##TITLE=AC1705_ROEFFECT0028_8638437_zhXyscSLqr
##JCAMPDX= 6.0         $$ Bruker NMR JCAMP-DX V2.0
##DATA TYPE= NMR SPECTRUM
##DATA CLASS= NTUPLES
##ORIGIN= BRUKER
##OWNER= Administrator
$$ 1.72 TOPSPIN		Version 2.1
$$ 2014-05-22 21:59:51.783 -0700  Administrator@X
$$ Compression mode = diff/dup
##.OBSERVE FREQUENCY= 400.02188249412
##.OBSERVE NUCLEUS= ^1H
##.ACQUISITION MODE= SIMULTANEOUS (DQD)
##.ACQUISITION SCHEME= undefined
##.AVERAGES= 64
##.DIGITISER RES= 22
##SPECTROMETER/DATA SYSTEM= spect
##.PULSE SEQUENCE= noesygpps1d.comp
##.SOLVENT NAME= COFFEE_meoh
##.SHIFT REFERENCE= INTERNAL, COFFEE_meoh, 1, 14.9612
##AUDIT TRAIL= $$ (NUMBER, WHEN, WHO, WHERE, PROCESS, VERSION, WHAT)
$$ ##TITLE= Audit trail, TOPSPIN		Version 2.1
$$ ##JCAMPDX= 5.01
$$ ##ORIGIN= Bruker BioSpin GmbH
$$ ##OWNER= Administrator
$$ $$ E:\/data/COFFEE/nmr/AC1705_ROEFFECT0028_8638437_zhXyscSLqr/12/pdata/1/auditp.txt
$$ ##AUDIT TRAIL=  $$ (NUMBER, WHEN, WHO, WHERE, PROCESS, VERSION, WHAT)
(   1,<2014-05-22 21:59:47.018 -0700>,<Administrator>,<X>,<go>,<TOPSPIN 2.1>,
      <created by zg
	started at 2014-05-22 21:48:17.346 -0700,
	POWCHK enabled, PULCHK disabled,
       configuration hash MD5:
       C8 4E 4E 5D D3 5C D8 9E 9F 52 82 E0 59 8A DE 15
       data hash MD5: 64K
       11 3A 9C CF DA C5 21 08 74 FA 03 DE 1E 5A 4D BE>)
(   2,<2014-05-22 21:59:49.862 -0700>,<Administrator>,<X>,<proc1d>,<TOPSPIN 2.1>,
      <Start of raw data processing
       efp LB = 0.3 FT_mod = 6 PKNL = 1 PHC0 = 0 PHC1 = 0 SI = 128K 
       data hash MD5: 128K
       44 DB 94 6E F4 58 97 93 D8 1B 03 CD CB CC 9B 3F>)
(   3,<2014-05-22 21:59:50.752 -0700>,<Administrator>,<X>,<proc1d>,<TOPSPIN 2.1>,
      <pk PHC0 = -85.23193 PHC1 = 0 
       data hash MD5: 128K
       B7 87 4F 59 98 8A A7 A4 06 63 2D E7 3C 07 56 6C>)
(   4,<2014-05-22 21:59:51.158 -0700>,<Administrator>,<X>,<proc1d>,<TOPSPIN 2.1>,
      <abs ABSG = 1 
       data hash MD5: 128K
       E1 84 DD 8C E1 94 24 8C 64 B4 60 0C D0 A1 8F 2B>)
(   5,<2014-05-22 21:59:51.283 -0700>,<Administrator>,<X>,<proc1d>,<TOPSPIN 2.1>,
      <abs ABSG = 2 
       data hash MD5: 128K
       DC 96 6F 4F 9B 71 49 60 9A D0 AD 3E 59 BA 94 D9>)
(   6,<2014-05-22 21:59:51.377 -0700>,<Administrator>,<X>,<proc1d>,<TOPSPIN 2.1>,
      <abs ABSG = 3 
       data hash MD5: 128K
       2A 59 3F CE 59 B5 C3 8B 72 A5 A3 28 FA 1A 6D 95>)
(   7,<2014-05-22 21:59:51.471 -0700>,<Administrator>,<X>,<proc1d>,<TOPSPIN 2.1>,
      <abs ABSG = 4 
       data hash MD5: 128K
       8A 68 5A 10 4F 8C 4A 7E 02 82 88 02 5E 7B FC 45>)
(   8,<2014-05-22 21:59:51.565 -0700>,<Administrator>,<X>,<proc1d>,<TOPSPIN 2.1>,
      <abs ABSG = 5 
       data hash MD5: 128K
       99 F8 8E 18 9C 54 99 A7 58 2D 71 DE A2 A2 18 3D>)
$$ ##END=
$$ 
$$ $$ hash MD5
$$ $$ 01 DF F0 65 C9 B9 49 DE 17 83 8B A7 74 EA F8 8D
##$RELAX= 
##$RELAX= 
##$RELAX= 
##$RELAX= 
##$RELAX= 
##$RELAX= 
##$RELAX= 
##$RELAX= 
$$ Bruker specific parameters
$$ --------------------------
##$DU= <E:\>
##$EXPNO= 12
$$ [...]
150 150 150 150 150 150 150 150
##$TP07= 0
##$TPNAME0= <>
##$TPNAME1= <>
##$TPNAME2= <>
##$TPNAME3= <>
##$TPNAME4= <>
##$TPNAME5= <>
##$TPNAME6= <>
##$TPNAME7= <>
##$TPOAL= (0..7)
0.5 0.5 0.5 0.5 0.5 0.5 0.5 0.5
##$TPOFFS= (0..7)
0 0 0 0 0 0 0 0
##$TUNHIN= 0
##$TUNHOUT= 0
##$TUNXOUT= 0
##$USERA1= <user>
##$USERA2= <user>
##$USERA3= <user>
##$USERA4= <user>
##$USERA5= <user>
##$V9= 5
##$VALIST= <valist>
##$VCLIST= <CCCCCCCCCCCCCCC>
##$VD= 0
##$VDLIST= <DDDDDDDDDDDDDDD>
##$VPLIST= <PPPPPPPPPPPPPPP>
##$VTLIST= <TTTTTTTTTTTTTTT>
##$WBST= 2048
##$WBSW= 25
##$XGAIN= (0..3)
0 0 0 0
##$XL= 0
##$YL= 0
##$YMAX_a= 6234149
##$YMIN_a= -13298527
##$ZGOPTNS= <>
##$ZL1= 120
##$ZL2= 120
##$ZL3= 120
##$ZL4= 120
##$ABSF1= 14.9612
##$ABSF2= -5.596982
##$ABSG= 5
##$ABSL= 3
##$ALPHA= 0
##$AQORDER= 0
##$ASSFAC= 0
##$ASSFACI= 0
##$ASSFACX= 0
##$ASSWID= 0
##$AUNMP= <proc_prof1d_extract.lims>
##$AXLEFT= 0
##$AXNAME= <>
##$AXNUC= <1H>
##$AXRIGHT= 0
##$AXTYPE= 0
##$AXUNIT= <>
##$AZFE= 0.1
##$AZFW= 0.1
##$BCFW= 0
##$BC_mod= 0
##$BYTORDP= 0
##$COROFFS= 0
##$CY= 15
##$DATMOD= 1
##$DC= 0
##$DFILT= <>
##$DTYPP= 0
##$F1P= 0
##$F2P= 0
##$FCOR= 0.5
##$FTSIZE= 131072
##$FT_mod= 6
##$GAMMA= 0
##$GB= 0
##$INTBC= 1
##$INTSCL= 1
##$ISEN= 128
##$LB= 0.3
##$LEV0= 0
##$LPBIN= 0
##$MAXI= 10000
##$MC2= 0
##$MEAN= 0
##$ME_mod= 0
##$MI= 0
##$NCOEF= 0
##$NC_proc= -2
##$NLEV= 6
##$NOISF1= 0
##$NOISF2= 0
##$NSP= 0
##$NTH_PI= 0
##$NZP= 0
##$OFFSET= 14.9612
##$PC= 1
##$PHC0= -85.23193
##$PHC1= 0
##$PH_mod= 1
##$PKNL= yes
##$PPARMOD= 0
##$PPDIAG= 0
##$PPIPTYP= 0
##$PPMPNUM= 2147483647
##$PPRESOL= 1
##$PSCAL= 4
##$PSIGN= 0
##$PYNMP= <proc.py>
##$REVERSE= no
##$SF= 400.020009555856
##$SI= 131072
##$SIGF1= 0
##$SIGF2= 0
##$SINO= 400
##$SIOLD= 131072
##$SPECTYP= <>
##$SREGLST= <1H.CDCl3>
##$SSB= 0
##$STSI= 131072
##$STSR= 0
##$SW_p= 8223.68421052631
##$SYMM= 0
##$S_DEV= 0
##$TDeff= 65536
##$TDoff= 0
##$TI= <>
##$TILT= no
##$TM1= 0
##$TM2= 0
##$TOPLEV= 0
##$USERP1= <user>
##$USERP2= <user>
##$USERP3= <user>
##$USERP4= <user>
##$USERP5= <user>
##$WDW= 1
##$XDIM= 131072
##$YMAX_p= 413594775
##$YMIN_p= -11514
##$CURPLOT= <Network HP LaserJet P1505>
##$CURPRIN= <$Network HP LaserJet P1505>
##$DFORMAT= <normdp>
##$LAYOUT= <+/1D_H.xwp>
##$LFORMAT= <normlp>
##$PFORMAT= <normpl>
##$SURQMSG= 1
$$ End of Bruker specific parameters
$$ ---------------------------------
##NTUPLES= NMR SPECTRUM
##VAR_NAME=  FREQUENCY,     SPECTRUM/REAL,   SPECTRUM/IMAG
##SYMBOL=    X,             R,               I
##VAR_TYPE=  INDEPENDENT,   DEPENDENT,       DEPENDENT
##VAR_FORM=  AFFN,          ASDF,            ASDF
##VAR_DIM=   131072,        131072,          131072
##UNITS=     HZ,            ARBITRARY UNITS, ARBITRARY UNITS
##FACTOR=    0.0627417313425164, 1,          1
##FIRST=     8223.62146879497, 4288,         -71974
##LAST=      0,             6949,            -71858
##MIN=       0,             -11514,          0
##MAX=       8223.62146879497, 413594775,    0
$$ Real data points
##PAGE= N=1
##DATA TABLE= (X++(R..R)), XYDATA
$$ [...]
61589C88667j243j831j921j445j267j767k122j572o62l36m53k20K99L36j08j13
$$ 388667 387424 385593 383672 382227 380960 379193 377071 375499 374837 374501 374048 373828 374127 374463 374355 374242
61573C74242O95J555J726J433J197R84N35Q7K19J125K371L340L808M068M434M654
$$ 374242 374937 376492 378218 379651 380848 381832 382367 382454 382673 383798 386169 389509 393317 397385 401819 406473
61557D06473M142K910J811J432J284O87k2mO06P99K47k28oM09K47m14q58o65L
$$ 406473 410615 413525 415336 416768 418052 418739 418717 418713 419319 420118 420365 420137 420131 420540 420787 420373 419515 418850 418853
61538D18853O41P36K34j38M79J937L084L186K790K784L148L106K209P78n09j119
$$ 418853 419494 420230 420464 420326 420805 422742 425826 429012 431802 434586 437734 440840 443049 443827 443318 442199
61522D42199r67n94q27j898l059l335k525j199O7J121K025K745L088K853K169
$$ 442199 441232 440638 439811 437913 434854 431519 428994 427795 427862 428983 431008 433753 436841 439694 441863
61507D41863J617J795K677L700M497N066N209M539L434L269M866P173Q327P937
$$ 441863 443480 445275 447952 451652 456149 461215 466424 470963 474397 477666 482532 489705 498032 505969
61493E05969P339P557P939P351N834M377L401K402J046j58o48o46p17p40J00K213
$$ 505969 513308 520865 528804 536155 541989 546366 549767 552169 553215 553057 552409 551763 551046 550306 550406 552619
61477E52619M916P078Q186Q509Q378P702O296M385K552J128j39j710l622n398
$$ 552619 557535 564613 572799 581308 589686 597388 603684 608069 610621 611749 611610 609900 606278 600880
61463F00880o619p330p775q030q081q037p801o896n189l601l175l458k828p89
$$ 600880 594261 586931 579156 571126 563045 555008 547207 540311 535122 531521 528346 524888 522060 521271
61449E21271J152J580J166J453K521L215L300L788N098O293O504N899M834L222
$$ 521271 522423 524003 525169 526622 529143 532358 535658 539446 544544 550837 557341 563240 568074 571296
61435E71296J371L49O31J147O53n78j276r43k32J60J92J89M77J225K192K846L136
$$ 571296 572667 573016 573647 574794 575447 574869 573593 572650 572418 572578 572770 572959 573436 574661 576853 579699 582835
61418E82835L782N226O658O820N451L288Q65j735m126n585o003o064o138n716
$$ 582835 586617 591843 598501 605321 610772 614060 614925 613190 609064 603479 597476 591412 585274 579558
61404E79558m372k731j949k379l181l188k027m57L33j73j450k673l467l781l426
$$ 579558 575186 572455 570506 568127 564946 561758 559731 559274 559607 559434 557984 555311 551844 548063 544637
61389E44637k378j248p94r91j156r58o20j79O75J874K834L333L804M464M860M764
$$ 544637 542259 541011 540217 539226 538070 537112 536492 536313 536988 538862 541696 545029 548833 553297 558157 562921
61373E62921M786N453O201O056M895L401K025P56l59j167j845k683l430l502k904
$$ 562921 567707 573160 579361 585417 590312 593713 595738 596494 596135 594968 593123 590440 587010 583508 580604
61358E80604k323k135j941j276l13N34J238K108L243M382N204N571N498N022M108
$$ 580604 578281 576146 574205 572929 572616 573150 574388 576496 579739 584121 589325 594896 600394 605416 609524
61343F09524K757J318M38M64R86J319J341J458J825K085J956J514Q22k17j343
$$ 609524 612281 613599 614037 614501 615487 616806 618147 619605 621430 623515 625471 626985 627807 627590 626247
61328F26247j893j631j245j457j993j971j114mP67J217J683K335L053L587L827
$$ 626247 624354 622723 621478 620021 618028 616057 614943 614939 615706 616923 618606 620941 623994 627581 631408
61313F31408M050M737N909O879P132P188Q104J0086J2217J3570J3998J3667J2439
$$ 631408 635458 640195 646104 652983 660115 667303 675407 685493 697710 711280 725278 738945 751384
61300G51384J0153P122L873O80k316m743o245p021p696q618r550j0071j0010r498
$$ 751384 761537 768659 772532 773212 770896 766153 759908 752887 745191 736573 727023 716952 706942 697444
61286F97444q780q111p602p152o636o138n831n557m736k947n33J548K584K732
$$ 697444 688664 680553 672951 665799 659163 653025 647194 641637 636901 633954 633421 634969 637553 640285
61272F40285K698K894L088K885K328J845J737J970K434L131M038N023N987P008
$$ 640285 642983 645877 648965 651850 654178 656023 657760 659730 662164 665295 669333 674356 680343 687351
61258F87351Q135R077R251Q281O502M847M008L772L430K845K665L229L845L725
$$ 687351 695486 704563 713814 722095 728597 733444 737452 741224 744654 747499 750164 753393 757238 760963
61244G60963L224L357M166M532L776K504J465L92j296l265m631n156n232m845
$$ 760963 764187 767544 771710 776242 780018 782522 783987 784379 783083 779818 775187 770031 764799 759954
61230G59954l491j223J053K610L645M647N588O134O305O470O821P150P057O231
$$ 759954 756463 755240 756293 758903 762548 767195 772783 778917 785222 791692 798513 805663 812720 818951
61216H18951M772L287K479K386K305J727R89P22Q07N31k86r17o63K97J311K194
$$ 818951 823723 827010 829489 831875 834180 835907 836896 837618 838425 838956 838670 837753 837090 837387 838698 840892
61200H40892L248M569N855O981Q316J0231J2513J4472J5449J5128J3601J1316
$$ 840892 844140 848709 854564 861545 869861 880092 892605 907077 922526 937654 951255 962571
61188I62571Q853O482M115J809M3p50p52n41n05q02j621l012m526n547o022o351
$$ 962571 971424 977906 982021 983830 983873 983123 982371 981830 981325 980523 978902 975890 971364 965817 959795 953444
61172I53444o650o695o605o913p702q286q105p438o850o421o003n795o081o631
$$ 953444 946794 940099 933494 926581 918879 910593 902488 895050 888200 881779 875776 869981 863900 857269
61158H57269o845o371n236l593j755k06Q64J871L314N135O847Q007Q141O696L750
$$ 857269 850424 844053 838817 835224 833469 833263 834127 835998 839312 844447 851294 859301 867442 874138 877888
61143H77888M76j907l480n175p052q016p447o108m995m030k574p06P81J454J639
$$ 877888 878364 876457 872977 867802 860750 852734 845287 839179 834184 830154 827580 826874 827655 829109 830748
61128H30748J844K317L207M658O490Q122R071R401R651J0349J1635J3153J4268
$$ 830748 832592 834909 838116 842774 849264 857386 866457 875858 885509 895858 907493 920646 934914
61115I34914J4562J4276J4158J4702J5515J5729J4957J3666J2492J1525J0497
$$ 934914 949476 963752 977910 992612 1008127 1023856 1038813 1052479 1064971 1076496 1086993
61104A086993R373Q323P188N505L055Ol591p842j2363j6103j8298j9279j9923
$$ 1086993 1096366 1104689 1111877 1117382 1120437 1120443 1116852 1109010 1096647 1080544 1062246 1042967 1023044
61091A023044k0569k0934k0827k0425j9883j9166j8354j7702j7259j6681j5637
$$ 1023044 1002475 981541 960714 940289 920406 901240 882886 865184 847925 831244 815607
61080H15607j4144j2480j0856r396q279p674p431o995n947m620l841l862l905
$$ 815607 801463 788983 778127 768731 760452 752778 745347 738352 732405 727785 723944 720082 716177
61067G16177l185k041j394j316r84q3O95Q60R49J614K596L252L653M438N865P515
$$ 716177 712992 710951 709557 708241 707257 707174 707869 708729 709678 711292 713888 717140 720793 725231 731096 738611
61051G38611Q752R222R210R683J1374J3567J4606J4086J3647J4803J6825J7821
$$ 738611 747363 756585 765795 775478 786852 800419 815025 829111 842758 857561 874386 892207
61039H92207J7333J6642J6846J7743J8601J9038J8998J8661J8446J8641J9055
$$ 892207 909540 926182 943028 960771 979372 998410 1017408 1036069 1054515 1073156 1092211
61028A092211J9504K0267K1608K3301K5212K7772L1049L4035L5817L6897L8287
$$ 1092211 1111715 1131982 1153590 1176891 1202103 1229875 1260924 1294959 1330776 1367673 1405960
61017A405960L9962M1460M3372M6783N1719N7718O5534P6327Q9234J01800J13251
$$ 1405960 1445922 1487382 1530754 1577537 1629256 1686974 1752508 1828835 1918069 2019869 2133120
61006B133120J25773J42255J64376J93224K29927K74982L28413L91116M65059
$$ 2133120 2258893 2401148 2565524 2758748 2988675 3263657 3592070 3983186 4448245
60997D448245N52524O57253P86084R46852J144326J379628J648114J924099K140105
$$ 4448245 5000769 5658022 6444106 7390958 8535284 9914912 11563026 13487125 15627230
60988A5627230K193818K001551J564325R85055M16854j1320k33152k40776p5284
$$ 15627230 17821048 19822599 21386924 22371979 22788833 22777513 22544361 22303585 22228301
60979B2228301J68329L48519L27457M4438m47140j013339j514113j859927k023014
$$ 22228301 22396630 22745149 23072606 23117044 22669904 21656565 20142452 18282525 16259511
60970A6259511k020510j895111j699208j478982j263323j064833q88388p36338
$$ 16259511 14239001 12343890 10644682 9165700 7902377 6837544 5949156 5212818
60962E212818o08144n00689m11196l38387k80644k35132j99300j71577j50149
$$ 5212818 4604674 4103985 3692789 3354402 3073758 2838626 2639326 2467749 2317600
60953B317600j32654j17685j05195r4938q5754p6849o8519o1111n4444m8771m5083
$$ 2317600 2184946 2067261 1962066 1867128 1781374 1704525 1636006 1574895 1520451 1471680 1426597
60942A426597m3682m3374m2843m2103m1829m1892m1351l9610l7020l4397l2275
$$ 1426597 1382915 1339541 1296698 1254595 1212766 1170874 1129523 1089913 1052893 1018496 986221
60931I86221l0448k8309k5700k3248k1441j9767j7527j5168j3857j3722j3544
$$ 986221 955773 927464 901764 878516 857075 837308 819781 804613 790756 777034 763490
60920G63490j2340j0389q514p177o558o598o593n554l470j596j026j468j811j402
$$ 763490 751150 740761 732247 725070 718512 711914 705321 699767 696297 694701 693675 692207 690396 688994
60906F88994m42M14N28k36j300j970k333l031m163n075n411n622o112o601o693
$$ 688994 688552 688966 689494 689258 687958 685988 683655 680624 676461 671386 665975 660353 654241 647640 640947
60891F40947o548o522o652o822p022o987o137m312k364j461j963l178m136m419
$$ 640947 634399 627877 621225 614403 607381 600394 594257 589945 587581 586120 584157 580979 576843 572424
60877E72424m387m643n244n536n043m176l643l393k827j906j274j242j374j234
$$ 572424 568037 563394 558150 552614 547571 543395 539752 536359 533532 531626 530352 529110 527736 526502
60863E26502q89n16q9L30N63O83Q51R01O95P87J770K981K942J331n30j503j756
$$ 526502 525613 525097 525008 525338 525901 526584 527435 528336 529031 529818 531588 534569 537511 538842 538312 536809 535053
60846E35053j674r36M90J483J028l49j442k051k808l884m853n605o336o824o657
$$ 535053 533379 532443 532933 534416 535444 535095 533653 531602 528794 524910 520057 514452 508116 501292 494635
60831D94635o051n645n488n096m396l818l357k456j035Q7J87m46r71r62o28l47
$$ 494635 488584 482939 477451 472355 467959 464141 460784 458328 457293 457380 457567 457121 456150 455188 454560 454213
60815D54213l54p39j472k340l005l189k886k395k079k018k005j818j405q39l17
$$ 454213 453859 453120 451648 449308 446303 443114 440228 437833 435754 433736 431731 429913 428508 427669 427352
60800D27352j77n93j219j461j166p04l22J18O55R31P08K79jj80m16n13k16L16
$$ 427352 427175 426582 425363 423902 422736 422032 421710 421828 422483 423414 424122 424401 424400 424220 423804 423291 423075 423391
60782D23391O23M29k32j134j829j861j251n41r4L26R55J459J385Q54L32m8m50
$$ 423391 424014 424443 424211 423077 421248 419387 418136 417595 417501 417827 418782 420241 421626 422480 422812 422764 422314
60765D22314p58o27J3R21J912K869L436L216K321J345P85O98R41J378J784J811
$$ 422314 421556 420929 420942 421863 423775 426644 430080 433296 435617 436962 437747 438445 439386 440764 442548 444359
60749D44359J277L94k89k48N79J650K254K233J958J581O71j086l109m327m260
$$ 444359 445636 446030 445741 445493 446072 447722 449976 452209 454167 455748 456419 455333 452224 447897 443637
60734D43637l370k455j977j949k104k117j816j284o89j36K77M19K56j43p35j442
$$ 443637 440267 437812 435835 433886 431782 429665 427849 426565 425876 425740 426017 426436 426692 426549 425814 424372
60718D24372j866j591q74o65j452k444k424j230Q7M58k20j287j961j789q74J20
$$ 424372 422506 420915 420041 419376 417924 415480 413056 411826 411913 412371 412151 410864 408903 407114 406240 406360
60702D06360M21j69j129j766j819j551j357j366j322r26k04N11R36J022P62J76
$$ 406360 406781 406612 405483 403717 401898 400347 398990 397624 396302 395376 395172 395683 396619 397641 398403 398579
60686C98579m46o02q3P65J481K014K587L318M092M664M713M051L011K330K417
$$ 398579 398133 397531 397448 398213 399694 401708 404295 407613 411705 416369 421082 425133 428144 430474 432891
60671D32891K923L242L188K904K380J485K83j010k228l181l558l230k522j807
$$ 432891 435814 439056 442244 445148 447528 449013 449296 448286 446058 442877 439319 436089 433567 431760
60657D31760j100l30J65J9m23l36N44J553K025K102K393L067L620L415K311Q16
$$ 431760 430660 430330 430495 430514 430091 429755 430299 431852 433877 435979 438372 441439 445059 448474 450785 451601
60641D51601l06o42n56q77k037l537m397m074k852j376j23O14N44l50j468j962
$$ 451601 451295 450653 450097 449220 447183 443646 439249 435175 432323 430947 430824 431438 431982 431632 430164 428202
60625D28202j601r21l88J40Q41J352J340J190J445J768J286J1r57p83J55R74J305
$$ 428202 426601 425680 425292 425432 426273 427625 428965 430155 431600 433368 434654 434665 433708 432925 433080 434054 435359
60608D35359J310J184J064J025R21N55J99M07J100J385O95l67p92l84K50O02P42
$$ 435359 436669 437853 438917 439942 440863 441418 441617 442024 443124 444509 445204 444837 444045 443661 443911 444513 445255
60591D45255R96J567K327K816K698K299K322K862L165K677J822J351J341J316
$$ 445255 446251 447818 450145 452961 455659 457958 460280 463142 466307 468984 470806 472157 473498 474814
60577D74814R86M71N4P2O68J417J648J475J959L685N795P109P712Q541R658J0011
$$ 474814 475800 476271 476325 476397 477065 478482 480130 481605 483564 487249 493044 500153 507865 516406 526064 536075
60561E36075R033P622P124P748Q376P776N748L149Q84r05k522l827m216l503k246
$$ 536075 545108 552730 559854 567602 575978 583754 589502 592651 593535 592630 590108 586281 582065 578562 576316
60546E76316r79K78J501K313K602K905L718M864O055P496R318J1063J2357J3723
$$ 576316 575337 575615 577116 579429 582031 584936 588654 593518 599573 607069 616387 627450 639807 653530
60532F53530J5916J8896K2024K4864K7092K8074K7395K5417K2599J8559J2805
$$ 653530 669446 688342 710366 735230 762322 790396 817791 843208 865807 884366 897171
60521H97171N919q58o984j2498j6849j9145j9601j9581j9843j9691j8178j5397
$$ 897171 903090 902232 895248 882750 865901 846756 827155 807574 787731 768040 749862 734465
60509G34465j2169r153o608m495k514l70J894M196O830J0010J3193J5667J7814
$$ 734465 722296 713143 706535 702040 699526 699156 701050 705246 712076 722086 735279 750946 768760
60496G68760K0835K5160K9891L4021L7358L9994M1687M2179M1445L9272L5216
$$ 768760 789595 814755 844646 878667 916025 956019 997706 1039885 1081330 1120602 1155818
60485A155818K9444K3166J7857J4317J2665J2704J4088J6363J8967K0848K0253
$$ 1155818 1185262 1208428 1226285 1240602 1253267 1265971 1280059 1296422 1315389 1336237 1356490
60474A356490J5692P221l726j5760k8074l9677m9198n5856n9810o1200n9775n5899
$$ 1356490 1372182 1379403 1375677 1359917 1331843 1292166 1242968 1187112 1127302 1066102 1006327 950428
60462I50428n1022m6357m1815l6924l2139k8357k5586k3086k0561j8383j6672
$$ 950428 899406 853049 811234 774310 742171 713814 688228 665142 644581 626198 609526
60451F09526j4968j2905j0654q538o661n115m165m000m381m666m241k991j469
$$ 609526 594558 581653 570999 562461 555800 550685 546520 542520 538139 533473 529232 526241 524772
60438E24772m31k19o39j331j993k285j982j396j242j865k751l072k459j253j49
$$ 524772 524341 524122 523483 522152 520159 517874 515892 514496 513254 511389 508638 505566 503107 501854 501705
60423E01705K77J3k94P8J114K122K581K623K573K446K151J796J558J456J500J825
$$ 501705 501982 501995 501701 501779 502893 505015 507596 510219 512792 515238 517389 519185 520743 522199 523699 525524
60407E25524K427K936K906K325J656J417J730K274K669K915L282L739L866L485
$$ 525524 527951 530887 533793 536118 537774 539191 540921 543195 545864 548779 552061 555800 559666 563151
60393E63151L101L300L995M622M858M716M315L980M212M944N237M472L485L502
$$ 563151 566252 569552 573547 578169 583027 587743 592058 596038 600250 605194 610431 614903 618388 621890
60379F21890M249M272L146K110K262L187L888L995L556K527J198L85M61P89O41
$$ 621890 626139 630411 633557 635667 637929 641116 645004 648999 652555 655082 656280 656665 657126 657915 658556
60364F58556K44K36O70J169J642K237K852L282L589L930M297M836N923P510Q803
$$ 658556 658800 659036 659706 660875 662517 664754 667606 670888 674477 678407 682704 687540 693463 700973 709776
60349G09776R139Q860Q813R160R235Q409O701M642K788J190p50l585o845r216
$$ 709776 718915 727775 736588 745748 754983 763392 770093 774735 777523 778713 777963 774378 767533 758317
60335G58317r935r541q981q560q165p884p809p585o800n635m600l921l572l636
$$ 758317 748382 738841 729860 721300 713135 705251 697442 689857 683057 677422 672822 668901 665329 661693
60321F61693m143m679m653l921k863j934j311p65K20J985M269O558Q760J1034
$$ 661693 657550 652871 648218 644297 641434 639500 638189 637424 637644 639629 643898 650456 659216 670250
60307F70250J2976J3778J3366J2635J2174J1620J0724J0211J0783J1926J2513
$$ 670250 683226 697004 710370 723005 735179 746799 757523 767734 778517 790443 802956
60296H02956J2102J0908Q882N637J091m429j0462j6260k0672k2861k2896k1339
$$ 802956 815058 825966 834848 840485 841576 837147 826685 810425 789753 766892 743996 722657
60284G22657j8608j5201j2000r646q015o821o231o308o415n971n363n298n701
$$ 722657 704049 688848 676848 667202 659187 652366 646135 639827 633412 627441 622078 616780 611079
60271F11079n994o057o025n581m443l199k664k633k310j716j583j895j760q61
$$ 611079 605085 599028 593003 587422 582979 579780 577116 574483 572173 570457 568874 566979 565219 564358
60257E64358J7K02k4p4J85O31J240J954K654L324L814L628K579J438J112J349
$$ 564358 564375 564577 564553 564479 564664 565295 566535 568489 571143 574467 578281 581909 584488 585926 587038 588387
60241E88387J173N22L01P61J028N62k5q7J46L57Q90J971K944L159L093L732N198
$$ 588387 589560 590082 590383 591144 592172 592734 592709 592622 592768 593125 594015 595986 598930 602089 605182 608914 614112
60224F14112O646P377P449P356P540Q139Q816R037Q783Q718R421J0636J1621J1914
$$ 614112 620758 628135 635584 642940 650480 658619 667435 676472 685255 693973 703394 714030 725651 737565
60210G37565J1571J0926J0377J0207J0308J0315J0162J0181J0419J0306R339P834
$$ 737565 749136 760062 770439 780646 790954 801269 811431 821612 832031 842337 851676 859510
60198H59510O568N897N579N254M764M099L274K269Q52j178l462n023n154m281
$$ 859510 866078 871975 877554 882808 887572 891671 894945 897214 898066 896888 893426 888403 883249 878968
60184H78968l603l864m687n087m510l337k483k527l171l630l470k905k335j888
$$ 878968 875365 871501 866814 861727 857217 853880 851397 848870 845699 842069 838599 835694 833359 831471
60170H31471j530j318j295j313j281j449k237l643n063n804n784n588n724n926
$$ 831471 829941 828623 827328 826015 824734 823285 821048 817405 812342 806538 800754 795166 789442 783516
60156G83516n455m020k144n57M75J026J171J080J141J533J868J700J099L58o32
$$ 783516 778061 774041 771897 771340 771815 772841 774012 775092 776233 777766 779634 781334 782433 782791 782159
60141G82159k003l140l013j426P02K324L085L106K610J991J668J659J698J817
$$ 782159 780156 777016 774003 772577 773279 775603 778688 781794 784404 786395 788063 789722 791420 793237
60127G93237K271K814K793K185J798K138K760L189L727M741N819O389O699P316
$$ 793237 795508 798322 801115 803300 805098 807236 809996 813185 816912 821653 827472 833861 840560 847876
60113H47876Q031Q095P362O451N810N412N266N506N810N456M172K477R98j6m78
$$ 847876 855907 864002 871364 877815 883625 889037 894303 899809 905619 911075 915247 917724 918722 918706 918228
60098I18228l45O5J85o9k47k58p60k172l883m970n449o091p229q394r107r405
$$ 918228 917883 917948 918133 918064 917817 917559 916799 914627 910744 905774 900325 894234 887005 878611 869504 860099
60082H60099r490r435r358r419r438q982q070p359p325p636p661p279o776o238
$$ 860099 850609 841174 831816 822397 812959 803977 795907 788548 781223 773587 765926 758647 751871 745633
60068G45633n556m904m637m753m859m738m531m370m206m067m102m183l876k953
$$ 745633 740077 735173 730536 725783 720924 716186 711655 707285 703079 699012 694910 690727 686851 683898
60054F83898j745p69k28P3M09Q67J243J225Q71P71J451K739M030N038N779O000
$$ 683898 682153 681384 681156 681229 681638 682505 683748 684973 685844 686615 688066 690805 694835 699873 705652 711652
60038G11652N261L773K452J925J965K062J991J512K44j711l545m619n168n741
$$ 711652 716913 720686 723138 725063 727028 729090 731081 732593 732837 731126 727581 722962 717794 712053
60024G12053o388o867p135p195o927o549o721p539p983p085n291l889l368l165
$$ 712053 705665 698798 691663 684468 677541 670992 664271 656732 648749 641664 636373 632484 629116 625951
60010F25951k738k104j451r78j024j623k105j871j419j682k534k934k543k089
$$ 625951 623213 621109 619658 618680 617656 616033 613928 612057 610638 608956 606422 603488 600945 598856
59996E98856j946j440r6J381K030J881J680J895K558L611M815N650N879N914O170
$$ 598856 596910 595470 595374 596755 598785 600666 602346 604241 606799 610410 615225 620875 626754 632668 638838
59981F38838O306N635M090K319R65J57l32r03j870l090l923l980l750m064m867
$$ 638838 645144 650779 654869 657188 658153 658310 657978 657075 655205 652115 648192 644212 640462 636398 631531
59966F31531n119m090k316r00j70M20J214J868K159K514L224L618K837J260J93
$$ 631531 626412 622322 620006 619106 618936 619356 620570 622438 624597 627111 630335 633953 636790 638050 638243
59951F38243J16J89j77l20M55J535J820J405J272J708K063K048K213K848L323
$$ 638243 638359 638548 638371 638051 638506 640041 641861 643266 644538 646246 648309 650357 652570 655418 658741
59936F58741K987K137J676K132L289M492N110N024M785N042N723O034N320L668
$$ 658741 661728 663865 665541 667673 670962 675454 680564 685588 690373 695415 701138 707172 712492 716160
59922G16160J735K67k20K62J191K059K889L931N067N882O302O606O895O899O356
$$ 716160 717895 718162 717942 718204 719395 721454 724343 728274 733341 739223 745525 752131 759026 765925 772281
59907G72281N230L614J693k28k034l973o146q043q955q724p719o341m969m017
$$ 772281 777511 781125 782818 782590 780556 776583 770437 762394 753439 744715 736996 730655 725686 721669
59893G21669l452k595j007P00J620J773J848K105K377K878L954N200N815N798
$$ 721669 718217 715622 714615 715315 716935 718708 720556 722661 725038 727916 731870 737070 742885 748683
59879G48683N863O262O698P176P833Q028O936N101L963L702K963J125p04j504
$$ 748683 754546 760808 767506 774682 782515 790543 797479 802580 806543 810245 813208 814333 813629 812125
59865H12125j693j862j596o18J02k92j005o10J027K852M076M558M313L626L162
$$ 812125 810432 808570 806974 806356 806458 806166 805161 804551 805578 808430 812506 817064 821377 825003 828165
59850H28165L106K671J354R1J96J582L092M180N253O627Q117R471J0364J0093
$$ 828165 831271 833942 835296 835387 835583 837165 840257 844437 849690 856317 864434 873905 884269 894362
59836H94362Q248N486K974J227K69N19K350M872O260N605L555J066j620m422o726
$$ 894362 902610 908096 911070 912297 912566 913085 915435 920307 926567 932172 935727 936793 935173 930751 924025
59821I24025p814p567o372m561k263L82L032N193O459O862O723O093M641K381
$$ 924025 916211 908644 902272 897711 895448 895830 898862 904055 910514 917376 924099 930192 934833 937214
59807I37214Q3j420k061k255k198j948j845k223k877l406l854m494n179n575n820
$$ 937214 937297 935877 933816 931561 929363 927415 925570 923347 920470 917064 913210 908716 903537 897962 892142
59792H92142o311o932p182p010o838o830o799o831p306q168q833q957q739q351
$$ 892142 885831 878899 871717 864707 857869 851039 844240 837409 830103 821935 813102 804145 795406 787055
59778G87055p656o630n526m416l102j657n38J71J028K376L657M123L913L956M833
$$ 787055 779399 772769 767243 762827 759725 758068 757530 757701 758729 761105 764762 768885 772798 776754 781587
59763G81587O186P252P637P518P299P316P731Q569R726J0966J2018J2695J2901
$$ 781587 787773 795025 802662 810180 817479 824795 832526 841095 850821 861787 873805 886500 899401
59750H99401J2590J1785J0643R334P850O069M059K150O67l19q99j141j094q51
$$ 899401 911991 923776 934419 943753 951603 957672 961731 963881 964548 964229 963330 962189 961095 960244
59736I60244o03o61j325k501l560l831l256k288j333o38n16j104j869j925j026
$$ 960244 959641 958980 957655 955154 951594 947763 944507 942219 940886 940248 939732 938628 936759 934834 933808
59721I33808J62Q94R90O59J94rL14R00J300J697K712M363N968P255Q708J0475
$$ 933808 933970 934864 935854 936513 936707 936698 937012 937912 939212 940909 943621 947984 953952 961207 969915 980390
59705I80390J1900J2663J3569J5411J7720J9381J9982J9856J9290J8511J7983
$$ 980390 992290 1004953 1018522 1033933 1051653 1071034 1091016 1110872 1130162 1148673 1166656
59694A166656J7941J7857J7132J5948J4839J3653J1692Q716N182J682j319l460
$$ 1166656 1184597 1202454 1219586 1235534 1250373 1264026 1275718 1284434 1289616 1291298 1289979 1286519
59682A286519m756n756o935q159r157j0147j1429j2723j3536j3897j4113j4088
$$ 1286519 1281763 1276007 1269072 1260913 1251756 1241609 1230180 1217457 1203921 1190024 1175911 1161823
59670A161823j3488j2334j0924r380p703n988m136j829Q11L110M845O668Q874
$$ 1161823 1148335 1136001 1125077 1115697 1107994 1102006 1097870 1096041 1096852 1099962 1104807 1111475 1120349
59657A120349J0653J1432J2071J3457J4698J4274J2519J1204J0673R185N485N37
$$ 1120349 1131002 1142434 1154505 1167962 1182660 1196934 1209453 1220657 1231330 1240515 1246000 1246537
59645A246537m038p980j2023j6358k0386k3454k5228k5661k5121k4262k3506k2750
$$ 1246537 1242499 1234519 1222496 1206138 1185752 1162298 1137070 1111409 1086288 1062026 1038520 1015770
59633A015770k1732k0292j8289j5715j3067j1123j0270j0313j0938j1943j3046
$$ 1015770 994038 973746 955457 939742 926675 915552 905282 894969 884031 872088 859042
59622H59042j3926j4558j5049j5201j4630j3248j1344r277p484o404n906n149
$$ 859042 845116 830558 815509 800308 785678 772430 761086 751809 744325 737921 732015 726866
59610G26866l671k210j715j839j422k40Q22J249J414J534J229N39K46P56J455
$$ 726866 723195 720985 719270 717431 716009 715769 716591 717840 719254 720788 722017 722556 722802 723558 725013
59595G25013J680J619J717J915J978K035K196K118J455M27m76j061j385j501j580
$$ 725013 726693 728312 730029 731944 733922 735957 738153 740271 741726 742153 741677 740616 739231 737730 736150
59580G36150j989k936m196n403o420p233p715p662o967n738m361l313k698k180
$$ 736150 734161 731225 727029 721626 715206 707973 700258 692596 685629 679891 675530 672217 669519 667339
59566F67339j589j293j574j976j862j360j126j260j201n71M17J357J887J718J075
$$ 667339 665750 664457 662883 660907 659045 657685 656559 655299 654098 653527 653944 655301 657188 658906 659981
59551F59981R10J942L613M760N131N392N867O258O623P472Q761R773J0341J1231
$$ 659981 660891 662833 666446 671206 676337 681729 687596 693854 700477 707949 716710 726483 736824 748055
59537G48055J3038J5591J8724K2466K5899K6786K3364J6233P882P50l950o138
$$ 748055 761093 776684 795408 817874 843773 870559 893923 910156 918038 918788 914838 908700
59525I08700o376n480m158k936k241k248k692l211l907n098o727q404r916j1195
$$ 908700 902324 896844 892686 889750 887509 885261 882569 879358 875451 870353 863626 855222 845306 834111
59511H34111j1946j2060j2043j2342j2416j1512j0065r213q964q172o490m983
$$ 834111 822165 810105 798062 785720 773304 761792 751727 742514 733550 725378 718888 713905
59499G13905m420m140l297j993n91J112L164M806N388N375N635O302O952P423
$$ 713905 709485 705345 702048 700055 699464 700576 703740 708546 713934 719309 724944 731246 738198 745621
59485G45621P792P925P654P046O220N231M358L973L877L427K523J787J528J313
$$ 745621 753413 761338 768992 776038 782258 787489 791847 795820 799697 803124 805647 807434 808962 810275
59471H10275Q95P06J031J453J555J422J045J52j010j564j249q08o02J15J823L712
$$ 810275 811170 811876 812907 814360 815915 817337 818382 818534 817524 815960 814711 813903 813301 813416 815239 818951
59455H18951M907N749O822P608P327O440O010N983N340L737J900M50o30j433j990
$$ 818951 823858 829607 836429 844037 851364 857804 863814 869797 875137 878874 880774 881224 880594 879161 877171
59440H77171k696m043n754o812o560n378m177l547l350k953j929o30K22N36R42
$$ 877171 874475 870432 864678 857866 851306 845928 841751 838204 834854 831901 829972 829342 829564 830100 831042
59425H31042J742K553L246M450O506Q674J0078J0915J1944J3315J4628J5809J7110
$$ 831042 832784 835337 838583 843033 849539 858213 868291 879206 891150 904465 919093 934902 952012
59412I52012J8619K0442K2924K5848K7596K5999K0193J1222J152p877j4089j6494
$$ 952012 970631 991073 1013997 1039845 1067441 1093440 1113633 1124855 1126007 1118130 1104041 1087547
59400A087547j5256j1348n869K83O271J1076J3233J1083M112n702j4827k0965
$$ 1087547 1072291 1060943 1055074 1055357 1061628 1072704 1085937 1097020 1101132 1095430 1080603 1059638
59388A059638k4293k5668k4848k1465j6728j2687j0041p845n222k347K22K194
$$ 1059638 1035345 1009677 984829 963364 946636 933949 923908 916063 910841 908494 908716 910910
59376I10910L398L777L705L795M254M861N431N936O229O186O024O083O312O321
$$ 910910 914308 918085 921790 925585 929839 934700 940131 946067 952296 958482 964506 970589 976901 983222
59362I83222N899N268M942N361O384P176P104O686O995Q111R137R904J1377J3771
$$ 983222 989121 994389 999331 1004692 1011076 1018252 1025356 1032042 1039037 1047148 1056285 1066189 1077566 1091337
59348A091337J5648J5888J5434J5802J6694J6589J5134J3432J2123J0623Q337
$$ 1091337 1106985 1122873 1138307 1154109 1170803 1187392 1202526 1215958 1228081 1238704 1247041
59337A247041N507K571l86l380o306r011j1189j2408j2795j3274j4481j5841j6520
$$ 1247041 1252548 1255119 1254733 1251353 1245047 1236036 1224847 1212439 1199644 1186370 1171889 1156048 1139528
59324A139528j6768j7337j8013j7878j6859j5889j5513j5384j5103j4625j3799
$$ 1139528 1122760 1105423 1087410 1069532 1052673 1036784 1021271 1005887 990784 976159 962360
59313I62360j2480j1212j0850j1358j1762j1452j0753j0106r458q669p780o685
$$ 962360 949880 938668 927818 916460 904698 893246 882493 872387 862929 854260 846480 839795
59301H39795n117l155j214N50K316M091N738P536J0078J3451J6917J9350J9581
$$ 839795 834678 831523 830309 830859 833175 837266 843004 850540 860618 874069 890986 910336 929917
59288I29917J6650J0602L115l409p545r327r380q260o542m600k153J294N449R211
$$ 929917 946567 957169 960284 956875 949330 940003 930623 922363 915821 911221 909068 910362 915811 925022
59274I25022J1774J3147J3646J3653J3886J5055J6846J7910J7231J5135J2676
$$ 925022 936796 949943 963589 977242 991128 1006183 1023029 1040939 1058170 1073305 1085981
59263A085981J0439Q268N874L339J010r81l000n469q140j0133j0918j0902j0781
$$ 1085981 1096420 1104688 1110562 1113901 1114911 1113930 1110930 1105461 1097321 1087188 1076270 1065368 1054587
59250A054587j0785j0821j0867j0794j0300r472q939q899q620p557o286n584n214
$$ 1054587 1043802 1032981 1022114 1011320 1001020 991548 982609 973710 965090 957533 951247 945663 940449
59237I40449m557l931m118m931n439n423n513n952o265o227o185o310o398o450
$$ 940449 935892 931961 927843 922912 917473 912050 906537 900585 894320 888093 881908 875598 869200 862750
59223H62750o614o584n941n161n294o461p459p156n665l974k932k662k481j531
$$ 862750 856136 849552 843611 838450 833156 826695 819236 812080 806415 802441 799509 796847 794366 792835
59209G92835P6J080O67k17q4J000J666J398J076J317J620J547J569K106K668K667
$$ 792835 792911 793991 794658 794441 794357 795357 797023 798421 799497 800814 802434 803981 805550 807656 810324 812991
59193H12991K481L042M640O564P794P885P282O787O523N787M179K365J195M89
$$ 812991 815472 818514 823154 829718 837512 845397 852679 859466 865989 871776 875955 878320 879515 880004
59179H80004n29k002l475m787o029o936p230p347p805q135p431n853m427l549
$$ 880004 879475 877473 873998 869211 863182 856246 849016 841669 833864 825729 818298 812445 808018 804469
59165H04469k745j874j304r74m47L7k36j101j559j359j283j666j849j510j244
$$ 804469 801724 799850 798546 797572 797125 797162 796926 795825 794266 792907 791624 789958 788109 786599 785355
59150G85355j401j493j308j540k644l959m578m461m163m131m650n813p175q017
$$ 785355 783954 782461 781153 779613 776969 773010 768432 763971 759808 755677 751027 745214 738039 730022
59136G30022q157p918p306o004m254k764j603j41J708L213M127N177O862Q638
$$ 730022 721865 713947 706641 700637 696383 693619 692016 691875 693583 696796 700923 706100 712962 721600
59122G21600R834J0486J0921J1243J1606J2315J3267J4002J4416J4724J4664J3654
$$ 721600 731434 741920 752841 764084 775690 788005 801272 815274 829690 844414 859078 872732
59110H72732J1835R965Q212O123L947K673K448K234J512J023J223J267L54j005
$$ 872732 884567 894532 902744 908867 912814 915487 917935 920169 921681 922704 923927 925194 925548 924543
59096I24543j946k541l288m049m377m232l778l000k111j632j529j093j71K02q64
$$ 924543 922597 920056 916768 912719 908342 904110 900332 897332 895221 893589 892060 890967 890796 890998 890134
59081H90134k795m237m530m071l676m057n337o725p128o391n390m755m303l797
$$ 890134 887339 883102 878572 874501 870825 866768 861431 854706 847578 841187 835797 831042 826739 822942
59067H22942l463l495l921n028o934q672q858p564o326o028o078n990o263o964
$$ 822942 819479 815984 812063 807035 800101 791429 782571 775007 768681 762653 756575 750585 744322 737358
59053G37358o981n670m010l100k588j628l68N68J242K002K585K586K224J867J393
$$ 737358 730377 724707 720697 717597 715009 713381 713013 713581 714823 716825 719410 721996 724220 726087 727480
59038G27480P24K57J55j0l49k94L32Q91J159J812L057M013M372N255P306R312
$$ 727480 728204 728461 728616 728606 728257 727963 728295 729186 730345 732157 735214 739227 743599 748854 756160 765472
59022G65472J0090J0483J1848J3554J3831J2401J0524Q827O813M332J984N4j605
$$ 765472 775562 786045 797893 811447 825278 837679 848203 857030 863843 868175 870159 870213 868608
59009H68608k696k700k020j661j713j273j9J259J941K495L640N264O504O608N531
$$ 868608 865912 863212 861192 859531 857818 856545 856526 857785 859726 862221 865861 871125 877629 884237 889768
58994H89768L914K507J466M03q52j988k867l774m645m712l485j600m6R88J944
$$ 889768 893682 896189 897655 898058 897206 895218 892351 888577 883932 879220 875735 874135 874089 875077 877021
58979H77021L088M433O167Q439J0965J3197J4795J5726J6275J6954J7874J8212
$$ 877021 880109 884542 890709 899148 910113 923310 938105 953831 970106 987060 1004934 1023146
58967A023146J7024J4636J2317J0522Q508N876L210P99j912n074p830r710j1340
$$ 1023146 1040170 1054806 1067123 1077645 1086153 1092029 1095239 1096038 1094126 1089052 1081222 1071512 1060172
58954A060172j3094j4323j4784j5471j6924j7995j7502j6093j5106j4599j3772
$$ 1060172 1047078 1032755 1017971 1002500 985576 967581 950079 933986 918880 904281 890509
58943H90509j2540j1382j0274q957p669o533m998k902j292r54j035l11R01J445
$$ 890509 877969 866587 856313 847356 839687 833154 828156 825254 823962 823008 821973 821662 822563 824008
58929H24008J231J042R66M31n33j276j547j555j320q70n70n26j99O58J432J784
$$ 824008 825239 826281 827247 827678 827145 825869 824322 822767 821447 820577 820007 819481 819282 819940 821372 823156
58913H23156K415L770N044N500N805O843Q205R125R895J1006J1868J1923J2080
$$ 823156 825571 829341 834385 839885 845690 852533 860738 869863 879758 890764 902632 914555 926635
58900I26635J3457J5484J6806J7325J7713J7721J6679J5084J4083J3803J3703
$$ 926635 940092 955576 972382 989707 1007420 1025141 1041820 1056904 1070987 1084790 1098493
58889A098493J3918J4758J5596J5894J6463J7987J9162J8315J6118J4563J3898
$$ 1098493 1112411 1127169 1142765 1158659 1175122 1193109 1212271 1230586 1246704 1261267 1275165
58878A275165J2813J1179J0048R184P141L971J458K41j108l587o381q537j0235
$$ 1275165 1287978 1299157 1309205 1318389 1325530 1329501 1330959 1331200 1330092 1326505 1320124 1311587 1301352
58865A301352j1729j2763j3553j4915j6878j8475j9331k0037k0698k0590j9622
$$ 1301352 1289623 1276860 1263307 1248392 1231514 1213039 1193708 1173671 1152973 1132383 1112761
58854A112761j8671j8117j7404j6375j5677j5504j5277j4892j4941j5414j5498
$$ 1112761 1094090 1075973 1058569 1042194 1026517 1011013 995736 980844 965903 950489 934991
58843I34991j4926j4287j3770j2982j2155j2070j2515j2324j1248j0296r859r033
$$ 934991 920065 905778 892008 879026 866871 854801 842286 829962 818714 808418 798559 789526
58831G89526p299n435m157l112j882p80j24L55Q28J155J570K550L790M320L913
$$ 789526 782227 776792 772635 769523 767641 766861 766737 767092 767920 769075 770645 773195 776985 781305 785218
58816G85218L373L273L498L982M728N056M141K456J312R36L55p65j712k293l150
$$ 785218 788591 791864 795362 799344 804072 809128 813269 815725 817037 817973 818328 817563 815851 813558 810408
58801H10408m219m521l950l688m261m711m328l750l593l328k298p84O80K120L632
$$ 810408 806189 801668 797718 794030 789769 785058 780730 776980 773387 770059 767761 766977 767657 769777 773409
58786G73409M986O137P329Q454R176R835J1139J2873J4056J4435J4564J4432J3391
$$ 773409 778395 784532 791861 800315 809491 819326 830465 843338 857394 871829 886393 900825 914216
58773I14216J1533R582P260L386j955o971j0367j2569j4235j5125j5110j4907
$$ 914216 925749 935331 942591 945977 944022 937051 926684 914115 899880 884755 869645 854738
58761H54738j4936j4608j3399j1718j0151q820p754o937n877m194k648k300k747
$$ 854738 839802 825194 811795 800077 789926 781106 773352 766415 760538 756344 753696 751396 748649
58748G48649k638j878j583j797j128R61L336N094O516P691Q057P859Q247R255
$$ 748649 746011 744133 742550 740753 739625 740586 743922 749016 755532 763223 771280 779139 787386 796641
58734G96641R523Q601P731P632P374O309N194M504L505K013J257J854K618K588
$$ 796641 806164 814765 822496 830128 837502 843811 849005 853509 857014 859027 860284 862138 864756 867344
58720H67344K573L495M759N618O673Q615J0711J1803J1741J0843R024O447L758
$$ 867344 869917 873412 878171 883789 890462 899077 909788 921591 933332 944175 953199 959646 963404
58707I63404Q60l172q122j2114j4207j5870j8674k1922k3915k4328k3964k3281
$$ 963404 964264 961092 952970 940856 926649 910779 892105 870183 846268 821940 797976 774695
58695G74695k2394k1503k0244j7722j4175j1396j0452j0269r465q254p331o339
$$ 774695 752301 730798 710554 692832 678657 667261 656809 646540 637075 628821 621490 615151
58683F15151m778l340k886l064l054k740k157r38P00J608J325Q72R74R04J44k94
$$ 615151 610373 607033 604147 601083 598029 595289 593132 592194 592894 594502 595827 596699 597673 598577 598721 598427
58667E98427N67K197L836N824Q343J0215J0462R658Q391N803J315l535o809q638
$$ 598427 598994 601191 605027 610851 619194 629409 639871 649529 657920 663723 665038 661503 654694 646056
58653F46056j0274j1685j1933j1129j0226r376q058o406n064m150l429k999k905
$$ 646056 635782 624097 612164 601035 590809 581433 573375 566969 561905 557755 554326 551327 548422
58640E48422k693k196j869j694q20Q85K182K246J795J533R78j01o78k42N4n91
$$ 548422 545729 543533 541664 539970 539150 540035 542217 544463 546258 547791 548769 548668 547990 547748 547802 547211
58624E47211j041k03R17Q52pm48m00j67R30L173N030N106M430M684N346M749L148
$$ 547211 546170 545967 546884 547736 547729 547281 546881 546714 547644 550817 555847 560953 565383 570067 575413 580162 583310
58607E83310K394L104M125M541M379L683K542J664J591J762J558J506K175K869
$$ 583310 585704 588808 592933 597474 601853 605536 608078 609742 611333 613095 614653 616159 618334 621203
58593F21203K763K456K879L693M257N074O661Q130Q691R417J1560J4052J4822
$$ 621203 623966 626422 629301 632994 637251 642325 648986 657116 665807 675224 686784 700836 715658
58580G15658J3864J2903J2643J2280J1333J0083Q567O853N844O294P525Q556R786
$$ 715658 729522 742425 755068 767348 778681 788764 797331 804184 810028 816322 823847 832403 842189
58567H42189J2093J5047J7680K0214K3388K6729K9200L0685L1291L0034K6112
$$ 842189 854282 869329 887009 907223 930611 957340 986540 1017225 1048516 1078550 1104662
58556A104662K0664J5475J0607N103p48n636r109j1474j2537j2078j0912r911
$$ 1104662 1125326 1140801 1151408 1156511 1155763 1150127 1141018 1129544 1117007 1104929 1094017 1084106
58544A084106q896p890q306j1100j4911j7978k0638k3918k6873k7791k7011k6157
$$ 1084106 1075210 1067320 1059014 1047914 1033003 1015025 994387 970469 943596 915805 888794 862637
58532H62637k5348k3583k1123j9082j7256j4673j1785r876q842p730o771o700
$$ 862637 837289 813706 792583 773501 756245 741572 729787 719911 711069 703339 696568 689868
58520F89868o755n679m064l443l675l504k946k791k509j198J84J17o28j36J280
$$ 689868 683113 677434 673370 669927 666252 662748 659802 657011 654502 653304 653488 653605 652977 652841 654121
58505F54121J685J004R99J964K439K102K173K811K791J984J657K099K273J994
$$ 654121 655806 656810 657809 659773 662212 664314 666487 669298 672089 674073 675730 677829 680102 682096
58491F82096K267L317M406N507P142Q759R429R772J1007J2620J3329J3864J6040
$$ 682096 684363 687680 692086 697593 704735 713494 722923 732695 743702 756322 769651 783515 799555
58478G99555J9454K1786K2199K1714K0404J7076J1832O335J334l641q232j1352
$$ 799555 819009 840795 862994 884708 905112 922188 934020 940355 941689 938048 929816 918464
58466I18464j3145j4485j4706j2582r140o715n370l134L56L489N811Q470J1317
$$ 918464 905319 890834 876128 863546 854406 847691 842321 839187 839543 843032 848843 857313 868630
58453H68630J2768J2765J2869J2989J1059O525J353l058p256j1516j4843j6782
$$ 868630 881398 894163 907032 920021 931080 937605 938958 935900 928644 917128 902285 885503
58441H85503j7873j8000j6556j4256j2377j0420p120l475j714j563o95J199K249
$$ 885503 867630 849630 833074 818818 806441 796021 788901 785426 783712 782149 781454 782653 784902
58428G84902K362L635O479Q851R974J1298J2994J2978J0418P042M027O65l058
$$ 784902 787264 790899 797378 806229 816203 827501 840495 853473 863891 870933 874960 875625 872567
58415H72567n662o958q497j0484j1187j0286r677j0128j0152r071q112p566n972
$$ 872567 866905 859947 851450 840966 829779 819493 809816 799688 789536 780465 772353 764787 758815
58402G58815l105p62K75J174K185K049J100J644M181O362O732O469O453N760M119
$$ 758815 755710 754948 755223 756397 758582 760631 761731 763375 767556 773918 780650 787119 793572 799332 803451
58387H03451K890K536J948J079J254K266K288J280J193K266K627K128K762M642
$$ 803451 806341 808877 810825 811904 813158 815424 817712 818992 820185 822451 825078 827206 829968 834610
58373H34610N461M826N145P110Q400Q084Q228R748J0696J0225J0280J1722J2671
$$ 834610 840071 844897 850042 857152 865552 873636 881864 891612 902308 912533 922813 934535 947206
58360I47206J2309J2398J3406J3073J0609Q423P848O958M514K217J254L67q66
$$ 947206 959515 971913 985319 998392 1009001 1017424 1025272 1032230 1036744 1038961 1040215 1040582 1039716
58347A039716o36J404K891K873L351N144O297O248P296J0146J2323J2827J3852
$$ 1039716 1039080 1040484 1043375 1046248 1049599 1054743 1061040 1067288 1074584 1084730 1097053 1109880 1123732
58334A123732J6075J6969J5874J5843J8001J8958J6537J3310J1601R699O046K709
$$ 1123732 1139807 1156776 1172650 1188493 1206494 1225452 1241989 1255299 1266900 1276599 1282645 1285354
58322A285354J459O58r78j649l84O31M13J505N119Q358R104R275J0488J1156J0705
$$ 1285354 1286813 1287471 1286493 1284844 1284460 1285091 1285504 1287009 1292128 1300486 1309590 1318865 1329353 1340509 1351214
58307A351214J1749J5043J7172J6355J5552J6775J7476J5946J4887J6101J6886
$$ 1351214 1362963 1378006 1395178 1411533 1427085 1443860 1461336 1477282 1492169 1508270 1525156
58296A525156J5366J4170J5136J5774J4652J4783J7762K0232K0126K0578K3490
$$ 1525156 1540522 1554692 1569828 1585602 1600254 1615037 1632799 1653031 1673157 1693735 1717225
58285A717225K5344K3908K2918K5288K7731K7203K6564K8568L0278K8911K7313
$$ 1717225 1742569 1766477 1789395 1814683 1842414 1869617 1896181 1924749 1955027 1983938 2011251
58274B011251K8232K9054K7697K7560L1104L4731L5721L7701M3384M8698N0297
$$ 2011251 2039483 2068537 2096234 2123794 2154898 2189629 2225350 2263051 2306435 2355133 2405430
58263B405430N1983N7125O1799O2223O1904O4188O5208O1763N8733O0589O2968
$$ 2405430 2457413 2514538 2576337 2638560 2700464 2764652 2829860 2891623 2950356 3010945 3073913
58252C073913O1125N9227O2472O7373O9147P1320P8332Q5930Q8954R1492R9077
$$ 3073913 3135038 3194265 3256737 3324110 3393257 3464577 3542909 3628839 3717793 3809285 3908362
58241C908362J07947J12453J16006J24051J33445J39532J46254J58151J70195
$$ 3908362 4016309 4128762 4244768 4368819 4502264 4641796 4788050 4946201 5116396
58232E116396J77095J84513J98989K15311K26499K37490K55575K76376K93381
$$ 5116396 5293491 5478004 5676993 5892304 6118803 6356293 6611868 6888244 7181625
58223G181625L12049L39542L70076L96111M24171M63056N06784N46801N90487
$$ 7181625 7493674 7833216 8203292 8599403 9023574 9486630 9993414 10540215 11130702
58214A1130702O48725P16196P83911Q59797R55694J066315J184109J322101J497461
$$ 11130702 11779427 12495623 13279534 14139331 15095025 16161340 17345449 18667550 20165011
58205B0165011J706652J944709K235142K611472L084698L660437M368122N233860
$$ 20165011 21871663 23816372 26051514 28662986 31747684 35408121 39776243 45010103
58197D5010103O244640P387310Q709435J0298152J2225669J4574572J7485661
$$ 45010103 51254743 58642053 67351488 77649640 89875309 104449881 121935542
58190A21935542K1096260K5436005L0413401L5734998M0520713M2944279M0679107
$$ 121935542 143031802 168467807 198881208 234616206 275136919 318081198 358760305
58183C58760305L2284936J8469276K004100j3663551k5905652l3532289l6592188
$$ 358760305 391045241 409514517 411518617 397855066 371949414 338417125 301824937
58176C01824937l5926652l2785837k8496677k4175920k0547834j7882092j6047080
$$ 301824937 265898285 233112448 204615771 180439851 159892017 142009925 125962845
58169A25962845j4690876j3482286j2251952j0966182r645480q339111p121907
$$ 125962845 111271969 97789683 85537731 74571549 64926069 56586958 49465051
58162D9465051o052229n135202m348429l683656l138885k692182k314647j996885
$$ 49465051 43412822 38277620 33929191 30245535 27106650 24414468 22099821 20102936
58154B0102936j738437j524257j335456j171718j040583r34459q38832p53603
$$ 20102936 18364499 16840242 15504786 14333068 13292485 12358026 11519194 10765591
58146A0765591o86150o31621n78963n28984m88574m53974m16608l78952l48528
$$ 10765591 10079441 9447820 8868857 8339873 7851299 7397325 6980717 6601765 6253237
58137F253237l22263k92218k61028k36844k18526j99988j83721j75926j73161
$$ 6253237 5930974 5638756 5377728 5140884 4922358 4722370 4538649 4362723 4189562
58128D189562j67453j59876j56010j52807j43370j30455j22059j17285j09389
$$ 4189562 4022109 3862233 3706223 3553416 3410046 3279591 3157532 3040247 2930858
58119B930858r9378r3739r1448q5818p7161p1710o9632o5474n9155n5592n4525
$$ 2930858 2831480 2737741 2646293 2560475 2483314 2411604 2341972 2276498 2217343 2161751 2107226
58108B107226n1074m5583m3091m3774m3085m0583l9854m0609l9439l7259l7777
$$ 2107226 2056152 2010569 1967478 1923704 1880619 1840036 1800182 1759573 1720134 1682875 1645098
58097A645098l9693l8663l5646l5198l6738l5777l2551l1233l1513k9273k4769
$$ 1645098 1605405 1566742 1531096 1495898 1459160 1423383 1390832 1359599 1328086 1298813 1274044
58086A274044k2179k1540j9136j5426j4671j6844j7541j6046j6070j8322j9450
$$ 1274044 1251865 1230325 1211189 1195763 1181092 1164248 1146707 1130661 1114591 1096269 1076819
58075A076819j8729j8923k0165j9559j7229j6324j6826j5537j2476j1072j1808
$$ 1076819 1058090 1039167 1019002 999443 982214 965890 949064 933527 921051 909979 898171
58064H98171j1747j0487j0475j1285r830o658n805p850r158q651r261j1748j3103
$$ 898171 886424 875937 865462 854177 844347 837689 831884 824034 814876 806225 796964 785216 772113
58051G72113j2236j1759j2673j2644j0800r320q981p886n811n140o277o625n237
$$ 772113 759877 748118 735445 722801 712001 702681 693700 685814 680003 674863 668586 661961 656724
58038F56724m229m577m696m102m390n660n925m886m502n267n681n734o988q935
$$ 656724 652495 647918 643222 639120 634730 629070 623145 618259 613757 608490 602809 597075 590087 581152
58024E81152r326q329q214q870p995n869n233o123n666l566k838m172m587k945
$$ 581152 571826 563497 555283 546413 538418 532549 527316 521193 515527 511961 509123 504951 500364 497419
58010D97419j845k541k720j188k43j201j765k34J479J389O98J131J999K073J760
$$ 497419 495574 493033 490313 489125 488882 487681 485916 485682 487161 488550 489248 490379 492378 494451 496211
57995D96211J576Q97k37m62M28Q03J4o48o40r79j611r89P24J218q4p84M62J826
$$ 496211 497787 498684 498447 497985 498413 499216 499230 498582 497942 496963 495352 494363 495087 496305 496221 495437 495899 497725
57977D97725J734J432K466M252N783P329Q943R570R075Q816R061Q152N396K346
$$ 497725 499459 500891 503357 507609 513392 520721 529664 539234 548309 557125 566186 574338 579734 582080
57963E82080J4k628o157r140j0521j1185j1888j1880j0915j0314j0618j0428q945
$$ 582080 582094 579466 573309 564169 553648 542463 530575 518695 507780 497466 486848 476420 467475
57950D67475p529p328p321o189m354k869j856j127p03R9K345N485P529P872P990
$$ 467475 459946 452618 445297 439108 434754 431885 430029 428902 428199 428298 430643 436128 443657 451529 459519
57935D59519Q753R253Q938Q653Q687Q019O439N175M506K919k83l678n946p361
$$ 459519 468272 477525 486463 495116 503803 511822 518261 523436 527942 530861 530578 526900 520954 513593
57921E13593q291q443q339r197j0464r971p480n477n290n073l111n75P34J101
$$ 513593 505302 496859 488520 479323 468859 458888 451408 445931 440641 435568 432457 431882 432616 433717
57907D33717J564J870J510J033P48j96k091l712m313m834n853o292n437m358l881
$$ 433717 435281 437151 438661 439694 440442 440246 438155 434443 430130 425296 419443 413151 407714 403356 399475
57892C99475l159j618m16l70k91R50K357K520J780J180O84k4l44J14N04J14n35
$$ 399475 396316 394698 394282 393912 393621 394571 396928 399448 401228 402408 403092 403068 402724 402838 403342 403456 402921
57875D02921r83j711k634k483q87N99R20J176K452L779L924L612M151N256N942
$$ 402921 401938 400227 397593 395110 394223 394822 395742 396918 399370 403149 407073 410685 414836 420092 426034
57860D26034O354P076P687P580P198P102O812N788M568L758L034K103J417J028
$$ 426034 432388 439464 447151 454731 461929 469031 475843 481631 486199 489957 492991 495094 496511 497539
57846D97539J73j062j381o00n43k272m277m931m933n494n889m855l115k295k388
$$ 497539 497712 496650 495269 494669 494126 491854 487577 482646 477713 472219 466330 461475 458360 456065 453677
57831D53677k218j616j212p90L66J997L180L649L694L338K711K388K428J939N77
$$ 453677 451459 449843 448631 447841 448207 450204 453384 457033 460727 464065 466776 469164 471592 473531 474108
57816D74108o35r30r97j492j745j175o79j161j936j978j642j798k300k709l371
$$ 474108 473473 472543 471546 470054 468309 467134 466455 465294 463358 461380 459738 457940 455640 452931 449560
57801D49560m451n033m515l761l561l220k002n95K84J285K885L922L464K669K883
$$ 449560 445109 440076 435561 431800 428239 425019 423017 422422 422706 423991 426876 430798 434262 436931 439814
57786D39814L225K156K90o19n84r50j729j664n68N00J170J985K825K837J887O86
$$ 439814 443039 445195 445485 444866 444282 443332 441603 439939 439371 439871 441041 443026 445851 448688 450575 451261
57770D51261l67j260j722j748k268l915n745o469o373o573o968o513n087l643
$$ 451261 450894 449634 447912 446164 443896 439981 434236 427767 421394 414821 407853 401340 396253 392610
57756C92610k744k245k108k339k460k006j163j30J327K914L472K741K285L372
$$ 392610 389866 387621 385513 383174 380714 378708 377545 377415 378742 381656 385128 387869 390154 393526
57742C93526N058N765N542N251M756L660K771K897L245K828K465L381M805N096
$$ 393526 398584 404349 409891 415142 419898 423558 426329 429226 432471 435299 437764 441145 445950 451046
57728D51046M395L958L714K778J745J830K308J397n23j223j82P14L44k83l25m73
$$ 451046 455441 459399 463113 465891 467636 469466 471774 473171 472648 471425 471243 471957 472301 472018 471693 471220
57712D71220j217j760j493j007r13j030j237j808k511k620k133j646r98N57K678
$$ 471220 470003 468243 466750 465743 464830 463800 462563 460755 458244 455624 453491 451845 450847 451404 454082
57697D54082M049M391M853N972O817O581N562M057J692j423m116n452n724n635
$$ 454082 458131 462522 467375 473347 480164 486745 492307 496364 498056 496633 492517 487065 481341 475706
57683D75706n312m641l710k539r62R80L092N516Q507J1856J5234J8889K3283K8421
$$ 475706 470394 465753 462043 459504 458542 459522 462614 468130 476637 488493 503727 522616 545899 574320
57669E74320L4392M2028N1890O2930P3110Q0590Q2948P6286N7589K8457m980l6074
$$ 574320 608712 650740 702630 765560 838670 919260 1002208 1078494 1136083 1164540 1159560 1123486
57657A123486o0494p5869q1304p8336p0688o1785n2944m4194l5719k8029k1556
$$ 1123486 1062992 987123 905819 827483 756795 695010 642066 597872 562153 534124 512568
57646E12568j6602j3186j0858r192q189p685o920n652m969n725o807o470m955
$$ 512568 495966 482780 471922 462730 454541 446856 439936 434284 429315 423590 416783 410313 405358
57633D05358l973l961l741k884k427k903l455l381l063k813k277j493j249j839
$$ 405358 401385 397424 393683 390799 388372 385469 382014 378633 375570 372757 370480 368987 367738 365899
57619C65899k554k820k829k796k588k206j750r63J89Q24K60n57l07M69J81r66
$$ 365899 363345 360525 357696 354900 352312 350106 348356 347393 347582 348406 348666 348109 347802 348271 348452 347486
57603C47486j115J92J257J042N48O79O98j58j228j629j589j621j567j261j062
$$ 347486 346371 346563 347820 348862 349410 350089 350787 350629 349401 347772 346183 344562 342995 341734 340672
57588C40672j059p75k11jj27K27J111J494R66L67J48m26j785l142l831m179m455
$$ 340672 339613 338838 338627 338626 338499 338726 339837 341331 342297 342664 342812 342386 340601 337459 333628 329449 324994
57571C24994m245l603l401l810l820l005k422k870l596l597l040k500j937j271
$$ 324994 320749 317146 313745 309935 306115 303110 300688 297818 294222 290625 287585 285085 283148 281877
57557B81877r14q99n99N4K28l10n65P8R47J459K051K948L407L033K579K516K162
$$ 281877 280963 280064 279465 279519 279747 279437 278872 278950 279897 281356 283407 286355 289762 292795 295374 297890 300052
57540C00052J094Q0l50q18j638j827p98L17L10m53j109j717k363k184p76N80O27
$$ 300052 301146 301226 300876 300058 298420 296593 295795 296112 296422 295969 294860 293143 290780 288596 287820 288400 289027
57523B89027K5J19P87R89O16L40L40N34J240K453L223L013K726L162L485K707
$$ 289027 289052 289171 289958 290947 291563 291903 292243 292777 294017 296470 299693 302706 305432 308594 312079 314786
57507C14786J665J792K687K669J330r0n75j71O70J309R01n67j672j201P3N11j12
$$ 314786 316451 318243 320930 323599 324929 324839 324264 324093 324763 326072 326973 326406 324734 323533 323606 324117 324005
57490C24005p33q48p94o43k57j19p71j686j974j818j971k288k114j697j745j943
$$ 324005 323272 322424 321630 320987 320730 320611 319840 318154 316180 314362 312391 310103 307989 306292 304547 302604
57474C02604j459o53o37j343j583j137j061j771k294j910j216j022j203j175p04
$$ 302604 301145 300492 299855 298512 296929 295792 294731 292960 290666 288756 287540 286518 285315 284140 283436
57459B83436Q0Q53J137P77L43M40Q05Q30O80R98J705K053J803J388R87M11j22
$$ 283436 283516 284369 285506 286283 286626 287066 287871 288701 289381 290379 292084 294137 295940 297328 298315 298726 298604
57442B98604p2N44J118J316J284J117R30J203K254L460L864L403K779K297J742
$$ 298604 298532 299076 300194 301510 302794 303911 304841 306044 308298 311758 315622 319025 321804 324101 325843
57427C25843J154Q41O50J10p24j302j412j268j002p01o84j015j144p04k56m08
$$ 325843 326997 327838 328488 328598 327874 326572 325160 323892 322890 322189 321505 320490 319346 318642 318386 317978
57411C17978p97p69m72j98O09K403M170M437L286J939P36q51k475k986k349j797
$$ 317978 317181 316412 315940 315742 316351 318754 322924 327361 330647 332586 333322 332471 329996 327010 324661 322864
57395C22864j831j596n81N20J093J430J773J768J379J299J886K616K940K878K587
$$ 322864 321033 319437 318856 319376 320469 321899 323672 325440 326819 328118 330004 332620 335560 338438 341025
57380C41025K212K238K956L554K953J602J117J894K530K005R72K99k58j056j507
$$ 341025 343237 345475 348431 351985 354938 356540 357657 359551 362081 364086 365058 365357 365099 364043 362536
57365C62536j075l69k93q13j312j576j634j348p31k26n4J04M19N59M62O17J141
$$ 362536 361461 361092 360799 359986 358674 357098 355464 354116 353385 353159 353105 353209 353628 354187 354649 355266 356407
57348C56407J373R95O94J045J450J098K67j53M6M03P02J085J450J487J213R66
$$ 356407 357780 358775 359469 360514 361964 363062 363329 363176 363222 363625 364327 365412 366862 368349 369562 370528
57332C70528R05R60J068J134R50M83J10J98O39J013J076R26Q06Q48R17P29L13
$$ 370528 371433 372393 373461 374595 375545 376028 376138 376336 376975 377988 379064 379990 380796 381644 382561 383290 383603
57315C83603J31M84J033J358J740K682L795L979K830J197J54l0K13L92L26L16
$$ 383603 383734 384218 385251 386609 388349 391031 394826 398805 401635 402832 402986 402956 403169 403561 403887 404203
57299D04203R19K158L151L141K565K428K815L027K890K821K720K049J146J136
$$ 404203 405122 407280 410431 413572 416137 418565 421380 424407 427297 430118 432838 434887 436033 437169
57285D37169K156K903K487J629J376J726K129K505K921L065K768K458K467K492
$$ 437169 439325 442228 444715 446344 447720 449446 451575 454080 457001 460066 462834 465292 467759 470251
57271D70251K307K298K784L428L879M369N059N468N198M621M187L644K634J528
$$ 470251 472558 474856 477640 481068 484947 489316 494375 499843 505041 509662 513849 517493 520127 521655
57257E21655R84J086J490J974K309K169J768J985L161M256M095L032K472K999
$$ 521655 522639 523725 525215 527189 529498 531667 533435 535420 538581 542837 546932 549964 552436 555435
57243E55435L890M333M313M129L840L468L308L702M654N796O619O822O497O074
$$ 555435 559325 563658 567971 572100 575940 579408 582716 586418 591072 596868 603487 610309 616806 622880
57229F22880N947O250O884P638Q342R077J0136J1552J2910J3925J4903J6184J7442
$$ 622880 628827 635077 641961 649599 657941 667018 677154 688706 701616 715541 730444 746628 764070
57216G64070J8177J8671J9589K0853K1698K1920K2170K2911K3919K4867K5701
$$ 764070 782247 800918 820507 841360 863058 884978 907148 930059 953978 978845 1004546
57205A004546K6319K6726K7438K8945L0707L1817L2543L4059L6443L8489L9845
$$ 1004546 1030865 1057591 1085029 1113974 1144681 1176498 1209041 1243100 1279543 1318032 1357877
57194A357877M1871M5551M9870N3273N5645N7845O0189O2492O4837O7242O9148
$$ 1357877 1399748 1445299 1495169 1548442 1604087 1661932 1722121 1784613 1849450 1916692 1985840
57183A985840P0204P1054P2454P4070P5029P5264P5427P5787P5854P4885P2296
$$ 1985840 2056044 2127098 2199552 2273622 2348651 2423915 2499342 2575129 2650983 2725868 2798164
57172B798164O8064O3210N9304N6948N5258N3325N1447N0339M9974M9975N0411
$$ 2798164 2866228 2929438 2988742 3045690 3100948 3154273 3205720 3256059 3306033 3356008 3406419
57161C406419N1325N2087N2132N1847N1870N2000N1615N0645M9380M7839M6174
$$ 3406419 3457744 3509831 3561963 3613810 3665680 3717680 3769295 3819940 3869320 3917159 3963333
57150C963333M5074M4821M4462M2913M0529L8624L7791L7565L7425L7095L6237
$$ 3963333 4008407 4053228 4097690 4140603 4181132 4219756 4257547 4295112 4332537 4369632 4405869
57139D405869L4815L3551L3097L2916L1935L0125K8614K8318K9276L1166L3612
$$ 4405869 4440684 4474235 4507332 4540248 4572183 4602308 4630922 4659240 4688516 4719682 4753294
57128D753294L6022L7947L9645M1758M4509M7780N1650N6150O0606O3900O5515
$$ 4753294 4789316 4827263 4866908 4908666 4953175 5000955 5052605 5108755 5169361 5233261 5298776
57117E298776O5906O6122O7407P0864P6997Q5679R6816J10500J26327J43552J62676
$$ 5298776 5364682 5430804 5498211 5569075 5646072 5731751 5828567 5939067 6065394 6208946 6371622
57106F371622J86079K16215K53798K98699L52242M17796M99786O03056P32594
$$ 6371622 6557701 6773916 7027714 7326413 7678655 8096451 8596237 9199293 9931887
57097I931887Q92624J085764J312940J572682J859473K164154K477951K795824
$$ 9931887 10824511 11910275 13223215 14795897 16655370 18819524 21297475 24093299
57089B4093299L115087L432150L741266M031124M273037M408325M354990M043327
$$ 24093299 27208386 30640536 34381802 38412926 42685963 47094288 51449278 55492605
57081E5492605L461624K676615J807930R70456K23934m36684j049489j643332
$$ 55492605 58954229 61630844 63438774 64409230 64633164 64196480 63146991 61503659
57073F1503659k217159k747204l204496l566025l817712l954820l981502l908336
$$ 61503659 59286500 56539296 53334800 49768775 45951063 41996243 38014741 34106405
57065C4106405l749175l519941l238924k926207k601441k281432j978766j701761
$$ 34106405 30357230 26837289 23598365 20672158 18070717 15789285 13810519 12108758
57057A2108758j455190j240867j057754r02664p72085o63506n74582n01755m40970
$$ 12108758 10653568 9412701 8354947 7452283 6680198 6016692 5442110 4940355 4499385
57048D499385l89606l46639l10885k80356k53465k29679k08576j89363j71673
$$ 4499385 4109779 3763140 3452255 3171899 2918434 2688755 2480179 2290816 2119143
57039B119143j55783j41553j28045j14778j02434r1728q2313p3471o5103n7385
$$ 2119143 1963360 1821807 1693762 1578984 1476550 1384822 1302509 1229038 1163935 1106550
57029A106550n0025m2589l5150k7935k0631j2578l378P101J9073L2349M5325N4539
$$ 1106550 1056525 1013936 978786 950851 930220 917642 914264 921365 940438 972787 1018112 1072651
57017A072651N5640M5569K4646l096l1832n6508p4014q3070q4124p9292p1319
$$ 1072651 1128291 1173860 1198506 1195410 1163578 1107070 1033056 949986 865862 786570 715251
57006G15251o2137n2608m3352l5116k8317k2999j9231j6932j5318j3389j1045
$$ 715251 653114 600506 557154 522038 493721 470722 451491 434559 419241 405852 394807
56995C94807r054p850p058o298n635n018m071k675j137N31K856O123R691J2270
$$ 394807 385753 377903 370845 364547 358912 353894 349823 347148 346011 346542 349398 355521 365212 377482
56981C77482J2617J0043M805j932q867j5138j9945k2273k1857j9929j7938j5909
$$ 377482 390099 400142 404947 403015 394148 379010 359065 336792 314935 295006 277068 261159
56969B61159j3079r754p134n381l385o26K200M703P578J1315J5425J9451K3452
$$ 261159 248080 238326 231192 225811 222426 221800 224000 228703 236281 247596 263021 282472 305924
56956C05924K6774K7518K4211J7157P649l169j3836k2124k6395k6990k5470k2892
$$ 305924 332698 360216 384427 401584 409233 406064 392228 370104 343709 316719 291249 268357
56944B68357j9588j5928j2401r077n700k203J382N205R356J3610J7748K1911K6379
$$ 268357 248769 232841 220440 211363 205663 203460 204842 210047 219403 233013 250761 272672 299051
56931B99051L1177L5808L8767L7459K9692J5952k97j5003k5863l2390l4872l4060
$$ 299051 330228 366036 404803 442262 471954 487906 487609 472606 446743 414353 379481 345421
56919C45421l1299k8034k5104k2665k0490j8151j5391j2527j0109q197o434m855
$$ 345421 314122 286088 260984 238319 217829 199678 184287 171760 161651 153454 147020 142165
56907A42165l887l463k918j934r68m65l63m64n94l62M86J390J545J271J838L757
$$ 142165 138278 134815 131897 129963 128995 128530 128167 127703 127109 126747 127233 128623 130168 131439 133277 137034
56891A37034O207Q402J0478J2773J5279J8081K1190K3551K3403K0096J4549P637
$$ 137034 143241 151643 162121 174894 190173 208254 229444 252995 276398 296494 311043 318680
56879C18680m21q540j4318j6261j5399j3606j1305p966l903k31K561M919P401
$$ 318680 318259 309719 295401 279140 263741 250135 238830 230864 226961 226730 229291 234210 241611
56866B41611J0221J3431J7023K1184K6562L3634M1613M8601N2852N2858M6602
$$ 241611 251832 265263 282286 303470 330032 363666 405279 453880 506732 559590 606192
56855F06192L2774J3480o035k1444l1986l8519m0948l9012l4025k7906k1360j4427
$$ 606192 638966 652446 646411 624967 592981 554462 513514 474502 440477 412571 391211 376784
56843C76784p767j906L948J0762J8146K5395L3186M2675N3662O5074P6209Q5422
$$ 376784 369017 367111 371059 381821 399967 425362 458548 501223 554885 619959 696168 781590
56831G81590Q8284P9670N8297K8076m858l5027n8265p2055p6502p4031o7506n8968
$$ 781590 869874 949544 1007841 1035917 1031059 996032 937767 865712 789210 715179 647673 588705
56819E88705m9787m0798l2040k3240j4614o665O33P678J4684K2038L0704M1148
$$ 588705 538918 498120 466080 442840 428226 421561 422194 429872 444556 466594 497298 538446
56807E38446N2050O0729O4422O0563M7150K4694k360k7741m7059n8954o3647o2229
$$ 538446 590496 651225 715647 776210 823360 848054 845694 817953 770894 711940 648293 586064
56795E86064n6967n0342m3309l5533k7255j9647j3393q253m002m62L345Q555J4872
$$ 586064 529097 478755 435446 399913 372658 353011 339618 331365 327363 326901 330246 338801 353673
56782C53673K0897K6060L0714L4025L3455K7135J5745J665j2606k4785l2979l6633
$$ 353673 374570 400630 431344 465369 498824 525959 541704 543369 530763 505978 472999 436366
56770D36366l6775l4848l1759k8154k4721k1717j8822j5881j3265j1319j0001
$$ 436366 399591 364743 332984 304830 280109 258392 239570 223689 210424 199105 189104
56759A89104r117q384p301n641m007l196l065k790k133j599j376j109p62q12j396
$$ 189104 179987 171603 164302 158661 154654 151458 148393 145603 143470 141871 140495 139386 138624 137812 136416
56744A36416k009k185j868j177l92o9m23q74q94q91j431k016j803j087q11q98
$$ 136416 134407 132222 130354 129177 128785 128716 128293 127419 126525 125634 124203 122187 120384 119297 118486 117588
56728A17588m60M72R58Q44J008J741K346K523K738K954K452J338P64J189J697
$$ 117588 117128 117600 118558 119402 120410 122151 124497 127020 129758 132712 135164 136502 137266 138455 140152
56713A40152J621J511J847K075J743J423J684K050J859J360J109J077J008J071
$$ 140152 141773 143284 145131 147206 148949 150372 152056 154106 155965 157325 158434 159511 160519 161590
56699A61590J401J569J197O24L78L82J94k39m84j24P91J610J545O62L8L97R68
$$ 161590 162991 164560 165757 166381 166759 167141 167335 167096 166612 166488 167279 168889 170434 171096 171134 171531 172499
56682A72499O03l32m22O58J793K275K663L386L791L142J683J94p60r20n18n01
$$ 172499 173102 172770 172348 173006 174799 177074 179737 183123 186914 190056 191739 191933 191173 190253 189735 189234
56666A89234j619l188l721k900j810j118m34M01P53M31J86M17O01N09O71J140
$$ 189234 187615 184427 180706 177806 175996 174878 174444 174845 175598 176029 176215 176632 177233 177742 178413 179553
56650A79553J091L95J89J113K192K408K161K165K034J151j4o31q19j128j346r47
$$ 179553 180644 181039 181228 182341 184533 186941 189102 191267 193301 194452 194438 193807 192988 191860 190514 189567
56634A89567k21K2m73j337k212k749k493j487n48l94q83j563k311l013l235k836
$$ 189567 189346 189368 188895 187558 185346 182597 180104 178617 178069 177675 176792 175229 172918 169905 166670 163834
56618A63834k291j855j146m0P39O07J5k85k90l43l47l4M67Q86J186J262Q89L17
$$ 163834 161543 159688 158542 158502 159241 159848 159863 159578 159288 158945 158598 158564 159031 159917 161103 162365 163254 163571
56600A63571K00N25M98r0l73R2M53k2o22l31N40J012J035J288J816K023J765J421
$$ 163571 163771 164296 164794 164704 164331 164423 164876 164854 164232 163901 164441 165453 166488 167776 169592 171615 173380 174801
56582A74801J047L88l80p24n63k64Q0P85J906K987L500L302K682K198K323L062
$$ 174801 175848 176236 175856 175132 174569 174305 174385 175170 177076 180063 183563 186865 189547 191745 194068 197130
56566A97130L943M560M901N170N553O208P269Q822J1019J3841J6396J6966J4490
$$ 197130 201073 205633 210534 215704 221257 227465 234734 243556 254575 268416 284812 301778 316268
56553C16268R769M521l21m611p840r299r175q351p210n787m721m705n115m714
$$ 316268 326037 330558 330237 325626 317786 308487 299312 290961 283751 277964 273243 268538 263423 258709
56539B58709l608l040l248l270k857k804l159k960k138j802k199k243j658j551
$$ 258709 255101 252061 248813 245543 242686 239882 236723 233763 231625 229823 227624 225381 223723 222172
56525B22172k253k538j851j234j140m91R90J622M37j086j473j565k574l690l569
$$ 222172 219919 217381 215530 214296 213156 212665 213655 215277 215714 214628 213155 211590 209016 205326 201757
56510B01757k708k311k093j240l62m90j086r73m09l86p65q00o85q84p54L24J272
$$ 201757 199049 196738 194645 193405 193043 192553 191467 190494 190085 189699 188934 188134 187449 186565 185811 186135 187407
56493A87407O72r06j715j382q71m91J92R01Q39J46l25l74l29m0O25R39L53l15
$$ 187407 188079 187173 185458 184076 183205 182714 182906 183807 184646 184792 184467 184093 183764 183724 184349 185288 185641 185326
56475A85326j10L51l7q86j021n03k22r8N27J234J082L88K08M50K74q8K77J040
$$ 185326 185216 185567 185530 184644 183623 183120 182898 182800 183327 184561 185643 186031 186239 186689 186963 186875 187152 188192
56457A88192R65M3m29R7Q74J331J616J731J518J386J773K190J965J529J631J856
$$ 188192 189157 189200 188771 188868 189742 191073 192689 194420 195938 197324 199097 201287 203252 204781 206412 208268
56441B08268J403P23P60J096N79o64j550j948k422k588j667l37o5p45r52l70l6
$$ 208268 209671 210394 211154 212250 212829 212165 210615 208667 206245 203657 201990 201653 201588 200843 199891 199521 199485
56424A99485k78l81l10p25j278q68K74O91Q8l16n1km30l47N90J314J186R12J012
$$ 199485 199207 198826 198516 197791 196513 195645 195919 196610 196698 196382 196331 196329 195899 195552 196142 197456 198642 199554 200566
56405B00566R20K60k95j27M51R35J255J348J091Q14R56J208J073R79J624K504
$$ 200566 201486 201746 201451 201324 201775 202710 203965 205313 206404 207218 208174 209382 210455 211434 213058 215562
56389B15562K508J775J372J374Q92n6m37j3M12N50Q70J262J138Q66J379K250K057
$$ 215562 218070 219845 221217 222591 223483 223427 222990 222977 223389 223939 224809 226071 227209 228075 229454 231704 233761
56372B33761P45j56Q1N74P12J014J683K004J706J354J059L65l37K3J243J788J123
$$ 233761 234506 234350 234431 235005 235717 236731 238414 240418 242124 243478 244537 244902 244565 244588 245831 247619 248742
56355B48742M43O45J170J382J509J679J540J288J735K784L249K510J128l37j640
$$ 248742 249185 249830 251000 252382 253891 255570 257110 258398 260133 262917 266166 268676 269804 269467 267827
56340B67827k024p76J201K130J913K178L506M511M148L121K464K331K734L766
$$ 267827 265803 265027 266228 268358 270271 272449 275955 280466 284614 287735 290199 292530 295264 299030
56326B99030M693M445L376K927L236K974J798R78J098J193P59N67P87M10o23p49
$$ 299030 303723 308168 311544 314471 317707 320681 322479 323457 324555 325748 326507 327074 327861 328271 327648 326899
56310C26899P21K311K650K270K148K168K119K606L815M798N076N644P371R493
$$ 326899 327620 329931 332581 334851 336999 339167 341286 343892 347707 352505 357581 363225 370596 380089
56296C80089J0559R840P406M039J485J208K437K929K115J768L111N132O509P316
$$ 380089 390648 400488 407894 411933 413418 414626 417063 419992 422107 423875 426986 432118 438627 445943
56282D45943Q027Q439Q512Q821R396R552R365R801J0916J1615J1628J1924J2714
$$ 445943 453970 462409 470921 479742 489138 498690 508055 517856 528772 540387 552015 563939 576653
56269E76653J3031J2862J3613J5718J7835J9201K0833K3461K6349K9016L2262
$$ 576653 589684 602546 616159 631877 649712 668913 689746 713207 739556 768572 800834
56258H00834L6511M1020M5632N1358N8361O5321P1705P8779Q7336R6444J05274
$$ 800834 837345 878365 923997 975355 1033716 1099037 1170742 1249521 1336857 1433301 1538575
56247A538575J14184J22995J30344J35744J40279J44209J45942J44321J39876
$$ 1538575 1652759 1775754 1906098 2041842 2182121 2326330 2472272 2616593 2756469
56238B756469J32758J21789J06643Q8818O9229M7134K2684j753k4210m4861o3945
$$ 2756469 2889227 3011016 3117659 3206477 3275706 3322840 3345524 3343771 3319561 3274700 3210755
56227C210755q0253r3128j03692j12602j18690j21315j21823j21302j19124j15140
$$ 3210755 3130502 3037374 2933682 2821080 2702390 2581075 2459252 2337950 2218826 2103686
56217B103686j10899j07100j02268r5684q9182q4266p9871p4808p0031o6372o2456
$$ 2103686 1992787 1885687 1783419 1687735 1598553 1514287 1434416 1359608 1289577 1223205 1160749
56206A160749n7092n1601m7598m4451m0990l7635l4828l1507k7263k3877k2446
$$ 1160749 1103657 1052056 1004458 960007 919017 881382 846554 815047 787784 763907 741461
56195G41461k1171j8319j5178j3641j2967j1503r704q756p987o305m640m319m517
$$ 741461 720290 701971 686793 673152 660185 648682 638978 630222 622235 615930 611290 606971 602454
56182F02454l756k574k272k451k059j527j571j310J47J707K033J950K890M369
$$ 602454 598698 596124 593852 591401 589342 587815 586244 584934 585081 586788 588821 590771 593661 598030
56168E98030N111N265N517N493M948N066O560Q116Q561Q826R918J0873J0748J0718
$$ 598030 603141 608406 613923 619416 624364 629430 635990 644106 652667 661493 671411 682284 693032 703750
56154G03750J2075J3976J5280J6682J9083K1802K4396K8015L3021L7678M1450
$$ 703750 715825 729801 745081 761763 780846 802648 827044 855059 888080 925758 967208
56143I67208M6950N6170O7363P8165Q9067J00886J11438J17919J20297J19233
$$ 967208 1014158 1070328 1137691 1215856 1304923 1405809 1517247 1635166 1755463 1874696
56133A874696J13168J00991Q5632P1627O0797N3058M8978M8095M6784M1483L2650
$$ 1874696 1987864 2088855 2174487 2246114 2306911 2359969 2408947 2457042 2503826 2545309 2577959
56122B577959K2738J2342J312q690j6323k3407l2528m3757n6484p1848q9876j06680
$$ 2577959 2600697 2613039 2614351 2605661 2589338 2565931 2533403 2489646 2433162 2361314 2271438 2164758
56110B164758j18189j24390j26668j23808j14658j02092r0014p8539o6224n4604
$$ 2164758 2046569 1922179 1795511 1671703 1557045 1454953 1364939 1286400 1220176 1165572
56100A165572m6101l9564l2399k5285k0413j6999j2867q696o399n155l190j518
$$ 1165572 1119471 1079907 1047508 1022223 1001810 984811 971944 963248 956849 951694 948504 946986
56088I46986j668j867J07K524K702K070L476N781O120N498O815R280J0007R407
$$ 946986 945318 943451 943558 946082 948784 950854 954330 960111 966231 971729 978544 987824 997831 1007238
56074A007238R840J0669R914R036J0798J3920J5132J4839J5682J7211J7205J6432
$$ 1007238 1017078 1027747 1037661 1046697 1057495 1071415 1086547 1101386 1117068 1134279 1151484 1167916
56062A167916J6906J7406J5933J4353J5101J5847J3304R849R984J2642J3535J2914
$$ 1167916 1184822 1202228 1218161 1232514 1247615 1263462 1276766 1286615 1296599 1309241 1322776 1335690
56050A335690J4099J6408J6658J5918J7660K0783K1534K0760K2134K4835K5238
$$ 1335690 1349789 1366197 1382855 1398773 1416433 1437216 1458750 1479510 1501644 1526479 1551717
56039A551717K4190K5174K6900K5403K1948K1109K2512K2372K1634K4454K9936
$$ 1551717 1575907 1601081 1627981 1653384 1675332 1696441 1718953 1741325 1762959 1787413 1817349
56028A817349L3625L5765L9859M4586M5729M4549M5565M7762M7030M5381M8099
$$ 1817349 1850974 1886739 1926598 1971184 2016913 2061462 2107027 2154789 2201819 2247200 2295299
56017B295299N3507N5686N5697N9494O6117O9026O8312P0318P5713P9158Q0411
$$ 2295299 2348806 2404492 2460189 2519683 2585800 2654826 2723138 2793456 2869169 2948327 3028738
56006C028738Q4446R0834R4324R5639J00308J07437J11393J13676J20795J31470
$$ 3028738 3113184 3204018 3298342 3393981 3494289 3601726 3713119 3826795 3947590 4079060
55996D079060J38769J43841J53771J67059J75815J81356J92275K07828K19353
$$ 4079060 4217829 4361670 4515441 4682500 4858315 5039671 5231946 5439774 5659127
55987E659127K27747K42524K63675K82113K98285L21868L52496L80118M05270
$$ 5659127 5886874 6129398 6393073 6675186 6973471 7295339 7647835 8027953 8433223
55978H433223M38939M81384N22335N63239O16820O83091P49763Q18297R04252
$$ 8433223 8872162 9353546 9875881 10439120 11055940 11739031 12488794 13307091 14211343
55969A4211343J009776J123197J248591J406632J603164J829176K096567K440414
$$ 14211343 15221119 16344316 17592907 18999539 20602703 22431879 24528446 26968860
55961B6968860K881375L421963M082377M896025N864646O969497Q239845R761299
$$ 26968860 29850235 33272198 37354575 42250600 48115246 55084743 63324588 73085887
55953G3085887J1612189J3858019J6616882K0042865K4211738K9077140L4449093
$$ 73085887 84698076 98556095 115172977 135215842 159427580 188504720 222953813
55946B22953813L9687345M3209783M2606005L5871999K2977411O288419j0614353
$$ 222953813 262641158 305850941 348456946 384328945 407306356 413594775 402980422
55939D02980422k4647278l4170134l8941645l9666013l7542954l3840846k9544045
$$ 402980422 378333144 344163010 305221365 265555352 228012398 194171552 164627507
55932A64627507k5242778k1248017j7717407j4694184j2143433j0019912q290770
$$ 164627507 139384729 118136712 100419305 85725121 73581688 63561776 55271006
55925E5271006o902358n776764m854960m109591l510910l015998k598191k254362
$$ 55271006 48368648 42591884 37736924 33627333 30116423 27100425 24502234 22247872
55917B2247872j975310j737248j527936j353429j212408j088688r74577q77657
$$ 22247872 20272562 18535314 17007378 15653949 14441541 13352853 12378276 11500619
55909A1500619p98727p25406o53016n90729n41378m95054m47841m07896l77739
$$ 11500619 10701892 9976486 9323470 8732741 8191363 7696309 7248468 6840572 6462833
55900F462833l48539l17173k91687k74627k57393k36200k18071k05900j92741
$$ 6462833 6114294 5797121 5505434 5230807 4973414 4737214 4519143 4313243 4120502
55891D120502j75993j62898j56619j50327j40084j30819j24833j16890j05374
$$ 4120502 3944509 3781611 3624992 3474665 3334581 3203762 3078929 2962039 2856665
55882B856665r6286r1613q5241p4685o5596o0504n4342m5441m0094m1655m5289
$$ 2856665 2760379 2668766 2583525 2508840 2443244 2382740 2328398 2282957 2242863 2201208 2155919
55871B155919m7754n2282n9635o4243o3636o2333o2421n9610n2633m7085m5739
$$ 2155919 2108165 2055883 1996248 1932005 1868369 1806036 1743615 1684005 1631372 1584287 1538548
55860A538548m4042l9432l6237l6958l7371l4844l3200l4740l5452l2746l0417
$$ 1538548 1494506 1455074 1418837 1381879 1344508 1309664 1276464 1241724 1206272 1173526 1143109
55849A143109l1279l2079l0193k8386k8691k8277k5469k3345k3464k2546j9086
$$ 1143109 1111830 1079751 1049558 1021172 992481 964204 938735 915390 891926 869380 850294
55838H50294j6684j7142j6894j3986j1979j3038j3762j1876j0472j1521j1649
$$ 850294 833610 816468 799574 785588 773609 760571 746809 734933 724461 712940 701291
55827G01291q705o237o899p487n265l397n174q167q953q744r606r820p720n727
$$ 701291 692586 686349 679450 671963 666698 663301 658127 649960 641007 632263 622657 612837 605117 599390
55813E99390o090o682n139l095k389j307J505L655L448L558O238Q938Q793P540
$$ 599390 593300 586618 581479 578384 575995 574688 576193 579848 583296 586854 593092 602030 610823 618363
55799F18363P836Q337O582L430P19k310o623j0494j2499j4215j6785j8084j6557
$$ 618363 626199 634536 641118 644548 645267 642957 636334 625840 613341 599126 582341 564257 547700
55786E47700j4407j3726j2837r902o665n187m237k491j935m331p369q089p333
$$ 547700 533293 519567 506730 496828 490163 484976 480739 478248 476313 471982 464613 456524 449191
55773D49191p250p252n962m505m299m065k376p75j137k388k785l034m178n082
$$ 449191 441941 434689 428727 424222 419923 415858 413482 412707 411570 409182 406397 403363 399185 394103
55759C94103m910n335p248q203o345l955l748m416l460j760j591k387k339k121
$$ 394103 389193 383858 376610 368407 362062 358107 354359 349943 346483 344723 343132 340745 338406 336285
55745C36285l358n120n485m969n167n599m993m167m556n392n220m611m670m555
$$ 336285 332927 327807 322322 317353 312186 306587 301594 297427 292871 287479 282259 277648 272978 268423
55731B68423l199j757j677k049j580j250k316l583l453k889l431m139l454k306
$$ 268423 265224 263467 261790 259741 258161 256911 254595 251012 247559 244670 241239 237100 233646 231340
55717B31340k418l075k566j336q97j001n83r4l12l62N50J091M6j090m50R99J268
$$ 231340 228922 225847 223281 221945 221048 220047 219464 219370 219058 218696 219246 220337 220383 219293 218843 219842 221110
55700B21110O64N28M17o28j644j431j098j989k838j852k4P06Q84J978L076K539
$$ 221110 221774 222302 222719 222091 220447 219016 217918 215929 213091 211239 211215 211921 212805 214783 217859 220398
55684B20398J502K099L512L411K306K681M538N506M946M381M032K475j52j786
$$ 220398 221900 223999 227511 230922 233228 235909 240447 245953 250899 255280 259312 261787 261635 259849
55670B59849j677j199j155q76k00Q3L4O04J680K078J586J165J169J073P75N50
$$ 259849 258172 256973 255818 254942 254742 254825 254859 255463 257143 259221 260807 261972 263141 264214 264989 265539
55654B65539J19o75q56K46J340P41j159k803l957n315o507o729o548o970p365
$$ 265539 265658 264983 264127 264373 265713 266454 265295 262492 258535 253220 246713 239984 233436 226466 219101
55639B19101o529n071m511m661m171l096k614k682k221j251o89m22L47J272J467
$$ 219101 212572 207501 202990 198329 194158 191062 188448 185766 183545 182294 181605 181183 181530 182802 184269
55624A84269J393K045K831K388J057L24K59k65j156j245n90n00j282k025k422
$$ 184269 185662 187707 190538 192926 193983 194307 194566 194301 193145 191900 191310 190810 189528 187503 185081
55609A85081k923l230k523j112j17J89J92l21j489k157j314o0j48j233j773j916
$$ 185081 182158 178928 176405 175293 175176 175365 175557 175236 173747 171590 170276 170216 170068 168835 167062 165146
55593A65146k953m386m318k676j453j517j614q61PL49N83R21R43Q02J350K660
$$ 165146 162193 157807 153489 150813 149360 147843 146229 145368 145375 145724 146307 147228 148171 148973 150323 152983
55577A52983L849M527N082N544N604N707O699Q446J0099J1511J3076J4451J4786
$$ 152983 156832 161359 166441 171985 177589 183296 189995 198441 208540 220051 233127 247578 262364
55564B62364J3907J2068R130N274J688r46l743p629j1138j2219j1446j1037j1415
$$ 262364 276271 288339 297469 302743 304431 303485 299742 292113 280975 268756 257310 246273 234858
55551B34858j1122r732q377p479o320m926m187m014l395k308j689j565j093l44
$$ 234858 223736 214004 205627 198148 191828 186902 182715 178701 175306 172998 171309 169744 168651 168307
55537A68307j49l58j49K14j43q05p27l90j079k332k535j838j951l077l648l281
$$ 168307 168158 167800 167651 167865 167722 166917 166190 165800 164721 162389 159854 158016 156065 152988 149340 146059
55521A46059l403m517n335n136m651m118k778r01j17r44k026k385k504k634k121
$$ 146059 142656 138139 132804 127668 123017 118899 116121 115220 115103 114159 112133 109748 107244 104610 102489
55506A02489j108p96j264j021M72J776J764J141Q23N79J98L21J113J574J067L12
$$ 102489 101381 100585 99321 98300 98772 100548 102312 103453 104276 104855 105053 105374 106487 108061 109128 109440
55490A09440J01K86N33R16J284J282J271J926K764K612J603J060J271J184N62
$$ 109440 109541 109827 110360 111276 112560 113842 115113 117039 119803 122415 124018 125078 126349 127533 128095
55475A28095M06Q68P03n35j669j968k180k772k936k256j684j894k183j872j439
$$ 128095 128501 129369 130072 129537 127868 125900 123720 120948 118012 115756 114072 112178 109995 108123 106684
55460A06684j386j357j087r81j107q94l43k23n83n79j28k20j036j434q82k95k74
$$ 106684 105298 103941 102854 101873 100766 99872 99529 99306 98723 98144 98016 97796 96760 95326 94444 94149 93875
55443I3875j55M46P31J54o38j083j416j525o30J132K256J892R21L49k7n66q90
$$ 93875 93720 94166 94897 95051 94413 93330 91914 90389 89759 90891 93147 95039 95960 96309 96282 95716 94826
55426I4826p95p97j025q11j6O01P68J090J525J120j38q05m6J232J977K168J846
$$ 94826 94031 93234 92209 91398 91382 91983 92751 93841 95366 96486 96348 95543 95497 96729 98706 100874 102720
55409A02720O97o67q24K64Q85K15n17m21m76j493k413k123j322j111j143o66o2
$$ 102720 103417 102750 101926 102190 103075 103290 102773 102352 101876 100383 97970 95847 94525 93414 92271 91605 91543
55392I1543M4N1L94M60k74j037r22k06M98J243J956J877Q98J93L95N16k15q62
$$ 91543 91587 91638 92032 92492 92218 91181 90259 90053 90551 91794 93750 95627 96525 96718 97113 97629 97414 96552
55374I6552m03N06P51M58J64m46j527k075j459p42r94j401p55L94P12L15J74J20
$$ 96552 96149 96655 97406 97864 98028 97582 96055 93980 92521 91779 90785 89384 88629 89023 89735 90050 90224 90344
55356I0344o49j675j671o26J95J95k7J6J33J54J72J15j55m59n76n79m52R4R31
$$ 90344 89695 88020 86349 85723 85918 86113 86086 86102 86235 86389 86561 86676 86521 86062 85486 84907 84455 84549 85480
55337H5480J365J123O72J73p69j865j966r03q0l27n87J45J063J062O93R41J317
$$ 85480 86845 87968 88640 88813 88044 86179 84213 83310 83230 82903 82316 82461 83524 84586 85279 86220 87537
55320H7537Q36rk8O06P30J28m36o79q78q86l95J94L06J46J59J04k73l86K16Q07
$$ 87537 88373 88364 88336 88942 89672 89800 89364 88685 87807 86921 86526 86720 87026 87172 87331 87435 87162 86776 86992 87799
55300H7799N81O2J65N93N52K50L42M79o7q44q00PN51M30M0l32n08j3J124J739
$$ 87799 88380 88442 88607 89200 89752 90002 90344 90823 90756 89912 89112 89119 89670 90100 90140 89808 89300 89287 90411 92150
55280I2150R52m08r90q23o78l48P80K035K073R26j30n24p33r56r08p38p93o24
$$ 92150 93102 92694 91704 90881 90203 89855 90635 92670 94743 95669 95539 95015 94282 93326 92418 91680 90887 90263
55262I0263L62J578J884J311Q21O29K09l65n10m32q21j444j450r32p23q67p39
$$ 90263 90625 92203 94087 95398 96219 96848 97057 96692 96182 95750 94929 93485 92035 91103 90380 89513 88774
55245H8774m69o59q49j3J393J707N75n11n36j90k79m85l60k04k52j01M02P08N50
$$ 88774 88305 87646 86797 86784 88177 89884 90459 89948 89412 89222 88943 88458 88098 87894 87642 87541 87943 88651 89201
55226H9201M65P99J118J024P43M10k98j403k204k094j248k47L80K15o99j456j095
$$ 89201 89666 90465 91583 92607 93350 93760 93462 92059 89855 87761 86513 86266 86646 86861 86162 84706 83611
55209H3611J07R17Q19N04N60P07O24N99Q73J135J110J007R79P38O7p64j353j541
$$ 83611 83718 84635 85454 85958 86518 87225 87849 88448 89321 90456 91566 92573 93552 94290 94357 93593 92240 90699
55191I0699j290o33R1M56M39L26K36J66L17P21Q24J15q47r47l4P94O73l6m11r3
$$ 90699 89409 88776 88867 89323 89762 90088 90324 90490 90807 91528 92352 92467 91620 90673 90639 91433 92106 92070 91659 91566
55171I1566M98P33M53K15O86J583J728N81q52j275p61l20l25l76l48m99o60l59
$$ 91566 92064 92797 93250 93465 94151 95734 97462 98043 97191 95916 95155 94835 94510 94134 93786 93287 92627 92268
55153I2268L16Q14J026J194J106L44p78j465j552j508j378p07M30J225J104K28
$$ 92268 92584 93398 94424 95618 96724 97068 96290 94825 93273 91765 90387 89680 90110 91335 92439 92667
55137I2667q92j592j119N62K204K440J398K57m75j112j480q82M99J491J528J308
$$ 92667 91775 90183 89064 89626 91830 94270 95668 95925 95450 94338 92858 91976 92475 93966 95494 96802
55121I6802J474J727J594J158O22p7q23j241j307j322j232o83J21M88L12J98L45
$$ 96802 98276 100003 101597 102755 103377 103300 102477 101236 99929 98607 97375 96692 96813 97301 97613 97811 98156
55104I8156J90n41j271j357p57K56J376K038J749Q47K55K97M57L89M01P09R84
$$ 98156 98346 97805 96534 95177 94420 94676 96052 98090 99839 100686 100941 101238 101695 102084 102485 103194 104178
55087A04178Q95N50J79l8J36O68R20L96l80n15j41r9l26J24J279J812R07m79r15
$$ 104178 105073 105623 105802 105764 105900 106568 107488 107884 107504 106989 106848 106749 106423 106547 107826 109638 110545 110066 109151
55068A09151k54N04N28j62r03q85Q5J233J568J013K73k52o73q72n26J24L65kn45
$$ 109151 108897 109401 109929 109767 108864 107979 108064 109297 110865 111878 112151 111899 111226 110354 109828 109952 110317 110315 109770
55049A09770j015j421j450q36k18m22r30m29R40J433K50j229j454p21k21k09j48
$$ 109770 108755 107334 105884 105048 104830 104408 103478 103049 103989 105422 105672 104443 102989 102268 102047 101838 101690
55032A01690R9K59L66O21Q39P07K89j19l55l49j16K4k69p19p16k78k9j19l2L32
$$ 101690 101789 102048 102414 103035 103874 104581 104870 104751 104396 104047 103931 103955 103686 102967 102251 101973 101944 101825 101793 102125
55012A02125L97j3k32J51P05J032J310J538J234M23k5K61M69k0m32J99J393J840
$$ 102125 102522 102509 102277 102428 103133 104165 105475 107013 108247 108670 108645 108906 109375 109355 108923 109122 110515 112355
54994A12355J200L32j05l24p26j197j236m23J078K399K552J497K84k9N41J122
$$ 112355 113555 113887 113782 113458 112732 111535 110299 109876 110954 113353 115905 117402 117686 117657 118198 119320
54978A19320R63P8q58j162q34m95m46k03N94J361J367R07O62L89m99j395j053
$$ 119320 120283 120361 119503 118341 117507 117012 116566 116363 116957 118318 119685 120592 121254 121643 121144 119749 118696
54961A18696L29J152P93L46N74P79L91J05M93P92K52n02n33j24n9k65k93l70q33
$$ 118696 119025 120177 120970 121316 121890 122669 123060 123165 123658 124450 124702 124200 123667 123543 123484 123219 122926 122556 121723
54942A21723j149o88O7K04j71k09K71O89Q06R33J134J077P31N50R29J866L105
$$ 121723 120574 119886 119953 120157 119986 119777 120048 120737 121543 122476 123610 124687 125418 125968 126897 128763 131868
54925A31868M271N082N618O079O286O016N879O884Q661R220P225L686O00j346
$$ 131868 136139 141221 146839 152918 159204 165220 171099 177983 186644 195864 203089 206775 207375 206029
54911B06029k761m040n043n903o944p905q105p375o128m695l207k007j411j257
$$ 206029 203268 199228 194185 188282 181338 173433 165328 157953 151825 147130 143923 141916 140505 139248
54897A39248j200j316j819k372k328j522l67P47J660K240K404K314K260K416K905
$$ 139248 138048 136732 134913 132541 130213 128691 128324 129071 130731 132971 135375 137689 139949 142365 145270
54882A45270L785M790N417N557N681O212P005P660P855P252N603L203P34j468
$$ 145270 149055 153845 159262 164819 170500 176712 183717 191377 199232 206484 212087 215290 216024 214556
54868B14556l463n013n748o093o945q076q050o358m510m077m622m596l512k132
$$ 214556 211093 206080 200332 194239 187294 179218 171168 164810 160300 156223 151601 147005 143493 141361
54854A41361j128o62q58j645k329k277j784j573j724j829j808j812j675j243r63
$$ 141361 140233 139571 138713 137068 134739 132462 130678 129105 127381 125552 123744 121932 120257 119014 118051
54839A18051j341k048k269j731p69L29J348J797J259M7j010j351r56j94L26J97
$$ 118051 116710 114662 112393 110662 109893 110222 111570 113367 114626 114673 113663 112312 111356 111162 111488 111685
54823A11685j50J58J045J304L35p90q70k74j52n42n10K53J104J510J480J062L11
$$ 111685 111535 111693 112738 114042 114377 113587 112717 112443 112291 111749 111239 111492 112596 114106 115586 116648 116959
54806A16959l25l39J72P18J098J333J295R45O08M27O5m92n50J42O13K8q48o59
$$ 116959 116634 116295 116467 117185 118283 119616 120911 121856 122464 122891 122956 122464 121914 122056 122669 122697 121849 121190
54788A21190N02J265R12Oo35o25J64J379J995J371L21J62R24J538J618J856K728
$$ 121190 121692 122957 123869 123875 123240 122615 122779 124158 126153 127524 127845 128007 128931 130469 132087 133943 136671
54771A36671L866M857N677O286O657P231Q395R570R723Q779P566O426M871K787
$$ 136671 140537 145394 151071 157357 164014 171245 179640 189210 198933 207712 215278 221704 226575 229362
54757B29362Q58n00j802l660n920p895q959q890q049p168o494n456l760k388k445
$$ 229362 230220 229720 227918 224258 218338 210443 201484 192594 184545 177377 170883 165427 161667 159279 156834
54742A56834l397l612k586j443j089j052n34L40Q78P54K49%O15K023L248L443
$$ 156834 153437 149825 147239 145796 144707 143655 143121 143461 144339 145093 145342 145342 145957 147980 151228 154671
54726A54671L010L067L924M912N527N814N663M808L562K604J858N63j402l210
$$ 154671 157681 160748 164672 169584 175111 180925 186588 191396 194958 197562 199420 199983 198581 195371
54712A95371m302m940n332n209m632m310m602m959m758m064l239k441j780j310
$$ 195371 191069 186129 180797 175588 170956 166646 162044 157085 152327 148263 145024 142583 140803 139493
54698A39493p29K20R51N32p72j475q75j02n09j817k598k094q15K79O21K22m45
$$ 139493 138764 138984 139935 140467 139695 138220 137345 137243 136734 134917 132319 130225 129410 129689 130310 130532 130087
54681A30087q02o38j32M57Q77P46j6p82q22l96m53j139j547j140o12p93j424j651
$$ 130087 129285 128647 128515 128972 129849 130595 130579 129797 128975 128579 128126 126987 125440 124300 123688 122895 121471 119820
54663A19820j190m48J44L98K04l66r28j003m86K36N16K2p81r44j67P32R01O45
$$ 119820 118630 118182 118326 118724 118928 118562 117634 116631 116145 116381 116897 116919 116138 115194 115027 115759 116660 117305
54645A17305P96J292J332P61K68J78Q4j82k05O9M5m64q12n27MK98M41N79N01K44
$$ 117305 118101 119393 120725 121486 121754 121932 122016 121834 121629 121698 121743 121279 120467 119940 119944 120242 120683 121262 121763 122007
54625A22007L05P86R80L97m28p61o92p52r52r46p26n55m24j11L67P76J003J059
$$ 122007 122312 123098 124078 124475 124047 123286 122594 121842 120890 119944 119218 118663 118239 118128 118495 119271 120274 121333
54607A21333R82R23J076J331J263O74j28p17r26q48o68n95o19m64q2J11m5J10
$$ 121333 122315 123238 124314 125645 126908 127582 127454 126737 125811 124963 124295 123700 123081 122617 122535 122646 122601 122711
54589A22711J051J881J307l12j196o30J51k6o59p55m00k30j91J10M67M69L22M07
$$ 122711 123762 125643 126950 126638 125442 124812 124963 124937 124278 123523 123123 122893 122702 122812 123279 123748 124070 124477
54571A24477M67P4m41l86K25Q11J153J477J736J584R90K91l73j081j641j585p59
$$ 124477 124944 125018 124577 124191 124416 125227 126380 127857 129593 131177 132167 132458 132085 131004 129363 127778 127019
54554A27019M22J348J637J257N54K5j22q0k8J47N87J166J625J777J472P16m9j98
$$ 127019 127441 128789 130426 131683 132237 132262 132140 132060 132032 132179 132766 133932 135557 137334 138806 139522 139473 139275
54536A39275L07P50N30j19n67n58k81lN3k77q74j288j124l70O68J524J707J081
$$ 139275 139582 140332 140862 140743 140176 139618 139337 139334 139387 139110 138236 136948 135824 135454 136122 137646 139353 140434
54518A40434J76k76j86m8n6J08N21P05L11l51p71p38k46N37J065P58j49o66k39
$$ 140434 140610 140334 140148 140100 140044 140152 140673 141378 141689 141338 140567 139829 139583 140120 141185 141943 141794 141128 140889
54499A40889N96J034Q95M59o0m84n98m27k36q0J74L31j5o62q68m12J15L38N76
$$ 140889 141485 142519 143414 143873 143813 143329 142731 142304 142068 141988 142162 142493 142478 141816 140948 140536 140651 140989 141565
54480A41565R41R02L05l7N27J391J520Q79L23M02Q76J211J056N36L28J045K326
$$ 141565 142506 143408 143713 143676 144203 145594 147114 147993 148316 148718 149594 150805 151861 152397 152725 153770 156096
54463A56096L091K901K408K163J842J102L53k4m77j527k767l339l022k232j332
$$ 156096 159187 162088 164496 166659 168501 169603 169956 169932 169455 167928 165161 161822 158800 156568 155236
54448A55236n44o1K15N74Q27L85o42j268j096r60j438j726j034j20j62q75j079
$$ 155236 154692 154631 154846 155420 156247 156632 155990 154722 153626 152666 151228 149502 148468 148348 148186 147311 146232
54431A46232o73o35j237j588j032Q6J069J531J403R96R67J519J917J506Q01P06
$$ 146232 145559 144924 143687 142099 141067 141153 142222 143753 145156 146152 147119 148638 150555 152061 152862 153568
54415A53568J029Q40Q0l87k23Km2j5K52L96K22l2k84n92n68L11J576J978J144
$$ 153568 154597 155437 155517 155130 154907 154909 154867 154852 155104 155500 155722 155690 155406 154814 154246 154557 156133 158111 159255
54396A59255J00k26j70m14p23l66N90J282J249J006J223J733J703P62l82p54l61
$$ 159255 159355 159129 158959 158545 157822 157456 158046 159328 160577 161583 162806 164539 166242 167004 166622 165868 165507
54379A65507r6l78n48K3R05J245R87Q11J135J812K568L162L311K936K381J903
$$ 165507 165411 165033 164485 164508 165413 166658 167645 168456 169591 171403 173971 177133 180444 183380 185761 187664
54363A87664J311M71k50n51q11j381j820j526p10jN31J039J073J67j060j569j473
$$ 187664 188975 189446 189196 188645 187834 186453 184633 183107 182397 182396 182927 183966 185039 185206 184146 182577 181104
54346A81104j742k436k569j831j168j235j497j362j134j275j583j746j856j848
$$ 181104 179362 176926 174357 172526 171358 170123 168626 167264 166130 164855 163272 161526 159670 157822
54332A57822j253r6O88M80q6j30J28n3n50n50N9M98K79k06n10p48j069j074l17
$$ 157822 156569 156473 157161 157641 157555 157425 157553 157500 156950 156400 156459 156957 157236 157030 156520 155772 154703 153629 153312
54313A53312Q67J574J330N37j50m85n72n27m66n75q61j039r74r66j118q00N58
$$ 153312 154179 155753 157083 157620 157470 156985 156413 155886 155420 154845 153984 152945 151971 151005 149887 149087 149645
54296A49645K222K693J585J11n39m43j72J84O38P64L97J50M81Q10M25k76l64K57
$$ 149645 151867 154560 156145 156256 155717 155274 155102 155286 155924 156688 157085 157235 157716 158526 158951 158675 158311 158568
54278A58568R00J139J034O24N4k08LJ19k01l21L01R57P55K04L89J038R60J40j95
$$ 158568 159468 160607 161641 162265 162319 162111 162114 162233 162032 161711 162012 162969 163724 163928 164317 165355 166315 166455 166260
54259A66260L42Q13P37Q16J433J787J210K25k82j24L45P14N62j34n16J91J243
$$ 166260 166602 167415 168152 168968 170401 172188 173398 173623 173341 173217 173562 174276 174838 174704 174188 174379 175622
54242A75622J050n43j936k113j812j880j874j227m81l09l29P9N81N46J63p2k91
$$ 175622 176672 176129 174193 172080 170268 168388 166514 165287 164806 164497 164168 164247 164828 165374 165537 165465 165174
54225A65174p66j067o81K2L47L26L71L40j44q02j023q24p08p70p17n62n45n00
$$ 165174 164408 163341 162660 162682 163029 163355 163726 164066 163922 163120 162097 161273 160565 159795 159078 158516 157971 157471
54207A57471n2O26R24O51K12l7j74m08p70j099j101n86J44M12k3n36l68M98J400
$$ 157471 157419 158045 158969 159620 159832 159795 159621 159213 158443 157344 156243 155657 155801 156213 156190 155654 155286 155784 157184
54188A57184J714J299N46J32L87P94N96J4J21J266K448K731K438K302K205J628
$$ 157184 158898 160197 160743 160875 161262 162056 162652 162666 162787 164053 166501 169232 171670 173972 176177 177805
54172A77805P30P8l01p03r48p66o71j406k589k972k144j078p76j139j511j605
$$ 177805 178535 178613 178312 177609 176661 175895 175224 173818 171229 168257 166113 165035 164259 163120 161609 160004
54156A60004j470j043k51O20J076Q69K38k77k37K96P93Q06L92p3l56m53m04k48
$$ 160004 158534 157491 157240 157860 158936 159805 160043 159766 159529 159825 160618 161424 161816 161743 161387 160934 160530 160282
54138A60282n0J82M77O55M26q5k44L34J184J486J038L69Q6L98J144J929K343K303
$$ 160282 160232 160414 160891 161546 161972 161887 161643 161977 163161 164647 165685 166054 166140 166538 167682 169611 171954 174257
54120A74257K088J925J800J799K182K849L085K340R90j25o85r72j236j486j731
$$ 174257 176345 178270 180070 181869 184051 186900 189985 192325 193315 193190 192505 191533 190297 188811 187080
54105A87080j974k039j840j660j736j729j182l87j34n71r30o35r3J1k62l01%O2
$$ 187080 185106 183067 181227 179567 177831 176102 174920 174533 174399 173828 172898 172263 172170 172181 171919 171618 171618 171680
54087A71680m55r91q30j70J42j07j02P08J605J583Q54M66O48O49L63Q36K559M288
$$ 171680 171225 170234 169404 169234 169376 169269 169167 169875 171480 173063 173917 174383 175031 175680 176043 176879 179438 183726
54069A83726M484L329K274K071K178K010J703J510J236O11k38r14j140q44k13
$$ 183726 188210 191539 193813 195884 198062 200072 201775 203285 204521 205132 204894 203980 202840 201996 201783
54054B01783L43M84L00J95M06P77R57P68M15M01J019J941K539K671K791L190L677
$$ 201783 202126 202610 202910 203105 203511 204288 205245 206013 206428 206829 207848 209789 212328 214999 217790 220980 224657
54037B24657M138M797N618O032N783N457N622N922N686N020M575M572M797N167
$$ 224657 228795 233592 239210 245242 251025 256482 262104 268026 273712 278732 283307 287879 292676 297843
54023B97843N524N142L495J407M13Q62J515J260L02n64j018j088p35j80j50j131
$$ 297843 303367 308509 312004 313411 313824 314686 316201 317461 317763 317199 316181 315093 314358 314178 314028 312897
54007C12897k729m230n471o572p134o486m805l311l000l538l776l186k327j861
$$ 312897 310168 305938 300467 293895 286761 280275 275470 272159 269159 265621 261845 258659 256332 254471
53993B54471j648j151m34j56o09j282j581j467j127n23L52J176J735K362L421
$$ 254471 252823 251672 251238 251082 250473 249191 247610 246143 245016 244493 244845 246021 247756 250118 253539
53978B53539M591N166M855L787J924p88l712n692o117n453m585m033l858l851
$$ 253539 258130 263296 268151 271938 273862 273074 269362 263670 257553 252100 247515 243482 239624 235773
53964B35773l603k770j523m28J98N91J053J518J689J457J024P77J012J577J927
$$ 235773 232170 229400 227877 227449 227647 228238 229291 230809 232498 233955 234979 235756 236768 238345 240272
53949B40272J746J428J586K217K804L140L483L865L948L740L849M587N357N402
$$ 240272 242018 243446 245032 247249 250053 253193 256676 260541 264489 268229 272078 276665 282022 287424
53935B87424M805M236L899L340K302J218O84P40R30Q87O60N21O83J272K347L731
$$ 287424 292229 296465 300364 303704 306006 307224 307908 308648 309578 310465 311125 311646 312329 313601 315948 319679
53919C19679M844N130M799M832N864P278P871P346O648O708P411Q064Q379Q472
$$ 319679 324523 329653 334452 339284 345148 352426 360297 367643 374291 380999 388410 396474 404853 413325
53905D13325Q196P145N362L517K163J164R1j077k022k692l379m152m615m471m115
$$ 413325 421521 428666 434028 437545 439708 440872 440963 439886 437864 435172 431793 427641 423026 418555 414440
53890D14440m325n390o782p722p890p593p364p414p394o787n676m863m944n427
$$ 414440 410115 404725 397943 390221 382331 374738 367374 359960 352566 345779 340103 335240 330296 324869
53876C24869n264m245l341l508m532n398n416m686l718l003k813l014l133k805
$$ 324869 319605 315360 312019 308511 303979 298581 293165 288479 284761 281758 278945 275931 272798 269993
53862B69993k198j833k013k553l014l112k899k625k359j892j192p73j205k280
$$ 269993 267795 265962 263949 261396 258382 255270 252371 249746 247387 245495 244303 243530 242325 240045
53848B40045l063k927k085j075j97K95K6j018k186k736k418j361J60J477J668
$$ 240045 236982 234055 231970 230895 230698 230993 231019 230001 227815 225079 222661 221300 221460 222937 224605
53833B24605N96o26q35j96K75K35K49O34R68R15P20O90P47Q12J041J380J349P31
$$ 224605 225201 224575 223740 223544 223819 224054 224303 224937 225905 226820 227540 228230 228977 229789 230830 232210 233559 234290
53815B34290P2Q4O65J007O38J7J5R54K326L378L817L903M002M222M480M677M760
$$ 234290 234362 234446 235111 236118 236756 236773 236788 237742 240068 243446 247263 251166 255168 259390 263870 268547 273307
53798B73307M814N135N965P003P492P043O116N468N294N203M859M293L709L237
$$ 273307 278121 283256 289221 296224 303716 310759 316875 322343 327637 332840 337699 341992 345701 348938
53784C48938K879K443J605K41j349k668l437l696l676l674l941m514n214n783
$$ 348938 351817 354260 355865 356106 354757 352089 348652 344956 341280 337606 333665 329151 323937 318154
53770C18154n960n493m469l505l224l502l695l626l665l824l549k753k185k244
$$ 318154 312194 306701 302232 298727 295503 292001 288306 284680 281015 277191 273642 270889 268704 266460
53756B66460k224j545r56j558l044l968l596k521j509p15j82k15q39j467j479
$$ 266460 264236 262691 261735 260177 257133 253165 249569 247048 245539 244824 244642 244427 243588 242121 240642
53741B40642r28m19n13j223j948j976j266m67m4K31O28Q32N28J68L87J016J410
$$ 240642 239714 239295 238782 237559 235611 233635 232369 231902 231858 232089 232717 233549 234077 234245 234632 235648 237058
53724B37058J455J453J307P12P6K25J122J819J884J917K336K528J778M70k69J08
$$ 237058 238513 239966 241273 241985 242061 242286 243408 245227 247111 249028 251364 253892 255670 256140 255871 255979
53708B55979J064J662J544J148J100J440J721J863K339L324M231M661N154O187
$$ 255979 257043 258705 260249 261397 262497 263937 265658 267521 269860 273184 277415 282076 287230 293417
53694B93417P069O774N484M223L196J788J25p89o75m50o61o92n5N67L68l73q36
$$ 293417 300486 307260 312744 316967 320163 321951 322076 321287 320612 320162 319501 318809 318754 319321 319689 319316 318480
53677C18480q10n95l75k33l48o37o42j89K66L35J73j2l66q91j169j061j051j443
$$ 318480 317670 317075 316700 316467 316119 315482 314840 314651 314917 315252 315425 315413 315047 314156 312987 311926 310875 309432
53659C09432j780j589j127q03m67J47P66R93R80J003Q33K31l31j94M14O30J66
$$ 309432 307652 306063 304936 304133 303666 303813 304579 305572 306552 307555 308388 308619 308288 308094 308508 309138 309304
53642C09304l47k73L70J177J838K251K442K504K473K304K053J851J641J218P30
$$ 309304 308957 308684 309054 310231 312069 314320 316762 319266 321739 324043 326096 327947 329588 330806 331536
53627C31536O81J199J637J330N00m1J08N78P71N35K84N90J535K489K845K832L215
$$ 331536 332217 333416 335053 336383 336883 336842 336950 337528 338299 338834 339118 339708 341243 343732 346577 349409 352624
53610C52624M157M919M862M193L496L034K828K877L016K946K700K658K843K825
$$ 352624 356781 361700 366562 370755 374251 377285 380113 382990 386006 388952 391652 394310 397153 399978
53596C99978K500K321K386K093J183L90L57N57J10p96j247r89o64p67j171j606
$$ 399978 402478 404799 407185 409278 410461 410851 411208 411765 411875 411079 409832 408843 408179 407412 406241 404635
53580D04635j931k025j860j679j601j279m69L08K77n60j493k110k597l059l150
$$ 404635 402704 400679 398819 397140 395539 394260 393791 394099 394376 393816 392323 390213 387616 384557 381407
53565C81407k492j133M37J464J328K25p27n60M79J335J474J284J271J429J436
$$ 381407 378915 377782 378219 379683 381011 381236 380509 379949 380428 381763 383237 384521 385792 387221 388657
53550C88657J146O99M42O21J023J126Q41P25J137J642J701J514J597J903K148
$$ 388657 389803 390502 390944 391565 392588 393714 394555 395280 396417 398059 399760 401274 402871 404774 406922
53535D06922K574L544M570M750M158L914M700O078P393Q522R475J0061J0357J0829
$$ 406922 409496 413040 417610 422360 426518 430432 435132 441210 448603 457125 466600 476661 487018 497847
53521D97847J1579J2130J2350J2888J4158J5491J5996J5854J6011J6879J8067
$$ 497847 509426 521556 533906 546794 560952 576443 592439 608293 624304 641183 659250
53510F59250J9299K0809K2661K4303K5180K5440K5693K6270K6923K7207K6901
$$ 659250 678549 699358 722019 746322 771502 796942 822635 848905 875828 903035 929936
53499I29936K6126K5225K4541K4150K3832K3359K2819K2460K2245K1837K1125
$$ 929936 956062 981287 1005828 1029978 1053810 1077169 1099988 1122448 1144693 1166530 1187655
53488A187655K0501K0386K0719K1129K1408K1477K1106K0167J9052J8393J8347
$$ 1187655 1208156 1228542 1249261 1270390 1291798 1313275 1334381 1354548 1373600 1391993 1410340
53477A410340J8623J9122J9910K0505J9953J7941J5338J3164J1497R693P291M353
$$ 1410340 1428963 1448085 1467995 1488500 1508453 1526394 1541732 1554896 1566393 1576086 1583377 1587730
53465A587730J217j727m349o990r902j2406j3349j2738j2084j2535j3437j3618
$$ 1587730 1588947 1587220 1582871 1575881 1565979 1553573 1540224 1527486 1515402 1502867 1489430 1475812
53453A475812j3296j3712j5231j7084j8735k0331k1682k1927k0736j9028j8041
$$ 1475812 1462516 1448804 1433573 1416489 1397754 1377423 1355741 1333814 1313078 1294050 1276009
53442A276009j8146j8842j9479j9627j9112j8014j6477j4465j1905r095o611m808
$$ 1276009 1257863 1239021 1219542 1199915 1180803 1162789 1146312 1131847 1119942 1110847 1104236 1099428
53430A099428l587k682j881j072l02L05R18K044L805N529O603P448R006J1392
$$ 1099428 1095841 1093159 1091278 1090206 1089904 1090209 1091127 1093171 1096976 1102505 1109108 1116556 1125562 1136954
53416A136954J3786J5634J7164J8669K0004K1046K1993K3015K4058K5229K6776
$$ 1136954 1150740 1166374 1183538 1202207 1222211 1243257 1265250 1288265 1312323 1337552 1364328
53405A364328K8589L0182L1438L2804L4551L6400L8144M0038M2201M4219M5812
$$ 1364328 1392917 1423099 1454537 1487341 1521892 1558292 1596436 1636474 1678675 1722894 1768706
53394A768706M7444M9686N2311N4545N6060N7176N8212N9103N9680N9920N9833
$$ 1768706 1816150 1865836 1918147 1972692 2028752 2085928 2144140 2203243 2262923 2322843 2382676
53383B382676N9346N8417N7054N5233N2923N0220M7335M4424M1542L8745L6023
$$ 2382676 2442022 2500439 2557493 2612726 2665649 2715869 2763204 2807628 2849170 2887915 2923938
53372B923938L3091K9384K4613J9310J4516J0550O363O10o733j4332k1132k7382
$$ 2923938 2957029 2986413 3011026 3030336 3044852 3055402 3061765 3062375 3055642 3041310 3020178 2992796
53360B992796l3686l9819m5068m9211n2386n4405n5057n4902n4779n4562n3314
$$ 2992796 2959110 2919291 2874223 2825012 2772626 2718221 2663164 2608262 2553483 2498921 2445607
53349B445607n0809m7991m5642m3540m1395l9799l9532m0400m1556m2571m3503
$$ 2445607 2394798 2346807 2301165 2257625 2216230 2176431 2136899 2096499 2054943 2012372 1968869
53338A968869m4118m3812m2359m0195l7826l5419l3033l0870k9035k7355k5593
$$ 1968869 1924751 1880939 1838580 1798385 1760559 1725140 1692107 1661237 1632202 1604847 1579254
53327A579254k3673k1552j9159j6767j5229j5344j6903j8734j9912k0564k1173
$$ 1579254 1555581 1534029 1514870 1498103 1482874 1467530 1450627 1431893 1411981 1391417 1370244
53316A370244k1477k0683j8672j6305j4417j3039j1810j0603r362p823n799l535
$$ 1370244 1348767 1328084 1309412 1293107 1278690 1265651 1253841 1243238 1233876 1226053 1220254 1216719
53304A216719j419L13J407J674J577K206M088O515Q623J0597J3096J5927J8277
$$ 1216719 1215300 1215613 1217020 1218694 1220271 1222477 1226565 1233080 1241703 1252300 1265396 1281323 1299600
53291A299600J9996K1642K3370K4747K5688K6606K7467K7567K6702K5641K5060
$$ 1299600 1319596 1341238 1364608 1389355 1415043 1441649 1469116 1496683 1523385 1549026 1574086
53280A574086K4621K3560K1734J9610J7574J5588J3287J0269O550K804k45k660
$$ 1574086 1598707 1622267 1644001 1663611 1681185 1696773 1710060 1720329 1726879 1729683 1729438 1726778
53268A726778n074p690j0113j2179j4232j6455j8572k0488k2491k4548k6096k6893
$$ 1726778 1721704 1714014 1703901 1691722 1677490 1661035 1642463 1621975 1599484 1574936 1548840 1521947
53256A521947k7450k8195k8884k9218k9378k9433k8901k7595k6343k6038k6334
$$ 1521947 1494497 1466302 1437418 1408200 1378822 1349389 1320488 1292893 1266550 1240512 1214178
53245A214178k6167k5281k4429k4153k4211k4304k4560k5023k5235k4759k3787
$$ 1214178 1188011 1162730 1138301 1114148 1089937 1065633 1041073 1016050 990815 966056 942269
53234I42269k2885k2281k1783k1228k0673j9993j8641j6137j2854r929q239p755
$$ 942269 919384 897103 875320 854092 833419 813426 794785 778648 765794 755865 747626 739871
53222G39871q005q843j0214j1577j2272j2451j2960j4188j5583j6463j6694j6462
$$ 739871 731866 723023 712809 701232 688960 676509 663549 649361 633778 617315 600621 584159
53210E84159j5960j5558j5634j5862j5255j3385j1088r483q773q458q289q299
$$ 584159 568199 552641 537007 521145 505890 492505 481417 471934 463161 454703 446414 438115
53198D38115q306q059p751p776q083q307q459q847r326r202q117o562n345m799
$$ 438115 429809 421750 413999 406223 398140 389833 381374 372527 363201 353999 345882 339320 333975 329176
53184C29176m701m672m445l906l170k589k482k794l100l040k727k534k513k299
$$ 329176 324475 319803 315358 311452 308282 305693 303211 300417 297317 294277 291550 289016 286503 284204
53170B84204j746j308j451j912k036j624r97l89J07P9q01j939k185j406p76j060
$$ 284204 282458 281150 279699 277787 275751 274127 273130 272741 272848 272927 272126 270187 268002 266596 265820 264760
53154B64760j463r44J18N51J51k63l33n66j154j426q98j09J24j80l14J10P09Q63
$$ 264760 263297 262353 262471 263022 263173 262910 262577 262011 260857 259431 258533 258424 258548 258368 258054 258164 258873 259736
53136B59736L88k68m21K11J218J898K004J909K036K285K263J880J507J450J558
$$ 259736 260124 259856 259435 259646 260864 262762 264766 266675 268711 270996 273259 275139 276646 278096 279654
53121B79654J555J567K040K969L633L424K685K317K612K913K499J453M70J05L27
$$ 279654 281209 282776 284816 287785 291418 294842 297527 299844 302456 305369 307868 309321 309791 309896 310223
53106C10223O11K67j018k799m179m614m318l840l503l324l208l014k691k380k265
$$ 310223 310834 311101 310083 307284 303105 298491 294173 290333 286830 283506 280298 277284 274593 272213 269948
53091B69948k201j809j024l00r1l91q63j183j184r56r18j405k066k083j245l40
$$ 269948 267747 265938 264914 264614 264523 264132 263269 262086 260902 259946 259028 257623 255557 253474 252229 251889
53075B51889j74n78q06n84k48m4J43L42L04j42p94j335j577j422q37m6M13J61
$$ 251889 251715 251137 250331 249747 249499 249455 249598 249940 250244 250102 249308 247973 246396 244974 244137 244091 244504 244665
53057B44665n22q88m97M00J247J695J593Q60k18q32m42L94O97N18Q23J752K110
$$ 244665 244143 243255 242758 243158 244405 246100 247693 248553 248335 247503 247061 247455 248152 248670 249493 251245 253355
53040B53355J202L8j69J92N0m41l23L25N21J84J84N96M84l16p58l01L49P16J280
$$ 253355 254557 254595 254426 254618 254668 254227 253904 254229 254750 254934 255118 255714 256198 255882 255124 254823 255172 255888 257168
53021B57168K067K053Q89j04K00J037J124O17M38N18J98k53l5O26P05O9l62j13
$$ 257168 259235 261288 262177 262073 262273 263310 264434 265051 265489 266007 266205 265952 265917 266543 267248 267317 266955 266842
53003B66842K62K30J9J67R10K052K907K675J422M04O91J771K293J884J369J416
$$ 266842 267104 267334 267353 267520 268430 270482 273389 276064 277486 277890 278581 280352 282645 284529 285898 287314
52987B87314J795J963J628Q24m0l21M5K41l86j281j441p96q6K84M12L03N7K58
$$ 287314 289109 291072 292700 293524 293484 293163 293208 293449 293063 291782 290341 289545 289459 289743 290155 290458 290515 290773
52969B90773J204K079J979J371J342J694J296J78l09L88J282J532J392R89j97
$$ 290773 291977 294056 296035 297406 298748 300442 301738 301916 301607 301995 303277 304809 306201 307190 306993
52954C06993j882k513j440k72p18k075k302j036J28J05m83p52q85j383j951j879
$$ 306993 305111 302598 301158 300886 300168 298093 295791 294755 294883 294988 294505 293753 292868 291485 289534 287655
52938B87655j075j16N21P78P13L55o4j61R0J39n11j545k040j495l46N97R52Q67
$$ 287655 286580 286464 286985 287763 288476 288831 288767 288606 288696 288835 288324 286779 284739 283244 282898 283495 284447 285314
52920B85314P04P47R61Q60Pj197j728j209l96n2O0M01N74p6j142j468p31J68L16
$$ 285314 286018 286765 287726 288586 288593 287396 285668 284459 284063 284011 284071 284472 285046 284970 283828 282360 281629 281797 282113
52901B82113l25j198j659j192J25J357J565R58N08N43N24J85q2j42m04q57p29
$$ 282113 281788 280590 278931 277739 277864 279221 280786 281744 282252 282795 283319 283504 283422 283280 282876 282019 281290
52884B81290L19J418J565R64O11Q90J235J042M59J58N77J454K122K244K082J933
$$ 281290 281609 283027 284592 285556 286167 287057 288292 289334 289793 289951 290528 291982 294104 296348 298430 300363
52868C00363J649J033L51k1k41o69j127j143q02o72r23j164j127r08o52n76j048
$$ 300363 302012 303045 303396 303375 303134 302465 301338 300195 299393 298721 297798 296634 295507 294599 293947 293371 292323
52851B92323k004k561k163j725k515m063m561l423k038j680k020k264k387k493
$$ 292323 290319 287758 285595 283870 281355 277292 272731 269308 267270 265590 263570 261306 258919 256426
52837B56426k092r34K37O56N16L86L17K24L45O51O05J53J45R78J709J405N97L57
$$ 256426 254334 253400 253637 254293 254809 255195 255512 255736 256081 256732 257337 257490 257635 258613 260322 261727 262324 262681
52819B62681O18N45M6k62k88m93r15j135j099j079r23k28Q11J509J581J245O43
$$ 262681 263299 263844 263890 263628 263340 262847 261932 260797 259698 258619 257696 257468 258279 259788 261369 262614 263257
52802B63257j95r51j324j544j903k069j680j306j755k598k505j158K35O24L38
$$ 263257 263062 262111 260787 259243 257340 255271 253591 252285 250530 247932 245427 244269 244504 245128 245466
52787B45466J90K57J38j45j79J98P56J151J124O39P7N0P38J578J767J076O7m49
$$ 245466 245656 245913 246051 245906 245727 245925 246681 247832 248956 249595 249672 249722 250460 252038 253805 254881 254948 254499
52769B54499k36J48L8m16m57J15N45L04l2K90R29R78M73L17Q03J246J199J058
$$ 254499 254263 254411 254449 254033 253576 253691 254236 254540 254508 254798 255727 256705 257178 257495 258298 259544 260743 261801
52751B61801J093Q35l2q90r41k47N67J258J972K587K657K028J130O32R37J823
$$ 261801 262894 263729 263697 262807 261866 261619 262186 263444 265416 268003 270660 272688 273818 274450 275387 277210
52735B77210K491K242J307O31O67Q01L91j44N8R49J580J426R65P18M84j01p58
$$ 277210 279701 281943 283250 283881 284548 285349 285740 285596 285654 286603 288183 289609 290574 291292 291776 291675 290917
52718B90917q97n23k77n82j118j267q38k80k39q56j463j207o6R79J011J90o32
$$ 290917 290020 289497 289220 288638 287520 286253 285415 285135 284896 284040 282577 281370 281304 282283 283294 283484 282852
52701B82852j002j036p36O8R59J005Mr21o76M01J038O44k60j007j416j511j262
$$ 282852 281850 280814 280078 280146 281105 282110 282114 281193 280517 280918 281956 282600 282340 281333 279917 278406 277144
52684B77144p64k37K32O24P34M29Kj65k36o09j054r40l32j08o86j391j421q94
$$ 277144 276380 276143 276375 276999 277733 278162 278164 277999 277763 277154 276100 275160 274828 274720 274034 272643 271222 270328
52666B70328m64l66l56k80j82p8Q8K84M98Q17J294J875K544L272L881M117L923
$$ 270328 269864 269498 269142 268862 268680 268602 268690 268974 269472 270289 271583 273458 276002 279274 283155 287272 291195
52649B91195L378K469J330M96L46L86k35j465k405k681k810l001k612j346j15
$$ 291195 294573 297042 298372 298868 299214 299600 299365 297900 295495 292814 290004 287003 284391 283045 282930
52634B82930Q2n00q30m66K35Q35J112J005Q31J249K411L463L399K136L32j417
$$ 282930 283012 282512 281682 281216 281451 282286 283398 284403 285234 286483 288894 292357 295756 297892 298224 296807
52618B96807k681l014k375j426q19m88p1L17M34N24R07J271J116N96K33P2j36
$$ 296807 294126 291112 288737 287311 286492 286004 285933 286250 286684 287208 288115 289386 290502 291098 291331 291403 291267
52601B91267j99K68J026J427J312J011O38J28k56k47k34p41j386j381r34j066
$$ 291267 291068 291336 292362 293789 295101 296112 296750 296878 296622 296375 296141 295400 294014 292633 291699 290633
52585B90633j837j947n16J602K932L045K578K145J862J616J248O40j04p13j126
$$ 290633 288796 286849 286333 287935 290867 293912 296490 298635 300497 302113 303361 304001 303897 303184 302058
52570C02058j527j891j859j316p22n74q51j189j379j462j525j590j580j347q66
$$ 302058 300531 298640 296781 295465 294743 294169 293318 292129 290750 289288 287763 286173 284593 283246 282380
52555B82380l85j34N8N04R94Q77m8j126j541j149l69M21J068J399J236O72J47
$$ 282380 281995 281861 281919 282423 283417 284294 284246 283120 281579 280430 280061 280482 281550 282949 284185 284857 285004
52538B85004OR6k3m60q10p61n89o62o34K43J839K946K653J444M60J44J61K29M36
$$ 285004 285010 285106 285083 284623 283813 283052 282463 281801 281167 281410 283249 286195 288848 290292 290752 290896 291057 291286 291722
52519B91722Q76J466K001K158J707J047R80J615K103J955J924K705L487K912J093
$$ 291722 292598 294064 296065 298223 299930 300977 301957 303572 305675 307630 309554 312259 315746 318658 319751
52504C19751n13j054j003j005j223j861l132m412m547l448k338k079k194k038
$$ 319751 319238 318184 317181 316176 314953 313092 309960 305548 301001 297553 295215 293136 290942 288904
52490B88904j884k123k263j641n76K7q2l65l69p4M70J265K061K392J949Q64l45
$$ 288904 287020 284897 282634 280993 280417 280444 280362 279997 279628 279554 280024 281289 283350 285742 287691 288555 288210
52473B88210j054r22q5J098K425L656M295M059L450L229L352L185K729K713L220
$$ 288210 287156 286234 286149 287247 289672 293328 297623 301682 305132 308361 311713 314898 317627 320340 323560
52458C23560L201J920L3j425k388l335m091m047l374k991l262l486k966k010j482
$$ 323560 326761 328681 328714 327289 324901 321566 317475 313428 310054 307063 303801 300315 297349 295339 293857
52443B93857j618j710j006L08J242J123L41k78n50r69j758k367k169j170N5Q87
$$ 293857 292239 290529 289523 289831 291073 292196 292537 292259 291709 290740 288982 286615 284446 283276 283331 284218
52427B84218R84M61r8j07M15R51J253J539J933K191K178K097K032J714J100P14
$$ 284218 285202 285663 285565 285458 285873 286824 288077 289616 291549 293740 295918 298015 300047 301761 302861 303575
52411C03575J048J856K449K451K080J861K233L228M396N266N907O708P560P726
$$ 303575 304623 306479 308928 311379 313459 315320 317553 320781 325177 330443 336350 343058 350618 358344
52397C58344O664M533J808j092l563m871m860m263l939m105m473m725m563l796
$$ 358344 365008 369541 371349 370257 366694 361823 356963 352700 348761 344656 340183 335458 330895 327099
52383C27099k672j721j040k51O35R39M51P1O97J924K654K686K850L677M724N331
$$ 327099 324427 322706 321666 321415 322050 322989 323440 323511 324208 326132 328786 331472 334322 337999 342723 348054
52367C48054N392N202M896M363L475K326J203M10k9k87l96j98K55N66M01q8m14
$$ 348054 353446 358648 363544 367907 371382 373708 374911 375321 375292 375005 374609 374411 374666 375232 375633 375545 375131
52350C75131j38Q38K047K625K179J500J715K691L052K143J064J175K381L611M430
$$ 375131 374993 375831 377878 380503 382682 384182 385897 388588 391640 393783 394847 396022 398403 402014 406444
52335D06444N156N824O055N920O072O884Q082R289J0398J1390J2266J3128J4026
$$ 406444 411600 417424 423479 429399 435471 442355 450437 459726 470124 481514 493780 506908 520934
52322E20934J4730J5132J5618J6561J7601J8032J7833J7712J8140J8931J9817
$$ 520934 535664 550796 566414 582975 600576 618608 636441 654153 672293 691224 711041
52311G11041K0742K1582K2139K2606K3370K4191K4302K3630K3198K3788K4790
$$ 711041 731783 753365 775504 798110 821480 845671 869973 893603 916801 940589 965379
52300I65379K5036K4396K3713K3391K2885K1551J9326J6333J2582Q475M985K738
$$ 965379 990415 1014811 1038524 1061915 1084800 1106351 1125677 1142010 1154592 1163067 1168052 1170790
52288A170790J159p83l169n037n719n608n557o011o948q099q920q799p726o364
$$ 1170790 1171949 1171166 1167997 1162960 1157241 1151633 1146076 1140065 1133117 1125018 1116098 1107299 1099573 1093209
52274A093209n187l961k462j087j98O66K156M098N871P443R167J0776J1663J2092
$$ 1093209 1088022 1084061 1081599 1080512 1080314 1080980 1083136 1087234 1093105 1100548 1109715 1120491 1132154 1144246
52260A144246J3074J4863J6557J7493J8103J8973J9865K0226K0037J9700J9486
$$ 1144246 1157320 1172183 1188740 1206233 1224336 1243309 1263174 1283400 1303437 1323137 1342623
52249A342623J9443J9379J8715J6870J3985J0755P474L996O46j738k983l902n118
$$ 1342623 1362066 1381445 1400160 1417030 1431015 1441770 1449244 1453240 1453886 1452148 1449165 1445263 1440145
52236A440145o479p865r582j1400j2366j2208j1933j2300j2756j2665j2519j2806
$$ 1440145 1433666 1425801 1416219 1404819 1392453 1380245 1368312 1356012 1343256 1330591 1318072 1305266
52224A305266j2759j1496r658q591q427q253p676o875n629l678j826j281j843
$$ 1305266 1292507 1281011 1271353 1262762 1254335 1246082 1238406 1231531 1225902 1222224 1220398 1219117 1217274
52211A217274k029j008P01K425M010N249N771N811O085O720P154P193P204P176
$$ 1217274 1215245 1214237 1214938 1217363 1221373 1226622 1232393 1238204 1244289 1251009 1258163 1265356 1272560 1279736
52197A279736O661N809N533O296P549Q675R586J0204J0128R215P771N934L656
$$ 1279736 1286397 1292206 1297739 1304035 1311584 1320259 1329845 1340049 1350177 1359392 1367163 1373097 1376753
52184A376753J446J63k98j247l598o641q975j0027j0218j0117r950r652r036q114
$$ 1376753 1378199 1378362 1378064 1376817 1373219 1366578 1357603 1347576 1337358 1327241 1317291 1307639 1298603 1290489
52170A290489p304o987o833o136m784l340k196j315q25r76j373j067K32J658K254
$$ 1290489 1283185 1276198 1269365 1263229 1258445 1255105 1252909 1251594 1250769 1249793 1248420 1247353 1247585 1249243 1251497
52155A251497J857Q30m54j529k032k201k541k821k251q93P5l6m70k43N55J290
$$ 1251497 1253354 1254184 1253730 1252201 1250169 1247968 1245427 1242606 1240355 1239462 1239537 1239501 1239031 1238788 1239343 1240633
52139A240633J779J992J478N7j480k137j870j240l70R94K795M726O780R056J1272
$$ 1240633 1242412 1244404 1245882 1245939 1244459 1242322 1240452 1239212 1238842 1239836 1242631 1247357 1254137 1263193 1274465
52124A274465J3136J4875J6765J8468J9512K0203K1272K2776K4117K5038K5799
$$ 1274465 1287601 1302476 1319241 1337709 1357221 1377424 1398696 1421472 1445589 1470627 1496426
52113A496426K6395K6309K5320K3986K3046K2696K2586K2298K1766K1365K1474
$$ 1496426 1522821 1549130 1574450 1598436 1621482 1644178 1666764 1689062 1710828 1732193 1753667
52102A753667K1819K1469J9831J7396J5170J3556J2135J0296P694M295N02k999
$$ 1753667 1775486 1796955 1816786 1834182 1849352 1862908 1875043 1885339 1893033 1897328 1897830 1894831
52090A894831n902q656j1687j4569j6560j7713j8727j9751k0118j9393j7997j6520
$$ 1894831 1888929 1880273 1868586 1854017 1837457 1819744 1801017 1781266 1761148 1741755 1723758 1707238
52078A707238j5049j3445j1872j0585r551q505p228n618l686j617M34K676N508
$$ 1707238 1692189 1678744 1666872 1656287 1646736 1638231 1631003 1625385 1621699 1620082 1620516 1623192 1628700
52065A628700Q919J2351J5243J7398J8757J9271J9258J9436K0185K1041K1274
$$ 1628700 1637619 1649970 1665213 1682611 1701368 1720639 1739897 1759333 1779518 1800559 1821833
52054A821833K0726J9738J8430J6599J4241J1700R178O451L213n73m699q815j2310
$$ 1821833 1842559 1862297 1880727 1897326 1911567 1923267 1932445 1938896 1942109 1941536 1936837 1928022 1915712
52041A915712j4538j5521j6179j7494j9476k1279k2279k2582k2499k2028k1163
$$ 1915712 1901174 1885653 1869474 1851980 1832504 1811225 1788946 1766364 1743865 1721837 1700674
52030A700674k0328k0015k0154k0211j9852j9180j8371j7449j6417j5328j4185
$$ 1700674 1680346 1660331 1640177 1619966 1600114 1580934 1562563 1545114 1528697 1513369 1499184
52019A499184j3084j2441j2626j3293j3468j2658j1480j0849j0814j0647j0011
$$ 1499184 1486100 1473659 1461033 1447740 1434272 1421614 1410134 1399285 1388471 1377824 1367813
52008A367813r489r858j1238j3188j5331j7610k0016k2350k4273k5428k5595k4942
$$ 1367813 1358324 1348466 1337228 1324040 1308709 1291099 1271083 1248733 1224460 1199032 1173437 1148495
51996A148495k4110k3771k3891k3734k2735k1289k0403k0640k1653k2654k3057
$$ 1148495 1124385 1100614 1076723 1052989 1030254 1008965 988562 967922 946269 923615 900558
51985I00558k2727k1973k1377k1249k1186k0457j8946j7381j6479j6226j6166
$$ 900558 877831 855858 834481 813232 792046 771589 752643 735262 718783 702557 686391
51974F86391j5974j5423j4172j2101r672p509n741m053k221k48J837L864N376
$$ 686391 670417 654994 640822 628721 619049 611540 605799 601746 599525 599277 601114 604978 610354
51961F10354N970N779N298M788M208L531K774J769M30p82j062pK074M567P045
$$ 610354 616324 622103 627401 632189 636397 639928 642702 644471 644901 644119 643057 643050 645124 649691 656736
51946F56736R263J1018J1991J1774J0279Q150O380N259M119K486Q78k2m21r03
$$ 656736 665999 677017 689008 700782 711061 719211 725591 730850 734969 737455 738333 738311 737890 736987
51932G36987j395j595k011l446n596p320q326r443j1110j2725j3891j5062j6481
$$ 736987 735592 733997 731986 728540 722944 715624 707298 697855 686745 674020 660129 645067 628586
51919F28586j7445j7376j6762j6259j5581j4084j1918r757p853o077m562l535
$$ 628586 611141 593765 577003 560744 545163 531079 519161 509404 501551 495474 490912 487377
51907D87377k744j727n27N14J403K376L170L181K375J431Q19J54j257l472n803
$$ 487377 484633 482906 482379 482893 484296 486672 489842 493023 495398 496829 497648 497802 496545 493073 487270
51892D87270p536q539r109r392r197q437p426o471n378l781j792O6J519K726L871
$$ 487270 479734 471195 462086 452694 443497 435060 427634 421163 415785 412004 410212 410278 411797 414523 418394
51877D18394M981O105P170P821P860P704P833P871P009N223L284J555k49j993
$$ 418394 423375 429480 436650 444471 452331 460035 467868 475739 482748 487971 491255 492810 492561 490568
51863D90568k849k501j691j110n89J45P79J050J299J740J902J402N76k74j470
$$ 490568 487719 485218 483527 482417 481828 481973 482752 483802 485101 486841 488743 490145 490721 490447 488977
51848D88977l116m457m896n035n786o974p746p868p736p460o815n835m733l547
$$ 488977 485861 481404 476508 471473 465687 458713 450967 443099 435363 427903 421088 415253 410520 406973
51834D06973k384j592j026K05K358M089L988K564J638J918K373J898M99j089k084
$$ 406973 404589 402997 401971 402176 404534 408623 412611 415175 416813 418731 421104 423002 423501 422412 420328
51819D20328j859m68J024J466Q93K17j11l08m15k75k10o62j171p91L60J046O64
$$ 420328 418469 418001 419025 420491 421384 421601 421490 421182 420767 420492 420282 419620 418449 417658 418018 419064 419728
51802D19728l3j81J05L58N89J018J598K210K764K901K156O47r43k201l160l608
$$ 419728 419695 419514 419619 419977 420566 421584 423182 425392 428156 431057 433213 433860 432917 430716 427556 423948
51786D23948l071j704n08k88r44j877k545k516j747r63r52j346r71M21J784K387
$$ 423948 420877 419173 418665 418377 417433 415556 413011 410495 408748 407785 406833 405487 404516 404937 406721 409108
51770D09108K821L805N052N985O722P525P975P540O435N110L445J213j103k796
$$ 409108 411929 415734 420786 426771 433493 441018 448993 456533 462968 468078 471523 472736 471633 468837
51756D68837l903m841n424n156m374m165m982o110o656o548o207n732m834l442
$$ 468837 464934 460093 454669 449513 445139 440974 435992 429882 423226 416678 410471 404739 399905 396463
51742C96463j984r75l98K93J473K826L774M253M728N536O585P668Q476Q399O939
$$ 396463 394479 393504 393106 393399 394872 397698 401472 405725 410453 415989 422574 430242 438718 447117 454056
51727D54056M636K882K477K861L106L158L608M600N466N283L521M97k624m600
$$ 454056 458692 461574 464051 466912 470018 473176 476784 481384 486850 492133 495654 496151 493527 488927
51713D88927n146m892m321l370k296k044l070m485n142n029m787m294k822m89
$$ 488927 483781 478889 474568 471198 468902 466858 463788 459303 454161 449132 444345 440051 437229 436740
51699D36740J469K097J596O01o84k242l666m373m201l467k495j399k84N02M59
$$ 436740 438209 440306 441902 442503 441819 439577 435911 431538 427337 423870 421375 419976 419692 420194 420653
51684D20653n98k205l516l967l599k796j937j323j027p30K0J105J787J597R59
$$ 420653 420055 417850 414334 410367 406768 403972 402035 400712 399685 398955 398975 400080 401867 403464 404423
51669D04423O78J117K204L916O286R066J1789J4125J5837J6574J5972J3831J0081
$$ 404423 405101 406218 408422 412338 418624 427690 439479 453604 469441 486015 501987 515818 525899
51656E25899M911q01n623q617r991j0328r563p334m069r49J155K096J903M94j901
$$ 525899 530810 530009 524386 515769 505778 495450 485887 478553 474484 473535 474690 476786 478689 479183 477282
51641D77282m588o912q546r282r067q310p697p432p091o361n493m808m210l497
$$ 477282 472694 465782 457236 447954 438887 430577 422880 415448 408357 401996 396503 391695 387485 383988
51627C83988k797k359k115j728r89L9J059J577J130j80j530k037j616j027j031
$$ 383988 381191 378832 376717 374989 374000 374039 375098 376675 377805 377625 376095 374058 372442 371415 370384
51612C70384j611k044j736r11m51q82j692j904j222k83L30Q62J892L318M353M528
$$ 370384 368773 366729 364993 364082 363631 362749 361057 359153 357931 357648 357978 358840 360732 364050 368403 372931
51596C72931M269M357N061O085P164Q325R486J0057R315P057L862O56j855l417
$$ 372931 377200 381557 386618 392703 399867 408192 417678 427735 437050 444107 447969 448625 446770 443353
51582D43353m198m553m688m433l466j806J08J883L555N400P487R490J0913J1427
$$ 443353 439155 434602 429914 425481 422015 420209 420317 422200 425755 431155 438642 448132 459045 470472
51568D70472J1204J1008J1646J3158J4619J4992J4118J2813J2229J3156J5642
$$ 470472 481676 492684 504330 517488 532107 547099 561217 574030 586259 599415 615057
51557F15057J8921K1862K3737K4585K4679K3843K1559J7580J2184N966l79o218
$$ 615057 633978 655840 679577 704162 728841 752684 774243 791823 804007 809973 809594 803376
51545H03376j1279j5741j9765k3070k5242k6252k6274k5310k3464k1471k0113
$$ 803376 792097 776356 756591 733521 708279 682027 655753 630443 606979 585508 565395
51534E65395j9137j7496j4910j2421j1022j0395r607q462p451o703n857m888m253
$$ 565395 546258 528762 513852 501431 490409 480014 470407 461945 454494 447791 441934 437046 432793
51521D32793m128m083l723l203k884k796k709k431j896j197o76o82j107j471j545
$$ 432793 428665 424582 420859 417656 414772 411976 409267 406836 404940 403743 403067 402385 401278 399807 398262
51506C98262j546j584j320o09oj68q35r97l2J629L087L790L813L563L342L065
$$ 398262 396716 395132 393812 393203 393197 393029 392194 391197 391165 392794 395881 399671 403484 407047 410389 413454
51490D13454K399J308K85k08l03m23n62m41k70p04j890l142l796l952l999l965
$$ 413454 415853 417161 417446 417238 416935 416512 415950 415509 415239 414535 412645 409503 405707 401755 397756 393791
51474C93791l671l221k804k424k132k244k837l352l261k866k859l233l283k668
$$ 393791 390120 386899 384095 381671 379539 377295 374458 371106 367845 364979 362120 358887 355604 352936
51460C52936j822j257r36n75j04L72Q24J314J894K565L182L450L307L179L551
$$ 352936 351114 349857 348921 348346 348242 348614 349438 350752 352646 355211 358393 361843 365150 368329 371880
51445C71880M322M973N362N942P077Q498R545R731Q995P625O010M262K199j65
$$ 371880 376202 381175 386537 392479 399556 408054 417599 427330 436325 443950 449960 454222 456421 456256
51431D56256k279l567m126m555n140n704o107o389o482o294o041n941n661m713
$$ 456256 453977 450410 446284 441729 436589 430885 424778 418389 411907 405613 399572 393631 387970 383257
51417C83257l432k751k881k914k079o69N88J460K025K186J974J840K135K564K600
$$ 383257 379825 377074 374193 371279 369200 368531 369119 370579 372604 374790 376764 378604 380739 383303 385903
51402C85903K153J488R05Q11J626L094M117L916L087K929L884N157N726N348M684
$$ 385903 388056 389544 390449 391260 392886 395980 400097 404013 407100 410029 413913 419070 424796 430144 434828
51387D34828M823O449R163J1719J3380J4645J6407J8735K1119K3520K6325K9404
$$ 434828 439651 446100 455263 466982 480362 495007 511414 530149 551268 574788 601113 630517
51375F30517L1922L3325L3901L4108L3674L1586K6817J9081R178j351j1087j9362
$$ 630517 662439 695764 729665 763773 797447 829033 855850 874931 884109 882758 871671 852309
51363H52309k6082l1208l4673l6511l6770l5503l3127l0544k8436k6585k4300
$$ 852309 826227 795019 760346 723835 687065 651562 618435 587891 559455 532870 508570
51352E08570k1376j8281j5477j2987j0635q377o389m985m350m207l987l542l352
$$ 508570 487194 468913 453436 440449 429814 421437 415048 410063 405713 401506 397519 393977 390625
51339C90625l757m371m639m620m697m837m663m011k944j549k65l9j297l038l664
$$ 390625 386868 382497 377858 373238 368541 363704 359041 355030 352086 350537 350272 350233 348936 345898 342234
51324C42234k726j157Q7P80R98Q37O66Q37J079Q62M39N78J195J328P85O88J796
$$ 342234 339508 338351 338438 339218 340216 341053 341719 342556 343635 344497 344936 345514 346709 348037 348822 349510 351306
51307C51306L216L581K809J819J079L06o35j403j682j471r70n89q18j629k223
$$ 351306 354522 358103 360912 362731 363810 364116 363481 362078 360396 358925 357955 357366 356548 354919 352696
51292C52696j923j051m01q0M68J365J984J849J292R91J262J990K896L613L867
$$ 352696 350773 349722 349321 349241 349709 351074 353058 354907 356199 357190 358452 360442 363338 366951 370818
51277C70818L790L840M215M466L974K698J256K53k68o19q85p85j79O09J198J733
$$ 370818 374608 378448 382663 387129 391103 393801 395057 395310 395042 394423 393538 392753 392574 393183 394381 396114
51261C96114K558L421L479K326O11p26j414j722j725j346r53j143j864k366k307
$$ 396114 398672 402093 405572 407898 408509 407783 406369 404647 402922 401576 400623 399480 397616 395250 392943
51246C92943k253k719l207k968k293k233k996l492k847j674j211j648k112k029
$$ 392943 390690 387971 384764 381796 379503 377270 374274 370782 367935 366261 365050 363402 361290 359261
51232C59261j727j605j487j102n56LO63J301J378P02l0j1O34J181J393J623J967
$$ 359261 357534 355929 354442 353340 352784 352787 353450 354751 356129 356831 356801 356790 357424 358605 359998 361621 363588
51215C63588K081J833J528J391J381J610K252K955K981K239J537J491J731J655
$$ 363588 365669 367502 369030 370421 371802 373412 375664 378619 381600 383839 385376 386867 388598 390253
51201C90253J402J528K044K432K382K022J515R46N13M28N22L75j37o57q47q07
$$ 390253 391655 393183 395227 397659 400041 402063 403578 404524 405037 405465 405987 406362 406225 405568 404721 403914
51185D03914r60j533k223k395j762q44n34j072j786j989j781j614j488j081m71
$$ 403914 402954 401421 399198 396803 395041 394197 393663 392591 390805 388816 387035 385421 383933 382852 382381
51170C82381j05j23k37l14n48r00r87p20n17n57l04P14K040K793K844K863L192
$$ 382381 382276 382153 381916 381602 381054 380154 379167 378447 377930 377373 377069 377783 379823 382616 385460 388323 391515
51153C91515L367K918K135J700J870K342K628K337J365R5q24j207j623k572l579
$$ 391515 394882 397800 399935 401635 403505 405847 408475 410812 412177 412272 411448 410241 408618 406046 402467
51138D02467l698k728j459n92n8M44P64N61l8m91l67L28J261K041K459K655K858
$$ 402467 398769 396041 394582 393990 393932 394376 395140 395701 395663 395172 394805 395133 396394 398435 400894 403549 406407
51121D06407L001K805K260J639R79K8j101j703j293k58O20R58P56J04o56q64k68
$$ 406407 409408 412213 414473 416112 417091 417119 416018 414315 413022 412764 413384 414342 415098 415202 414546 413682 413414
51104D13414N00P38O95J127K078K849L067L066L145L119K756K145J528J168J312
$$ 413414 413914 414652 415347 416474 418552 421401 424468 427534 430679 433798 436554 438699 440227 441395 442707
51089D42707J803J889J060pj24P49J374R79K40J32O02R50R25P43M99J81M3L49
$$ 442707 444510 446399 447459 447452 447328 448077 449451 450430 450670 450802 451404 452354 453279 454022 454521 454702 454745 455094
51071D55094R60J563K185K999L833M287M342M450N067O330Q087J0027J1813J3341
$$ 455094 456054 457617 459802 462801 466634 470921 475263 479713 484780 491110 499197 509224 521037 534378
51057E34378J4756J6084J6947J6799J5349J2659R059N155J731n74j408p06J153
$$ 534378 549134 565218 582165 598964 614313 626972 636031 641186 642917 642343 640935 640229 641382
51044F41382L070L707K664R03l23q66j632l331n593p304p559o249m046j892n35
$$ 641382 644452 648159 650823 651726 651403 650537 648905 645574 639981 632677 625118 618869 614823 612931 612396
51029F12396l79j565l840o337p897p828o386m400k608j265j42J194K906M657N989
$$ 612396 612017 610452 606612 600275 592378 584550 578164 573764 571156 569891 569749 570943 573849 578506 584495
51014E84495O791P205P274P094P069P391P377O067L565J063o17j784k872l556
$$ 584495 591286 598491 605765 612859 619928 627319 634696 640763 644328 645391 644774 642990 640118 636562
51000F36562l341k435j431o25j36j56m87l21Q46K487L735M484N200O071P057Q418
$$ 636562 633221 630786 629355 628730 628594 628438 627951 627630 628476 630963 634698 639182 644382 650453 657510 665928
50984F65928J0391J2558J4293J5672J7190J8761J9912K0845K2410K4746K6813
$$ 665928 676319 688877 703170 718842 736032 754793 774705 795550 817960 842706 869519
50973H69519K7617K7324K6802K6696K7339K9121L2388L7062M2653M8516N4073
$$ 869519 897136 924460 951262 977958 1005297 1034418 1066806 1103868 1146521 1195037 1249110
50962A249110N9000O3433O7753P2094P6149P9472Q1740Q2707Q2184Q0142P6615
$$ 1249110 1308110 1371543 1439296 1511390 1587539 1667011 1748751 1831458 1913642 1993784 2070399
50951B070399P1517O4840N7122M9314M2037L5239K8715K2610J7269J2853R462
$$ 2070399 2141916 2206756 2263878 2313192 2355229 2390468 2419183 2441793 2459062 2471915 2481377
50940B481377P397O839P300P679P074N397L084M44k558n950r577j3278j7085k1096
$$ 2481377 2488774 2495613 2502913 2510592 2517666 2523063 2526147 2526591 2524033 2518083 2508506 2495228 2478143 2457047
50926B457047k5397l0314l6377m3707n1555n8893o5277p0722p4922p7241p7602
$$ 2457047 2431650 2401336 2364959 2321252 2269697 2210804 2145527 2074805 1999883 1922642 1845040
50915A845040p6680p4999p2395o8688o4245n9507n4452m9053m3871l9566l6036
$$ 1845040 1768360 1693361 1620966 1552278 1488033 1428526 1374074 1325021 1281150 1241584 1205548
50904A205548l2627k9012k5478k2453k0156j8561j7391j6199j4724j3002j1080
$$ 1205548 1172921 1143909 1118431 1095978 1075822 1057261 1039870 1023671 1008947 995945 984865
50893I84865q864o481m423l030k193j777j863k252k254j438j94R15J842K707L303
$$ 984865 976001 969520 965097 962067 959874 958097 956234 953982 951728 950290 950096 951011 952853 955560 958863
50878I58863L658M455O182Q196R483J0018J0609J1729J3265J4991J6493J7021
$$ 958863 962521 966976 973158 981354 990837 1000855 1011464 1023193 1036458 1051449 1067942 1084963
50866A084963J6386J5770J6562J8668K0992K3319K6419L0408L4423L8199M2595
$$ 1084963 1101349 1117119 1133681 1152349 1173341 1196660 1223079 1253487 1287910 1326109 1368704
50855A368704M8179N4457O1000O8249P6605Q5686R5139J05259J16190J27283J37920
$$ 1368704 1416883 1471340 1532340 1600589 1677194 1762880 1858019 1963278 2079468 2206751 2344671
50844B344671J48163J57983J66575J73248J78339J82482J85332J85665J82233
$$ 2344671 2492834 2650817 2817392 2990640 3168979 3351461 3536793 3722458 3904691
50835C904691J74095J60696J42520J21292R8871P6225N3862L2738J3995j794j4447
$$ 3904691 4078786 4239482 4382002 4503294 4602165 4678390 4732252 4764990 4778985 4777191 4762744
50824D762744k3545k8634k9769k7329k1649j3360l744N746J3989J9641K0743J5689
$$ 4762744 4739199 4710565 4680796 4653467 4631818 4618458 4614714 4620460 4634449 4654090 4674833 4690522
50812D690522M526j1359l0479n1650p3641r5421j16617j36917j55147j69805j80374
$$ 4690522 4695048 4683689 4653210 4601560 4527919 4432498 4315881 4178964 4023817 3854012 3673638
50801C673638j87257j90489j89391j83750j74431j62630j49130j34648j20176
$$ 3673638 3486381 3295892 3106501 2922751 2748320 2585690 2436560 2301912 2181736
50792B181736j06544r3937q2180p1117o0600n0473m0936l2549k5712k0354j6157
$$ 2181736 2075192 1981255 1899075 1827958 1767358 1716885 1675949 1643400 1617688 1597334 1581177
50781A581177j2762r724o827m583l873m723n932o323o090o342p571r116j0159
$$ 1581177 1568415 1558691 1551864 1547281 1543408 1538685 1532753 1526430 1520340 1513998 1506427 1497311 1487152
50768A487152j0744j1518j2803j4315j5690j6921j8125j9134j9636j9603j9276
$$ 1487152 1476408 1464890 1452087 1437772 1422082 1405161 1387036 1367902 1348266 1328663 1309387
50757A309387j8706j7667j6128j4406j2726j0856q520n856l207o37J986M633P105
$$ 1309387 1290681 1273014 1256886 1242480 1229754 1218898 1210378 1204522 1201315 1200678 1202664 1207297 1214402
50744A214402R398J1746J4423J7615K1387K5584K9939L4435L9284M4458M9660
$$ 1214402 1223800 1235546 1249969 1267584 1288971 1314555 1344494 1378929 1418213 1462671 1512331
50733A512331N4959O0965O7844P4675Q0393Q4958Q8913R2164R4155R5057R5637
$$ 1512331 1567290 1628255 1696099 1770774 1851167 1936125 2025038 2117202 2211357 2306414 2402051
50722B402051R5841R4528R0971Q5727P9560P2214O2910N1361L7699K1999M794
$$ 2402051 2497892 2592420 2683391 2769118 2848678 2920892 2983802 3035163 3072862 3094861 3099655
50711C099655j2143k6420l6550m2495m4762m3549l8940l1560k2648j3472m723
$$ 3099655 3087512 3061092 3024542 2982047 2937285 2893736 2854796 2823236 2800588 2787116 2782393
50700B782393L486J0923J6619J9151J7617J2134L326q332k2476l8456n5276p1702
$$ 2782393 2785879 2796802 2813421 2832572 2850189 2862323 2865649 2857317 2834841 2796385 2741109 2669407
50688B669407q6289r7619j04963j08625j09333j07395j02760r5693q6982p7398
$$ 2669407 2583118 2485499 2380536 2271911 2162578 2055183 1952423 1856730 1769748 1692350
50678A692350o7332n7122m7355l8630l1037k4054j6991r561k105M696J0289J4551
$$ 1692350 1625018 1567896 1520541 1481911 1450874 1426820 1409829 1400268 1398163 1402859 1413148 1427699
50666A427699J7735K0230K2225K3459K3329K1635J9187J7275J6396J5881J5025
$$ 1427699 1445434 1465664 1487889 1511348 1534677 1556312 1575499 1592774 1609170 1625051 1640076
50655A640076J4080J3742J4019J4309J4388J4573J4871J4703J3912J3404J4249
$$ 1640076 1654156 1667898 1681917 1696226 1710614 1725187 1740058 1754761 1768673 1782077 1796326
50644A796326J6412J8940K1218K3583K6625L0365L4314L8061M1523M4684M7327
$$ 1796326 1812738 1831678 1852896 1876479 1903104 1933469 1967783 2005844 2047367 2092051 2139378
50633B139378M9095M9791M9520M8495M6757M4224M1054L7747L4680L1589K7653
$$ 2139378 2188473 2238264 2287784 2336279 2383036 2427260 2468314 2506061 2540741 2572330 2599983
50622B599983K2054J4365M591o685j8052k7557l3708l6222l5711l2766k7724k1204
$$ 2599983 2622037 2636402 2640993 2634308 2616256 2588699 2554991 2518769 2483058 2450292 2422568 2401364
50610B401364j4404q424l480R21M973Q020R090P758M283r74p972j6662k6571l6889
$$ 2401364 2386960 2378536 2375056 2375977 2380950 2388970 2398060 2405818 2410101 2409127 2401155 2384493 2357922 2321033
50596B321033m6983n6498o4998p1789p6329p8602p8887p7401p4418p0550o6435
$$ 2321033 2274050 2217552 2152554 2080765 2004436 1925834 1846947 1769546 1695128 1624578 1558143
50585A558143o2189n7567n2694m8075m3804l9287l4188k9163k5137k2120j9299
$$ 1558143 1495954 1438387 1385693 1337618 1293814 1254527 1220339 1191176 1166039 1143919 1124620
50574A124620j6102j2593q930n140j546J264L151M677O397Q311J0277J2425J4682
$$ 1124620 1108518 1095925 1086995 1081855 1080309 1081573 1084724 1089401 1095798 1104109 1114386 1126811 1141493
50561A141493J6325J6600J5678J4546J4106J4711J6414J9044K2080K4924K7467
$$ 1141493 1157818 1174418 1190096 1204642 1218748 1233459 1249873 1268917 1290997 1315921 1343388
50550A343388K9961L2307L3903L4389L4129L3660L3017L1887L0285K8713K7769
$$ 1343388 1373349 1405656 1439559 1473948 1508077 1541737 1574754 1606641 1636926 1665639 1693408
50539A693408K7812K8968L1278L4787L9546M5455N2051N8513O4042O8254P1319
$$ 1693408 1721220 1750188 1781466 1816253 1855799 1901254 1953305 2011818 2075860 2144114 2215433
50528B215433P3835P6624Q0419Q5570R1941R9035J06114J12391J17400J21113
$$ 2215433 2289268 2365892 2446311 2531881 2623822 2722857 2828971 2941362 3058762 3179875
50518C179875J23470J23802J21191J15401J07001R6391Q3211O7106M8698K9271
$$ 3179875 3303345 3427147 3548338 3663739 3770740 3867131 3950342 4017448 4066146 4095417
50508D095417R697r869k9309m8023o5163q0021r2143j01213j06837j08381j05259
$$ 4095417 4105114 4095245 4065936 4017913 3952750 3872729 3780586 3679373 3572536 3464155 3358896
50497C358896r7584q6336p2597n6923l9785k2250n601R546K3066L4302M1904M4800
$$ 3358896 3261312 3174976 3102379 3045456 3005671 2983421 2977820 2987366 3010432 3044734 3086638 3131438
50485C131438M2728L5636K3318O045j4911l7804o1094q3253j02398j16850j26082
$$ 3131438 3174166 3209802 3233120 3239165 3224254 3186450 3125356 3042103 2939705 2822855 2696773
50474B696773j30769j31932j30196j25798j19079j10873j02372r4347q6565p8234
$$ 2696773 2566004 2434072 2303876 2178078 2058999 1948126 1845754 1751407 1664842 1586608
50464A586608o9135n9989n1682m4555l8530l3415k8836k4325j9800j5550j1504
$$ 1586608 1517473 1457484 1405802 1361247 1322717 1289302 1260466 1236141 1216341 1200791 1189287
50453A189287p048j972K923O728R550J2165J4928J7641K0182K2592K4629K5971
$$ 1189287 1182239 1180267 1183190 1189918 1199468 1211633 1226561 1244202 1264384 1286976 1311605 1337576
50441A337576K6759K7354K7513K6382K3330J8506J2593O501J196k716n228o505
$$ 1337576 1364335 1391689 1419202 1445584 1468914 1487420 1500013 1506514 1507710 1504994 1499766 1493261
50429A493261o431n040l083j470k99R51K420L837N363P472J0005J2288J4372J7182
$$ 1493261 1486830 1481790 1478707 1477237 1476938 1477889 1480309 1484146 1489509 1496981 1506986 1519274 1533646 1550828
50415A550828K1021K4983K8347L1654L5708M0283M4682M8957N3512N7925O1190
$$ 1550828 1571849 1596832 1625179 1656833 1692541 1732824 1777506 1826463 1879975 1937900 1999090
50404A999090O3038O4069O4517O3736O1158N7081N2112M6375L9683L2151K4176
$$ 1999090 2062128 2126197 2190714 2254450 2315608 2372689 2424801 2471176 2510859 2543010 2567186
50393B567186J5803O498m396j6997l0630m4117n6337o6568p4409p9485q1306p9582
$$ 2567186 2582989 2589487 2585091 2568094 2537464 2493347 2437010 2370442 2296033 2216548 2135242 2055660
50381B055660p4679o7706n9857n1537m2311l1921k1064j0861j762O552J4183K0443
$$ 2055660 1980981 1913275 1853418 1801881 1759570 1727649 1706585 1695724 1693962 1700514 1714697 1735140
50369A735140K4363K5317K3089J7794J0050Q90q737j8221k6957l4187l9447m2912
$$ 1735140 1759503 1784820 1807909 1825703 1835753 1836643 1827906 1809685 1782728 1748541 1709094 1666182
50357A666182m5085m6431m7451m8733n0478n2231n3304n3310n2048m9317m5224
$$ 1666182 1621097 1574666 1527215 1478482 1428004 1375773 1322469 1269159 1217111 1167794 1122570
50346A122570m0440l5703l1096k6245k1171j6574j3172j0907q984o668m015j717
$$ 1122570 1082130 1046427 1015331 989086 967915 951341 938169 927262 918278 911610 907595 905878
50334I05878j98Q98K129L348L965L950L983M411M789M740M705N353O691Q254R745
$$ 905878 905680 906578 908707 912055 916020 919970 923953 928364 933153 937893 942598 947951 954642 962896 972641
50319I72641J1026J1846J2192J2684J3956J5751J7138J7644J7603J7525J7591
$$ 972641 983667 995513 1007705 1020389 1034345 1050096 1067234 1084878 1102481 1120006 1137597
50308A137597J7905J8750K0387K2790K5723K8943L2433L6491M1556M7691N4240
$$ 1137597 1155502 1174252 1194639 1217429 1243152 1272095 1304528 1341019 1382575 1430266 1484506
50297A484506N9933O3054O1555N3701L9259K0085o92j9995l5497m5843n0968n1959
$$ 1484506 1544439 1607493 1669048 1722749 1762008 1782093 1781401 1761406 1725909 1680066 1629098 1577139
50285A577139n0150m6381m1327l5947l0968k6290k1472j6526j1583o209k2O194
$$ 1577139 1526989 1480608 1439281 1403334 1372366 1346076 1324604 1308078 1296495 1290286 1290264 1296458
50273A296458J1079J4496J7776K1860K6114K9437L1773L3839L5951L7776L8892
$$ 1296458 1307537 1322033 1339809 1361669 1387783 1417220 1448993 1482832 1518783 1556559 1595451
50262A595451L8972L7650L4850L1227K7737K4836K2342K0049J7965J5967J3591
$$ 1595451 1634423 1672073 1706923 1738150 1765887 1790723 1813065 1833114 1851079 1867046 1880637
50251A880637J0323N880J22o975j5042k3212l0517l6376m0519m2613m2325l9773
$$ 1880637 1890960 1896840 1896962 1889987 1874945 1851733 1821216 1784840 1744321 1701708 1659383 1619610
50239A619610l5747l1245k7023k3629k1496k0705k0796k1202k1678k2023k1695
$$ 1619610 1583863 1552618 1525595 1501966 1480470 1459765 1438969 1417767 1396089 1374066 1352371
50228A352371k0254j8082j6097j4766j3922j3432j3375j3562j3738j4263j5607
$$ 1352371 1332117 1314035 1297938 1283172 1269250 1255818 1242443 1228881 1215143 1200880 1185273
50217A185273j7055j7092j5548j4192j4338j5044j4734j3577j2855j2740j2320
$$ 1185273 1168218 1151126 1135578 1121386 1107048 1092004 1077270 1063693 1050838 1038098 1025778
50206A025778j1418j0794j0559r944q801p908p558p153o535o384o763o619n403
$$ 1025778 1014360 1003566 993007 983063 974262 966354 958796 951643 945108 938724 931961 925342 919939
50193I19939m068l616l639l246k537k132j909j313n02j04j59j40M8L2j95k01N4
$$ 919939 915871 912255 908616 905370 902833 900701 898792 897479 896977 896873 896714 896574 896622 896654 896459 896258 896312
50176H96312O4m88j337k066k357j825k04K012L640L910L270K850L296M402N736
$$ 896312 896376 895888 894551 892485 890128 888303 888099 890111 893751 897661 900931 903781 907077 911479 917215
50161I17215P281R301J1841J4658J7648K1040K4962K9114L3270L7917M3792N0702
$$ 917215 924496 933797 945638 960296 977944 998984 1023946 1053060 1086330 1124247 1168039 1218741
50149A218741N7421O2999O7659P1938P5300P6242P3874O8998O3498N8780N4974
$$ 1218741 1276162 1339161 1406820 1478758 1554058 1630300 1704174 1773172 1836670 1895450 1950424
50138A950424N1511M8105M4777M0988L5445K7194J6565M541q496k2587l7003n0112
$$ 1950424 2001935 2050040 2094817 2135805 2171250 2198444 2215009 2219550 2211054 2188467 2151464 2101352
50126B101352o0659o8567p4223p7686p8871p7818p4516o9087o2472n6160n0727
$$ 2101352 2040693 1972126 1897903 1820217 1741346 1663528 1589012 1519925 1457453 1401293 1350566
50115A350566m5368l9417l3599k8990k5473k2197j9047j6492j4278j1469p979
$$ 1350566 1305198 1265781 1232182 1203192 1177719 1155522 1136475 1119983 1105705 1094236 1086257
50104A086257m888k959j809r85q83j975l737n211o311p792j0009j2262j3528j3297
$$ 1086257 1081369 1078410 1076601 1075616 1074733 1072758 1069021 1063810 1057499 1049707 1039698 1027436 1013908 1000611
50090A000611j1737r367o843m713l131j885p92J22Q91J815L112M571N841O974
$$ 1000611 988874 979507 972664 967951 964820 962935 962143 962265 963156 964971 968083 972654 978495 985469
50076I85469Q259R605J0565J1083J1655J2490J3065J2928J2454J2166J1798J0798
$$ 985469 993728 1003333 1013898 1024981 1036636 1049126 1062191 1075119 1087573 1099739 1111537 1122335
50064A122335R463Q595Q141P169N390L605K333R67j037l072m253m787n472o222
$$ 1122335 1131798 1140393 1148534 1155703 1161093 1164698 1167031 1167998 1166961 1163889 1159636 1154849 1149377 1143155
50050A143155o157n001l483k226j020M94K183L738N278P155R443J1935J4529J7354
$$ 1143155 1136998 1131997 1128514 1126288 1125268 1125762 1127945 1131683 1136961 1144116 1153559 1165494 1180023 1197377
50036A197377K0533K4012K7667L1465L5522L9938M4605M9133N2987N5677N6897
$$ 1197377 1217910 1241922 1269589 1301054 1336576 1376514 1421119 1470252 1523239 1578916 1635813
50025A635813N6611N4943N1963M7652M2239L6405L0884K5995K1774J8296J5285
$$ 1635813 1692424 1747367 1799330 1846982 1889221 1925626 1956510 1982505 2004279 2022575 2037860
50014B037860J1396M639o033j9615l3737m6212n6021o3349o8964p3260p5657p5168
$$ 2037860 2049256 2053895 2047862 2028247 1994510 1948298 1892277 1828928 1759964 1686704 1611047 1535879
50002A535879p1634o6021n9473n2575m5720l9471l4062k9048k3993j9226j5354
$$ 1535879 1464245 1398224 1338751 1286176 1240456 1200985 1166923 1137875 1113882 1094656 1079302
49991A079302j2400r983q106p192p382q326r661j1319j3237j5054j6241j6450
$$ 1079302 1066902 1056919 1048813 1041621 1034239 1025913 1016252 1004933 991696 976642 960401 943951
49979I43951j5863j5161j4871j4673j3755j2003j0385r812j0033j0049r288p997
$$ 943951 928088 912927 898056 883383 869628 857625 847240 837428 827395 817346 808058 800061
49967H00061o771o133o335p083p645p563p082o594o000n028l851k869k065j041
$$ 800061 793290 787157 780822 773739 766094 758531 751449 744855 738855 733827 729976 727107 725042 724001
49953G24001M51K304M194N622O180O072N978O022N441L780J885R03P39L32p91
$$ 724001 724452 726756 730950 736572 742752 748824 754802 760824 766265 770045 771930 772833 773572 773904 773113
49938G73113k141l221l952m277m150m010m411n166n631n850o536p742q486q076
$$ 773113 770972 767751 763799 759522 755372 751362 746951 741785 736154 730304 723768 716026 707540 699464
49924F99464p010o128n494m731l872l263k883k354j517o71j60J3J64N72J160J648
$$ 699464 692454 686326 680832 676101 672229 668966 666083 663729 662212 661541 661381 661394 661558 662130 663290 664938
49908F64938K051K714L739M689N235N727O587P523P973Q092Q428Q790Q348O968
$$ 664938 666989 669703 673442 678131 683366 689093 695680 703203 711176 719268 727696 736486 744834 751802
49894G51802N511M521L446J667m31j998k927l927n576p652r306r826r332q698
$$ 751802 757313 761834 765280 766947 766516 764518 761591 757664 752088 744436 735130 725304 715972 707274
49880G07274q511q245o988m886l166k635k848k982k831k539k011j139j27Q28J800
$$ 707274 698763 690518 683530 678644 675478 672843 669995 667013 664182 661643 659632 658493 658366 659194 660994
$$ [...]
##END NTUPLES=NMR SPECTRUM
##END=
