##TITLE=AC1706_ROEFFECT0029_8638349_uYmLTuHmfP
##JCAMPDX= 6.0         $$ Bruker NMR JCAMP-DX V2.0
##DATA TYPE= NMR SPECTRUM
##DATA CLASS= NTUPLES
##ORIGIN= BRUKER
##OWNER= Administrator
$$ 1.72 TOPSPIN		Version 2.1
$$ 2014-05-23 03:50:46.428 -0700  Administrator@X
$$ Compression mode = diff/dup
##.OBSERVE FREQUENCY= 400.02188249412
##.OBSERVE NUCLEUS= ^1H
##.ACQUISITION MODE= SIMULTANEOUS (DQD)
##.ACQUISITION SCHEME= undefined
##.AVERAGES= 8
##.DIGITISER RES= 22
##SPECTROMETER/DATA SYSTEM= spect
##.PULSE SEQUENCE= zg30
##.SOLVENT NAME= COFFEE_meoh
##.SHIFT REFERENCE= INTERNAL, COFFEE_meoh, 1, 14.98509
##AUDIT TRAIL= $$ (NUMBER, WHEN, WHO, WHERE, PROCESS, VERSION, WHAT)
$$ ##TITLE= Audit trail, TOPSPIN		Version 2.1
$$ ##JCAMPDX= 5.01
$$ ##ORIGIN= Bruker BioSpin GmbH
$$ ##OWNER= Administrator
$$ $$ E:\/data/COFFEE/nmr/AC1706_ROEFFECT0029_8638349_uYmLTuHmfP/10/pdata/1/auditp.txt
$$ ##AUDIT TRAIL=  $$ (NUMBER, WHEN, WHO, WHERE, PROCESS, VERSION, WHAT)
(   1,<2014-05-23 03:50:39.881 -0700>,<Administrator>,<X>,<go>,<TOPSPIN 2.1>,
      <created by zg
	started at 2014-05-23 03:49:33.881 -0700,
	POWCHK enabled, PULCHK disabled,
       configuration hash MD5:
       C8 4E 4E 5D D3 5C D8 9E 9F 52 82 E0 59 8A DE 15
       data hash MD5: 64K
       AD D0 F4 39 61 79 22 3D 66 B7 A4 EE B8 F1 FA A5>)
(   2,<2014-05-23 03:50:42.803 -0700>,<Administrator>,<X>,<proc1d>,<TOPSPIN 2.1>,
      <Start of raw data processing
       efp LB = 0 FT_mod = 6 PKNL = 1 PHC0 = 0 PHC1 = 0 SI = 32K 
       data hash MD5: 32K
       F8 4F 6B 17 98 E8 FF DA E8 DB 69 18 3A 01 FF C3>)
(   3,<2014-05-23 03:50:43.116 -0700>,<Administrator>,<X>,<proc1d>,<TOPSPIN 2.1>,
      <pk PHC0 = 91.4502 PHC1 = 0 
       data hash MD5: 32K
       3A 6A 84 01 01 62 70 CA 9E 24 96 D0 4E FA 5E 3F>)
(   4,<2014-05-23 03:50:43.241 -0700>,<Administrator>,<X>,<proc1d>,<TOPSPIN 2.1>,
      <abs ABSG = 1 
       data hash MD5: 32K
       CF EB EC C3 36 99 10 DC FB A7 E0 EC 90 3C 6E B3>)
(   5,<2014-05-23 03:50:43.303 -0700>,<Administrator>,<X>,<proc1d>,<TOPSPIN 2.1>,
      <abs ABSG = 2 
       data hash MD5: 32K
       51 39 D6 67 3B A6 15 05 2E 2B CD 5E 69 93 41 B1>)
(   6,<2014-05-23 03:50:43.366 -0700>,<Administrator>,<X>,<proc1d>,<TOPSPIN 2.1>,
      <abs ABSG = 3 
       data hash MD5: 32K
       BC 91 50 DB DD 22 B4 C3 9A 0C D7 8C 9A 96 3B 1A>)
(   7,<2014-05-23 03:50:43.413 -0700>,<Administrator>,<X>,<proc1d>,<TOPSPIN 2.1>,
      <abs ABSG = 4 
       data hash MD5: 32K
       0A 94 28 35 81 20 D9 B9 82 C5 F1 48 28 79 DF 50>)
(   8,<2014-05-23 03:50:43.459 -0700>,<Administrator>,<X>,<proc1d>,<TOPSPIN 2.1>,
      <abs ABSG = 5 
       data hash MD5: 32K
       39 7A 5C EE 28 4C 92 6D AE 08 2B 47 5F 18 99 29>)
$$ ##END=
$$ 
$$ $$ hash MD5
$$ $$ F2 C5 57 75 AC 87 BC B9 EB 83 E5 03 03 41 4D 02
##$RELAX= 
##$RELAX= 
##$RELAX= 
##$RELAX= 
##$RELAX= 
##$RELAX= 
##$RELAX= 
$$ Bruker specific parameters
$$ --------------------------
##$DU= <E:\>
##$EXPNO= 10
##$NAME= <AC1706_ROEFFECT0029_8638349_uYmLTuHmfP>
$$ [...]
150 150 150 150 150 150 150 150
##$TP07= 0
##$TPNAME0= <>
##$TPNAME1= <>
##$TPNAME2= <>
##$TPNAME3= <>
##$TPNAME4= <>
##$TPNAME5= <>
##$TPNAME6= <>
##$TPNAME7= <>
##$TPOAL= (0..7)
0.5 0.5 0.5 0.5 0.5 0.5 0.5 0.5
##$TPOFFS= (0..7)
0 0 0 0 0 0 0 0
##$TUNHIN= 0
##$TUNHOUT= 0
##$TUNXOUT= 0
##$USERA1= <user>
##$USERA2= <user>
##$USERA3= <user>
##$USERA4= <user>
##$USERA5= <user>
##$V9= 5
##$VALIST= <valist>
##$VCLIST= <CCCCCCCCCCCCCCC>
##$VD= 0
##$VDLIST= <DDDDDDDDDDDDDDD>
##$VPLIST= <PPPPPPPPPPPPPPP>
##$VTLIST= <TTTTTTTTTTTTTTT>
##$WBST= 2048
##$WBSW= 25
##$XGAIN= (0..3)
0 0 0 0
##$XL= 0
##$YL= 0
##$YMAX_a= 642715
##$YMIN_a= -549117
##$ZGOPTNS= <>
##$ZL1= 120
##$ZL2= 120
##$ZL3= 120
##$ZL4= 120
##$ABSF1= 14.98509
##$ABSF2= -5.573092
##$ABSG= 5
##$ABSL= 3
##$ALPHA= 0
##$AQORDER= 0
##$ASSFAC= 0
##$ASSFACI= 0
##$ASSFACX= 0
##$ASSWID= 0
##$AUNMP= <proc_prof1d_extract_pilot.lims>
##$AXLEFT= 0
##$AXNAME= <>
##$AXNUC= <1H>
##$AXRIGHT= 0
##$AXTYPE= 0
##$AXUNIT= <>
##$AZFE= 0.1
##$AZFW= 0.1
##$BCFW= 0
##$BC_mod= 0
##$BYTORDP= 0
##$COROFFS= 0
##$CY= 15
##$DATMOD= 1
##$DC= 0
##$DFILT= <>
##$DTYPP= 0
##$F1P= 0
##$F2P= 0
##$FCOR= 0.5
##$FTSIZE= 32768
##$FT_mod= 6
##$GAMMA= 0
##$GB= 0
##$INTBC= 1
##$INTSCL= 1
##$ISEN= 128
##$LB= 0
##$LEV0= 0
##$LPBIN= 0
##$MAXI= 10000
##$MC2= 0
##$MEAN= 0
##$ME_mod= 0
##$MI= 0
##$NCOEF= 0
##$NC_proc= -8
##$NLEV= 6
##$NOISF1= 0
##$NOISF2= 0
##$NSP= 0
##$NTH_PI= 0
##$NZP= 0
##$OFFSET= 14.98509
##$PC= 1
##$PHC0= 91.4502
##$PHC1= 0
##$PH_mod= 1
##$PKNL= yes
##$PPARMOD= 0
##$PPDIAG= 0
##$PPIPTYP= 0
##$PPMPNUM= 2147483647
##$PPRESOL= 1
##$PSCAL= 4
##$PSIGN= 0
##$PYNMP= <proc.py>
##$REVERSE= no
##$SF= 400.02
##$SI= 32768
##$SIGF1= 0
##$SIGF2= 0
##$SINO= 400
##$SIOLD= 32768
##$SPECTYP= <>
##$SREGLST= <1H.CDCl3>
##$SSB= 0
##$STSI= 32768
##$STSR= 0
##$SW_p= 8223.68421052631
##$SYMM= 0
##$S_DEV= 0
##$TDeff= 65536
##$TDoff= 0
##$TI= <>
##$TILT= no
##$TM1= 0
##$TM2= 0
##$TOPLEV= 0
##$USERP1= <user>
##$USERP2= <user>
##$USERP3= <user>
##$USERP4= <user>
##$USERP5= <user>
##$WDW= 1
##$XDIM= 32768
##$YMAX_p= 464742541
##$YMIN_p= -680631
##$CURPLOT= <Network HP LaserJet P1505>
##$CURPRIN= <$Network HP LaserJet P1505>
##$DFORMAT= <normdp>
##$LAYOUT= <+/1D_H.xwp>
##$LFORMAT= <normlp>
##$PFORMAT= <normpl>
##$SURQMSG= 1
$$ End of Bruker specific parameters
$$ ---------------------------------
##NTUPLES= NMR SPECTRUM
##VAR_NAME=  FREQUENCY,     SPECTRUM/REAL,   SPECTRUM/IMAG
##SYMBOL=    X,             R,               I
##VAR_TYPE=  INDEPENDENT,   DEPENDENT,       DEPENDENT
##VAR_FORM=  AFFN,          ASDF,            ASDF
##VAR_DIM=   32768,         32768,           32768
##UNITS=     HZ,            ARBITRARY UNITS, ARBITRARY UNITS
##FACTOR=    0.250966925370066, 1,           1
##FIRST=     8223.43324360094, 67409,        -106580
##LAST=      0,             17233,           -123181
##MIN=       0,             -680631,         0
##MAX=       8223.43324360094, 464742541,    0
$$ Real data points
##PAGE= N=1
##DATA TABLE= (X++(R..R)), XYDATA
$$ [...]
19558c15577a10408F6139L518h2886j52925o7863J50141f8424j56038I7649R0794
$$ -315577 -110408 66139 69657 -82886 -235811 -303674 -153533 -68424 -224462 97649 188443
19547A88443c8788o7119j68154e2331k00675a22508E3057i6216M4491A62489L099
$$ 188443 -38788 -105907 -274061 -52331 -253006 -122508 53057 -96216 -51725 162489 165588
19536A65588F985C217b05196B44456a75490A09883a43488b4646j89618A45963
$$ 165588 6985 3217 -205196 244456 -175490 109883 -143488 -24646 -214264 145963
19525b5667j84366n2136J23501B39295j19151e0268j34016P3237k08914B97327
$$ -25667 -210033 -262169 -138668 239295 120144 -50268 -184284 -111047 -319961 297327
19514a89866a2670M091A46680K06625i676j27539B30443c83414I9815a64087E6794
$$ -189866 -12670 -8579 146680 353305 -9676 -137215 230443 -383414 99815 -164087 56794
19502b23057a2920C46183A61097c4639j77983j46991c9520A34108f16813h6508
$$ -223057 -12920 346183 161097 -34639 -212622 -359613 -39520 134108 -616813 -86508
19491F2382L9026h9789j12644G574a70257b4582I1426d1540C9941b7775j20885
$$ 62382 101408 -89789 -202433 7574 -170257 -24582 91426 -41540 39941 -27775 -148660
19480a48660A17948a37995l8968E13a45532C9962a08799H759b17873f4080A43489
$$ -148660 117948 -137995 -176963 513 -145532 39962 -108799 8759 -217873 -64080 143489
19468d8387j62804c7677j8181p5467n093A28587h486j59323B47627a23974c2552
$$ -48387 -211191 -37677 -55858 -131325 -136418 128587 -8486 -167809 247627 -123974 -32552
19456a95564E2835h9639B27164d7153k32204J37434M1606j10594B48708d46222
$$ -195564 52835 -89639 227164 -47153 -279357 -141923 -100317 -210911 248708 -446222
19445i3675p0294D6772j0708J21058B599b72494J27489j05333A22683J60140c15092
$$ -93675 -163969 46772 36064 157122 2599 -272494 -145005 -250338 122683 282823 -315092
19433c66111e4753m62848i2558G5649c10542h1386j28147a00885A32844b2417
$$ -366111 -54753 -517601 -92558 75649 -310542 -81386 -209533 -100885 132844 -22417
19422A02095c22722A40163M2483d6991j34223K9577A04191b13033N2869k681M0492
$$ 102095 -322722 140163 182646 -46991 -181214 -151637 104191 -213033 -160164 -162845 -122353
19411a22353k03547O3154E7117d1405j56411J8277g8627j06759f1885B75369a01484
$$ -122353 -325900 -262746 57117 -41405 -197816 -179539 -78627 -185386 -61885 275369 -101484
19399A60692e50033B6759i8061G5107a06113H7679a89293L412p8912n5367a45768
$$ 160692 -550033 26759 -98061 75107 -106113 87679 -189293 -185881 -264793 -320160 -145768
19387c25362D0290J44016a07214G9598a20959c4889k03751m1691g3048l4855H9837
$$ -325362 40290 184306 -107214 79598 -120959 -34889 -238640 -280331 -73048 -107903 89837
19375A7605d15989C69451D9663L45723e3366g288k22501h5325j12369k30875A06888
$$ 17605 -415989 369451 49663 395386 -53366 -7288 -229789 -85325 -197694 -428569 106888
19363c65125J34713i9681H6326f2179J0248C6470J07690l8334n590a11214k26048
$$ -365125 -230412 -99681 86326 -62179 -51931 36470 144160 105826 100236 -111214 -337262
19352c37262d7808k2054k22463A63545F3924a78822n7192m3427f804n7170A61616
$$ -337262 -47808 -69862 -292325 163545 63924 -178822 -236014 -279441 -6804 -63974 161616
19340c14606I9796p075J72694b38126C2728a8392D9741J71722f389A3766a35290
$$ -314606 99796 92721 265415 -238126 32728 -18392 49741 221463 -6389 13766 -135290
19328a66376O8204A36756C3990b36297i3643b4125j47927C4227a66474D56145
$$ -166376 -98172 136756 33990 -236297 -93643 -24125 -172052 34227 -166474 456145
19317a10960b4605l1891j70414A68469A6946a32600N3198b561j12231d6514j05581
$$ -110960 -24605 -56496 -226910 168469 16946 -132600 -79402 -2561 -114792 -46514 -152095
19306a52095k5485D5887e7770p883J6511k98647f6797j32996A07270m4197a04096
$$ -152095 -177580 45887 -57770 -65653 -49142 -347789 -66797 -199793 107270 63073 -104096
19294C4395a65578L2155B49821b00369n8002D7164J31965C0465d5401C4650J87370
$$ 34395 -165578 -133423 249821 -200369 -258371 47164 179129 30465 -45401 34650 222020
19283B22020o0527a65580D843O7070b59202j19154a16325b6926q5987B75812F5951
$$ 222020 161493 -165580 4843 71913 -259202 -378356 -116325 -26926 -112913 275812 65951
19271b77938C67209A6152c69546B12695a80234a157k74644E622J59502b57390
$$ -277938 367209 16152 -369546 212695 -180234 -1157 -275801 5622 165124 -257390
19260B8618a01636J9545n5905p8362A6739J87165b08534B29205a60555B6604P3821
$$ 28618 -101636 -82091 -137996 -216358 16739 203904 -208534 229205 -160555 26604 100425
19249A00425h7114I87K19791c93319a05311A80748K20314f1411j69557A637J95243
$$ 100425 -87114 987 220778 -393319 -105311 180748 401062 -61411 -230968 1637 196880
19238A96880P1066F6669B0979L2554R0133C1745J61878n8584g307j36426j49071
$$ 196880 267946 66669 20979 53533 143666 31745 193623 135039 -7307 -143733 -292804
19227b92804A75898a5003k05443m5570B23784a71051l3117g2258k16542P8411
$$ -292804 175898 -15003 -220446 -266016 223784 -171051 -204168 -72258 -288800 -210389
19217b10389l28038i2100A13417a2637r8464N4899E2203a3846k02809C5073d8785
$$ -210389 -538427 -92100 113417 -12637 -111101 -56202 52203 -13846 -216655 35073 -48785
19205a00032n171h306j93544k94288B5101b28854E3760a40868j58308C81L10421
$$ -100032 -105203 -8306 -201850 -496138 25101 -228854 53760 -140868 -299176 381 310802
19194C10802b17241g897B02879b1291k79120I6957J88666d6399A9487a69323C3185
$$ 310802 -217241 -7897 202879 -21291 -300411 96957 285623 -46399 19487 -169323 33185
19182i4887A56105a55155B18224a30959G8305a666B898c270l9726q1724o6652
$$ -94887 156105 -155155 218224 -130959 78305 -1666 2898 -3270 -42996 -124720 -191372
19171a91372O348d998j8877j09649B24215i847j05871k9307A02106a45247e7203
$$ -191372 -185024 -4998 -23875 -133524 224215 -9847 -115718 -145025 102106 -145247 -57203
19159b32548k0184N3346i520A62709a47067f8217k9253j29857F6160J39972D5888
$$ -232548 -252732 -199386 -9520 162709 -147067 -68217 -97470 -227327 66160 206132 45888
19147E4081Q3590J10431e12688h2991j84445n4804E03870h5121j58984N6684F8917
$$ 54081 137671 248102 -512688 -82991 -267436 -322240 503870 -85121 -244105 -187421 68917
19135A76731e19284b5675k4829j38843j76a2871k19829A57224k3063e7923I9056
$$ 176731 -519284 -25675 -50504 -189347 -189523 -12871 -232700 157224 134161 -57923 99056
19123d88393J96036a07747B29263I718a35164q2231B20503b32589n3446A00046
$$ -488393 -292357 -107747 229263 9718 -135164 -217395 220503 -232589 -286035 100046
19112h7061G7818B5137c41509J01950g949k45104B16568h76j47425K022C39979
$$ -87061 77818 25137 -341509 -239559 -7949 -253053 216568 -876 -148301 -146279 339979
19100b54251A19097a55526A12953K54239b37204d8661K434B35450a78855k05300
$$ -254251 119097 -155526 112953 367192 -237204 -48661 -46227 235450 -178855 -384155
19090c84155a29696C58612b06069B05574a28910A91460i1272A48085K218a81186
$$ -384155 -129696 358612 -206069 205574 -128910 191460 -91272 148085 150303 -181186
19079b04726A02170D1879f9277A73471f3382l26025C99170A29272L1895c29306
$$ -204726 102170 41879 -69277 173471 -63382 -389407 399170 129272 161167 -329306
19068D6494d7793B85637e0965P098k11230i3296c2213j92865B01508n2425a37117
$$ 46494 -47793 285637 -50965 -43867 -255097 -93296 -32213 -225078 201508 149083 -137117
19056F8000J28766J68801I9664Q6121a63437r3115Q6678p3483G0031g7804j74796
$$ 68000 196766 365567 99664 185785 -163437 -256552 -169874 -243357 70031 -77804 -252600
19045b52600J22381j56335j21740J98854o2497R8156l3228b6995j666j75269M354
$$ -252600 -130219 -286554 -408294 -209440 -271937 -173781 -207009 -26995 -28661 -203930 -199576
19034a99576n0386h3157G3740a30860B10832B9249K00492P183b3997A47863J28255
$$ -199576 -249962 -83157 73740 -130860 210832 29249 229741 236924 -23997 147863 276118
19023B76118c70623A38608j5941L39611o9078G7534e4500e083A65865a74246A06528
$$ 276118 -370623 138608 122667 462278 393200 77534 -54500 -5083 165865 -174246 106528
19011D7117b00644i4509A95770c9089j60473d1635k02811J2469d3384j67026H3659
$$ 47117 -200644 -94509 195770 -39089 -199562 -41635 -244446 -231977 -43384 -210410 83659
18999a56724n1302e2714C3981b78822c3877q4902K7875k10978a2853A60809e7262
$$ -156724 -208026 -52714 33981 -278822 -33877 -118779 -90904 -301882 -12853 160809 -57262
18987i9590j30636B69952B8671h0478o2587A20766L0948b79233B95142d21014
$$ -99590 -230226 269952 28671 -80478 -143065 120766 151714 -279233 295142 -421014
18976A8056a90288g6364H2405a51500f8501j96712Q4670b3934D9116h2273A2955
$$ 18056 -190288 -76364 82405 -151500 -68501 -265213 -180543 -23934 49116 -82273 12955
18964B15725b01367C5566K9359J1775a64454d6792j9475A72796b17400n0104A70334
$$ 215725 -201367 35566 64925 76700 -164454 -46792 -66267 172796 -217400 -267504 170334
18952E00236F2981j9591b46591B40361g9709K4174j8953E764a38378A95552a97650
$$ 500236 62981 43390 -246591 240361 -79709 -55535 -74488 5764 -138378 195552 -197650
18940e8793F0518J48713A4572a21056j12028g7838F9214d0607j59234O6094A19973
$$ -58793 60518 209231 14572 -121056 -233084 -77838 69214 -40607 -199841 -133747 119973
18928G0732J19534D609b25626B21850a70615a1442B91779b9778H844a86560h2401
$$ 70732 190266 4609 -225626 221850 -170615 -11442 291779 -29778 8844 -186560 -82401
18916A22810a01188k0472o4424H1003a59683A97627D9730J78881F1536B6856a72504
$$ 122810 -101188 -121660 -186084 81003 -159683 197627 49730 228611 61536 26856 -172504
18904a77409A5575R6587a67442l0518q8851j29833a73751d5840R122B56650e2243
$$ -177409 15575 112162 -167442 -197960 -286811 -416644 -173751 -45840 -36718 256650 -52243
18892A66119e3409M549j19550A16607h5324c8671r4885k00133C7777R8169L1348
$$ 166119 -53409 -48860 -168410 116607 -85324 -38671 -133556 -333689 37777 135946 167294
18881A67294a34271f5261K2016b0015o4367O872q8408D0103c7966j87953R4074
$$ 167294 -134271 -65261 -43245 -20015 -84382 -77510 -165918 40103 -37966 -225919 -131845
18870a31845I3667C1758a92351J2122j20891B14718b80030A1719a0532l03752
$$ -131845 93667 31758 -192351 -180229 -301120 214718 -280030 11719 -10532 -314284
18860c14284a6171A30479n0185d0518j08683k29867d9785A66445k1875J67824
$$ -314284 -16171 130479 80294 -40518 -149201 -379068 -49785 166445 144570 312394
18850C12394c1237o8367c1605D8703K89468A6423K04200g9086H450e8884D12773
$$ 312394 -31237 -99604 -31605 48703 338171 16423 220623 -79086 8450 -58884 412773
18838D6384G985a27963M358k31113N0721J3089i2988j93972n3663B6700b61041
$$ 46384 7985 -127963 -123605 -354718 -303997 -290908 -92988 -286960 -340623 26700 -261041
18826A66192m5188P8021b13708A76074c19990a03380r0875I0827e2256A09607
$$ 166192 121004 199025 -213708 176074 -319990 -103380 -194255 90827 -52256 109607
18815I0882N7947J2925a59202d7816G5685b8806D96083k44338j7566B6652F857
$$ 90882 148829 161754 -159202 -47816 75685 -28806 496083 251745 234179 26652 6857
18803b03459n9910j997o3996C2709L45927A60353m8840b78296B45225c81588A24730
$$ -203459 -263369 -265366 -329362 32709 378636 160353 111513 -278296 245225 -381588 124730
18791A78079G326b79791A3555i8154M583c3434l9724g025l98331E0380a57111
$$ 178079 7326 -279791 13555 -98154 -93571 -33434 -73158 -7025 -405356 50380 -157111
18779b4079P226A92771m6335i7312E8033A3687e1437p109A14195b89727A28331
$$ -24079 -16853 192771 146436 -97312 58033 13687 -51437 -58546 114195 -289727 128331
18767C2262J80327a21362k46922a73263f3888n6289H7949a92148q8544f0792j37884
$$ 32262 212589 -121362 -368284 -173263 -63888 -120177 87949 -192148 -280692 -60792 -198676
18756a98676m6567f1602n97944C19930b18179A9561h6525a6690k40653B26701
$$ -198676 -245243 -61602 -659546 319930 -218179 19561 -86525 -16690 -257343 226701
18745d33324d2640D1135a54175H9117k2164b31056j47969A92729i0027A7383H218
$$ -433324 -42640 41135 -154175 89117 66953 -231056 -379025 192729 -90027 17383 8218
18733H6765N4176b77904F7682K87908h136k74470a30793m56771A6310a18430C7390
$$ 86765 140941 -277904 67682 355590 -8136 -282606 -130793 -587564 16310 -118430 37390
18721f1813r6405m6126A17333b11839A23708a04566A24101L2991q221b11897r0640
$$ -61813 -158218 -204344 117333 -211839 123708 -104566 124101 157092 148871 -211897 -302537
18710c02537a49540A64516b89189B71623a19814c7333n2786j64140p0967B12122
$$ -302537 -149540 164516 -289189 271623 -119814 -37333 -90119 -254259 -325226 212122
18699A75959e367j62021J1765j38029A04997J28271H7521b01928A21759a67730
$$ 175959 -5367 -167388 -155623 -293652 104997 233268 87521 -201928 121759 -167730
18688b17136d546j29262p6822o0749h9420c487A5392a5413F4693h1306j1611B0930
$$ -217136 -4546 -133808 -210630 -271379 -89420 -3487 15392 -15413 64693 -81306 -92917 20930
18675B63434O634G5325a42038C48400h5214I2942h6318a3279B0388c28935M3473
$$ 263434 270068 75325 -142038 348400 -85214 92942 -86318 -13279 20388 -328935 -285462
18664b85462C3498a17311k75760E2191i9865A41376b65289d4977B3907e4927j6520
$$ -285462 33498 -117311 -393071 52191 -99865 141376 -265289 -44977 23907 -54927 -71447
18653g1447B30685b22054L1874a7781k61395j5812C6777b96545A44677P6954a97226
$$ -71447 230685 -222054 -190180 -17781 -279176 -294988 36777 -296545 144677 221631 -197226
18641b29296o7023H5017g3752o6891o3304c2805k72254I0221B8178a34031L1813
$$ -229296 -296319 85017 -73752 -140643 -203947 -32805 -305059 90221 28178 -134031 -102218
18630a02218j49017B82857a40260l7728L2888E6482b40881n2025C4588K46253
$$ -102218 -251235 282857 -140260 -177988 -145100 56482 -240881 -292906 34588 280841
18620B80841a52525O8925p7315j2870f4837A43552J5523c02254Q8280H432a0205
$$ 280841 -152525 -83600 -160915 -173785 -64837 143552 159075 -302254 -213974 8432 -10205
18608A06945a45998B9559a96114N0465n8271A50970D1723b70279O8385C1812b7839
$$ 106945 -145998 29559 -196114 -145649 -203920 150970 41723 -270279 -201894 31812 -27839
18596a33496h194l0304p3348I7204l6772a39418i649j79j66953k42397e9333A8284
$$ -133496 -8194 -38498 -111846 97204 60432 -139418 -9649 -9828 -176781 -419178 -59333 18284
18583b06811p6486J06363L4285L9246j20759A1198b28541D7781b74208a4520l00955
$$ -206811 -283297 -176934 -142649 -103403 -224162 11198 -228541 47781 -274208 -14520 -315475
18572c15475a30838m0382B63373A31672a91080g2518J7299j7604j02935A79272
$$ -315475 -130838 -171220 263373 131672 -191080 -72518 -55219 -72823 -175758 179272
18561i814j84076j340B4403K6647a61458d9839l6734a6884q8913m668F2545J44463
$$ -9814 -193890 -195230 24403 51050 -161458 -49839 -86573 -16884 -105797 -110465 62545 207008
18549B07008o8022a86023D58189f626l61560L7439B01378b06464i5803A16975
$$ 207008 138986 -186023 458189 -6626 -368186 -330747 201378 -206464 -95803 116975
18538C599P119a45209k80101e2505A13683B3057a61728A36995N350a94339B04318
$$ 3599 10718 -145209 -425310 -52505 113683 23057 -161728 136995 142345 -194339 204318
18526b10001j29241J17747M9050J7980n2083M6595L9664K7941A999J37229a71836
$$ -210001 -339242 -221495 -172445 -154465 -206548 -159953 -120289 -92348 1999 139228 -171836
18514A2712c12535Q4615N2114A76155k1585a50997j15906R4931E3369G638a45221
$$ 12712 -312535 -227920 -175806 176155 154570 -150997 -266903 -171972 53369 7638 -145221
18502b00597D6025i1835B31852a73925H7621M6637d3679j38096J5783D9715e927
$$ -200597 46025 -91835 231852 -173925 87621 134258 -43679 -181775 -165992 49715 -5927
18490a55143B12926m9184a42300N0910b1907A48602b99618R1252a5284j56029
$$ -155143 212926 163742 -142300 -91390 -21907 148602 -299618 -208366 -15284 -171313
18480a71313a0969B42256b14967Q4088r9031r7314a57256q6316A45032a45779
$$ -171313 -10969 242256 -214967 -130879 -229910 -327224 -157256 -243572 145032 -145779
18469c15798e1349B54701d0315p1213j24525a14224A64542b52021A527J10813
$$ -315798 -51349 254701 -40315 -111528 -236053 -114224 164542 -252021 1527 112340
18459A12340i0743A72891a11539A13500b4443j988o5064d3718k60582q626d0015
$$ 112340 -90743 172891 -111539 113500 -24443 -26431 -91495 -43718 -304300 -312926 -40015
18447a72420K1769c86p40l48121i4788j22725K5007d2444k11406c7484H6910b24205
$$ -172420 -150651 -386 -1126 -349247 -94788 -217513 -192506 -42444 -253850 -37484 86910 -224205
18434c58465A9373P6617b150G7349c0808A7103P0445i3663r5895b8166a251j1818
$$ -358465 19373 95990 -2150 77349 -30808 17103 87548 -93663 -189558 -28166 -1251 -13069
18422a3069j85568Q0269L9686F0923b6627A03440J14161a1104B4147N3466L81762
$$ -13069 -198637 -118368 -78682 60923 -26627 103440 217601 -11104 24147 77613 459375
18411D59375d02346C3114J05308E4438b10959Q6529G0130g0526I4939c0410O097
$$ 459375 -402346 33114 138422 54438 -210959 -124430 70130 -70526 94939 -30410 -24313
18400b4313j06046A99270B1290e5249G5689c10592a01749j62406q3953E0963b8019
$$ -24313 -130359 199270 21290 -55249 75689 -310592 -101749 -264155 -348108 50963 -28019
18388A72996E7697b76258j85578J16547a61660j38919O3390H5364m0950J54622
$$ 172996 57697 -276258 -461836 -345289 -161660 -300579 -237189 85364 44414 199036
18378A99036G6100d4506G1706d2974k09209P9508N4507n9475I4861J01648d4272
$$ 199036 76100 -44506 71706 -42974 -252183 -172675 -118168 -177643 94861 196509 -44272
18366a41204I6462a57947D7024i3006J284a6150q3029l10276I9616J45260J8418
$$ -141204 96462 -157947 47024 -93006 -91722 -16150 -99179 -409455 99616 244876 263294
18355B63294H7791h7587C0824d5189A43401A0680a76310G2266b74841J18814c1032
$$ 263294 87791 -87587 30824 -45189 143401 10680 -176310 72266 -274841 -156027 -31032
18343b33064N7840F84P8355g1280k58050E380b40723e0302j02286B37736b56285
$$ -233064 -175224 684 79039 -71280 -329330 5380 -240723 -50302 -152588 237736 -256285
18331b1322p3318A43780J23547I3447h275A53543b10459i2724k06628i1851J9916
$$ -21322 -94640 143780 267327 93447 -8275 153543 -210459 -92724 -299352 -91851 -71935
18320g1935j17089d7412C8929M015c03665a0316G6133c39438e912E5732l712a66642
$$ -71935 -189024 -47412 38929 42944 -303665 -10316 76133 -339438 -5912 55732 52020 -166642
18307b70669J18852f0435o9185c6318o1929M5946o5507F3094b20682A5488P9372
$$ -270669 -151817 -60435 -129620 -36318 -98247 -52301 -117808 63094 -220682 15488 94860
18296I4860N638a07631j72333C555f5653A23499k2784b93341A88164b27339a06937
$$ 94860 100498 -107631 -279964 3555 -65653 123499 100715 -293341 188164 -227339 -106937
18284g7611k8836n3360B4633e9593m07513B6985E985B15O2359K10123b9130m0965
$$ -77611 -106447 -159807 24633 -59593 -467106 26985 5985 215 62574 272697 -29130 -70095
18272g0095F0890b28741n2979f4895j03703M0791D52721B949h5380r9119A07959
$$ -70095 60890 -228741 -281720 -64895 -168598 -127807 452721 2949 -85380 -184499 107959
18260a75193e0668J1011B9766b65144B39648N5411f7621B0043b20222F0527a94214
$$ -175193 -50668 -39657 29766 -265144 239648 295059 -67621 20043 -220222 60527 -194214
18248b40301J07424c5816C0424i4817H62b02482Q2946l0873k38945C18135f8585
$$ -240301 -132877 -35816 30424 -94817 862 -202482 -119536 -150409 -389354 318135 -68585
18236a02723k99319G3122b00847A60937a40441J8294k25946R356A90584o990o0983
$$ -102723 -402042 73122 -200847 160937 -140441 -122147 -348093 -338737 190584 183594 122611
18225A22611a41572d0204n4365C8467b39639E0790d5630j23238A47226h4833c5781
$$ 122611 -141572 -40204 -94569 38467 -239639 50790 -45630 -168868 147226 -84833 -35781
18213c0444B36786a78139B92716c7041A47191a79092L1756f982K543B18907p5381
$$ -30444 236786 -178139 292716 -37041 147191 -179092 -147336 -6982 -4439 218907 143526
18202A43526a82939K4772f0046B47238A19188f2627q063r6255p963j0335R123
$$ 143526 -182939 -158167 -60046 247238 119188 -62627 -70690 -166945 -174908 -185243 -176120
18191a76120f143p9659M1137A00809C7665b33846b9626j43204O4399B32832j11543
$$ -176120 -6143 -85802 -44665 100809 37665 -233846 -29626 -172830 -108431 232832 121289
18180A21289d33979A67948q1122a56347e7352R04j3601H189b97057A31488i049
$$ 121289 -433979 167948 86826 -156347 -57352 -56448 -70049 8189 -297057 131488 -9049
18168E9719b64547N3374J01164B09571I1797A034J10242K0686C0924c16389N4694
$$ 59719 -264547 -211173 -110009 209571 91797 1034 111276 131962 30924 -316389 -261695
18157b61695k934I7413b8870A80691a94838A43079C5459e4680k55734H957b00653
$$ -261695 -264629 97413 -28870 180691 -194838 143079 35459 -54680 -310414 8957 -200653
18145B39503c4681n44162C7360L3910R4477a95158j28769A48489c2475B83918
$$ 239503 -34681 -578843 37360 71270 165747 -195158 -323927 148489 -32475 283918
18134F1492J09a28321A69973b5986D4652c04576O5286J08849M0652l7522G9540
$$ 61492 61601 -128321 169973 -25986 44652 -304576 -239290 -130441 -89789 -127311 79540
18122h3259j34427G3105h9950L409G4372A0317b12570e5410k57799A01945b88286
$$ -83259 -217686 73105 -89950 -86541 74372 10317 -212570 -55410 -313209 101945 -288286
18110A30229c97351h1317C53325I1090K5259a25554j61600c8044A62748J52237
$$ 130229 -397351 -81317 353325 91090 116349 -125554 -287154 -38044 162748 314985
18100C14985b12949A38801b000j08357M6901K6254l86032E2530c65316a31539
$$ 314985 -212949 138801 -2000 -110357 -63456 -37202 -423234 52530 -365316 -131539
18089B31755a97577f4054p0677A18266c07839A9105e4964o4455j2973K7144A44097
$$ 231755 -197577 -64054 -134731 118266 -307839 19105 -54964 -119419 -132392 -105248 144097
18077c44440b5901k75015A27861a93222P2740q728F1441N3285A9179g616o3274
$$ -344440 -25901 -300916 127861 -193222 -120482 -129210 61441 114726 19179 -7616 -70890
18066g0890j2686B9194i7528E3631a5739G084M42643e76490c6146C48923a86114
$$ -70890 -83576 29194 -97528 53631 -15739 7084 449727 -576490 -36146 348923 -186114
18054A76081j9756a04645j87108e9151p3749k7493F1972N2630c6516B02321e4889
$$ 176081 156325 -104645 -291753 -59151 -132900 -160393 61972 114602 -36516 202321 -54889
18042E10620e3171A29401c2346j48843l858A19642K3085c12022A86508p1437B8199
$$ 510620 -53171 129401 -32346 -181189 -185047 119642 142727 -312022 186508 115071 28199
18030a61013d1644j0896j34560C1698a5258n6452b3653l2626j9484J9637j14643
$$ -161013 -41644 -52540 -187100 31698 -15258 -71710 -23653 -56279 -75763 -56126 -170769
18019a70769c4593H8053d78719A63229B3013c7033I8237c4754C17733p5808m9737
$$ -170769 -34593 88053 -478719 163229 23013 -37033 98237 -34754 317733 241925 192188
18008A92188g2055B19824O6264A2103e0700k47889B6176L38605H582a74939A96422
$$ 192188 -72055 219824 286088 12103 -50700 -298589 26176 364781 8582 -174939 196422
17996b09467A04309g0447I7304K6460e7866o6186M4297B3027b4349B09481q3525
$$ -209467 104309 -70447 97304 123764 -57866 -124052 -79755 23027 -24349 209481 125956
17985A25956a4762A73099K53687c29996h5495j34125A5256b24l6269j78873J07490
$$ 125956 -14762 173099 426786 -329996 -85495 -219620 15256 -224 -36493 -215366 -107876
17974a07876h772r9280m7584m5387o3668E2363b34951e6757A17609K01932A12052
$$ -107876 -8772 -108052 -155636 -201023 -264691 52363 -234951 -56757 117609 319541 112052
17962E3425a99769M1108B15659r9423e2164j18824A08847J84417i5981I6969R9578
$$ 53425 -199769 -158661 215659 116236 -52164 -170988 108847 293264 -95981 96969 196547
17951A96547D4572a57196f7611D1558K4938d9280A1463J29058k1310e7877H6595
$$ 196547 44572 -157196 -67611 41558 66496 -49280 11463 140521 119211 -57877 86595
17939A79451o8564b79485B1406d1892J8672a708k90271A4668a98841B20096b06527
$$ 179451 110887 -279485 21406 -41892 -23220 -1708 -291979 14668 -198841 220096 -206527
17927b95933A08388D4585m594b98936A47853b44269B71655b17075E7163M5467
$$ -295933 108388 44585 39991 -298936 147853 -244269 271655 -217075 57163 102630
17917A02630a34624j11667i7162B60070A27139f7905G6912C0584Q7821a03234
$$ 102630 -134624 -246291 -97162 260070 127139 -67905 76912 30584 118405 -103234
17906H9606K32388d2107C2625O2931a84184A8758m832a31852j65059G4457b4079
$$ 89606 321994 -42107 32625 95556 -184184 18758 13926 -131852 -296911 74457 -24079
17894B01802b36807p696A63366f2871j79804A48071a79360O2889j21703J0237
$$ 201802 -236807 -244503 163366 -62871 -242675 148071 -179360 -116471 -238174 -227937
17884b27937p3141a24538d867n0842A42841K3088b11933K8213L2147j19232A05615
$$ -227937 -301078 -124538 -4867 -55709 142841 165929 -211933 -183720 -151573 -270805 105615
17872A8987M1334J33912M8034b12480C07852P1932A38028i4473A2143h9744A71541
$$ 18987 60321 194233 242267 -212480 307852 379784 138028 -94473 12143 -89744 171541
17860b36438g5126B8217L35455C4767a38177G2445i8454J0894L416p6508J3577
$$ -236438 -75126 28217 363672 34767 -138177 72445 -98454 -87560 -84144 -160652 -147075
17849a47075b4961k02150a5539m0204A92898c14574d1590A77953M1976j05338
$$ -147075 -24961 -227111 -15539 -55743 192898 -314574 -41590 177953 219929 114591
17839A14591J4932m8356L1148Q20l6850j0804a04115C53087q4915A32586b95077
$$ 114591 129523 81167 112315 113135 76285 65481 -104115 353087 268172 132586 -295077
17827D9051i2008E4170J86746d1983B3180a96329h8926d2862j18577I649q90d71325
$$ 49051 -92008 54170 240916 -41983 23180 -196329 -88926 -42862 -161439 9649 8759 -471325
17814E254a41367B21313f3387A35041n2307l0223K14215F7420b90627n1608a35109
$$ 5254 -141367 221313 -63387 135041 82734 52511 266726 67420 -290627 -342235 -135109
17802B8108a88359B19857a54730o5063A87182k0729a56436f6251L2333j0529B7186
$$ 28108 -188359 219857 -154730 -219793 187182 166453 -156436 -66251 -33918 -44447 27186
17790A56244p915a29519A53507i9429a488A46944a27358n2991a1565n1508m3525
$$ 156244 148329 -129519 153507 -99429 -1488 146944 -127358 -180349 -11565 -63073 -106598
17779a06598A45438a30471C03298A0175d21784E0492h2170j679I4915b32916J3701
$$ -106598 145438 -130471 303298 10175 -421784 50492 -82170 -83849 94915 -232916 -219215
17768b19215A98573b10318A39641D9406m936h6076K2686I2781a03605G8555C2675
$$ -219215 198573 -210318 139641 49406 44470 -86076 -63390 92781 -103605 78555 32675
17756b13971f636j17908i711A33285o907K41195j67694I5218b45737J20240b5248
$$ -213971 -6636 -124544 -9711 133285 126378 367573 199879 95218 -245737 -125497 -25248
17744c00669B92224b32358q6359A21343b63434c5026k96764J16848e2751A49341
$$ -300669 292224 -232358 -318717 121343 -263434 -35026 -331790 -214942 -52751 149341
17733c8660A26565a57427N7787I6062a11558F1681a99778B87210d8171D12108
$$ -38660 126565 -157427 -99640 96062 -111558 61681 -199778 287210 -48171 412108
17722i4119B12736G4969a00608B10155q7720q031g1231B04565f0429j5669C76676
$$ -94119 212736 74969 -100608 210155 122435 114404 -71231 204565 -60429 -76098 376676
17710C4153a33592b878j29980j96407B1733b66160A48251R581J31164b61o1290
$$ 34153 -133592 -2878 -132858 -329265 21733 -266160 148251 157832 288996 -261 -61551
17699f1551B8796c5665A12389E5502L71928A15345b53470I1103J55815b07362
$$ -61551 28796 -35665 112389 55502 427430 115345 -253470 91103 246918 -207362
17688a35167k0431O9428C05739K26378d1332B27045B4083J44810a51815C7811
$$ -135167 -155598 -86170 305739 532117 -41332 227045 24083 168893 -151815 37811
17677H7479R7478d8323a5631A24180a56898C37519g7939B40241f0668E3762a23188
$$ 87479 184957 -48323 -15631 124180 -156898 337519 -77939 240241 -60668 53762 -123188
17665A6642c0617I9273h0873m772B4027d0597p1966n5992h1655C3563K64417b8163
$$ 16642 -30617 99273 -80873 -85645 24027 -40597 -112563 -168555 -81655 33563 297980 -28163
17652A04410b3423A26241f7077p6462l320a0803A25484c8667D5353J54570b0102
$$ 104410 -23423 126241 -67077 -143539 -146859 -10803 125484 -38667 45353 199923 -20102
17640A19826f4602A63709B1237a99581A12938e0605o369H0090J88323H0109a7661
$$ 119826 -64602 163709 21237 -199581 112938 -50605 -56974 80090 268413 80109 -17661
17628c1803B52463a90152A20748a61935j76520l5203a72456m0537B09248b24423
$$ -31803 252463 -190152 120748 -161935 -338455 -373658 -172456 -212993 209248 -224423
17617i8014B48397i0315H6490J71153f0067D0119a58147j28513J07204B51676
$$ -98014 248397 -90315 86490 257643 -60067 40119 -158147 -286660 -179456 251676
17606A3476J75108o7863K58918I1610a41605G7416A6988K77045A39373a11705
$$ 13476 188584 120721 379639 91610 -141605 77416 16988 294033 139373 -111705
17595H5650a73403A07656Q1462F9991a63818A51739o1985M5243C229a26375J2975
$$ 85650 -173403 107656 189118 69991 -163818 151739 89754 134997 3229 -126375 -113400
17584a13400I8737a99055B4851R6580J7062b44336A34225a21981p5138O4156E25362
$$ -113400 98737 -199055 24851 121431 138493 -244336 134225 -121981 -197119 -132963 525362
17572H9250J64370H9240J73265a20959A97779J83970A42442c875I059i0368M1829
$$ 89250 253620 89240 262505 -120959 197779 381749 142442 -3875 9059 -90368 -48539
17561d8539F028h1413k3890c1277E0871b25249O6101A54011R3424b79369C95500
$$ -48539 6028 -81413 -105303 -31277 50871 -225249 -159148 154011 247435 -279369 395500
17549F7191L5340R8778a72977e4629N323A86914e4864k44640C1315J07640c98892
$$ 67191 102531 201309 -172977 -54629 -49306 186914 -54864 -299504 31315 138955 -398892
17537a13401C91599a91441C3368J92445k4984d2114D7294J63533g0538h039D119
$$ -113401 391599 -191441 33368 225813 200829 -42114 47294 210827 -70538 -8039 4119
17525A82071N1735M4098A04287M4424a31214B50555p9533J31936q6125I9874K51605
$$ 182071 233806 277904 104287 148711 -131214 250555 171022 302958 216833 99874 351479
17514C51479j62236J56649c7550n1326A73859a52424E3652M00765h2746A9380
$$ 351479 189243 345892 -37550 -88876 173859 -152424 53652 454417 -82746 19380
17503i5676C5508j1300J64464a00084B96957A11370K19775h7772j60346K7870
$$ -95676 35508 24208 188672 -100084 296957 111370 331145 -87772 -248118 -220248
17493b20248B01994J97973A55743c6114A25555B4102N91061k74437H4779j650
$$ -220248 201994 399967 155743 -36114 125555 24102 615163 340726 84779 83129
17483H3129a2467D82174d7554B13851J43205b20686B23722a81677A66779a85926
$$ 83129 -12467 482174 -47554 213851 357056 -220686 223722 -181677 166779 -185926
17472C4599P2598K15588c2281B88221b3236E8049P2201m2762K48627a8779A8408
$$ 34599 107197 322785 -32281 288221 -23236 58049 130250 87488 336115 -18779 18408
17460D44833b44575j1602o0280B34930C1832a82211o9571B63155m5462j2025K36665
$$ 444833 -244575 -256177 -316457 234930 31832 -182211 -251782 263155 217693 205668 442333
17449D42333j76224C7606M27504j65400J65044a9383D87538k26978N4943o7630
$$ 442333 266109 37606 465110 299710 464754 -19383 487538 260560 315503 247873
17439B47873I7307L63750A45778a4654n0574A88227J94945j8564l6290A1856J64620
$$ 247873 97307 461057 145778 -14654 -65228 188227 383172 364608 328318 11856 176476
17428A76476P1082b37472c9982C13446J51440j10862A24952Q1411o9513j6818
$$ 176476 247558 -237472 -39982 313446 464886 354024 124952 206363 136850 120032
17418A20032c509C51376m5118J1612A57509l6756J79468E8482r978K12224A15824
$$ 120032 -3509 351376 306258 317870 157509 120753 300221 58482 48504 260728 115824
17406f5825A68511c52525a37308A86946L4884l4091b50168A89226d338A48569
$$ -65825 168511 -352525 -137308 186946 221830 187739 -250168 189226 -4338 148569
17395A94510E4035J74180J42317j49787o9238D6127J68009b53099A50278d54C11004
$$ 194510 54035 228215 370532 220745 151507 46127 214136 -253099 150278 -454 311004
17383h6677H5158O4909i045l915A29546R1757k6580M8314r4767d4232A17718m7518
$$ -86677 85158 150067 -9045 -12960 129546 221303 194723 243037 148270 -44232 117718 70200
17371G0200J38883j02394e3847k62620b8872A81336q0794J94562b5233o337a1967
$$ 70200 209083 106689 -53847 -316467 -28872 181336 100542 295104 -25233 -31570 -11967
17359D87139j17287j75269d64171B59029a1979I6248M4295c7157A44587F1693
$$ 487139 369852 194583 -464171 259029 -11979 96248 140543 -37157 144587 61693
17348E3827a68607B08751j2051J21087G4500M24397e2543a884B88442A29737e1497
$$ 53827 -168607 208751 196700 317787 74500 498897 -52543 -1884 288442 129737 -51497
17336B62744J95043E5118J55319m6568D0562j3744L49048B4926M9281J00586C064
$$ 262744 457787 55118 210437 163869 40562 26818 375866 24926 74207 174793 3064
17324A87786K33399j74374p5159O3197n0345K1841D7631G34L4763J14402a627
$$ 187786 421185 246811 171652 234849 184504 206345 47631 734 35497 149899 -1627
17312C01873A09979a35915e0023C83190G5121C6292a36760F0280K56527d734j48916
$$ 301873 109979 -135915 -50023 383190 75121 36292 -136760 60280 316807 -4734 -153650
17301a53650B57884p7099J78927A46611D8878b61658A89288m4187M1332J12215
$$ -153650 257884 180785 359712 146611 48878 -261658 189288 145101 186433 298648
17291B98648G1015K77282b1388m5264I5207N8583J46607I6475f9532D0415J35415
$$ 298648 71015 348297 -21388 -66652 95207 153790 300397 96475 -69532 40415 175830
17280A75830i4501D9622K69693p0648I0735K72887j08967L9882j06441a8019B62761
$$ 175830 -94501 49622 319315 248667 90735 363622 254655 294537 188096 -18019 262761
17268B12258K3938D1738K87495j12290A01324J07057I2311m3851L38792B6225
$$ 212258 236196 41738 329233 216943 101324 208381 92311 48460 387252 26225
17257E37985A97547P5861K67386B5272J53482J10612J18328k2502I7551K46151
$$ 537985 197547 273408 540794 25272 178754 289366 407694 385192 97551 343702
17247C43702A44406E6006P8699C3889c3153A61792K8106K86553g1908C14609K9425
$$ 343702 144406 56006 134705 33889 -33153 161792 189898 476451 -71908 314609 344034
17236C44034G0309N1207C5964K93521j4766A39163o7027J63063J43096A30257
$$ 344034 70309 121516 35964 329485 314719 139163 72136 235199 378295 130257
17225H6189P3999j7348J41381K31058k40828E2495p773L10423b35422C35651A60275
$$ 86189 160188 142840 284221 515279 274451 52495 44722 355145 -235422 335651 160275
17213F4618M00024l3103H9534L57196C4497L25311A09297a60627A92804L69026
$$ 64618 464642 431539 89534 446730 34497 359808 109297 -160627 192804 561830
17203E61830A27554J74445R9496A61667l0184g8832B52254Q1548J27678j75354
$$ 561830 127554 301999 401495 161667 131483 -78832 252254 333802 461480 286126
17193B86126J40215j41545J3295p8462J87224A26641K66791j5312A1200R2776
$$ 286126 426341 284796 298091 219629 406853 126641 393432 378120 11200 103976
17183A03976K24919l8601M2649J7179j58743L87667E7925L51294j86795J10628
$$ 103976 328895 290294 332943 350122 191379 579046 57925 409219 222424 333052
17173C33052l8550j08561L13456j66917j37255L51840k18223j01064o8600K94102
$$ 333052 294502 185941 499397 332480 195225 547065 328842 227778 159178 453280
17163D53280A25672L58353k04886j1820L66700C06161j37613B6816J61221J56138
$$ 453280 125672 484025 279139 267319 634019 306161 168548 26816 188037 344175
17153C44175G3403K02624J02491K4873A25671K73722j2682j82688J894q3727O4312
$$ 344175 73403 276027 378518 403391 125671 399393 386711 204023 205917 122190 186502
17142A86502M30899B71704J21030L7248P1071o3403j67646J98167k31891K49148
$$ 186502 617401 271704 392734 429982 501053 437650 270004 468171 236280 485428
17132D85428j79708J91818j57235P3758N1301Q9090R8663B00251M0410L22812
$$ 485428 305720 497538 340303 414061 465362 554452 653115 200251 240661 563473
17122E63473k65694j0831K1250k6585J73740j42754L80597l29664j05590K29649
$$ 563473 297779 286948 308198 281613 455353 312599 693196 363532 257942 487591
17112D87591j05539J27107j9484j35962K125P9042L10668B34076K25501A05162
$$ 487591 382052 509159 489675 353713 355838 434880 745548 234076 459577 105162
17101A45147K20771P7685K74878B72293M14970C17936K723L30106A68522r785
$$ 145147 365918 443603 718481 272293 687263 317936 320659 650765 168522 158737
17091A58737L06586r6298O3082O9266j65663L77511B41867k5614J24646I4125
$$ 158737 465323 369025 432107 501373 335710 713221 241867 216253 340899 94125
17080B53346J56129L47378j48942j97932j5631J18998K17492l50122J08744j20825
$$ 253346 409475 756853 607911 409979 394348 513346 730838 380716 489460 368635
17070C68635Q9607K4297H8061K99472N3423M6719J06547A84504M26778B98924
$$ 368635 458242 482539 88061 387533 440956 487675 594222 184504 611282 298924
17059E32308j77705J69496O403j51822J70742O5405B81763K44512n4293P2284
$$ 532308 354603 524099 530502 378680 549422 614827 281763 526275 471982 544266
17049E44266q573J51478m5501j4745B86394M45734k09317j30790n8525L2712K90018
$$ 544266 535693 687171 641670 626925 286394 732128 522811 392021 333496 366208 656226
17038F56226j64603J16591n0555k5428j01326K7267J46895J8201j82956K23133
$$ 656226 491623 608214 557659 532231 430905 458172 605067 623268 440312 663445
17028F63445J537k62283J59290K24726k87283J38000j8007o4084k21654K95375
$$ 663445 664982 402699 561989 786715 499432 637432 619425 555341 333687 629062
17018F29062j82862L21237j30122R7999k40410R3923J31130j73672K01978L1029
$$ 629062 446200 767437 637315 735314 494904 588827 719957 546285 748263 779292
17008G79292N3138j53398q129Q3137L9592K09449j73774j12341K78492k05510
$$ 779292 832430 679032 670903 754040 793632 1003081 829307 716966 995458 789948
16998G89948K20312l52550j05410K63505Q8119o5104J87787l03167L80583E16330
$$ 789948 1010260 657710 552300 815805 903924 838820 1026607 723440 1104023 516330
16987E27130P5590J40569L14475j72418J97107j51187J33797J09871l83558L03355
$$ 527130 602720 743289 1057764 885346 1082453 931266 1065063 1174934 791376 1094731
16977A094731j82030j04455K83592l36768n0270l9653K40173o8290J04228m1501
$$ 1094731 912701 808246 1091838 755070 704800 665147 905320 837030 941258 899757
16967H99757j89465K79252J60492k80684J56030n6084L7300D11305P25568m697
$$ 899757 710292 989544 1150036 869352 1025382 969298 1006598 411305 1136873 1132176
16957A132176m6324j03851J23434m7027M14810n35807N3877L20276k37733k58779
$$ 1132176 1085852 982001 1105435 1058408 1473218 937411 991288 1311564 1073831 815052
16947H15052N15523m52911L36657l3219J45145O8081l44767L03032J06926j62792
$$ 815052 1330575 877664 1214321 1181102 1326247 1394328 1049561 1352593 1459519 1296727
16937A296727L1885k1210J8629j73747J82581k88004L85108j32939P6428k66559
$$ 1296727 1328612 1307402 1326031 1152284 1334865 1046861 1431969 1299030 1375458 1108899
16927A108899K15933K25159k22276R7052j10658K04997k69914L08313k1201J38861
$$ 1108899 1324832 1549991 1327715 1424767 1314109 1519106 1249192 1557505 1536304 1675165
16917A675165j61911N8688l21469J93336k62567O72263n1245l6116k11088Q0638
$$ 1675165 1513254 1571942 1250473 1443809 1181242 1853505 1802260 1766144 1555056 1635694
16907A635694k48095N73558l73007K0715J81875K54050k03808k21929K46810j0193
$$ 1635694 1387599 1961157 1588150 1608865 1790740 2044790 1840982 1619053 1865863 1855670
16897A855670O2014p5326J74483j4242K39001k85540j77544M5556N16813k73817
$$ 1855670 1917684 1842358 2016841 2002599 2241600 1956060 1778516 1824072 2340885 2067068
16887B067068J04518k72143J90815o5884J21960P7469N966L36690m85828N159
$$ 2067068 2171586 1899443 2090258 2024374 2146334 2223803 2229769 2566459 2080631 2085790
16877B085790j42003L84708q3302M73474j95281L16162k67055l7720J96289j6507
$$ 2085790 1943787 2328495 2245193 2718667 2523386 2839548 2572493 2534773 2731062 2714555
16867B714555J9934j63935L3511L10036k91891J45214K3467J77840m0604K10430
$$ 2714555 2734489 2570554 2604065 2914101 2622210 2767424 2790891 2968731 2928127 3138557
16857C138557O237k05074M40380k33479J67491k81247K12066L17514m9666K65639
$$ 3138557 3144794 2939720 3380100 3146621 3314112 3032865 3244931 3562445 3512779 3778418
16847C778418l35441L47469j20241j8479J52919k989K57296K22795n94274L05456
$$ 3778418 3442977 3790446 3670205 3651726 3804645 3801656 4058952 4281747 3687473 3992929
16837C992929R5882K02553k14000K18733J77049j4432J93194K2161N8003Q0231
$$ 3992929 4088811 4291364 4077364 4296097 4473146 4458714 4651908 4674069 4732072 4812303
16827D812303K50627l28010N39882J69746k23898M03973P193l16065L80041j25771
$$ 4812303 5062930 4734920 5274802 5444548 5220650 5624623 5631816 5315751 5695792 5570021
16817E570021M49734k86559o6331O62718M9639P4672K4763M02661Q8405K57900
$$ 5570021 6019755 5733196 5666865 6329583 6379222 6453894 6478657 6881318 6969723 7227623
16807G227623P156K62632j76713P2710P01928o9208K0665J57931N41235J11140
$$ 7227623 7234779 7497411 7320698 7393408 8095336 8026128 8046793 8204724 8745959 8857099
16797H857099J93294K41430K96208J42288K91829J34595M06535j43286N60883
$$ 8857099 9050393 9291823 9588031 9730319 10022148 10156743 10563278 10419992 10980875
16788A0980875L81422L41772M93276K76056J54438J6893L05152M59961N46701
$$ 10980875 11362297 11704069 12197345 12473401 12627839 12644732 12949884 13409845 13956546
16779A3956546K23505N64012O62189L4454L99321N75408Q61869N71621L28304
$$ 13956546 14180051 14744063 15406252 15440706 15840027 16415435 17277304 17848925 18177229
16770A8177229J028686K21367Q22513O96864P53761J040550Q09699P55740O95012
$$ 18177229 19205915 19427282 20249795 20946659 21700420 22740970 23550669 24306409 25001421
16761B5001421J444715P26715J247085P96049J288054J474288Q63932J845593
$$ 25001421 26446136 27172851 28419936 29215985 30504039 31978327 32842259 34687852
16753C4687852J368901J633262J624450K037929J957337K181379K281400K194865
$$ 34687852 36056753 37690015 39314465 41352394 43309731 45491110 47772510 49967375
16745D9967375K616570K586144K942123L031629L935118K779518M032870M001916
$$ 49967375 52583945 55170089 58112212 61143841 65078959 67858477 71891347 75893263
16737G5893263M241651M875178M926718N423420N231052O507184N929112P024532
$$ 75893263 80134914 85010092 89936810 95360230 100591282 107098466 113027578 120052110
16729A20052110P324679O889777P452558P703617P730039P914373P070592P292239
$$ 120052110 127376789 134266566 141719124 149422741 157152780 165067153 172137745 179429984
16721A79429984O341173N564790M621665L218174J916025N16233q24521k311881
$$ 179429984 185771157 191335947 195957612 199175786 201091811 201608044 200783523 198471642
16713A98471642m083104m802572o650018o521456p640493q117939q183753q108279
$$ 198471642 194388538 189585966 182935948 176414492 168773999 160656060 152472307 144364028
16705A44364028q535599p810786p633449p220466p505672o400625n914123o002960
$$ 144364028 135828429 128017643 120384194 113163728 105658056 99257431 93343308 87340348
16697H7340348n059536n122717m853086m228488m097299l521728l529002l021535
$$ 87340348 82280812 77158095 72305009 68076521 63979222 60457494 56928492 53906957
16689E3906957l156665k525395k737847k337092k351207k152597j759253j826222
$$ 53906957 50750292 48224897 45487050 43149958 40798751 38646154 36886901 35060679
16681C5060679j289144j798588j638594j286966j483242r24525j391554o80852
$$ 35060679 33771535 31972947 30334353 29047387 27564145 26639620 25248066 24567214
16673B4567214j203841q91434j110422o24508q79639p74602j133680m57966p11436
$$ 24567214 23363373 22471939 21361517 20737009 19857370 19082768 17949088 17491122 16779686
16664A6779686n82236o40383l41979m92296o97655o73314j67195k30438k36916
$$ 16779686 16197450 15557067 15215088 14722792 14025137 13351823 13184628 12954190 12717274
16655A2717274o69145m73508n05474k25375j29965m47052k29096m92240k64112
$$ 12717274 12048129 11574621 11069147 10843772 10713807 10266755 10037659 9545419 9281307
16646I281307j56737m02166k12606j33607l66483k44951r4116J70393o35275n2776
$$ 9281307 9124570 8722404 8509798 8376191 8009708 7764757 7670641 7841034 7205759 7152983
16636G152983p906m76576k03085j36985j53069j31703J65714n54461J73664k33154
$$ 7152983 7145077 6668501 6465416 6328431 6175362 6043659 6209373 5654912 5828576 5595422
16626E595422j1634j58206k36099n18j8062R6511k98436j82426k64667j111j74358
$$ 5595422 5583788 5425582 5189483 5188965 5170903 5267414 4968978 4786552 4521885 4520774 4346416
16615D346416k425k9046o4190l85967l2118j44430J3942j24157J66109r2679q7475
$$ 4346416 4343991 4314945 4250755 3864788 3832670 3688240 3702182 3578025 3744134 3651455 3563980
16604C563980K9711m8568p4801j49997l53654R5518P1014l41861K36747q2297
$$ 3563980 3593691 3545123 3470322 3320325 2966671 3062189 3133203 2791342 3028089 2945792
16594B945792k65868J29494K65371l95975J50368l07219M950K16131l87000K6188
$$ 2945792 2679924 2809418 3074789 2678814 2829182 2521963 2526913 2743044 2356044 2382232
16584B382232q5922N6524j33362k59679K51660L77414k99936j66058J60354k68979
$$ 2382232 2296310 2352834 2219472 1959793 2211453 2588867 2288931 2122873 2283227 2014248
16574B014248j91735J74934l674J99394m16966J02366p6212j9770j7577Q0126
$$ 2014248 1822513 1997447 1993773 2193167 1776201 1878567 1802355 1782585 1765008 1845134
16564A845134j52212K19659J4891j23749j49712o0348n405q6231k38341L59504
$$ 1845134 1692922 1912581 1927472 1803723 1654011 1593663 1588258 1502027 1263686 1623190
16554A623190J44544n45142N47791k78257K8045K4516j23480Q4922J9550j81806
$$ 1623190 1767734 1222592 1770383 1492126 1520171 1544687 1421207 1506129 1525679 1343873
16544A343873K63279k34109Q5701l65916K17189N1889j05936K8801l0223M8617
$$ 1343873 1607152 1373043 1458744 1092828 1310017 1361906 1255970 1284771 1254548 1303165
16534A303165N1881j77300J22847l2742n0011J38504k08718Q4124l04363L3926
$$ 1303165 1355046 1177746 1300593 1267851 1217840 1356344 1147626 1231750 927387 961313
16524I61313J40257k64666L35368j66640k5631K292o8691L11869n65800N02848
$$ 961313 1101570 836904 1172272 1005632 980001 982293 913602 1225471 659671 1162519
16514A162519n80607R4398J80002M7319J21760k95463J36107J6232k03214J46291
$$ 1162519 581912 676310 856312 903631 1025391 729928 866035 882267 679053 825344
16504H25344J56789j77885q7840M1179K16641k07247M14415m28663P5689B98270
$$ 825344 982133 804248 716408 757587 974228 766981 1181396 752733 828422 298270
16493H50674j12926p0776J73700J02933k22213N6773l56105J14190L35503B65017
$$ 850674 737748 666972 840672 943605 721392 778165 422060 536250 871753 265017
16482E71020K3662R9J97045l15296L35139C82164L47258k69705L62195k96699
$$ 571020 594682 594781 791826 476530 811669 382164 729422 459717 821912 525213
16472E25213k0981K11914j99712R3854C9596N05130j60080M72186C93807N4295
$$ 525213 504232 716146 516434 610288 39596 544726 384646 856832 393807 448102
16462D48102j82781P7988J07318j23585J11118L98483D07605r964K61219O107
$$ 448102 265321 343309 450627 327042 438160 836643 407605 397641 658860 664967
16452F64967r6284n3510j65108j0927m6727K13679j34062K36304j11803l0078
$$ 664967 568683 515173 350065 339138 292411 506090 372028 608332 496529 466451
16442D66451j08391L9756K29118k76615j10439J65521l1422J71695o7463k17007
$$ 466451 358060 397816 626934 350319 239880 405401 373979 545674 478211 261204
16432B61204K15020p1947P920H1633M79148l5388j28459L17667B42529j1636K94635
$$ 261204 476224 404277 412197 81633 560781 525393 396934 714601 242529 230893 525528
16421E25528B11849K1264C4913J56973J12196R3796L66640k76008i2156C52214
$$ 525528 211849 233113 34913 191886 304082 397878 764518 488510 -92156 352214
16410C15937j39722K01645P8396o8731J5453r9499O6792r0702j35917N3967J74551
$$ 315937 176215 377860 456256 387525 402978 303479 370271 279569 143652 197619 372170
16399C72170A53673K51830k4932K861r6097R0262A53386R9634J4149O1934M2490
$$ 372170 153673 405503 380571 383432 287335 377597 153386 253020 267169 329103 371593
16388C71593J94053A37658J33576l7098J27382j16348r5476O30K42968k1333A30784
$$ 371593 565646 137658 271234 234136 361518 245170 149694 150324 393292 371959 130784
16376D95279B03981d1218G0388J06096J13911l7806K3464D0576J42399K97717
$$ 495279 203981 -41218 70388 176484 290395 252589 276053 40576 182975 480692
16366D80692A01836h6650I3688J84889b82452C46836j46532G5162J18419L38692
$$ 480692 101836 -86650 93688 278577 -282452 346836 200304 75162 193581 532273
16356E32273j53865j12305r9173q2262R8492M16820b4585H7948J55803J71381
$$ 532273 378408 266103 166930 84668 183160 599980 -24585 87948 243751 415132
16346D15132l6912e7967G886M42579e7360G6613c4970J6989B79708P5682J6374
$$ 415132 378220 -57967 7886 450465 -57360 76613 -34970 -17981 279708 355390 371764
16335C71764A67937b6220A54135D8851J13676a12665Q087A64369a77502B35906
$$ 371764 167937 -26220 154135 48851 162527 -112665 -104578 164369 -177502 235906
16324E6663c2569A53735f5185p106n5290e4733j08100A53186F0464a5848B2527
$$ 56663 -32569 153735 -65185 -72291 -127581 -54733 -162833 153186 60464 -15848 22527
16312A34370l8639j1818B307e6847A56501K80923A12810R3611F3428A3921L16244
$$ 134370 95731 83913 2307 -56847 156501 437424 112810 206421 63428 13921 330165
16301C30165F5716B3509o891Q8171P7156c9059o6195H8687J45647a39057C61790
$$ 330165 65716 23509 16618 104789 181945 -39059 -105254 88687 234334 -139057 361790
16289B02002H7703K1845J5092m4458A9796k709N2848J91427q769L18288k13345
$$ 202002 87703 109548 124640 80182 19796 17087 69935 261362 252593 570881 357536
16278C57536j33693M1293G4329L50976A1313i5858j80980D5636J34597j0856L6016
$$ 357536 223843 265136 74329 425305 11313 -95858 -276838 45636 180233 169377 205393
16267B05393G5788I033J92993b89717C24683r183C3568R6997a98484B48262q1222
$$ 205393 75788 9033 202026 -289717 324683 315500 33568 130565 -198484 248262 167040
16256A67040K21976a12530M7389K0401J592C4653b53813a093o2410k33603A8354
$$ 167040 389016 -112530 -65141 -44740 -43148 34653 -253813 -1093 -63503 -297106 18354
16244A45762a74199C62769a26310B79018c72710F0293M5188J81160B1040b078
$$ 145762 -174199 362769 -126310 279018 -372710 60293 105481 286641 21040 -2078
16233F1462J53509B7404c3215E4393B2270b29660B34773mf6269D1195L04341j42866
$$ 61462 214971 27404 -33215 54393 22270 -229660 234773 234769 -66269 41195 345536 202670
16221B02670r2133o031P2947b01050f5600A0629L717c3106n6694K7184C06182
$$ 202670 110537 104506 177453 -201050 -65600 10629 14346 -33106 -89800 -62616 306182
16209A44997a94365h1076m7162H3640c14653b2670j51618e0141C41888b78713
$$ 144997 -194365 -81076 -128238 83640 -314653 -22670 -174288 -50141 341888 -278713
16198b24265D9961b7052j1037J6952A88591a7326H2198e8913C6736M0038L717
$$ -224265 49961 -27052 -38089 -21137 188591 -17326 82198 -58913 36736 76774 80491
16187H0491L9025I776h2173b0174F03861c21986a43367m04335A96182g3114a1270
$$ 80491 119516 9776 -82173 -20174 603861 -321986 -143367 -547702 196182 -73114 -11270
16175a87120M1552M4931k93408C6627c02603G4377i4367c9051A71361f9530P254
$$ -187120 -145568 -100637 -394045 36627 -302603 74377 -94367 -39051 171361 -69530 -62276
16164f2276l3866J5038I8644K8698m1929h973B22590M3741J1332A9944R2062a21663
$$ -62276 -96142 -81104 98644 127342 85413 -8973 222590 266331 277663 19944 112006 -121663
16151b47980A38416N4843a10217K6244E8118d25408A93962b02803c824l0629a4649
$$ -247980 138416 193259 -110217 -83973 58118 -425408 193962 -202803 -3824 -34453 -14649
16139b78546f1246A5278Q3713l8501a81756B55270A22475b81851A34892A6733
$$ -278546 -61246 15278 98991 60490 -181756 255270 122475 -281851 134892 16733
16128B27443b66199A80435D45a35802e5l1442m4198A35257c06246A4330J53755
$$ 227443 -266199 180435 445 -135802 -55 -31497 -75695 135257 -306246 14330 168085
16117A68085k4156m4330b53643A93859l9649j7743n5365c75856G4813b50231F7638
$$ 168085 143929 99599 -253643 193859 154210 136467 81102 -375856 74813 -250231 67638
16105B17653E3741b58786C71305D0634J05131a42085e9662B14154h9998A29041
$$ 217653 53741 -258786 371305 40634 145765 -142085 -59662 214154 -89998 129041
16094D2168C84a88223B70209a08490A1144b31593A97188a25824l1431A27350d6507
$$ 42168 384 -188223 270209 -108490 11144 -231593 197188 -125824 -157255 127350 -46507
16082a61748Q111j17776J19351D6089h5676n5586A16880f6219j66704R0293A75128
$$ -161748 -153637 -271413 -152062 46089 -85676 -141262 116880 -66219 -232923 -142630 175128
16070g9832r6102n4608B6026c0253E2890K85022K0174a43354j21179d807n1735
$$ -79832 -175934 -230542 26026 -30253 52890 337912 358086 -143354 -264533 -4807 -56542
16059e6542j05509c3773k30083a19278A29404b0670A1820R1533h6759q0524p952
$$ -56542 -162051 -33773 -263856 -119278 129404 -20670 11820 103353 -86759 -167283 -175235
16048a75235N5424k04898J57663a6597G2851J00533m4755a49744B65151c2626
$$ -175235 -119811 -324709 -167046 -16597 72851 173384 128629 -149744 265151 -32626
16037H8274a26349C9395A2673Q6207i3587B47245b060l74468a83726f5121r482
$$ 88274 -126349 39395 12673 98880 -93587 247245 -2060 -376528 -183726 -65121 -74603
16026g4603k3652B1375K46652A21267O6738g403A70107a20799b4956I1096L807
$$ -74603 -98255 21375 268027 121267 188005 -7403 170107 -120799 -24956 91096 94903
16015I4903e5296A16150a32459p5229a4411I0570O4336a76965d8286m9979b2289
$$ 94903 -55296 116150 -132459 -207688 -14411 90570 154906 -176965 -48286 -98265 -22289
16003A03801H467P5017c28091B23440a33525A9226d9163G6296i4267b7299C6475
$$ 103801 8467 83484 -328091 223440 -133525 19226 -49163 76296 -94267 -27299 36475
15991B79081b96294J00762A40004a74698I6357P8134g4860A81400K70794A51475
$$ 279081 -296294 -195532 140004 -174698 96357 174491 -74860 181400 452194 151475
15980E58806k22252j49649b87713B1564K665b4790a2289F5457a84305D25511a5000
$$ 558806 336554 186905 -287713 21564 24229 -24790 -12289 65457 -184305 425511 -15000
15968b8556k44828C49312b05787i4872j02120E20646k14480j39447b8802A07783
$$ -28556 -273384 349312 -205787 -94872 -196992 520646 306166 166719 -28802 107783
15957b83347f9236L1466H3004d89347D9066a87115j7486F84c81045B00475i6216
$$ -283347 -69236 -37770 83004 -489347 49066 -187115 -204601 684 -381045 200475 -96216
15945c39132m3104f2103n0764r8445J01136A87563d26065D9614b3337A04682c45585
$$ -339132 -382236 -62103 -112867 -211312 -110176 187563 -426065 49614 -23337 104682 -345585
15933B83847c4805r5530a5691j37975C0350K13776a1B6031b50432A09785C5834
$$ 283847 -34805 -130335 -15691 -153666 30350 244126 -11 26031 -250432 109785 35834
15921c0973G488M21373j61653c88470c2973j89588J10412A37649a34309A43135
$$ -30973 7488 428861 267208 -388470 -32973 -222561 -112149 137649 -134309 143135
15910A18557K40847b67949C54841A61111h4631D7876a16266a0124k03137F5360
$$ 118557 359404 -267949 354841 161111 -84631 47876 -116266 -10124 -213261 65360
15899c20705A53941a39513O8224A56427b6516D4471b68339a9705E7793b07891
$$ -320705 153941 -139513 -71289 156427 -26516 44471 -268339 -19705 57793 -207891
15888a11549B0240a1849k11147B49361B2293a31101A60398a27025A72786D5887
$$ -111549 20240 -11849 -222996 249361 22293 -131101 160398 -127025 172786 45887
15877b2965F641b71075J6916l2156B6203K13148c3453j25437F379a5391n40017
$$ -22965 6641 -271075 -254159 -286315 26203 239351 -33453 -158890 6379 -15391 -555408
15866e55408B3420b46587h5089k68178J32649d697B27924F3720P1967d32686a12194
$$ -555408 23420 -246587 -85089 -353267 -220618 -4697 227924 63720 135687 -432686 -112194
15854A16158m1830R7103b68508A41747a58454Q514j98487a12604A94407o0203
$$ 116158 74328 171431 -268508 141747 -158454 -149940 -348427 -112604 194407 134204
15844A34204l7349Q4570C2756d9248A9426c34862N2450J40734q9994i3258G0259
$$ 134204 96855 181425 32756 -49248 19426 -334862 -282412 -141678 -231672 -93258 70259
15832B68121r8276c5421B21530d38776d237k04881d6284d221j79141k1592q7694
$$ 268121 169845 -35421 221530 -438776 -4237 -209118 -46284 -4221 -183362 -204954 -292648
15821b92648r5428f8229B7814b15795e7897K3852n9303A74197B1681h7772J6091
$$ -292648 -388076 -68229 27814 -215795 -57897 -34045 -93348 174197 21681 -87772 -71681
15810g1681j24476l4778a6420n7938p6705J5787B22458Q982h8169B87719c06199
$$ -71681 -196157 -230935 -16420 -74358 -151063 -135276 222458 231440 -88169 287719 -306199
15798b04852j11615d7433A96605D1986g4692C576P4259a15049G8846j7601i8062
$$ -204852 -316467 -47433 196605 41986 -74692 3576 77835 -115049 78846 61245 -98062
15786E4393a03582j13172A70121d6020A55751a6528j64429B94622B2367a41411
$$ 54393 -103582 -216754 170121 -46020 155751 -16528 -180957 294622 22367 -141411
15775B1338a8484n0863l430D3623b40023A78525F0585j2984P7082c2364j19313
$$ 21338 -18484 -69347 -72777 43623 -240023 178525 60585 47601 124683 -32364 -151677
15764a51677B9974h8774A76831a26659G4942L3855b50275A03363J44866c4899
$$ -151677 29974 -88774 176831 -126659 74942 108797 -250275 103363 248229 -34899
15753F481L26146A36341c2961B17015K669b46630J3271a05925c671D79170F5781
$$ 6481 332627 136341 -32961 217015 219684 -246630 -233359 -105925 -3671 479170 65781
15741C3242d5941C62257a44554I7157b22371I3545m2659c19164F0827B7725K02495
$$ 33242 -45941 362257 -144554 97157 -222371 93545 50886 -319164 60827 27725 230220
15730B30220r1880n5267c65346A01941c4104D9850O7408a50775c0967A6506h3384
$$ 230220 138340 83073 -365346 101941 -34104 49850 117258 -150775 -30967 16506 -83384
15718b55165A71580a99580f7262B91356C4320L6807K5651a13910N0529j60529
$$ -255165 171580 -199580 -67262 291356 34320 71127 96778 -113910 -63381 -223910
15708b23910d2186j02251J0212C20717F2222l0142F7b7602k4395j79836H1923
$$ -223910 -42186 -144437 -134225 320717 62222 32080 67 -27602 -51997 -231833 81923
15696A4992b43606B0054B653J79870a5685E1223M07445G8825a60528B80947f9297
$$ 14992 -243606 20054 2653 182523 -15685 51223 458668 78825 -160528 280947 -69297
15684C78580A01507A652f8421l24988L7227g6679A57509a51105O6416E4446M4106
$$ 378580 101507 1652 -68421 -393409 -356182 -76679 157509 -151105 -84689 54446 98552
15673I8552c66572G1038J51106m1492M4005A11416b05476g6919j85186k47162
$$ 98552 -366572 71038 222144 180652 224657 111416 -205476 -76919 -262105 -509267
15663e09267C8444b6953B16222N1509a9660A18308d67809B24257a73381f4728
$$ -509267 38444 -26953 216222 267731 -19660 118308 -467809 224257 -173381 -64728
15652F29a51111e7456j42686B49813C3293g2391A57302b64326a30037c0747D2985
$$ 629 -151111 -57456 -200142 249813 33293 -72391 157302 -264326 -130037 -30747 42985
15640a36382O4226H8658b3912m6611j98742c8619I7128c53791B16504a37370J2004
$$ -136382 -72156 88658 -23912 -70523 -269265 -38619 97128 -353791 216504 -137370 -125366
15629a25366E228J35223A9684g9079b4052A42654e8849I850L22990h900b925j18224
$$ -125366 5228 140451 19684 -79079 -24052 142654 -58849 9850 332840 -8900 -2925 -121149
15617a21149G5428K51886H9825p217a70083H1278a28045b7231A40784a0008j07847
$$ -121149 75428 327314 89825 82608 -170083 81278 -128045 -27231 140784 -10008 -117855
15606a17855m0320e2511j44463M0911C302N3804J8666a32565I1616b68325A09440
$$ -117855 -158175 -52511 -196974 -156063 3302 57106 75772 -132565 91616 -268325 109440
15594a46657K6594C01225d1318A52963a21742K6657C5463a83472A81353B3757
$$ -146657 -120063 301225 -41318 152963 -121742 -95085 35463 -183472 181353 23757
15583A62740b36803m920P0580g431D9198a82415D1730c21836P8057B32986k469
$$ 162740 -236803 -241723 -171143 -7431 49198 -182415 41730 -321836 -243779 232986 230517
15572B30517h5282K3826E1341c9113l90782a58169K9947N6503n3478A04278P4647
$$ 230517 -85282 -61456 51341 -39113 -429895 -158169 -128222 -71719 -125197 104278 178925
15561A78925C1620K59342A06554J91886R605a32630a9849A01095a12980a7501
$$ 178925 31620 290962 106554 298440 308045 -132630 -19849 101095 -112980 -17501
15550e50651D9437Q3791m3515b24149f9891m143C32097a16701c3932C2907b5091
$$ -550651 49437 133228 89713 -224149 -69891 -74034 332097 -116701 -33932 32907 -25091
15538c6093h730D7184N0835c79048E1275b21313Q914b9755E5894L9547Q617g9025
$$ -36093 -8730 47184 98019 -379048 51275 -221313 -212399 -29755 55894 95441 104058 -79025
15525E5562a18163B27758g3248J6728n2489L8182k1469I9572R443J07257D9501
$$ 55562 -118163 227758 -73248 -56520 -109009 -70827 -92296 99572 109015 216272 49501
15513e5641j17183M4477j33426c8343H4448c3443l341C3936K7452E032L24570
$$ -55641 -172824 -128347 -261773 -38343 84448 -33443 -36784 33936 61388 5032 329602
15502C29602o0022b3458j16740B58264I1810f1655G2015N7572a21137j74737q2884
$$ 329602 269580 -23458 -140198 258264 91810 -61655 72015 129587 -121137 -295874 -378758
15491c78758H300c6902j09573I709a48231M6670d3643g552j37000c4932J2473
$$ -378758 8300 -36902 -146475 9709 -148231 -101561 -43643 -7552 -144552 -34932 -22459
15480b2459j9434A38081g9833c6295j62635b9434r9665B2517L91344d7874A98879
$$ -22459 -41893 138081 -79833 -36295 -198930 -29434 -129099 22517 413861 -47874 198879
15468b47410J4730A15692i1788c9524j84306b9438F3584i220k28195i8201L1016
$$ -247410 -232680 115692 -91788 -39524 -223830 -29438 63584 -9220 -237415 -98201 -67185
15457f7185o4250k93152A35966a82448F4156A6062a70347O2670B88176a43118
$$ -67185 -131435 -424587 135966 -182448 64156 16062 -170347 -107677 288176 -143118
15446g7279A26367C7330d56412f2464A03576g7828A37656b33915N150m4142A44564
$$ -77279 126367 37330 -456412 -62464 103576 -77828 137656 -233915 -228765 -272907 144564
15434B8157O9275K6945J08837m5130f10453f4725O827n1025k4181M938e9750C06313
$$ 28157 97432 124377 233214 188084 -610453 -64725 -57898 -108923 -133104 -128166 -59750 306313
15421a37288b3625A83197f9860A69152b8690A8035a9145j18263G210K7384a04397
$$ -137288 -23625 183197 -69860 169152 -28690 18035 -19145 -137408 7210 34594 -104397
15409A31823b32088H5748R9048b69602Q5567A44655a35154k10251a12380K9392
$$ 131823 -232088 85748 184796 -269602 -184035 144655 -135154 -345405 -112380 -82988
15399h2988o0556H2615c73310m580C38970b12209B2937b06720D60457b34441C31292
$$ -82988 -143544 82615 -373310 -377890 338970 -212209 22937 -206720 460457 -234441 331292
15387d00942B30930c04924A34683g7766A17937e0658J5264A12093p703c77315
$$ -400942 230930 -304924 134683 -77766 117937 -50658 -35394 112093 104390 -377315
15376e0044B38817a48831L4329a8112A83747a52776C40006a35888L2910A2773
$$ -50044 238817 -148831 -114502 -18112 183747 -152776 340006 -135888 -102978 12773
15365A35759b88326E56777b03842c0168j8831G96J44356b66935A37195F4931Q9074
$$ 135759 -288326 556777 -203842 -30168 -48999 796 145152 -266935 137195 64931 154005
15354A54005J49466C597a26345B06286J3503i2360l991j92725E5727J01117G7878
$$ 154005 303471 3597 -126345 206286 219789 -92360 -96351 -289076 55727 156844 77878
15342c44447a1050A31303b33885P9096A38461J58961a066D0930l770a56655C76029
$$ -344447 -11050 131303 -233885 -154789 138461 297422 -1066 40930 37160 -156655 376029
15330h3137K4020B40249r6727a19261r1449B7541a04000C8205e3039q591a60D5553
$$ -83137 -59117 240249 143522 -119261 -210710 27541 -104000 38205 -53039 -61630 -160 45553
15317e6148A1374b45115A84504G8696A1466h5579F1757K4451D1966K13708a6334
$$ -56148 11374 -245115 184504 78696 11466 -85579 61757 86208 41966 255674 -16334
15305a16695A21604i6336A56317O4244j03860B8496b92836A92727b31198J03500
$$ -116695 121604 -96336 156317 220561 116701 28496 -292836 192727 -231198 -127698
15295a27698C23110h4152A00617j333K4669O5006a1085j8763B11779b81774Q641
$$ -127698 323110 -84152 100617 99284 123953 188959 -11085 -29848 211779 -281774 -273133
15284b73133A28495f1712G4517a69551d3883F8996J03863H3025a31310B47438
$$ -273133 128495 -61712 74517 -169551 -43883 68996 172859 83025 -131310 247438
15273H5322K73005j54310M7325A6047J70776B9338b00324A50526c20496A35658
$$ 85322 358327 204017 251342 16047 186823 29338 -200324 150526 -320496 135658
15262c3670B28800N198B4604J34788g3500B07099a30425A52859a05350i33D02257
$$ -33670 228800 233998 24604 159392 -73500 207099 -130425 152859 -105350 -933 402257
15250H1066Q4728K51449L59975J74126J376992j152201K05120J30679E18511H3131
$$ 81066 165794 417243 777218 951344 2328336 1176135 1381255 1511934 518511 83131
15239A82965Q037d8678A74686a50805a760E372K92332i4066p5150a0947A60416
$$ 182965 191002 -48678 174686 -150805 -1760 5372 297704 -94066 -169216 -10947 160416
15227B7661J66445G4109L3854I998c3202B50541c01225J1391G2486B1284N2102
$$ 27661 194106 74109 107963 9998 -33202 250541 -301225 -289834 72486 21284 73386
15216G3386B4492J67775F2901a16588B67407J05244b63521n8794A43255J97243
$$ 73386 24492 192267 62901 -116588 267407 372651 -263521 -322315 143255 340498
15206C40498h8816A7957K24520r9217P6383r5006m4650L8042a95673B53729i2646
$$ 340498 -88816 17957 242477 143260 219643 124637 79987 118029 -195673 253729 -92646
15194A97609a83716A53540L5224M1496p8242Q8520A6344K46960l8785a71695J0830
$$ 197609 -183716 153540 188764 230260 152018 240538 16344 263304 224519 -171695 -160865
15183a60865C0447J91679o0308C8419J72690m0747K03904H1178K99738j30369
$$ -160865 30447 222126 161818 38419 211109 170362 374266 81178 380916 250547
15173B50547O779i5495A17810m759J43652E9660b69424c2693A77442a02385C43098
$$ 250547 257326 -95495 117810 113051 256703 59660 -269424 -32693 177442 -102385 343098
15161i162o1691C49942b8981P05k2461K2199j956k0381B96947b51583H0338d40788
$$ -9162 -70853 349942 -28981 -28276 -50737 -28538 -30494 -50875 296947 -251583 80338 -440788
15148A82874F7661f8950B05464d2241C88625a4250A06971a71319e1430j61578
$$ 182874 67661 -68950 205464 -42241 388625 -14250 106971 -171319 -51430 -213008
15138b13008A33549K18038A71345R0241J92173A89781N5984Q474C6090P545K81021
$$ -213008 133549 351587 171345 261586 453759 189781 245765 254239 36090 43635 324656
15127C24656a19613B46397A15569J07111p9694J0209K5981n7497K10549A58508
$$ 324656 -119613 246397 115569 222680 142986 153195 179176 121679 332228 158508
15116A56734J4216m3323g4058q7252a170A33067A9312L52540f7972b0420I6119
$$ 156734 170950 127627 -74058 -161310 -1170 133067 19312 371852 -67972 -20420 96119
15104F5034b78737A70779O4584E1226K52853O1804F8874J95368q6598F5281O4235
$$ 65034 -278737 170779 235363 51226 304079 365883 68874 264242 177644 65281 129516
15093A29516k063P711K94689j18590I7440J83757a06604A38795n1485J66026p4715
$$ 129516 127453 135164 429853 311263 97440 281197 -106604 138795 87310 253336 178621
15082A78621D0892K15322P8069k9062c0925B05452Q0387A7109M05873A26125m0980
$$ 178621 40892 256214 334283 305221 -30925 205452 285839 17109 422982 126125 85145
15071H5145K03282g1890B30010b19671H022L1518P3737m2096M18926j18930q482
$$ 85145 288427 -71890 230010 -219671 8022 39540 113277 71181 490107 371177 362695
15060C62695c69220a04742A05007D3743J61094o0717i2997C375g8762E9592Q9828
$$ 362695 -369220 -104742 105007 43743 204837 144120 -92997 3375 -78762 59592 149420
15049A49420c51746H9949R7690R7585l2855H7272J20985P8790d9412j39918B23492
$$ 149420 -351746 89949 187639 285224 252369 87272 208257 287047 -49412 -189330 223492
15037A51869j0552B5897j2637L83901j01565A9891J98653m1664a22736A54073
$$ 151869 141317 25897 13260 397161 295596 19891 218544 176880 -122736 154073
15026D00663A32296J17140A05457L74827B30252F3359M4367M5684K1744b29699
$$ 400663 132296 249436 105457 480284 230252 63359 107726 153410 175154 -229699
15015A98266M0125L91486B51941p4303N9505F6080K29435K49843A53682J35118
$$ 198266 238391 629877 251941 177638 237143 66080 295515 545358 153682 288800
15005B88800K80956B54729K7053j9720g9061C80072e5428B89230B4012J30100
$$ 288800 569756 254729 281782 262062 -79061 380072 -55428 289230 24012 154112
14995A54112M25708A29369O3844h5272C00699J86373j32958a47911A43160J37906
$$ 154112 579820 129369 193213 -85272 300699 487072 354114 -147911 143160 281066
14985B81066f2403A84214K59553B21421m6112G1438q592a5151D56890h0908B27362
$$ 281066 -62403 184214 443767 221421 175309 71438 62846 -15151 456890 -80908 227362
14973A43401M5325E7021J66055H6471K12620A01877a64203A89109M8320n5328
$$ 143401 188726 57021 223076 86471 299091 101877 -164203 189109 237429 182101
14963A82101D1805K98620O0964A39439E1583K75010D7097M61711g5818B35743
$$ 182101 41805 340425 401389 139439 51583 326593 47097 508808 -75818 235743
14952E12353k51876l0941p9691L43153A34951N7743j6955Q1806D5417K17149d8487
$$ 512353 260477 229536 149845 492998 134951 192694 175739 257545 45417 262566 -48487
14940A72815L93283p9000j35617K22116j11456r9390N0336j06463L3657q795P3518
$$ 172815 566098 487098 351481 573597 462141 362751 413087 306624 340281 331486 405004
14929D05004p8734p1338q7023K97268r0601k050P7523j11835j49387E4650K0399
$$ 405004 326270 254932 167909 465177 374576 372526 450049 338214 188827 54650 75049
14918G5049L48750H5660K27038M2827o3272j13466L06233A80507O42614C94640
$$ 75049 423799 85660 312698 355525 292253 178787 485020 180507 823121 394640
14907C79209A82679q3402K27064K23097B14130r3874N4280J08739A17316a07688
$$ 379209 182679 99277 326341 549438 214130 120256 174536 283275 117316 -107688
14896B61791P1994A50761J83502J11516j82703L4708L5950B0123J62719L01026
$$ 261791 333785 150761 334263 445779 263076 297784 333734 20123 182842 483868
14886D83868A40196K05188O5131j7647m1553E9794K67625J75563A86267K09483
$$ 483868 140196 345384 410515 392868 351315 59794 327419 502982 186267 395750
14876C95750j03171q4940P3561K96246k65191J05938j34323K41894k15091q7916
$$ 395750 292579 207639 281200 577446 312255 418193 283870 525764 310673 222757
14866B22757K31654J95963B91334k5381I0257L42930O2836j27144K99026l16696
$$ 222757 454411 650374 291334 265953 90257 433187 496023 368879 667905 351209
14856C51209K41029B71190j13362K73511A77926L40927m1975J63617l6623B90234
$$ 351209 592238 271190 157828 431339 177926 518853 476878 640495 603872 290234
14845D86742Q3661j11262K28384j98324r1847J09569j91671j26402K81346J50593
$$ 486742 570403 459141 687525 489201 397354 506923 315252 188850 470196 620789
14835F20789j89550J82213j57028j50440J2464J78210l4877k07251M07101B62291
$$ 620789 431239 613452 456424 305984 318448 496658 461781 254530 661631 262291
14824F80691l26971L83060l58341L545j87003M4476P0696J80090j37603Q8946
$$ 680691 353720 736780 378439 381984 194981 239457 310153 490243 352640 441586
14814D41586q3761k702R9497o7675R4519j76774J02039P9359k30915M07131A00005
$$ 441586 357825 355123 454620 386945 481464 304690 406729 486088 255173 662304 100005
14802D30830Q5106R3943N7324l13298O08751B87543J55307K2756j47329C2410
$$ 430830 515936 609879 667203 353905 962656 287543 442850 465606 318277 32410
14791F21804K27479B37187J21882L99654M4473j86725k21151m0226K48635k37480
$$ 621804 849283 237187 359069 758723 803196 616471 395320 355094 603729 366249
14781C66249J51527K95334k21337M4515j68820J17010R1289r3147J76591k08553
$$ 366249 517776 813110 591773 636288 467468 584478 675767 582620 759211 550658
14771E50658j54062M31728M6785l22213O7600k6504M4519k93349M35444C34310
$$ 550658 396596 828324 875109 552896 620496 593992 638511 345162 780606 334310
14760G67742l43825j1409J20896N4923N7504j94080Q2074j0884r7461L82185k03842
$$ 767742 423917 412508 533404 588327 645831 451751 533825 522941 425480 807665 603823
14749F03823p0013J66731n4255J66120j98105J53102K5360J22150l5191j22574
$$ 603823 533810 700541 646286 812406 614301 767403 792763 914913 879722 757148
14739G57148j48237L3806Q1594K58792B13515P48081D24299P06761l90009J1642
$$ 757148 608911 642717 724311 983103 213515 961596 424299 1131060 741051 752693
14729G52693q8829K5975J61051j26085p7355J87050R1736q0305j16051L00908
$$ 752693 663864 689839 850890 724805 647450 834500 926236 845931 729880 1030788
14719A030788k77037O22697o66463j56506J88341j17485M2748M563L50505k16978
$$ 1030788 753751 1376448 709985 553479 741820 624335 667083 671646 1022151 805173
14709H05173l60877K66476q8952K09915J22035L05271r9244k68807J16846k63603
$$ 805173 444296 710772 621820 831735 953770 1259041 1159797 890990 1007836 744233
14699G44233J78220O2846j55569J39716r7953L08039m15048M0929K39887k165
$$ 744233 922453 985299 829730 969446 871493 1179532 764484 805413 1045300 1043135
14689A043135k63543k6057J63326n7340K56022j47337k15277N15445k76056k39661
$$ 1043135 779592 753535 916861 859521 1115543 968206 752929 1268374 992318 752657
14679G52657M1819K34207k73592L02287M0543O9386m1005j04430J04576L2232
$$ 752657 794476 1028683 755091 1057378 1097921 1167307 1126302 1021872 1126448 1158680
14669A158680j596j11805l3424R1341o4577r6726K7649J24372l302M8559J79845
$$ 1158680 1157084 1045279 1011855 1103196 1038619 941893 969542 1093914 1090612 1139171 1319016
14658A319016r5074n24069O30857l24063J76810N4668Q5306k63311m6759J8482
$$ 1319016 1223942 699873 1330730 1006667 1183477 1238145 1323451 1060140 1013381 1031863
14648A031863L57049j33654Q9183k52553l664K57786o10699P67785l13553k97122
$$ 1031863 1388912 1255258 1344441 1091888 1088224 1346010 735311 1503096 1189543 892421
14638H92421M65470j3853j21071K97880k38804J4070K14157l52401N05969k76944
$$ 892421 1357891 1344038 1222967 1520847 1282043 1296113 1510270 1157869 1663838 1386894
14628A386894m53228M13244M4956j30464J98719j60822K02871j32382L65489m08322
$$ 1386894 933666 1346910 1391866 1261402 1460121 1299299 1502170 1369788 1735277 1326955
14618A326955K00328p6411n9387J21088n25985K06625K13386L76870q3639q8888
$$ 1326955 1527283 1450872 1391485 1512573 986588 1193213 1406599 1783469 1699830 1610942
14608A610942k1307K50103n08466L25566j94288J78367j49403J82626k59266N35231
$$ 1610942 1589635 1839738 1331272 1656838 1462550 1640917 1491514 1674140 1414874 1950105
14598A950105k47779k42789M27056J44406k66185K4022n4144j51175P2778J48789
$$ 1950105 1702326 1459537 1886593 2030999 1764814 1788836 1734692 1583517 1656295 1805084
14588A805084J21198k59159N7140N41155K7501l21219N8187k44909L11519k75922
$$ 1805084 1926282 1667123 1724263 2265418 2292919 1971700 2029887 1784978 2096497 1820575
14578A820575L60259k9564M4363j44564K29467r7748j02099L27510N8861j97719
$$ 1820575 2180834 2151270 2195633 2051069 2280536 2182788 2080689 2408199 2467060 2269341
14568B269341M20575k42129M15681m11211K49018J1436n95325R36802j12458J1329
$$ 2269341 2689916 2447787 2863468 2452257 2701275 2712711 2117386 3054188 2941730 2953059
14558B953059j72614N03609j1408Q1675K53667N94129O10878O15813R31200J568137
$$ 2953059 2780445 3284054 3272646 3354321 3607988 4202117 4812995 5428808 6360008 7928145
14548G928145L807710Q388235J8591817J2059821A8695794G628618r57003l036185
$$ 7928145 11735855 20124090 38715907 50775728 18695794 7628618 6671615 3635430
14540C635430j182122k31233J7068l20416J13465k45434K51265R4708j20315j44077
$$ 3635430 2453308 2222075 2239143 1918727 2032192 1786758 2038023 2132731 2012416 1868339
14530A868339N63709l23959K2531N24061n03052M47822k9843l5741o8002q3985
$$ 1868339 2432048 2108089 2130620 2654681 2151629 2599451 2569608 2533867 2465865 2381880
14520B381880L56478l64043M55547l26209O2714J21494N38532k70539q0969p6810
$$ 2381880 2738358 2374315 2829862 2503653 2566367 2687861 3226393 2955854 2874885 2798075
14510B798075K28290r3436j04656M18331l16378M14447l20810l5314K20057q3412
$$ 2798075 3026365 2932929 2828273 3246604 2930226 3344673 3023863 2988549 3208606 3125194
14500C125194m1502J2990K52842j66041L83491k67460K72464k54171K58456j2511
$$ 3125194 3083692 3096682 3349524 3183483 3566974 3299514 3571978 3317807 3576263 3563752
14490C563752j577j77209K92116J15452j42383Q9121Q6948J9548K70744o4616
$$ 3563752 3562175 3384966 3677082 3792534 3650151 3739272 3826220 3845768 4116512 4051896
14480D051896K37992m3687k28409m02326M78969m8652J61299J2661K40244n4123
$$ 4051896 4289888 4246201 4017792 3615466 4094435 4045783 4207082 4219743 4459987 4405864
14470D405864r8834J86791j2701K80286K81791j85066l5319k25937M74851k51006
$$ 4405864 4307030 4493821 4481120 4761406 5043197 4858131 4822812 4596875 5071726 4820720
14460D820720J68304j36903L65234L4970L3035j4303L0233K43665J2023k13928
$$ 4820720 4989024 4852121 5217355 5252325 5285360 5271057 5301290 5544955 5556978 5343050
14450E343050K24990M48283l60405j09815N96683k47689K42752j65021K25083
$$ 5343050 5568040 6016323 5655918 5546103 6142786 5895097 6137849 5972828 6197911
14441F197911J84037J48067j44190M82058j36998n5171N1486M22125j80738K20009
$$ 6197911 6381948 6530015 6385825 6867883 6730885 6675714 6727200 7149325 6968587 7188596
14431G188596j27033J2445K55506j16884M59129j26099J71119k2924N26605N6046
$$ 7188596 7061563 7074008 7329514 7212630 7671759 7545660 7716779 7693855 8220460 8276506
14421H276506J54426j36597N1100K69017R7298L92520J17840p7922j28121L06707
$$ 8276506 8430932 8294335 8345435 8614452 8711750 9104270 9222110 9144188 9016067 9322774
14411I322774L49814j4056K68185k09803M46185N98909k37002J07823J61388K36182
$$ 9322774 9672588 9658532 9926717 9716914 10163099 10762008 10525006 10632829 10794217 11030399
14401A1030399J79992k88001N87703Q552L72802J84651K01824J52454L05138L03259
$$ 11030399 11210391 10922390 11510093 11518645 11891447 12076098 12277922 12430376 12735514 13038773
14391A3038773p7426K73699M66338j60451N89424N14642j47441J55858M49993
$$ 13038773 12961347 13235046 13701384 13540933 14130357 14644999 14497558 14653416 15103409
14382A5103409J07987L93424M74749j24290M56865M46736K13442M21511J72072
$$ 15103409 15211396 15604820 16079569 15955279 16412144 16858880 17072322 17493833 17665905
14373A7665905L28671M72890J64133R06215K08898L40318J59223O19830L79297
$$ 17665905 17994576 18467466 18631599 19537814 19746712 20087030 20246253 20866083 21245380
14364B1245380P71737L66833K87202M68370Q06708M10563O77359Q33104J63879
$$ 21245380 22017117 22383950 22671152 23139522 23946230 24356793 25034152 25867256 26031135
14355B6031135M21848J197376L55422P12831K86406J196174N98405O26925J129081
$$ 26031135 26452983 27650359 28005781 28718612 29005018 30201192 30799597 31426522 32555603
14346C2555603N59201P89756R00319Q87954J111326Q59871J512261R38007R84723
$$ 32555603 33114804 33904560 34804879 35692833 36804159 37664030 39176291 40114298 41099021
14337D1099021R57285J282803J121069J502157J141153J724301J291556J523371
$$ 41099021 42056306 43339109 44460178 45962335 47103488 48827789 50119345 51642716
14329E1642716J987605J482134K042553J530760K016898J944235K077210K329626
$$ 51642716 53630321 55112455 57155008 58685768 60702666 62646901 64724111 67053737
14321F7053737K466185K397547K496190K656344K542220L290574L132882L214018
$$ 67053737 69519922 71917469 74413659 77070003 79612223 82902797 86035679 89249697
14313H9249697L861890L412464L882338M154928M344578M410773M828387M996174
$$ 89249697 93111587 96524051 100406389 104561317 108905895 113316668 118145055 123141229
14305A23141229N404810N231554N807281O211099O239828P091357P419753P276211
$$ 123141229 128546039 133777593 139584874 145795973 152035801 159127158 166546911 173823122
14297A73823122Q227797Q502687R116674R363322J0066117J0741828J0642341
$$ 173823122 182050919 190553606 199670280 209033602 219099719 229841547 240483888
14290B40483888J1431304J1936333J2379255J2583121J3549661J3431207J4186246
$$ 240483888 251915192 263851525 276230780 288813901 302363562 315794769 329981015
14283C29981015J4136637J4662946J4475315J4286394J3962710J3319650J2593412
$$ 329981015 344117652 358780598 373255913 387542307 401505017 414824667 427418079
14276D27418079J1552135R916260Q330646O116092J409329j73388j213116K01866
$$ 427418079 438970214 448886474 457217120 463333212 464742541 464569153 463356037 463557903
14268D63557903k468586n337524r234936j1329536j3674409j4763366j5467525
$$ 463557903 461089317 455751793 446516857 435187321 421512912 406749546 391282021
14261C91282021j5833253j6143853j6034612j6137284j5378149j5190897j5077695
$$ 391282021 375448768 359304915 343270303 327133019 311754870 296563973 281486278
14254B81486278j3927444j2875842j2213524j2126984j1837550j0843595j0287747
$$ 281486278 267558834 254682992 242469468 230342484 218504934 207661339 197373592
14247A97373592r932611r246287q254530p824103p413057p549344o785471o254174
$$ 197373592 187440981 178194694 169940164 162116061 154703004 147153660 140368189 134114015
14239A34114015o220905n182844n339595n267086m630093m493288m380460l731965
$$ 134114015 127893110 122710266 117370671 112103585 107473492 102980204 98599744 94867779
14231I4867779l417559l515178l310177l444045l324584k744326k790369k537578
$$ 94867779 91450220 87935042 84624865 81180820 77856236 75111910 72321541 69783963
14223F9783963k651154k229830k450779j972829j765785j853425k170767j756207
$$ 69783963 67132809 64902979 62452200 60479371 58713586 56860161 54689394 52933187
14215E2933187j699275j562734j069592j617589j670816j359003j007872j138061
$$ 52933187 51233912 49671178 48601586 46983997 45313181 43954178 42946306 41808245
14207D1808245j238390q27712j273414j236371j023299j165433n13992p06782
$$ 41808245 40569855 39742143 38468729 37232358 36209059 35043626 34529634 33822852
14199C3822852q64941j042874o37289j085211q24412k73817p59027n46316r68663
$$ 33822852 32957911 31915037 31277748 30192537 29368125 29094308 28335281 27788965 26820302
14190B6820302n56403p25481m56250m18948q58299k12480q97876j59440l78846
$$ 26820302 26263899 25538418 25082168 24663220 23804921 23592441 22694565 22535125 22156279
14181B2156279p15011n45325o37192j8238j08190o09766j08218n40523l15540
$$ 22156279 21441268 20895943 20258751 20240513 20132323 19522557 19414339 18873816 18558276
14172A8558276n43189l08242l43588m79899m47993j6299l00899m62829j69275
$$ 18558276 18015087 17706845 17363257 16883358 16435365 16419066 16118167 15655338 15486063
14163A5486063j85269k21705m54598j88564k69911m23183k77916k05463r3740
$$ 15486063 15300794 15079089 14624491 14435927 14166016 13742833 13464917 13259454 13165714
14154A3165714l7575k30996l43001l34999n05193J98037l19214O6046m82439N9230
$$ 13165714 13128139 12897143 12554142 12219143 11713950 11911987 11592773 11658819 11176380 11235610
14144A1235610j60443l19776j89087q7362J24034m10096q946o3958l63733j58456
$$ 11235610 11075167 10755391 10566304 10478942 10602976 10192880 10183934 10119976 9756243 9597787
14134I597787j92569k40179K1482k22125O0613l33512j7532Q9245L4617l06109
$$ 9597787 9405218 9165039 9186521 8964396 9025009 8691497 8673965 8763210 8797827 8491718
14124H491718l70686K25569K4282m97952M38422n53911k57652Q1323O6656m63801
$$ 8491718 8121032 8346601 8370883 7872931 8311353 7757442 7499790 7581113 7647769 7183968
14114G183968L14849k51774J2731O1530m83290J25665j4650k93548o8386k71404
$$ 7183968 7498817 7247043 7259774 7321304 6838014 6963679 6949029 6655481 6587095 6315691
14104F315691J21427r8032n2665o3578k24836M08480l42011K81646n71247k4125
$$ 6315691 6437118 6339086 6286421 6222843 5998007 6406487 6064476 6346122 5774875 5750750
14094E750750K19375l54464l1557J89511k78949k64175K56355l98989K2023J06683
$$ 5750750 5970125 5615661 5584104 5773615 5494666 5230491 5486846 5087857 5109880 5216563
14084E216563p1229j39920k39845J72488J14667k34916j07204K66135l43099j14242
$$ 5216563 5145334 5005414 4765569 4938057 5052724 4817808 4710604 4976739 4633640 4519398
14074D519398Q9229J42367j02246P3989l21691K70694n15953O4205J12348m7740
$$ 4519398 4608627 4750994 4648748 4722737 4401046 4671740 4155787 4219992 4332340 4284600
14064D284600k56935k61931M61792Q6860j45110k07527J37943j19587j42101R4693
$$ 4284600 4027665 3765734 4227526 4314386 4169276 3961749 4099692 3980105 3838004 3932697
14054C932697p9865M431q3074R3847k38490J30686J85260m10633j01189K86930
$$ 3932697 3852832 3857263 3774189 3868036 3629546 3760232 3945492 3534859 3433670 3720600
14044C720600j19648J47986m96727J6100j64j13797L13075m98308J33056j16385
$$ 3720600 3600952 3748938 3252211 3268311 3268147 3154350 3467425 2969117 3102173 2985788
14034B985788L24770J37194j59216j778k91695L13685k16666j21074J07512l23809
$$ 2985788 3310558 3447752 3288536 3286758 2995063 3308748 3092082 2971008 3078520 2754711
14024B754711K23450l01881R7677m8509m2646j17634J75871j04467K18487n18036
$$ 2754711 2978161 2676280 2773957 2725448 2682802 2565168 2741039 2636572 2855059 2337023
14014B337023K07387j26926J74010M7235J89063k08610J9925k87223J20381j12852
$$ 2337023 2544410 2417484 2591494 2638729 2827792 2619182 2639107 2351884 2472265 2359413
14004B359413L70888m21606K38641k84800o4824q5903M05115k08667K74712m04906
$$ 2359413 2730301 2308695 2547336 2262536 2197712 2111809 2516924 2308257 2582969 2178063
13994B178063j0400M01893k86145N52510K28426J003868K888122N981415J7713104
$$ 2178063 2167663 2569556 2283411 2835921 3064347 4068215 6956337 12937752 30650856
13985C0650856K1340472B5567872A1676039n091908j597199p66474n31977J86795
$$ 30650856 51991328 25567872 11676039 6584131 4986932 4220458 3688481 3875276
13977C875276n43974j46035k64289k4958j79650j06330k77716P1086M8048q3596
$$ 3875276 3331302 3185267 2920978 2896020 2716370 2610040 2332324 2403410 2451458 2367862
13967B367862L12165n72813K69387R179m92806L53343m4709J79128R09n4773l30628
$$ 2367862 2680027 2107214 2376601 2385780 1892974 2246317 2201608 2380736 2381645 2326872 1996244
13956A996244j4640J92216l31163J81335k31637L42330m7518l89987J60976L22929
$$ 1996244 1981604 2173820 1842657 2023992 1792355 2134685 2087167 1697180 1858156 2181085
13946B181085n59897P34465l84012L05431l82991J31775p7373k44321r3535J70988
$$ 2181085 1621188 2355653 1971641 2277072 1894081 2025856 1948483 1704162 1610627 1781615
13936A781615q2000j8528J7402n6900J04404p9177K41013j79813R2571j05548
$$ 1781615 1699615 1681087 1698489 1641589 1745993 1666816 1907829 1728016 1820587 1715039
13926A715039j41405n5832l10238O93615n99481J97814K05219l59874M53409k17462
$$ 1715039 1573634 1517802 1207564 1901179 1301698 1499512 1704731 1344857 1798266 1580804
13916A580804P2372k92983M62451k30373K0623Q6884l64916J45755J06975j16347
$$ 1580804 1653176 1360193 1822644 1592271 1612894 1699778 1334862 1480617 1587592 1471245
13906A471245j56570q6257K35950k25598M11306k37918L9464q5247m4032J52737
$$ 1471245 1314675 1228418 1464368 1238770 1650076 1412158 1451622 1366375 1322343 1475080
13896A475080k93902L73272n8557k69634J76570o5161R4100m83874P3874L35424
$$ 1475080 1181178 1554450 1495893 1226259 1402829 1337668 1431768 947894 1021768 1357192
13886A357192K75915n91973J50050k40987K25846O1646j46126J51317J76292m03774
$$ 1357192 1633107 1041134 1191184 950197 1176043 1237689 1091563 1242880 1419172 1015398
13876A015398L36301k24535J40099J26614k02243j04376K57311l79206K76574
$$ 1015398 1351699 1127164 1267263 1393877 1191634 1087258 1344569 965363 1241937
13867A241937j83820Q7263K20421n3360j36387p7614l0780M9030K61712n9835
$$ 1241937 1058117 1145380 1365801 1312441 1176054 1098440 1067660 1116690 1378402 1318567
13857A318567o7750l54716J67875K60600j2983k21346l64253L15761k21879J38205
$$ 1318567 1250817 896101 1063976 1324576 1311593 1090247 725994 1041755 819876 958081
13847I58081J09943K17099j28080j62933k7715J47694R1644J17624l12544J57569
$$ 958081 1068024 1285123 1157043 994110 966395 1114089 1205733 1323357 1010813 1168382
13837A168382r6175j342J87685j48708q7943m06042M96951j16947N2073l35545
$$ 1168382 1072207 1070865 1258550 1109842 1021899 615857 1112808 995861 1047934 712389
13827G12389K03051L86035l94611o7623J01031j28506k2542L10303m5628j68312
$$ 712389 915440 1301475 906864 839241 940272 811766 789224 1099527 1053899 885587
13817H85587q1995N49483n62197n3493l6505J45304k03779L42779k48844J89159
$$ 885587 803592 1353075 790878 737385 700880 846184 642405 985184 736340 925499
13807I25499P633N6740k90098Q9669K15261m21546K40274J57344k70989P1964
$$ 925499 933132 989872 699774 789443 1004704 583158 823432 980776 709787 781751
13797G81751Q903J97214j48182k52330K52955J66582k82395J0044m7483l6399
$$ 781751 790654 987868 839686 587356 840311 1006893 724498 734542 687059 650660
13787F50660J700l1147j60802K78840J78657J77283j62999p410k35821j08940
$$ 650660 652360 621213 460411 739251 917908 1095191 932192 924782 688961 580021
13777E80021K9222K04131j6623R7289j44493R0341j02640R4978o1631j63343P4330
$$ 580021 609243 813374 796751 894040 749547 839888 737248 832226 770595 607252 681582
13766F81582J32846j90644J4505r925L4030l1760j87283O00095k64153j6370k05138
$$ 681582 814428 623784 638289 628364 662394 630634 443351 1043446 779293 762923 557785
13755E57785K98961j47218K50548l86181M3198K36688k57348k9028J10723J73747
$$ 557785 856746 709528 960076 573895 617093 853781 596433 567405 678128 851875
13745H51875j59620K30394M1284k24050K417r9073j11783P7722L5063j40012J6638
$$ 851875 692255 922649 963933 739883 742300 643227 531444 609166 644229 504217 520855
13734E20855j90692L99086r2008Q6417j7637P0771j28664L68013m83443N01032
$$ 520855 330163 729249 637241 723658 706021 776792 648128 1016141 532698 1033730
13724A033730l85685J6473j46536K61655k44001l0106L14447k08219R2472r7742
$$ 1033730 648045 664518 517982 779637 535636 505530 819977 611758 704230 606488
13714F06488L8479Q3853C03813O06497l31713j79299L5755J04048J07468O3629
$$ 606488 644967 728820 303813 910310 578597 399298 435053 539101 646569 710198
13704G10198J13506j25793k38814M17638B01045L35603K37631k50927j16628L26361
$$ 710198 823704 697911 459097 876735 201045 536648 774279 523352 406724 733085
13694G33085l15997J04519K65212j00272m0484j85964K31339C23287O4837N0897
$$ 733085 417088 521607 786819 686547 646063 460099 691438 323287 388124 439021
13684D39021M56396D32746L03399l05236R4487O0432j8920J75089l34131M61088
$$ 439021 895417 432746 736145 430909 525396 585828 566908 741997 407866 868954
13674H68954B83921l1478N01884k49175k27871m0853L98603k10981A62706m3258
$$ 868954 283921 252443 754327 505152 277281 236428 635031 424050 162706 119448
13664A19448N5433L86893P6449j01460L41896k35998K9861k19116A81676J72196
$$ 119448 174881 561774 638223 536763 878659 642661 672522 453406 181676 353872
13654C53872L2894j1435p482r9257M13856j99234j48375m0104J91719K3623A64604
$$ 353872 386766 375331 367849 268592 682448 483214 334839 294735 486454 510077 164604
13642B83674L01275K2335B04764L23124j10403j31364r65j26331L80070B10170
$$ 283674 584949 607284 204764 527888 417485 286121 285156 158825 538895 210170
13631F69242k37814m6967Q9917j2281q2754j80073k0350L11705p7258K8043j96166
$$ 669242 431428 384461 474378 462097 379343 199270 178920 490625 413367 441410 245244
13620B45244L04410j70038L37180B72410Q8567J04592K03842k16629j22044J24328
$$ 245244 549654 379616 716796 272410 360977 465569 669411 452782 330738 455066
13610D55066P3642o214j68765k1763M27414k59905K8910l123p4409L5957H2570
$$ 455066 528708 522494 353729 331966 759380 499475 528385 525262 450853 486810 82570
13598G82971k53061J39392k04138R0591j42282m1679J03769K6701A02960K43580
$$ 782971 529910 669302 465164 555755 413473 371794 475563 502264 102960 346540
13588C46540q8482L45501A48546J8358L00004R8624k21185N2872l718m0417M0165
$$ 346540 258058 603559 148546 166904 466908 565532 344347 397219 393501 353084 393249
13577C93249J7302A88267K40576C2644M67432j76805A36625M70292A99442J25087
$$ 393249 410551 188267 428843 32644 500076 323271 136625 606917 199442 324529
13567C24529p4331J83903A47662J22387K19588A78232K40395j38102A13622J56170
$$ 324529 250198 434101 147662 270049 489637 178232 418627 280525 113622 269792
13557B69792P779A32284J76093l0333n2931J72338P3255j81424J84292j95789
$$ 269792 277571 132284 308377 278044 225113 397451 470706 289282 473574 277785
13547B77785J63292M2043j60936b1598D33979j26250b43269E08507q7231j41476
$$ 277785 441077 483120 322184 -21598 433979 307729 -243269 508507 421276 279800
13537B79800M3714J32394j13150k5004J62435k33847Q5207L7592J23754A09590
$$ 279800 323514 455908 342758 317754 480189 246342 331549 369141 492895 109590
13526D51017j55501K23273K1351c8636C64144N2540j53058J62231A85951o369
$$ 451017 295516 518789 540140 -38636 364144 416684 263626 425857 185951 179582
13516A79582J54705A23291J08447K20813m9208I6940J32037L13416A58324M569
$$ 179582 334287 123291 231738 452551 403343 96940 228977 542393 158324 162893
13506A62893J47069a0635C32466A50525K96871J54351j71926p7990j22311M04524
$$ 162893 309962 -10635 332466 150525 447396 601747 429821 351831 229520 634044
13496F34044B62515J46722A87817K0578R8164J7072j07248l4437K48824F5981
$$ 634044 262515 409237 187817 208395 306559 323631 216383 181946 430770 65981
13485A23343K43654J34891E7762M14148A70678K2488m9234a53833A26842N9983
$$ 123343 366997 501888 57762 471910 170678 193166 143932 -153833 126842 186825
13475A86825m0094o9744L53274i7137C29280J2781A21690K58682J85514A67675
$$ 186825 146731 76987 430261 -97137 329280 342061 121690 380372 565886 167675
13464C32691R9069r1230l3323K703J4789N8144j74154b1305C10353o6561A01916
$$ 332691 431760 340530 307207 309910 324699 382843 208689 -21305 310353 243792 101916
13452E03519E3540J76991r4003F1319O1343k8017b25159D40420j84658J38112
$$ 503519 53540 230531 136528 61319 122662 94645 -225159 440420 255762 393874
13442C93874k4707A46203L02783k10549L28753K69693A32589c5254C29194a17050
$$ 393874 369167 146203 448986 238437 567190 836883 132589 -35254 329194 -117050
13431B89495L2371j4761O947K774C2580K00316K2733q214C6034K76673j12828
$$ 289495 321866 307105 314052 316826 32580 232896 255629 247415 36034 312707 199879
13420A99879J20760K1329F0605K17119r5861O5234J93687b01128A57505J98710
$$ 199879 320639 341968 60605 277724 181863 247097 440784 -201128 157505 356215
13410C56215C7396M05054A4846R9272j4877l8526e63A85774N9850q1912B5543
$$ 356215 37396 442450 14846 114118 99241 60715 -563 185774 245624 163712 25543
13398D52042J0496j86871r592j03199J73992j27850H7648L50773N4247j28583
$$ 452042 462538 275667 266075 162876 336868 209018 87648 438421 492668 364085
13388C64085F3279Q2856Q137P7055j07189C2213L05885A47144o0271M1979L71918
$$ 364085 63279 146135 154272 231327 124138 32213 338098 147144 86873 128852 500770
13377E00770M249A40893J2458o4828i1807C96259d2432B60579j209J05694m6905
$$ 500770 505019 140893 153351 88523 -91807 396259 -42432 260579 259370 365064 318159
13366C18159b202B78185L52114C00033A06297D0348L03579l5647A03643R1292
$$ 318159 -2202 278185 630299 300033 106297 40348 343927 308280 103643 194935
13356A94935q3657a93071H31M9937K34571m8285j13614J25534n161k3735H5899
$$ 194935 111278 -193071 831 50768 285339 237054 123440 248974 243813 220078 85899
13344B26817J18831G3610J75063j01083J77601M2885K17557B91063c1048B30683
$$ 226817 345648 73610 248673 147590 325191 368076 585633 291063 -31048 230683
13333C80077O3774j3472A35762o6061K44712D7999K38910A2912K69816D4104J23177
$$ 380077 443851 430379 135762 69701 314413 47999 286909 12912 282728 44104 167281
13322A67281D1261C27L35997r9364J4379J69589C8523b2098A72726C3087d4677
$$ 167281 41261 327 336324 236960 251339 420928 38523 -22098 172726 33087 -44677
13310B27192Q4360A52558P3952P0218E9977J80613q2304J56540M3136j43186J66391
$$ 227192 311552 152558 226510 296728 59977 240590 158286 314826 357962 214776 381167
13299C81167a44756a1008l1814A76388L4263h3223C25159H6594b76382B76805
$$ 381167 -144756 -11008 -42822 176388 210651 -83223 325159 86594 -276382 276805
13288h3485D98849B7030J28434J32582l8610K61745A23529K05502E3907J66094
$$ -83485 498849 27030 155464 288046 249436 511181 123529 329031 53907 220001
13278B20001m5796k4686K82401a0232H7805a85366D18091A17418N9450J75913
$$ 220001 174205 149519 431920 -10232 87805 -185366 418091 117418 176868 352781
13268C52781A31064J80335I8558K41627J80903A60598a61032G025g3331L1098
$$ 352781 131064 311399 98558 340185 521088 160598 -161032 7025 -73331 -42233
13258d2233B0567o550L58043a58427D63515j48387H3405J77137B7184J4565K14645
$$ -42233 20567 14017 372060 -158427 463515 315128 83405 260542 27184 41749 256394
13247B56394A0927J30759q805k746n5365k0458k818N0042a33525B9304a13011
$$ 256394 10927 141686 132881 130135 74770 54312 51494 101536 -133525 29304 -113011
13235b10007H6232K12757G1429b41741B28805j01175a81707A07527J63335i502
$$ -210007 86232 298989 71429 -241741 228805 127630 -181707 107527 270862 -9502
13224I2907j0431J22870a25127A1739a21802A36709L6951J02622m8443J56769
$$ 92907 82476 205346 -125127 11739 -121802 136709 173660 276282 227839 384608
13214C84608L28762I9813J06598O8162a03209B44680R9415d3273B90801I4115
$$ 384608 713370 99813 206411 274573 -103209 244680 344095 -43273 290801 94115
13203C55188j40676i7441A07337r444R1156G5000J07375h8852A78381o1377J12551
$$ 355188 214512 -97441 107337 97893 189049 75000 182375 -88852 178381 117004 229555
13192B29555E0456K10490K26398B04748A1371b4141I9525M3104F831L65285A08651
$$ 229555 50456 260946 487344 204748 11371 -24141 99525 142629 6831 372116 108651
13180g4632I6098b0168m57188B11251i456C66137J62425A35479J0145F0247J76970
$$ -74632 96098 -20168 -477356 211251 -9456 366137 528562 135479 145624 60247 237217
13169B37217j00449D4957L5303C3281J0356J67397a69437A27871J83268A28488
$$ 237217 136768 44957 80260 33281 43637 211034 -169437 127871 311139 128488
13158B35624a63326A38629M0190N2426h1305A18210a33264C16638A3216L47270
$$ 235624 -163326 138629 178819 231245 -81305 118210 -133264 316638 13216 360486
13148C60486E211L7037a85748B73043j12904J36190k1424a55758I4091l0448J83991
$$ 360486 5211 42248 -185748 273043 160139 296329 274905 -155758 94091 63643 247634
13137B47634B5848M8016P7974J4338P9607a91100a9584E4835J07226l3352h5267
$$ 247634 25848 73864 151838 166176 245783 -191100 -19584 54835 162061 128709 -85267
13125B03438h1693A52136N1728H8447n362b1999A9142M98119A72786a69523A38979
$$ 203438 -81693 152136 203864 88447 83085 -21999 19142 517261 172786 -169523 138979
13113H4356B3129L93761G2647L77017b911H1013a08383G0987h1102j20977O8120
$$ 84356 23129 416890 72647 449664 -2911 81013 -108383 70987 -81102 -202079 -133959
13102a33959r204A16747K39595q621j71387o884H1051P4688N4423I2c2025C34267
$$ -133959 -143163 116747 356342 347721 176334 169450 81051 155739 210162 92 -32025 334267
13089A14604b78141B40592A15763J9596c01615A58555D3818N2111M517c4246A68858
$$ 114604 -278141 240592 115763 135359 -301615 158555 43818 95929 100446 -34246 168858
13077A28555l1087a55519C8237K07877n2383a89683C09521A4952b6212C7079j5526
$$ 128555 97468 -155519 38237 246114 193731 -189683 309521 14952 -26212 37079 21553
13066B1553K42801O7883G5979e3315G0515K58004A0863N74383k83251b1432C27262
$$ 21553 264354 332237 75979 -53315 70515 328519 10863 585246 301995 -21432 327262
13054H2552a06206A86650i4368A76831O2940d3703i660B94306I875K49472b04174
$$ 82552 -106206 186650 -94368 176831 239771 -43703 -9660 294306 9875 259347 -204174
13042F7655c0776j23857I987l417b4385A67260b11596C74902d9451p6530A63981
$$ 67655 -30776 -154633 9987 6570 -24385 167260 -211596 374902 -49451 -125981 163981
13030A97965J36212M6753i2714c689p445B90053A31978n7218e0442I7731J5432
$$ 197965 334177 380930 -92714 -3689 -11134 290053 131978 74760 -50442 97731 113163
13019A13163M7015i4129A78323k806J06026b08014Q4074A43805b26526A16312
$$ 113163 160178 -94129 178323 175517 281543 -208014 -123940 143805 -226526 116312
13008C8843K73322I5406K49878a17593A56492d993D59612e1033A9337K4309J89646
$$ 38843 312165 95406 345284 -117593 156492 -4993 459612 -51033 19337 43646 233292
12997B33292q018G056K6331L899O0546a52852c6914n393A78638b10305e0071B69864
$$ 233292 225274 7056 33387 37286 97832 -152852 -36914 -42307 178638 -210305 -50071 269864
12984B32368M0619b6538A21538J98466j29474n6920b44427j59700F2664J21603
$$ 232368 272987 -26538 121538 320004 190530 133610 -244427 -404127 62664 184267
12974A84267N7675i3609c398C9593b65532A06427b12428A50878b16041A19398
$$ 184267 241942 -93609 -3398 39593 -265532 106427 -212428 150878 -216041 119398
12963a22540A24042a54702L4284J8788K7665N286a1380B42950a43857L2876A17561
$$ -122540 124042 -154702 -120418 -101630 -73965 -68679 -11380 242950 -143857 -110981 117561
12951B88830A3322K51443j22308Q5744b6068C29652H5118c0538A34475l1931B7145
$$ 288830 13322 264765 142457 228201 -26068 329652 85118 -30538 134475 102544 27145
12939c6037A56599h604A28242N5130a24876j53093a28754C6726K10775a72772
$$ -36037 156599 -8604 128242 183372 -124876 -277969 -128754 36726 247501 -172772
12928B27140G3431K00351h2508A76118A0817a60761A49048A9915J40012b74546
$$ 227140 73431 273782 -82508 176118 10817 -160761 149048 19915 159927 -274546
12917D56036h1126A4591O2734b03496A47166A4758K4180j245d1727j47160A04023
$$ 456036 -81126 14591 77325 -203496 147166 14758 38938 37693 -41727 -188887 104023
12905A74011A2004K58360g1270b6485E7190J7344a88689A78089P0029B3502N5026
$$ 174011 12004 270364 -71270 -26485 57190 74534 -188689 178089 248118 23502 78528
12894G8528g102B70247a37459F6230J54151H643L62929r9993A6995b29233A27399
$$ 78528 -7102 270247 -137459 66230 220381 8643 371572 271579 16995 -229233 127399
12882c3972A6120a18301N0712f919q4065B7418K11258j4024G9099j0483a81176
$$ -33972 16120 -118301 -67589 -6919 -90984 27418 238676 224652 79099 68616 -181176
12870e143p1120m4268B32592a9414A15720a69834F1932J59985b4017C29204G9396
$$ -5143 -76263 -120531 232592 -19414 115720 -169834 61932 221917 -24017 329204 79396
12858B20763e2388o0242I4600J47869a73761L9400b6210G4907F228a62530N5345
$$ 220763 -52388 -112630 94600 242469 -173761 -134361 -26210 74907 6228 -162530 -107185
12847a07185h284A8953M18928A14280l8171J78828A05918a52012A81732a7360
$$ -107185 -8284 18953 437881 114280 76109 254937 105918 -152012 181732 -17360
12836A32119C3512Q3304l4441B3347P0783g4228k37012A20869C9816J19438E3224
$$ 132119 33512 116816 82375 23347 94130 -74228 -311240 120869 39816 159254 53224
12824C5420L95587A47625C1004h6646B90604b27796C46087c7191P690D9975a89338
$$ 35420 431007 147625 31004 -86646 290604 -227796 346087 -37191 -29501 49975 -189338
12812F0381k9030b6144B53491c5874A03465B7799O6678a38086c7981k66430A40767
$$ 60381 31351 -26144 253491 -35874 103465 27799 94477 -138086 -37981 -304411 140767
12800i1446D8220J7404M3718D0219A2761b54047B46484f9953B6914M8501e6064
$$ -91446 48220 65624 109342 40219 12761 -254047 246484 -69953 26914 75415 -56064
12788G3837a40285Q214C2601b18420C6464a1018l6667F0741g6205A48865e0428
$$ 73837 -140285 -132071 32601 -218420 36464 -11018 -47685 60741 -76205 148865 -50428
12776a06858I4472i5296A98052a89929P2090G5284J26393g2543D63434b02782
$$ -106858 94472 -95296 198052 -189929 -117839 75284 201677 -72543 463434 -202782
12765C7738h8160A50069A832J54599C7636d2723j0605C9652A6767a12115j00906
$$ 37738 -88160 150069 1832 156431 37636 -42723 -53328 39652 16767 -112115 -213021
12754b13021C6517J40105n1902N9449P2971a07562A97112F9114a00606k3166G8130
$$ -213021 36517 176622 124720 184169 257140 -107562 197112 69114 -100606 -123772 78130
12742H1225e1199B8646b44891E6440a26062e2036A26187j7399Q3792g5877j37937
$$ 81225 -51199 28646 -244891 56440 -126062 -52036 126187 108788 192580 -75877 -213814
12731b13814D8217K35040K22692j31917A59271G9482J59933j5495a15647B30433
$$ -213814 48217 283257 505949 374032 159271 79482 239415 223920 -115647 230433
12720D00941a89306A4913a14178q7276A32679d4847A75540b27583a6067C10732
$$ 400941 -189306 14913 -114178 -201454 132679 -44847 175540 -227583 -16067 310732
12709C07592a2557C77532R5002j85130B0998M18624j90827n1147q9781a2246B14036
$$ 307592 -12557 377532 472534 287404 20998 439622 248795 197648 107867 -12246 214036
12697e3745l1907b4509k7933D8016a74569C19950r2740a83365A51255p834k1660
$$ -53745 -85652 -24509 -52442 48016 -174569 319950 227210 -183365 151255 143421 121761
12686A21761c0477j79066i6653c9187m2396E5564L0978j7946O3790k7946e2396
$$ 121761 -30477 -209543 -96653 -39187 -81583 55564 86542 68596 132386 104440 -52396
12674H2608b889D74040C6886L77756j84844D1412R696k3587J47983J68697G3881
$$ 82608 -2889 474040 36886 414642 229798 41412 51108 27521 175504 344201 73881
12662C00813A08560B012K98720B3521J82183I2480O7974J03266H5977L7405J91171
$$ 300813 108560 2012 300732 23521 205704 92480 160454 263720 85977 123382 314553
12651C14553j44362k257a87670e3895D39798A11992a69013B29928e1557E3850
$$ 314553 170191 167934 -187670 -53895 439798 111992 -169013 229928 -51557 53850
12640B11813d7274j59109B93091j4821A8398J03111a92386A8609a13064B0531
$$ 211813 -47274 -206383 293091 278270 18398 121509 -192386 18609 -113064 20531
12629d3219B7319M64004A02468J43163A20891a47626C34105e7233C02609A4296
$$ -43219 27319 491323 102468 245631 120891 -147626 334105 -57233 302609 14296
12618A35072b2651C66948H0307a12452c3695G7797J6070J03480L2597E1584b22894
$$ 135072 -22651 366948 80307 -112452 -33695 77797 93867 197347 229944 51584 -222894
12606A31893m506b8367k76509J26971C06294h4809D15259G0549R8574g9111C29936
$$ 131893 127387 -28367 -304876 -177905 306294 -84809 415259 70549 169123 -79111 329936
12594e0132m0857j58572b6044A20310a35366G5235a38910k7384B02986r8599M9354
$$ -50132 -90989 -249561 -26044 120310 -135366 75235 -138910 -166294 202986 104387 153741
12583A53741e8499B34213N682A06080a82964j33637A11547E3325N9478B8950b67566
$$ 153741 -58499 234213 239895 106080 -182964 -316601 111547 53325 112803 28950 -267566
12571a00027H4545c749A8034a43359J3844p4981A71526a60183A48105h1400m9872
$$ -100027 84545 -3749 18034 -143359 -129515 -204496 171526 -160183 148105 -81400 -131272
12560a31272A55586d7813f63r1403K1101a5767q8495D9713L12109a19098B29416
$$ -131272 155586 -47813 -663 -92066 -70965 -15767 -104262 49713 361822 -119098 229416
12548C8849i1196B70020a84887q8165A55115b15677c0098q477n8843n2179I3574
$$ 38849 -91196 270020 -184887 -273052 155115 -215677 -30098 -38575 -97418 -149597 93574
12536a61073j7279B05254c00107d9802j45401q9076h471k2767B56892N6860j51993
$$ -161073 -178352 205254 -300107 -49802 -195203 -284279 -8471 -31238 256892 313752 161759
12525A61759A898c7675k1676A40917N574a47468A05715P3959d9874q2556B25066
$$ 161759 1898 -37675 -59351 140917 146491 -147468 105715 179674 -49874 -132430 225066
12513D3038Q0771m426i5850B15877C7884i1568G787a44488D2764J55351C7121
$$ 43038 123809 119383 -95850 215877 37884 -91568 7787 -144488 42764 198115 37121
12501C5074J18751a50110a2018k54371b2033B3153L38425b58861B3657b35229
$$ 35074 153825 -150110 -12018 -266389 -22033 23153 361578 -258861 23657 -235229
12490D0596f669H7076b4140C34481E8269c02813F38K02622k7684F1170a10403
$$ 40596 -6669 87076 -24140 334481 58269 -302813 638 203260 175576 61170 -110403
12478A10886O4664f0405H271a49825B89343b42483b8806k03589C29504j24504
$$ 110886 175550 -60405 8271 -149825 289343 -242483 -28806 -232395 329504 205000
12468B05000h5646A92523l5443F7869a99482A5886J10926c58881a61923a358j49174
$$ 205000 -85646 192523 157080 67869 -199482 15886 126812 -358881 -161923 -1358 -150532
12457a50532B1881M0170h2916A64553b87633B9685f6095c0726A52136a16760k84223
$$ -150532 21881 62051 -82916 164553 -287633 29685 -66095 -30726 152136 -116760 -400983
12446d00983d620A41706J27615E345K6203b45272A78990N1984b476j23372K2091
$$ -400983 -4620 141706 269321 5345 31548 -245272 178990 230974 -2476 -125848 -103757
12435a03757o8701D5171L43602a1522k64997a5933E4628a11819B43867n8558m7709
$$ -103757 -172458 45171 388773 -11522 -276519 -15933 54628 -111819 243867 185309 137600
12424A37600C5336a28369j73196i5188n8953A96589m7371d5999A14185b33263
$$ 137600 35336 -128369 -301565 -95188 -154141 196589 149218 -45999 114185 -233263
12413d1373A17327k4635J47934c5933A26472c07890A84143C0258I023J56791C5762
$$ -41373 117327 92692 240626 -35933 126472 -307890 184143 30258 9023 165814 35762
12401D7907b60746C0624K04310A03970a55561A80813F2362L6297a9704A57333
$$ 47907 -260746 30624 234934 103970 -155561 180813 62362 98659 -19704 157333
12390e984H7251a40834a2877F6575J25496g8568A35925j2234m8321J76631a03221
$$ -5984 87251 -140834 -12877 66575 192071 -78568 135925 123691 75370 252001 -103221
12378a71524F7197a11565j56139d4657B38834D8998J51418E967J94220h3655A19103
$$ -171524 67197 -111565 -267704 -44657 238834 48998 200416 5967 200187 -83655 119103
12366A61190a45879G6777i7569D14073a66358B828L9588A1421e21H4998f9770
$$ 161190 -145879 76777 -97569 414073 -166358 2828 42416 11421 -521 84998 -69770
12354h6789B47598a00569A24134a25711A28116b11945R4693e0911k4857A52666
$$ -86789 247598 -100569 124134 -125711 128116 -211945 -117252 -50911 -75768 152666
12343c3866r233a1792k00468E46910a55744a5552k26148c7047n4221G5644J35666
$$ -33866 -43099 -11792 -212260 546910 -155744 -15552 -241700 -37047 -91268 75644 211310
12332B11310b04762A86734j8663d5182C62916A35975b62467e101A90828k827C8223
$$ 211310 -204762 186734 168071 -45182 362916 135975 -262467 -5101 190828 188001 38223
12320b84188a7640j6832C9311J21844a77393B23937c8725A06677J4567E7714J12726
$$ -284188 -17640 -34472 39311 161155 -177393 223937 -38725 106677 121244 57714 170440
12309A70440c99047f0134C56959A53350c5897r379B51045b11868p0713J09879
$$ 170440 -399047 -60134 356959 153350 -35897 -45276 251045 -211868 -282581 -172702
12299a72702D95360b50990h6285c8187B76478a1753A22929B1150P6573C4985e3572
$$ -172702 495360 -250990 -86285 -38187 276478 -11753 122929 21150 97723 34985 -53572
12287B19627a28787l8607C11274B6357K97195a91005C13498l4333H4245L25472
$$ 219627 -128787 -167394 311274 26357 323552 -191005 313498 279165 84245 409717
12277D09717e1688h031A10209J63162K23910A41827L15413C0437J55916H4056
$$ 409717 -51688 -8031 110209 273371 497281 141827 457240 30437 186353 84056
12266f8737C71804j78365D2590K91801a3749D5833f6016B43061I1538f8722A51213
$$ -68737 371804 193439 42590 334391 -13749 45833 -66016 243061 91538 -68722 151213
12254F7918N7095J0954N5627j858n6641a63551N9861j11091G5990K60875j47559
$$ 67918 125013 135967 191594 189736 133095 -163551 -103690 -214781 75990 336865 189306
12243A89306n5331D8578K19468q2340C290L8339J30351C6212a46950F5554K1231
$$ 189306 133975 48578 268046 185706 3290 41629 171980 36212 -146950 65554 86785
12232H6785A3086a75614H2540L3996K0954l3109k6759J67221G0557K75164g7735
$$ 86785 13086 -175614 82540 116536 137490 104381 77622 244843 70557 345721 -77735
12220A75240J24535q086A4741K52187n501j10522b69609G5490C012P8286n980
$$ 175240 299775 291689 14741 266928 261427 150905 -269609 75490 3012 81298 75318
12209G5318q15J66601O3121A8912K21146a5116C46586A37230L59705e5956E7704
$$ 75318 74503 241104 304225 18912 240058 -15116 346586 137230 496935 -55956 57704
12197A75845J58163a7710E24259A79865K5009J92419A47743B698b01888B42728
$$ 175845 334008 -17710 524259 179865 204874 397293 147743 2698 -201888 242728
12186C54318H2941M5239J68342A41210F6671k2784a2327C8995b0887C9437P2500
$$ 354318 82941 128180 296522 141210 66671 43887 -12327 38995 -20887 39437 111937
12175A11937D7998a00205I9683J26714m7234P3161C4487J01353a11667C77743
$$ 111937 47998 -100205 99683 226397 179163 252324 34487 135840 -111667 377743
12164C92519j31540b2921r8428h710j5960A66277K60404J8202A79816a08999J6847
$$ 392519 260979 -22921 -121349 -8710 -24670 166277 426681 444883 179816 -108999 -92152
12153i2152A89545a6192E09078D7615J97807D1055L737J75499p6825k0235C468
$$ -92152 189545 -16192 509078 47615 245422 41055 44792 220291 143466 123231 3468
12141A23871b15615B59908f9237C1725J18885f3580j29862K8725N4588B28370
$$ 123871 -215615 259908 -69237 31725 150610 -63580 -193442 -164717 -110129 228370
12130C44568a24715a6988A8344a60760j0460A58035a24413B28627a41871N6669
$$ 344568 -124715 -16988 18344 -160760 -171220 158035 -124413 228627 -141871 -85202
12120h5202B3802b902A35294J07202k6143A7859N5613g9346j64026a07366j5608
$$ -85202 23802 -2902 135294 242496 216353 17859 73472 -79346 -243372 -107366 -122974
12109a22974B63457b1190I2047b98781C2739h5049A95210A6605f4524A34051c63767
$$ -122974 263457 -21190 92047 -298781 32739 -85049 195210 16605 -64524 134051 -363767
12097B91238i3382k03159D73314A993J01230N9690e7909K7861C75918j66273a84417
$$ 291238 -93382 -296541 473314 1993 103223 162913 -57909 -30048 375918 209645 -184417
12085a3393A8242K62501j5319a07572H3770D1080J46063O8155J053572J183237
$$ -13393 18242 280743 265424 -107572 83770 41080 187143 255298 1308870 2492107
12075B492107A232999a08103D20185h5634F1814J68385a91034D9201a85668B30050
$$ 2492107 1232999 -108103 420185 -85634 61814 230199 -191034 49201 -185668 230050
12064h8918A20830L72871e4090A44054a59227b1315p4048l2789c2564A16786C2909
$$ -88918 120830 493701 -54090 144054 -159227 -21315 -95363 -128152 -32564 116786 32909
12052c01209g019A02221c666j54708r3659B11857D43L4669J05503n2601j4849
$$ -301209 -7019 102221 -3666 -158374 -252033 211857 443 35112 140615 88014 73165
12041G3165c86631a5741j85771B02549b22809B56783k2708J4359I7412b73820
$$ 73165 -386631 -15741 -201512 202549 -222809 256783 234075 248434 97412 -273820
12030g8170k52200B6811a65338f4956A75571F6006N5969L2685m1379a58992A91828
$$ -78170 -330370 26811 -165338 -64956 175571 66006 121975 154660 113281 -158992 191828
12018c6110B09680q0437N3409C4878R7710h945A34943a70434e8912A03798Q3039
$$ -36110 209680 129243 182652 34878 132588 -8945 134943 -170434 -58912 103798 186837
12007A86837a55446L5970B10217b66208j57841K04011j2424A45314a24246q722
$$ 186837 -155446 -119476 210217 -266208 -424049 -220038 -232462 145314 -124246 -132968
11997a32968M1926C07025A44104a16472A6618a97239A9906e07830A68120a0675
$$ -132968 -91042 307025 144104 -116472 16618 -197239 19906 -507830 168120 -10675
11986a50279D17996a3082k35928e315I7039L47907A90695i0628B78341B7391K77889
$$ -150279 417996 -13082 -249010 -5315 97039 444946 190695 -90628 278341 27391 305280
11975C05280b6115j57701d1504B01709o3215m4505g4935n7457B759O16259d7040
$$ 305280 -26115 -183816 -41504 201709 138494 93989 -74935 -132392 2759 619018 -47040
11963h1686q3650d220D23660c38358B33038f7895j40130F7435c60885i9044c4503
$$ -81686 -165336 -4220 423660 -338358 233038 -67895 -208025 67435 -360885 -99044 -34503
11951C07725A13916m6544j6891b54150o243b7032n3094o2187b1089E4646a28566
$$ 307725 113916 67372 50481 -254150 -260393 -27032 -80126 -142313 -21089 54646 -128566
11939a12060C4666N2104N8902a08826j8792F3524J08971p9674o332a90912c9933
$$ -112060 34666 86770 145672 -108826 -127618 63524 172495 92821 86489 -190912 -39933
11927A04563a93205A87475a08602A12384c2466C8765Q9968J2620g4761a2378j34842
$$ 104563 -193205 187475 -108602 112384 -32466 38765 128733 141353 -74761 -12378 -147220
11916a47220D6778L02914r5744j3756e4669b6297o1338G5596C7750b0840f546
$$ -147220 46778 349692 253948 240192 -54669 -26297 -87635 75596 37750 -20840 -6546
11904B16968b95368h2245b6924F6349a50700P3636A50171a03867j42515i3289
$$ 216968 -295368 -82245 -26924 66349 -150700 -77064 150171 -103867 -246382 -93289
11893f5790A94852a24739e7925A27776h5683j12777B13595a5400j30619q5456
$$ -65790 194852 -124739 -57925 127776 -85683 -198460 213595 -15400 -146019 -231475
11883b31475F2510f508C19331a87917f25j23628j10136C87694H8378J99663G4074
$$ -231475 62510 -6508 319331 -187917 -625 -124253 -234389 387694 88378 288041 74074
11871A66796B7300m413a53544L2719d1492p4102A44011b38702A4906d4010j21264
$$ 166796 27300 22887 -153544 -120825 -41492 -115594 144011 -238702 14906 -44010 -165274
11860a65274i79r181j88406A23856c24681J21859M4666A83534C7983P5804a93736
$$ -165274 -979 -10160 -198566 123856 -324681 -202822 -158156 183534 37983 113787 -193736
11848H1763c03057a3089B4483p624P7350d19488J96652H3225J05467a72062j2264
$$ 81763 -303057 -13089 24483 16859 94209 -419488 -222836 83225 188692 -172062 -184326
11837a84326O7202K9611r0893k39895a02619B48270c60588J0787a46714k9997
$$ -184326 -117124 -87513 -178406 -418301 -102619 248270 -360588 -349801 -146714 -176711
11827a76711N56Q644c4620J5239k13584C1368a85389Q3683a2470b539A21877h854
$$ -176711 -176155 -167511 -34620 -19381 -232965 31368 -185389 -101706 -12470 -2539 121877 -8854
11814b32802B14876n5538a32501j53921A7904d55570K13584B23707a80310d973
$$ -232802 214876 159338 -132501 -286422 17904 -455570 -241986 223707 -180310 -4973
11803B36388D290b7362k00643C69512b05596M8861j69085l7191c260C55678G4488
$$ 236388 4290 -27362 -228005 369512 -205596 -156735 -325820 -363011 -3260 355678 74488
11791a46617F6080N6475N0589j8258a25109C1761J09446E6458i9306J8456p1578
$$ -146617 66080 122555 173144 154886 -125109 31761 141207 56458 -99306 -80850 -152428
11780a52428c8726F6999a78820k0119p5638B18383a53897K5649A90618a4895A04138
$$ -152428 -38726 66999 -178820 -198939 -274577 218383 -153897 -128248 190618 -14895 104138
11768G1650d3224A00918R2799H4144R5693Q0159c69997A16522a24433m1303C33824
$$ 71650 -43224 100918 193717 84144 179837 259996 -369997 116522 -124433 -165736 333824
11756i5236j49765C382K73777b46769D8169f8762L3299m4564B66705a52363d0786
$$ -95236 -245001 3382 277159 -246769 48169 -68762 -35463 -80027 266705 -152363 -40786
11744e27899a83301o6954C839b1823C77454n7270a17836B01409E9097b41919b6521
$$ -527899 -183301 -250255 3839 -21823 377454 320184 -117836 201409 59097 -241919 -26521
11732B07427F1091k8347M40837c44803G2214e5705j5173m0500F2089A5075K225
$$ 207427 61091 32744 473581 -344803 72214 -55705 -70878 -111378 62089 15075 17300
11721A7300i6432E1468b37268A11023J33069b442A54304L41757f438B46182c31007
$$ 17300 -96432 51468 -237268 111023 244092 -2442 154304 496061 -6438 246182 -331007
11709B74000e3930C63814F1916k6799J54596l6271A741K81291l3223q8533J3442
$$ 274000 -53930 363814 61916 35117 189713 153442 1741 283032 249809 161276 174718
11698A74718l1845K15525A51172P4396a47023A09467K53871a32703M033H5733
$$ 174718 142873 358398 151172 225568 -147023 109467 363338 -132703 -128670 85733
11687C8227f2224B06511M5518l8012p7937a8578j70804A0428c5137H3767R9246
$$ 38227 -62224 206511 252029 214017 136080 -18578 -189382 10428 -35137 83767 183013
11676A83013m7764o0244a39989A01672J9762a9803C6787J36073J07259E6835a65553
$$ 183013 135249 75005 -139989 101672 121434 -19803 36787 172860 280119 56835 -165553
11664b5181A58375a17632B02161f769p0234A22972b29237B87674i2224r3709B05420
$$ -25181 158375 -117632 202161 -6769 -77003 122972 -229237 287674 -92224 -185933 205420
11652A85243b46266A59817G0066b16268A08443L27835k17511o9007J30648b64672
$$ 185243 -246266 159817 70066 -216268 108443 436278 218767 149760 280408 -264672
11641B28610M7389C3307K59696B4887J2678J35030l1283J01407L0748C2934b5420
$$ 228610 275999 33307 293003 24887 37565 172595 141312 242719 273467 32934 -25420
11629e4495j03334F610a81322J2808B8103a37231A40065a39353A50149Q45j066
$$ -54495 -157829 6610 -181322 -168514 28103 -137231 140065 -139353 150149 150994 149928
11618A49928b4130k19165c9043E9750Q8966B4423m028e2865A51408D5546K3953
$$ 149928 -24130 -243295 -39043 59750 148716 24423 20395 -52865 151408 45546 69499
11607F9499f0862J3659G4581d99404f7797K2635A45659a84948A89433N2280C9631
$$ 69499 -60862 -47203 74581 -499404 -67797 -45162 145659 -184948 189433 241713 39631
11595B71147e9206A46488k8767D7474h5125G8083A120a22381A2786J38890L9169
$$ 271147 -59206 146488 117721 47474 -85125 78083 1120 -122381 12786 151676 190845
11584A90845e7581j4353B21717q6618F2792C986a67781D7787R3598j4956M3514
$$ 190845 -57581 -71934 221717 135099 62792 3986 -167781 47787 141385 126429 169943
11573A69943a5713C15198G0446M5858j7141d8666k01652C45183m9447o2060A14716
$$ 169943 -15713 315198 70446 116304 99163 -48666 -250318 345183 295736 233676 114716
11561E59560A10240L0976K26459R711h231l3597D4875J15388K74767E7115K73487
$$ 559560 110240 141216 367675 377386 -8231 -41828 44875 160263 435030 57115 330602
11550C30602N1932G3080b97983D00071j23246Q5021e4445A88058k0682R2270b6321
$$ 330602 382534 73080 -297983 400071 276825 361846 -54445 188058 167376 259646 -26321
11538a62503m8047D69490b8116A72971L33965D0806K44900A1303L38753A18938
$$ -162503 -210550 469490 -28116 172971 506936 40806 285706 11303 350056 118938
11527A0731K1191K46235j3031B9231i3001a91j261E1596J0669J06485k5093b6435
$$ 10731 31922 278157 265126 29231 -93001 -191 -1452 51596 62265 168750 143657 -26435
11514D34705a43004N1365M5630A31030K25863h0221c9515C49225c6856F7887h7424
$$ 434705 -143004 -91639 -46009 131030 356893 -80221 -39515 349225 -36856 67887 -87424
11502B0675Q4462C1124c4861J5738B73170a35554j66671A5279J14146n7858a75501
$$ 20675 105137 31124 -34861 -19123 273170 -135554 -302225 15279 129425 71567 -175501
11490A15349G349L07804J93221A20618O2524L6063J50820A64868G3219a65813
$$ 115349 7349 315153 508374 120618 183142 219205 370025 164868 73219 -165813
11479E8766K27760Q2056j7240B0325L8574i8920B92468e3863A85274J4339L795
$$ 58766 286526 368582 351342 20325 58899 -98920 292468 -53863 185274 199613 203408
11468B03408D857K71678a321B01717b1280C7029K88907G873g237A8800K9935a65491
$$ 203408 4857 276535 -1321 201717 -21280 37029 325936 7873 -7237 18800 48735 -165491
11455C0474f947G8920J13478c6102k6729A22992J62600D6405K39356N5853c3895
$$ 30474 -6947 78920 192398 -36102 -62831 122992 285592 46405 285761 341614 -33895
11443a65242B68162f4569C25613g7831m1129G5578M017g4478A17462a36638G8463
$$ -165242 268162 -64569 325613 -77831 -118960 75578 79595 -74478 117462 -136638 78463
11431a05213b381A13673a30472C5094J59572q2037a04206A35039a79478b0290
$$ -105213 -2381 113673 -130472 35094 194666 112629 -104206 135039 -179478 -20290
11420h0027B55620b51415I3088c29339C33376K25463a27653A83551a88872A79861
$$ -80027 255620 -251415 93088 -329339 333376 558839 -127653 183551 -188872 179861
11409b41724j12746B79276E6641b21557B01996b92930A67682C1465R0019a54486
$$ -241724 -354470 279276 56641 -221557 201996 -292930 167682 31465 121484 -154486
11398H0664J91141q5393J9769a39598B97119m0122a00100m4486B64862h7804j61489
$$ 80664 271805 186412 206181 -139598 297119 256997 -100100 -144586 264862 -87804 -249293
11387b49293C0027K3773g175A65102D9541a34658L0145C37486A28973N2121a08293
$$ -249293 30027 53800 -7175 165102 49541 -134658 -104513 337486 128973 181094 -108293
11375A08392J31564a15297j07461a6707B11020B5100r549h68k07977Q3208p2288
$$ 108392 239956 -115297 -222758 -16707 211020 25100 15551 -868 -208845 -125637 -197925
11364a97925b0352F0539f6591D9345b15933c529B79614j33253N2975b7915n4683
$$ -197925 -20352 60539 -66591 49345 -215933 -3529 279614 146361 199336 -27915 -82598
11353h2598B06530b72042a35022A31178N1040k5456a62733B02259b31945d0244
$$ -82598 206530 -272042 -135022 131178 182218 156762 -162733 202259 -231945 -40244
11342a33563A45912C7266g412A71496h6070o5620G0734j2167J54228q4430O8218
$$ -133563 145912 37266 -7412 171496 -86070 -151690 70734 58567 212795 128365 196583
11331A96583o9826a78567a2140E0545f2666m6295j6044C35218A26161l5202L4650
$$ 196583 126757 -178567 -12140 50545 -62666 -108961 -125005 335218 126161 90959 125609
11320A25609c47807O6532A77243M0049c2444j26858r3896A32295j9324A51P7089
$$ 125609 -347807 -281275 177243 217292 -32444 -159302 -253198 132295 112971 151 77240
11309G7240N9367d6263C93819a25164B5495a15480j37059H2167a40464j7466A21221
$$ 77240 136607 -46263 393819 -125164 25495 -115480 -252539 82167 -140464 -157930 121221
11297a96148R4633H3749P1750k9834C8422a19625b0245n6246B25652d93339a54898
$$ -196148 -101515 83749 155499 125665 38422 -119625 -20245 -76491 225652 -493339 -154898
11285a65885A49148m6838b38996K7835h6951p6237p526Q5195L4460j86561h4834
$$ -165885 149148 102310 -238996 -211161 -86951 -163188 -170714 -85519 -51059 -237620 -84834
11273c90203C434J86047A2582i0709M1746m31228h5079o8515h769m3970A00577
$$ -390203 3434 189481 12582 -90709 -48963 -480191 -85079 -153594 -8769 -52739 100577
11261B2342R8267O5085D2665b60280A68161f6399p9303A86116b13833A39595c09999
$$ 22342 120609 185694 42665 -260280 168161 -66399 -145702 186116 -213833 139595 -309999
11249b62313C3065a31916F9271a85616B8281e573j77765q4560b191p5766l29193
$$ -262313 33065 -131916 69271 -185616 28281 -5573 -183338 -267898 -2191 -77957 -407150
11238d07150a13926l8004A96790L33896D7744b76806a03553I6520a21600j10069
$$ -407150 -113926 -151930 196790 530686 47744 -276806 -103553 96520 -121600 -231669
11228b31669c1083C9181a95928A2099K8486K20801B4162g353l00967A64590b69342
$$ -231669 -31083 39181 -195928 12099 40585 261386 24162 -7353 -308320 164590 -269342
11216G9341g9247F1631c83155a75562K4503L2918q368q8789r3620c7294r6757
$$ 79341 -79247 61631 -383155 -175562 -151059 -118141 -126509 -215298 -308918 -37294 -134051
11205a34051m1719j7055F441b07234e0971E4948a50390r726G7257f9522j43845
$$ -134051 -175770 -192825 6441 -207234 -50971 54948 -150390 -160116 77257 -69522 -213367
11194b13367G8158b78674f899k02979C89881B1735a38123b5115E8154P4477h5321
$$ -213367 78158 -278674 -6899 -209878 389881 21735 -138123 -25115 58154 132631 -85321
11182a2384j3573A34191a34831c5745J1426F5995b52554B238O9278a62342P9856
$$ -12384 -25957 134191 -134831 -35745 -24319 65995 -252554 2238 71516 -162342 -82486
11171h2486A72007R1433I356b52283b5657A11554J73900G6284Q7902j9568C5977
$$ -82486 172007 263440 9356 -252283 -25657 111554 285454 76284 164186 144618 35977
11159A73731q4357g2728C72190f1325a2638A82369g7893i765F0625a53813j03318
$$ 173731 89374 -72728 372190 -61325 -12638 182369 -77893 -9765 60625 -153813 -257131
11148b57131G1547c66501C05506g3081j05525o5923i4463j48483C06158P5413
$$ -257131 71547 -366501 305506 -73081 -178606 -244529 -94463 -242946 306158 381571
11138C81571A70080d016m9189j03302L8515L114M4103B633J95894d5695m8427
$$ 381571 170080 -4016 -53205 -156507 -117992 -114878 -70775 2633 198527 -45695 -94122
11127i4122E33514b01562C10649E9906A9461b31021I8057l8063K59835j09899
$$ -94122 533514 -201562 310649 59906 19461 -231021 98057 59994 319829 209930
11117B09930g6227j12238A41315F8635e218E13045k17542a04442B60546n5521
$$ 209930 -76227 -188465 141315 68635 -5218 513045 295503 -104442 260546 205025
11107B05025M0310b38932C79941A77739G8476J72105J64303b6232B75361H9141
$$ 205025 245335 -238932 379941 177739 78476 250581 414884 -26232 275361 89141
11096h0773C49007j10839J64968p2567r4924p5115K05009l978q1433a11880C16764
$$ -80773 349007 238168 403136 330569 235645 160530 365539 361561 280128 -111880 316764
11084E21401B05764K47999p3792j68816R0935J35553B13807J39183m9633L7968
$$ 521401 205764 453763 379971 211155 302090 437643 213807 352990 303357 341325
11074C41325A60438J01460j1480p7185M01432j98572H3273N81606B09622q5084
$$ 341325 160438 261898 250418 173233 574665 376093 83273 664879 209622 124538
11064A24538K85852A41084K11684K26271k88376O52093m13679N7974o2965K81953
$$ 124538 410390 141084 352768 579039 290663 942756 529077 587051 524086 806039
11054H06039j24778M7948O8014k87349L8915M07740O4454j44686j66948q0982
$$ 806039 681261 729209 797223 509874 548789 956529 1020983 876297 709349 628367
11044F28367L99717l89634J6584j96265M50227o6546k73593q6399M67532n1577
$$ 628367 1028084 638450 655034 458769 908996 842450 568857 482458 949990 898413
11034H98413D27184M85738k38770J76782j77902M9172j79675J63465J33132O7344
$$ 898413 427184 912922 674152 850934 673032 722204 542529 705994 839126 906470
11024I06470j0482K1208k20470k2346K24425k17275J16939l43300K40140k8268
$$ 906470 895988 917196 696726 674380 898805 681530 798469 455169 695309 667041
11014F67041J12808K6958n4329B93599K42824k2525K6117Q1719m8318J27749M1723
$$ 667041 779849 806807 752478 293599 536423 513898 540015 621734 573416 701165 742888
11003G42888p2983K5586R9349j50802R5443K53346j95805P8575j53699l3018L34526
$$ 742888 669905 695491 794840 644038 739481 992827 797022 875597 721898 688880 1023406
10992A023406l36646l9582L17733D07193M78636R7069n4895J10056L45111l36312
$$ 1023406 686760 647178 964911 407193 885829 982898 928003 1038059 1383170 1046858
10982A046858M1569K12422p3805M69641j46336J1120k09015Q61805O7106L42730
$$ 1046858 1088427 1300849 1227044 1696685 1550349 1561469 1352454 2214259 2281365 2624095
10972B624095L53890m22032M62685P737r5679l90649k22530r8810J58327l76099
$$ 2624095 2977985 2555953 3018638 3026375 2930696 2540047 2317517 2218707 2377034 2000935
10962B000935m70055n0927j56889L77078K19834K66818P7222j62132l03969J89953
$$ 2000935 1530880 1479953 1323064 1700142 1919976 2186794 2264016 2101884 1797915 1987868
10952A987868n21974l78446Q9162m49712K46823j46978l27056J18053j60158B15900
$$ 1987868 1465894 1087448 1176610 726898 973721 826743 499687 617740 457582 215900
10941C03514K38271k48215o9010r3078Q7634J9922d5083C52988a11166B42095
$$ 303514 541785 293570 224560 131482 219116 239038 -45083 352988 -111166 242095
10930A76453c0071C42959p8650B3372K277J2148J42503E7953a41713q4631M987
$$ 176453 -30071 342959 264309 23372 25649 37797 180300 57953 -141713 -226344 -221357
10919b21357e1834L285A23153D4151N7698g1575E2557M47152k34057f5697B2663
$$ -221357 -51834 -48549 123153 44151 101849 -71575 52557 499709 265652 -65697 22663
10907B43464D321a4699A6379J94447b40628B54435g8369A82777Q4335B8334b81383
$$ 243464 4321 -14699 16379 210826 -240628 254435 -78369 182777 267112 28334 -281383
10895A58426c2962H2762b56049J2565A10170J19998B0293c44201E8686b61194
$$ 158426 -32962 82762 -256049 -243484 110170 230168 20293 -344201 58686 -261194
10884A24343n7537g5964A23121g0726c0914A62748a7375D4416a02132i844H9729
$$ 124343 66806 -75964 123121 -70726 -30914 162748 -17375 44416 -102132 -9844 89729
10872a12072I9981g226G8862a48224j7441j15266B49933b79232C1363J55568N2978
$$ -112072 99981 -7226 78862 -148224 -165665 -280931 249933 -279232 31363 186931 239909
10861B39909a23035r820J2218A65600o5284c7972A35098d3530E9471b37374P8194
$$ 239909 -123035 -132855 -120637 165600 100316 -37972 135098 -43530 59471 -237374 -159180
10850a59180B12544h928j07139m6804O5886A88037a88423O9443C30214h7796A18768
$$ -159180 212544 -8928 -116067 -162871 -96985 188037 -188423 -118980 330214 -87796 118768
10838E4496R7686b46763G0419J81107a38876E0168J66192o9812d8860j46449L8844
$$ 54496 152182 -246763 70419 251526 -138876 50168 216360 146548 -48860 -195309 -156465
10827a56465D80790c8587A3225b33329O3194l8805g8818K6615l6406j70543J19650
$$ -156465 480790 -38587 13225 -233329 -170135 -208940 -78818 -52203 -88609 -259152 -139502
10816a39502E9753J29671C1841d8867j34545q1336C04435b69582C12952b19912
$$ -139502 59753 189424 31841 -48867 -183412 -264748 304435 -269582 312952 -219912
10805B9386i9301d4436B8688J04634b74234I9372h0566D14392h9462k30940D08615
$$ 29386 -99301 -44436 28688 133322 -274234 99372 -80566 414392 -89462 -320402 408615
10793h9687j14303e6522m6414A83123a05232A19253C8122J56321f3474p8449A85837
$$ -89687 -203990 -56522 -102936 183123 -105232 119253 38122 194443 -63474 -141923 185837
10781d92146I2825J02730e9342b1223A88263B7358J1508b3869I5425l5144J68052
$$ -492146 92825 195555 -59342 -21223 188263 27358 38866 -23869 95425 60281 228333
10770B28333b15027D7210P889a2298n6695m67557i7793R509A46787B7208a57582
$$ 228333 -215027 47210 55099 -12298 -68993 -536550 -97793 -88284 146787 27208 -157582
10758a58420b861A48479a40816A74569g0968q2877A80400b79826o66g5845C85438
$$ -158420 -2861 148479 -140816 174569 -70968 -153845 180400 -279826 -280492 -75845 385438
10746A48884i0723j35798m5907A3746a32787D680J33540a75341B93360B3660b81251
$$ 148884 -90723 -226521 -272428 13746 -132787 4680 138220 -175341 293360 23660 -281251
10734I7272R6166c76551A76281c26341G39f7771A74363b93951H5003b3774j24954
$$ 97272 193438 -376551 176281 -326341 739 -67771 174363 -293951 85003 -23774 -148728
10723a48728e9533j46949J00834C9859e56551B44619j05950a18045M3755E16446
$$ -148728 -59533 -206482 -105648 39859 -556551 244619 138669 -118045 -74290 516446
10712A29563m3278b11527Q0295B18473a97346C0868L7695A1034O5538d57125c7627
$$ 129563 86285 -211527 -131232 218473 -197346 30868 68563 11034 76572 -457125 -37627
10700a84616G5505e5485A89271a81001f2702k8395C7794L2726b28641B75379g2925
$$ -184616 75505 -55485 189271 -181001 -62702 -91097 37794 70520 -228641 275379 -72925
10688b50474d6882j04105j12591b5347B41886B6239c50216I4288j8509e4907n7136
$$ -250474 -46882 -150987 -263578 -25347 241886 26239 -350216 94288 75779 -54907 -112043
10677a12043j92742d2569j23052c5191I0426k7724a31232A51512n5012i8799b7543
$$ -112043 -304785 -42569 -165621 -35191 90426 62702 -131232 151512 96500 -98799 -27543
10665c61750a17940d4021A49290h2761j86759q8331B10537a30668j67045A23373
$$ -361750 -117940 -44021 149290 -82761 -269520 -357851 210537 -130668 -297713 123373
10654f0440A25244a49320c6992H4319L8734c31501i0268K8665B71792c72129A32790
$$ -60440 125244 -149320 -36992 84319 123053 -331501 -90268 -61603 271792 -372129 132790
10642B52723J475a10026K5082M2294A28146J7276k4202N5364i6834F0212K26178
$$ 252723 254198 -110026 -84944 -42650 128146 145422 121220 176584 -96834 60212 286390
10631B86390a86232B16302b0700B1258b20431a07493j22648p3496D1255L91877
$$ 286390 -186232 216302 -20700 21258 -220431 -107493 -230141 -303637 41255 433132
10621D33132A3770C403K06809g2945j00798l4767L0434J8339F3463i5942j73938
$$ 433132 13770 3403 210212 -72945 -173743 -208510 -178076 -159737 63463 -95942 -269880
10610b69880J07329J3354N7420F1488P2266c39237I6852J99635a67783c0002k92278
$$ -269880 -162551 -149197 -91777 61488 133754 -339237 96852 296487 -167783 -30002 -322280
10599c22280e9562j43233M4466j86291A22215Q5653c218q3264K5589A98514O8653
$$ -322280 -59562 -202795 -158329 -344620 122215 207868 -3218 -86482 -60893 198514 267167
10588B67167d18015a04230j07309L5561J7581d889n0940k12363g4767l3073G9304
$$ 267167 -418015 -104230 -211539 -175978 -158397 -4889 -55829 -268192 -74767 -107840 79304
10576b60997K9254H7257G632O1044b10184A12317a21703a3174k8755k72931C88912
$$ -260997 -231743 87257 7632 68676 -210184 112317 -121703 -13174 -41929 -314860 388912
10564g7754I3322K975r848m2355M06L86575D9804J95622a68780A36028d39753
$$ -77754 93322 96297 86449 44094 44500 431075 49804 245426 -168780 136028 -439753
10552F1709L59591d70508i5201j7129l474A77736c7789B50518d30526H634a95000
$$ 61709 421300 -470508 -95201 -112330 -115804 177736 -37789 250518 -430526 8634 -195000
10540e1614k2365o9441A09314a9668I4614D6829K61194A07505J36655G2867c0740
$$ -51614 -73979 -143420 109314 -19668 94614 46829 308023 107505 244160 72867 -30740
10528f4178k6969p354b9887j32960g8824A12398c090j68430n4656Q9795D12944
$$ -64178 -91147 -98501 -29887 -162847 -78824 112398 -3090 -171520 -226176 -136381 412944
10516a05505J8235j4529b1111C89896C3631J8914J71719b62551K8039A33263D8861
$$ -105505 -87270 -101799 -21111 389896 33631 52545 224264 -262551 -234512 133263 48861
10504e1319k9102n250B10588p7297a70380O5995A41929a5617m4065n5343j5884
$$ -51319 -80421 -85671 210588 133291 -170380 -104385 141929 -15617 -59682 -115025 -130909
10493a30909B76712I910b23371c8885j01668H9117a44908B4038J80530a21577
$$ -130909 276712 9910 -223371 -38885 -140553 89117 -144908 24038 204568 -121577
10482C44907m4467p8579N57348k99981j4419K22103B62598L1898J03727f7205
$$ 344907 300440 221861 779209 479228 464809 686912 262598 294496 398223 -67205
10471B28812b81948E0978d2057k4076r9864A06083b9843A29024a03744j8272A01994
$$ 228812 -281948 50978 -42057 -66133 -165997 106083 -29843 129024 -103744 -122016 101994
10459B46101j17562K14981A6320K23487r9606F5228d85634J02496f7550H0297
$$ 246101 128539 343520 16320 239807 140201 65228 -485634 -383138 -67550 80297
10448A75615b93332R9403N0734A2668J50548h1605c438A08964c48684G7185K54734
$$ 175615 -293332 -193929 -143195 12668 163216 -81605 -3438 108964 -348684 77185 331919
10437C31919A17549i7438n52A20209b52626I3632a9559A6515b08238q6509M7385
$$ 331919 117549 -97438 -97990 120209 -252626 93632 -19559 16515 -208238 -294747 -247362
10426b47362A1175a30153M7760j6564r076A08669K53229g9894l42923H4930d6577
$$ -247362 11175 -130153 -82393 -98957 -108033 108669 361898 -79894 -422817 84930 -46577
10414D23192j92967m0678Q3841H0859P4141f1337l19928A67336g5886j55470b8678
$$ 423192 230225 189547 273388 80859 155000 -61337 -381265 167336 -75886 -231356 -28678
10402B03391F2726c91830h7632J114A09195c35089A469K61818n1962J76267j62478
$$ 203391 62726 -391830 -87632 -86518 109195 -335089 1469 263287 211325 387592 225114
10391B25114J34857j04477d39731b01247D24611m2957h2647o0410H3382a3073
$$ 225114 359971 255494 -439731 -201247 424611 381654 -82647 -143057 83382 -13073
10380A70246C4066J31491K27279A60876l7721j731K18468L05470B85294n1463
$$ 170246 34066 165557 392836 160876 123155 121424 339892 645362 285294 233831
10370B33831K23942A72795L66151j94167K84513J53224I6705K42382K05459j58075
$$ 233831 457773 172795 538946 344779 629292 782516 96705 339087 544546 386471
10360C86471L6242n8407J28986j04788c0528F42415a8884F8352L04665j302L04804
$$ 386471 422713 364306 493292 388504 -30528 642415 -18884 68352 373017 371715 676519
10349F76519r5137j35630n3234A42249J84371A10818K43765n1881m9116g4503
$$ 676519 581382 445752 392518 142249 326620 110818 354583 302702 253586 -74503
10338A07721Q0543q025H7488J57949H7351b452D17366A74195J3451b9125B46576
$$ 107721 188264 180239 87488 245437 87351 -2452 417366 174195 187646 -29125 246576
10326C40231A03432m4351J81183J90566B10463o3826N3076J82050j10624e3180
$$ 340231 103432 59081 240264 430830 210463 146637 199713 381763 271139 -53180
10315i7444A26061P8115m6439N1736m2561l7489E9338j0100J54559d14097e1988
$$ -97444 126061 204176 157737 209473 166912 129423 59338 49238 203797 -414097 -51988
10303B58356d3929G1288k9875f1815I6286E753J05273C7820a38446J1490C0525
$$ 258356 -43929 71288 41413 -61815 96286 5753 111026 37820 -138446 -126956 30525
10291a10391E3924b00984c0095f033B4293a30590j07593A47398J30112a74281
$$ -110391 53924 -200984 -30095 -6033 24293 -130590 -238183 147398 277510 -174281
10280B263N08391d3818k34719b3724a615n0219G1856Q647e419A11162d77330C06983
$$ 2263 510654 -43818 -278537 -23724 -1615 -51834 71856 80503 -5419 111162 -477330 306983
10267a7905C48161A5362M9310a11344A81440j8863O9059H7880o772R9816q8736
$$ -17905 348161 15362 64672 -111344 181440 162577 231636 87880 81108 180924 92188
10256I2188k6784N30520A60339O468a9831R299k8448B9966K76209a37099k11156
$$ 92188 65404 595924 160339 166807 -19831 -10532 -38980 29966 306175 -137099 -348255
10245c48255B86282I1065e7556k36172B84810k3550h033H7201J04478h2103r2830
$$ -348255 286282 91065 -57556 -293728 284810 261260 -8033 87201 191679 -82103 -174933
10234a74933A11576A9647a9500E8392a67377e4267j9563l8973A76979a61606J1492
$$ -174933 111576 19647 -19500 58392 -167377 -54267 -73830 -112803 176979 -161606 -150114
10223a50114A05958a97210k9757I3379d96219B039d6922j76279B36811b3499I0267
$$ -150114 105958 -197210 -226967 93379 -496219 2039 -46922 -223201 236811 -23499 90267
10211I4316a83368A5365R8064d53991A62666b31769j61759J11549J04653h8571
$$ 94316 -183368 15365 113429 -453991 162666 -231769 -393528 -281979 -177326 -88571
10200a18064A46353b10908G7154c38767H248J68925g8073A15575b19589E9593
$$ -118064 146353 -210908 77154 -338767 8248 177173 -78073 115575 -219589 59593
10189A9179L9268g3984A6399J91306a32689K823A57934k0193b0730A01667L14881
$$ 19179 58447 -73984 16399 207705 -132689 -129866 157934 137741 -20730 101667 416548
10178D16548b45499H063a01843I2967C6067D786P8249k3760b25767a08146A1611
$$ 416548 -245499 8063 -101843 92967 36067 4786 83035 59275 -225767 -108146 11611
10166D5159d9829j13899d8875r7296c8488A24209b26899J07911C06235a42282
$$ 45159 -49829 -163728 -48875 -146171 -38488 124209 -226899 -118988 306235 -142282
10155I1401K33116f9281B0415f7215B05212C2391b36252H9326m1911b45272O1858
$$ 91401 324517 -69281 20415 -67215 205212 32391 -236252 89326 47415 -245272 -183414
10144a83414N7017j0044r842a5907p6651Q571q584j84018O8381j79387J15776
$$ -183414 -126397 -136441 -146283 -15907 -92558 -83987 -92571 -276589 -208208 -387595 -271819
10133b71819g7677k9792M292F074N8721C0539b20684B24877F0589a13989k17023
$$ -271819 -77677 -107469 -103177 6074 64795 30539 -220684 224877 60589 -113989 -331012
10122c31012a05859J6247A5802J31051b63272O5814n832R9540E2638J08195b79767
$$ -331012 -105859 -89612 15802 146853 -263272 -197458 -203290 -103750 52638 160833 -279767
10110A58685l9644a83826I7686g0519C5063a69370g1683I564b36221P7048M0382
$$ 158685 119041 -183826 97686 -70519 35063 -169370 -71683 9564 -236221 -159173 -118791
10099a18791I6589a31506b4825j59879f6573r4943k17396a21641q9190c2006j08672
$$ -118791 96589 -131506 -24825 -184704 -66573 -161516 -378912 -121641 -210831 -32006 -140678
10088a40678j76128C0788c26140A3455a28403j52983A66144C5722a00084D7810
$$ -140678 -316806 30788 -326140 13455 -128403 -281386 166144 35722 -100084 47810
10077c83515a18133j02905e7308n1613b0084m0970B2215e4579j32602h9408B2584
$$ -383515 -118133 -221038 -57308 -108921 -20084 -61054 22215 -54579 -187181 -89408 22584
10065a80011A0820b27049A58003d660k08640e6071I5020p28K6097a09028A14616
$$ -180011 10820 -227049 158003 -4660 -213300 -56071 95020 94292 120389 -109028 114616
10053d29955g1162R792A22687j4379P3464b95740D25846I6214b543j1024A46442
$$ -429955 -71162 -61370 122687 108308 181772 -295740 425846 96214 -2543 -13567 146442
10041A43600B9724h9349A74879f999A6798a47832M8898o541F5818b03494b4567
$$ 143600 29724 -89349 174879 -6999 16798 -147832 -98934 -105475 65818 -203494 -24567
10029B74419d8716k28060A2074a52843o1465A08822J50855M0804b04011I0236
$$ 274419 -48716 -276776 12074 -152843 -214308 108822 259677 300481 -204011 90236
10018A01256O655a00951E7271e4137K1117A06191k85L383c03403o2459a37792
$$ 101256 107911 -100951 57271 -54137 -33020 106191 105906 109289 -303403 -365862 -137792
10006a70828B63023d70196A99591H0766h087B00202D2418a66776I0714O6272C4265
$$ -170828 263023 -470196 199591 80766 -8087 200202 42418 -166776 90714 156986 34265
9994a24843k94395c4004k98995j03106F9056j4372g4877j66343B7121a0795B1216
$$ -124843 -419238 -34004 -332999 -436105 69056 54684 -74877 -241220 27121 -10795 21216
9982c29120f5337j580B99149N0049a37770i727H0252k946a53527j81928E2239
$$ -329120 -65337 -66917 299149 349198 -137770 -9727 80252 77306 -153527 -335455 52239
9970D1187J70326a84934I4163b42925A20333l0248K230g8161J9636o9284E8152
$$ 41187 211513 -184934 94163 -242925 120333 90085 92315 -78161 -58525 -127809 58152
9958e01558a53197L3600A28761J57217A25708E912K96458o4255f3396H8987a94973
$$ -501558 -153197 -119597 128761 285978 125708 5912 302370 238115 -63396 88987 -194973
9946d52600a46883g3088j66063j52093F9507a15188G5801f5331m8142o9458j83009
$$ -452600 -146883 -73088 -239151 -391244 69507 -115188 75801 -65331 -113473 -182931 -365940
9935c65940B8694P7610a4121k85869g797j44477E3961C956c2975k45252K3474
$$ -365940 28694 106304 -14121 -299990 -7797 -152274 53961 3956 -32975 -278227 -254753
9924b54753B23525a52260A88512d06485a41919B15815a4034A01318c15229d3450
$$ -254753 223525 -152260 188512 -406485 -141919 215815 -14034 101318 -315229 -43450
9913I2498a18631K8042n4410q5885g9813b9436B97098d3389C758a51766d6496
$$ 92498 -118631 -90589 -144999 -230884 -79813 -29436 297098 -43389 3758 -151766 -46496
9901a04848L0566c3266l91410a66237P3284b2620j03343d9732A10194g6293L3958
$$ -104848 -74282 -33266 -424676 -166237 -92953 -22620 -125963 -49732 110194 -76293 -42335
9890d2335H9950A4999a51540f9377j37938R4899N3168H948b09234e8503A41828
$$ -42335 89950 14999 -151540 -69377 -207315 -112416 -59248 8948 -209234 -58503 141828
9878a70557E780h5257E2947a49415b0312m6187j57975A46222c86177e3384p870
$$ -170557 5780 -85257 52947 -149415 -20312 -66499 -224474 146222 -386177 -53384 -61254
9867f1254A39812L8877J43900H896J16943c01142A44736c33788c5642J674j50377
$$ -61254 139812 178689 322589 8896 125839 -301142 144736 -333788 -35642 -33968 -184345
9856a84345R1875g028j32362a5381b259j89863e2198k41884J21973m2748Q8765
$$ -184345 -92470 -7028 -139390 -15381 -2259 -192122 -52198 -294082 -172109 -214857 -126092
9845a26092l9006j57806A08007a65948c5062j94510h8822j27771A15334k1586
$$ -126092 -165098 -322904 108007 -165948 -35062 -229572 -88822 -216593 115334 93748
9835I3748B2184c272A09160A6747f8322k95014C8546J9430b26571h2359F7055
$$ 93748 22184 -3272 109160 16747 -68322 -363336 38546 57976 -226571 -82359 67055
9823c86126a49571A73006c12389a52630A72181b68268Q0923P1259A53368A6576
$$ -386126 -149571 173006 -312389 -152630 172181 -268268 -187345 -116086 153368 16576
9812b10812I9466c09098J06007j92731i1672H2809l1262n763l557d5332k41044
$$ -210812 99466 -309098 -203091 -395822 -91672 82809 51547 45784 42227 -45332 -286376
9801b86376N5807N2810f1912j00041A22734b27428k17207B53052c99982c6501
$$ -286376 -230569 -177759 -61912 -161953 122734 -227428 -444635 253052 -399982 -36501
9790A36039A9165a37208d5549B03142N6564f2385A64411a06003B32610b19692
$$ 136039 19165 -137208 -45549 203142 259706 -62385 164411 -106003 232610 -219692
9779c36047d9691j6641j73670P4577M1537l923E0154a32403b6478A32971f5196
$$ -336047 -49691 -66332 -240002 -165425 -123888 -127811 50154 -132403 -26478 132971 -65196
9767h7434k09717J04477j99383A58399b49111B03606E3769a93064L6559k36798
$$ -87434 -297151 -192674 -392057 158399 -249111 203606 53769 -193064 -156505 -393303
9757c93303j7601a31801j33279f5833k89667L3934O5029J08910d2001j75546F03
$$ -393303 -410904 -131801 -265080 -65833 -355500 -321566 -256537 -147627 -42001 -217547 603
9745G5093C7205c75083a70877M4269c7858E4173K81593e1188A16674c96190a82556
$$ 75093 37205 -375083 -170877 -126608 -37858 54173 335766 -51188 116674 -396190 -182556
9733d2070j25545k58207b04655R245N5495f8092p8548A91734b86657A22697h3731
$$ -42070 -167615 -425822 -204655 -195410 -139915 -68092 -146640 191734 -286657 122697 -83731
9721c9492p7097n8449j0786g2407m0070A8280K5005a91342a1369B8921a16364
$$ -39492 -116589 -175038 -185824 -72407 -112477 18280 43285 -191342 -11369 28921 -116364
9709A88956J01574J24526g8021B02815g1481g913G1812b79931A07062c61115a73136
$$ 188956 290530 415056 -78021 202815 -71481 -7913 71812 -279931 107062 -361115 -173136
9697a89126A0756K3202c37859A60985l5512E5802A4228a10819j33473e612j25071
$$ -189126 10756 33958 -337859 160985 125473 55802 14228 -110819 -244292 -5612 -130683
9686a30683n6110g7669k4851l26148A30272b27831H1832J06530a42419f9740j37865
$$ -130683 -186793 -77669 -102520 -428668 130272 -227831 81832 188362 -142419 -69740 -207605
9675b07605j613L8642A37479A3534a00817k08671G7372a31306M862j75842H9126
$$ -207605 -209218 -170576 137479 13534 -100817 -309488 77372 -131306 -126444 -302286 89126
9663a33451a1200k72629J11895a4138C9280J36234K6426J3347D140O0430k0929
$$ -133451 -11200 -283829 -171934 -14138 39280 175514 201940 215287 4140 64570 43641
9652D3641b2106j35963f5474j02056E5921R0748A3142e3613o8494d0380k05452
$$ 43641 -22106 -158069 -65474 -167530 55921 146669 13142 -53613 -122107 -40380 -245832
9641b45832h7700j10921F0777g9492H0116N5155a90009I721f5089j4576b5286
$$ -245832 -87700 -198621 60777 -79492 80116 135271 -190009 9721 -65089 -79665 -25286
9629D0414a11486j69311B42971a66974C16137b26604A52502a72690G1610a49736
$$ 40414 -111486 -280797 242971 -166974 316137 -226604 152502 -172690 71610 -149736
9618A57457K18317c2255q8811E4586Q290a30475J0985F0249b2636o6053j47473
$$ 157457 375774 -32255 -121066 54586 62876 -130475 -119490 60249 -22636 -88689 -236162
9607b36162B148J23829a4124D6376b20639d8852n6186B70460a34659A1287e7740
$$ -236162 2148 125977 -14124 46376 -220639 -48852 -105038 270460 -134659 11287 -57740
9595G8997a32014m04848E206R3997c0489j45782P3110k10980a09861o2760k9219
$$ 78997 -132014 -536862 5206 99203 -30489 -176271 -103161 -314141 -109861 -172621 -201840
9584b01840B81304A4877K75128m3420a45171l756C0812a08692g250C1928d49088
$$ -201840 281304 14877 290005 246585 -145171 -148927 30812 -108692 -7250 31928 -449088
9572A20122k3632c11133D9232b42377i824r3476r8143K1147N2410j72197A64611
$$ 120122 96490 -311133 49232 -242377 -9824 -103300 -201443 -180296 -127886 -300083 164611
9560A4447a31872N8060K066C28200I4623a85962C8399a79151k9200A38614a64895
$$ 14447 -131872 -73812 -71746 328200 94623 -185962 38399 -179151 -208351 138614 -164895
9548A46268b93397b8246B3358b27442P3693j81658i7095j03375B725O7703J27572
$$ 146268 -293397 -28246 23358 -227442 -153749 -335407 -97095 -200470 2725 70428 198000
9537A98000a1147m3091F3169k6188g4971p8966f23j26093L7922l5102I7440k2456
$$ 198000 -11147 -54238 63169 36981 -74971 -153937 -623 -126716 -88794 -123896 97440 74984
9525G4984a08341C38147d2096j23573N9884c9256l3107C11138c24186g9666k5259
$$ 74984 -108341 338147 -42096 -165669 -105785 -39256 -72363 311138 -324186 -79666 -104925
9514a04925B1163K56794a20768B48282C592Q9771m5490J08459b13912a066k75739
$$ -104925 21163 277957 -120768 248282 3592 93363 47873 156332 -213912 -1066 -276805
9503b76805d5716k2852j73079F6521b34909a0831j96418e1149B03838a4448k28483
$$ -276805 -45716 -68568 -241647 66521 -234909 -10831 -207249 -51149 203838 -14448 -242931
9492b42931j5139c0773A00001c62103J04016a20359D7665a62947N3138j61379
$$ -242931 -258070 -30773 100001 -362103 -258087 -120359 47665 -162947 -109809 -271188
9482b71188B06665i3140A62266d4383j44978g5001B4775e32908j6233f6692j98212
$$ -271188 206665 -93140 162266 -44383 -189361 -75001 24775 -532908 -549141 -66692 -264904
9471b64904k5920e7112m9143L5724r2757N7747r5896c1477k53691J38311A65094
$$ -264904 -290824 -57112 -106255 -70531 -163288 -105541 -201437 -31477 -285168 -146857 165094
9459d14040G3963a39297A91374a11957G7266b5634k35606A53974p4803a65578
$$ -414040 73963 -139297 191374 -111957 77266 -25634 -261240 153974 79171 -165578
9448B01432C7729c39230a67952A56737b37063j05412P0840j02634C3903P8718
$$ 201432 37729 -339230 -167952 156737 -237063 -342475 -271635 -374269 33903 112621
9438A12621a38242B30355a84250F8988c40407G034l10d008C3802a31236M8535
$$ 112621 -138242 230355 -184250 68988 -340407 7034 6724 -4008 33802 -131236 -82701
9427h2701K4140B03188f1638A57124a54025f9818q1839A11781d9180k02729n2918
$$ -82701 -58561 203188 -61638 157124 -154025 -69818 -151657 111781 -49180 -251909 -304827
9416c04827d4516a9343H7067a08249j23473O0724j17726A3057b18054A73305c10743
$$ -304827 -44516 -19343 87067 -108249 -231722 -170998 -288724 13057 -218054 173305 -310743
9404b3012F912J74287b31651d8184k08943L4471J9492N1831j1327M8661b39B4460
$$ -23012 6912 181199 -231651 -48184 -257127 -222656 -203164 -151333 -162660 -113999 -239 24460
9391D5457i8j67100H5616b71748B53891b68057J33165d3409B5392L6881b04495
$$ 45457 -98 -167198 85616 -271748 253891 -268057 -134892 -43409 25392 62273 -204495
9379F5402a28816A09169n3654K7949d09951B19080F2576b97819a4436A31588i586
$$ 65402 -128816 109169 55515 83464 -409951 219080 62576 -297819 -14436 131588 -9586
9367c86398B01870n8131a53721A7131J93386b59268K6382l8718E9836h4213A68657
$$ -386398 201870 143739 -153721 17131 210517 -259268 -232886 -271604 59836 -84213 168657
9355A04835b60775M7310o168G4453M81955b40450e4576J7221r0253N0217k37183
$$ 104835 -260775 -213465 -219633 74453 556408 -240450 -54576 -37355 -127608 -77391 -314574
9344c14574a26187A12633d29263D4031a05756k58467a22545M6704A2116P7075
$$ -314574 -126187 112633 -429263 44031 -105756 -364223 -122545 -75841 12116 89191
9334H9191p145j4274J53395b79929R6445q8494b7184A09384b71380O7643A97419
$$ 89191 82046 67772 221167 -279929 -183484 -271978 -27184 109384 -271380 -203737 197419
9322A54715j5352a34595c0344j42123j9996a7677o2207j00438A03824K5537i5183
$$ 154715 139363 -134595 -30344 -172467 -192463 -17677 -79884 -180322 103824 129361 -95183
9310a07633B14313b29328j75273A31812l284L98013c5339l45894B01703a71208
$$ -107633 214313 -229328 -404601 131812 128528 526541 -35339 -381233 201703 -171208
9299A78024c8317n9719k01029a04451c8734j83902c2241q796G9165b6188j03179
$$ 178024 -38317 -98036 -299065 -104451 -38734 -222636 -32241 -41037 79165 -26188 -129367
9288a29367m8695d6743A6077b78839B18438F0644a58919n5464I2199K1644b87198
$$ -129367 -178062 -46743 16077 -278839 218438 60644 -158919 -214383 92199 113843 -287198
9276B1464i7817b6322p5472f683F7599N4670m0214b66456J24001B0205c5571j50337
$$ 21464 -97817 -26322 -101794 -6683 67599 122269 82055 -266456 -142455 20205 -35571 -185908
9264a85908M5965J2453I0156b56473a3139k38261A81760F4013a407j29095j00213
$$ -185908 -139943 -127490 90156 -256473 -13139 -251400 181760 64013 -1407 -130502 -230715
9253b30715B6207n555M16826a96760C02277n1053a03735j98304g7917K309j01456
$$ -230715 26207 20652 437478 -196760 302277 251224 -103735 -302039 -77917 -75608 -177064
9242a77064c6105C587e8937n3676L4207j27338A68112q1478H329b59257a1622
$$ -177064 -36105 3587 -58937 -112613 -78406 -205744 168112 86634 8329 -259257 -11622
9230b3908k76808p060H9063I27K78324B0774f9719k74920c9051j16901l4896h3915
$$ -23908 -300716 -307776 89063 927 279251 20774 -69719 -344639 -39051 -155952 -190848 -83915
9217b57666J08198n0739d678k29899f573A56320d40901c2813j34391C5556a36081
$$ -257666 -149468 -200207 -4678 -234577 -6573 156320 -440901 -32813 -167204 35556 -136081
9205b02235e7500A02770d11921I5987b15476A90813a12919k42156a70055d9006
$$ -202235 -57500 102770 -411921 95987 -215476 190813 -112919 -355075 -170055 -49006
9194h4311k988B2445K5561D676J872b4227B51510a79848l2644f9791r740K9566
$$ -84311 -87299 22445 48006 4676 6548 -24227 251510 -179848 -212492 -69791 -79531 -49965
9182d9965B3014f9754I4668L04489b09222F4769a17198c9834k79867b0422j15270
$$ -49965 23014 -69754 94668 399157 -209222 64769 -117198 -39834 -319701 -20422 -135692
9171a35692K5379j75526p1630A13012B4082M59602a92829A3609f2238m9561A7907
$$ -135692 -110313 -285839 -357469 113012 24082 483684 -192829 13609 -62238 -111799 17907
9159d13491C0101c86220a15840o245A22664a29786b8765j59476J0834A20088C4091
$$ -413491 30101 -386220 -115840 -122085 122664 -129786 -28765 -188241 -177407 120088 34091
9147B0503a82727B2848i3640N34j81524i4732D0010K03377B1340a24829A17495
$$ 20503 -182727 22848 -93640 -93106 -274630 -94732 40010 243387 21340 -124829 117495
9135D1168b64756B15245k3112J015a04402A45094f4738r4658l7236M6635j07022
$$ 41168 -264756 215245 192133 193148 -104402 145094 -64738 -159396 -196632 -149997 -257019
9124b57019A8517a20113A85865b61307a28617D3747j631i0178K087j00082B17826
$$ -257019 18517 -120113 185865 -261307 -128617 43747 42116 -90178 -88091 -188173 217826
9112B89116j14408b70005F0939c07119A84493A8698h2283F4222J47503m5040n9890
$$ 289116 174708 -270005 60939 -307119 184493 18698 -82283 64222 211725 166685 106795
9101A06795A5172b42794k2094P3191A97313D3709J3015a19832b2390j45483Q3540
$$ 106795 15172 -242794 -264888 -191697 197313 43709 56724 -119832 -22390 -167873 -84333
9090h4333A99889d8068l20473d2524k75646j3185G5664a64055O4339d7801m1288
$$ -84333 199889 -48068 -368541 -42524 -318170 -331355 75664 -164055 -99716 -47801 -89089
9079h9089C1411R8606f5553l05118B49669a7634l1944g046k89481A91569e1021
$$ -89089 31411 130017 -65553 -370671 249669 -17634 -49578 -7046 -296527 191569 -51021
9067i3459j04774A0768a12345e3778F7964e35928g1403j30841m1728R7195L3825
$$ -93459 -198233 10768 -112345 -53778 67964 -535928 -71403 -202244 -243972 -146777 -112952
9056a12952A84844d2235j30951K6894B26064a2584l99639g7690G3567a44750d9591
$$ -112952 184844 -42235 -173186 -146292 226064 -12584 -412223 -77690 73567 -144750 -49591
9044b62796J22694r3874L4799Q7604j642c9101c792m512l2148j38912A46496p0278
$$ -262796 -140102 -233976 -199177 -111573 -113215 -39101 -3792 -8304 -40452 -179364 146496 76218
9032G6218J44762b21954g5557j81863k7467f654H746c20958A101L1948a13480
$$ 76218 220980 -221954 -75557 -257420 -284887 -6654 8746 -320958 1101 33049 -113480
9020c4110m9901C82485D3323A7931Q0565h176A33774b89034g0534I0699i0400
$$ -34110 -84011 382485 43323 17931 98496 -8176 133774 -289034 -70534 90699 -90400
9008c39153i2689r898a1669j65026g7149l30927a58875M4352k87240a67890g8991
$$ -339153 -92689 -102587 -11669 -176695 -77149 -408076 -158875 -114523 -401763 -167890 -78991
8996a56216j38771a08539q3841m2944B52487a22141e2316A28358e1250B7331Q5082
$$ -156216 -294987 -108539 -192380 -235324 252487 -122141 -52316 128358 -51250 27331 112413
8985A12413J95022C4299a48093i313k23773c08E04770g2255A54894b23278Q5724
$$ 112413 307435 34299 -148093 -9313 -233086 -308 504770 -72255 154894 -223278 -137554
8974a37554B60975e0352A76438b16749a1937p1445A57434R9726d7781k49894G65
$$ -137554 260975 -50352 176438 -216749 -11937 -83382 157434 257160 -47781 -297675 765
8962i2249k56759C04597f4322m55255P7811a93145h4280L4523j42732J0363A68756
$$ -92249 -349008 304597 -64322 -519577 -441766 -193145 -84280 -49757 -192489 -182126 168756
8950D047d9542k15842h4193K9277j60075M340F6275h2665A7023J44238c3837E6020
$$ 4047 -49542 -265384 -84193 -54916 -214991 -210651 66275 -82665 17023 161261 -33837 56020
8937B26442B6163b91465B61301J62133A33210B9137a48185e4969p6933J8241B35475
$$ 226442 26163 -291465 261301 423434 133210 29137 -148185 -54969 -131902 -113661 235475
8925B52209H7445J027658Q49915K855179P540460B622124D31801A63757Q9542
$$ 252209 87445 1115103 1965018 4820197 12360657 2622124 431801 163757 253299
8916B53299j2252B2167o365P4968a17813A7368K93916f627B34869b1507A37065
$$ 253299 241047 22167 15802 90770 -117813 17368 311284 -6627 234869 -21507 137065
8904D6529a04349j84257A98477H2347L6844e3126j35180B14491E5245b6392B19099
$$ 46529 -104349 -288606 198477 82347 119191 -53126 -188306 214491 55245 -26392 219099
8892A13522b63775E5229b05472A7418g5755j172G8514g7620i76l38824A06098
$$ 113522 -263775 55229 -205472 17418 -75755 -76927 78514 -77620 -976 -339800 106098
8880a27166B79844b17702H2764J42025b40499D6967a71569B04228g1212m0362
$$ -127166 279844 -217702 82764 224789 -240499 46967 -171569 204228 -71212 -111574
$$ [...]
##END NTUPLES=NMR SPECTRUM
##END=
