##TITLE=AC1706_ROEFFECT0029_8638349_uYmLTuHmfP
##JCAMPDX= 6.0         $$ Bruker NMR JCAMP-DX V2.0
##DATA TYPE= NMR SPECTRUM
##DATA CLASS= NTUPLES
##ORIGIN= BRUKER
##OWNER= Administrator
$$ 1.72 TOPSPIN		Version 2.1
$$ 2014-05-23 04:03:44.321 -0700  Administrator@X
$$ Compression mode = diff/dup
##.OBSERVE FREQUENCY= 400.02188249412
##.OBSERVE NUCLEUS= ^1H
##.ACQUISITION MODE= SIMULTANEOUS (DQD)
##.ACQUISITION SCHEME= undefined
##.AVERAGES= 64
##.DIGITISER RES= 22
##SPECTROMETER/DATA SYSTEM= spect
##.PULSE SEQUENCE= noesygpps1d.comp
##.SOLVENT NAME= COFFEE_meoh
##.SHIFT REFERENCE= INTERNAL, COFFEE_meoh, 1, 14.96113
##AUDIT TRAIL= $$ (NUMBER, WHEN, WHO, WHERE, PROCESS, VERSION, WHAT)
$$ ##TITLE= Audit trail, TOPSPIN		Version 2.1
$$ ##JCAMPDX= 5.01
$$ ##ORIGIN= Bruker BioSpin GmbH
$$ ##OWNER= Administrator
$$ $$ E:\/data/COFFEE/nmr/AC1706_ROEFFECT0029_8638349_uYmLTuHmfP/12/pdata/1/auditp.txt
$$ ##AUDIT TRAIL=  $$ (NUMBER, WHEN, WHO, WHERE, PROCESS, VERSION, WHAT)
(   1,<2014-05-23 04:03:39.352 -0700>,<Administrator>,<X>,<go>,<TOPSPIN 2.1>,
      <created by zg
	started at 2014-05-23 03:52:09.959 -0700,
	POWCHK enabled, PULCHK disabled,
       configuration hash MD5:
       C8 4E 4E 5D D3 5C D8 9E 9F 52 82 E0 59 8A DE 15
       data hash MD5: 64K
       C8 26 FE C8 93 89 58 A6 22 76 3A 3B C2 3D 8D F6>)
(   2,<2014-05-23 04:03:42.321 -0700>,<Administrator>,<X>,<proc1d>,<TOPSPIN 2.1>,
      <Start of raw data processing
       efp LB = 0.3 FT_mod = 6 PKNL = 1 PHC0 = 0 PHC1 = 0 SI = 128K 
       data hash MD5: 128K
       B5 5A 10 53 C0 3D 74 ED 22 AE 41 21 38 44 00 01>)
(   3,<2014-05-23 04:03:43.242 -0700>,<Administrator>,<X>,<proc1d>,<TOPSPIN 2.1>,
      <pk PHC0 = -86.47339 PHC1 = 0 
       data hash MD5: 128K
       9F AC A1 D4 91 52 0E 16 B7 7A 5B 9B BA 97 A7 E8>)
(   4,<2014-05-23 04:03:43.696 -0700>,<Administrator>,<X>,<proc1d>,<TOPSPIN 2.1>,
      <abs ABSG = 1 
       data hash MD5: 128K
       F6 F7 36 0C 40 AF A1 BB 00 9A 83 FB D4 FC 01 91>)
(   5,<2014-05-23 04:03:43.821 -0700>,<Administrator>,<X>,<proc1d>,<TOPSPIN 2.1>,
      <abs ABSG = 2 
       data hash MD5: 128K
       09 A2 FD 84 32 FA C7 4C A9 EB A9 8A 6E 7A 58 C0>)
(   6,<2014-05-23 04:03:43.930 -0700>,<Administrator>,<X>,<proc1d>,<TOPSPIN 2.1>,
      <abs ABSG = 3 
       data hash MD5: 128K
       DE F4 2F 8D 1C 30 4E 96 4A C1 FB A8 9E C0 97 CB>)
(   7,<2014-05-23 04:03:44.039 -0700>,<Administrator>,<X>,<proc1d>,<TOPSPIN 2.1>,
      <abs ABSG = 4 
       data hash MD5: 128K
       18 1F D1 23 C1 61 55 E5 A4 26 B3 52 2C 18 A2 26>)
(   8,<2014-05-23 04:03:44.133 -0700>,<Administrator>,<X>,<proc1d>,<TOPSPIN 2.1>,
      <abs ABSG = 5 
       data hash MD5: 128K
       94 11 0E 78 71 97 CE D9 38 4B 8B 80 B4 27 7F E5>)
$$ ##END=
$$ 
$$ $$ hash MD5
$$ $$ B8 85 C1 8A 36 BD EB 17 47 FB E5 B9 1A BF ED 47
##$RELAX= 
##$RELAX= 
##$RELAX= 
##$RELAX= 
##$RELAX= 
##$RELAX= 
##$RELAX= 
##$RELAX= 
$$ Bruker specific parameters
$$ --------------------------
##$DU= <E:\>
##$EXPNO= 12
$$ [...]
##$TP07= 0
##$TPNAME0= <>
##$TPNAME1= <>
##$TPNAME2= <>
##$TPNAME3= <>
##$TPNAME4= <>
##$TPNAME5= <>
##$TPNAME6= <>
##$TPNAME7= <>
##$TPOAL= (0..7)
0.5 0.5 0.5 0.5 0.5 0.5 0.5 0.5
##$TPOFFS= (0..7)
0 0 0 0 0 0 0 0
##$TUNHIN= 0
##$TUNHOUT= 0
##$TUNXOUT= 0
##$USERA1= <user>
##$USERA2= <user>
##$USERA3= <user>
##$USERA4= <user>
##$USERA5= <user>
##$V9= 5
##$VALIST= <valist>
##$VCLIST= <CCCCCCCCCCCCCCC>
##$VD= 0
##$VDLIST= <DDDDDDDDDDDDDDD>
##$VPLIST= <PPPPPPPPPPPPPPP>
##$VTLIST= <TTTTTTTTTTTTTTT>
##$WBST= 2048
##$WBSW= 25
##$XGAIN= (0..3)
0 0 0 0
##$XL= 0
##$YL= 0
##$YMAX_a= 7294582
##$YMIN_a= -14678521
##$ZGOPTNS= <>
##$ZL1= 120
##$ZL2= 120
##$ZL3= 120
##$ZL4= 120
##$ABSF1= 14.96113
##$ABSF2= -5.597052
##$ABSG= 5
##$ABSL= 3
##$ALPHA= 0
##$AQORDER= 0
##$ASSFAC= 0
##$ASSFACI= 0
##$ASSFACX= 0
##$ASSWID= 0
##$AUNMP= <proc_prof1d_extract.lims>
##$AXLEFT= 0
##$AXNAME= <>
##$AXNUC= <1H>
##$AXRIGHT= 0
##$AXTYPE= 0
##$AXUNIT= <>
##$AZFE= 0.1
##$AZFW= 0.1
##$BCFW= 0
##$BC_mod= 0
##$BYTORDP= 0
##$COROFFS= 0
##$CY= 15
##$DATMOD= 1
##$DC= 0
##$DFILT= <>
##$DTYPP= 0
##$F1P= 0
##$F2P= 0
##$FCOR= 0.5
##$FTSIZE= 131072
##$FT_mod= 6
##$GAMMA= 0
##$GB= 0
##$INTBC= 1
##$INTSCL= 1
##$ISEN= 128
##$LB= 0.3
##$LEV0= 0
##$LPBIN= 0
##$MAXI= 10000
##$MC2= 0
##$MEAN= 0
##$ME_mod= 0
##$MI= 0
##$NCOEF= 0
##$NC_proc= -2
##$NLEV= 6
##$NOISF1= 0
##$NOISF2= 0
##$NSP= 0
##$NTH_PI= 0
##$NZP= 0
##$OFFSET= 14.96113
##$PC= 1
##$PHC0= -86.47339
##$PHC1= 0
##$PH_mod= 1
##$PKNL= yes
##$PPARMOD= 0
##$PPDIAG= 0
##$PPIPTYP= 0
##$PPMPNUM= 2147483647
##$PPRESOL= 1
##$PSCAL= 4
##$PSIGN= 0
##$PYNMP= <proc.py>
##$REVERSE= no
##$SF= 400.020009584776
##$SI= 131072
##$SIGF1= 0
##$SIGF2= 0
##$SINO= 400
##$SIOLD= 131072
##$SPECTYP= <>
##$SREGLST= <1H.CDCl3>
##$SSB= 0
##$STSI= 131072
##$STSR= 0
##$SW_p= 8223.68421052631
##$SYMM= 0
##$S_DEV= 0
##$TDeff= 65536
##$TDoff= 0
##$TI= <>
##$TILT= no
##$TM1= 0
##$TM2= 0
##$TOPLEV= 0
##$USERP1= <user>
##$USERP2= <user>
##$USERP3= <user>
##$USERP4= <user>
##$USERP5= <user>
##$WDW= 1
##$XDIM= 131072
##$YMAX_p= 432381091
##$YMIN_p= -12642
##$CURPLOT= <Network HP LaserJet P1505>
##$CURPRIN= <$Network HP LaserJet P1505>
##$DFORMAT= <normdp>
##$LAYOUT= <+/1D_H.xwp>
##$LFORMAT= <normlp>
##$PFORMAT= <normpl>
##$SURQMSG= 1
$$ End of Bruker specific parameters
$$ ---------------------------------
##NTUPLES= NMR SPECTRUM
##VAR_NAME=  FREQUENCY,     SPECTRUM/REAL,   SPECTRUM/IMAG
##SYMBOL=    X,             R,               I
##VAR_TYPE=  INDEPENDENT,   DEPENDENT,       DEPENDENT
##VAR_FORM=  AFFN,          ASDF,            ASDF
##VAR_DIM=   131072,        131072,          131072
##UNITS=     HZ,            ARBITRARY UNITS, ARBITRARY UNITS
##FACTOR=    0.0627417313425164, 1,          1
##FIRST=     8223.62146879497, 1291,         -68969
##LAST=      0,             3465,            -69433
##MIN=       0,             -12642,          0
##MAX=       8223.62146879497, 432381091,    0
$$ Real data points
##PAGE= N=1
##DATA TABLE= (X++(R..R)), XYDATA
$$ [...]
67702 123559 124571 125824 126885 127337 127284 127306 127793 128464 128719 128350 127672 127066 126702 126721 127299 128375 129603 130712
67684 130712 131663 132311 132307 131573 130588 129922 129781 130249 131505 133378 135064 135925 136346 137232 138795 140468 141867
67667 141867 143149 144460 145746 147205 149171 151364 152953 153683 154323 155547 156946 157650 157559 157387 157715 158430
67651 158430 158941 158596 157077 154764 152578 151150 150248 149330 148439 148194 148980 150457 151881 152637 152561 152009 151592
67634 151592 151609 151727 151395 150539 149647 149271 149666 150947 153284 156732 160886 164813 167515 168625 168737 168924 169784
67617 169784 171022 171941 172187 171898 171354 170771 170385 170499 171347 172951 175154 177736 180480 183129 185299 186480
67601 186480 186239 184513 181690 178436 175461 173291 172050 171381 170722 169753 168577 167508 166763 166294 165836 165144
67585 165144 164308 163696 163426 163009 161815 159900 158128 157417 158013 159454 161012 162154 162867 163558 164496 165366 165670
67568 165670 165513 165588 166305 167294 167910 167927 167560 167147 167012 167317 167790 167896 167525 167267 167706 168675 169602 170357 171305
67549 171305 172508 173358 173192 172087 170840 170223 170355 170772 171033 171200 171655 172497 173310 173579 173232 172646 172213 171956
67531 171956 171574 170791 169719 168850 168588 168816 169070 169147 169313 169895 170912 172194 173624 175046 176185 176896 177415
67514 177415 178094 178913 179472 179521 179326 179354 179627 179549 178518 176758 175340 175256 176521 178338 179983 181273 182286
67497 182286 183079 183873 185165 187243 189609 191206 191382 190512 189518 188813 187979 186649 185428 185464 187033 189124
67481 189124 190667 191693 192795 193863 194128 193359 192285 191698 191707 192008 192373 192582 192408 192018 192004 192669 193532 193875
67463 193875 193561 193053 192861 193289 194511 196511 198927 201189 202875 203939 204716 205763 207484 209817 212356
67448 212356 214804 217041 218825 219831 220131 220281 220623 220790 220189 218843 217493 216936 217468 218876 220806 223083
67432 223083 225661 228261 230287 231368 231865 232445 233160 233395 232738 231451 229958 228369 226771 225534 224958 224908
67416 224908 225057 225247 225386 225337 225164 225140 225293 225289 225065 225149 225956 227144 228094 228713 229250 229643 229651 229497 229753 230658 232076
67395 232076 234081 236896 240076 242369 242851 241920 240806 240291 240304 240636 241482 242896 244115 244092 242866 241837
67379 241837 242218 243615 244702 245053 245433 246296 246936 246580 245621 245143 245662 246874 248299 249578 250380 250612 250661
67362 250661 250977 251506 251879 251984 252012 252156 252723 254316 257260 260863 263758 265088 264997 264050 262757 261740 261768
67345 261768 263129 265173 266853 267739 268348 269514 271532 273907 275852 276995 277584 278115 278864 279752 280483 280826
67329 280826 280897 281209 282279 284178 286630 289376 292146 294409 295680 296123 296317 296319 295575 294001 292498 291973 292314
67312 292314 292853 293359 294031 294842 295591 296370 297394 298463 299112 299261 299262 299386 299682 300255 301313 302895 304834 306905
67294 306905 308801 310187 311031 311701 312459 313184 313821 314658 315722 316409 316318 316078 316630 317955 319277 320275 321207
67277 321207 321921 321737 320563 319350 319035 319583 320367 321047 321743 322688 323958 325309 326229 326445 326448 327118 328736 330683
67259 330683 332194 333031 333378 333514 333783 334505 335673 336907 337810 338192 338022 337458 336924 336808 337040 337254 337370 337672
67241 337672 338327 339193 340121 341083 341937 342460 342656 342782 343032 343491 344303 345496 346717 347575 348217 349106 350222 351036
67223 351036 351374 351779 352855 354618 356620 358329 359300 359456 359331 359612 360289 360736 360724 360800 361344 361835 361564 360779
67205 360779 360558 361624 363628 365588 366794 367291 367643 368303 369196 369962 370531 371333 372905 375353 378096 380105
67189 380105 380612 379861 378997 378999 379851 380920 381745 382111 381811 381012 380617 381513 383471 385390 386614 387399 388137 388881
67171 388881 389711 390809 391913 392304 391679 390537 389545 388984 388910 389301 389835 390104 390186 390469 390829 390759 390528 391259 393400
67152 393400 395855 397317 397825 398294 399067 399766 400240 400849 401849 403145 404636 406292 407935 409355 410621 411961
67136 411961 413366 414613 415585 416278 416651 416750 416914 417558 418754 420160 421227 421426 420584 419261 418544 419126 420699
67119 420699 422466 424025 425535 427227 429074 430843 432215 432969 433172 433109 432942 432713 432692 433371 434853 436647
67103 436647 438367 440312 442938 445941 448330 449378 449301 449066 449619 451129 452790 453600 453471 453323 453912 454889
67087 454889 455312 454803 453827 453077 452980 453717 455290 457434 459640 461368 462300 462645 463221 464908 467709 470550 472267
67070 472267 472751 472946 473826 475534 477446 478926 479931 480832 481671 481941 481395 480774 481133 482563 484192 485485
67054 485485 486891 489005 491750 494678 497458 499690 500857 501006 501067 501957 503684 505746 508001 510557 513095
67039 513095 514960 515975 516705 517857 519685 521957 524283 526415 528302 529820 530622 530583 530354 530998 532970 535873
67023 535873 539194 542717 546065 548615 550234 551626 553533 556068 559074 562490 566018 569067 571511 573922
67009 573922 576575 578887 580433 581834 583952 586805 590003 593599 597563 601030 603213 604802 607303 611090
66995 611090 615117 618514 621475 624460 627503 630557 633701 636719 639200 641323 643948 647577 651706 655485
66981 655485 658633 661443 664270 667274 670443 673705 677151 681084 685634 690434 694969 699178 703395 707845
66967 707845 712498 717291 722105 726708 731083 735689 741044 747165 753655 760093 766089 771443 776660 782827
66953 782827 790425 798683 806701 814582 822787 831030 838846 846739 855545 864997 874216 883442 893851 905656
66939 905656 917860 930117 943278 957523 971396 983646 994952 1006853 1019828 1033351 1047230
66928 1047230 1061854 1077456 1093919 1111061 1128555 1145932 1163176 1181014 1200058 1220006 1240126
66917 1240126 1260221 1280641 1301731 1323683 1346592 1370224 1394120 1418353 1443747 1470845 1499115
66906 1499115 1527673 1556390 1585658 1615507 1645685 1676419 1708344 1741743 1776376 1811982 1848419
66895 1848419 1885409 1922684 1960338 1998589 2037239 2075866 2114436 2153247 2192280 2231204 2270070
66884 2270070 2309483 2349804 2390537 2430758 2469889 2507827 2544497 2579602 2612878 2644387 2674317
66873 2674317 2702500 2728355 2751582 2772736 2792700 2811584 2828540 2842720 2853936 2862196 2867149 2868417
66861 2868417 2866146 2860786 2852529 2841320 2827186 2810161 2790079 2766876 2741015 2713215 2683819 2652641
66849 2652641 2619327 2583635 2545589 2505619 2464371 2422117 2378631 2333982 2289083 2244892 2201280
66838 2201280 2157336 2112696 2067934 2023600 1979489 1935172 1890772 1846942 1804308 1763170 1723497
66827 1723497 1684987 1647230 1609925 1572891 1535965 1499139 1462776 1427383 1393132 1359849 1327513
66816 1327513 1296370 1266459 1237382 1208790 1180852 1153923 1127932 1102387 1076941 1051730 1027133
66805 1027133 1003400 980575 958628 937515 917053 896877 876700 856701 837504 819585 802750
66794 802750 786364 770032 753838 737966 722376 706967 691809 677069 662873 649361 636669
66783 636669 624634 612718 600545 588488 577428 567895 559564 551636 543448 534698 525391 515762 506152
66770 506152 496752 487528 478490 469906 462057 454849 447870 440800 433621 426534 419813 413633 407775 401650
66756 401650 394922 388068 381881 376460 371193 365810 360837 356653 352711 348241 343375 338878 334975 331150
66742 331150 327092 323183 319817 316764 313477 309722 305649 301481 297276 292844 287878 282448 277424 273989
66728 273989 272455 271777 270451 267775 264197 260642 257758 255598 253745 251729 249404 247002 244822 242920
66714 242920 241072 238959 236471 233926 231791 229971 227575 223808 219041 214630 211610 209903 208774 207597
66700 207597 206054 204081 201962 200191 198936 197833 196480 194863 193151 191377 189554 187826 186186 184248
66686 184248 181665 178623 175663 173142 171157 169865 169446 169664 169776 169068 167430 165343 163373 161758 160475
66671 160475 159529 158960 158544 157771 156407 154860 153669 152728 151433 149569 147631 146226 145515 145281 145104 144388
66655 144388 142781 140807 139576 139528 139911 139846 139375 138923 138199 136483 133857 131355 129731 128721 127726 126711
66639 126711 126057 125921 126174 126728 127458 127813 127023 124991 122734 121575 121850 122644 122853 122212 121189 120265 119686
66622 119686 119660 120229 120933 121113 120662 120061 119559 118749 117235 115307 113627 112477 111654 110896 110108 109299 108616 108362
66604 108362 108718 109448 110011 109978 109348 108611 108481 109279 110525 111379 111559 111461 111358 110991 110169 109243 108581 107969 107015
66585 107015 105831 104874 104354 104214 104429 104833 104901 104266 103253 102443 101840 101090 100337 100160 100617 101052 101030 100827 100729
66566 100729 100418 99468 98039 96668 95623 94874 94465 94472 94644 94424 93460 91976 90614 89951 90033 90301 90030 88984
66548 88984 87616 86590 86210 86345 86734 87228 87776 88347 88852 89123 89047 88777 88711 89109 89766 90140 89836 88879 87612
66529 87612 86477 85920 86243 87293 88346 88560 87684 86205 84777 83658 82784 82108 81633 81275 80999 81030 81617
66512 81617 82549 83158 82923 81902 80592 79563 79226 79636 80427 81120 81560 81916 82306 82667 82984 83277 83409 83213
66494 83213 82871 82741 82726 82288 81283 80289 79830 79683 79305 78568 77698 76809 75971 75456 75440 75630 75636 75598 75964 76751
66474 76751 77463 77732 77660 77458 77131 76658 76218 76081 76334 76726 76806 76358 75788 75825 76657 77599 77873 77420 76694 75959
66454 75959 75271 74916 75305 76387 77567 78246 78198 77539 76698 76285 76533 76947 76931 76691 76974 77943 78931 79434 79671
66435 79671 79876 79671 78664 77268 76375 76417 77188 78386 79795 80966 81300 80663 79607 78759 78222 77773 77425
66418 77425 77443 77869 78376 78708 78989 79393 79766 79860 79854 80186 80816 81067 80395 79065 77736 76644 75574 74524 73887
66399 73887 73845 73986 73812 73482 73679 74702 75951 76526 76209 75584 75257 75301 75584 76180 77115 78005 78471 78732 79260
66380 79260 79906 79960 79141 77941 76848 75855 74948 74437 74432 74589 74834 75748 77651 79752 80908 80909 80414 79922 79494
66361 79494 79242 79251 79061 77994 76133 74327 73094 72047 70621 68860 67280 66319 66145 66650 67448 68148 68816
66344 68816 69936 71786 74057 76118 77454 77817 77246 76066 74719 73575 72957 73114 73918 74748 75099 75174 75503
66327 75503 76091 76456 76427 76319 76230 75772 74756 73680 73217 73519 74219 74906 75359 75600 75887 76404 76835 76580 75637
66308 75637 74962 75612 77629 80021 81708 82259 81834 80759 79341 77911 76810 76186 75855 75551 75331 75511 76092
66291 76092 76530 76338 75722 75304 75333 75513 75528 75318 74881 74177 73377 72879 72945 73466 74144 74735 75162 75563 76191 77062
66271 77062 77820 78187 78437 79094 80231 81428 82338 82934 83204 83028 82428 81633 80826 80124 79750 79851 80161 80249 80079
66252 80079 79935 79794 79326 78600 78214 78499 79078 79502 79823 80164 80192 79564 78632 78112 78114 78008 77311 76269 75381 74730
66232 74730 74110 73586 73519 73972 74528 74933 75616 77111 79100 80648 81412 82050 83154 84360 84941 84834 84524 84247
66214 84247 83884 83364 82641 81525 80131 79253 79556 80524 80931 80307 79228 78268 77485 77032 77322 78247 78997 79097
66196 79097 79002 79259 79651 79679 79417 79362 79750 80428 81153 81710 82073 82719 84325 86729 88601 88734 87409 85962
66178 85962 85163 84582 83483 81765 79882 78280 77198 76758 76902 77322 77733 78289 79500 81538 83763 85246
66162 85246 85715 85684 85630 85528 85354 85479 86152 87007 87579 87893 88053 87680 86491 85091 84390 84401 84404 84178 84123 84238
66142 84238 83989 83448 83570 84912 86820 88259 88901 89053 89149 89672 90966 92709 94051 94574 94652 94716 94755 94755 94910
66123 94910 95063 94662 93700 93013 93140 93512 93269 92372 91430 90942 91174 92257 93903 95473 96650 97525 97803 96834
66105 96834 94931 93705 94246 95708 96535 96463 96311 96431 96505 96586 97198 98499 100251 102442 105040 107286 108236
66088 108236 108013 107639 107566 107302 106574 105912 105754 105763 105493 105112 105046 105297 105498 105341 104785 104098 103850 104463 105631 106499
66068 106499 106584 106218 105981 106099 106548 107347 108387 109210 109366 108958 108596 108710 109057 109045 108483 107808 107476 107377 107113
66049 107113 106686 106441 106426 106264 105775 105197 104736 104421 104587 105803 107952 109987 111116 111725 112607 113759 114554
66032 114554 114769 114712 114624 114566 114724 115236 115875 116403 117091 118315 119841 121035 121666 121960 122040 121886 121755 122055 122806
66013 122806 123718 124688 125751 126653 127120 127488 128501 130383 132605 134626 136451 138473 141122 144686 149065
65998 149065 153753 158407 163286 168703 174230 178997 182684 185656 188146 189953 191024 191775 192578 193308 193537
65983 193537 192883 191144 188427 185194 181901 178580 175018 171237 167482 163881 160480 157452 154853 152307
65969 152307 149425 146454 144039 142427 141383 140734 140461 140314 139964 139525 139299 139033 138148 136835 136183 136822 138018
65952 138018 138624 138555 138833 140338 142976 146044 148978 151534 153440 154401 154658 155210 156942 159511 161688 162861
65936 162861 163646 164792 166205 167476 168743 170364 172224 174012 175811 177780 179700 181543 184020 187761
65922 187761 192263 196511 200305 204072 207652 210418 212532 215001 218361 222204 226145 230360 234923 239435
65908 239435 243548 247171 250037 251815 252765 253500 253974 253550 252234 250916 250091 249206 247707 245900 244283 242693
65892 242693 240655 238026 234805 230815 226012 220756 215456 210272 205297 200583 195889 190995 186334 182630
65878 182630 179728 176560 172535 168213 164318 160914 157990 155984 155089 154684 154127 153573 153361 153127 152231 150773
65862 150773 149552 149187 149680 150589 151251 151175 150533 150001 149875 149770 149388 149031 149013 149153 149275 149621 150306 150939 151315
65843 151315 151936 153189 154510 155082 154995 154990 155345 155769 156228 157153 158826 161090 163620 166084 168166 169964 172241
65826 172241 175795 180555 185740 190891 196297 202377 208999 215575 221647 227214 232514 237531 241763 244602
65812 244602 245790 245329 243198 239605 235329 231141 226843 221633 215583 209967 205777 202605 199480 196094
65798 196094 192629 189005 185093 181320 178308 176143 174533 173515 173485 174683 176999 180013 182917 184906 186166
65783 186166 188018 191478 196068 200748 205559 211488 218886 226988 234996 242829 250650 258376 265865 272963
65769 272963 279132 283507 285585 285471 283279 278776 271866 263107 253417 243490 233738 224635 216786 210658
65755 210658 206403 203945 203157 203934 206164 209739 214619 220761 227892 235572 243692 252758 263317 275126
65741 275126 287220 298688 308903 317097 322455 324939 325412 324510 321786 316398 308280 298180 286873
65728 286873 274850 262672 251034 240307 230166 219812 208672 197094 186332 177592 171056 166102
65716 166102 162282 159561 157679 155958 153942 151618 148880 145472 141795 139063 138139 138635 139475 139870 139498
65701 139498 138465 137486 137515 138659 140024 141005 141985 143263 144159 143990 143228 142812 142855 142942 143208 144092 145424 146763
65683 146763 148422 151157 154953 159031 163013 167197 171746 176510 181693 187893 195334 203764 213116 223569
65669 223569 234906 246550 258402 270975 284521 298615 312767 326846 340622 353413 364499
65658 364499 373632 380962 386699 390918 393536 394548 394432 394076 393998 394000 393956 394561 396686 400273 404518 408815 412745
65641 412745 415308 415155 411733 405498 396854 385599 371648 355628 338453 320762 303066 286026 270249
65628 270249 255940 242882 230652 218914 207800 197918 189782 183327 178120 173704 169470 164697 159282
65615 159282 154138 150234 147492 145210 143246 142006 141496 141189 140811 140540 140457 140525 141026 142319 144099 145575
65599 145575 146319 146365 145603 143965 142149 141252 141498 142086 142467 143007 144184 145889 147828 149993 152442 155135
65583 155135 158199 161848 165944 170103 174328 179025 184430 190627 198063 207325 218314 230341 243026
65570 243026 256376 270011 283198 295772 308087 319864 330001 337787 343362 346670 346929 343659 337430
65557 337430 329133 319253 308310 297117 285980 274300 261639 248615 236256 225046 215065 206398
65545 206398 198789 191539 184398 178110 173541 170730 169258 168914 169429 170209 171001 172334 174599 177214 179379
65530 179379 181160 183061 184944 186191 186604 186343 185212 182882 179698 176487 173533 170419 166948 163624 161078
65515 161078 159355 157861 155831 152996 150018 148033 147456 147529 147321 146812 146523 146504 146383 146215 146610 147972 150083
65498 150083 152391 154311 155373 155501 155182 155009 155192 155796 157189 159764 163322 167236 171183 175326 179796
65483 179796 184412 188869 192844 195965 198103 199702 201374 203071 203956 203280 201224 198782 196822 195256 193073
65468 193073 189319 184113 178568 173731 169816 166512 163589 161022 158868 157311 156517 156199 155637 154410 152781
65453 152781 151138 149518 148011 147145 147252 147775 147809 147166 146403 146006 146088 146719 147945 149475 150905 152272 153956
65436 153956 156032 158170 160176 162206 164410 166785 169428 172479 175680 178399 180281 181559 182558 183098 182588
65421 182588 180560 177061 172690 168382 165026 163092 162511 162799 163321 163647 163777 163923 164025 163699 162787 161700
65405 161700 161048 161149 162025 163527 165244 166672 167885 169738 172889 176853 180551 183656 186853 190728 194983
65390 194983 198858 201852 203755 204368 203572 201605 199011 196319 193805 191538 189617 188318 187899 188188 188520
65375 188520 188288 187546 186949 187096 188016 189262 190402 191454 192828 194833 197307 199854 202324 204854 207584
65360 207584 210705 214706 220054 226540 233462 240678 248929 258785 269738 280759 291340 301437 310712
65347 310712 318391 323756 326400 326239 323691 319637 314691 308711 301473 293587 286140 279522 273197 266584
65333 266584 259562 252100 244084 235716 227581 220112 213396 207612 203097 199699 196586 193174 189914 187656
65319 187656 186422 185285 183514 181402 179840 179285 179318 179027 177654 175022 171646 168473 166320 165355 165123 165139
65303 165139 165345 165961 167040 168388 169809 171280 172991 175373 178860 183316 187901 191888 195466 199264 203179
65288 203179 206282 207929 208418 208397 208220 208047 207972 207695 206600 204542 202110 199809 197535 195217 193405 192643
65272 192643 192669 192841 192970 193128 192970 191955 190094 187850 185454 182924 180666 179331 178945 178673 177604 175512
65256 175512 172863 170495 169252 169517 170878 172437 173460 173714 173319 172523 171481 170088 168170 165930 163871
65241 163871 162135 160427 158874 158357 159384 161111 162195 162394 162585 163346 164291 164858 165143 165737 167116 169177
65225 169177 171125 171995 171637 170979 170885 171105 170939 170479 170351 170447 169982 168903 168233 168664 169613 170139 170128 170079 170225
65206 170225 170460 170829 171558 172649 173766 174516 174808 174982 175473 176097 175909 174247 171869 170442 170727 171867 172665
65189 172665 172996 173522 174548 175796 177170 179102 181966 185447 188767 191441 193605 195584 197320 198521 199308
65174 199308 200320 201999 204102 206203 208313 210630 212965 214916 216488 218117 220159 222716 225771 229107
65160 229107 232311 235383 239145 244445 251054 257964 264825 272436 281695 292626 304658 317437 331158
65147 331158 346418 363888 383872 406216 430909 458568 489947 525044 563114 603197 643909
65136 643909 682898 717633 747227 772965 796743 819400 840599 859518 875129 886192 891481 890025
65124 890025 881271 865535 844436 820362 795256 769992 744550 717965 688196 653343 613716 572174
65112 572174 531827 493866 457994 424242 393489 366486 343204 323196 306024 291249 278398
65101 278398 267091 257101 248290 240608 234111 228883 224973 222328 220601 219114 217320 215286 213385 211585
65087 211585 209539 207405 206041 206155 207608 209673 211587 212761 212936 212394 211654 210847 209771 208608 207987 208136
65071 208136 208503 208500 208115 207503 206551 205269 204112 203414 202868 201988 200822 199784 199100 198771 198829 199239 199816 200542
65053 200542 201672 203219 204673 205581 206157 206948 208128 209406 210381 210726 210286 209292 208180 207016 205415 203259
65037 203259 201029 199126 197337 195375 193436 191688 189585 186398 182278 178253 175205 173212 171817 170641
65023 170641 169753 169610 170446 171636 172089 171484 170664 170511 170943 171437 171949 172700 173535 174194 174938 176228 178020 180014
65005 180014 182372 185472 189134 192802 196404 200260 204193 207493 209907 211940 213949 215605 216501 216809 216957
64990 216957 217107 217280 217687 218611 220086 221925 223955 226115 228419 230875 233338 235436 236772 237195 236733 235367
64974 235367 233055 229926 226277 222471 218874 215746 212991 210244 207352 204497 201710 198739 195734 193524
64960 193524 192571 192044 190762 188833 187444 187013 186477 184734 181999 179281 177143 175471 174052 172820 171734
64945 171734 170859 170491 170910 172086 173792 175762 177560 178637 178892 179003 179815 181368 182829 183368 182900 181960
64929 181960 181132 180703 180721 181208 182190 183497 184616 184965 184484 183852 183876 184610 185264 185116 184411 184171 185131 187047
64911 187047 189097 190721 191920 192975 194240 196133 198955 202590 206647 211052 216213 222470 229560 236815
64897 236815 243747 250307 256770 263461 270358 276837 282074 285894 288957 291870 294395 295837 296006 295434 294743
64882 294743 294121 293293 291689 288752 284427 279344 274275 269519 265067 261128 257977 255406 252853 250228 248119
64867 248119 246966 246402 245683 244471 242906 241126 239065 236694 234205 231842 229564 226919 223343 218729 213694
64852 213694 209054 205029 201185 197265 193785 191569 190857 191178 191965 192946 193904 194518 194691 194783 195199 195860 196374
64835 196374 196618 196786 196881 196629 196033 195622 195873 196702 197859 199494 201922 204995 208165 211069 213704 216122
64819 216122 218399 220832 223784 227330 231469 236577 243173 251246 260285 269989 280429 291496 302798
64806 302798 314164 325580 336372 345064 350408 352138 350519 345810 338540 329695 320045 309694 298770
64793 298770 288115 278716 270784 263939 258009 253027 248609 244050 239197 234850 232124 231496 232404 233700
64779 233700 234709 235878 238122 241537 245285 248851 252738 257570 263208 269294 276079 283986 292791 301935
64765 301935 311298 320955 330424 338906 346124 352295 357526 361899 365901 369928 373450 375433 375594 374556
64751 374556 372833 370481 367798 365457 363615 361458 357995 352863 346209 338284 329405 319990 310425 301145
64737 301145 292733 285461 278863 272322 266129 261314 258275 256244 254365 252692 251755 251637 251925 252301 252799
64722 252799 253673 255240 257659 260687 263832 266885 270103 273783 277854 281919 285438 287891 289116 289525 289694
64707 289694 289609 288659 286393 282911 278435 272985 266707 260172 254042 248575 243631 239030 234812 231290 228829
64692 228829 227431 226636 226048 225841 226418 227787 229658 231982 234811 237794 240575 243720 248420 254910 261900
64677 261900 268102 273800 280386 288708 298495 309133 320354 332038 343755 354736 364141 371284 375637
64664 375637 376645 373735 366782 356660 345069 333592 322954 313178 304256 296486 290238 285543 282002
64651 282002 279139 276842 275319 274642 274636 275356 277286 280729 285336 290672 296991 304918 314565 325530 337642
64636 337642 351082 365810 381498 398048 415465 433016 449117 462320 471995 477973 480154 478769
64624 478769 474509 467963 459221 448350 436019 423386 411477 400725 390919 381643 373003 365801 360582
64611 360582 356701 352900 348762 344955 342048 339805 337745 335604 333084 329894 326317 323010 319946 316278
64597 316278 311599 306518 301549 296268 290186 283683 277335 271088 265030 260364 258473 259202 260996 262696
64583 262696 264434 266903 270604 275814 282493 289934 297003 302895 307366 310382 312025 312744 313078 313103 312510
64568 312510 311207 309339 306784 303198 298643 293615 288297 282271 275226 267577 260171 253674 248378 244283
64554 244283 241111 238484 236281 234684 233768 233265 232891 232692 232910 233581 234466 235340 236261 237532 239385 241695
64538 241695 244046 246102 247819 249195 250038 250126 249484 248263 246487 244233 241949 240228 239220 238605 238287 238748
64522 238748 240433 243014 245629 247837 249988 252532 255274 257573 259153 260354 261594 262986 264689 267252
64508 267252 271130 276007 281103 286220 292038 299225 307627 316629 325951 335758 346185 357117 368280
64495 368280 379105 388439 394879 397690 397356 394957 390982 384940 376292 365657 354784 345238 337349 330570
64481 330570 324532 319363 315115 311474 308150 305163 302589 300250 297864 295303 292619 289985 287695 285988
64467 285988 284773 283769 283038 283134 284518 286967 289721 292143 294184 296354 299252 302936 306644 309269 310260
64452 310260 310061 309724 310161 311605 313649 315811 318187 321360 325567 330316 335143 340350 346468 353312 360308
64437 360308 367609 376035 385902 396740 408421 421702 437255 454818 473906 494859 518763 546714
64425 546714 579612 618288 663361 715182 774239 841386 917519 1003466 1100351 1209421 1330756
64414 1330756 1462057 1598613 1734076 1861693 1976500 2077553 2167383 2247870 2316544 2367436
64404 2367436 2395217 2397754 2375424 2329949 2264825 2185579 2097724 2003624 1901546 1788128 1662263
64393 1662263 1527332 1390295 1258619 1137370 1028270 930726 843559 766138 698390 640088
64383 640088 590404 548205 512617 483045 458831 439232 423663 411589 402258 394900 389034 384075
64371 384075 378793 372011 363914 355902 348860 342353 335832 329684 324431 319658 314640 309568 305279 302019
64357 302019 299267 296711 294736 294029 295181 298540 303925 310492 317303 324002 330686 337396 344105 350908
64343 350908 357705 363840 368477 371222 372116 371342 369327 366804 364236 361432 358148 354800 352126 350473 349958
64328 349958 350931 353580 357241 360836 363987 367103 370443 373626 376037 377158 376522 373860 369415 363734 357219
64313 357219 350154 343000 336231 329945 324006 318409 313168 308067 302924 297867 292988 288088 283187 278922
64299 278922 275847 273721 272101 271174 271227 271645 271416 270527 269986 270524 272113 274685 278376 282923 287720 292709
64283 292709 298520 305509 313293 321340 329348 336917 343574 349395 355021 360899 367062 373740 381416 389990
64269 389990 398471 405780 411348 414813 415806 414406 411266 407047 402151 397210 393270 391131 390847 391944 393647
64254 393647 394806 394252 391548 386962 380609 372261 362208 351604 341517 332065 322859 313829 305273 297501
64240 297501 290804 285464 281546 278997 278029 278859 280867 282604 283067 282583 282128 282253 282952 284066 285321 286317
64224 286317 286912 287395 287991 288613 289349 290720 292892 294979 295687 294581 292309 289680 286938 283915 280593 277394
64208 277394 274970 273684 273346 273654 274783 277138 280495 283852 286353 288009 289323 290580 291829 293280 295354
64193 295354 298416 302621 307955 314397 322205 331983 344179 358551 374361 390978 407831 423933 438119
64180 438119 449839 459044 465106 466620 462706 454043 442171 428259 412974 397128 381805 367862
64168 367862 355650 345135 336079 328218 321410 315555 310428 305954 302575 300859 300587 300726 300481 299932 299435
64153 299435 298961 298391 298033 298411 299748 301916 304629 307485 310163 312793 315821 319332 322832 325859 328426
64138 328426 330671 332447 333471 333503 332318 329963 327181 324942 323348 321583 319251 317096 316029 316066 316736
64123 316736 317961 319939 322621 325932 330201 335795 342616 350382 359076 368657 378685 388782 399190
64110 399190 410347 422117 433898 445184 455589 464518 471347 475851 478237 479052 479275 480117 482252 485576
64096 485576 489916 495459 502083 508867 514915 520172 524795 528150 529254 527954 524950 520845 515743 509588
64082 509588 502274 493690 484262 475146 467186 459930 452438 444736 437627 431310 425238 419290 414024 409579
64068 409579 405271 400663 396226 392607 389870 387827 386454 385578 384712 383641 382754 382506 383003 384416 387260
64053 387260 391686 396870 401621 405509 409071 413084 418015 424059 431377 440195 450753 463113 476992
64040 476992 491904 507494 523472 539292 554265 568148 581293 593935 605545 615122 621909 625606
64028 625606 626110 623528 618485 612073 605297 598629 592173 586161 581111 577472 575124 573218 570475 565710
64014 565710 558365 548826 538211 527669 517722 508330 499437 491182 483619 476671 470598 466110 463585 462327
64000 462327 461028 459040 456955 455893 456461 458471 461466 465255 469874 475149 480581 485882 491473 498078
63986 498078 505790 513870 521645 529284 537505 546850 557495 569479 582650 596493 610458 624582 639562
63973 639562 656126 674403 693898 714033 734720 756490 780017 805566 832995 862171 893159
63962 893159 926067 961062 998586 1039176 1082984 1129910 1180486 1236341 1299564 1371822 1454316
63951 1454316 1548322 1655533 1778053 1918134 2077651 2257609 2458338 2680121 2923149 3186723
63941 3186723 3468932 3767245 4078810 4399792 4724941 5048284 5363863 5665387 5945613
63932 5945613 6196744 6411448 6583485 6708045 6782287 6805493 6778221 6701324 6575894 6403831
63922 6403831 6188277 5934077 5648259 5339508 5016375 4685943 4354245 4027140 3709996
63913 3709996 3406885 3120812 2854451 2609951 2388255 2189251 2012364 1856429 1719387
63904 1719387 1598952 1493512 1401814 1322135 1252546 1191770 1138987 1093003 1052521 1017003 986272
63893 986272 959305 934392 910554 887850 866236 845073 823955 803015 782163 761043 740110
63882 740110 720738 703680 688330 674150 662042 653395 648318 645682 644659 645440 648537 653979 661307
63869 661307 669995 679783 690751 703010 716310 730119 744119 758318 772654 786862 800805 814452
63857 814452 827319 838389 846919 853024 857197 859539 859757 857662 853461 847676 840829 832956 823384 811362
63843 811362 796976 781039 764033 745749 726132 705809 685307 664260 642015 618788 595690
63832 595690 573697 552953 532960 513179 493528 474584 457190 441694 427694 414663 402538
63821 402538 391539 381732 373117 365888 360152 355431 350814 345662 340072 334667 330102 326697 324354 322787
63807 322787 321805 321320 321171 321156 321281 321713 322411 323006 323136 322696 321693 320128 318134 315936 313492 310388 306296
63790 306296 301420 296416 291974 288477 285765 283179 280151 276909 274313 272864 272171 271590 270981 270515 270078
63775 270078 269378 268584 268322 268906 269822 270159 269447 267989 266519 265676 265750 266658 267975 269067 269497 269396 269203 268943
63757 268943 268093 266396 264514 263448 263487 264101 264766 265387 265966 266339 266428 266425 266617 267282 268744 271091 273855 276365
63739 276365 278553 281009 284116 287532 290725 293654 296632 299843 303225 306678 310158 313712 317471 321438
63725 321438 325273 328604 331667 335253 339810 344908 349847 354550 359550 365143 370821 375631 379041 381442
63711 381442 383673 385972 387546 387347 385068 381205 376442 371444 367019 363840 361879 360558 359470 358626 358054
63696 358054 357777 358164 359707 362252 364984 367300 369192 370769 372071 373511 375678 378297 380154 380604 380449
63681 380449 380677 380900 379910 377508 374911 373422 373342 374171 375240 376100 376807 377933 379948 382575 385134 387443
63665 387443 389870 392431 394435 395286 395189 394662 393658 391644 388452 384534 380276 375513 370049 364360 359302
63650 359302 355150 351392 347582 343928 340803 338125 335635 333506 332226 332004 332731 334330 336697 339377 341881
63635 341881 344345 347478 351785 357160 363127 369049 374246 378515 382605 387645 393980 401016 408198 415580
63621 415580 423412 431832 441129 451697 463454 475867 488818 502902 518606 535750 554081 573873
63609 573873 595561 619152 644409 671175 699246 728272 758075 788536 818755 846712 870158
63598 870158 887660 898672 903255 902136 896577 887661 876044 862641 848963 836187 824307 812590
63586 812590 800382 786904 770882 751418 729161 705928 683179 661363 640608 621321 603935
63575 603935 588544 575078 563633 554517 548018 544002 541740 540448 540169 541754 545647 551033 556530 561451
63561 561451 566005 570580 575318 580292 585696 591849 599227 608325 619368 632395 647734 665898 686790
63548 686790 709614 734020 760833 791027 824440 860206 898054 938143 979375 1018396 1050476
63537 1050476 1071390 1079168 1075011 1062650 1046186 1028222 1010020 992823 978029 966019 955615 945075
63525 945075 933246 919588 903571 884441 861438 834127 802710 768194 732218 696687 663407
63514 663407 633595 607315 583608 561653 541730 524632 510329 497801 486267 475987 467573 460942
63502 460942 455395 450498 446379 443083 440023 436418 432247 428437 425945 424845 424506 424419 424440 424409 424108 423661
63486 423661 423491 423719 424052 424356 424883 425788 426951 428510 430961 434446 438467 442668 447303 452467 457432 461348
63470 461348 464142 466131 467135 466646 464617 461499 457724 453698 450035 447152 444690 441882 438485 435048
63456 435048 432427 431275 431690 432984 434161 434968 436155 438390 441504 445254 450097 456415 463543 470525 477431
63441 477431 484945 493020 501023 509139 518504 529854 543038 558082 575792 596973 621758 650001
63429 650001 681487 715141 748402 777928 801135 817370 828061 835703 842237 848385 854741 863025
63417 863025 875495 893253 915824 942317 972144 1004563 1038287 1071782 1103338 1130742 1151595
63406 1151595 1164271 1168305 1164038 1152673 1136616 1118737 1100784 1083053 1065667 1049254 1033887 1018143
63394 1018143 999963 978181 952804 924275 893073 859879 825728 791971 760097 731266 705742
63383 705742 683003 662524 644251 628337 614847 603855 595474 589571 585791 584040 584666 588012 594018
63370 594018 602299 612404 623904 636483 649920 663870 677856 691807 706358 722195 739310 757440
63358 757440 776981 798785 823230 850235 880009 912819 947893 983494 1018293 1051731 1082661
63347 1082661 1108639 1127307 1137926 1141053 1137417 1127890 1114135 1098348 1082230 1066483 1051077 1035645
63335 1035645 1019740 1002964 984752 964033 939668 911597 881252 850444 820108 790466 762082
63324 762082 736167 713799 695210 679933 667464 657683 650712 646582 645181 646252 648753 649970 646099
63311 646099 634849 617478 597626 578226 560159 543543 528989 517089 507684 500327 494945 491501
63299 491501 489490 488269 487527 486993 486102 484404 482051 479448 476645 473330 469193 464109 458303 452474 447364
63284 447364 442961 438532 433606 428473 423572 418999 414934 411899 410098 408966 407890 406988 406747 407231 408197
63269 408197 409658 411781 414413 417177 419920 422712 425539 428314 431086 433945 436894 439999 443438 447204
63255 447204 451015 454789 458972 464111 470244 476864 483348 489460 495738 503339 512990 524067 535311 546635
63241 546635 559449 574866 592294 610417 628987 648928 671057 695450 721884 750257 780498
63230 780498 812503 846176 881316 917483 954089 990468 1025853 1059753 1092481 1124829 1157012
63219 1157012 1188460 1218888 1248944 1279349 1310018 1340516 1370778 1400656 1429214 1455154 1477594
63208 1477594 1495737 1508188 1513390 1510545 1499451 1479848 1451837 1416758 1376672 1332927 1286095 1237375
63196 1237375 1189080 1143283 1100659 1061051 1024619 991928 963312 938621 917450 899368 884167
63185 884167 872132 863826 859329 857887 858632 861595 867666 877394 889948 903434 916263 928119 939599
63172 939599 951125 962494 973384 983849 994041 1003682 1012124 1018942 1024280 1028534 1031682 1032828 1030493
63159 1030493 1023613 1012360 997853 981090 962357 941655 919259 895697 871430 846823 822305
63148 822305 798468 776061 755835 738130 722655 708924 696846 686538 677742 669951 663148 657804
63136 657804 654043 651388 649520 648678 649084 650503 652628 655378 658590 662077 666301 672326 680624 690434 700677
63121 700677 710909 720976 730445 739027 746958 754224 759993 763605 765647 767167 768123 767611 765499 762901
63107 762901 760885 759468 758053 756248 754036 751595 749242 747296 745920 745170 745043 745286 745433 745312 745279 745651
63091 745651 746249 746892 747950 749875 752457 755107 757673 760437 763499 766743 770247 774198 778515 783104 788284
63076 788284 794360 800932 807322 813701 821142 830439 841432 853579 866681 880856 896246 912944 930986
63063 930986 950329 971053 993611 1018656 1046677 1078018 1113034 1151931 1194545 1240552 1289790
63052 1289790 1342190 1397776 1457094 1521241 1590881 1665375 1743392 1824078 1907061 1991482 2075802
63041 2075802 2158667 2239450 2317912 2393810 2466927 2537155 2604604 2669954 2734453 2798948 2862885
63030 2862885 2924650 2982697 3035746 3082023 3119059 3144413 3156077 3152154 3130883 3091490 3034781
63019 3034781 2962677 2877313 2780664 2674811 2562386 2446674 2331066 2218311 2110510 2009829
63009 2009829 1918543 1837922 1767594 1706606 1654750 1612263 1578736 1553212 1535117 1524131 1519274
62998 1519274 1519078 1522739 1530222 1541202 1554803 1570556 1588576 1608408 1628619 1648111 1667109 1686211
62986 1686211 1705042 1722568 1738346 1752652 1765420 1775667 1782105 1783980 1781213 1773850 1761484 1743149
62974 1743149 1717849 1685304 1646301 1602434 1555472 1506769 1457055 1406773 1356574 1307337 1259777
62963 1259777 1214476 1172269 1133948 1099292 1067028 1036270 1007422 981125 956921 933732 911230
62952 911230 889762 869292 849425 830287 812386 795563 779095 762936 747870 734198 721154
62941 721154 707985 694892 682607 671672 662382 654790 648468 642824 637853 634014 631301 629146 627371
62928 627371 626348 625898 624939 622804 620196 618182 616835 615481 613834 612168 610653 609071 607143 604729 601846
62913 601846 598747 595758 592873 589770 586360 582998 579991 577280 574790 572630 570721 568708 566534 564664
62899 564664 563426 562617 562088 562213 563208 564351 564486 563244 561328 559624 558418 557471 556587 555938 555884 556533 557590
62882 557590 558728 559895 561057 561883 562102 561932 561649 560940 559433 557770 557282 558314 559686 560167 559818 559419
62866 559419 559240 559029 558769 558786 559247 560031 560924 561628 561830 561542 561181 561042 561043 561234 562186 564400 567537 570645 573014
62847 573014 574540 575455 576028 576512 577110 577967 579196 580703 582010 582593 582458 582065 581633 580946 579957 579043 578449
62830 578449 578005 577708 578069 579431 581400 583495 586006 589576 594161 598988 603517 607891 612383 616841 620911
62815 620911 624569 628277 632613 637780 643401 648893 654087 659370 665154 671417 677926 684768 692430 701330
62801 701330 711414 722300 733784 746090 759560 774204 789821 806534 824807 844819 866304
62790 866304 889333 914817 943750 976378 1012724 1053598 1100337 1153549 1212841 1277802 1348703
62779 1348703 1426237 1511124 1603923 1704620 1812357 1926049 2045142 2169114 2296361 2424306
62769 2424306 2550527 2672922 2788738 2894357 2986194 3061082 3115853 3147828 3156193 3142002 3106377
62758 3106377 3049608 2972500 2877633 2768587 2648649 2520944 2388974 2256032 2124366 1995559
62748 1995559 1871289 1753147 1642078 1538601 1443199 1355985 1276422 1203914 1138402 1079889
62738 1079889 1027779 981142 939321 901886 868427 838765 812883 790277 769980 751709 736268
62727 736268 724062 713904 704213 694970 687416 682010 677768 673748 670238 668031 667113 666658 666210 666472 668756
62712 668756 673731 680903 689441 699189 710483 723322 737468 753370 772143 794394 819754 847774
62700 847774 878491 911789 947119 984399 1024439 1067763 1113611 1160836 1209300 1259670 1312190
62689 1312190 1366225 1420562 1473509 1522999 1567191 1604847 1634825 1655697 1666244 1665877 1654269 1631307
62677 1631307 1597962 1556455 1508811 1455810 1398073 1337436 1276322 1216173 1157395 1100492 1046303
62666 1046303 995362 947891 904239 864641 828735 795979 766319 739809 716042 694664 676010
62655 676010 660327 646750 634045 622233 612463 605312 599986 595147 589780 583340 575972 568716 562832
62642 562832 558740 556036 554308 553381 552985 552957 553638 555367 557639 559477 560598 561554 562733 563884 564645 564981
62626 564981 564993 564738 564205 563246 561829 560637 560885 562991 565927 568581 571191 574679 579149 584082 589616 596448
62610 596448 604613 613430 622604 632383 642742 653412 664712 677412 691740 707489 725038 745283
62598 745283 768507 794344 822980 855354 892066 933005 978210 1028052 1082306 1139980 1200346
62587 1200346 1263227 1327873 1392370 1454469 1512231 1563594 1606208 1638256 1658939 1667990 1665347 1651453
62575 1651453 1627102 1592785 1548923 1496934 1439287 1378267 1315433 1252296 1190475 1130861 1073614
62564 1073614 1019348 969335 924045 882559 844121 809344 779111 753082 730174 709877 692202
62553 692202 676799 663038 650781 640316 631645 624388 618179 612675 607440 602347 597988 595154 593923
62540 593923 593511 592955 591744 589969 588129 586739 585995 585838 586217 587018 587888 588611 589656 591814 595258 599431
62524 599431 603958 609120 615369 622963 632240 643575 656840 671492 687495 705655 726778 750921
62512 750921 777676 806693 837736 870775 906235 944650 985843 1028877 1072767 1116613 1159023
62501 1159023 1198384 1234055 1266438 1295529 1320281 1339941 1355250 1367738 1378623 1389144 1401248
62490 1401248 1417060 1438066 1465453 1500623 1544396 1596093 1654312 1718426 1788481 1863855 1943074
62479 1943074 2025034 2109335 2194630 2276774 2348917 2403748 2436548 2447306 2440249 2420449 2389603
62468 2389603 2344481 2279711 2192767 2087031 1970365 1850645 1732339 1616679 1504133 1396015
62458 1396015 1294217 1200539 1116547 1043368 981044 928410 883885 846247 814653 788479 767380
62447 767380 751068 738776 729303 721837 716343 712953 711380 711179 712208 714537 718210 723227 729365 735848
62433 735848 741571 745873 748728 750188 750113 748565 745846 741931 736402 729144 720543 710847 700059 688687
62419 688687 677767 667670 657579 646722 635497 624831 615084 606201 598299 591311 584566 577567 570866
62406 570866 565380 561090 557186 553320 549943 547486 545938 545201 545195 545532 545691 545674 546083 547392 549507 552065
62390 552065 554810 557583 560271 562919 565753 568948 572452 576019 579463 582981 587197 592621 599054 605785
62376 605785 612504 619664 627841 637096 647113 657573 668137 678494 688777 699676 711831 725357
62364 725357 740233 756869 775963 797970 823001 851125 882591 917873 957529 1001769 1050100
62353 1050100 1101566 1155305 1210554 1266155 1320474 1371746 1418009 1456868 1486208 1505377 1515066
62342 1515066 1515971 1508404 1493382 1472996 1448932 1421298 1389563 1354076 1316005 1276341 1235755 1195166
62330 1195166 1155765 1118550 1084156 1052855 1024384 998128 973786 951481 930998 911483 892272
62319 892272 873410 854952 836357 817125 797526 778236 759839 743082 728860 717297 707450 698623
62307 698623 691296 686066 682441 679640 677930 678097 680024 682847 686179 690087 694120 697476 700031 702236
62293 702236 704039 704844 704543 703696 702707 701609 700610 699947 699262 697969 696261 694883 694000 693281 693095 694430 697279
62276 697279 700245 702396 704659 708671 714864 722351 730202 738105 746054 754152 762741 772287 782986 794748
62262 794748 807693 822562 840487 862312 888197 918032 952126 991176 1035449 1084386 1137166
62251 1137166 1193149 1251375 1310015 1366824 1419886 1467448 1507432 1537853 1557762 1567378 1567408 1558662
62239 1558662 1542074 1518451 1488094 1451012 1407476 1358176 1304115 1246810 1188351 1130825 1075804
62228 1075804 1024618 978567 938198 902762 871080 842749 817881 796116 776807 759977 746120
62217 746120 734996 725510 716893 709240 702709 697010 691960 687952 685497 684647 684935 685592 685951 686196 687574
62202 687574 691254 697050 703880 711289 719655 728960 738346 747129 755424 763428 770898 777731 784449 791700
62188 791700 799813 809043 819583 831018 842455 853660 865427 878362 891863 904849 916919 928144
62176 928144 938149 946251 952427 957544 962636 968381 975266 983834 994644 1008236 1025174 1045912 1070579
62163 1070579 1099050 1131216 1166995 1206004 1247236 1289066 1329465 1366220 1397118 1420370 1435241
62152 1435241 1442288 1442670 1437141 1425927 1409487 1388831 1364825 1337632 1307231 1274090 1238960 1202482
62140 1202482 1165561 1129798 1096845 1067421 1041423 1018787 999704 984160 971890 962647 955992 950948
62128 950948 946467 942143 937972 933711 929182 924963 921854 919721 917794 916142 915877 917621 920748 924555
62114 924555 929327 935622 943132 950894 958214 964875 970713 975392 978308 978461 974877 967639 958251 948672
62100 948672 940292 934089 931099 931805 934978 937845 937956 934951 930415 926140 922753 920042 918115 917606 918636
62085 918636 920297 921689 923064 925389 929076 933756 939083 945068 951756 959341 968609 980460 994717 1010023
62071 1010023 1025146 1039951 1054948 1070419 1086250 1102183 1117991 1133757 1150143 1168068 1188025
62060 1188025 1209873 1233147 1257073 1280374 1301614 1319746 1333781 1342171 1343461 1337741 1326671 1311791
62048 1311791 1293515 1271889 1247295 1219796 1188661 1153458 1115163 1075458 1035299 994938 955030
62037 955030 916757 880833 847146 815676 787148 762267 740665 721149 703060 686918 673462
62026 673462 662413 652696 643771 636037 629714 624050 618217 612364 607020 601768 595527 588150 580815 574540
62012 574540 569007 563230 556922 550829 545981 542894 541269 540404 540011 540623 543014 547410 553517 560944 569049
61997 569049 576730 583160 588663 594100 599415 603513 605615 605893 604684 601872 597341 591286 583772 574633
61983 574633 564101 552955 541759 530566 519633 509784 501589 494698 488417 482558 477373 472967 469125
61970 469125 465483 461732 457944 454733 452699 451689 451042 450517 450445 450948 451659 452259 452700 452881 452806 453117 454720
61953 454720 457662 461122 464634 468596 473405 478942 485172 492432 500746 509545 518445 527693 537710 548881
61939 548881 561840 576944 593256 609125 624132 639362 655313 670829 684804 697699 710351
61928 710351 722314 732622 741327 749023 755372 759342 760630 759817 757385 753501 748528 742832 736241 728592
61914 728592 720657 713818 708900 705960 704994 706165 709585 715527 724585 736868 751216 765869 779809
61901 779809 792802 804425 813817 820384 824102 825146 823718 820076 814259 806028 795706 784783 774986
61888 774986 766835 759722 753179 747339 742245 737499 732715 727690 721957 714726 705431 694018 680730 666023
61874 666023 650753 636021 622694 611189 601542 593470 586562 580720 576242 573229 571349 570543 571508 574832
61860 574832 580020 586089 592990 601668 612769 625969 640627 656482 673584 692096 712360 734681
61848 734681 758766 783637 808290 832355 856097 879948 903940 927326 948723 966780 980733
61837 980733 990309 995340 995722 991601 983514 972501 960188 948330 938008 929483 922978 919230 918935 922102
61823 922102 928276 937083 948093 960385 972650 983609 992126 997211 998283 995212 987909 976182 960242
61810 960242 941025 919731 897400 875113 854068 835017 817964 802720 789281 777331 765919
61799 765919 754185 741989 729418 716236 702416 688729 676035 664296 652947 641999 632117 623791
61787 623791 617044 611799 607951 605083 602580 600050 597456 594986 592975 591657 590831 590123 589633 589727 590136 590186
61771 590186 590188 591499 594467 597435 598846 599486 601410 605246 609923 614705 620034 626344 633283 640382 647599
61756 647599 654987 662551 670587 679419 688608 696936 703194 706617 706760 703656 698068 691026 683098 674460
61742 674460 665353 655948 646076 635695 625377 615825 607336 600294 595495 593100 591776 589938 587491 585364
61728 585364 583884 582809 582604 584108 586964 589802 592153 594814 598061 600931 602808 604451 606704 609215
61714 609215 611237 612871 614625 616304 617147 616794 615499 613574 611045 607728 603438 598330 593112 588591 584868
61699 584868 581259 577054 572070 566548 560964 555902 551631 547762 543755 539706 536132 533093 530095 526833
61685 526833 523418 519850 515937 511799 507922 504561 501558 498821 496555 494968 494101 493828 493662 492845 491175
61670 491175 489506 488822 489074 489557 490030 490668 491229 491311 491271 491842 492939 493847 494622 496238 499246 503282 507982
61653 507982 513306 518824 523790 528218 532826 537521 540999 542331 542093 541433 540840 540251 539576 538616 537176 535649
61637 535649 534820 534764 534714 534355 534400 535441 537137 539073 541512 544589 547425 548897 548822 547757 545999 543382 539744
61620 539744 535116 529661 523768 517934 512384 507053 501959 497113 492128 486646 481196 476791 473458 469967
61606 469967 465257 459351 452713 445675 438886 433281 429007 425211 421428 418276 416254 414748 413017 411266
61592 411266 409913 408530 406472 403983 401738 399776 397762 395902 394723 394178 393720 393009 391929 390233 387910
61577 387910 385632 384138 383376 382816 382352 382299 382739 383510 384587 385864 386751 386633 385699 384781 384493 384933 386028
61560 386028 387634 389409 391064 392773 394943 397640 400494 403062 405067 406454 407423 408223 408735 408579 407827
61545 407827 407176 407182 407698 408325 408944 409487 409750 409917 410768 412776 415350 417557 419276 421097 423355 425849 428280
61528 428280 430364 431649 431850 431332 430759 430181 428867 426107 421962 417235 412960 409849 408005 407075 406642 406338
61512 406338 405732 404516 402932 401620 400903 400603 400659 401385 402854 404505 405776 406785 408076 410027 412829 416604
61496 416604 421142 425779 429978 433827 437685 441531 444966 447672 449601 450925 451983 453130 454428 455655
61482 455655 456648 457489 458371 459626 461813 465364 470164 475817 482156 488969 495420 500550 504287 507160 509025
61467 509025 509081 507253 504534 501609 498134 493812 489179 484778 480462 476117 472206 468941 465762 462365 459497
61452 459497 457996 457759 458325 459641 461434 462640 462543 461928 462068 463084 464279 465621 467707 470535 473375 475805
61436 475805 477961 479854 481263 482323 483482 484849 486127 487102 487727 487924 487802 487819 488195 488537 488623 489164 491011
61419 491011 493988 497297 500791 504904 509450 513404 515974 517252 517705 517644 517199 516315 514754 512565 510416
61404 510416 508971 508037 506814 504878 502434 499857 497542 496055 495722 496038 495988 495011 493312 491414 489817 488960
61388 488960 489040 489835 490999 492389 493872 495157 496221 497640 500078 503622 507892 512456 516884 520893 524822
61373 524822 529448 534921 540386 545165 549638 554332 558743 561932 563757 564709 564947 564454 563826 563887 564616 565230
61357 565230 565224 564729 564101 563904 565016 567925 572083 576662 581668 587514 593829 599593 604307 608150 611132 613008
61341 613008 613986 614725 615640 616908 618863 621546 624047 625306 625444 625303 624867 623261 620433 617622 615872 615028
61325 615028 614523 614213 614056 613749 613180 612672 612504 612741 613671 615716 618772 622352 626595 632370 640160 649605
61309 649605 660415 672884 687026 701942 716687 731207 745880 760501 774307 786649 797096
61298 797096 805043 809737 810735 808190 802755 795333 786716 777314 767220 756565 745657 734808 724222
61285 724222 714037 704345 695239 686961 679877 674136 669551 665996 663668 662777 663247 664923 667683 671093
61271 671093 674467 677655 681267 685611 689982 693574 696585 699684 702961 706326 710497 716458 724120 732514
61257 732514 741161 750238 759404 767568 774032 778930 782405 784259 784725 784693 784743 784550 783571 781797 779522 776918
61241 776918 774062 770965 767420 763284 759015 755440 752885 750928 749005 746819 744296 741801 740384 741102
61227 741102 744024 748437 754021 761086 769556 778493 786918 794569 801634 808218 814329 819997 825292 830504
61213 830504 836165 842464 848748 854142 858520 862337 865715 868386 870398 872126 873732 875423 878170 883174
61199 883174 890512 899157 908488 918944 931059 944800 960129 977205 995458 1013200 1028707 1041208
61187 1041208 1050506 1056292 1058419 1057461 1054484 1050455 1046067 1041749 1037534 1033075 1027945 1021763 1014186 1005183
61173 1005183 995244 984905 974183 962930 951542 940665 930249 919619 908414 896806 884860
61162 884860 872484 859999 847958 836255 824292 812219 801184 792091 784870 779338 775981 775394 777439
61149 777439 781442 786822 793160 799920 806294 811102 812952 811069 806054 799394 792189 784837 777777 771786
61135 771786 767430 764880 764392 766338 770608 776507 783353 790717 798308 806433 816449 829809 846414 864705
61121 864705 883582 903423 924991 948210 972447 997338 1022871 1049157 1076411 1104699 1133497
61110 1133497 1162016 1190093 1218188 1246349 1273774 1299550 1323247 1344630 1363376 1379253 1391958
61099 1391958 1400687 1404536 1403550 1398774 1391124 1380849 1368245 1354131 1339241 1323728 1307689 1291718
61087 1291718 1276581 1262576 1249459 1236876 1224887 1214200 1205633 1199112 1193629 1188661 1185098 1184030
61075 1184030 1185088 1186940 1189119 1192371 1197314 1203758 1211331 1219892 1229214 1238985 1249087 1259258 1268759
61062 1268759 1277178 1285269 1294104 1303677 1313264 1322777 1332717 1343070 1353372 1363640 1374175 1384774 1395310
61049 1395310 1406642 1419670 1433844 1448014 1462374 1477978 1494669 1511216 1527446 1544478 1562820
61038 1562820 1581933 1601681 1622514 1644029 1665118 1685748 1706992 1729164 1751589 1774292 1798141
61027 1798141 1823247 1849106 1876495 1907253 1941917 1979458 2019550 2063039 2109971 2159308 2210893
61016 2210893 2265634 2323713 2385149 2452370 2529510 2618727 2719922 2834421 2965695 3115748
61006 3115748 3284286 3472911 3687433 3935475 4225392 4568334 4977113 5461675 6030137
60997 6030137 6695803 7478588 8399620 9482998 10764714 12285829 14064932 16084168 18308472
60988 18308472 20692806 23126615 25363806 27061159 27958865 28060860 27637352 27046811 26554658
60979 26554658 26291048 26299361 26537243 26811642 26776926 26084380 24587142 22418875 19887812
60970 19887812 17302501 14870744 12698113 10822634 9239224 7917613 6822034 5921790
60962 5921790 5187903 4589604 4099355 3697357 3368091 3095851 2866358 2669744 2499253
60953 2499253 2348989 2214637 2094178 1985986 1887777 1798436 1718787 1649133 1587772 1532942
60943 1532942 1484175 1440388 1398495 1355501 1310771 1265236 1219758 1175253 1132976 1093560 1056705
60932 1056705 1022410 991260 963095 936912 912607 891199 872749 855797 839541 824778 811866
60921 811866 799653 787524 776755 768486 761892 755696 750077 745727 742215 738712 735315 732296 729035
60908 729035 725049 721242 718784 717387 715909 714010 712021 709671 706194 701474 696154 690750 685348 679906
60894 679906 674272 668151 661462 654475 647336 639972 632673 626080 620287 614635 608734 602964 597686 592711
60880 592711 587983 583921 580634 577483 573874 569888 565790 561719 558162 555853 554695 553593 551841 550002
60866 550002 548956 548816 549248 550142 551487 553147 555186 557822 560768 563293 565274 567518 570731 574770 579052
60851 579052 582973 585814 587167 587773 589059 591500 594180 596137 597245 597579 597002 595816 594783 593980 592394
60836 592394 589123 584190 577908 570365 561965 553521 545410 537458 529969 523849 519283 515286 511102 507091
60822 507091 503763 500886 498087 495437 492861 489857 486363 483102 480558 478376 476136 473823 471176 467614
60808 467614 463305 459228 455680 451867 447564 443990 442189 441643 441380 441426 442100 442784 442547 441455 440302 439492
60792 439492 438919 438455 437893 436987 436165 436540 438542 441196 443397 445226 447258 449258 450404 450373 449471 448126
60776 448126 446822 446065 445913 445939 446041 446663 447849 448773 448748 448044 447282 446745 446714 447702 449741 452125 454293 456287
60758 456287 458021 459052 459525 460345 461819 463073 463370 462979 462127 460313 457593 455430 455126 456170 457191 457818
60742 457818 458581 459672 460806 461643 461438 458934 453680 447023 440910 436145 432511 429887 428268 427248 426454
60727 426454 426058 426116 425968 425119 424148 423921 424423 425182 426192 427565 428857 429626 430107 430512 430299 429075 427614
60710 427614 427021 427407 428312 429816 432145 434715 436637 437839 438743 439262 439132 438796 438933 439387 439488 439119 438593
60693 438593 437887 436881 435950 435397 434726 433446 432179 431967 432858 434143 435579 437247 438594 438848 438324 438239 439212
60676 439212 440862 442758 444877 447149 449383 451625 453942 456019 457643 459235 461088 462416 462048 459900
60662 459900 456917 453809 450717 447902 445784 444305 443058 441979 441321 441126 441405 442498 444552 446905 448830
60647 448830 450562 452788 455409 457660 459206 460183 460415 459498 457529 454938 451845 448412 445468 443769 442843
60632 442843 441578 439835 438448 437763 437260 436674 436423 436724 437140 437209 436816 435858 434270 432539 431534 431672 432658
60615 432658 433978 435160 435806 436014 436535 437831 439268 439989 440297 441222 442876 444225 444497 443969 443259 442680 442375
60598 442375 442368 442306 441768 440920 440330 440218 440477 441301 443131 445985 449439 453191 457079 460708 463694 466178 468507
60581 468507 470574 472029 472852 473121 472563 471195 470078 470505 472526 475168 478021 481708 486775 492929 499524
60566 499524 506121 512563 519103 526424 534912 543967 552612 560598 568302 575737 582372 587742 591507 593090
60552 593090 592162 589444 586324 583643 581346 579129 576877 574737 573470 574356 578006 583523 589646 596354 604544
60537 604544 614466 625534 637434 650435 664731 680392 697786 716987 736883 755762 772631 787018
60525 787018 797791 803415 803393 798489 789638 777728 764262 750908 738211 725848 714160 704226 696342
60512 696342 689699 683872 679390 676511 674624 673401 673433 675162 678117 681851 686881 694136 704110 717069
60498 717069 733493 753794 777909 805438 835925 869051 905019 944526 987652 1032927 1078236
60487 1078236 1122375 1164703 1203559 1236541 1262559 1282221 1295685 1301378 1297482 1283589 1260106 1227076
60475 1227076 1184764 1134925 1080601 1024797 969826 917434 868777 824256 783805 747361 714935
60464 714935 686457 661687 640198 621443 605024 590798 578518 567664 557975 549786 543278 537702
60452 537702 532045 526240 521039 516883 513599 510953 508745 506566 504258 502391 501500 501153 500636 500155 500297
60437 500297 500660 500327 499441 498919 498628 497414 495076 492776 491094 489220 486735 484745 484316 484880 485158 484885
60421 484885 484694 484972 485701 486991 489030 491674 494480 496966 498701 499564 500010 500615 501408 502221 503562 506260
60405 506260 510250 514566 518615 522512 526155 529085 531514 534282 537395 539741 540791 541563 543249 545799
60391 545799 548519 551234 554092 556874 559264 561359 563383 565329 567316 569813 573090 576830 580594 584211
60377 584211 587518 590234 592359 594217 595964 597572 599349 601765 604661 607315 609443 611459 613640 615780
60363 615780 617846 620243 623271 626929 631192 635781 639825 642681 644987 647907 651516 655113 658974 664317
60349 664317 671439 679447 688044 697841 708383 717645 724438 729821 735022 739247 740755 739032 734650 727945
60335 727945 719163 709421 700207 692100 684642 677188 669338 661098 653214 646820 642205 638402 634455 630463
60321 630463 626949 623954 621322 619195 617661 616536 615942 616447 618243 620875 624173 628667 634676 641968 650745
60306 650745 661918 675693 690824 706024 721298 737165 753422 769463 785100 800171 813800
60295 813800 824639 831399 832902 828477 818793 805469 789450 770663 749727 728804 710062 694232
60283 694232 681274 671219 663533 656851 650420 644853 640512 636160 630361 623292 616016 608771 601225 593725
60269 593725 587053 581332 576228 571792 568258 565437 563103 561394 560120 558427 555941 553444 551565 549754
60255 549754 547569 546057 546544 548738 551284 553660 556306 559380 562631 566071 569597 572343 573518 573624 573839
60240 573839 574501 575103 575336 575223 574714 574150 574595 576647 579377 581491 583042 584975 587554 590476 594080 599044
60224 599044 605110 611331 617446 623832 630308 636230 641774 647968 655316 663345 671633 680415 689995 700225
60210 700225 710683 720922 730691 740266 750283 760826 771205 781043 790872 800993 810581 818805 826140
60197 826140 833505 840703 846715 851008 853556 854164 852858 850407 847300 842775 836021 827798 819609 811760
60183 811760 803582 795105 787053 779480 771848 764250 757182 750349 743195 736460 731640 728882 726867 724899
60169 724899 723504 722768 721683 719705 717638 716267 715201 713739 711914 710061 708063 705681 703143 700987
60155 700987 699685 699596 700822 703004 705704 708901 712583 716076 718546 720090 721588 723547 725859 728612 732190
60140 732190 736515 741038 745691 751141 757955 766122 775435 785698 796454 807082 817264 826962 836109
60127 836109 844754 853165 861087 867220 870215 870139 868355 866305 865053 865448 867657 870716 873550 876297 879740
60112 879740 883658 886892 888942 890317 891165 890663 888163 884067 879131 873541 867028 859500 851322 843210 835795
60097 835795 829089 822617 816330 810919 806864 803742 801001 798763 797153 795604 793678 791953 791106 790806 790527
60082 790527 790763 792150 793979 795046 795602 796976 799387 801467 801929 800435 796892 791219 783839 775304 765396
60067 765396 753687 740842 728280 716679 705924 696243 688048 680845 673756 667119 662127 658871 656149
60054 656149 653369 651186 650028 649411 649101 649669 651493 654295 657925 662553 667881 673307 679041 685862 693616
60039 693616 701190 708150 715083 722031 727965 732264 735443 737864 738886 737886 735157 731312 726696 721759
60025 721759 717019 712205 706275 698581 689292 678658 666919 655032 644280 634871 625952 617174 609097
60012 609097 601934 595195 588858 583612 579580 576056 572844 570618 569564 568904 568188 567744 567517 566855 565971 566164
59996 566164 567920 570160 572125 574599 578371 582671 586271 589194 592462 596918 603007 610774 619299 627000
59982 627000 633184 638527 643533 647570 650049 651393 651973 651124 648223 643931 639438 635208 631289 628074 625817
59967 625817 624009 622187 620905 621161 623302 627054 632139 638243 644873 651753 658938 666198 672776 678027
59953 678027 681679 683379 682830 680635 678071 675661 672857 669328 665512 661599 657237 652756 649368 647447
59939 647447 645766 643255 640411 638110 636184 634231 632947 633428 635742 639117 643103 647775 653230 659518
59925 659518 666605 673997 680960 687361 693489 698824 702203 703713 705099 707548 710268 712161 713687 715968
59911 715968 719111 722734 727248 733249 740192 746879 752859 758303 762988 766410 768537 769446 768624 765610 761090
59896 761090 756484 752611 749446 746856 744903 743655 743328 744385 747091 751266 756755 763630 771594 779869
59882 779869 788039 796397 805111 813876 822722 832163 842021 851120 858832 865932 873161 879891 885045 888445
59868 888445 890417 890948 890233 889175 888239 886513 882952 877907 872432 866755 860521 853944 847527 841048 833948
59853 833948 826467 819455 813292 807787 802861 798589 794888 791865 790124 790166 791870 795084 800092 806940 814964
59838 814964 823594 832812 842067 849664 854340 856773 858591 860594 863024 866869 873345 882124 891144 898113
59824 898113 901479 900369 894740 885725 875059 864041 853400 843849 836074 830221 825787 821910 817765
59811 817765 813176 808980 806014 803566 799760 793850 787113 781021 775664 770627 766105 762114 757675 752049
59797 752049 745941 740376 735162 729626 724049 719133 714634 709879 705150 701368 698721 696700 695094 693922
59783 693922 692734 691009 688969 687181 685718 684475 683794 683995 684858 686335 689058 693260 698007 702561 707734
59768 707734 714661 722858 730767 737731 744244 750726 757289 764348 772205 780294 787908 795462 804072 814204
59754 814204 825611 838151 851747 865990 880680 896173 912237 927297 939948 950614 960502 969594
59742 969594 976942 982327 986133 988029 987335 984446 980481 975691 969550 962358 955404 949488 944324 939422
59728 939422 934598 929779 925154 921331 918500 915886 912921 910401 909417 909659 909949 909879 909646 908827 906767 903862
59712 903862 901037 898172 894460 890133 886521 884488 883983 884918 887232 890337 893759 898133 904333 911802 919013
59697 919013 925366 931526 938198 945834 955135 966339 978178 988900 998052 1005855 1011286 1012570 1009545
59684 1009545 1003866 996815 988576 979758 971815 965313 959148 952007 943604 934215 924093 913592 902909
59671 902909 891695 879875 868699 859680 852642 846180 840020 835468 833389 833235 834325 836642 839989 843671
59657 843671 847561 852414 858744 866257 874530 883229 891598 898788 904814 910148 914356 916276 915544 912743
59643 912743 908052 900992 891608 880648 868436 854867 840715 827616 816389 806448 797138 788608 781169
59630 781169 774736 769124 764048 758877 753238 747555 741962 735155 725781 714672 704175 695413 687783 680920
59616 680920 675317 670898 666844 663165 660774 659693 658857 658021 658151 659471 660857 661753 662998 665059 667022
59601 667022 668151 669035 670305 671477 671909 671813 671615 671377 671450 672609 674916 677406 679418 681252 683152 684737
59585 684737 685807 686600 686911 686095 684230 682136 679959 677022 673286 669561 665972 661705 656647 651781 647530
59570 647530 643286 639061 635953 634289 632890 630999 629399 628766 628396 627512 626510 625931 625474 624949 625002 625902
59554 625902 626705 626513 625614 624630 623636 622916 623439 625727 629148 632974 637149 641582 645948 650775 657395 666253
59538 666253 676613 688442 702856 719979 738215 756795 776927 798624 817880 829226 830623 824482
59526 824482 814754 804609 796214 790729 788036 787230 787418 787767 787462 786180 784053 780733 775383 768040 759961
59511 759961 751989 743649 734549 725494 717341 709878 702756 696490 691492 687090 682492 677925 673853 670029
59497 670029 666286 663349 661885 661576 662030 663625 666445 669391 671554 673673 677037 681655 686628 691683 697180
59482 697180 703110 709108 715028 720731 725870 730613 735955 742572 750044 757854 766246 775245 783754 790559
59468 790559 795516 798880 800279 799281 796318 792229 787607 783277 780498 779774 780301 781392 783628 787803 793738
59453 793738 801051 810027 820597 831345 840736 848663 855813 862266 867734 872371 876252 878620 878634 876229
59439 876229 871520 864219 854563 843970 833835 824522 816284 810053 806190 803472 800457 796987 793365 789255
59425 789255 784758 781532 781369 784404 789915 797953 808819 821925 836692 853665 873235 894197 915306
59412 915306 937340 961733 987951 1014388 1041196 1069360 1096497 1115931 1121338 1111591 1091029 1066519
59400 1066519 1044681 1030010 1023814 1024886 1031778 1044240 1061914 1081666 1096792 1099850 1087405 1062472
59388 1062472 1032037 1002091 975261 952293 933769 919743 909210 901196 895600 892255 890166 888560
59376 888560 887809 888473 890259 892600 895217 897432 898202 897720 897651 898731 899538 898924 898150 898956 900856 902301 903480
59359 903480 905934 910065 915063 920869 928241 937121 946718 957144 969331 983422 998760 1015373 1033967
59346 1033967 1054345 1075223 1095762 1116091 1136222 1155521 1173353 1189336 1202849 1213056 1219445
59335 1219445 1221830 1220117 1214623 1206162 1195214 1181574 1165411 1147833 1129650 1110479 1090040 1069430
59323 1069430 1050073 1032262 1015758 1000797 987252 973858 959723 945818 933555 922719 912259
59312 912259 902194 893086 884391 875129 865636 856908 848758 840396 832405 826313 822409 819703 817833 817384
59298 817384 818393 820117 822286 825226 828942 833471 839944 849825 863120 878526 894933 911235 924824
59285 924824 932051 930708 921375 906576 889633 873857 861325 852255 846275 843826 845475 850652 858327
59272 858327 868322 880719 894741 909561 925425 942386 958690 972168 982660 991396 998528 1003064
59260 1003064 1004691 1003801 1000150 993429 984840 976216 967772 958571 948921 940406 933615 927775 922633 918910
59246 918910 916843 915957 916270 918077 920630 922684 924303 926479 929170 931460 933493 936375 940142 943553 945766
59231 945766 946524 944902 939927 932489 924770 917627 910212 902028 893440 884243 873750 862442 851571 841106
59217 841106 830068 818931 809492 802153 795441 788642 782718 778161 774034 769840 766415 764282 762878 762001
59203 762001 762281 763618 764911 765941 767838 771049 774476 777302 780190 784087 789272 795913 803996 812296
59189 812296 819130 824655 830854 838822 847627 856204 864553 872529 879223 884306 888496 892103 894555 895805
59175 895805 896632 897090 896214 893724 890528 887227 883778 880870 879741 880099 880045 878593 876567 874592 872158 869259
59159 869259 866908 865175 862505 857785 851418 843715 834162 823116 812297 802544 792812 782379 772276
59146 772276 763459 755266 746914 739038 732497 726950 721753 717070 713152 709612 706253 703473 701221 698769
59132 698769 696193 694736 695100 696664 698944 702320 706760 711398 716037 721563 728240 735215 742305 750564
59118 750564 760321 770403 780173 790617 802489 814976 827103 838894 850282 860490 869369 877765
59106 877765 885757 892267 897217 902161 907714 912286 914587 915527 916256 916069 913870 910210 906328 902421 898334
59091 898334 894777 892413 890702 888864 887123 886039 885536 885329 885136 883846 879889 873187 865309 857072 847709
59076 847709 837200 827413 819643 812825 805516 798059 791351 785087 778720 772795 767806 762971 757518 752063
59062 752063 747415 743203 738944 735285 732900 731224 729356 727177 724734 721768 718691 716596 715403 713605
59048 713605 710745 708365 707439 706736 705103 703546 703528 704889 706965 710025 713964 717215 718833 720249 723208
59033 723208 727373 731737 736962 744282 753314 762974 773690 786766 802266 819224 837290 856649 876918
59020 876918 897378 917558 936531 952559 964576 972953 977766 977670 971856 961916 950368 938397 926271
59007 926271 914680 904247 894866 886852 881560 879671 880102 881869 885565 891649 898840 905690 912296 918854
58993 918854 923997 926378 926611 926001 924557 921851 918504 915120 911083 906104 901644 899061 897686 896516 896422
58978 896422 898787 903234 908739 915752 925116 935877 946305 956291 966915 978414 990319 1002760 1015973
58965 1015973 1029298 1042054 1054364 1065782 1074456 1079259 1081374 1082140 1080836 1076381 1069589 1061558 1051302
58952 1051302 1037342 1020466 1002669 984419 965271 946123 928493 912342 896779 882205 869762
58941 869762 859533 851202 845560 843287 843148 843415 844157 846228 849069 851636 854392 858178 862064 864479 865504
58926 865504 865960 865330 862847 859548 856865 854187 850182 845563 842068 839620 836980 834373 832939 832405 831855
58911 831855 832059 834460 838540 842750 847388 853987 862474 871589 881558 893672 907623 921883 936389
58898 936389 952368 969813 987581 1005578 1024373 1042980 1059570 1074158 1088219 1102030 1114839
58887 1114839 1127382 1141607 1157977 1175235 1192542 1209612 1225115 1237339 1246207 1252527 1255856 1255431
58875 1255431 1252446 1248679 1243407 1234479 1222126 1208851 1195786 1182020 1167418 1153201 1139671 1126102
58863 1126102 1113034 1101991 1092667 1083012 1072330 1061855 1052125 1042342 1032572 1024057 1016909 1009802 1002297
58850 1002297 995327 989192 983161 977081 971202 964361 954583 941563 926598 910283 892513 874400 857689
58837 857689 842412 827533 813675 802583 794035 786021 778044 771537 766887 762740 758548 755332 753623
58824 753623 752979 753623 756192 759801 762772 765263 768780 773238 777194 780827 785789 791990 797377 801181 804604
58809 804604 807988 810088 810524 810288 809444 806882 802715 798338 793878 788112 781108 774382 768365 762301 756610
58794 756610 752413 748797 743654 737399 732673 730110 727802 725379 725091 727995 732382 737038 742878 750209
58780 750209 757398 763584 770021 777519 785040 791839 798545 805108 810068 812629 813163 811130 805153 795779
58766 795779 785565 775830 765903 755947 747533 740920 734844 729701 727692 728925 730592 731088 731818 733779
58752 733779 735550 736000 735927 735578 733525 729562 725962 724272 723422 722449 722499 724619 728046 732150 737678 744629
58736 744629 751156 755974 759845 763663 767253 770948 775907 781899 787090 790913 794823 799459 803586 806478
58722 806478 808728 810118 809615 808267 809076 813050 818256 823465 829579 836601 842616 846978 851233 855632 857948
58707 857948 857071 854590 851438 846156 837841 827615 815873 801357 784339 767398 751569 735099 717416
58694 717416 700785 686444 672766 659066 647532 639299 632160 624402 617507 612822 608823 604026 599439
58681 599439 595896 592121 587669 584574 583789 583168 581234 579712 580045 580765 580761 581788 585101 588889 591818 595940
58665 595940 603195 612137 621009 631030 643508 656444 666989 674709 679685 680241 675539 667892 659679
58652 659679 650451 639625 629123 620558 612658 604304 597237 592779 588779 583076 577214 573575 571518 569641
58638 569641 569101 571221 574293 576233 578093 581551 585251 587000 587495 588473 589237 588321 586644 585846 585356 584068
58622 584068 582953 583203 583880 584177 585634 589308 593271 595895 599039 604799 611697 617406 622646 628909 634883
58607 634883 638813 642098 646817 651884 655289 658035 662104 666527 669178 670628 672612 674504 674782 674220 674254
58592 674254 674111 672876 672377 674653 678582 682427 687538 695978 706657 717442 728924 742331 755842
58579 755842 766969 776755 787766 799629 810270 819768 829315 838187 845474 853050 863276 875600 888878
58566 888878 904883 925774 950219 975857 1003431 1034575 1067710 1100194 1132298 1164766 1194512
58555 1194512 1217215 1232453 1242109 1245722 1241982 1233040 1222744 1211986 1200008 1188582 1180378 1174572
58543 1174572 1168345 1161313 1154327 1145512 1131860 1113407 1091883 1066925 1037669 1006238 975468 945149
58531 945149 914661 886983 865368 848212 832087 817721 807840 801181 794167 786906 782011 778927 774931
58518 774931 770585 768682 768728 767679 765223 763275 761434 758112 754984 754961 756811 757112 756450 758125 761717 763658
58502 763658 763542 764256 766318 767582 768190 770394 773671 775255 775307 776618 779549 782144 784633 788951 794526
58487 794526 799579 805680 815759 828510 840282 851764 867115 887056 908449 930262 954176 979471
58475 979471 1002915 1023671 1043102 1059927 1070785 1075143 1074619 1068318 1054506 1036080 1018559 1003171
58463 1003171 987660 973029 963193 958367 955253 953749 957261 966301 977852 991157 1008142 1027958
58451 1027958 1046975 1064219 1081030 1095491 1103104 1102920 1097250 1085985 1067511 1044746 1023542 1005187
58439 1005187 986876 969097 955678 946749 938889 932274 930463 932893 934952 935976 939897 947428 955043
58426 955043 962411 973246 987731 1001536 1013486 1026806 1041388 1052224 1057154 1059078 1058967 1053809 1043257
58413 1043257 1031418 1020281 1007872 994269 982719 973499 963428 952595 944752 940074 934735 928648
58401 928648 926195 928146 930377 931803 935800 942493 947672 950923 956759 965849 973265 977432 982613 990229
58387 990229 995853 997435 998668 1001654 1003926 1005102 1008697 1014916 1019439 1021733 1026676 1035620 1043900 1049643
58373 1049643 1056799 1066960 1076472 1084380 1094913 1109301 1123362 1135905 1151131 1170033 1188053 1204017
58361 1204017 1222531 1244552 1264592 1280478 1296780 1315151 1330427 1339992 1347974 1356410 1361327 1361504
58349 1361504 1362178 1366116 1369759 1371806 1376487 1384754 1391657 1396301 1404781 1419352 1434511 1447827 1464443
58336 1464443 1486441 1508142 1526775 1547520 1572857 1597158 1617110 1637304 1660116 1680250 1694873
58325 1694873 1708880 1724518 1736080 1740749 1744448 1751149 1756722 1759107 1763940 1774016 1783821 1790637 1800370
58312 1800370 1816264 1832860 1847339 1865543 1890195 1914642 1935030 1957118 1984156 2010008 2031483
58301 2031483 2055359 2085484 2115050 2139487 2164775 2194962 2223894 2247649 2272713 2303369 2333665
58290 2333665 2360411 2390962 2429134 2466812 2498969 2533481 2576246 2620334 2660077 2701935 2750617
58279 2750617 2798398 2839481 2881185 2929549 2977775 3020434 3064940 3117146 3170044 3218864 3272575
58268 3272575 3337743 3405938 3470104 3538198 3617245 3699396 3777621 3859409 3950565 4041504 4124534
58257 4124534 4208601 4301731 4395421 4481984 4570266 4667988 4766105 4857600 4953894 5064991 5181525
58246 5181525 5294640 5414872 5552349 5697466 5840969 5993614 6165369 6345143 6522563
58237 6522563 6709352 6917064 7134850 7352360 7582776 7839032 8109787 8384172 8676945
58228 8676945 9002719 9349397 9704766 10084333 10503925 10950955 11413445 11910337 12460974
58219 12460974 13053049 13674685 14348385 15097522 15910909 16778621 17729441 18792354 19956785
58210 19956785 21214681 22604522 24168013 25905233 27824118 29991543 32482767 35330954
58202 35330954 38589170 42393263 46902026 52234797 58534783 66019464 74886898 85258594
58194 85258594 97318421 111430838 128046077 147635546 170817171 198246174 230025382
58187 230025382 265358058 303070835 342046269 380145783 412472367 431834104 432381091
58180 432381091 413420615 379743002 338496505 295865305 255847043 220580245 190852605
58173 190852605 166523292 147048797 131765495 119685952 109377164 99461596 89299158
58166 89299158 79067063 69262176 60275668 52321880 45477531 39677305 34768922 30624143
58158 30624143 27156514 24256958 21797429 19697351 17919998 16409768 15094297 13939710
58150 13939710 12944164 12082200 11307313 10601199 9970439 9401792 8866881 8362982 7905177
58141 7905177 7485820 7082814 6699450 6355878 6048919 5758348 5484827 5244188 5031498
58132 5031498 4826990 4631137 4459059 4305988 4151623 3993619 3845165 3704809 3559744
58123 3559744 3414260 3284688 3169941 3055372 2941691 2842330 2756075 2669497 2583113 2508902
58113 2508902 2444962 2378136 2308977 2249442 2198438 2143631 2085189 2034332 1990470 1942534 1891177
58102 1891177 1847502 1811227 1771366 1727161 1687739 1652542 1612330 1568154 1529603 1495696 1457010
58091 1457010 1415325 1381832 1356965 1330975 1303486 1283663 1271555 1257747 1241265 1229876 1222627
58080 1222627 1209741 1190196 1172501 1157795 1138812 1115844 1097179 1083059 1065226 1043220 1025502
58069 1025502 1013522 999851 983030 969421 959511 946997 932462 923520 920275 914568 904726 897324
58057 897324 893377 886517 875963 867748 861845 851426 836381 824551 817970 810510 800592 793662 790517
58044 790517 785558 778296 774503 774306 771008 763356 757305 754105 748338 739352 732946 729920 724376 715215
58030 715215 708027 703733 696634 685728 676810 671212 663459 652329 643399 638276 631997 623517 618145 616888
58016 616888 613867 607179 602213 601228 599496 594854 591536 591410 590639 588043 587859 591289 593868 593860 594736 597107
58000 597107 596967 594257 594334 598421 601392 601444 603085 607873 611063 610431 609889 611295 611005 607633 605163 605277
57984 605277 604446 601361 599426 599234 596555 590595 586317 585730 584792 581813 580947 584179 587647 589170 591845
57969 591845 596863 600278 600316 600687 603338 604970 603907 603304 604358 603406 599077 595389 594410 592638 587935 583280
57953 583280 580417 576529 570528 566022 564720 563402 560574 559537 561669 563412 563311 565367 571828 579149
57939 579149 584640 590749 599156 607052 613046 620505 631180 641515 649030 656458 665703 673479 676798 677298
57925 677298 676563 672754 665450 658243 652911 646402 636835 626967 618572 609354 598814 591021 587822 585298
57911 585298 580832 577698 578507 580071 579201 577962 578633 578930 576898 575335 576638 578085 576838 574937 574871 574882
57895 574882 573182 572292 574651 578239 580926 584815 591892 599617 605242 610430 617323 624088 628609 632627
57881 632627 637986 642678 644711 646043 648670 650719 650419 649928 651144 651753 649646 647333 647714 649306 649912
57866 649912 651140 654802 658561 659743 660110 662382 665329 666671 667741 670898 675296 679273 683956 690450
57852 690450 696464 699680 701651 704588 707357 708345 709046 710948 712043 710347 707778 706714 705883 703478 701129
57837 701129 700781 700806 699272 697937 698977 700922 701954 704005 709246 715533 719752 722851 727218 731853 734614
57822 734614 736664 740205 744091 745951 746394 747079 746945 744379 740767 737938 734483 728554 721850 716831 712517
57807 712517 707162 702495 700920 700762 698679 694738 690971 687002 681395 675453 671443 668736 665571 662901
57793 662901 662697 664254 665825 667963 671702 675590 678192 681306 686948 693472 698450 702996 709204 715814
57779 715814 720726 725538 733056 742233 749948 756013 762179 768046 772248 775931 780731 784930 785816 784195
57765 784195 782498 780266 775862 770869 768274 767752 767078 766716 768620 771932 774291 776188 779699 784168 787366
57750 787366 789715 793182 797273 800383 803798 810002 818075 825062 830748 836878 842831 846465 848311 850688
57736 850688 853561 855342 856667 859197 861876 862689 862984 865639 870013 873186 875166 878184 881827 883683 884198
57721 884198 886062 889286 891614 893424 897357 903174 907760 910437 913764 918799 923836 928202 933155 938593
57707 938593 942743 945457 948283 951247 953111 954619 957691 961634 964054 965304 968025 972446 976288 979317
57693 979317 983737 989753 994795 997621 999452 1000717 1000407 998941 998080 997726 996373 994795 995622 999218 1003736
57678 1003736 1009322 1018314 1031051 1045390 1060819 1079319 1101873 1127947 1158764 1197089 1243063 1293892
57666 1293892 1348282 1407440 1470773 1533560 1589054 1629648 1646628 1633935 1594058 1537274 1474198
57655 1474198 1411452 1353551 1303978 1263066 1228624 1200008 1178616 1164038 1153339 1144913 1139577 1137264
57643 1137264 1136172 1135865 1137630 1141016 1143593 1144882 1146985 1150559 1153786 1156148 1159468 1164260 1168689 1172269
57629 1172269 1176976 1183502 1189885 1195096 1200623 1207184 1213153 1217543 1221476 1225564 1228899 1231639 1235435 1240312
57615 1240312 1244326 1247276 1251412 1257415 1263095 1267287 1271640 1277251 1282862 1287853 1293748 1301231 1308662 1315056
57601 1315056 1321644 1329184 1336620 1343599 1351292 1359571 1366460 1371642 1377345 1384498 1391207 1396455 1402023 1409172
57587 1409172 1416571 1423204 1430301 1438621 1446671 1453367 1459854 1467152 1474615 1481990 1490215 1498845 1505666 1510297
57573 1510297 1515310 1522345 1530027 1537124 1544618 1553045 1560913 1567564 1574683 1583148 1591288 1598085 1605157 1613703
57559 1613703 1622246 1629484 1636691 1645388 1655132 1665395 1676947 1689597 1701281 1711371 1722249 1735632
57547 1735632 1749919 1763131 1775864 1789256 1802531 1814723 1826550 1838589 1849795 1859714 1869972
57536 1869972 1881809 1894417 1907231 1921289 1936579 1950723 1962304 1973028 1984725 1996748 2008188
57525 2008188 2019940 2032500 2044453 2055357 2067543 2082665 2098890 2113896 2128290 2143717 2159875
57514 2159875 2175872 2192366 2209888 2227070 2242797 2258198 2274398 2290430 2305517 2321192 2338856
57503 2338856 2357333 2375112 2392881 2411536 2429887 2446741 2463222 2480604 2497807 2513426 2528223
57492 2528223 2543302 2557939 2571659 2586353 2603613 2621879 2638833 2654812 2671271 2687711 2702925
57481 2702925 2717688 2733495 2750060 2766495 2783491 2801905 2820708 2838747 2857049 2876966 2897570
57470 2897570 2917218 2936239 2955712 2975179 2993967 3013214 3034164 3055906 3077163 3098815 3122240
57459 3122240 3146631 3170351 3193507 3216876 3239870 3261995 3284836 3310034 3336636 3362739 3388327
57448 3388327 3414172 3439594 3463850 3488198 3514019 3540263 3565305 3589851 3615502 3641929 3668078
57437 3668078 3694715 3723007 3751891 3779575 3806457 3833955 3861779 3889012 3916570 3945786 3975724
57426 3975724 4004622 4032844 4061684 4090446 4117592 4143774 4170887 4198959 4226685 4254214 4282786
57415 4282786 4312388 4342228 4372645 4404164 4435749 4466437 4497528 4530634 4564784 4598145 4631295
57404 4631295 4665886 4701188 4735057 4767438 4799958 4832871 4865391 4898259 4932994 4969134 5005058
57393 5005058 5040932 5078105 5116287 5154193 5192300 5232110 5273246 5314158 5355150 5397845 5442071
57382 5442071 5486126 5529747 5574060 5618992 5663440 5707608 5752567 5797971 5842812 5887774 5934001
57371 5934001 5980167 6023842 6065410 6107627 6151492 6195523 6238914 6282452 6326304 6369743 6413201
57360 6413201 6457946 6503709 6549193 6594792 6642171 6691187 6739898 6787675 6835743 6884627 6933548
57349 6933548 6982434 7032060 7082140 7131573 7180538 7230160 7280295 7329884 7379126 7428939 7478689
57338 7478689 7526933 7573965 7621147 7668326 7714675 7761473 7810958 7862735 7914427 7965694 8018393
57327 8018393 8072738 8126574 8178816 8230536 8282279 8333280 8383852 8435636 8488806 8541665 8593556
57316 8593556 8645632 8698309 8750524 8802012 8853802 8905961 8957257 9007447 9057568 9107711 9157040
57305 9157040 9206274 9257505 9311046 9364890 9417681 9469849 9521655 9572801 9624243 9677630 9732430
57294 9732430 9786262 9838576 9891286 9945226 9998791 10050905 10102607 10154692 10206319 10256970 10307516
57283 10307516 10358327 10408421 10457417 10506350 10555806 10605218 10654668 10705440 10758140 10812040 10866686
57272 10866686 10922290 10978417 11034356 11090920 11149635 11209982 11269765 11328398 11387402 11447487 11507708
57261 11507708 11567801 11628659 11690026 11750306 11809178 11867837 11926192 11982528 12036511 12089840 12143240
57250 12143240 12195482 12246204 12297072 12349329 12402681 12457383 12514863 12575388 12637545 12700768 12765916
57239 12765916 12832743 12899583 12966435 13035615 13108283 13182965 13258569 13336212 13416776 13499133 13582116
57228 13582116 13665931 13750338 13833602 13914442 13993036 14069138 14141392 14209359 14273954 14334951 14390410
57217 14390410 14439535 14483769 14524102 14559624 14589670 14614938 14635476 14650114 14659161 14665343 14670909 14675956
57205 14675956 14680567 14686119 14693406 14701849 14711682 14724443 14740076 14755846 14769288 14780024 14787814 14791510
57193 14791510 14791134 14788444 14784172 14777202 14767576 14757594 14748625 14739567 14729927 14721561 14715638 14710477 14704140 14696647
57179 14696647 14687819 14675466 14657748 14635167 14608412 14576411 14538337 14495365 14448559 14396979 14339567
57168 14339567 14276917 14209528 14136355 14056759 13972001 13883365 13790969 13695899 13601270 13509475 13420362
57157 13420362 13333587 13250479 13172021 13097324 13025957 12959717 12900494 12848398 12803401 12766453 12737365
57146 12737365 12713821 12693942 12677222 12661112 12639174 12604653 12553856 12484588 12394183 12281503 12148849
57135 12148849 11999976 11838306 11668733 11498600 11334590 11180537 11039861 10917489 10816988
57126 10816988 10737701 10676357 10629171 10590617 10552864 10509001 10455503 10390881 10315306 10233740 10156565
57115 10156565 10094444 10054043 10039125 10051689 10089555 10146611 10219038 10309813 10426017 10575608 10769280
57104 10769280 11021680 11347498 11759339 12272680 12911014 13705235 14693068 15922804 17453666
57095 17453666 19348325 21666741 24467774 27810184 31747127 36322457 41572236 47518697
57087 47518697 54152354 61418502 69210426 77339035 85468867 93081963 99550716 104314252
57079 104314252 107051532 107744854 106618599 104015686 100283232 95707136 90500445 84824536
57071 84824536 78814521 72594985 66289445 60025959 53933475 48129070 42706442 37732056
57063 37732056 33244610 29254689 25748553 22696764 20061174 17797438 15857926 14197068
57055 14197068 12774319 11553104 10500514 9589383 8798344 8108932 7504449 6971621 6500485
57046 6500485 6081865 5707077 5370108 5067261 4794087 4545019 4316226 4106210 3913268
57037 3913268 3734913 3570021 3418799 3280161 3151545 3031591 2920577 2818228 2723721 2637780
57027 2637780 2561946 2495690 2437075 2386291 2345736 2316851 2299839 2295871 2305819 2327297 2357352 2397437
57015 2397437 2449054 2501924 2532123 2517059 2451343 2347013 2222250 2092645 1969064 1857487
57005 1857487 1759414 1674230 1601375 1539873 1487513 1442134 1402857 1369054 1339389 1312938 1289981
56994 1289981 1270628 1253799 1238411 1224365 1211533 1198927 1185647 1171761 1157879 1144889 1134182
56983 1134182 1126652 1121208 1115426 1107553 1096447 1080157 1056898 1027674 995892 964138 933214 904223
56971 904223 879104 858571 841705 828081 818203 811532 806370 802342 800925 803063 808293 816596 828726
56958 828726 844169 861133 879136 898904 918580 932374 934552 923409 900862 870316 835968 802073
56946 802073 771181 743847 720444 701826 687964 677809 671076 668521 670131 674930 682984 695732
56934 695732 713856 736520 762916 792661 824428 855979 885304 909433 922473 918184 895607 860095
56922 860095 818481 775507 734680 698771 667878 639713 613253 589999 570862 554504 539875
56911 539875 527794 518705 511305 504721 499721 496498 493553 490086 487188 485423 483552 481058 479519 479975
56897 479975 481141 481821 482891 485345 488530 492041 497327 505669 516395 528718 543415 560882 579228
56884 579228 596051 610548 622236 629143 629113 621898 608784 591494 572547 555036 540631 528948
56872 528948 519735 514079 512553 514122 518170 525887 538357 554979 575101 599583 629352 663842 702102
56859 702102 743993 788873 833904 874165 903302 914489 903781 873967 833358 789740 747010
56848 747010 707463 673890 647835 628534 615460 609868 612454 621879 637231 659712 690373 728568
56836 728568 774200 828798 892359 961665 1033633 1107062 1177557 1232989 1258424 1246120 1199455
56825 1199455 1128804 1046138 962074 884075 815759 758386 712528 677869 652887 636277 627855
56814 627855 627229 633027 644673 663485 690656 725383 766114 812203 862976 916002 966638 1007615
56802 1007615 1029109 1022674 987606 932084 866905 799678 735322 678261 631100 593131 562701
56791 562701 539692 524035 513889 507586 505728 509359 517752 529979 546803 568822 594418 621655
56779 621655 650285 679245 703633 716865 715241 698946 670294 633269 593338 555046 520084 488801
56767 488801 462076 440104 421212 403949 388973 377090 367133 357720 349332 342621 336427 329686 323514
56754 323514 319073 315079 309926 304684 301397 299803 298278 296680 295691 294650 292607 290425 289320 288420 286246
56739 286246 283507 281922 281250 279978 278063 276593 275521 274044 272469 271557 270846 269635 268688 268924 269513 269251
56723 269251 268765 269305 270550 271667 273292 276284 279737 282335 284425 286652 288010 287587 286806 287517 289219
56708 289219 290538 292017 294868 298324 300903 303009 305625 307754 307974 307345 307904 309339 310002 310141 311214
56693 311214 312889 313643 313675 314460 316096 317590 318954 320484 320986 319370 317143 316673 317895 319274 320864 323579
56677 323579 326526 328061 328667 329887 331228 330978 329293 327661 326171 324086 322169 321547 321265 319929 318704
56662 318704 319539 321450 321924 321103 321125 322040 321884 320302 318712 317263 315001 312600 311642 311560 310552 309073 309102
56645 309102 310352 310637 309610 308748 308061 306344 304446 304555 306245 306836 305758 305069 305520 305591 304659 303703 302618
56628 302618 300213 297127 295389 294769 292942 289623 287158 286552 286198 285084 284079 283490 282418 281138 281127 282235
56612 282235 282665 282094 281898 282090 281134 279108 277951 278158 278260 277897 278292 279377 279613 279048 279436 280952 281933
56595 281933 282198 283370 285494 286654 286511 287006 288987 291205 293130 295549 297969 298721 298173 298580 300239 301099
56579 301099 300638 300682 301846 302694 303010 304352 306673 308023 308427 310363 314412 318108 320235 322665 326699 331123
56563 331123 335269 340609 347865 355720 363765 373624 385906 398929 411345 422784 431108 432830 427705
56550 427705 419541 411238 402440 393122 385427 380109 374974 368955 364339 362728 361996 359479 355392 351053
56536 351053 346553 342167 339380 338523 337782 336158 334879 334517 333571 331488 330139 330601 331256 330800 330332 330728
56520 330728 330770 329711 329018 329738 330567 330242 329348 328284 326022 322415 319202 317280 315508 313482 312722 313725
56504 313725 314634 314205 313375 312667 311010 308392 306612 306099 305073 303136 302350 303356 303930 303000 302574 303873
56488 303873 305000 304442 303557 303657 303853 303746 304860 307429 309080 308744 308557 309847 310646 309397 307685 307048
56472 307048 306440 305146 304844 306358 307639 307330 307066 307937 308143 306618 305471 306221 307034 306372 305918 307167 308583
56455 308583 308976 310195 313478 316557 317471 317866 319426 320492 319575 318857 320613 323252 324484 325370 327660 329984
56439 329984 330352 329753 329744 329139 326573 323792 322928 323029 322475 322136 322912 323082 321503 320502 322046 324045 324101 323823
56421 323823 325476 327341 326724 324903 324752 325814 326031 326095 327763 329873 330259 329758 330296 331022 330301 329604 331234
56404 331234 334016 335215 334979 335003 334711 332830 330935 331370 333195 334102 334574 336271 338145 338201 337487 338335 340196
56387 340196 341115 341630 343312 345136 345357 345325 347320 350244 351543 351875 353635 356341 357700 358003 359322 361490
56371 361490 362888 364021 366387 368991 369766 369286 369460 369983 369760 370163 372890 376209 377402 377329 378450 380023
56355 380023 379763 378782 380154 383581 386080 387159 388974 391963 394515 396435 398876 401383 402567 402989 403955
56340 403955 404639 403811 403116 404937 408406 411188 413698 417735 422481 425878 428533 432270 436345 439089 441711
56325 441711 446280 451552 455025 457487 461132 464920 466402 466648 468601 471871 473835 474608 476246 478310 478906
56310 478906 478949 480737 483516 485084 486471 490351 496166 501568 507212 515212 524395 532294 540440 552144
56296 552144 566125 577727 585636 592166 597934 601699 604649 609399 615312 619920 624160 631039 640103 648548
56282 648548 656811 667490 679668 690075 699111 709989 722569 733917 744396 757345 773074 788995
56270 788995 805306 824721 846854 868718 890560 915512 943808 973145 1004309 1040452 1081181
56259 1081181 1123487 1168269 1219773 1278847 1343102 1413465 1493933 1584753 1682532 1787418 1903529
56248 1903529 2031657 2168072 2311108 2462355 2620563 2780826 2940635 3100349 3256807
56239 3256807 3403001 3535070 3653303 3755277 3834506 3887197 3914169 3915080 3887297 3831918 3754658
56228 3754658 3659210 3545679 3416757 3279208 3137664 2992691 2846201 2702801 2564485 2429804
56218 2429804 2299381 2176477 2061327 1951038 1845955 1749826 1662841 1581025 1503437 1433340
56208 1433340 1371152 1313003 1257538 1207437 1162958 1120732 1080317 1045085 1015257 986938 959434
56197 959434 936462 918623 901845 884903 871225 861523 851916 841333 833446 829189 824620 818319 813695
56184 813695 811837 809372 805577 804252 806235 807382 806226 806231 808296 808709 806947 807722 812638 817530 820650
56169 820650 825609 833457 839980 843960 850100 860471 870925 879225 888815 901253 913042 923457 937287
56156 937287 956040 974593 990510 1008599 1032163 1057800 1083129 1111700 1145841 1182483 1220550
56145 1220550 1264891 1318541 1378676 1444411 1520797 1610752 1710633 1817715 1933940 2058054 2182285
56134 2182285 2301106 2414970 2521349 2611489 2681455 2737968 2788124 2831826 2869169 2905637 2943338
56123 2943338 2975208 2994151 3000677 2996673 2980334 2952767 2920767 2886719 2843546 2784936 2712161 2625945
56111 2625945 2521708 2399618 2270267 2143608 2020802 1902946 1797912 1711158 1638646 1576133
56101 1576133 1526564 1491281 1463298 1437081 1416211 1403911 1395026 1385115 1378316 1378184 1379691 1378425 1378766
56088 1378766 1384790 1392029 1396461 1402642 1414520 1427285 1436779 1447782 1464356 1481275 1493874 1507032
56076 1507032 1525324 1543720 1557359 1571196 1590522 1611275 1629211 1649095 1675044 1701331 1722743
56065 1722743 1744540 1772169 1800808 1825195 1849873 1879308 1907903 1930443 1952337 1978804 2004302
56054 2004302 2023696 2043278 2069341 2096522 2119114 2143003 2174367 2207585 2236721 2267822 2307043
56043 2307043 2347903 2383409 2419473 2462845 2507285 2545454 2582869 2625954 2668213 2702901 2737468
56032 2737468 2780471 2826350 2868471 2914643 2973544 3038218 3099440 3162739 3235388 3309688 3376834
56021 3376834 3444225 3520896 3599240 3669955 3741462 3824902 3913620 3997749 4085140 4186599 4294211
56010 4294211 4396199 4499655 4616372 4740176 4861067 4987291 5129659 5278749 5422239
56001 5422239 5569829 5735590 5911045 6082339 6258368 6454259 6662859 6871300 7089575
55992 7089575 7332823 7591832 7852054 8124879 8427980 8752492 9083338 9433607 9823289
55983 9823289 10242930 10675671 11135765 11646264 12199095 12778548 13402897 14099048 14858474
55974 14858474 15664841 16541763 17523818 18605483 19772202 21056023 22503837 24119353
55966 24119353 25899508 27899957 30199173 32831852 35833712 39321245 43451204 48341558
55958 48341558 54117923 60987550 69164400 78777148 89976418 103086426 118541128 136776815
55950 136776815 158341428 183900862 213740874 247279065 283392331 320991251 358324724
55943 358324724 391217872 412849626 416760027 400932029 369061163 328019547 284280718
55936 284280718 242165902 204022990 170868019 142789395 119347744 99991027 84189972
55929 84189972 71359229 60896229 52330919 45330542 39582849 34789704 30755929 27374137
55921 27374137 24524563 22071513 19940136 18108799 16530921 15135632 13894082 12813899
55913 12813899 11873985 11026963 10258082 9581757 8985581 8432937 7915404 7450680 7033521
55904 7033521 6637469 6260389 5921858 5619203 5329563 5051531 4803137 4582091 4367702
55895 4367702 4158869 3972173 3805375 3639478 3474341 3327074 3197410 3068457 2939656
55886 2939656 2826239 2727753 2628765 2529363 2444444 2373834 2302517 2229621 2168722 2120153 2070672
55875 2070672 2019994 1980655 1951656 1918153 1877082 1837934 1798555 1745564 1679437 1615072 1556701
55864 1556701 1495401 1431752 1377528 1333649 1288799 1241366 1201266 1168793 1132920 1092209 1056871
55853 1056871 1028497 997808 964115 937248 918207 897057 871998 851826 837537 820005 798132
55842 798132 781254 771011 758354 741055 727089 718086 706172 689950 677284 669531 658925 644268
55830 644268 633549 628245 620467 608543 600279 597784 593874 586601 582675 583145 579929 570151 560387 553449
55816 553449 544298 532257 524064 521341 517705 511469 508726 510822 511302 508523 508997 514954 520445 523033
55802 523033 527581 535303 540671 542420 546247 553378 557523 556206 554087 552194 545044 531608 518237 507518
55788 507518 494904 479344 466493 458174 449340 438680 431719 430092 428154 423464 420277 419334 414680
55775 414680 404405 394438 388040 381333 372819 367326 366623 365778 362766 362214 365779 368139 366486 364796 364843
55760 364843 362243 355439 349477 346682 342512 334828 328358 325611 322106 315236 309399 307623 306183 302143
55746 302143 298434 296858 293745 287141 280943 277498 273352 266548 260932 258936 257146 253112 249571 248011
55732 248011 245172 239980 236801 237735 238638 236772 235248 235874 234849 230035 225537 224500 223951 221189 218727
55717 218727 218560 218044 215774 215116 217525 218864 216832 215629 218627 222637 224072 224659 226373 226775 224291
55702 224291 222409 223706 225096 223605 221548 221491 221362 219074 216784 216147 214573 210530 207413 207788 208904
55687 208904 208141 207751 209883 212168 212656 214025 218345 222712 224610 226687 231593 236905 239799 242068 245851
55672 245851 248921 248863 247676 247731 247434 245167 243236 243621 244096 242793 242210 244394 246602 246200 245559 247569 250490
55655 250490 251751 252704 255043 256614 255396 253745 254042 253940 250562 245697 242218 238913 233479 227282 222572
55640 222572 218145 212086 205756 201025 196651 191222 186447 183849 181659 178526 176577 177125 177360 175241 173546
55625 173546 174876 176768 176250 175180 176368 178233 178272 178146 180232 182447 181594 178836 177014 175484 172498
55610 172498 169749 169616 170555 169922 168686 168720 168279 165052 161093 159829 160523 160353 159616 160151 160873 159600 157294
55593 157294 156060 155064 152738 150758 151373 152976 152749 151570 151875 152822 152138 150737 150979 152192 152316 152194
55577 152194 153900 156562 158120 159446 162612 166865 170475 174619 181222 188815 194768 199853 206385 213678
55563 213678 219557 224484 229783 233610 233230 229806 226545 223516 218598 212142 206357 201310 195650 190066
55549 190066 186055 182652 178273 174291 172819 172602 171195 169536 170043 171785 172037 171238 171886 173708 174391 174021
55533 174021 174355 174690 172876 169587 167355 166149 164043 161333 159778 158601 155525 151134 148084 146617 144784
55518 144784 142374 140641 138976 135940 132882 132402 133813 134154 133050 132506 132555 131377 129308 128521 128903 128270
55502 128270 126484 125496 125449 124566 122774 121778 121686 121117 120410 121162 122852 123438 123010 123361 124382 124422 123812 124376
55484 124376 125788 126028 125129 124985 125791 126234 126683 128555 130933 131605 131128 132065 134485 135982 135932 135930 136130 134968
55466 134968 132499 130413 128773 126328 123803 123160 123728 122846 120264 118177 117096 115645 114319 115198 117692
55451 117692 118764 117890 117766 119409 120574 119932 119097 119373 119861 119877 120188 120914 121081 120870 121599 123044 123583 123180
55433 123180 123378 124240 124422 124233 125397 127629 128821 128741 129176 130314 130499 129771 129968 131013 130761 129021 128025
55416 128025 128392 128391 127822 128717 131231 132689 131980 131287 132112 133012 132697 132153 132199 131882 130780 130117 130316 129988 128532
55397 128532 127158 126406 125259 123593 122838 123366 123883 124142 125466 127854 129439 129633 129926 130781 130725 129421 128589
55380 128589 128860 128673 127401 126684 127415 128146 127678 126687 125711 124130 122139 121140 121198 120680 119234 118455 118836 118879
55362 118879 118059 117753 118334 118284 117236 116959 118242 119667 120490 121776 123628 124372 123737 123790 125385 126700 126601
55345 126601 126388 126768 126275 124385 123097 123559 124020 123065 122071 122407 122889 122143 121061 120821 120745 120180 120253 121715
55327 121715 123038 122670 121276 120039 118700 116987 115987 116317 116755 116320 115883 116273 116719 116676 117137 118601 119791
55310 119791 119961 120427 122174 123944 124385 124190 124491 124973 125157 125650 126568 126579 125127 123802 123952 124704 124814 124617
55292 124617 124724 124642 124170 124316 125430 126276 126233 126473 127661 128670 128889 129464 130752 130983 129258 127514 127555 128345
55274 128345 128302 128047 128658 129200 128425 127196 126865 126788 125689 124093 123204 122675 121550 120231 119557 119097 118227 117740
55256 117740 118567 120015 120953 121621 122732 123992 124989 126298 128228 129762 130185 130350 130981 131192 130192 128928
55240 128928 128463 128223 127378 126451 126010 125276 123677 122304 122194 122592 122413 121977 121831 121468 120737 120795 122044 122880
55222 122880 122234 121612 122690 124588 125517 125605 126009 126633 126759 126706 126981 127012 126455 126364 127342 128051 127397 126653 127429
55203 127429 129040 129949 130378 131289 132154 131958 131281 131228 131316 130431 128883 127653 126696 125812 125876 127276 128415 127785
55185 127785 126366 125996 126680 127509 128794 131038 133091 133711 133799 134750 135771 135342 134270 134585 136165 137046 136573
55168 136573 135823 135356 134882 134762 135702 137253 138526 139828 141716 143133 142672 141031 140090 140049 139660 138766 138360
55151 138360 138454 138075 137231 136899 137201 137415 137552 138110 138564 137923 136562 135765 135631 135082 133693 131970 130138 128200
55133 128200 126881 126961 127996 129036 130106 131610 132970 133379 133247 133400 133539 133050 132526 132815 133380 133412 133714
55116 133714 135543 138213 139826 139926 139563 139260 138749 138318 138587 139272 139761 140425 141806 143181 143534 143264 143267 143177
55098 143177 142343 141662 142444 144160 145302 145735 146172 146165 144942 143521 143618 144886 145586 145577 146247 147735 148712 148859
55080 148859 149257 150222 150908 151137 151589 152135 151972 151451 151828 153158 154307 154993 155857 156573 155919 153861 151685
55063 151685 149969 148239 146617 145880 145815 145326 144329 143816 143967 143939 143547 143468 143745 143764 143691 144262 145234 145705 145787 146262
55043 146262 146827 146531 145690 145403 145377 144362 142650 141961 142749 143710 144142 144737 145751 146429 146532 146583 146342 144999
55025 144999 143127 142478 143419 144409 144398 143984 143862 143904 144156 144984 145845 145536 144050 142660 141937 141263 140478 140303
55007 140303 140961 141892 142941 144250 145110 144765 144261 145446 148068 149942 150116 149753 149673 149355 148788 149070 150405
54990 150405 151541 151842 152056 152502 152447 151916 152084 153149 153724 153067 152081 151392 150359 148803 147836 148073 148751 149401
54972 149401 150615 152368 153415 153321 153307 154102 154758 154644 154870 156451 158650 160446 162230 164638 166940 167926
54956 167926 167524 166405 164894 163256 162161 161969 162186 162300 162397 162517 162309 161775 161340 160887 159825 158387 157627
54939 157627 157834 158258 158694 159860 161784 163383 164179 164955 166146 167149 167832 169137 171414 173716 175647 178398
54923 178398 182964 188639 194256 199690 205183 210364 214886 219039 222870 225684 227065 227384 226734 224492 220509
54908 220509 215588 210224 204157 197696 192111 187989 184487 180883 177579 174877 172219 169460 167553 167014
54894 167014 166902 166217 165246 164728 164815 165613 167541 170365 173003 175054 177356 180373 183341 185761 188432 192062
54878 192062 196138 200153 204759 210586 216883 222346 226456 229278 230786 231127 230575 228676 224470 218163 211412
54863 211412 205394 199746 193976 188553 183922 179876 176664 175283 175713 176241 175528 174064 172655 170875 168198
54848 168198 165366 163349 162020 160990 160702 161464 162363 162268 161175 159613 157713 155797 154849 155357 156451 157136
54832 157136 157461 157744 157651 156956 156190 155656 154856 153743 153333 154116 155013 154974 154478 154384 154439 154140 153966 154471 155074 154989
54812 154989 154561 154554 154972 155672 157193 159727 162070 162828 162055 160707 159272 157982 157531 158337 159735 160922 162107
54795 162107 163717 165240 165872 165702 165274 164651 163787 163135 162978 162880 162647 163005 164383 165820 166161 165639 165376 165906
54777 165906 167032 168513 170076 171405 172797 175100 178454 182016 185526 190015 196188 203245 210163 217031
54763 217031 224160 230954 236737 241676 245871 248496 248833 247239 244200 239545 233502 227328 221816 216312
54749 216312 210254 204467 199763 195606 191438 188044 186134 184701 182421 179692 177794 176950 176733 177440 179431
54734 179431 181832 183441 184309 185140 185884 186283 186952 188442 190023 190931 192057 194849 199137 203571 207661 211924
54718 211924 216515 221030 225180 228455 229779 228701 226190 223064 218590 211991 204325 197301 191191 185629
54704 185629 181473 179801 179634 178752 176566 174394 173144 172461 172014 171993 172302 172629 173215 174329 175268 175099 173986
54687 173986 172615 170861 168425 166145 165156 165159 165036 164699 164790 165020 164510 163413 162624 162141 161289 160329 160223 160965
54669 160965 161622 161852 162023 162120 161930 161919 162451 162536 160954 158273 156219 155389 155231 155762 157432 159507 160559 160599
54651 160599 160976 162112 163038 163173 162919 162409 161332 160114 159734 160264 161024 162011 163561 164767 164154 162032 160320
54634 160320 159827 159531 158849 158687 159676 161021 161790 161920 161428 160102 158548 158193 159568 161648 163322 164444
54618 164444 165119 165214 165023 165244 165861 165974 165068 163508 161740 160051 159123 159613 161025 162135 162582 162857 162890 162123
54600 162123 161016 160899 162052 163378 164191 164841 165351 165059 164148 163962 165138 166699 167592 167892 167943 167550 166685
54583 166685 165936 165686 165702 165829 166113 166115 165322 164362 164475 165528 165997 165299 164614 164839 165289 165214 165159 165865 166944 167619
54563 167619 167863 167994 168047 168263 169321 171310 173239 174231 174457 174386 174012 173425 173297 174003 174929 175302 175198 175214 175626
54544 175626 176308 176992 177383 177530 178146 179838 182019 183448 183937 184524 185791 187106 187795 188005 188017 187688 187027
54527 187027 186383 185708 184579 183298 182916 183665 184377 184003 182785 181363 179680 177533 175454 174186 173757 173685
54511 173685 173754 174140 175029 176372 177834 178913 179487 180058 180960 181595 181147 179886 178911 178770 179146 179678 180156 180147
54493 180147 179500 179031 179578 180585 180859 180525 180784 181783 182296 181686 180651 179732 178627 177422 177045 177885 179223
54476 179223 180599 182485 185071 187649 189842 192290 195426 198602 201076 202937 204448 205344 205335 204547 203133
54461 203133 201274 199778 199709 201121 203043 204813 206385 207300 206734 204797 202568 200568 198472 196435 195192
54446 195192 194584 193558 192039 191163 191160 190731 189228 187763 187248 186973 186179 185530 185820 186464 186486 186019 185773 185940
54428 185940 186492 187553 188678 188892 188253 188224 189658 191565 192781 193521 194241 194298 193120 191743 191725 193158 194790
54411 194790 195561 195189 194020 193115 193690 195612 197290 197771 197947 198882 200106 200638 200643 200928 201579 202247 203050 204175
54393 204175 205254 206068 207150 208801 210332 211168 211842 212940 213874 213733 212602 211091 209357 207560 206466
54378 206466 206566 207268 207893 208672 209885 210896 211116 211126 211800 213105 214707 216902 219773 222313 223644 224459
54362 224459 226003 228268 230407 232323 234539 236892 238532 238967 238171 236124 233225 230650 229291 228701 227910
54347 227910 226797 225726 224458 222459 219909 217427 215131 212787 210517 208638 207229 206459 206768 208066 209409
54332 209409 210126 210550 211023 211106 210545 210042 210103 210050 209185 208048 207457 207166 206591 206031 206006 206169 206023 205912 206126 205878
54312 205878 204477 202754 201964 201948 201706 201143 200814 200557 199883 199259 199562 200582 201380 201799 202351 203023 203445 203817
54294 203817 204381 204376 202904 200563 198931 198643 199179 200178 201634 203070 203825 204132 204747 205683 206310 206467 206505 206495
54276 206495 206367 206397 206601 206218 204911 203849 204322 205846 207004 207554 208254 209118 209543 209822 210820 212263 212979
54259 212979 212807 212765 213267 213695 213841 214310 215259 216053 216417 216788 217299 217521 217316 216975 216476 215595 214642 214006 213121
54240 213121 211079 208235 206002 205072 204978 205301 206067 206885 206981 206300 205568 205194 205084 205434 206606 208233 209490
54223 209490 210220 210830 211319 211515 211979 213305 214762 215082 214460 214239 214658 214535 213399 212224 211673 211139 210176
54206 210176 209440 209476 209717 209462 208962 208854 209229 209737 210057 209942 209392 208939 209139 209743 210070 210104 210365 210785 210661
54187 210661 209773 208652 207760 207297 207659 209081 210870 212040 212636 213424 214477 215201 215608 216192 216595 215838 214028
54170 214028 212504 211962 211654 210757 209400 208081 207083 206676 206888 207026 206455 205792 206116 207144 207589 207299 207375 208031
54152 208031 208108 207199 206546 207081 208035 208334 208103 207968 208014 208282 209243 210885 212195 212319 211564 210685 209982 209599 209862
54133 209862 210721 211540 211919 212140 212477 212789 213025 213359 213635 213517 213302 213689 214627 215411 215917 216649 217540 218066 218658
54114 218658 220492 223520 226212 227806 229333 231773 234636 237204 239844 243128 246735 250146 253409 256388
54100 256388 258264 258588 258016 257275 256328 255175 254402 254173 253667 252372 250954 250093 249420 248419 247420 246825 246308
54083 246308 245654 245425 245813 245732 244210 241970 240548 240396 240834 241270 241477 241132 240042 238624 237525 237131 237856
54066 237856 240180 243697 246861 248477 248895 249039 248959 248219 247072 246220 245712 244991 243850 242697 242014 242123 243203
54049 243203 245088 247232 249226 251118 253062 255092 257377 260083 262814 264884 266347 268042 270468 273448
54035 273448 277098 282050 288295 294829 300956 306972 313111 318911 324182 329528 335159 340191 343902 346770
54021 346770 349482 351887 353701 355281 356842 357821 357873 357638 357578 357007 355231 352797 350536 348116 344648 340083
54005 340083 334987 329546 323802 318234 313165 308161 302965 298368 295180 292976 290853 288770 287155 285881
53991 285881 284713 284049 284042 283658 281933 279593 278055 277207 275652 272930 270109 268177 267112 266599 266530 266566 266182
53974 266182 265363 264594 264184 264201 264877 266305 267895 268958 269734 271120 273502 276586 280229 284650 289927 295898
53958 295898 302371 308743 313702 316073 315939 314327 312050 309441 306856 304605 302581 300703 299551 299845 301522
53943 301522 303974 306948 310462 314164 317630 321147 325366 330265 335149 339521 343208 345781 346729 346260 345309
53928 345309 344723 344932 346196 348522 351349 353955 356183 358435 361113 364455 368569 373210 377888 382669 388403
53913 388403 395489 402938 409430 414994 420873 427964 436095 444500 452222 458311 462430 465223 467414 468791
53899 468791 468715 467354 465595 463904 462003 459630 456976 454351 451845 449210 445769 440794 434287 426958 419124
53884 419124 410453 401245 392940 386414 380641 374210 367442 361650 356877 351986 346736 342181 338848 335958
53870 335958 332793 329630 326876 324272 321461 318581 315832 313045 309976 306553 302706 298463 294304 290894
53856 290894 288359 286280 284350 282571 280930 279440 278382 277925 277600 276701 275065 272998 270728 268528 267007
53841 267007 266464 266256 265631 264895 264810 265178 265103 264570 264516 265195 265680 265373 264998 265581 267210 269289 271274 272663
53823 272663 272922 272129 271390 271917 273721 275540 276132 275440 274433 273960 274031 274290 274829 275993 277625 279240 280978
53806 280978 283485 286684 289713 292482 296157 301351 306995 312014 317083 323354 330270 336203 340834 345314
53792 345314 350264 355126 359519 363830 368226 372249 375651 378617 380967 382156 382272 382064 381687 380333 377448
53777 377448 373565 369596 365937 362449 358789 354594 349828 344936 340251 335480 330334 325330 321180 317714
53763 317714 314267 310879 308088 305742 303106 300161 297706 296079 294697 292997 290991 288820 286558 284502
53749 284502 282869 281286 279371 277667 277092 277601 278340 278918 279496 279805 279374 278667 278748 279757 280886 281810 282769
53732 282769 283235 282131 279756 277998 278076 279351 280848 282507 284251 285241 285074 284666 284972 285717 286277 286995 288624
53715 288624 291130 293904 296688 299527 302214 304458 306338 308124 310023 312323 315261 318462 321109 322991
53701 322991 324761 326891 329103 331197 333668 337076 341411 346399 351718 356616 360128 362121 363423 364612
53687 364612 365514 366245 367623 369854 371768 372185 371306 369999 368471 366597 364944 364409 365072 366192 367167 367899
53671 367899 368450 368917 369457 369965 369923 368973 367396 365770 364515 363986 364487 365736 366798 367028 366732 366485 366194
53654 366194 365273 363489 361234 359183 357957 357833 358540 359563 360658 361787 362615 362710 362414 362804 364565 367340
53638 367340 370390 373319 375985 378330 380524 382763 384779 386187 387398 389378 392300 395214 397392 399177
53624 399177 401236 403784 406915 410783 414903 418140 420078 421745 424330 427704 430773 432799 433864 434552
53610 434552 435689 437997 441519 445643 449824 453776 456978 458896 459947 461359 463675 466245 468509 470747
53596 470747 473050 474629 474923 474558 474395 474418 474286 474218 474460 474575 474039 472987 471677 469974 468100 467054 467338
53579 467338 467895 467347 465736 464109 462926 461882 460826 459773 458311 456057 453554 451835 451222 451256 451537 451917
53563 451917 452145 452117 452238 452848 453604 454095 454718 456155 458337 460722 463229 466023 468718 470767 472533 474970
53547 474970 478260 481592 484260 486229 487622 488433 488863 489341 490168 491619 494257 498526 504043 509891 515570
53532 515570 521253 527233 533653 540652 548315 556591 565632 575868 587250 598828 609760 620452 631988
53519 631988 644710 658163 672186 687166 703191 719761 736471 753418 770968 789716 810552
53508 810552 834026 859582 886020 912709 939741 966997 993898 1020267 1046589 1073054 1098931
53497 1098931 1123336 1146225 1168183 1189511 1209967 1229404 1248374 1267818 1288118 1308617 1328375
53486 1328375 1347303 1366169 1385433 1404693 1423515 1442195 1461167 1480183 1498709 1516791 1534824
53475 1534824 1552682 1569758 1585772 1600830 1614604 1626032 1634143 1638958 1641411 1642394 1641832 1638727 1632260
53462 1632260 1622784 1611390 1598640 1584372 1568854 1553192 1538165 1523342 1507928 1491852 1475380
53451 1475380 1458268 1440080 1420993 1401560 1382016 1362405 1342998 1323926 1304805 1285410 1266365
53440 1266365 1248530 1232162 1217381 1204921 1195427 1188423 1182962 1179025 1177223 1177312 1178223 1179543 1181859 1185427
53426 1185427 1189583 1193863 1198793 1205115 1212956 1222237 1233247 1246244 1260852 1276338 1292323 1309002
53414 1309002 1326921 1346755 1368984 1393473 1419401 1445796 1472269 1499314 1527907 1558636 1591199
53403 1591199 1624978 1660033 1697056 1736262 1776981 1818710 1861941 1907400 1954986 2004113 2054591
53392 2054591 2106531 2159717 2213821 2268920 2325103 2381832 2438440 2494942 2551559 2607570 2661500
53381 2661500 2712431 2760444 2805857 2848795 2889474 2928096 2964255 2996998 3025588 3049772 3069399
53370 3069399 3084414 3095176 3102103 3104827 3102152 3092921 3076536 3052741 3021517 2983391 2939482 2891129
53358 2891129 2839634 2786200 2731725 2676763 2621860 2567609 2514117 2460936 2408008 2356247 2306582
53347 2306582 2258902 2212626 2167862 2125038 2083728 2042832 2001872 1961263 1921371 1882228 1844221
53336 1844221 1808279 1775135 1744953 1717678 1693156 1670985 1650882 1633143 1618160 1605589 1594572
53325 1594572 1584570 1575220 1565615 1554587 1541712 1527258 1511327 1493920 1475801 1458323 1442245 1427502
53313 1427502 1414143 1402609 1392941 1384581 1377159 1370760 1365372 1360819 1357359 1355495 1355060 1355305 1356014 1357679
53299 1357679 1360508 1364290 1369500 1377448 1388717 1402328 1417097 1433145 1451415 1472211 1494874 1518620
53287 1518620 1543176 1568703 1595291 1622371 1648654 1672981 1695257 1716136 1735890 1754102 1770314
53276 1770314 1784214 1795172 1802476 1806186 1806996 1805057 1799760 1790960 1779551 1766373 1751242 1733598 1713473
53263 1713473 1691240 1666883 1640221 1611624 1581997 1552068 1521989 1491561 1460656 1429449 1398218
53252 1398218 1366988 1335711 1305040 1276375 1250442 1226187 1201848 1176916 1152217 1128217 1104358
53241 1104358 1080133 1055757 1031512 1007388 983822 961875 942131 924036 906789 890298 874875
53230 874875 860645 847727 836469 826974 818758 811255 804318 797924 791741 785222 777822 768962 758216
53217 758216 745673 731779 716749 700565 683533 666323 649398 632890 617069 602394 589098
53206 589098 577194 566738 557524 548777 539942 531469 523874 516281 507168 496602 486356 477492 469065
53193 469065 459652 449072 438093 427497 417982 409913 402637 395026 387200 380651 376067 372266 368068
53180 368068 364004 361133 359184 357069 354417 351381 347662 343059 338572 335668 334564 334178 333621 332849 332047
53165 332047 331290 330727 330359 329733 328516 327177 326433 326176 325623 324355 322575 320558 318489 316703 315404 314274
53149 314274 312982 311950 311900 312695 313289 312998 312316 312273 313280 314722 315544 315244 314351 313773 313758 313877 314044 314834
53131 314834 316491 318328 319701 321008 322982 325419 327380 328483 329235 330146 331193 332250 333524 335322 337710
53116 337710 340467 343235 345736 348000 350298 352767 355227 357369 358885 359405 358683 356967 354820 352465 349718
53101 349718 346587 343374 340071 336354 332388 328978 326541 324581 322620 320983 320081 319460 318236 316106 313462
53086 313462 310872 308912 308053 308238 308885 309667 310817 312331 313475 313661 313216 312742 312277 311713 311432 311676 311771
53069 311771 310869 309231 307959 307616 307761 307655 306822 305129 302991 301314 300618 300365 299705 298691 298123 298412 299235
53052 299235 300171 301055 301794 302415 303222 304376 305459 306007 306396 307573 309846 312437 314307 315012 314667 313468
53036 313468 311470 308846 306282 304913 305448 307358 309391 310993 312605 314411 315616 315467 314291 312890 311519
53021 311519 310173 309299 309324 309801 309933 309779 310141 311323 312725 313662 314029 314105 314170 314334 314439 314234 313894 314058 315067
53002 315067 316493 317772 318880 319962 320795 321172 321438 322018 322739 323170 323320 323473 323708 324151 325281 327340 329722
52985 329722 331614 332944 334208 335751 337754 340409 343348 345394 345726 344930 344128 343458 342370 340986 340090
52970 340090 339906 339956 340113 340791 342061 343505 345063 347112 349530 351479 352452 352896 353525 354474 355314 355516 354784
52953 354784 353276 351511 349789 347872 345550 343181 341231 339566 337765 335820 333954 332032 329825 327605
52939 327605 325864 324713 324134 324407 325514 326550 326640 326206 326378 327339 328195 328279 327642 326407 324716 323290 322959
52922 322959 323536 324057 324257 324797 325896 326738 326591 325694 324706 323991 323705 323912 324310 324453 324472 324998 326191 327402
52904 327402 327972 327912 327676 327719 328231 328806 328548 327048 325054 323557 322557 321576 321006 321778 323786 325860 327408
52887 327408 328867 330352 331095 330645 329550 328384 327099 325874 325637 327005 329328 331383 332533 332902 333055
52872 333055 333856 335953 339029 342110 344829 347672 350785 353489 355338 356739 357978 358526 357999 357050 356492
52857 356492 356056 354780 352235 348712 344587 340120 335703 331711 328175 324864 321536 317970 314105 310294
52843 310294 307035 304356 301926 299831 298668 298674 299408 300395 301406 301955 301469 300327 299831 300531 301408 301382 300841
52826 300841 300864 301555 302141 302279 302297 302336 302186 301942 302015 302400 302582 302356 302215 302707 303797 305123 306600 308427 310492
52807 310492 312078 312442 311723 310934 310869 311270 311390 311044 310591 310085 309143 307646 305961 304318 302539 300527 298531
52790 298531 296817 295504 294755 294601 294555 294016 293170 292845 293305 293851 293861 293576 293556 293924 294528 295350 296437 297716
52772 297716 299110 300530 301682 302289 302523 302737 302807 302310 301288 300193 299127 297914 296898 296767 297487 298345
52756 298345 299215 300731 302988 305159 306802 308474 310449 311880 312037 311520 311455 312172 313364 314897 316688 318326
52740 318326 319494 320335 320963 321212 321339 322176 323976 325796 326741 327118 327727 328693 329748 330930 332248 333297
52724 333297 334054 335313 337390 339105 339122 337708 336076 334508 332424 329980 328214 327596 327529 327401 327165 326820
52708 326820 326274 325859 326115 326868 327288 327055 326766 326898 327068 326695 325937 325505 325727 326039 325483 323756 321745 320749
52690 320749 321126 322059 322773 323345 324021 324460 324293 323869 323660 323397 322618 321758 321819 323009 324439 325084 324511 322851
52672 322851 320784 319435 319563 320768 322007 322795 323407 324118 324913 325869 327134 328536 329698 330534 331130 331298
52656 331298 330877 330350 330553 331771 333607 335679 337850 339943 341836 343840 346329 348935 350682 350967 350002
52641 350002 348376 346706 345592 345243 345078 344229 342547 340702 339290 338288 337349 336220 334960 334165 334780 337144
52625 337144 340385 343255 345362 346948 347794 347325 345763 344187 343211 342410 341249 339834 338400 336842 335223
52610 335223 334141 334019 334421 334525 334050 333346 332811 332521 332324 332096 331970 332282 333080 333788 333789 333287 333107 333558 334057
52591 334057 334100 334077 334694 335913 336911 337019 336421 335936 336223 337163 338078 338613 339282 340823 343164 345418 346987 348194
52573 348194 349610 351081 351782 351158 349591 348093 347408 347450 347638 347671 347759 348034 348087 347359 345821 343988 342390 341278
52555 341278 340658 340253 339535 338164 336433 335028 334387 334454 334921 335445 335757 335841 335983 336405 336978 337484 337989 338685
52537 338685 339496 340143 340511 340751 341121 341899 343172 344544 345339 345376 345227 345383 345613 345556 345556 346301 347881 349813 351821
52518 351821 353993 356297 358518 360632 362754 364838 366934 369517 372960 376800 380178 382935 385585 388245
52504 388245 390307 391308 391387 390643 388641 384981 380026 374752 370087 366435 363489 360505 357072 353689 351227
52489 351227 349883 349130 348621 348544 348937 349284 349111 348572 348107 347854 347743 347944 348827 350479 352425 353990 354997
52472 354997 356075 357989 360586 362775 363882 364733 366858 370733 375316 379259 382193 384804 388008 392054
52458 392054 396069 398535 398524 396481 393565 390468 387263 384055 381102 378261 374987 371004 366624 362329 358471
52443 358471 355409 353484 352661 352507 352561 352543 352354 352223 352697 353985 355329 355587 354576 353393 353221 354079 354932
52426 354932 354834 353847 352900 352790 353463 354450 355822 358112 361223 364125 366055 367308 368394 369163 369451 369867 371056
52409 371056 372761 374539 376915 380776 386046 392109 399142 407772 417676 427833 438034 448725 459276
52396 459276 467791 472837 474134 471492 464700 454910 444567 435197 426508 418295 411689 407510 404724 401949
52382 401949 399502 398575 399118 400018 400921 402459 404773 407111 409048 411139 414137 418253 423296 428896 434468
52367 434468 439477 443833 447629 450539 451995 451981 451208 450366 449497 448173 446148 443786 441927 441193 441386 441819
52351 441819 442290 443332 445266 447523 449270 450379 451314 452402 453745 455650 458540 462341 466363 469910 472865
52336 472865 475665 478852 482691 487166 492346 498606 506187 514675 523411 532557 543282 556544 571990
52323 571990 588345 604574 620424 636147 652046 668117 683873 698740 712924 727655 744224
52312 744224 762797 782409 802021 821376 840992 861623 883833 907918 933948 961623 990070
52301 990070 1018161 1045381 1072167 1099058 1125743 1151350 1175403 1197855 1218292 1235781 1249593
52290 1249593 1259556 1265761 1268595 1269075 1268356 1266751 1263835 1259604 1254675 1249217 1242664 1234893 1226807 1219121
52276 1219121 1211389 1202942 1194148 1185999 1178986 1173120 1168563 1165408 1163251 1161880 1162183 1165376 1171289 1178204
52262 1178204 1184605 1190555 1197226 1205683 1216404 1229512 1244934 1262390 1281506 1302009 1323728 1346345
52250 1346345 1369191 1391403 1412276 1431381 1448296 1462500 1473680 1481893 1487200 1489496 1489061 1486858
52238 1486858 1483599 1478753 1471206 1460819 1448541 1435055 1420154 1403561 1385498 1366232 1345895 1325015
52226 1325015 1304369 1283931 1262808 1240721 1218793 1198332 1179476 1161637 1144609 1128607 1113708
52215 1113708 1099941 1087610 1076949 1067754 1059690 1052696 1046778 1041895 1038246 1036123 1035191 1034557 1033871 1033639
52201 1033639 1034082 1034556 1034639 1034971 1036284 1038423 1041116 1044961 1050637 1057726 1065311 1073281 1081963 1090777 1098343
52186 1098343 1103884 1107668 1110083 1111046 1110313 1107691 1102985 1096354 1088652 1080898 1073381 1065653 1057250 1048102
52172 1048102 1038542 1029373 1021610 1015691 1011193 1007634 1005111 1003759 1003279 1003564 1005154 1008362 1012541 1017019
52158 1017019 1022123 1028299 1034691 1039635 1042302 1042957 1042060 1040184 1038482 1037993 1038515 1039169 1040022 1042110 1045888
52143 1045888 1050707 1055891 1061299 1066604 1071012 1074051 1076048 1077659 1079518 1082298 1086339 1091240 1096479 1102432
52129 1102432 1109991 1119348 1130081 1142370 1157036 1174226 1193071 1212930 1234069 1256819 1280957 1306147
52117 1306147 1332136 1358180 1383243 1407264 1431417 1456594 1482290 1507381 1531324 1554186 1576219
52106 1576219 1597988 1620277 1643260 1666187 1688396 1710209 1732310 1754611 1776173 1795945 1813168
52095 1813168 1827382 1838424 1846217 1850289 1849797 1844268 1834098 1820159 1803255 1784066 1763194 1741046
52083 1741046 1718001 1694788 1672206 1650337 1628551 1606560 1585006 1564761 1546127 1529077 1513743
52072 1513743 1500222 1488233 1477443 1467980 1460413 1455406 1453477 1454721 1458611 1464511 1472541 1483415 1497167
52059 1497167 1512644 1528758 1545747 1564598 1585500 1607569 1629967 1652609 1675546 1698097 1718932
52048 1718932 1736893 1751517 1762749 1770394 1774117 1773969 1770618 1764873 1757234 1748110 1738059 1727283 1715185
52035 1715185 1701099 1685440 1669454 1653741 1637715 1620732 1603067 1585333 1567478 1548875 1529150
52024 1529150 1508421 1486946 1465002 1443118 1422010 1402071 1382991 1364000 1344638 1325348 1307170
52013 1307170 1290698 1275549 1261079 1247405 1235242 1224799 1215240 1205299 1194138 1181570 1167742 1152644
52001 1152644 1135858 1116990 1096591 1076271 1057434 1040251 1024398 1010291 998547 988392 977795
51990 977795 965513 952140 938727 925239 910880 895274 878662 861415 843908 826592 809681
51979 809681 792956 776207 759618 743508 727979 713171 699502 687321 676541 666963 658827 652827
51967 652827 649723 649997 653619 659951 668085 677322 687083 696399 704030 709274 712298 713507 712963 710516 706109
51952 706109 699848 692307 684911 679365 676291 674913 674470 675504 679291 686362 696149 707874 721338 736886
51938 736886 754924 775465 797907 821299 844791 867623 888676 906420 919455 926732 927228 919977
51926 919977 904954 883639 858325 830930 802565 773886 745387 717514 690802 665973 643761
51915 643761 624619 608530 595021 583487 573745 566174 561089 558173 556944 557498 560149 564441 569273
51902 569273 574112 579341 585184 591004 595993 599849 602329 602705 600219 594755 586710 576508 564591 551542
51888 551542 538003 524804 513279 504799 499637 496805 495402 495591 497864 501964 507136 513015 519678 527101
51874 527101 535122 543753 553027 562658 572127 580880 588200 593300 595935 596613 595813 593374 589114 583738 578640
51859 578640 574978 573226 573245 574299 575289 575560 575494 575967 577336 579155 580628 581056 580026 577489 573513 567887
51843 567887 560355 551398 542235 533718 525691 517812 510459 504307 499484 495746 493037 491252 489778 488057
51829 488057 486496 486154 487494 489873 492183 493563 493645 492609 491021 489301 487394 485145 482789 480801 479536
51814 479536 479288 480308 482343 484484 485945 486754 487307 487639 487601 487369 487191 486939 486522 486416 487137 488372 489373
51797 489373 490081 491213 493323 496327 499792 503016 504947 504845 503152 501078 499209 497140 494588 492136 490573
51782 490573 489967 489770 489560 489361 489408 489816 490472 491280 492504 494700 498090 502324 507122 512852 519981 528212
51766 528212 536709 545041 553299 561301 568290 573563 576878 578144 577178 573946 568672 561553 552713 542637
51752 542637 532305 522669 514146 506669 500055 494179 488965 484348 480310 477016 474874 474230 474918 476378
51738 476378 478373 481162 484798 488753 492766 497611 504342 512977 522487 531936 540860 548638 554325 557463
51724 557463 558585 558684 558636 559293 561579 565947 571728 577175 580199 579351 574579 567297 559605 553245 549051 546911
51708 546911 545883 544543 541791 537449 532067 526373 521137 517261 515443 515745 517692 520576 523404 524900
51694 524900 524227 521674 518288 514929 512085 510292 510038 511240 513231 515205 516206 515035 511038 505138 499366
51679 499366 495100 492257 490287 489261 489623 491408 494179 497446 500818 503983 506920 510051 514004 519193
51665 519193 525671 533358 542502 553930 568434 585512 602891 617691 627938 632701 631359 623780 611319
51652 611319 596738 582703 570701 561403 555276 552414 552255 554038 557210 561099 564488 565973 564683 560527
51638 560527 553995 546023 537840 530516 524511 519654 515445 511369 507097 502564 497923 493436 489471 486426
51624 486426 484513 483623 483489 483802 484060 483619 482177 480034 477576 474753 471359 467586 463898 460576 457721
51609 457721 455417 453466 451279 448621 446167 444745 444299 444291 444779 446247 448521 450903 453411 456932 461978
51594 461978 468262 475723 484958 496190 508731 521931 535710 549376 560726 567299 568315 564835 558517
51581 558517 550941 543680 537997 534353 532742 533470 537116 543768 552850 563788 576487 591004 606997
51568 606997 623649 640162 656441 673320 691844 712151 733179 753643 773170 792557 813228
51557 813228 836552 863192 892685 923672 954629 984065 1009976 1029677 1040756 1042201 1034453 1018641
51545 1018641 996046 968087 936426 902915 869411 837403 807695 780567 756250 735081 717242
51534 717242 702653 691014 681526 672673 662964 652104 640847 629570 617719 604998 592336 580983
51522 580983 571191 562459 554576 547597 541078 534272 527079 520132 513905 508362 503471 499390 495986 492805
51508 492805 489766 487327 485682 484265 482471 480490 478960 477993 477029 475679 474312 473711 474376 476267 479023
51493 479023 482178 485252 487875 489963 491664 493044 493979 494414 494542 494505 494069 492926 491267 489698 488496 487264
51477 487264 485494 483228 480957 479047 477473 476021 474480 472653 470339 467404 463918 460214 456716 453583
51463 453583 450566 447364 444052 440976 438358 436246 434786 434142 434117 434223 434257 434535 435430 436976 439051 441604
51447 441604 444528 447655 451124 455564 461706 469925 480206 492248 505425 519016 532729 546714 560743
51434 560743 573655 584003 591166 595588 598131 599541 600239 599983 597581 591505 581303 568413 555302
51421 555302 543670 533501 523792 514045 504825 497008 490829 485906 481952 479055 477310 476573 476622 477213 477901
51406 477901 478212 478254 478798 480373 482434 483863 484289 484638 486308 489954 495133 500926 506705 512446 518569 525653
51390 525653 534116 543927 554659 566025 578404 592590 609081 627959 649522 674513 703423 735985
51378 735985 771767 810874 853515 899149 946602 994954 1043684 1091897 1137585 1177409 1206868
51367 1206868 1221406 1218602 1199640 1168117 1127424 1079776 1027366 972978 918864 865858 814289
51356 814289 765208 720105 679835 644404 613513 586894 564319 545660 530708 518709 508467
51345 508467 499242 491206 484669 479200 473984 468788 464178 460852 459025 458313 457980 457493 456973 456947 457577 458461
51329 458461 459304 460261 461344 461893 461077 458725 455438 452150 449763 448741 448600 448041 446051 442862 439659 437536
51313 437536 436879 437433 438619 439936 441296 442924 444966 447410 450290 453418 455920 456731 455865 454603 453994
51298 453994 453641 452384 449738 446220 442606 439446 437015 435241 433768 432395 431323 430842 431075 432156 434182
51283 434182 436812 439442 442143 445842 451097 457221 463151 468751 474679 481321 488364 495150 500933 505207
51269 505207 508208 510707 512841 513698 512641 510554 509020 508745 509539 511296 513894 516306 516953 515071 511113
51254 511113 505906 500271 495275 491719 489141 486191 482230 477760 473052 467365 460164 452425 446050 442273
51240 442273 441075 441684 443026 443937 443696 442566 441570 441594 442830 444932 447400 449684 451166 451418 450628 449575
51224 449575 448944 448682 448222 447236 445858 444278 442629 441331 440990 441688 442837 444041 445620 447925 450604 453045
51208 453045 455136 457145 459180 461331 463998 467463 471403 475348 479389 483789 488153 491692 494303 496679
51194 496679 499296 501774 503352 503580 502514 500631 498583 496701 494747 492296 489299 486049 482893 480228
51180 480228 478463 477577 476964 476111 475161 474524 474380 474933 476553 479013 481108 481814 481466 481099 481080 481163 481356 481665
51162 481665 481368 479833 477965 477635 479506 482540 485650 488675 491451 493162 493264 492196 490696 489063 487474
51147 487474 486197 485104 483762 482404 482053 483149 484842 486152 487093 488019 488562 488066 486677 485282 484565 484670
51131 484670 485510 486862 488366 489793 491139 492218 492579 492231 492043 492922 494836 497054 499039 500679 501926
51116 501926 502814 503712 505103 507073 509339 511699 514149 516606 518872 520940 523111 525633 528281 530430 531717
51101 531717 532579 533845 535668 537304 538312 539470 541781 544845 547142 547896 547753 547443 546754 545280 543378
51086 543378 541750 540629 539972 539946 540692 541935 543304 544654 545671 545681 544447 542800 541863 541910 542455 543175 544115
51069 544115 545312 546942 549714 554383 560803 568039 575521 583651 593184 604520 617800 633260 651176
51056 651176 671681 694787 720188 746571 771230 790990 804061 811116 814557 816914 820106 825681
51044 825681 834526 845639 855846 861936 863305 861882 859405 855507 848653 838213 825130 811233 798552
51031 798552 788809 782520 778280 773383 765468 753740 738958 722743 706936 693206 682743 676023 672780
51018 672780 672386 674446 679026 686161 695344 705810 717163 729360 742135 754923 767350 779318 790529
51005 790529 800453 808935 816260 822359 826436 827836 826921 824749 822154 819463 816788 814139 811394 808591
50991 808591 806273 805210 805729 807446 809801 812862 817606 825271 836327 850229 866349 884884 906453
50978 906453 931068 958058 986976 1017935 1051008 1085820 1121883 1158854 1196361 1234229 1273143
50967 1273143 1314694 1360516 1411703 1468968 1532601 1602028 1676094 1754120 1836184 1922030 2010393
50956 2010393 2099799 2189276 2277579 2362192 2439965 2508581 2566950 2614468 2650578 2675031 2687984
50945 2687984 2689783 2680965 2662529 2635958 2603012 2565622 2525825 2485499 2445968 2407686 2369996 2331367
50933 2331367 2290418 2247110 2202827 2159330 2117812 2078693 2041559 2005223 1968437 1930789 1892382
50922 1892382 1852678 1810461 1765217 1717759 1669192 1620020 1570721 1522365 1476006 1432065 1390847
50911 1390847 1353022 1318952 1288110 1259835 1234138 1211170 1190526 1171728 1154833 1139783 1125732
50900 1125732 1111905 1098692 1086951 1076646 1067097 1058326 1051193 1046284 1043533 1042739 1043601 1045312 1046996
50887 1046996 1048572 1050507 1052857 1055354 1058316 1062471 1067812 1073514 1079221 1085672 1093752 1103528 1114458 1126066
50873 1126066 1138302 1151743 1167450 1186022 1206732 1228172 1249868 1272672 1297481 1324330 1352984
50862 1352984 1383774 1417423 1454492 1495370 1540470 1590155 1644739 1704827 1771421 1845615 1928457
50851 1928457 2021139 2124858 2240263 2367368 2506189 2657162 2820567 2995634 3180446 3372733
50841 3372733 3570731 3773205 3978550 4183879 4385146 4578063 4758343 4920864 5059385
50832 5059385 5167994 5242967 5283109 5288876 5261942 5205349 5123145 5019587 4899065 4766646 4627948
50821 4627948 4488249 4352079 4223530 4106214 4002489 3912846 3835918 3768694 3706998 3646637
50811 3646637 3584608 3519139 3448797 3372120 3288101 3196460 3097308 2991089 2878979 2762968 2645416
50800 2645416 2528729 2415309 2307163 2205401 2110546 2023387 1945126 1876652 1818087 1769014
50790 1769014 1728588 1695382 1667847 1645283 1627933 1615920 1608467 1604364 1602700 1602836 1604074 1605812 1607813
50777 1607813 1609945 1611656 1612020 1610393 1606993 1602621 1597726 1591819 1584051 1574258 1562971 1550394 1536091
50764 1536091 1519992 1502918 1485532 1467446 1448189 1428513 1409742 1392253 1375655 1360219 1346933
50753 1346933 1336091 1327101 1319941 1315820 1315909 1320223 1328086 1339056 1353116 1370682 1392667 1419886 1452152
50740 1452152 1488636 1529250 1574849 1625856 1681663 1741834 1806979 1877822 1954180 2035528 2121906
50729 2121906 2213570 2310163 2410835 2514696 2620615 2726980 2832142 2934785 3033561 3126930
50719 3126930 3213668 3292744 3362108 3418253 3457696 3478385 3479036 3457964 3413966 3348350 3265310 3170291
50707 3170291 3068661 2965566 2865789 2772964 2689189 2615473 2552157 2498809 2454201 2416821 2385431
50696 2385431 2359036 2336256 2314713 2291148 2262504 2227078 2184539 2135018 2078771 2016783 1951039
50685 1951039 1883856 1817386 1753975 1696135 1645403 1601596 1563755 1531567 1505463 1485893 1473213
50674 1473213 1467804 1469476 1476991 1488969 1505239 1526575 1553087 1583499 1615981 1649057 1681676 1713083
50662 1713083 1742834 1770459 1795063 1815827 1833049 1848186 1862590 1876549 1889745 1902275 1914973
50651 1914973 1928904 1944633 1961758 1979077 1995502 2011006 2026618 2043533 2062416 2083469 2106822
50640 2106822 2132759 2161808 2194615 2231531 2272266 2316078 2362208 2409865 2457965 2505318 2551164
50629 2551164 2595302 2637689 2678169 2716555 2752665 2786379 2817950 2847960 2875934 2898554 2909967
50618 2909967 2905010 2882780 2847359 2805415 2763199 2725031 2693258 2668678 2650919 2638902 2631385 2627293
50606 2627293 2625557 2624772 2623096 2618510 2609130 2593304 2569647 2537175 2495435 2444489 2384953 2318164
50594 2318164 2246139 2171063 2094688 2018306 1943142 1870498 1801335 1735942 1674214 1616252 1562512
50583 1562512 1513372 1468752 1428290 1391728 1358970 1329853 1304211 1282227 1264364 1250696 1240542
50572 1240542 1233116 1228403 1227070 1229536 1235456 1244053 1254576 1266393 1279155 1293140 1309150 1327777
50560 1327777 1348867 1371772 1395859 1420679 1445984 1471926 1499039 1527739 1557915 1589251 1621825
50549 1621825 1656055 1692048 1729209 1766597 1803534 1839806 1875357 1910000 1943624 1976722 2010475
50538 2010475 2046116 2084281 2125188 2169234 2217049 2269085 2325556 2386731 2452730 2522895 2595967
50527 2595967 2671324 2749738 2832705 2921334 3016152 3117359 3224552 3336295 3450635 3565983
50517 3565983 3680903 3792895 3898085 3992680 4074471 4142474 4195372 4230956 4247285 4243821 4221107
50506 4221107 4179826 4120893 4046325 3959244 3862868 3760151 3654682 3551149 3454226 3367334 3292948
50495 3292948 3233468 3190859 3165572 3156652 3162824 3182644 3213609 3251915 3293220 3332883 3365380 3384533
50483 3384533 3385033 3363528 3318365 3249354 3158387 3049563 2927948 2798305 2665101 2532775 2405126
50472 2405126 2284528 2172073 2068088 1972235 1883732 1802102 1727444 1659647 1597969 1541950 1492184
50461 1492184 1449402 1413126 1382015 1355295 1333059 1315299 1301467 1291183 1284815 1283057 1286166 1293639
50449 1293639 1304459 1317791 1333619 1352498 1374534 1399059 1425643 1454822 1487192 1522102 1557937
50438 1557937 1593442 1627866 1659800 1686697 1705969 1716388 1718565 1714636 1707541 1699938 1693261 1687762
50426 1687762 1683294 1679812 1677316 1675880 1675938 1678249 1683383 1691364 1701818 1714431 1729383 1747496 1769831
50413 1769831 1796941 1828649 1864659 1905102 1950209 1999695 2052704 2108156 2164928 2222033 2278953
50402 2278953 2335496 2390996 2443984 2492965 2537196 2576279 2609347 2635100 2652295 2659708 2656004 2640275
50390 2640275 2612444 2572687 2520930 2457798 2385809 2308863 2230647 2154117 2082034 2016813 1959695
50379 1959695 1910944 1870958 1840458 1819573 1807624 1803919 1807861 1818081 1832367 1848782 1865960 1881924
50367 1881924 1893526 1897678 1892581 1877399 1851728 1816282 1773501 1726490 1677454 1627699 1578733 1532520
50355 1532520 1490716 1454237 1423395 1397681 1375408 1354295 1332730 1310013 1285325 1257201 1224706
50344 1224706 1188885 1152486 1118150 1087160 1059831 1036427 1017239 1002094 990424 981883 976457 973862
50332 973862 973400 974632 977697 982556 988334 993949 999163 1004467 1010140 1016027 1022127 1028677 1035527 1042078
50318 1042078 1048138 1054429 1061916 1070874 1080791 1090971 1100959 1110582 1119793 1128524 1136661 1144209 1151416 1158731
50304 1158731 1166811 1176605 1189063 1204480 1222352 1242180 1264163 1288812 1316318 1346771 1380604 1418059
50292 1418059 1458337 1499693 1539795 1574834 1598548 1603994 1587799 1552741 1505895 1454579 1403897
50281 1403897 1356792 1314872 1278763 1248313 1223045 1202633 1187045 1176198 1169476 1165852 1164706 1166319
50269 1166319 1171144 1178779 1188200 1198953 1211509 1226344 1243326 1262279 1283633 1308100 1335905 1366501
50257 1366501 1398720 1431111 1462500 1492530 1521415 1549085 1574814 1597745 1617426 1633832 1647240
50246 1647240 1658168 1666929 1673033 1675256 1672315 1663168 1646900 1623160 1593052 1559112 1524110 1490183
50234 1490183 1459020 1431999 1409603 1391174 1375675 1362353 1350359 1338153 1323719 1305232 1281558
50223 1281558 1252743 1220433 1187334 1155805 1127024 1101355 1078714 1058363 1039209 1020995 1004664
50212 1004664 990966 979291 968493 958309 949132 940829 932782 924960 918029 912200 906727 900771 894283
50199 894283 887845 882000 876961 872599 868518 864316 859872 855358 851015 847084 843806 841195 838854 836281
50185 836281 833443 830908 829386 829107 829562 829832 829372 828574 828323 828947 829928 830738 831566 832937 835025 837739 841183
50168 841183 845564 850701 855980 860732 864557 867528 870359 874117 879385 885884 893169 901431 911214 922661
50154 922661 935565 950099 966961 986737 1009576 1035594 1065210 1098924 1136948 1179110 1224914
50143 1224914 1273587 1324372 1376969 1431594 1488429 1546932 1605620 1662564 1716263 1766246 1813021
50132 1813021 1857509 1900461 1942075 1981760 2018089 2049020 2072081 2084378 2082983 2066137 2034293
50121 2034293 1989726 1935129 1872936 1805729 1736346 1667131 1599500 1534548 1473576 1417727 1367521
50110 1367521 1323117 1284514 1251103 1221520 1194580 1170122 1148453 1129337 1112034 1096057 1081232
50099 1081232 1067180 1053401 1039924 1027334 1015958 1005283 994298 982311 969528 956969 945713
50088 945713 936094 927773 920520 914465 909439 904708 899779 895020 891024 887843 885372 883948 883787 884216 884486
50073 884486 885241 888194 894060 901595 908988 915573 921786 927977 933929 939361 944388 949347 954363 959117
50059 959117 962991 965429 966283 965919 964988 963994 962864 961064 958346 955284 952727 950826 949186 948007 948337
50044 948337 950800 954688 958893 963290 968663 975713 984756 996002 1009335 1024002 1039285 1055427 1073314
50031 1073314 1093333 1115273 1139291 1166168 1196418 1229714 1265453 1303388 1343444 1385247 1428066
50020 1428066 1471007 1513220 1554122 1593386 1630506 1664570 1694820 1721170 1743538 1760829 1771359
50009 1771359 1774542 1771528 1763884 1751981 1734807 1710833 1678748 1637883 1588670 1532949 1473686 1414228
49997 1414228 1357482 1305365 1258779 1218053 1183274 1154136 1129703 1108665 1089854 1072442 1055984
49986 1055984 1040559 1026481 1013373 999773 984205 966631 948354 930588 913626 897330 881799
49975 881799 867381 854472 843375 834047 825999 818838 812865 808666 806164 804486 802709 800266 796809
49962 796809 792370 787684 783632 780224 776789 773348 771069 771031 773120 776548 780922 786357 792975 800801 809861
49947 809861 819906 830091 839218 846330 851125 854032 855953 857613 859056 859911 860005 859306 857432 853887 848884
49932 848884 843223 837065 829401 819186 806592 792870 779355 766991 756357 747655 740745 735450 731695
49919 731695 729292 727987 727813 728997 731327 734137 737137 740699 744946 749148 752589 755610 759145 763544
49905 763544 768552 774286 781412 790246 800150 810162 819907 829707 839995 850732 861270 870645 878034
49892 878034 883084 885933 887032 886773 885057 881256 874835 865986 855346 843241 829669 815114 800811
49879 800811 787922 776840 767430 759477 752518 745776 738846 732321 727263 724158 722754 722733 724059 726537
49865 726537 729489 732157 734503 737485 742344 749440 757888 766579 775480 785540 797387 810617 824419
49852 824419 838296 851880 864547 875683 885008 892352 897451 900344 901630 901874 900900 898037 892867 885499
49838 885499 876393 866245 855799 845399 834919 824425 814582 806039 798773 792512 787439 783855 781409
49825 781409 779361 777630 776919 777701 779656 782289 785646 790134 795964 802970 810755 818830 826815 834657 842540
49810 842540 850474 858046 864637 869817 873545 876122 877983 879388 880257 880288 879171 876721 872995 868461 863935
49795 863935 860099 856935 853501 848250 839814 827920 813685 798793 784408 771131 759738 751136 745323
49782 745323 741135 737609 735121 734567 735825 737720 739330 740628 741967 743647 746089 749813 755014 761507
49768 761507 769190 778147 788166 798501 808257 816745 823462 828191 831380 834095 837250 840888 844231 846315
49754 846315 846547 844869 841556 836790 830393 822090 812124 801563 791924 784332 778935 775116 772346 770688
49740 770688 770253 770493 770649 770913 772354 775348 778817 781584 783947 787195 792024 798253 805710 814377 823614
49725 823614 832151 839131 844700 849590 854735 861270 870136 881467 894846 910014 926555 942984 957378
49712 957378 969317 980102 990318 998013 1000238 995863 986131 973034 958236 943354 930019 919228
49700 919228 911171 905911 903781 904919 908739 913916 918539 920370 917690 910481 900661 890820 882681 876756
49686 876756 873174 872366 874740 879904 886691 894215 902679 912852 924973 938730 954258 972379 993600
49673 993600 1017627 1044369 1074476 1107500 1139525 1163841 1174908 1171825 1158264 1139785 1121339 1106271
49661 1106271 1096424 1092523 1094452 1101357 1111899 1124658 1138000 1149071 1153306 1146168 1126195 1096275
49649 1096275 1061715 1027316 996069 969418 947613 929909 915274 903217 893745 886741 881832 878757
49637 878757 877356 877221 877812 878882 880255 881209 880685 878350 874930 871175 866873 861188 853702 844836 835441
49622 835441 826273 817682 809613 802028 795353 790154 786303 783000 779928 777853 777508 778323 778979 779071 779462 780997
49606 780997 783568 786502 789272 791575 793349 794984 797027 799278 800670 800463 799201 798040 797427 796950 796233
49591 796233 795341 794371 793317 792462 792363 793167 794345 795359 796290 797449 798616 799099 798551 797454 796750 797125 798580
49574 798580 800485 802075 803178 804510 807066 811232 816722 823425 831839 842404 854743 867950 881341
49561 881341 894387 906095 915225 921382 925271 927455 927342 924015 917855 910683 904178 898626 893390 888184
49547 888184 883491 879933 877642 876381 876002 876531 877839 879618 881847 884939 889002 893139 896035 897422 898477
49532 898477 900647 904542 910164 917651 927290 939208 953599 970992 991743 1015460 1041468 1069676
49520 1069676 1100312 1132732 1164883 1193982 1217404 1233277 1241082 1242094 1238852 1233925 1229223 1226182
49508 1226182 1225971 1229254 1236022 1245555 1256138 1264865 1268376 1264233 1251630 1231166 1204581 1174650 1144428
49495 1144428 1116097 1090648 1068573 1050256 1035571 1023748 1013968 1005753 998747 992628 987446 983469
49483 983469 980558 978288 976896 977381 980200 984400 988511 991810 994341 996249 997734 999272 1001200 1003242
49469 1003242 1004907 1006269 1007942 1010485 1014082 1018602 1023652 1028792 1034059 1040068 1047303 1055395 1063279 1069914
49455 1069914 1074815 1078147 1080441 1081870 1081843 1079706 1075833 1071381 1066923 1062062 1056610 1051299 1046902 1043418
49441 1043418 1040692 1039083 1038871 1039638 1040980 1043319 1047263 1052590 1058629 1065362 1073513 1083748 1096306 1111090
49427 1111090 1127642 1145380 1164324 1185273 1209003 1235655 1264868 1295640 1326101 1355107 1384396
49416 1384396 1416694 1449560 1472942 1476050 1457079 1424514 1389348 1358121 1332940 1314586 1303442
49405 1303442 1298954 1300117 1306155 1316041 1328180 1341364 1355356 1369891 1383827 1395976 1406217 1415254
49393 1415254 1423784 1432201 1440405 1447468 1452216 1454528 1455352 1455041 1452457 1446279 1436467 1423971 1409778 1394762
49379 1394762 1379703 1364805 1349859 1335442 1323151 1313968 1307136 1301461 1297024 1294696 1294559 1295862 1298174
49366 1298174 1301562 1305797 1310223 1314323 1317713 1319740 1319859 1318338 1315935 1312816 1308408 1302322 1294935 1286963
49352 1286963 1278842 1270625 1262305 1254275 1247509 1242949 1240531 1239147 1237743 1235993 1233654 1230010 1224591 1217991
49338 1217991 1211233 1204655 1198038 1191514 1185499 1179923 1174417 1169406 1166342 1166522 1170113 1176529 1185489 1197405
49324 1197405 1212775 1231318 1251777 1272622 1292630 1310410 1323611 1329617 1327507 1318907 1306622 1292894
49312 1292894 1279056 1265783 1252794 1238972 1223753 1208189 1193936 1181602 1170833 1161582 1154274 1148942
49300 1148942 1145265 1143448 1144151 1147341 1151959 1156897 1161737 1166436 1170914 1175042 1178518 1180705 1181216 1180622 1179922
49285 1179922 1179250 1177688 1174393 1169198 1162090 1153086 1143031 1133805 1127126 1123428 1122117 1122451 1123887 1126116
49271 1126116 1129198 1133323 1138114 1142537 1145876 1148533 1151470 1155085 1158939 1162452 1165515 1168376 1171139 1173659
49257 1173659 1176125 1179679 1185980 1195944 1209384 1226149 1246802 1271268 1297481 1322754 1346250 1368442
49245 1368442 1387814 1399976 1401298 1392358 1376555 1356332 1332388 1306050 1280324 1257948 1239642 1224897
49233 1224897 1213517 1205661 1201083 1199296 1200211 1203819 1209266 1215014 1220197 1225394 1231692 1239228 1247036 1254288
49219 1254288 1261244 1268787 1277340 1286615 1296277 1306349 1316871 1327570 1338188 1348866 1359889 1371125
49207 1371125 1382046 1392366 1402533 1413522 1426190 1440761 1456892 1474185 1492495 1511612 1530803
49196 1530803 1549109 1566192 1582505 1598383 1613274 1626221 1636878 1645680 1653209 1659754 1665448 1670410
49184 1670410 1674727 1678670 1682975 1688584 1696019 1705376 1716982 1731582 1749616 1770759 1794702 1822231
49172 1822231 1854973 1893986 1939010 1989198 2044097 2103292 2164976 2225060 2277775 2317395 2340125
49161 2340125 2345485 2336629 2319260 2299498 2281901 2268683 2260082 2255175 2252619 2251236 2250319 2249601 2249214 2249899
49147 2249899 2252971 2259462 2269128 2280669 2293193 2307101 2323230 2341488 2360772 2380013 2398779 2416981
49135 2416981 2434665 2452247 2470385 2489296 2508473 2527324 2545841 2564502 2583807 2604037 2625131
49124 2625131 2646609 2668030 2689737 2712724 2737594 2764281 2793214 2826004 2864197 2907848 2956283
49113 2956283 3010053 3071296 3142611 3226848 3327986 3450546 3597279 3768282 3963303 4184111
49103 4184111 4432506 4703821 4981333 5239214 5457034 5636735 5803337 5979997 6155690
49094 6155690 6279825 6296379 6188576 5991739 5763962 5544770 5337414 5122289 4882351 4618898
49084 4618898 4349961 4097600 3876128 3689405 3535548 3411389 3312902 3234749 3171966 3121598
49074 3121598 3081641 3049251 3021262 2995856 2972585 2951189 2931430 2913664 2898398 2885376 2873896
49063 2873896 2863683 2854592 2845814 2836460 2826787 2817803 2809697 2801623 2793141 2784969 2778017 2772355 2767413 2762708
49049 2762708 2758187 2754286 2751759 2751149 2752357 2754939 2758466 2762101 2764131 2762740 2757338 2748702 2738026 2726543
49035 2726543 2715985 2708412 2705046 2705644 2709163 2714685 2721550 2729108 2736728 2743919 2750322 2755701 2759926 2762882
49021 2762882 2764542 2765323 2766114 2767625 2769917 2772813 2776450 2781063 2786567 2792846 2800068 2808155 2816325 2823903
49007 2823903 2831287 2839335 2847940 2856048 2863045 2869370 2875755 2882557 2889814 2897217 2903957 2909287 2913240 2916173
48993 2916173 2917797 2917566 2915893 2913869 2911656 2908288 2903395 2897906 2892494 2886426 2878856 2870423 2862474 2855187
48979 2855187 2847456 2838460 2828571 2818639 2808960 2799040 2788085 2775695 2762253 2748548 2735016 2721611
48967 2721611 2708408 2695853 2684292 2673712 2664173 2656076 2649792 2645546 2643885 2645732 2651551 2660827 2672672
48954 2672672 2686532 2701975 2718366 2735315 2753233 2772997 2795201 2819921 2846760 2874839 2903104
$$ [...]
##END NTUPLES=NMR SPECTRUM
##END=
