##TITLE=AC1707_ROEFFECT0029_8637995_807HLyJJxx
##JCAMPDX= 6.0         $$ Bruker NMR JCAMP-DX V2.0
##DATA TYPE= NMR SPECTRUM
##DATA CLASS= NTUPLES
##ORIGIN= BRUKER
##OWNER= Administrator
$$ 1.72 TOPSPIN		Version 2.1
$$ 2014-05-22 19:56:57.886 -0700  Administrator@X
$$ Compression mode = diff/dup
##.OBSERVE FREQUENCY= 400.02188249412
##.OBSERVE NUCLEUS= ^1H
##.ACQUISITION MODE= SIMULTANEOUS (DQD)
##.ACQUISITION SCHEME= undefined
##.AVERAGES= 8
##.DIGITISER RES= 22
##SPECTROMETER/DATA SYSTEM= spect
##.PULSE SEQUENCE= zg30
##.SOLVENT NAME= COFFEE_meoh
##.SHIFT REFERENCE= INTERNAL, COFFEE_meoh, 1, 14.98509
##AUDIT TRAIL= $$ (NUMBER, WHEN, WHO, WHERE, PROCESS, VERSION, WHAT)
$$ ##TITLE= Audit trail, TOPSPIN		Version 2.1
$$ ##JCAMPDX= 5.01
$$ ##ORIGIN= Bruker BioSpin GmbH
$$ ##OWNER= Administrator
$$ $$ E:\/data/COFFEE/nmr/AC1707_ROEFFECT0029_8637995_807HLyJJxx/10/pdata/1/auditp.txt
$$ ##AUDIT TRAIL=  $$ (NUMBER, WHEN, WHO, WHERE, PROCESS, VERSION, WHAT)
(   1,<2014-05-22 19:56:53.095 -0700>,<Administrator>,<X>,<go>,<TOPSPIN 2.1>,
      <created by zg
	started at 2014-05-22 19:55:40.539 -0700,
	POWCHK enabled, PULCHK disabled,
       configuration hash MD5:
       C8 4E 4E 5D D3 5C D8 9E 9F 52 82 E0 59 8A DE 15
       data hash MD5: 64K
       94 45 79 28 88 4B 37 48 A9 0B 67 56 12 60 EE 1C>)
(   2,<2014-05-22 19:56:55.185 -0700>,<Administrator>,<X>,<proc1d>,<TOPSPIN 2.1>,
      <Start of raw data processing
       efp LB = 0 FT_mod = 6 PKNL = 1 PHC0 = 0 PHC1 = 0 SI = 32K 
       data hash MD5: 32K
       83 4F F7 CB 0B 73 92 A9 59 1C DB 59 B0 8E 66 3F>)
(   3,<2014-05-22 19:56:55.391 -0700>,<Administrator>,<X>,<proc1d>,<TOPSPIN 2.1>,
      <pk PHC0 = 90.53833 PHC1 = 0 
       data hash MD5: 32K
       DF 85 AA 08 52 63 22 60 5D F9 74 80 95 F2 41 1E>)
(   4,<2014-05-22 19:56:55.448 -0700>,<Administrator>,<X>,<proc1d>,<TOPSPIN 2.1>,
      <abs ABSG = 1 
       data hash MD5: 32K
       6D 8F F3 3B 65 4C FF 2F 2A 79 61 7E 13 96 A9 84>)
(   5,<2014-05-22 19:56:55.494 -0700>,<Administrator>,<X>,<proc1d>,<TOPSPIN 2.1>,
      <abs ABSG = 2 
       data hash MD5: 32K
       42 C3 5A CE 66 A6 1B 88 47 95 51 A2 11 D0 92 CE>)
(   6,<2014-05-22 19:56:55.551 -0700>,<Administrator>,<X>,<proc1d>,<TOPSPIN 2.1>,
      <abs ABSG = 3 
       data hash MD5: 32K
       09 26 92 25 2A D6 19 11 71 B7 7B A2 5A 1A 87 27>)
(   7,<2014-05-22 19:56:55.609 -0700>,<Administrator>,<X>,<proc1d>,<TOPSPIN 2.1>,
      <abs ABSG = 4 
       data hash MD5: 32K
       E8 08 3A 74 DC B7 46 2C 3E E4 76 3C 06 5B 5C AD>)
(   8,<2014-05-22 19:56:55.654 -0700>,<Administrator>,<X>,<proc1d>,<TOPSPIN 2.1>,
      <abs ABSG = 5 
       data hash MD5: 32K
       37 AE 70 12 67 92 90 C2 4B FC B5 F5 4B 6C 49 1D>)
$$ ##END=
$$ 
$$ $$ hash MD5
$$ $$ 90 6A 4B 0C 06 58 C9 34 20 DB 60 99 54 90 22 EC
##$RELAX= 
##$RELAX= 
##$RELAX= 
##$RELAX= 
##$RELAX= 
##$RELAX= 
##$RELAX= 
$$ Bruker specific parameters
$$ --------------------------
##$DU= <E:\>
##$EXPNO= 10
$$ [...]
150 150 150 150 150 150 150 150
##$TP07= 0
##$TPNAME0= <>
##$TPNAME1= <>
##$TPNAME2= <>
##$TPNAME3= <>
##$TPNAME4= <>
##$TPNAME5= <>
##$TPNAME6= <>
##$TPNAME7= <>
##$TPOAL= (0..7)
0.5 0.5 0.5 0.5 0.5 0.5 0.5 0.5
##$TPOFFS= (0..7)
0 0 0 0 0 0 0 0
##$TUNHIN= 0
##$TUNHOUT= 0
##$TUNXOUT= 0
##$USERA1= <user>
##$USERA2= <user>
##$USERA3= <user>
##$USERA4= <user>
##$USERA5= <user>
##$V9= 5
##$VALIST= <valist>
##$VCLIST= <CCCCCCCCCCCCCCC>
##$VD= 0
##$VDLIST= <DDDDDDDDDDDDDDD>
##$VPLIST= <PPPPPPPPPPPPPPP>
##$VTLIST= <TTTTTTTTTTTTTTT>
##$WBST= 2048
##$WBSW= 25
##$XGAIN= (0..3)
0 0 0 0
##$XL= 0
##$YL= 0
##$YMAX_a= 558266
##$YMIN_a= -479550
##$ZGOPTNS= <>
##$ZL1= 120
##$ZL2= 120
##$ZL3= 120
##$ZL4= 120
##$ABSF1= 14.98509
##$ABSF2= -5.573092
##$ABSG= 5
##$ABSL= 3
##$ALPHA= 0
##$AQORDER= 0
##$ASSFAC= 0
##$ASSFACI= 0
##$ASSFACX= 0
##$ASSWID= 0
##$AUNMP= <proc_prof1d_extract_pilot.lims>
##$AXLEFT= 0
##$AXNAME= <>
##$AXNUC= <1H>
##$AXRIGHT= 0
##$AXTYPE= 0
##$AXUNIT= <>
##$AZFE= 0.1
##$AZFW= 0.1
##$BCFW= 0
##$BC_mod= 0
##$BYTORDP= 0
##$COROFFS= 0
##$CY= 15
##$DATMOD= 1
##$DC= 0
##$DFILT= <>
##$DTYPP= 0
##$F1P= 0
##$F2P= 0
##$FCOR= 0.5
##$FTSIZE= 32768
##$FT_mod= 6
##$GAMMA= 0
##$GB= 0
##$INTBC= 1
##$INTSCL= 1
##$ISEN= 128
##$LB= 0
##$LEV0= 0
##$LPBIN= 0
##$MAXI= 10000
##$MC2= 0
##$MEAN= 0
##$ME_mod= 0
##$MI= 0
##$NCOEF= 0
##$NC_proc= -8
##$NLEV= 6
##$NOISF1= 0
##$NOISF2= 0
##$NSP= 0
##$NTH_PI= 0
##$NZP= 0
##$OFFSET= 14.98509
##$PC= 1
##$PHC0= 90.53833
##$PHC1= 0
##$PH_mod= 1
##$PKNL= yes
##$PPARMOD= 0
##$PPDIAG= 0
##$PPIPTYP= 0
##$PPMPNUM= 2147483647
##$PPRESOL= 1
##$PSCAL= 4
##$PSIGN= 0
##$PYNMP= <proc.py>
##$REVERSE= no
##$SF= 400.02
##$SI= 32768
##$SIGF1= 0
##$SIGF2= 0
##$SINO= 400
##$SIOLD= 32768
##$SPECTYP= <>
##$SREGLST= <1H.CDCl3>
##$SSB= 0
##$STSI= 32768
##$STSR= 0
##$SW_p= 8223.68421052631
##$SYMM= 0
##$S_DEV= 0
##$TDeff= 65536
##$TDoff= 0
##$TI= <>
##$TILT= no
##$TM1= 0
##$TM2= 0
##$TOPLEV= 0
##$USERP1= <user>
##$USERP2= <user>
##$USERP3= <user>
##$USERP4= <user>
##$USERP5= <user>
##$WDW= 1
##$XDIM= 32768
##$YMAX_p= 406608781
##$YMIN_p= -709729
##$CURPLOT= <Network HP LaserJet P1505>
##$CURPRIN= <$Network HP LaserJet P1505>
##$DFORMAT= <normdp>
##$LAYOUT= <+/1D_H.xwp>
##$LFORMAT= <normlp>
##$PFORMAT= <normpl>
##$SURQMSG= 1
$$ End of Bruker specific parameters
$$ ---------------------------------
##NTUPLES= NMR SPECTRUM
##VAR_NAME=  FREQUENCY,     SPECTRUM/REAL,   SPECTRUM/IMAG
##SYMBOL=    X,             R,               I
##VAR_TYPE=  INDEPENDENT,   DEPENDENT,       DEPENDENT
##VAR_FORM=  AFFN,          ASDF,            ASDF
##VAR_DIM=   32768,         32768,           32768
##UNITS=     HZ,            ARBITRARY UNITS, ARBITRARY UNITS
##FACTOR=    0.250966925370066, 1,           1
##FIRST=     8223.43324360094, -173443,      117901
##LAST=      0,             -196320,         -50519
##MIN=       0,             -709729,         0
##MAX=       8223.43324360094, 406608781,    0
$$ Real data points
##PAGE= N=1
##DATA TABLE= (X++(R..R)), XYDATA
$$ [...]
23851 192739 -161296 -25062 193474 -168689 -61837 8018 -213694 221843 194425 115529 -72350
23839 -219527 -344868 42479 -40344 -212392 219895 437 159980 -44767 -290926 -5270 34859
23827 433757 26147 -42887 313066 -21018 -420755 99373 -362679 161699 -477938 -348634
23817 -348634 -77572 -193515 7710 -69502 -36486 -94132 19426 300110 118331 -146725 225948
23805 107684 75991 -395997 99525 -310020 -7497 -343341 136998 -196756 70575 -50937 -162750
23794 -162750 -126619 52037 122777 -200203 3294 -69784 30498 45511 62262 -272699 -354898
23783 -354898 49796 -101907 -253815 50591 -38943 -234546 54317 -39586 230268 -206862
23772 -95898 187495 32880 256470 -20586 -113577 38998 122823 67842 -41941 298521 -94919
23760 148879 -94200 149763 -174055 -180855 -162027 -194962 -189999 200355 78975 65033 -260759
23748 192138 1813 27079 -73254 -181724 209670 401472 -52938 137598 -169745 189483
23737 12315 120016 -382141 -16675 -274253 -459032 -30194 2882 -117014 150850 -229998
23726 305571 131869 -197111 -21310 136022 314806 -287529 -316530 -186615 350759 25884
23715 -147267 -168479 268881 -217651 128419 34709 401346 -37226 -59256 120812 172109
23705 172109 388261 -141917 -273268 -124652 -188606 125536 17685 235195 163392 188635
23695 188635 11977 57907 159718 179874 156766 237751 47372 -264968 194636 -57336 -149760
23684 -149760 21083 -317923 -218124 270914 -99525 -27985 -60645 -164084 121813 -10250 -9358
23673 -9358 -140953 135581 219959 275985 312775 185118 165096 -167589 -41862 48706 137603
23662 137603 -241434 -49974 -132047 35160 -41602 115244 -235808 81757 -123510 -230963
23652 -230963 43388 -154165 -17957 36951 62855 -200796 217535 -339530 -166850 -15217
23641 -221547 29792 93496 -146959 66087 17997 -166849 78600 157042 273787 -194777 -175780
23630 -175780 283819 137963 352010 63357 94995 -268530 115167 225874 -14919 -78925
23620 -78925 148726 17796 189435 228635 -130867 -30771 -358812 102494 51952 -241992
23609 -246363 -474708 193201 -141931 -264834 134420 -52187 214593 -81179 88674 53969
23599 53969 -56349 244213 -7262 179659 -26174 -94051 -222571 143666 -60590 -469048 77743
23587 -84927 490466 43230 -380688 76013 110143 278928 -47729 -367053 45360 96660 70766
23576 70766 97265 91059 16067 -96857 -115692 1803 23049 168056 -445390 92786 -228328
23564 -17290 244230 49227 195094 -5344 -45527 -155835 -240097 14578 174696 165656 249353
23553 249353 112283 25361 -280001 276848 -153914 -130326 -180381 -47047 140410 -145036
23542 -134211 -325426 -162349 -267409 118906 -323308 342687 49489 -10707 -36009 -265931
23532 -265931 -100330 100888 49912 -12593 125145 306014 -135308 -269316 393255 -11136
23521 141618 -190753 -174617 -228303 -59068 50742 -231636 -91746 84713 -100929 -275730 -91400
23509 209184 78008 -51397 7522 -34887 20413 247029 61455 223068 54122 128855 5766
23497 -71184 76625 93364 -51629 131668 -334789 -185003 85441 38678 -18343 -145821 74619
23485 -295207 7400 -176325 -137716 -30200 118093 -26568 337547 -121590 343035 148479
23474 -375679 -103467 -78168 -332533 -6031 -172106 196235 101231 -173359 -175495 43698 208038
23463 208038 -5780 13932 -267367 151975 34546 131752 162172 170268 53834 138026 -260573
23451 -138327 -80726 -415159 -27273 -100916 -42711 -555722 -330975 92543 81718 484021 120332
23439 -15966 -158827 -27142 -42279 -258694 214381 -170061 -106942 -159759 38285 -2319 94132
23427 -70708 111451 191469 -212850 1090 -152142 95992 137008 -250758 234852 -288780 -147075
23416 -147075 -158599 -126684 -161428 25184 -123569 -227237 206121 81241 -72590 -168910 -132568
23405 -132568 -23987 134318 -178337 -238300 215055 432316 129267 -149052 395774 -182158
23394 104676 -2539 -77952 48821 -52883 -187914 -119783 -90454 75716 -256657 112865 -79965
23382 164784 83899 -117613 -307542 -203742 45890 -235297 94459 -54212 -189032 4520 -365825
23370 371430 129931 -42847 9602 -178667 222285 -176447 631368 -158155 105466 -104368
23359 48903 181977 -97455 -58158 59904 164823 92483 -137002 -205763 -60962 345437 -107401
23347 217043 211064 388477 25828 65885 -230621 75834 109764 -415852 107538 -229288 -166280
23336 -166280 252170 132473 -106054 152372 260937 -4223 -293918 293 40473 -120132 -111452
23325 -111452 69216 -133034 198041 73322 -65320 7316 116568 -65655 259301 9354 210160
23314 210160 -42486 -18471 -132848 -43877 -251519 162234 -83337 -89083 92032 -194177 -20888
23302 -68849 34259 -25634 -95982 -125291 20904 -77075 -133211 14933 236652 306206 -33663
23290 -266952 -30907 -384692 235941 -224677 118263 -141301 113376 2423 -237267 -256673
23280 -256673 239626 -7069 -274561 -19769 -103751 244657 136453 12197 -127896 184273
23269 -160887 -5772 288966 -153467 5986 70573 21090 20548 209795 -47805 81995 -39372 -138629
23257 -138629 46258 -318761 47406 -329384 -86592 285955 40281 -170451 305287 -335705
23246 -11493 170196 -342386 -232295 -199135 -192040 18162 -17512 226116 -225691 142237 -204315
23234 -46157 80391 -45670 144234 97319 -76849 547391 174774 -47282 -285583 -98827 224470
23222 -525310 -20188 104667 179859 -41612 -89651 -75765 23755 -274723 -45581 -210417 -109832
23211 -109832 35167 -148777 -102860 4157 -292748 -148562 -9276 22948 -189213 -73548 13022
23199 -71563 -214749 225280 -161397 234376 457776 92816 -367773 -75446 168183 137836
23189 137836 65379 7106 66411 -384557 -2321 43521 146148 167995 206641 108795 -106360
23177 -75472 54812 -144654 -55667 -136739 155286 -433527 105164 147540 114565 159956 -43138
23165 140389 -143817 -2495 -13958 -93236 -118286 -204093 -145974 -272789 -185878 282067 10204
23153 -269975 198977 -192235 127853 -118909 2040 -248906 -385554 -110544 38156 -165942
23142 -129788 126726 490401 -8721 -105616 -272807 50200 92066 -409986 324482 -5798 -33956
23131 -33956 199855 51784 65326 19315 222375 -162924 -98990 -315753 397786 92356 71800
23120 71800 35679 26439 70640 -239703 -21989 -31182 -7042 -71312 218630 -53156 -98305 5404
23107 -292815 -176824 260378 -45196 33966 1565 -243482 -10680 -28851 48887 295281 70170
23095 144465 -178233 -44742 25319 69069 -317078 -276973 -21207 -73063 470918 -19300 71112
23083 248161 40313 197396 -121478 131514 39419 144675 -91788 -110797 147315 -112959
23072 148027 -20622 246290 -159921 -94248 -270932 62505 -95849 -198823 -87155 -205220
23062 -205220 -272083 -119447 158056 -598141 -219249 8256 -36774 93252 -150465 -260574
23052 -260574 -245773 -247253 -281540 -105573 -240781 -223798 -147362 -40312 126103 -211878 -127744
23041 -127744 325735 78710 47462 -71132 27276 191126 245721 48685 -236135 -128663 -108548
23030 -108548 66135 -98695 15883 -27764 80839 -256938 278238 -156912 -15839 -234954 -114273
23018 286166 287840 242427 -140196 -161408 143378 -37304 -92018 356960 189711 -35190 325894
23006 288807 -105117 153807 -92373 -169671 67738 -28269 -139414 53796 -188000 -182148 7030
22994 105690 -256546 76448 320090 216249 312559 82986 -213269 -188473 51787 122391 225424
22983 225424 -400529 145340 -142267 95784 131594 87465 -391520 -136711 -15885 117399
22972 -40537 276960 150490 -29168 -85519 -103971 70559 -61719 -330935 -61211 -311843 72928
22960 -248915 117198 -424749 -77288 -167819 255943 14183 -58629 -164750 194412 324812
22950 324812 -23064 -36314 -205748 24929 -199039 117881 -260800 242862 110526 -376482
22939 250489 -250079 30710 -60474 245715 136290 192667 -12734 74368 -99796 -91661 229839
22927 71555 -33684 -63194 128192 247263 -336166 -112362 -146494 42691 -24047 75217 -66585
22915 76538 8769 -18416 153276 119323 60069 117789 181802 -63912 -45991 -86004 171508
22903 -92790 -187539 318991 305542 -284859 102007 111865 -94672 4166 -155607 75191 -68748
22891 88900 163663 46190 -373547 -19651 139419 194468 371044 -379254 -274468 39540 70342
22880 70342 -21976 -86882 31578 -62932 -289809 391721 -432469 42648 -77949 -59044 122128
22868 199295 30363 69610 238574 -6421 73369 -10305 -46679 -121510 -39884 123149 -95271
22856 10830 -43646 -59633 -86873 -119599 -69258 353704 -77285 -34390 13848 -107400 -423242
22845 -423242 265640 64830 -152280 -148392 78590 -103991 71286 203008 142206 -576664 -59876
22833 -180184 -83710 -63003 269772 -189315 9164 -178064 -136585 -197584 -154633 -147694 -141785
22822 -141785 214777 -253872 -10694 148293 -144451 -111954 158595 -7899 -347187 -108081
22811 82437 -184911 276037 157858 -148098 35023 90140 -22458 262917 -11485 -120553
22801 -120553 -68362 -22352 58762 88610 -487832 27185 -320963 -221442 -84559 44409 63655
22790 63655 -295462 -221847 76361 191882 -32328 204581 -211143 -69287 54221 181286 -159966
22778 -125717 73138 271780 -413427 -73849 -151138 -171334 -197132 -74429 -50345 -68197 19911
22766 -104216 12955 110493 202091 305073 -203249 -141028 -47162 -134015 224443 61235 34546
22755 34546 95115 85804 46237 368615 25487 231184 -86310 249109 -180072 191001 23602
22743 -377754 -173061 126259 -294471 128992 -19481 -280523 -341614 72188 146765 69694
22732 104814 -370056 65167 -4384 135034 243794 195904 -41568 36286 117743 -170990 26531
22720 7008 204953 30833 -67030 35756 -79127 175309 -173790 259422 -106683 244725 -394778
22708 186002 -206679 -235113 -129741 38095 264792 20044 -358337 -275808 -274306 54451 -80670
22696 -276468 192424 -4928 18430 -167277 -17336 -207127 -31344 154693 -135532 -112667 92794
22684 139964 43187 -241207 -200259 -182839 -43136 -113131 -99741 -21360 53946 259136 176977
22673 176977 -33885 43278 39687 225069 -16801 284281 -23606 -8687 61292 -139334 -27400
22661 -88559 43203 -118306 9070 343896 -286888 -145753 -206562 -12119 -326638 2264 115464
22650 115464 -333744 167206 -309189 -121481 -178011 75268 36136 -30431 -242833 -253407
22640 -253407 273644 101983 59273 -124571 203092 -133640 -111470 -43506 569674 135391
22629 -129624 -330718 -181795 152422 -163833 -46211 62213 -115156 -190085 81199 177148
22619 177148 -116582 175999 -191970 265999 -134547 -189730 145350 -188706 -157600 -327702
22609 -327702 138032 -118926 -338930 -320050 -204442 108958 136092 -92319 -168296 85598
22598 320270 96193 139526 -190828 -176631 21872 126533 107492 45290 -34133 144057 56730
22586 -81736 107142 52398 -38892 46222 15950 -96400 61976 -376201 185100 40488 -41450
22574 391294 -302860 81162 71182 84035 3383 -171773 6830 -163393 -200983 -219495 -220431 151461
22561 -64789 -96749 -162505 93589 52232 72509 -56983 -92873 84506 -9501 140840 -142931
22549 -192944 99367 -338227 -257499 73167 67302 -310406 -111893 -48990 55139 115595 -342095
22537 127648 -42111 -360409 -45748 155173 70962 199273 -141971 -118552 -55396 33784 -312850
22525 74361 83365 159890 7208 -446484 59676 -109153 -166064 -186657 54055 93437 174361 -204739
22512 53191 -301896 -213396 -412789 -146866 -107330 -100852 -74458 -379235 201884 23209 12816
22501 12816 154345 16788 -602268 -4230 48591 60875 -38805 -55410 275176 -53315 313283
22489 253499 -246629 186409 52157 242904 22421 243867 71175 -81419 119203 -245985
22478 21316 135765 -130559 117864 16744 157405 -257372 94014 28238 -73366 118815
22467 164411 -31009 -413287 -108430 172737 -148450 -78753 123972 -205067 199234 10522
22456 23627 100156 -90334 17061 196312 230275 -244376 -68478 31500 -165612 21738 -168681
22444 69909 71160 -74760 -323444 113590 211734 -338755 -89762 -166511 -119673 81372 154413
22433 154413 56072 -180367 -43587 192313 -202283 -118177 -183153 -187185 -309539 -201804 -252683
22422 -252683 -60502 306110 -59269 -223053 83811 -99480 -164163 81027 -181396 -267908 -207171
22411 -207171 25080 119167 14335 329355 67609 127800 192086 -111669 -195950 -15660 -81951
22400 -81951 -100173 -288049 -337887 -93217 156930 -65184 -29965 83792 -170530 107165 -86002
22388 -82994 -20900 -102462 57814 -202013 -50895 41778 45627 -2531 -47577 -92801 136545 -280133
22375 111968 -29568 -77322 -70097 -293547 -293626 327421 -131416 -36378 -136290 -106045 -93338 -257791
22363 -257791 18864 256859 -56127 96448 -153150 -138963 192757 -246211 -92112 -135716 -176827
22352 -176827 -428111 -255014 -48171 -170712 -95000 331318 223368 -138775 -97058 -126034
22342 -126034 -108953 43425 -307954 -99107 -187838 -38221 -163041 -102616 268769 -498277 -117152
22330 -479388 68071 93322 283821 -164133 179823 -280991 123583 -13385 -104730 -42672
22319 -170333 -199939 -86762 427532 -249565 101898 -263142 -179445 -49104 -60088 326345
22308 -78801 55069 -46851 -158952 26835 -56682 15191 -47962 -212027 -11619 -237297 -74571
22296 57930 184163 3406 -43779 -261183 -225737 144126 -14196 -266344 -18450 62972 -90543
22284 37298 -520958 -145876 137318 240056 14068 8367 68661 205707 -356251 -83379 -199674
22273 -199674 -71234 -106860 74156 -215819 307709 52369 142994 49798 -241549 -223216 152392
22261 16421 46909 136225 204315 -40577 -28003 -52704 219941 101530 101065 -269177 -68491
22249 4042 195758 -184827 -141664 343216 18577 71554 38757 170840 212324 50019 -23962
22237 -283302 131417 71513 -104913 -29567 -515105 153972 204016 -33338 -475402 197447
22226 22673 -261005 -148366 -150711 174660 -66224 -145639 -282312 -94687 179556 -255831 -25373
22214 75751 -95642 324255 -160831 -195406 -43304 -41705 -110486 -122425 11388 -114607 -64517
22203 -64517 147854 260733 328676 -24655 -169169 39616 -241561 15075 -8117 -25496 -190337
22192 -190337 101519 -103350 221373 -116575 -22505 -331761 31685 149064 -290285 -75916
22181 110064 -422067 -221007 -306558 28362 145627 18153 38198 -101966 -217347 -163069
22171 -163069 -43344 -207338 -225208 -232846 -191504 -195796 -260198 60251 -40508 -248973 -155508
22160 -155508 -37338 -147844 -209156 -58612 75229 -87784 139255 -61691 97277 -39828 -327142
22149 -327142 -184472 -112274 -183341 -96104 173132 126796 -179547 -14510 49675 129694 142171
22138 142171 117905 13826 135747 -178182 103301 -106030 -242618 192292 -90933 -76925
22128 -76925 129340 -326991 -177495 -91479 -47328 -27100 -126696 -367605 -2033 91169 -416038
22116 -17727 203099 -5528 -383428 233923 172195 32159 262624 35795 206944 113562 21522
22104 -31485 -165207 -99654 -18714 -81320 -28999 -90100 207167 -175882 263212 -5812 -526272
22093 -526272 -65639 203550 -218531 112412 -100297 -89710 -52366 -397223 368938 199887
22083 199887 47395 -330932 413843 -169252 -105978 130773 77270 -82770 -232543 -185660
22073 -185660 103605 16536 285520 148305 199311 -101856 101662 -72039 76188 205902
22063 205902 326930 -175897 202776 -47348 -91583 191012 -56170 81647 -70659 -121632 145241
22051 -152981 -95883 106212 -28210 -90427 -127143 -278362 63669 -131014 224938 76457 153179
22040 153179 -197163 -83597 -121940 173257 -153467 -254440 176262 58720 -459659 -161458
22029 -112445 49982 -140819 -43216 -179727 9129 -115997 210581 -153248 235003 129888
22019 129888 164471 -238328 148082 -313133 37022 -75989 -65344 -151130 -210520 212162 207216
22008 207216 -246033 -281186 61201 -298320 -46534 -269993 55568 -170938 36122 -33274 -94837
21997 -94837 239417 -209353 297855 -72806 17266 344878 -204255 217352 40305 74468
21987 74468 192994 -346373 98409 -94241 -98107 210011 -82024 -195626 -369411 114944 32707
21975 -221033 -225884 -235998 106204 189267 6094 128423 -30842 32449 -4346 9208 -78781 18566
21962 58758 -65438 101413 68960 -40579 -158296 -73693 -233992 -277805 72284 -389870 34892
21950 279886 -118781 -194669 -316071 -8605 -158391 44577 -12617 20425 100032 3320 -80380
21938 118333 -47906 48855 -123474 -282337 81177 -203320 -198350 329081 -208499 -59606 -32100
21927 -32100 9483 129330 32723 -113879 -131069 207955 23151 -49000 -50761 12718 -211008
21915 340225 -279875 131298 117972 -130577 -170298 -523484 -169660 122547 126272 -247099
21904 -186043 342726 -323164 -430242 -263806 -32011 232467 -192421 167894 -79283 2138
21893 -193979 -329066 85014 5440 -82236 318758 184249 -133976 -109480 -104160 156931 297539
21882 297539 133730 236762 32555 -87760 -417671 95511 -539541 136217 -108523 -68352
21872 -68352 85891 -31441 124341 -47059 -271803 -230468 64432 -173376 -246873 275108 -115335
21860 74211 -67447 69174 -184383 -9195 -153229 97119 -273292 -227937 268397 -105857 44808
21848 -10745 -230399 9206 -187257 -418751 -69564 -257228 49674 -418809 25804 -153364 -8000
21836 26366 199965 312561 174043 11084 156060 156104 -452329 -159246 -99884 450144 63182
21824 -17092 21975 -120363 35809 27135 25550 -73302 -380308 -132173 109958 -181332 -245592
21813 -245592 -57443 179728 -214943 171325 162826 -77920 -99842 -137612 171923 -164478 -212824
21802 -212824 -407148 51732 -100583 -59997 -215037 241550 -109364 216369 -12725 -214781
21792 -214781 123384 135103 128899 -374829 -6807 -226053 4177 74185 312982 25494 -225057
21780 347716 20538 -250447 69035 174664 44748 109310 155966 -103645 -222099 69571 84738
21769 84738 -115820 90346 -330759 -3354 11797 -228609 -60373 -58466 -174219 169055 -35381
21757 24099 -230741 -65028 -390421 -211129 -68875 129186 -419602 -109655 -167482 185146
21746 220085 61070 152831 222678 115451 -17444 -115995 24562 -31801 -211684 -107462 -35936
21734 -260227 104692 -12555 193492 -203229 -316288 -103450 -80192 -113407 83834 53850
21724 53850 76486 31332 60542 -78806 19514 -191781 -155384 223092 -277725 -181714 -291002
21713 -291002 8212 -127407 72213 -42731 -24791 121969 -122481 42777 442314 -359256 139127
21701 -71380 -101167 -251072 9781 -33548 -88633 -14260 -33929 -105402 301282 -84832 24974
21689 -20978 32484 40386 181473 -179804 -51020 -287123 -59166 -428645 -278817 -116843 49895
21677 266136 108033 -157149 81089 209780 -17221 29681 -454176 -66912 -176786 26946
21666 -103356 -78466 -153183 -227076 -42842 -73032 -51460 43733 157465 222507 -51741 -9748
21654 -65767 124704 -106154 -98332 68241 -745 160837 -5747 38946 -4192 -326404 -160329 13346
21641 12258 99637 -21343 11778 12731 -158786 54716 -5814 -66312 -151137 -1995 170227 -149535
21628 189865 106299 -190664 -419594 122920 -340899 -19329 -117581 -100475 -164099 -152034 -151018
21617 -151018 4680 -96487 -94665 49131 6973 119891 -244551 -26649 126887 185631 -21340
21605 242599 -123568 -217050 131831 -223535 -91818 -271757 -29828 -80479 -31625 -2035 75401
21593 -210827 -175573 -167257 210471 -144233 -84038 28677 -195953 -123488 220394 -49364 -61783
21582 -61783 -200114 -7631 336354 -13270 -259413 -323561 -307416 -282452 -72375 198243 40931
21570 411117 -120712 167329 -253458 85848 -77811 4147 -119133 147829 -136245 137680
21559 -59050 -278373 -34530 240601 -11897 10840 18194 17179 158747 31519 -140849 -213272
21548 -213272 103259 125294 -47979 -25387 -328941 -197545 -45633 37618 -196545 -275063 70600
21536 -261418 -99402 69656 -74916 -88741 103668 -88420 -21478 -23676 -319336 -315795 -31448
21524 -117352 -51478 50248 -213755 240069 -237140 -296987 177349 -20035 96637 -135928
21513 20072 413707 -60314 248559 -229235 161610 -106975 9653 46199 244607 117188
21502 -53604 -214387 -110686 -263084 94329 -160684 232701 192467 66585 3058 115871 -56668
21490 -271881 31218 215385 65061 -380035 -151879 -87749 133835 -170644 97738 145825
21480 145825 -24177 -189498 -130740 -337777 -132358 -227817 184143 33431 132949 147643 25972
21468 -314923 -276342 -213608 -211170 69859 -106040 -135958 73638 -17744 -117408 20777 -214400
21456 -20988 -383421 132442 -18501 50718 -79391 -277041 55326 -31367 96213 -23348 -85432
21445 -85432 -92294 132307 125232 116316 -85467 12099 95673 7977 127661 509260 299557 353622
21433 353622 80756 42720 220023 136699 71616 -60730 -62334 -251209 -116281 -841 -90500
21422 -90500 -388504 -358337 -399795 -264099 66816 -35581 -3158 151848 -89102 98274 50330
21411 50330 123021 -88071 179979 62644 -39571 233526 -70312 -175611 -51029 -209216 207186
21399 -112726 -106989 131553 7005 90217 -143955 -112463 -24664 58082 23774 33185 63890 -365829
21386 52064 -96904 173963 213371 -81173 72863 158362 98624 18942 -292827 -141512 32602
21374 -261198 118877 -173365 -20677 -299743 -153513 -67992 -190970 2499 -84804 -150762 -29398
21362 -125552 57598 -158740 -190143 -88137 -120282 107242 193023 -248370 -150530 -251285 102021
21350 -205202 177908 53325 222371 234314 -185454 211807 47246 87407 128149 -71901 282889
21338 157030 -111786 -130891 -88676 -58987 344838 -122569 240043 52849 -235964 -250045
21328 -250045 93140 -542931 -389141 -135371 68686 69104 -149441 -40455 -135719 -51026 77703
21316 -45713 26210 -424722 196367 242687 198978 -199391 -370189 -128353 66979 -120005
21305 -291762 398375 450416 32389 115194 -82645 -80027 -33792 -102997 122577 -282594 -234243
21294 -234243 -400044 -139237 -73464 -138644 426352 -131964 -183040 -34168 53911 -525546
21283 -65777 28539 -119600 89169 -81401 105169 95226 -272620 85393 -160544 23573 137155
21272 137155 -79766 53167 -357977 -82788 -55352 161114 -61308 34467 146313 151674 -208549
21260 121396 96144 2491 -85921 -58207 -194859 162920 -269958 -88157 -9575 -310015 -227319
21249 -227319 -91777 -234413 -282397 -221544 -178453 -159477 -232809 -200110 77232 -159618 151275
21237 116849 -166832 -203010 -92123 -337921 234325 8539 -65233 -56032 127957 166193 -28819
21225 66252 -62484 -297100 -87906 110322 48157 -76809 130549 228412 -64256 -514660 119459
21213 -182415 -319213 -39170 -126656 -60468 -6258 155922 -84082 34366 -214009 174494 32334
21201 60284 -138794 31292 -201218 254755 -22903 -140019 -107296 -101134 -145642 201669 -317883
21189 10156 156587 -286732 -158834 172276 -439626 -131638 -287415 135931 -59818 11951
21178 -463622 -57620 -260668 28921 21497 76366 -116972 -38138 145988 -250235 -209675 18001
21166 195970 237917 166999 3279 -161023 249480 -140236 -104680 154852 5314 -51700 -57496
21155 -57496 -187973 196282 115218 203919 -13046 32900 -20110 -297420 -248811 -200392 -151777
21144 -151777 24365 104301 -178466 -8916 -305280 -67318 -177499 -13640 -19187 -149936 -12246
21132 -88682 -478426 -124572 -295375 41740 166270 -21425 -210171 -11901 -24651 -132840
21122 -132840 230093 12805 42365 48484 53417 -12398 -40715 -14291 197098 -183538 37378
21110 39134 -177299 -161210 -124993 -240916 101173 -13353 -451698 -27153 -116018 120004 -348730
21098 146818 291545 247869 93113 192727 -295596 134328 -61329 253072 105658 -337391
21087 189475 -112456 -252249 119366 -90147 83853 -96866 -239936 114297 158002 -32968
21076 114614 -103616 91947 -245051 224476 -262094 -190849 41406 -192163 -605333 163284
21065 195265 -29964 -59453 -129331 155404 -22614 467234 -177832 -126373 -22776 -146468 -210875
21054 -210875 230319 -10718 -27852 -234713 -58178 86430 -16063 -373585 -30743 203866 97078
21042 22159 72482 -196145 -166421 -116861 -38175 49468 148140 -122028 -161577 -115853 -228186
21031 -228186 -24911 -23497 -35146 -429073 115373 -120099 13717 -65269 -325167 -185577 -32270
21019 -194202 -70574 177016 -73821 -217654 -78161 110372 -159988 112906 -195257 198528
21008 -140637 -216204 26132 -140187 -230054 -209287 211486 398351 -16166 366490 -424615
20997 -15631 -200745 111965 134984 -138062 -57146 -67180 118816 16249 -347921 254802
20986 -368609 -289121 -367666 275470 -293836 -356726 300706 -117674 -147821 28752 -193130
20975 36553 -7611 -209889 -234665 -4123 -233132 58381 -128313 -226897 -278444 38809 -272851
20963 -51548 -306648 -221345 307112 11315 -232387 -258998 -200273 -336974 15019 92453 -9955
20951 251853 16358 -159694 -167052 3413 106829 1464 120263 69168 -75160 -217204 81009
20939 129959 -383446 154249 76922 -34638 -51712 65727 209881 -7583 -7361 -157783 -13005
20927 270925 106552 -211727 42954 -9250 -114470 201674 -202080 -152723 297302 -52777
20916 28449 58125 -50158 -221557 -40437 -110978 116106 -154152 89615 49398 -57841 250173
20904 -181671 -283863 -72212 -43456 202209 -257328 -62285 -26680 -145359 -227476 50227 -199622
20892 -45429 -13255 14552 105686 -184246 -144487 270575 326059 -57445 344425 -123889 -152283
20881 -152283 -182556 -117311 -100394 80223 42419 362452 76707 -42370 10641 -242803 89478
20869 78762 15500 -78351 150169 46822 -135785 -106972 19283 -7053 -114735 202825 -186301
20857 -292504 -149110 -247512 -35213 -65976 135090 160066 -117289 -28363 -239999 -24555 261060
20845 -192320 72700 294096 -71111 16858 -35979 14186 -181186 -144238 -111227 57326 136191
20834 136191 -69040 101423 114438 -212655 138857 -101769 68347 -54124 44212 -56698 -204940
20823 -204940 -75898 90656 245307 108529 108920 303090 -138760 -274336 -118114 -226611
20813 -226611 -110005 -117145 6856 229025 -142734 -327992 -129687 -266569 240889 -57056
20802 -365 -125284 -19925 216395 -7591 115997 -67449 148949 16610 -576050 -26563 106225
20790 136587 -30116 54630 -131575 -326580 -264755 -196343 -140530 -48417 -175394 -317264 -114281
20778 158323 -23300 -286628 -40887 180989 261939 -62824 -105413 -7843 -202776 -112011 53696
20766 42094 -124029 -61641 102035 -44016 42117 135222 118859 55657 4987 -123931 -440304
20755 -440304 95630 -138139 196067 144302 134740 169595 107154 -216014 -176641 41720 -45411
20743 -155680 -39242 134465 -80885 124400 -142978 -59415 -96850 -13732 309834 43588 -155520
20731 440068 -91591 -202625 -572548 -80137 -102444 168937 -226107 -576234 274610 -98417
20720 -379328 -35194 74097 -89062 141222 145941 113421 -28933 -141946 -203837 -223531 -52956
20708 252033 -40071 -69590 213954 -106578 32277 4191 78611 310078 -53813 -81240 -33913
20696 60576 -50282 -114910 -55112 -9176 -90619 -259536 116767 -54325 -130 -278820 -345505 34335
20683 -41168 -365571 -179554 5886 -27893 -63722 24618 -126244 -334317 -80061 -37015 294857
20671 103161 219926 -101836 -71833 -208305 -208494 -15427 102024 -107213 262032 -223957
20660 185831 -264884 56409 -165678 72915 -18508 -81691 369449 -170237 -9346 -4759 -59952
20649 -59952 99808 -129245 -60533 161807 119743 193397 50563 -187544 88137 -169942 17212
20637 -321993 -156419 -106355 60454 40587 54194 136767 -365174 196149 168710 186919 -352844
20625 -182208 -93806 24163 84294 -261232 62225 47951 -40094 237534 -72638 -215162 75574
20613 -19029 -202473 -185146 -104729 291547 -23063 288004 301367 384227 311112 27264 -180379
20601 -180477 -96925 -100960 36480 -53819 -312563 16642 -84435 -164109 -313540 -191500 -111390
20590 -111390 -54642 17298 -3300 -48707 34899 214281 242633 29470 223771 -235860 -20984
20578 -111966 -161303 84325 -131524 -189098 -111763 -140897 -273881 68736 64517 -3947 -390916
20567 -390916 111936 -169938 188567 219671 151177 79598 14719 -115555 -256490 323629
20556 -414690 -208327 -67198 -234749 34869 -255242 -43157 77182 -123646 -194148 -45450 -5251
20544 -53924 99548 -159331 130686 145850 -324472 -116665 -101650 -68747 -114953 -5257 -367847
20533 -367847 66875 -206429 139944 209568 165990 -103352 12427 -101314 240008 -1991 -146182
20522 -146182 -175540 -198773 -220007 -236340 290189 -183730 -10328 -92769 15754 -246366 -205494
20511 -205494 -287035 -251833 -11536 10480 -232485 -204612 -116027 -165388 143464 -39494 -116152
20500 -116152 -53333 -153213 49506 -30107 -185647 116095 -184741 114571 110964 -88173 -165833
20489 -165833 -268975 16638 26741 83135 -402397 54819 -334966 266566 -23902 -277376
20479 -277376 -170681 -182667 20084 -120468 32968 -122245 -34097 3206 -60045 36202 -168858
20467 50865 -12372 -187839 -33845 -111633 406764 -94311 57088 -210825 -179175 -47421 171488
20455 136946 18712 164535 -253692 -43776 353833 58243 -307861 -294543 169623 31831
20444 -155769 -45028 -424662 95330 -119421 -140394 25468 -252255 -84888 -53457 -133817 -6666
20432 197715 77141 264185 -102322 -100057 91770 136612 -193618 51943 -354338 53444 -381194
20420 185180 106477 223523 -352041 -458084 -255658 -280642 217405 -84866 -164942 -132220
20410 -132220 -264595 247390 -114396 -62779 -52782 -411736 88286 -144057 -174423 -14294 -213207
20399 -213207 -173661 240897 -192583 42929 -128780 462870 141905 -155800 66768 -324000
20388 71202 -236834 476391 -171010 -81718 -111402 239635 -217352 128461 165326 -69890
20377 301285 -149869 -19734 -54939 -111764 136147 -270316 -127884 181730 228386 -314132
20366 -202923 34573 -58980 -198394 -1170 -200565 3958 -118269 -308398 100295 -43520 77388
20354 -209338 -454239 -279227 -97586 34690 -113443 -232569 110451 -238472 251489 -129205
20343 227625 -33825 93300 262102 87699 -295365 -24330 -76409 63377 -90430 -157281 56229
20331 181516 69342 104468 -83645 22905 -202815 274162 184673 -73766 51929 226888 40578
20319 74311 -126209 -175918 9449 -245354 -141085 -73150 -74566 107992 -276839 -82319 -406120
20308 -406120 -284000 42946 48028 41833 88632 -18761 83644 -363628 -27950 -34038 -81616 -180967
20296 -180967 115262 -267194 115292 -76284 50691 -150995 -83641 184737 -112624 -308498
20286 -308498 175995 -416578 -279868 146903 50606 317818 44811 108049 -158216 156181
20275 -336725 -266028 -2009 -104132 -104302 45223 -383908 -116459 -261574 -45090 -103296 118862
20263 94532 25567 22173 -227088 -237988 -99975 171117 -169535 -121988 -243827 -85361 46265
20251 -190644 17640 -230077 30712 -530658 -61590 -244522 197668 -422563 92624 -132910
20240 -261483 11099 -382132 84221 -171466 -85120 241848 95497 -63490 -189660 16726 -24445
20228 107627 -48424 -134624 -95207 -30497 231196 -64712 237272 -7959 -185796 -76221 199997
20216 -224540 231133 -110937 53403 107100 -103691 -20638 -314772 -391877 73802 -60326 17133
20204 -457277 -63905 197395 132945 -101963 206461 -139588 145071 -68809 -110335 -256019
20194 -256019 -22726 147574 -163565 46286 -193746 -62700 -294011 -136680 -115355 22002
20183 304367 57500 -206778 -22441 160945 -74019 80276 16025 -58541 283873 -2070 -408418
20172 -408418 -139124 105181 370668 -214889 -45079 -207692 9529 -8902 -185246 61278 156660
20161 156660 151232 14017 117475 -98695 -217204 -27248 32701 -67782 -154376 -1428 -159016
20150 -159016 51849 -100730 100187 19802 -254011 -11955 112820 154411 -133309 21557
20139 131259 135527 369618 -98410 47177 63076 110388 -40310 113652 -56796 -118711 163195
20127 -124016 -222118 -28924 -4050 -48067 -29508 -322498 -254853 -36386 -197351 -10516 -113283
20116 -113283 -122549 -69100 -430852 -221615 100981 -323283 -151975 -51912 -131389 26231 -134992
20104 -476132 -88333 -219368 207631 -123910 -122707 -83469 85895 5823 -161103 -150167 -241711
20093 -241711 -97940 -373112 -63277 141032 85221 -52279 58508 -217437 -111960 237740
20082 -223978 -189119 211072 143073 48483 109228 -21804 -149261 66401 261181 186986 -141390
20070 94416 -73745 105480 -336011 -158765 -73234 112219 -582276 -396933 250139 28253
20059 1996 -295791 -551360 -31792 -282290 41410 -148524 -54616 10392 -172929 -168196 -168123 201937
20046 89240 -136434 -242155 -185332 -529513 -20319 -22136 -51456 -93678 104057 27676 28129
20035 28129 75256 -368825 -42844 -319196 31841 -9612 -23749 -6614 -126501 -229900 -191473
20024 -191473 -397706 -36628 -204322 252275 -56829 225221 -110267 -55644 143898 27382
20013 102682 -9386 -69459 72382 308200 -213921 -177344 100045 -44212 14915 132085 224952
20002 224952 81362 286162 86536 167221 106924 -314772 -87022 -137633 39385 41011 -125198
19990 141688 80243 -15102 36548 -110231 197901 119042 100180 -174204 -195313 87961 -216341
19978 -92204 -1868 91392 138199 -266092 -157440 -239521 119087 291912 -358791 89425 -102685
19966 54782 40051 -34660 -433028 259132 -68687 -142742 -20090 -80905 4384 280806 -224254
19954 -69056 -239097 37548 -180850 -172106 176384 -25305 -185416 50349 -394699 90385 -56038
19942 -300133 199827 -238017 41466 -87103 -31119 -4232 -34391 -187475 269088 -370872 -214166
19931 -214166 280843 214550 -460799 -204044 -71105 -80158 -102635 -258193 -149525 2540 42574
19920 42574 -215088 211102 -116626 -184673 -93308 -78932 -709729 -181220 -86074 -92901 110175
19908 -60032 -2120 -122743 -209357 76081 -361968 227792 90528 214609 -200925 267036 -68030
19896 -298908 -65756 -63229 -50655 -58068 -4670 124788 324349 -23435 -172044 -28644 42786
19884 2489 -460009 12477 32402 12357 4999 26387 -376904 -53168 252281 -166879 -354730
19873 -354730 -326228 220620 -5539 -12169 -111139 112676 -212003 77322 12923 -367784 174747
19861 88994 -448402 -38723 -389745 113795 -331491 -254949 -83064 -63235 -48404 114833 295669
19850 295669 -42424 286580 -522327 118489 -149073 27227 -357767 153484 -276385 -107380
19839 -279064 -159958 181049 -76056 106192 -53581 -252064 -279445 -213522 -96660 -79484 -66723
19828 -66723 -122124 -54120 -13903 391922 96045 204979 204683 -31496 -72450 -185356 -67890
19816 279110 -29715 -54118 -57477 -298089 72233 211 69105 -40839 -40275 -364558 -321764 -370297
19804 -370297 -47795 -290438 38583 51220 96062 -240808 -34073 10469 28488 29342 281027
19793 281027 -316600 -164651 417875 153482 -219283 157664 170960 30014 155588 213356
19783 213356 -246746 -108128 -146050 -243250 152129 144696 103519 149755 -78148 121138 129360
19772 129360 -9779 48703 -248461 -15917 -376631 -298094 -223981 -86583 90265 -30864 107659
19760 47254 -361932 -209236 204084 -185263 94338 -26241 261070 24207 39274 74256 -384866
19748 -265045 160128 -70631 -12214 -212777 193126 -55970 -316232 -75696 70236 33634 -236393
19736 293674 89784 90041 181879 -81452 -94940 -65743 107812 -87517 -55935 -156879 -6674 -143258
19724 -143258 129718 32640 110296 254641 143492 -175599 -63078 -96303 -238876 -176856
19714 -176856 -142516 218866 -93352 -312826 -34711 -105007 119466 -68756 -186228 14372 24953
19703 24953 51303 -310382 21481 -238291 -293264 103258 60973 -279240 -191015 17911 -410205
19691 -40267 207604 -201176 44539 -302672 -163223 -158728 94095 51090 -165239 -60035 63646
19679 134580 -60232 -118729 55889 67741 -233838 -97470 2722 -446349 48667 68331 -132126
19667 -108338 -376932 -201251 -37358 -33843 3327 171993 -200273 -79166 -290751 315042 -36736
19655 242698 86670 -138287 -56901 -256515 -106365 -55617 217469 -1689 -60245 -185341 -138399
19644 -138399 -140905 -119935 144571 94889 -196778 -170634 82066 -160113 75661 -175558 -252469
19633 -252469 62719 16196 29395 -52074 -312481 33762 -173051 -18850 -139128 62870 -85462
19621 -209405 -79637 -162607 -160506 -435490 -60468 -16739 -271179 257398 389297 -2911 -143794
19610 -143794 -337759 270070 68724 -10021 -1292 146976 -563114 -22397 -320470 -310682 159336
19598 -222521 -78923 -518198 -272641 45795 137414 122993 -195818 -52426 -58594 226924 -165263
19586 -46683 -63458 -353533 140915 -115208 23471 -57038 -244408 -266225 53912 111477 116605
19575 116605 -9299 43927 202753 64769 21689 -78309 -140385 66350 23006 85969 76952 123431
19563 123431 177338 189880 297209 -132473 -2740 -19297 86714 -46789 -378607 162725 -68556
19551 -271399 -152120 -52137 -125987 -113920 -90256 -32552 13843 121430 -237015 -44401 -247495
19540 -247495 -120354 -5301 -240194 -249722 148803 -183876 157944 -23602 -75543 -37759 -189336
19529 -189336 90750 -121413 2718 -171067 292072 -129869 -505021 130459 -205472 -91622
19518 284435 293034 -175525 -46442 -3908 180833 -24457 46249 -138437 -171572 16629 150467
19507 150467 138476 -404298 118482 -179506 -296055 -24473 105676 -1087 167222 -126722
19496 102982 -70992 -283966 -149960 30237 219844 31985 -137726 -230861 -88315 95051 117125
19485 117125 -316160 -116967 -369588 -174004 119516 115810 158407 -159951 279622 -36365
19474 -285831 -33565 -66392 133775 54267 162044 81567 92802 -301437 131199 -271973
19463 49649 52643 -19596 -167260 -14780 237450 64532 -142721 185825 146243 -124572 1427
19451 -90179 159130 -3425 113767 53442 135315 20657 116309 -37493 64003 183976 -186740
19439 -217232 -201997 277334 -215250 -180370 238961 161609 -288611 -139320 -160932 -23276
19428 110285 202138 81621 -71555 -177654 206626 -75855 -201610 -179792 -64006 71005 220986
19417 220986 -115419 343064 -110834 179680 26801 -51097 -275298 -245271 -71199 -100692
19407 -100692 -380865 326660 -166996 83509 -98735 6036 -76050 126818 9274 -184517 47619
19395 194855 -144153 -139529 -195259 -37163 -306637 91460 -144205 95572 -51005 -438663 51027
19383 -44695 -40207 -110068 3068 -349552 -143900 17773 165578 -92403 -349729 151663 -32861
19371 43590 -135749 -459966 85002 -46460 53850 -205131 79627 172003 -196152 -309832 -17104
19359 -52088 19309 -122732 -310946 -2847 241213 331234 -85246 -251077 51042 -40063 -115601
19348 -115601 -187631 72751 19942 -267357 -136329 74037 264316 -80056 -338287 70104 204956
19337 204956 -123424 -39608 104867 -102740 -183095 -274354 -161250 -23342 -89575 -55542 -251536
19326 -251536 -301948 -83200 -37527 -145974 -105610 -118960 -109716 -580094 -333833 54609 -140552
19314 71643 166494 9090 -16585 -64893 77808 19290 34495 28455 -245308 7046 -164715 -296877
19302 -296877 -175739 -160623 157860 -460045 -150260 -245872 -36493 12167 -244453 64552
19291 -200019 -86985 42391 121411 -45980 -112761 26465 -25609 85621 275336 83736 -169921
19279 -272407 -130190 43519 8715 -151802 -113195 -118867 -29512 88056 -130872 -260831 -136526
19268 -136526 -156883 11662 -236692 -250445 142395 8076 85875 174494 194334 -143028 -253235
19257 -253235 -118884 58116 380935 -23571 -138805 -133327 -18073 77758 -164673 -327438 -94130
19245 -81420 -79484 -186422 115261 53643 -107379 -77319 -92508 -54849 -296481 -333060 52076
19233 7996 -147923 -98842 -28923 -40086 -49597 155714 -89037 35245 52161 -26511 63370 -113009
19220 128790 110281 46746 -25147 -20827 142324 87719 -224804 133269 227663 -226157 6769
19208 -189467 -295135 14045 43987 -194135 -140538 -937 42832 338743 -33051 -89669 -183184
19197 -183184 107813 122322 -191662 -80569 197187 -17670 245299 -169707 115404 -304138
19186 165311 -47121 -29545 109782 65424 -51883 247401 -160244 73497 77191 -82374 -95749
19175 -95749 -37240 -50816 -88017 41416 -115163 -226193 -199861 -406091 -563526 197792 245833
19164 245833 -126781 -118544 49195 -285473 79788 -228178 -299344 -231672 -142961 -161107 -89550
19153 -89550 -123695 43283 278116 124676 153133 -250149 -41444 -148618 -155847 200683 101543
19142 101543 -280091 48723 -73311 -126750 -73064 -207976 396767 -26700 -106732 -426163 -55468
19130 13654 20864 -141553 -46448 -221033 90751 -199835 -206675 -132702 -29505 -343004 244361
19118 -114165 337090 -51064 -196446 183074 -70258 -226190 -338246 62358 181127 37907
19107 38796 -47966 -231575 282874 -28355 -46828 79814 -329374 11143 -92827 68765 -362285
19095 -210198 -12310 -66958 83489 -75757 -87788 105518 -233790 136787 54963 29112 -137178
19083 -215731 -250271 183162 -265022 -266859 483206 -129359 -14554 -153288 213824 222903 42961
19071 32947 -186005 -20992 -66205 -398325 443901 -147203 205465 -128596 -124240 13028 -59781
19059 -373085 -178606 -61186 -435885 112828 -558576 167456 -78003 -233675 -98193 -63855
19049 -63855 -54853 145973 -205924 -187089 12754 -47964 87777 -106932 29407 20792 -242377
19037 -249174 -14549 286596 161077 158331 -107704 67512 176325 -151441 -96941 310151
19026 -137066 105167 122434 -102446 -223461 -92565 393079 93984 183659 271281 -3966 -146247
19015 -146247 -70377 121595 -534991 77890 8822 161386 23103 -154942 35172 150085 -89730
19003 76621 -45409 133643 -235732 123743 -9603 -127424 -65719 -154342 20803 -258432 -134862
18992 -134862 88004 -136357 -296189 128167 -22653 -263295 -353851 161322 117125 -105909
18981 18959 300269 -99771 127211 -244338 80528 190625 -19210 90903 335818 -107725
18970 146658 -77049 -224195 -101648 -117968 -125387 81105 -50004 266902 144518 -414838 -13419
18958 36415 30733 66583 -109341 36944 -12098 -30263 304898 -11506 -202744 -312903 -108506
18946 -11044 258389 163782 -104363 -172583 29370 66267 43266 -245658 -179904 2650 -123710
18934 -285063 -92212 -120061 -400115 -42897 299145 65265 14042 -226959 -502056 -76268 -220795
18923 -220795 -298248 205060 -31136 11535 -2395 -14770 55802 -350534 -200392 -82221 53471
18911 -141869 155348 -71817 -34942 -261774 64017 22365 -81398 -357393 31538 -54415 -281646
18900 -281646 36078 -480054 37382 102772 133829 -6397 -6816 178105 -254 40880 -77787 217866
18887 116782 -88587 -3503 -279651 -108553 -17070 -211219 136936 -125631 -112111 -86248 -254277
18876 -254277 -170105 -610126 246380 -171295 2299 -157821 96740 -224872 80903 -236234
18865 -136653 -252851 111426 73037 39470 -118803 305018 -174584 189956 -358390 191864
18854 72984 30561 152907 -406895 -18129 -107563 -149048 -236498 52269 62706 -175290 106115
18842 60999 17475 -413764 -43930 150013 -214727 112575 186580 237866 195697 37046 -463424
18830 -173108 -72760 44694 -73493 229916 39597 -319099 -301615 -413820 82236 9114 156457
18819 156457 390615 37520 -219020 147024 258263 271013 40180 -2930 131633 188107 138921
18808 138921 -161925 270514 -26304 71239 -52559 -133692 -252385 -109809 313004 -8497 -223796
18797 -223796 -25476 219901 -165346 166377 -173850 -471138 -68973 76567 -293193 39290
18786 6020 -278616 -286881 -281899 -122491 -25698 -1944 -197510 132279 -10196 -151536 144912
18774 60426 291475 -269964 -1996 31971 -467716 -289634 83989 -102358 -127354 130081 89334
18763 89334 53574 -78560 16126 641 157364 -302566 46369 -154906 -148113 68188 -171011
18751 -66120 301040 -40069 -220494 -35278 49872 143096 19153 -161840 -394311 47607 56417
18740 56417 137728 -341695 -84214 -149696 34671 -92432 59653 117586 -264014 -196342 -198996
18729 -198996 -285872 -50404 -195473 247761 45293 393252 -55611 180278 -346057 -164840
18718 -250282 68325 58599 -92318 -67514 -18389 -230329 19615 -14845 -34144 -107731 -71649
18707 -71649 -50761 79124 -88600 13528 -29744 -99004 -263247 255913 94705 33643 190598
18696 190598 -142650 -179440 242057 39867 -44347 -310974 -30003 -125376 -132630 -59052 -176898
18685 -176898 288999 -96854 338146 159342 -192234 88221 -226895 147398 -70868 183526
18674 39004 77118 205301 -165446 33091 257446 -229502 -76672 75514 19347 -219675 165145
18662 -195023 240905 135353 74313 -140360 -154187 -336271 -106069 -133944 -239002 -57266
18651 113080 42421 -150718 -22902 158366 139641 -296281 -14836 -79024 -41013 207130 -186761
18639 -128762 -65629 -65192 -185097 -57915 -260090 222648 -34954 12694 -204335 -270652 -281662
18628 -281662 88754 -107302 -76198 -378662 -133542 -93651 233571 67921 54230 -37304 -177675
18617 -177675 174052 260989 -216400 171127 176529 -255932 35002 -61693 26178 -217166 75289
18605 -226747 -195396 -203919 -73423 -257561 -76429 -103268 77014 28566 238179 -135271 25385
18593 -290207 -299956 248060 171052 -308418 225291 283620 80934 -231912 200034 -18874 -46310
18582 -46310 17179 -177798 -205858 207308 -194399 395440 146027 -137787 5779 -116454
18571 -185577 10841 2043 193331 -135224 -108801 -96558 122783 -216286 -92168 340932 77131
18559 26272 -371402 67728 -107692 -175576 -84401 -366129 -200194 -341971 110212 -312015
18548 -45952 134611 7538 -6236 -231360 24917 -118706 -76625 -36146 -113272 129512 175667
18537 175667 346734 -301879 -68149 -130933 17232 -76107 5714 -370142 -96365 -18387 247401
18525 232373 -55920 -55286 -86533 -301904 -102547 -65607 23158 230369 -40658 1132 -8336 217629
18512 61778 -25449 -183894 44182 91269 -155281 -90283 438339 183641 126283 -4449 -43492
18501 -43492 -349799 249152 17946 -64794 -70812 -5108 -138513 81013 -458409 52257 -19487
18489 45848 -136039 -234437 -26266 -314807 7675 192247 7738 -110163 42723 286599 -361288
18477 -1867 -219181 -108709 182503 -200061 -313160 69040 -273093 -110874 -156980 172672
18466 -104039 -31497 -436309 -68757 111032 -10214 -165355 112130 -45131 -395647 165804
18455 108723 109478 -88904 88758 155968 -156596 -36214 289777 -167952 83567 -175553 19211
18443 -34979 -132602 -147787 -38301 -150274 16256 -398424 4852 -18672 -309782 116490 64791
18432 64791 -124044 9211 84996 59223 -67529 246036 -209313 -301057 -357570 -33588 109623
18420 -57917 -275948 -180264 268027 -372121 -237221 320964 -15770 -274214 195339 73552
18409 -2510 55514 -1018 -179084 216369 2474 194176 121932 145388 -150193 268941 -80161
18397 -507879 396960 66800 -300689 5263 -70976 -73534 116980 139593 62732 288857 -173989
18385 66945 173698 -243039 -370835 -122425 -85741 9224 48152 -410819 8141 49139 -78101
18373 200139 95399 -107259 -76678 228527 -674 176011 72717 -20908 5342 -96436 -82175
18362 -82175 11411 -5754 141277 278697 -8281 89620 -148673 -72664 -299057 -93727 -222013
18351 -222013 -122658 -170378 393229 -501097 -132098 293361 -11181 -236290 97647 -189250
18340 131593 223122 12644 119471 213814 -57177 -35658 -179101 -264202 -151211 41100 72133
18329 72133 -320840 -53652 18874 -25058 -215948 -284770 174582 -54752 39959 41107 1370
18317 -244935 136908 -229102 215917 111927 -258938 345828 -3210 -397552 -92697 84325
18306 -405706 -15244 52570 254715 -92820 -136884 -61638 106331 -65044 -213634 76244 18213
18294 -100219 -154306 -60582 -53353 -223358 185022 5376 -19408 251353 -247842 140260 26101
18282 -131873 13361 285776 102601 334348 -228835 33117 -144051 -112028 203926 -330800
18271 59056 -87749 -145240 -121671 -452610 110480 -70567 -185368 53483 -172272 135922 37964
18259 -277003 -70898 57991 -233727 -42611 59053 -225662 18215 -151521 -170072 153358 -236142
18247 18586 120395 -217567 102651 -218320 -227314 -104247 6976 33389 -36165 287172 -93330
18235 -96200 -201561 -69914 -265716 -27555 201139 -231006 -166003 -13787 258239 -17726 -62650
18224 -62650 -76539 -96570 73567 31310 -252254 196024 -236266 68891 -130433 131860 -143174
18212 -18023 -63344 -159436 -181325 -141587 338630 250481 56713 213127 29944 -43699 72482
18200 -20571 -175328 -189656 -207736 -24718 160294 162162 123461 35871 -84414 -240065 169742
18188 55302 75936 67830 -224195 -276316 144913 269869 -293000 -332406 -165300 -210729 86777
18176 326364 -77682 192085 41854 -113677 -114152 -626002 -39544 -196814 100329 -25739 5993
18164 223979 296085 -269339 57500 -133158 183498 -90768 -115146 -241412 39128 -112117
18153 98044 -216185 -87350 -154820 -6863 -327350 152311 78252 -37711 208748 -46931 123529
18141 -95046 14873 -459831 232277 -226082 -134475 -264356 -105368 50779 -286782 67987
18130 28216 203532 56330 271603 198142 -58654 41506 70810 -20303 -133087 -256484 104788
18118 123238 -195853 272148 -23253 -299785 29912 -282656 284205 -120021 240274 -38548
18107 -124023 -68529 -178004 16632 312814 60216 -67686 224944 -162726 223902 -370969
18096 -213523 194364 -72609 -9216 -112332 49170 -308282 -225662 -33262 -95163 102161 -31287
18084 13189 -73171 32219 163586 -64476 -156867 10499 -30969 -232247 174226 13671 -3602
18072 -54154 -59260 -38321 -54140 -137235 115783 -137775 -247750 -163191 128782 257471 -238856
18060 -299997 -31725 -85452 47624 -99466 -206931 -34538 -233888 -188050 75893 -154047 258393
18048 -290659 -13242 -304604 -516 30374 222694 -8662 101452 -314886 89257 126594 64614
18037 64614 -22855 -15355 148197 51625 243340 161511 -39468 -43109 218951 307058 236243
18026 236243 -56145 -87992 -80184 64701 -87242 -75090 99631 142008 6489 11428 146180 -139574
18013 121210 -23114 -187262 41709 128047 -2205 162647 -198458 -210049 -25336 -63210 -54248
18002 -54248 260957 -56709 120826 -119339 -76852 96706 -285559 13397 -81377 -61744 75514
17990 -257790 -152584 -211675 -43548 83032 119468 64168 22802 -11252 -116752 -43373 49884
17978 -113158 -79263 125654 -313038 -48737 -462963 -124916 -417611 -32200 -318001 -161081
17968 -161081 -155960 -38293 -316625 -109456 -297607 -264737 10213 -113616 247438 -263612
17957 -111020 73628 -56103 130275 -311552 -57585 14014 -127278 -79474 -219146 -52577 24480
17945 159376 -11849 53792 43671 -431781 -85608 130885 -102409 -181341 -148788 105315 -37457
17933 141581 -230485 -100269 32759 -325350 1842 182040 -69663 -199059 44446 -27923 -152258
17922 -152258 -165609 -156553 80840 -89103 102784 -40940 -22067 6940 -63441 -76620 4259 -91197
17909 -49528 212539 -9765 -168737 -285002 -268341 80583 272436 -22460 63732 -36899 -287596
17898 -287596 1556 -51612 166174 150999 2615 99627 194779 148765 -19239 -341403 -7665 19047
17885 -36061 204667 109653 142068 153794 204310 -109163 152098 144118 -55165 270550 -25287
17873 -48219 84492 154747 -189427 -113498 -211767 -225683 -158979 -297988 -119414 257930 -59480
17861 8700 -11352 -161197 -116641 -145836 42277 -67471 191136 44853 568010 110803 136829
17850 136829 99939 111911 116375 -101212 -185517 -161356 48185 -151763 88947 161054 -102690
17838 -171685 -355241 17332 -270224 263438 179280 36259 137026 -175538 3162 95735 -103544
17826 -29717 -101157 -363468 -122979 123309 -43626 -354095 -314464 3885 -241889 189003 149943
17815 149943 -21525 237925 -55127 -88390 260000 -105167 124886 -58477 51134 167552
17805 167552 -152953 47882 61899 1497 -37218 -128776 -6063 -49319 401540 208352 -42388
17793 69022 -53620 -208339 -13436 -220612 -358219 -9927 -131328 -164925 -242566 126974 81579
17782 81579 157343 -42758 37 6848 343408 -177305 110948 -40969 -37206 -229672 -136664 -190835
17770 -190835 57341 48546 96100 102591 -37788 54976 -245718 220692 204145 -166848 402400
17758 -239151 -403250 442337 -72863 -86430 -59248 253383 101369 -50365 -62788 -166400
17748 -166400 -176016 -26002 251413 160209 -224511 -139562 -17622 192788 93186 157116 54842
17736 -182481 13876 -181485 228685 -141830 273304 126502 91283 -15405 -165561 -71291
17725 16808 118584 -67914 298947 -296469 -3734 114692 -54412 125096 70741 -163093 177421
17713 -166751 54317 239201 130214 134048 -168344 268515 -63542 -207155 -30183 -198205
17703 -198205 -47097 -156678 -1810 127260 -359650 59945 124028 -145663 99912 262274 -68125
17691 -66224 73025 338292 161780 -71356 -18310 -265461 -275698 -49576 -181559 87875 288987
17680 288987 72532 -375655 -34517 163583 61925 -190251 -151810 142965 123175 -173379
17669 235320 -97102 154406 -10497 144256 166603 43456 -184432 -106904 258056 -63845 -133008
17658 -133008 3428 -54172 137361 140402 154671 222073 47700 50219 170084 -153248 88924
17646 170082 -49335 22975 18876 438291 -89755 -93565 268903 326357 306334 147046 271405
17635 271405 347236 -71059 -223347 246980 -53026 276214 279829 -13391 154750 -29485 -240320
17624 -240320 -53294 -42738 -56311 285880 308538 -302779 66055 95326 117161 149072 -5203
17612 551152 -38161 145588 104082 -140839 -161280 205809 -116102 379251 -57889 -83601
17602 -83601 110291 80994 -162691 -121103 102226 106801 209594 -50728 51037 283389 149365
17591 149365 346103 -260149 116440 200827 -55928 117411 82075 -45878 219155 -127259
17580 -271216 24298 191018 -41345 -47369 51024 29181 -5562 334236 29435 -1159 59176 80820
17568 80820 72596 82441 79322 132038 -203523 -63666 80761 -80874 197596 -218074 31350 -90517
17555 -104681 164886 110440 -301037 -36847 -4587 -60490 -34571 20510 73031 158550 -216115
17543 23843 -46142 133131 202486 -286516 67325 228891 -69435 -259920 162393 120710 -11529
17531 168372 27429 -185197 15678 -91648 127360 -161453 20637 53847 126179 -124511 67820
17519 -21788 149782 269430 15846 34596 65623 260798 2815 188606 14857 176935 179305
17508 179305 -71252 71013 240528 6800 -92819 154027 -120858 177935 -115853 1909 -282236
17496 48486 -23880 89956 23842 186132 21885 31787 596526 31481 251501 124971 14246
17484 278539 34673 116397 132181 206732 160057 98977 -146330 -237268 380266 62041 235279
17473 235279 37012 343079 182574 120125 65700 -148320 16021 137496 415365 275049
17463 275049 -36106 -190207 180953 -80106 199963 54616 68178 131799 142358 -192680 500632
17451 318669 18956 -168262 144087 462188 -20026 499274 144122 324661 -198465 313998
17440 128728 223304 -23367 86296 315001 225106 201053 277045 -137870 140791 275605 380467
17429 380467 182943 246294 50147 223415 477180 264092 234214 667948 408431 461446
17419 461446 138537 403890 28181 43859 390514 318115 195904 54889 177883 187011 -271372
17407 193524 -234066 175236 237478 443578 145881 -179115 381208 211299 230606 -371308
17396 44548 238414 171420 111898 -9019 323243 -209675 189043 -15502 533401 -141843 291634
17384 -36430 -67371 431962 268975 167131 -112276 14213 -72501 -14940 -69933 -7358 352074
17372 403539 258041 346551 -138532 521369 370922 96369 44234 257048 222724 -29005
17361 232575 106814 206349 234348 12556 338368 206838 -9823 153022 350508 281491 491545
17350 491545 92440 338088 -110903 -66544 100422 139819 602739 55083 355896 -270580
17339 309135 -23051 -54476 300672 150582 81847 557316 175789 246514 164052 437 21333
17328 21333 71285 273738 -112583 10056 -56833 -184788 342875 211960 472254 337699
17318 337699 -301976 102317 217497 -100540 192134 384090 -109096 125733 98047 35392
17307 -64287 6516 4664 61588 76132 373753 -33149 -37701 95277 68873 283046 -149402 295243
17294 358632 297138 192436 323363 228636 324421 203630 -8350 -365701 123943 237412
17284 237412 127412 -104899 26237 440635 148865 318708 373017 -16288 7081 1959 159468
17273 159468 252725 228055 -64689 514353 462335 115522 449439 45412 -109603 270174
17262 360874 498970 247656 121174 33092 81668 34854 6675 350019 98316 -76953 89692
17250 113022 134725 -23761 378301 22178 309754 -29167 211675 71990 379698 162498
17239 125009 512278 337421 129306 76923 271669 355157 182081 99769 -168956 23492
17228 270228 46590 473408 70560 148081 100277 -100469 242937 258340 1247 219782 399308
17217 399308 120307 -110284 184937 274588 509837 -43421 73858 63609 265696 94795
17206 11358 305889 58574 195701 395037 52735 294661 29947 55807 371950 429645 180640
17194 28610 377372 98760 216052 131733 414619 -122220 22722 348688 238085 464049
17184 464049 489569 240602 -32861 224174 303414 118354 91127 160285 274072 112022
17173 566718 197642 236156 58629 295779 39725 -9924 179677 230075 226750 272099 318160
17162 318160 219178 237677 361833 357131 61790 305809 462668 217322 281827 274939 346867
17151 346867 272651 382233 277484 446790 352745 438487 166079 103719 279384 196180
17141 196180 22919 -88660 251110 386165 218893 162538 452993 203838 255393 205725
17131 205725 243943 2013 191500 561218 358372 697545 346267 472251 236021 431173
17121 431173 407625 394651 305585 155543 304096 10609 292897 483340 302568 522331
17111 522331 482203 412765 547349 586260 378313 471487 475555 253522 532822 582111 233807
17099 324188 233707 269673 243990 448088 309313 618372 462282 281907 239452 472672
17089 472672 346625 226543 412448 498902 535821 632605 196672 -164294 753665 115777
17078 513076 303320 527931 691431 560278 490730 393487 172908 564608 619198 502636
17068 502636 495252 333876 243110 350074 204075 690555 323920 356383 460188 1029070
17058 1029070 335913 246842 584382 523668 335978 672965 563655 336993 318971 248052
17048 248052 529796 492488 438064 412090 501881 362593 785455 211208 509879 687354
17038 687354 856413 512918 430194 464863 509266 74551 315595 461516 770492 584211
17028 584211 690145 405454 407347 748917 529993 760207 996445 295505 230888 341909
17018 341909 608260 430306 641396 650502 690312 1019289 394417 641043 718543 670817
17008 670817 291939 484211 533533 337860 652053 692520 476255 608694 591039 953621
16998 953621 881085 559886 601825 838543 454353 957855 537899 878963 714366 817727
16988 817727 960458 609002 486512 889228 324903 760838 1026961 994589 322058 401389
16978 401389 761686 887036 742444 1197007 1299864 942019 701099 883603 801220 964723
16968 964723 905765 1063961 1085861 976845 1040855 1083405 902629 863391 674898 855785
16958 855785 948975 792029 755112 991610 970188 953720 1104045 753448 1119714 804291
16948 804291 1016819 1152926 1199414 671249 1122913 1123352 1228568 1539448 1154077 1169762
16938 1169762 1380435 1178379 1080330 1123504 1397921 1357017 856591 844425 1387092 1225326
16928 1225326 1266052 1071460 1228256 1409317 1384746 1239548 1050242 1138784 1500834 1101469
16918 1101469 1190429 1639427 1312722 1330329 1175094 1742404 1292378 1513459 1508241 1337572
16908 1337572 1555778 1535585 1527642 1579878 1254221 1607890 1904097 1707618 1230668 1869461
16898 1869461 1519774 1433792 1590897 1662079 1542777 1559017 1631213 1625776 1454454 1504156 1803627
16887 1803627 1683385 1935509 1760113 1680338 1732449 1953716 2042923 2270645 2023558 1841559
16877 1841559 1999097 2163096 2129304 1640867 2261603 2249643 2401206 2204505 2373709 2175269
16867 2175269 2126163 2021429 2147441 2396231 2110212 2350357 2565819 2526184 2496976 2493688
16857 2493688 2479060 2764207 2736999 2322629 2953963 2570304 2839491 2903201 2914239 2785837
16847 2785837 3023779 2717091 3065642 3129396 2812115 3349904 2724591 3155592 3591373 3227165
16837 3227165 3421225 3551147 3618200 3787166 3939027 3957585 3992700 3779573 3932282 4122289
16827 4122289 3922340 4319921 4232418 4250577 4129133 4333050 4525873 4671062 4795216 4895136
16817 4895136 5172407 5121702 4619397 5011578 5216741 5265131 5352321 5489506 5995680 5699711
16807 5699711 5636696 6106105 6088152 6201896 6347511 6728268 6668950 6901579 6884544 7026385
16797 7026385 7391522 7880646 7610942 7935179 8177254 7832448 8211041 8654471 8780177
16788 8780177 8766852 9436140 9197326 9924036 10240591 10171462 10765239 10835427 11190894 11499066
16778 11499066 12013512 12028236 12675347 13175122 13218436 13825537 14312557 14650071 15171574 15908829
16768 15908829 16034304 16748245 17387583 18188472 18487882 19406172 20018001 20951722 21448862
16759 21448862 22554953 23082289 24554919 25302606 26139218 27447403 28724778 29751201
16751 29751201 30925542 32417525 34057568 35533039 37440812 39073702 41284052 43361741
16743 43361741 45064494 47710736 50301515 52917345 55791500 59207633 62201868 65727841
16735 65727841 69717165 73412208 77768884 82459617 87643098 92570337 98072087 104062118
16727 104062118 109723646 116368712 122513533 129252642 135449067 142056765 147716142 153961008
16719 153961008 159009129 163595577 167117502 169823723 171160910 172326535 171380877 169517911
16711 169517911 166404726 162702310 158188625 152899039 146642177 140095528 133120385 126289652
16703 126289652 119810650 113315697 106909917 100729662 94496348 88853985 83733437 78396628
16695 78396628 73754178 69843165 65317434 61351092 57934325 54987911 51509577 49200441
16687 49200441 46172411 43693018 41488992 39422550 37189688 35460835 33877617 31872971
16679 31872971 30156629 28957016 27647577 26206859 25346889 24264688 23039716 22319151
16671 22319151 21048257 20308401 19280560 18829517 18117053 17229600 16589048 16395970 15362424
16662 15362424 14833085 14248409 14153788 13541761 12861466 12337230 12038372 11800678 11335560
16653 11335560 11056752 10251014 10113545 10207517 9853926 9452008 9266161 8864707 8539985
16644 8539985 8294816 7939160 7713510 7599731 7867418 7405276 7219935 6980594 6463390
16635 6463390 6481018 6567317 6377639 6036055 5841435 5811209 5770928 5450822 5418532 5187111
16625 5187111 5207948 4875089 4952541 4931422 4729624 4596952 4361706 4875377 4487178 4368151
16615 4368151 4075566 3916524 4051544 3928696 3640660 3793418 3521099 3670736 3174448
16606 3174448 3556170 3279121 3220215 3016905 3249636 3175579 2796797 3010327 3098170 2779263
16596 2779263 2888774 2696892 2424997 2676103 2962758 2625000 2608457 2307742 2648633 2271487
16586 2271487 2384173 2490193 2517739 2178742 2124071 2078318 1902115 1973411 2136976 2071148
16576 2071148 2202251 1763041 1985859 1953497 2034162 1546002 2028893 1974734 1850490 1634982
16566 1634982 1864091 1514506 1450379 1447227 1351281 1650486 1565498 1520113 1534558 1531709 1341523
16555 1341523 1571622 1288305 1407542 1373601 1162309 1269820 1288989 1132794 1321699 1019748
16545 1019748 1117631 1139230 1361719 1378176 1472777 1223312 1095497 1308913 1075033 1103846
16535 1103846 1263560 862265 1176903 1120938 831476 826120 1084560 724406 802998 584597
16525 584597 867006 984018 973282 1122772 945271 1147473 1060246 822704 1341892 940300
16515 940300 957108 875461 781254 831268 899100 784617 1224445 868285 700175 894954
16505 894954 650214 829991 1023410 795590 633239 659727 850622 417290 839760 976392
16495 976392 712458 954048 800371 424499 720758 976105 622970 568122 658015 634864
16485 634864 487403 548997 846101 444541 807084 669739 668472 627749 536382 839254
16475 839254 58432 599895 702156 425956 274469 544450 470397 704695 630042 755149
16465 755149 240037 682723 495078 363755 467338 305018 375334 588010 320496 589055
16455 589055 618552 344451 633467 497365 746042 265857 332650 510972 624377 565663
16445 565663 119149 263672 198025 476050 564673 68969 352476 441509 423720 482006 355882
16434 355882 139205 398355 266207 328676 613068 108360 466659 307273 449534 415443
16424 415443 586495 619466 271066 249139 214831 430363 374188 178599 542693 342355
16414 342355 218595 302116 202682 588388 115431 -84205 413350 416972 100435 186081 415595
16403 415595 -109221 383231 358505 209191 241416 47056 330826 97667 287014 239548
16393 239548 218979 386806 435732 124143 226450 712451 265674 103084 398787 131859
16382 51818 794147 41353 112687 223475 -67091 144638 404413 398232 253800 82800 -154343
16370 36843 96873 26958 135031 239186 156699 75572 110930 167850 366574 241346 -119510
16358 412455 48359 277194 363131 -86080 289133 -31446 149537 -168510 -87910 502542
16347 225583 71941 332599 62833 339042 16040 56385 168062 588009 8030 114749 598196
16336 598196 17154 229185 147691 109030 -30403 221099 211346 351249 171419 92923 378055
16325 378055 88969 27657 -114885 9136 364006 186949 -53281 142496 -519831 9720 249976
16314 249976 192511 74493 252214 -103405 51536 388015 -170919 281273 214452 83018
16303 61610 -71201 -51864 133311 355689 183687 -11976 -8863 18957 85325 30554 268877
16292 268877 189729 83678 115333 -35561 74294 257376 121004 5681 288946 232302 151560
16281 151560 100225 377486 52156 177875 59426 -71552 367138 423861 -140975 -194805 176773
16269 83805 -4604 -215775 -92366 115677 80852 -114389 -86393 -79790 159342 194387 -80469
16257 49258 110847 -128790 11150 289731 -24622 -128905 109319 205813 7361 -69552 300167
16245 347877 -50335 291676 -3509 -182592 362413 180615 220897 -159096 87617 259517
16235 259517 -4345 -72038 247759 -110481 -113916 55792 -54027 -45946 131372 373038 100871
16223 156604 -64827 -131209 13598 -316879 323103 292891 -100292 313587 116229 63213
16213 63213 -142026 -156979 212322 -34086 -145711 29206 65548 25673 53163 60491 -91720
16201 -36343 -39679 100564 -135922 276222 24490 -141050 -166546 98518 -18630 -3084 -40741
16190 -40741 222288 73885 -109530 157665 -236419 1086 -285360 9051 -35655 -482383 -326869
16179 -326869 -50665 217917 139830 27067 94401 -192963 72076 -34973 263089 -262663 80535
16167 -351095 136523 90998 32558 143058 48532 64471 6763 109060 -220010 123353 82810
16156 82810 -92512 -93204 -56316 -1799 -29698 -218980 -177221 176219 14074 -262905 -65456 -226586
16144 -226586 -217076 90941 -56186 110390 2792 -95803 -222902 -26607 -123870 128492 -141873
16132 217298 -75575 -73786 36799 -178393 -42927 -370180 -234747 -150028 45789 31247 -4748
16120 67150 27020 159438 69800 -104220 -294653 -13650 77520 314788 147988 247941 82795
16108 -200629 -122369 -398671 160910 -18402 -303419 237222 51761 68202 203773 -20403
16097 17677 3382 -65763 18235 -92807 136192 -201030 103965 33709 267599 -75786 51640
16085 -32563 117409 -22383 -41534 -64692 291278 -8228 118702 -73865 -171328 -330744 -239673
16074 -239673 -253778 -232798 -106770 112747 -159822 -67553 -218052 -131673 27096 -147215
16063 -154839 224908 -75923 -47426 -94902 -254481 141503 -308021 75298 56228 145414 -26720
16051 246661 48533 139858 101702 317496 83981 23582 27903 53023 37376 -68667 -43287
16040 -43287 -116251 132855 -80437 197739 73440 -271650 -86571 -61980 -139703 -147917 100455
16028 196042 -139718 1682 -26047 -34737 25745 323939 -108539 -273703 232522 -160017 -197830
16017 -197830 16368 -133492 -271205 46695 62884 -174474 -14922 -121543 18605 167155
16007 167155 -136573 -257281 -37634 -173636 127288 -79016 92747 -201457 65256 42544
15997 42544 -144567 82055 251884 717 13510 -150309 40560 -343490 185801 118191 -19570
15985 46420 203213 252134 291158 72081 219769 138478 396534 150439 204530 -183746 -105082
15974 -105082 -103759 -170381 -228609 365234 90280 -161562 -154249 -295878 199595 -77210 102943
15962 -244637 59687 -120471 -78734 313994 85757 127287 -128694 -24032 -53007 -180662 -24399
15950 119504 -449365 199568 -121680 -76728 -172823 -50232 160736 100553 -168369 -267617
15940 -267617 114264 -189889 -365126 29956 240274 37360 -224739 -270768 -47035 -244929
15930 -244929 28605 -65355 270300 150990 268573 -222398 -227235 -46074 -248562 267051
15919 133259 12929 -119480 168631 -57626 -146446 -115789 -120713 221106 11018 -32251 56587
15907 221854 -208390 -29316 14006 137536 132717 -443389 75904 -246456 240772 -153086
15896 42933 82016 97034 -224987 -129943 -133419 106771 -171554 -31728 255431 -239655 -112629
15884 6970 17955 -155051 -8406 58336 -443004 56498 -152235 -14505 -238527 -78849 -174417
15873 -174417 -226893 158814 -86625 -175385 -78312 -44905 16441 141706 326354 -24526 26638
15861 389914 -79602 -221854 121928 -14366 -120458 164406 195302 207377 924 -35102 18515
15849 93304 42509 -141862 -147443 161467 241049 -234535 -6358 181429 165820 -5408 -41930
15838 -41930 199033 -57252 -11438 161978 -101089 -52089 73954 37175 -52403 -206570 -573836
15827 -573836 -96404 -215581 -178637 -112464 -230374 -6046 -85193 -165752 222473 -141395 -150423
15816 -150423 -84100 -73183 -6667 -114450 -29276 104648 -27491 173381 189523 34160 73218
15805 73218 -384339 188219 -90345 187765 357062 -61766 -297830 199092 124888 197630
15795 197630 51541 9751 -27635 -357728 -58194 -264064 -57049 8837 -248608 72864 -69933
15783 -60545 -140251 -15345 118811 -118546 -295088 -151791 -31010 -79605 -297246 120677
15772 589 -188589 -79546 -259858 202614 -151799 230360 143686 -178861 127562 53539 156874
15761 156874 -49620 6592 58056 65073 108327 -105875 -4945 316431 -79869 38844 -145683
15749 -59403 117761 8071 293233 -67811 45935 32910 156522 157818 -195255 -121989 132382
15737 -245897 -83211 217870 356027 56218 -337596 -47158 115842 -282025 252292 219147
15727 219147 106934 -113915 -40685 193361 -51800 119113 -379479 44985 -94058 57276
15716 427602 596646 -52597 -29529 -68163 -152229 279329 -152247 -126236 -52800 -187580 266599
15704 -317593 152650 -101365 -24890 10579 -118686 -214666 451983 -355119 115924 -42060
15693 80941 65729 -112653 -3013 97556 82894 170214 -287335 96845 -116589 18498 -227244
15681 -58775 93206 -128252 -153770 233077 -140842 -181215 8163 149718 118554 -113647 214744
15669 20030 -157802 -173695 2124 -213866 -203136 221454 22167 61725 126296 -115981 -38749
15657 -284364 -185770 -251898 -87713 -193829 55793 -133084 65523 180434 311725 -116223
15646 80066 16807 290 -249724 -62416 -110308 141619 -291796 20394 -91135 -88882 25642 -43938
15633 -194742 11516 118466 -83504 -281207 53771 167016 156848 227080 44970 251783 -120745
15621 -105178 249004 -42750 -41410 280602 294198 48554 22974 70061 -5244 -18574 -191034
15610 -191034 9805 -167673 -67806 -107592 116223 -146320 88475 73747 132655 57613 -18377
15598 -108186 -195111 -78208 -270857 -15190 -315360 97727 -91482 215106 -200668 -110359 178168
15586 31138 107132 396250 125132 13035 -21166 -73246 -146550 -40672 155144 -180195 10049
15574 -77094 234698 178588 -66237 178911 -271042 218363 71890 153070 -285463 -57222 163086
15562 9050 -91572 203588 -35487 -272175 -3729 101598 37512 -292049 -6242 144551 185166
15551 185166 -197855 244760 185530 113396 -100115 -41714 -119184 -72914 289622 41963 254961
15540 254961 134293 116389 57471 9293 -53117 52080 -140181 34928 26371 -445732 -103335
15528 -11923 280797 -278494 289295 -103973 78930 -160825 261271 -111791 -62551 -75441
15518 -75441 11008 58628 -46666 -300522 166489 -55294 -189601 -281646 -49390 -16060 222080
15506 -197686 214904 -233700 -97497 -340 104737 120741 8292 71294 -235610 -310014 8767
15494 -259792 92417 22879 459741 8981 -310764 -90454 140771 173940 153710 -217180 -14816
15482 112398 67266 314563 156400 -147156 195086 -43479 56622 -12441 -14660 -58136 -77188
15471 -77188 50846 -164765 71015 -221555 103591 -427048 -221472 62805 55249 -122377 -190759
15460 -190759 -184808 128635 -82078 -120067 234138 -282071 -188690 -87779 80493 -254547 389674
15448 7850 -79825 15686 122331 -3919 -258384 202328 162445 36075 -30059 -435594 35837
15436 -106683 31749 108267 92939 91565 288226 73402 197315 -137810 -320514 11692 259976
15425 259976 -178996 -148663 -284295 -232562 165619 70519 1069 -37478 -112397 10837 -222850
15413 -199498 -230777 -17716 -52545 62370 -302049 45397 -296526 71740 -9162 208076 138819
15402 138819 -223621 -101282 -190306 -115997 -196763 11881 26518 89196 -92315 -166711 378546
15390 -196939 74321 -49782 129217 294056 20093 153392 -243960 -14591 133152 -171225
15379 -75693 298077 -212852 207442 -64361 59854 264890 184235 -179581 78553 -153646
15368 139577 85130 70334 -106773 54619 -285981 26674 3538 -413853 -35512 14853 183018
15357 183018 -479605 -12415 -247176 -397548 259301 135997 -178912 -105362 128693 27446
15346 171297 165209 161383 73670 262076 205358 344786 28140 -209045 72675 40238 166495
15335 166495 -154480 130044 154673 -59316 -87126 3863 -102206 219080 -20817 -281327 -20680
15323 228545 337340 119239 401710 -382023 -99944 -55152 219936 88938 -106583 -196827
15313 -196827 26178 -349285 -171412 200491 -9213 -161301 -156934 -316366 74462 206678 20704
15301 -145632 393116 86858 150256 -318875 94451 244215 -205724 -3257 -144066 -21862 38750
15289 97907 -1998 -10065 -44150 11761 -303283 191209 29408 -33856 96746 42531 64789 -277616
15276 37952 151762 198801 18466 275472 40542 71834 206076 350564 111535 -36 66125
15264 172243 92483 -72682 110472 -55278 -23869 -78151 -85826 152795 366609 118735 -70481
15252 -120360 -198853 -72513 58102 190150 431296 756933 1382457 1540262 1106887 1452592
15242 1452592 611034 -42303 -212679 69868 -36291 -50822 -225288 -33438 265486 28510
15231 -56768 237996 3701 -56904 -140822 171357 -172447 -63336 -96486 184617 -168150 78488
15219 31498 54625 -42506 -90267 -110857 27978 -8862 -2535 130611 -308681 -47740 231808
15207 228687 91835 -182381 -16706 249691 -193684 89606 58317 -86861 104912 467478
15197 467478 -97018 186323 -209854 429521 -41871 166790 -141039 296042 121168 -1137
15186 117588 243017 191437 64828 -165459 176920 267219 103410 91959 -166097 371640
15175 192691 78355 -125732 172919 -40709 80150 -95716 -10713 98783 68912 341307 79968
15163 -78156 44267 -246612 21250 -26642 171042 359966 -60475 160720 353360 146882
15152 116951 -47241 175470 -32863 147750 313208 -320539 313324 -59811 146115 39075
15141 330550 131430 374414 -176212 10234 86326 415694 -66315 159336 289552 371985
15131 371985 305822 169209 272159 321768 -57239 278142 -185588 -93234 51596 281105
15121 281105 213784 134951 239014 161562 50636 173252 345713 -13363 -146198 87817 -75231
15109 148831 5368 -45249 36780 -177574 179847 294186 321863 19977 -220943 211144 232095
15098 232095 111120 255662 292383 234309 106323 530224 181284 182080 52441 243420 -9597
15086 72558 258049 35832 481982 145557 159821 168694 386374 556874 -157641 112135
15075 156204 -57042 343386 -34995 210634 200785 220796 162986 346307 61152 -140904 -104354
15064 -104354 316668 248415 -49646 -132546 77189 236890 184022 -86454 -16360 -194627 -16358
15052 -354638 337174 -18736 545976 219227 416518 406853 -180493 159579 164949 130145 231285
15041 231285 358326 321747 243984 488284 -116910 -47072 81924 269702 191516 111663 -255882
15029 503235 -249022 164843 284464 349354 192474 243944 99338 -91977 73750 266696
15019 266696 393291 51398 142354 56571 233219 347346 -88330 126479 197376 -53913 100569
15007 -54306 226413 24952 -170347 86410 -14762 274515 -32193 180710 40057 270489 167675
14996 167675 1464 428026 242240 431975 445290 196233 242787 449609 58847 114015 277649
14985 277649 74860 293635 281012 368037 189327 584249 329981 444488 255524 -131290
14974 214813 187454 28654 174116 333272 128949 -48498 422143 184259 328033 233510
14964 233510 212964 505072 241022 179689 341338 477906 210401 111342 124723 128152 402488
14953 402488 -14058 505089 151817 418972 613013 382842 474754 -95462 550098 115848
14942 364199 401648 271552 263882 -19077 156907 274138 82499 439528 360760 218125 374097
14931 374097 215978 348664 704498 182224 40580 344948 263286 346922 295143 271087
14921 271087 38748 52336 -165369 381227 379249 466741 367588 332079 78545 298134 165526
14910 165526 160412 443540 395825 293494 511974 126121 44916 80394 422349 322800 502386
14899 502386 238555 197210 200912 216539 -17420 439419 326376 350067 424177 386672 442092
14888 442092 363474 517482 159231 91922 252657 305624 377959 340808 322161 87659 180481
14877 180481 88520 141266 322063 399205 261543 408547 279349 433574 185586 259360
14867 259360 200565 384972 596326 99178 650410 510561 262847 595140 525661 460109
14857 460109 585699 -29716 458906 127667 359339 379178 445478 316857 290648 211181
14847 211181 449185 432173 270843 247219 418521 422750 248502 581814 202894 176408
14837 176408 539437 289761 427412 390486 49256 421832 446214 206562 495235 561701
14827 561701 533795 -28535 197610 599608 584165 269358 421449 368559 568422 768284
14817 768284 572651 769583 543239 546440 350122 235331 345162 362226 -8787 815841
14806 527397 438766 595743 479120 531538 653111 715365 397593 804876 623311 113064
14795 529477 632776 499806 294338 452519 497956 683799 233079 414999 527240 341076
14785 341076 682709 448840 420528 397766 360614 548504 662018 458752 599524 540222
14775 540222 120019 951472 468620 487377 507285 513469 464327 467102 601936 651821 617864
14764 617864 474865 517419 820179 664936 600533 575597 784116 283540 526741 199371
14753 542933 345789 751349 519677 706988 494780 303311 468780 443483 528693 774572
14743 774572 776576 372813 776311 762830 870924 595837 789216 395364 659757 506688
14733 506688 839414 486857 467992 491004 892153 626237 914909 660501 820368 733607
14723 733607 393205 963347 567141 537640 747618 570244 784378 693346 735894 504699
14713 504699 729170 508165 813233 759474 626858 687042 642062 864041 468347 735253
14703 735253 640564 559066 643720 835314 952275 1003749 808909 983308 979027 746610 1061946
14692 1061946 496070 869013 818914 1176272 818923 752391 778647 873150 619061 612846
14682 612846 850837 794928 695521 1061396 1219924 936136 929756 1113916 712202 985533
14672 985533 950529 753807 984134 1099234 703706 1175093 1261772 790514 898346 751526
14662 751526 973822 1158769 1040605 827505 885467 852840 936120 966028 916538 926624 851257
14651 851257 734902 1107929 1026643 1155290 758640 941826 1172909 985993 1181653 735512
14641 735512 1012808 1249099 1245054 954291 1150389 1006993 1103928 1397499 1120053 1134763
14631 1134763 1315583 1280374 1640619 1149243 1461263 885878 1495697 1296031 1361728 918319
14621 918319 892629 1208850 1189892 1471240 1374720 1227739 1477542 1064782 1452252 1371402
14611 1371402 1465797 1430634 1377906 1026642 1278881 1223640 1383176 1331110 1077777 1233665
14601 1233665 1278726 1229250 1385182 1404617 1549267 1464611 1737991 1359412 1542745 1276033
14591 1276033 1462811 1711221 1456129 1333854 1495681 1469191 1553951 1606875 1464769 1959871
14581 1959871 2002694 1636267 1536748 1856366 1878797 1853642 1804372 1636235 1540119 1925048
14571 1925048 1865620 1731650 1922976 2031398 1947295 2286452 1998809 2103255 2092567 2294776
14561 2294776 2305315 2621016 2424815 2440014 2693579 3061266 2504449 3111590 3533648 3489354
14551 3489354 4218784 5483078 7191583 10613968 16908689 30800664 43414057 20048811
14542 7928044 6035851 3891588 1950634 1555906 1760930 1293418 1819663 1476305 1731208
14533 1731208 1692702 1685601 1775752 1970613 1802051 2064844 1868707 1907119 1994417 2293770
14523 2293770 1990404 2068484 2062802 2232877 1842766 1999956 2250469 2207745 2187133 2488459
14513 2488459 2242436 2332501 2454687 2478259 2632733 2746209 2518436 2570932 2866192 2599017
14503 2599017 2762861 2787169 2693504 2615183 2588437 2806618 3007735 2783013 2763228 2682282
14493 2682282 3076133 2722613 2919710 2777778 3102535 3179201 3229390 3244077 3473313 3193539
14483 3193539 3210579 3165124 3245803 3429265 3645344 3353423 3548037 3632206 3884394 3620557
14473 3620557 3270781 3834760 3792994 3757167 3676229 4177918 3974494 3912963 4248623 3971491
14463 3971491 4229274 4152130 4121566 4132625 4347894 4719614 4158894 4575601 4486203 4558044
14453 4558044 4647061 5043300 4425197 4703877 4828644 4956063 4787013 4913057 5146118 5448355
14443 5448355 5214540 5162668 5470763 5708698 5383380 5786616 5665572 5955094 5702420 5785484
14433 5785484 5614910 5858248 6192123 6010785 6331487 5969665 6550653 6500165 6693513 7144795
14423 7144795 6505812 6686034 6906158 7470127 7239819 7303494 7312673 7197559 7675180 7635519
14413 7635519 7679592 7976482 8168775 8050056 8127675 8117567 8349193 8495122 8791949 8508614
14403 8508614 8879186 9387488 9324601 9534657 9376402 9771476 9706979 9788855 10159022 10070332
14393 10070332 10209732 10393550 10923846 11298001 11223403 11385640 11504047 11994970 12018856 12435717
14383 12435717 12427223 12928565 13014856 13048544 13539587 13241069 13732714 13842004 14283969 14699427
14373 14699427 15077024 15390466 15514897 15925921 16299390 16680429 16838557 17286047 17516164
14364 17516164 17834422 18298040 18672715 19254171 19807444 19928562 20441146 20912345 21252751
14355 21252751 21875828 22447883 22735789 23292127 24294020 24339480 25042451 25866771 26424314
14346 26424314 27495308 27965742 28455534 29296929 30174868 30926530 31948673 32391800 33396882
14337 33396882 34371710 35443698 36501584 37942796 38697661 39766953 41275474 42591944
14329 42591944 43812477 45412558 46965559 48630364 49865017 51691638 53357345 55342806
14321 55342806 57232424 59035088 61708179 63962597 66056986 68574242 71473619 74444510
14313 74444510 77339231 80518805 83620733 87351664 90882003 94598209 98856009 103407254
14305 103407254 108125462 113274165 118323174 123915133 129295112 135784618 141891779 148639334
14297 148639334 156067894 163449500 171500958 180184414 189189596 198901021 208741673 219185911
14289 219185911 230231084 241544448 253589454 265892349 278718140 291606825 304622466
14282 304622466 317747667 331000803 343884516 356669420 368508278 380149118 390388766
14275 390388766 398958100 404879463 406608781 406413574 406118710 406085016 406556535 404334634 399524837
14266 399524837 392217636 382519567 371453928 359817380 346893847 333360582 319510519
14259 319510519 305485021 291488439 277353880 263835064 250555518 237962202 226277222
14252 226277222 215395042 204400008 194293162 184166121 175224021 166250160 158050642
14245 158050642 150665302 143269842 136765889 129977586 123883314 118126290 112752280 107944642
14237 107944642 103842594 98969766 94569534 90479342 86597551 83337979 80592685 77116543
14229 77116543 73981304 71144500 68025842 65999553 63331634 61073458 59055857 56662894
14221 56662894 54904986 53281384 51273201 49687774 48238812 46153151 44842496 43579627
14213 43579627 42900653 41322029 39963441 38780313 37655646 36510496 36018819 35448966
14205 35448966 33915338 32241265 31735222 30877427 30171791 29605313 28639729 28042493 27308528
14196 27308528 26313986 25556915 25295458 24870051 24033880 23523250 22578399 22342784 21721397
14187 21721397 21567505 20606418 20174589 20089860 19744073 19268335 18291520 18185345 18214253 17839867
14177 17839867 17182324 16809575 16677977 16132990 15904084 15020523 15329675 14806609 14483400
14168 14483400 14144928 14038370 13555592 13196379 13244975 13203221 12935725 12533433 12429561 11987747
14158 11987747 11968879 11726957 11710874 11546369 11443765 11198185 10465440 10687101 10694922 10078654
14148 10078654 10241755 9810117 9875602 9930195 9584934 9163874 9085992 9017044 8943084 9189681
14138 9189681 8521883 8612013 8562677 8233055 8294884 8241334 7965383 8043820 7922466 7573722
14128 7573722 7578249 7592294 7044494 7223294 7103128 6765504 6962376 6598437 6587540 6641447
14118 6641447 6433467 6912388 6214503 6184440 6120104 6235378 5968250 6028666 6249887 5882729
14108 5882729 5751406 5256915 5578190 5648329 5609361 5575777 5569602 5135409 5146127 5589895
14098 5589895 5175673 5204161 4681158 5041608 4590011 4848221 4845020 4535040 4603164 4489111
14088 4489111 4526458 4457298 4749203 4453505 4384231 4416112 4050515 4233265 4484359 4275170
14078 4275170 4083186 3870428 4021265 3983874 3713721 3956553 4049006 4071096 4006560 3598808
14068 3598808 3474766 3505770 3835744 3481028 3890742 3669648 4072659 3363078 3723436 3486652
14058 3486652 3665582 3776943 3471155 3601439 3296769 3160220 3467400 3006367 3143166
14049 3143166 3098019 2941268 2914996 2780670 2862591 3195973 3246321 3001701 2999198 2637856
14039 2637856 2772855 2905659 2800061 2741670 2575595 2894824 2519948 2874820 2585224 2715137
14029 2715137 2344437 2880493 2509765 2771647 2374203 2350751 2630415 2692664 2403870 2133282
14019 2133282 2320187 2412698 2112042 1950334 2206895 2086541 2287603 2163807 2420894 1973096
14009 1973096 2043427 1944335 2105789 2186049 1986327 2188927 1991666 1984530 1940704 1960890 1682754
13998 1682754 2066271 1773601 1757941 1959917 1995617 2094305 2129640 2250695 2447231 3816070
13988 3816070 6475867 11428165 24033837 43439234 26199211 11443099 6560332 5017185
13980 5017185 4209748 3650640 2985616 3063800 2618831 2656322 2224706 2199967 2299514 2194118
13970 2194118 1923532 2316165 2119304 2257896 2020570 1864037 1965683 1779298 2022155
13961 2022155 2020553 2051386 1485919 1876183 1728004 1780104 1853978 1825976 1691607 1672726 1658138
13950 1658138 1318733 1882531 1480167 1800729 1994872 1337622 1510790 1793803 1480917
13941 1480917 1755988 1924388 1544967 1415917 1678729 1386477 1313141 1507369 1472725 1433172
13931 1433172 1491265 1498509 1431776 1130948 1164990 1384234 1348789 1342041 1537095 1408670 1433739
13920 1433739 1258331 1339649 1212434 1457247 1254468 1115157 1065916 1385425 1461543 1320081
13910 1320081 1027761 1594457 1376268 1215968 1269055 1383302 1257695 1623599 832328 1244402
13900 1244402 1021062 1294784 1130879 1362321 1380464 955579 1388951 1463810 1109921 1153712
13890 1153712 1295690 1078701 1134871 966752 974502 1111558 906929 1292412 1170158 1125373
13880 1125373 1045142 922180 820465 958770 738782 753608 874515 882008 986514 1042585
13870 1042585 888142 844862 994768 743378 1030783 709648 896018 1105890 998120 1029735
13860 1029735 629763 1110575 844981 541065 768871 1115976 317291 922726 945387 1039311
13850 1039311 766717 831044 1089601 895744 687308 803750 1270013 1041980 1076330 1157920
13840 1157920 842465 554665 819963 782506 1117130 980337 1252351 1379078 842075 757196
13830 757196 753810 848278 806082 834738 854757 944935 707901 836788 605085 928671 639915
13819 639915 725274 889444 883143 976240 848800 704777 623344 864606 582422 750140
13809 750140 769616 601069 782061 765671 674475 636408 459683 723191 961082 442510
13798 574116 851084 404475 833611 628987 1101804 611721 628330 573560 514637 842123
13788 842123 589711 865729 884778 695183 817549 755788 637753 942028 612647 374323
13778 374323 879611 539755 642229 618081 413957 751984 703893 591149 551632 618646
13768 618646 325436 992275 535396 581321 926472 816340 1010365 684366 386855 650876
13758 650876 671860 248308 554210 511253 497027 341509 404349 558108 496446 314854
13748 314854 492004 302578 703829 561815 895687 461300 614352 330620 398884 619113
13738 619113 201528 567131 778073 840167 570518 477530 357762 407053 609986 333191
13728 333191 561448 376831 473085 681695 638179 613620 413621 666780 377731 425048
13718 425048 508694 166706 458001 441620 341058 319749 599854 606422 166720 447622
13708 447622 385240 419781 291794 692624 528992 166440 214228 513785 373308 539462
13698 539462 544511 517107 534545 290521 329554 385752 330818 692532 722012 217402 98367
13686 408099 344226 441539 336281 319724 579929 562590 323293 -36884 446371 569841
13676 569841 242680 641500 551982 502100 319715 324818 604304 312287 447584 368195
13666 368195 190389 403650 349322 496783 508469 235488 414078 276928 652629 431087
13656 431087 767631 428687 639030 209629 555076 119729 191483 464005 359060 668393
13646 668393 335941 426084 307509 90780 165112 493623 606945 348311 444379 296395
13636 296395 468120 256786 222843 365847 93512 -126946 439333 172596 250175 352994
13626 352994 391666 234882 439923 161875 516828 486041 161229 72461 190336 196705
13616 196705 322317 595969 518090 361187 574230 516221 267846 637374 312946 127154
13605 214990 342489 507538 283929 379282 372206 209083 174415 345453 298202 20246 264430
13594 264430 325780 302888 282029 306990 147340 179957 389135 264128 535355 298928
13584 298928 309914 103734 489315 320158 580900 412952 223936 -174360 157235 380776
13574 380776 136168 546441 166373 -254107 392282 534587 278935 539833 134008 466030
13564 466030 458687 -13500 403504 424901 312189 296556 551670 33361 525832 410657 137224
13552 -101243 -13938 287250 390966 107821 470003 204647 483225 287660 532760 317151
13542 317151 -31375 333741 117320 118825 140269 293271 201373 275076 -61486 42792 386901
13531 386901 24090 562040 74888 404776 342395 147771 -20601 208800 333618 213135
13521 213135 197669 588647 212517 185304 125721 133439 167763 302559 196414 457346 49124
13509 350642 549704 154662 122552 190515 278456 53018 166524 248786 356651 304031 165379
13498 165379 348066 -15035 -104409 157737 301882 375629 -40034 -12668 438420 75404 259451
13487 259451 -64272 409923 21698 -152368 400990 421840 219749 275312 82226 139046 166579
13476 166579 221084 223213 140719 170428 230699 361386 440879 247542 -59378 337565 -46501
13464 246085 337284 133845 -1301 322402 216648 40067 34014 449975 421563 51642 164299
13453 164299 44546 233439 134989 395288 289919 -87097 374614 124287 79546 146936
13443 146936 120161 6694 402088 -20479 17483 17710 225323 -35277 244406 247305 522182
13432 522182 123315 84552 456073 407283 375585 329514 124904 436720 -38029 -36479 161594
13420 47600 -147375 254160 221874 202613 -78588 306896 173524 -87252 17344 459482 313779
13409 313779 150533 339539 97964 244784 22960 236571 252173 82005 181743 43995 71644
13398 71644 201214 419658 276475 79578 384243 102605 125194 451728 418272 -223903
13387 82187 187737 -47727 351136 -134088 11489 44322 235969 -284014 -61666 327280
13376 77870 284002 557118 206422 86100 20899 190056 336284 629514 -57784 20840
13365 87725 309294 56400 373482 20241 553206 185340 196697 124166 211348 180818 288796
13354 288796 44629 180251 101234 219292 341270 227055 364434 200939 366939 59463
13343 189077 441312 342295 100006 382662 473372 133173 -59249 264052 554774 95107
13332 117689 175587 -235816 241669 308011 209251 146039 143483 11573 190125 138114 -17721
13320 -13393 139020 61974 -6781 330621 159584 177595 163709 227949 111512 -59127 91154
13308 65254 283175 100614 423157 -119701 316373 42270 26762 82239 74995 270091 103994
13296 134880 111072 68066 48567 -147052 213331 345259 -202657 47356 101648 404397
13286 404397 -112330 -202948 -215611 141345 -41285 47960 283248 104720 170451 90819 453670
13275 453670 -23781 -187513 45456 199737 47951 -124548 25135 -33685 273277 415367
13265 415367 -17786 -56855 -186972 340198 134755 63708 153722 -32611 126820 96173 -126125
13253 -12137 313219 128805 133578 129180 243451 307082 423162 -68535 145126 -126093 25899
13241 142349 -44916 320808 327699 41928 206488 -88861 245112 357850 125951 -20074 -228201
13230 -228201 151739 124312 -53990 194116 299071 159733 44231 -11824 29625 323 112565
13219 112565 158092 280258 143702 196391 -79191 -198587 223550 120438 -26340 -180506
13209 -180506 280589 -20407 406597 -175520 32336 193114 292292 -11151 143898 -280459
13198 -224780 46386 54580 292152 215727 -141735 275101 105416 -2090 63721 323725 -65460
13186 -318966 111778 134254 217807 -418079 -53233 -23684 99967 449186 200541 -13941 -211445
13175 -211445 132857 141386 98121 155206 95451 200317 -73222 36565 8006 21169 44510
13164 44510 316891 58823 26251 439935 411545 50241 -64042 92247 446567 117646 260008
13153 260008 -27094 219225 114176 178073 -15738 395871 -173467 154562 246578 149023
13143 149023 11871 126669 110216 -19755 -349858 -55265 223500 138098 320735 193625
13133 193625 59073 377750 179490 276926 262997 32606 186578 194393 167844 182036 -147780
13121 117209 -25636 -194977 123477 317789 -136754 -111877 99012 156904 -134556 339875
13110 172088 19010 35670 252355 249155 44155 -34867 -36236 6750 -11496 31831 -222363 98296
13097 34866 -224361 -244225 21708 -332390 589953 -285238 -102241 90967 -80071 244120
13086 -58809 -30772 145687 -148513 39939 187070 273155 8148 -64575 175697 -172619 58951
13074 -139109 423557 19610 235190 -26229 132489 226441 299984 91755 134838 -97562 -36240
13062 39909 172343 89979 149770 212314 325067 276150 -91231 162830 149092 -291987 86340
13050 -102313 402160 60578 108609 114795 91568 -41408 333744 521541 -150428 -242508 -28860
13038 224787 146113 180417 94391 -135104 54395 53054 935 52859 72404 -40906 -134504 132908
13025 184813 -142656 112896 -70713 109555 59699 242622 -27669 27502 -114940 206404
13014 -120920 207367 388971 204644 228004 197739 -85016 -42647 7051 -151071 -28287 130904
13002 117857 -107409 428341 -34329 5047 22070 174328 -226604 159715 288718 8946 106863
12991 106863 227605 -251631 145305 198520 145720 287943 181342 -79152 141111 -15420
12980 148901 52086 -355903 17766 284768 93007 134804 -82654 10665 -208797 -16946 167920
12968 16107 -159204 -277024 404420 102963 -133032 -2856 272859 261619 176115 20552 -87234
12956 -56800 -188838 -18432 -284441 -170843 -60638 75064 192654 -113276 -75290 -152782 96985
12944 1489 -680 -227734 -3080 207782 -160929 385181 14535 164708 -16725 49597 -126824
12932 389287 177550 -1101 -37014 17036 269643 60639 5306 66243 103561 3090 -92027 -44302
12919 83916 198113 -185414 -150809 -50197 14110 368133 -51979 -257838 -183768 48655 -92693
12907 -152033 -190299 56513 245167 239305 309270 69084 70204 -140827 26982 989 -220967 22686
12894 -49250 267563 -6915 15925 40562 -122442 262958 194734 -63839 -290595 106913 38057
12882 2419 145303 22799 -132428 -315296 93423 -103161 149581 -106657 193425 -79717
12871 275456 55413 -26465 197558 94767 -181544 -85564 -100584 -66964 101001 91371 -24556
12859 122167 -288224 71971 19836 -113654 22326 -110830 157818 -35748 -401277 -17384
12848 -152865 -29618 105473 -529581 -66156 146455 264380 -141020 301091 142022 -50500
12837 -284545 -114249 -59702 483822 -111596 285574 610 -3146 -59188 129808 142545 312038
12826 312038 -38 -232424 38629 -210231 -125760 -18152 -123538 140921 -94079 -19684 -79259
12815 -79259 168062 226575 -257688 -202357 -34453 225258 -68383 183477 379375 19206 -244717
12803 -98891 -10536 -10091 96873 170582 167135 120768 -6660 -193495 1100 133512 83730 -281974
12790 -159471 5603 -44000 -239255 190367 99089 110602 -415736 127120 83747 22053 -44809
12778 187749 -97302 334962 378327 -266389 88468 -76485 -60719 74773 -355644 -202782 111088
12766 120482 219063 97507 -71968 -70847 213873 35962 87329 51527 161440 292322 -166556
12754 80013 -150765 386149 200369 -123976 -91907 13758 -87200 90664 -186996 -22324 -64282
12743 -64282 36756 -38517 -130359 378297 339481 55098 644181 100145 508037 -80566 -102261
12732 -102261 138296 7935 201813 56285 16828 10122 98281 -2192 -140212 230156 66774
12720 247570 109868 -63491 -100321 166998 -224530 -8182 89599 193757 230203 118974 186948
12709 186948 549030 -139083 393270 87692 171312 168474 171556 -85998 -78439 372046 45799
12697 -204971 268831 -285014 34896 91514 -299376 -210938 -246794 -38842 -123662 -154209 480557
12685 19420 -413427 -155311 321736 -242031 220852 491167 7482 282967 529147 234149
12674 -21161 31832 -5706 155223 -3210 241636 53666 14444 25333 -226514 -31546 -174420
12663 -174420 50249 6401 -200810 -213305 -36900 42490 100916 295265 441701 153829 162195
12652 162195 -328308 161221 -26952 210766 266137 5151 -241818 -109968 84556 -43581 47874
12640 196762 321232 -51556 385163 86471 396028 -245387 -1352 -56900 105109 3010 190175
12629 190175 196482 82090 336271 -326489 246488 46851 236021 489265 209054 99370
12618 192936 90566 257597 162215 -91717 164207 -26320 97483 -284337 -254368 57976 109892
12607 109892 -30551 55262 307502 -138352 -245072 -122867 25769 213035 266663 -38059
12596 46168 349424 -455769 270547 197488 45603 -126744 501079 5956 -40517 92630 38778
12584 -249174 924 -6696 -95329 -33185 195970 -144372 -280095 -42456 204495 -6594 138345
12572 10529 85312 40800 -59301 -46443 -187810 -252815 8924 -167810 160156 77534 -60289
12560 261825 -65415 -43461 211898 -115775 7126 86326 -17298 67546 189053 -35774 259556
12548 -235043 -19764 74168 -110995 51706 364923 197613 180403 121024 23229 -76070 -114142
12537 -114142 -294828 274076 -149132 -106701 14416 -37390 87278 89362 29779 -35166 152838
12525 -223983 14215 228198 52180 9176 -116446 -93146 -23297 83220 169858 -106280 33120
12513 -33610 41311 45436 230173 89541 20990 37327 -316867 185697 171748 78070 -122797
12501 317131 212157 -54727 -10326 -458864 30840 46600 -129903 27036 -26213 184963 104636
12490 104636 48897 -96448 -194027 81039 -152041 33346 -66795 103159 46569 46521 -248294
12478 16338 -209511 -279664 -113992 -244961 4878 -128160 321905 -506553 -15021 84755 -337333
12466 -85859 -175763 120010 -68153 -185945 -95240 -165420 255840 -90165 -181497 148530 331886
12455 331886 -147313 -182661 277908 -157337 289196 144672 141456 -40196 -313344 334992
12444 -164223 -63491 92014 90825 84674 97615 24639 106648 170005 -116798 -202928 173853
12432 -73971 187698 -196287 -39371 -150006 25508 24204 -108341 14532 -112994 98904 63221
12421 63221 -99630 -56899 -55332 52108 144074 -355305 78505 94167 208675 -238968 -156908
12410 -156908 71432 -216069 -141998 120749 35907 141580 -42285 222764 180464 -158455
12399 -266017 -72719 -22863 194517 -1603 -118728 -198226 31234 -345613 -146798 -290773 342560
12387 6801 -317030 122156 -70621 -98018 265223 179793 -213171 271887 -86428 1783 -29443
12375 -210264 189205 39511 166681 -234251 -57980 -98764 -192013 -27185 -75597 -185666 208285
12363 116597 165678 -103886 -79649 -124936 -25270 79851 -158583 -188750 -214720 53464 -8302
12351 53828 -190326 123292 3254 29920 -18259 51325 -18430 151099 -113860 -110860 278950
12339 45991 164381 230842 -329012 54272 1456 81234 804 -293155 510284 -201144 54866
12327 -92705 91969 -221180 33673 47745 316983 58590 -37161 115095 -58097 29377 -27444
12315 -101029 204623 289871 -300264 78949 310785 -57865 209451 -15082 6852 56223 36648
12304 36648 -71267 458985 -585 302522 208850 47033 -120769 156409 32402 -73910 -389778
12293 -389778 -130781 94399 323110 271457 168751 56361 86175 305684 148619 -100326
12282 -17779 183000 -212814 -24187 -5969 270582 203506 52131 158913 216704 385376 38049
12270 532941 201518 213808 404353 173167 105098 319910 52117 1451 -165746 220701
12259 307610 128237 83114 -278163 -181426 -210760 182625 -64845 20386 -1707 -66129 -100020
12248 -100020 244627 70588 509199 -98512 126218 34640 112159 222548 109816 -397206
12237 -21262 5434 -105718 42320 1609 -31410 376870 12523 111360 57351 3081 107273 -5603
12224 165622 384836 290762 38072 -194979 315899 144113 383796 86400 129432 266864
12214 266864 150063 -12983 116507 31458 -4432 -109891 -342532 229014 150121 195404 -33678
12202 7111 143625 278744 -164120 418729 622 377930 -73108 -98090 32924 252397 53430
12190 -304120 357774 368766 157087 -175441 -209908 156056 93952 51950 222148 23855
12179 94535 220262 110000 -69448 324690 -209781 -63804 268610 347585 319643 8384 -68275
12167 308953 263611 175552 347588 13764 409406 -143480 458027 275359 24083 111775
12157 111775 152319 277382 -153374 -62302 21958 261533 67244 -287586 -24289 -56678 -136979
12146 -136979 -101119 118434 -110008 -82432 -152098 295334 5756 3098 148045 143830 299928
12135 299928 220674 -233725 132844 -94373 -74191 -5487 -92901 -53523 -70770 -211548 24779
12123 82598 112889 -250904 -306461 -6279 54018 -112395 -318319 -168056 -17172 -32017 223462
12111 -129309 185557 -342345 57182 105688 212550 -196669 -169076 200994 -21790 24706
12100 -102930 110319 -71620 356218 106044 -292807 146385 121595 96721 213152 -44654
12089 146956 -160683 131029 79043 10442 95590 38609 -222047 125437 528686 566595
12079 566595 890831 2030373 1247502 149575 254218 -413588 198330 -161519 -121715 152830
12068 -1908 -90804 -114121 40099 146097 -205260 278415 270530 46356 176777 82551 127180
12057 127180 124755 -96111 -51719 308792 161461 96244 15672 174139 -44589 -415916 -178513
12045 -170803 3652 -6123 125675 27450 196556 -217144 30344 275913 7423 -25870 -185775
12034 -185775 -108438 82634 -40155 -38031 151883 202140 96227 195409 186615 -135501 -29345
12022 127431 18732 -291251 -306251 -261573 -62072 266508 365537 148219 156424 -61798 757
12010 167849 28260 46375 36530 53033 232455 263896 91030 -236773 45896 -102893 -120648
11999 -120648 -73325 -61769 -93636 388702 -107876 -22818 102035 150817 -209074 -74013 -115099
11988 -115099 8499 -327145 53300 -47156 -18991 -60399 -93819 82035 -60441 -32563 -106510
11977 -106510 164004 -12357 186496 63455 135884 199105 12458 -381150 -58630 -18320 157468
11965 102570 -492395 -269030 58588 97261 52440 -231740 -154383 81316 122154 101285 47219
11953 282200 -45946 180373 -105462 -259282 -264685 -240186 -288031 138090 -252224 -75484 41451
11941 289800 -233673 324516 -159698 -101240 216180 -138661 -168724 180548 -11022 -71194
11931 -71194 -243522 -131159 -239150 45405 233835 -4873 -193172 -7431 90171 27125 -150239
11919 -132820 48986 69873 2679 -111830 -75814 -203842 90065 218578 -1645 150059 48526
11907 -13278 -70118 7242 68257 -445712 19982 -47957 91838 -290768 -103624 -168801 232745
11895 -177918 -58481 -233183 65084 113449 103263 -95323 204472 77730 69739 54039 -200011
11883 -4483 -107142 -38543 -347339 -217827 -280957 59725 136153 -154921 -164780 140091 -154581
11871 137160 -308914 -71868 253208 193245 129700 20096 -39429 -80190 -7488 -160063 -21409
11859 -180211 300138 -255925 -97667 -53002 -11118 -1925 134764 -273328 -101428 114297
11848 95690 162623 -55752 -340403 295 -134114 -365546 -111864 -97496 -82568 -29490 -171877
11837 -171877 -139363 134549 -220505 56970 -170908 248721 2312 -301744 164139 -50966
11826 259615 53086 -48132 -134434 -122560 115949 -154615 76785 -64247 130315 32350 -110962
11814 -180116 -126803 -323189 31617 28388 -141885 278704 -42623 -112393 -267645 -139097 266767
11802 -157523 73126 48542 -162254 174031 73439 -92982 -334799 -101180 352911 188833
11792 188833 298735 -103246 -149831 58798 81435 -97324 -19014 208911 -188454 10419 -34057
11780 -348205 -100540 230851 30579 7172 -55915 -196361 -135949 -170401 76736 114510 -113603
11768 -76648 -2303 -12030 177165 -106854 -157734 139360 153938 309707 21883 -425408 -43079
11756 -162660 -138091 -112727 209873 70284 -86689 -75567 101428 206551 11843 -60591 42063
11744 53326 189471 221959 -275229 -304875 190054 -156040 20961 -381516 111792 -187149
11733 -148657 223042 -10409 35683 129887 -143711 160481 261387 -277605 -247443 -3880 51531
11721 138756 222844 143746 -53445 192133 154002 32151 3767 4613 118955 86368 128826 167790
11709 167790 49169 -29158 297883 241255 30724 -15474 109980 -188385 -232673 -189389 371551
11697 34219 458720 108366 -85944 112287 -217859 -229750 48515 55810 183919 -289958 -4194
11685 62357 282781 113209 -272637 -122904 23590 199260 -11129 145090 360433 69416
11674 -198943 22439 92775 405126 147403 191826 71772 -46523 208148 -65414 121065 -137633
11662 -92717 -72281 -176096 181660 -111667 43587 310113 335164 41007 154670 112299 -34877
11650 -128329 -177620 63018 300635 140607 -150006 214337 487110 -49097 -321813 -207721
11640 -207721 85430 259344 -97392 -260216 -265446 8829 -122131 8205 5083 27221 62816 235762
11628 235762 200443 464681 -15894 -82997 190104 179685 33123 -46751 -146325 -194591 -49134
11616 -200393 -194751 -131772 91215 -68548 82511 65680 194696 136542 -194283 247806 137843
11605 137843 159144 -11648 -379687 -19448 -25638 -18775 -92566 152807 -33856 72 82547 321384
11593 321384 -110708 283534 -130923 -7372 -80271 131051 151551 61609 -261972 201771
11582 -183930 498584 193569 334255 -246659 213766 50492 217698 220658 -15184 -20113 229266
11570 -132630 394780 126745 97720 -209619 -277208 -60848 -213238 173128 69489 138785
11560 138785 252223 -130348 63447 -268029 -15454 100598 -157588 7016 92471 -232767
11549 -80013 -167852 58857 -45690 -5943 484847 139802 216311 232562 476467 203439 10541
11537 177616 240788 -121640 36235 279950 141581 -201619 314766 132155 -157891 27393
11526 -174084 117728 227524 -226905 -218928 3518 184185 27045 66914 127328 42539 264542
11515 264542 224125 143293 287456 148711 -103554 99509 372759 67211 156413 187809 -208272
11503 -99989 232625 182767 66225 226644 -19243 132943 -327396 92933 -68197 -164807 -25090
11491 444384 115778 131071 -30635 58816 236893 151473 -199905 -81501 291737 99653 83354
11480 83354 283716 -18348 235062 472767 241816 144935 218510 215712 342979 269417 36654
11468 63324 139681 -191473 -78740 240443 356485 116090 52338 66501 205034 81870 -369847
11456 227842 -26079 105441 258510 -73669 172100 178314 -108679 164749 156110 -37408 16410
11444 676 -143307 -87023 -326183 195132 -186965 42323 33110 -128479 -144995 295148 277610
11433 277610 188955 -87746 -87748 185123 94538 -110185 -187717 -117977 363 260174 -254169 81409
11420 246108 -301143 -197984 244018 -154326 -139148 -289914 5768 148780 17008 -21982
11409 87930 -460861 -166050 -2799 171972 454619 446823 121262 -103216 -72878 19458 336921
11398 336921 201882 -158583 -33079 -43096 -126117 11416 266966 -101601 -19509 88452 48371
11387 48371 60082 -22208 418339 168957 7196 -69511 11090 102056 -53301 -378402 -279201
11376 -279201 131873 72404 -131916 109733 128332 67618 296957 -71886 -167074 -3758 -306431
11365 -306431 26778 -264923 229016 148387 155502 1472 -101919 -99093 74109 201489 -119845
11353 -32432 -72587 -31156 -92752 145325 217640 -71546 -33023 129672 -21764 59740 54213
11342 54213 20527 -101421 -192135 -26225 -44074 -139415 126977 -197166 61004 -90140 251984
11330 -145668 108944 96119 154691 -214116 -199180 -34850 -158547 170857 -181090 191599
11319 -198087 96225 105619 252688 74963 -25192 -75536 86610 185051 135579 29933 120754
11308 120754 -103855 -17238 -98054 34290 -99154 -19610 138634 145466 -64467 -183849 179084
11296 179286 -34253 -87648 -60129 175454 -193517 161663 -68328 -156090 54149 -13395 -301572
11285 -301572 -148838 343909 3075 -245268 -97440 -425671 -245524 -120943 142493 -306083
11274 288437 -316856 -14183 70185 -141583 484972 245313 -309873 -27400 -148205 -134630
11264 -134630 167454 -106381 50561 -42882 -85051 -136159 283346 272036 104414 142661 -84055
11252 -13907 230252 -70430 315235 269497 -21933 -141812 -338384 -1673 -33704 -6521 -193049
11241 -193049 133796 -233228 83817 -75717 -184803 -140754 50466 -94447 36450 -189494 -277651
11230 -277651 -2046 -1639 320142 19219 -180470 121709 -112796 8094 -88082 25837 89148
11219 89148 -267935 30783 73733 -307943 -132830 -45305 -493753 120475 -173689 -83498
11208 -205183 54989 -70798 -60209 -223539 42527 71266 -7333 248739 -213619 -275339 -275174
11197 -275174 43624 -222446 -248445 60985 -30118 -187207 -23792 247546 120793 -233282
11186 -370463 -142533 -225693 -171729 -88460 59594 36643 -250271 88816 107784 343734 55741
11174 36833 124021 44065 -308564 147872 -40634 86126 -267730 -24855 131387 273328 -148028
11162 56574 40076 81972 133164 -120203 -253294 339973 382587 -99528 157759 33438 -118814
11150 19319 120681 -45634 -225347 211661 129070 -84843 -15397 184932 134401 -10871 -377209
11139 -377209 -16704 136987 -138363 75446 64656 -118888 96167 -11615 -531527 -249703
11128 -40890 -90668 56106 -64105 147152 -49002 -90086 -185437 56812 147278 -199182 -254691
11117 -254691 116266 277832 140866 57563 38612 385808 89462 46026 -176598 -23369
11106 -179924 -38960 448493 -55995 220843 17312 185455 -91959 455084 -137527 -148750
11096 -148750 271549 575738 -122707 -16352 -127405 124517 137383 284461 216408 119644
11086 119644 409421 286116 253687 381938 208351 517110 447304 258815 62630 296972
11076 296972 408406 195886 344379 178446 342565 549177 -86527 258437 428194 630832
11066 630832 475511 296617 274775 227998 595153 522261 372275 589190 421099 769118
11056 769118 427445 411718 589862 769807 684622 799170 615596 571001 661565 406259
11046 406259 526042 888289 599961 602937 723849 475056 791227 812415 939162 673398
11036 673398 502572 329617 517145 524365 411345 481059 414840 744583 510729 849825
11026 849825 395468 892478 562331 779939 266318 927248 468187 437904 616791 388122
11016 388122 377083 482735 580489 555739 550394 302317 361841 450990 876137 460615 394175
11005 394175 749150 506887 579513 892285 640800 229732 590122 796790 433865 700328
10995 700328 621860 543175 627948 546263 646973 969770 667457 388482 634158 766831
10985 766831 781935 927354 816661 1069718 1010563 1041600 1274896 1237471 1667279 1400001
10975 1400001 1541132 1882700 2201968 2441731 2648597 2585888 2380857 2194355 2158744 2048812
10965 2048812 2039500 1787092 1721234 1602371 1680495 1519963 1257866 1757623 1843813 1824113
10955 1824113 1911119 1563754 1487620 1692759 1315860 960863 1153430 715466 405489 596619
10945 596619 263828 216353 502047 279862 21357 495131 134975 354952 175083 279936
10935 279936 77233 -111538 207006 212121 -20462 251322 114643 -238558 -89827 107137
10924 -109695 -206928 -48033 47097 -180419 164915 121605 419547 -97667 105083 -16501 41955
10912 -290674 99433 334603 181617 -35326 -72105 65111 -175580 -245548 -312232 -75091 128732
10900 -283040 167284 -187318 95456 144608 -63259 163958 -316138 -169305 171551 -20497
10889 322898 -184438 69797 -82621 159576 -163880 75168 11975 211075 40534 279227
10879 279227 287308 -167851 256858 -39570 110652 297754 -182637 69841 -13847 -296538
10869 -296538 244979 56639 -45197 -113128 212057 -50520 -374845 -1209 -15681 36561 -104327
10857 -108596 -18646 34122 21310 -74389 116800 -172618 128248 147462 -6382 -315330 -146494
10845 30931 -180369 -69637 216251 -137346 -173208 77144 -128977 28966 -318427 74519 31761
10833 -27018 -396087 -57220 -23978 4365 51025 -158824 -101330 -104221 -36067 5963 -228390 -170383
10821 -170383 428876 -46540 41961 166406 -126683 -9396 -76397 -123429 -182652 -157477 -160849
10810 -160849 199764 -323990 27020 46198 224962 -106899 230540 63536 -141699 -390009
10800 -390009 353902 -200848 -265263 -36113 69868 -251384 -353569 -179036 -168044 26941
10789 -75256 -12427 -217677 -161378 -116952 -72 -198864 141639 179696 -116563 185917 -40822
10777 176523 58123 -57958 84627 37011 -379100 92501 -56911 -9259 -288805 93197 129349
10766 129349 424340 -216189 62072 -91683 63987 -273679 -383219 179948 -55666 63138
10755 -160066 68794 17859 117188 -3670 518 -48133 -161124 -256322 194377 -207386 27858
10743 -118528 36932 231610 60344 -275137 -223224 197137 164514 97043 256168 102095
10732 81993 -70711 -120714 -25312 -124044 51361 267811 -19724 277881 -5617 -62274 -345691
10721 -345691 -125767 48119 54861 -277302 -325999 -94713 -129789 53739 97923 183660 -51909
10709 -154637 13265 100065 -43747 -89594 90176 91695 -191037 -147762 21651 -400412 -40304
10697 -175439 -164652 -136835 -285287 -14380 -30791 180929 -177233 -161594 -225187 27682 -224000
10685 -62020 98868 -336115 -292129 -92536 -124005 -66553 103047 -78620 -73957 27733 -325293
10673 -208066 -20928 -103592 219887 -23863 -442673 -186026 61533 -163091 136471 -152963
10662 132570 127445 -146758 -240454 -86935 -99585 -58960 -146878 48493 157648 -259931 194063
10650 -164850 -122688 9011 -97915 197730 -404876 172255 -130994 155052 139606 23730 -61484
10638 -358130 -186301 -83598 92059 -85751 -342569 283678 48527 55766 -158484 -43243 -234722
10627 -234722 -88854 -91386 173978 89100 60676 -214038 56237 23023 39283 109048 -74287
10615 -13204 432335 -77698 195751 30292 114871 -58091 -314495 -2185 -182393 2960 12695
10604 12695 363168 -163237 289481 -280475 -76732 102046 -312411 66754 -228176 -122936
10594 -122936 41440 -236818 -201648 233282 -84563 -249641 449656 -50043 61281 -101667
10583 -165980 -26752 73720 14512 90356 8565 358184 195299 177145 100404 178465 108988
10572 108988 -245634 -35201 -173716 -215662 -196625 -379936 214496 72961 -34362 93691 235783
10561 235783 -80479 139852 -33516 -143130 111433 -247573 -29592 -30966 99886 -189686 34995
10549 -390551 232314 44970 205740 30243 -497812 -66732 -185493 142312 -4216 -663077
10539 -663077 -218415 156804 -298710 183886 -97155 -54317 -206303 -109023 1655 -161050
10528 123737 -255663 -96476 131467 29546 71878 -22259 -72745 169830 -341809 36777 -243174
10516 225072 103045 -117052 165696 43799 -84457 -283530 -103144 -195119 -126928 -251476
10506 -251476 -327262 75789 41955 -38232 410048 -220583 -152753 55769 18745 -199732 66046
10494 185272 -288750 -32858 -83204 -107442 2366 -347777 -13749 227124 194669 131031 -75153
10482 134030 360266 573092 -2926 463632 687938 486746 391197 45135 125386 -211865
10471 78496 245495 -234430 38142 245053 352357 -224358 29153 -204671 -339338 96279
10460 96562 -54060 -73330 -195731 129301 -156624 167641 23167 136487 216094 191818 -255516
10448 -45777 -331932 121800 -101206 109322 44426 -298439 284051 48017 -40381 129822
10437 189290 -61731 -96864 -265919 126619 -135441 -380141 -40894 21427 -187084 -149813
10427 -149813 -415884 261722 157929 3611 161358 -62506 -160425 56655 -102412 -46354 102877
10415 35763 -252527 -93210 18676 105969 536278 -200553 -261381 -16169 220631 97044 -160969
10403 207884 56925 -223336 -258776 146403 16459 265858 -275188 9708 -153943 -174702 299888
10391 219782 182846 -128022 283776 527414 -118290 -155636 398149 -201945 170273 -94415
10380 228616 -73071 186738 104273 248344 278736 257673 231479 246278 539639 596773 160746
10368 334794 115124 151449 572958 622495 351293 286935 111578 276880 194109 144699
10358 144699 330963 286189 459270 -140691 341469 208226 174463 -123275 605330 497965
10348 497965 298041 196613 335115 412467 397856 416592 455457 87663 318707 -985 515251
10336 415224 26967 157716 101764 177209 99850 -30823 167487 -313102 -169450 -28981 -75648
10325 -75648 35129 -245912 -69184 -311888 421625 103051 -89745 86791 -93840 357169 62950
10313 135909 -206376 -106237 -87697 -73332 -8249 52626 -215895 -90650 -361993 151639 80400
10302 80400 74594 132387 47943 27498 -55284 142563 -25567 168774 3351 -23512 -84489 1532
10289 -324123 -20108 -26505 308813 -150250 -150301 79588 -196498 373485 -233068 300767 -129275
10277 15171 -25989 -188365 93017 192420 -89198 187276 51907 216263 -370398 294349 229138
10266 229138 119614 -166931 -311241 2771 55996 -253279 141849 282803 29069 199042
10256 199042 494780 225508 42532 218373 79442 -71598 -260877 102327 -210490 188122
10245 193840 -271790 -347755 -52093 115364 -15371 -295028 205746 -354136 462089 -60032
10234 -187075 97099 230276 -94451 149051 -176970 -6633 -262756 244932 -107191 -146978
10224 -146978 -129655 151692 -20263 -71651 -157191 95813 -153634 -195992 -211432 -116012 -147399
10213 -147399 44619 -156663 41270 16037 132632 -132493 -378952 -262525 -70100 72176
10202 16310 -71714 -5061 -63027 85992 -59670 214812 11801 -400908 135690 377149 115653
10190 -210838 -91159 -194400 -8794 -204662 -70539 -218466 -300586 156066 115331 3226 -112369
10178 109598 -240821 330444 -133567 -155314 -267399 -143498 96249 376920 -9404 -198311
10168 -198311 -218999 -118096 54634 37345 -233826 186536 57823 24505 -364188 -82326 -373883
10157 -373883 -358660 -304207 321941 3573 196432 -172 -34521 -165250 -97014 -277937 137085
10145 142340 288560 -27290 -78712 -17763 74145 15369 13740 -130138 13010 -503774 -224940
10133 -254466 -52771 5115 8695 -210583 -215739 61323 -2389 59742 -353083 -80863 37245 -89317
10120 5288 -31400 -380 146396 -100236 -300732 85970 -218909 127305 6034 -10184 -192882
10109 -192882 -117148 73453 -377151 -104867 -268089 2789 151014 -417453 -242598 -147411
10099 -147411 -250639 -116951 -381975 -269288 144765 -213172 82014 116462 184658 28707
10088 -345800 183271 182220 -32656 274875 -88382 -179317 -174147 -392666 -90544 -11686 -290849
10077 -290849 199516 199458 -217497 -17266 -174803 51713 61974 258209 126546 -171791 43994
10065 97939 185507 268420 465674 -72930 38003 365433 -67491 -7003 -293280 -9811 -52970
10054 -52970 -235319 129235 -175647 -244112 94355 -102229 -141713 -135995 -78848 -398948 -43989
10042 -215637 -41192 -52806 -139003 -16491 -1480 -235651 212383 17048 222403 56135 -64442
10030 -179015 -105618 -108150 -26692 210249 -109307 -333124 -174444 122162 45066 -78512 -139366
10019 -139366 342062 232120 159800 -12596 101918 206912 -85446 -180344 -47308 158049
10008 143949 -97055 -396202 -223694 -241907 -181563 -51904 -279493 196819 -234761 -124192
9998 -124192 -102815 -151098 -171808 -72992 157097 6151 -210443 -152545 -445381 39623 276632
9987 276632 -65263 -239006 456749 -76678 -368193 -68198 -140441 -142614 134772 -244661 208474
9975 -403029 158730 -44639 -128984 74256 190486 -520200 -47700 -63272 -101934 20251 -189864
9963 -178221 -409210 110703 -291215 -59879 67035 373221 236169 -240921 -77297 -343073
9953 -343073 -180185 -68501 -170317 -202870 -44784 -235872 -61640 87948 172920 15430 -63206
9941 -124712 -167023 -89059 -162087 189718 -161863 -332949 154031 -127193 111866 -137533
9930 -150136 9445 88516 156665 -79669 253339 -245227 284565 89438 72472 -202642 -127174
9919 -127174 -276748 -214080 -220091 -207483 -172894 -212195 -232233 -380820 -169520 32753 -158206
9907 -233505 118123 78605 -70931 -85958 -48021 -75925 -203684 26125 -181114 -285081 -245237
9896 -245237 -410116 52025 -226769 -73551 -21856 111038 -86561 215689 -9530 203200 -20497
9884 93284 37702 -86719 17512 51765 -502955 170768 -99110 5754 132278 -36574 -116520
9873 -116520 -73312 129168 -66153 -1891 -152692 -116646 243381 -239588 36137 -517031 -19441
9861 -206231 -340546 268283 -18165 -132677 106306 -124003 31713 -113256 130234 -325866
9850 -270327 65562 146702 14830 -203418 158386 -169475 -6681 131659 148308 -84705 -62714
9839 -62714 -172624 -107588 86555 55504 49994 22006 -31538 191174 -61895 146625 32840
9827 122337 -247470 200718 -154121 -203316 -53103 -220892 -198029 -258754 6573 -341038 96324
9815 -436927 -57761 -269954 -179541 -153457 -72587 47988 30961 11794 17550 -182112 -404987
9804 -404987 -309880 -254579 154475 71566 14567 -204360 128299 -163381 -140157 -202231 -9440
9792 -126266 48370 257226 149772 46908 168728 -145540 219150 -119771 -180146 -30361
9781 22316 -485461 -20028 -60321 -132734 -315918 -168478 -183700 33258 121911 -193280 71431
9769 -1371 -110953 -18446 -87146 -104572 -277146 -33259 -190319 -367528 -101867 -3172 -118063
9758 -118063 134594 -368596 -290110 -34661 210483 -251636 -5935 84712 -88448 67161 -279115
9746 280284 -28588 -316613 -56929 -162772 101780 -34796 -320828 -177501 -98779 61919 -270085
9734 7937 -98156 -100714 -179743 -317722 51536 -115200 60424 300693 -71810 -238062 -207994
9723 -207994 81748 -132054 -53618 -139982 -79226 -235365 36843 -119482 -114826 -289262 134585
9711 -142442 -218266 -399439 -99061 -222557 37105 -22210 -246532 -171188 358694 -172858 -180567
9700 -180567 153628 316581 -142879 127231 -180993 -595671 -36185 122344 98760 -103843
9689 -360203 -106522 63641 53436 -225094 -111178 96302 -186444 91495 -349155 -18864 167236
9677 -221686 49078 -20538 -358828 215880 59172 -61759 104989 116134 -134524 -31343 -268326
9666 -268326 -231595 114343 -128249 -301515 144125 124574 -244117 -166203 -105254 -115804 37799
9654 -408622 -314195 -135893 -158462 -234249 -25103 -332877 -105195 -129294 -180304 32206 158422
9643 158422 -294808 67704 185760 -4763 -203820 -95149 173336 -153445 43830 109389 -93282
9631 -78065 -227496 -3539 -437350 -81090 -174086 139130 -208533 148508 -4383 -106817 22650
9619 -331452 285102 -30287 -168394 -384351 -16486 -257819 72191 -64319 -241721 172503
9608 -92904 -159363 -6592 147286 -252342 -95912 -3753 -305156 338651 49097 -89446 -128389
9597 -128389 -186617 -55086 56639 168361 -293561 148412 226582 34660 164702 345908 24910
9585 -150543 1440 97342 57916 24521 -64575 -316387 -312664 -463578 -11120 -335448 -204647
9574 -204647 135545 -106727 -211209 102062 -121050 -61510 -557476 72438 -228362 133529
9563 -232726 -58773 59954 17983 -21955 132368 -445150 -2214 51535 -171510 75937 -36312
9551 -174914 141611 88153 -345603 -216118 -193616 -407015 200554 -231482 -352088 -102197
9540 -35378 12955 237893 -282041 -136698 6286 -206647 -54577 -298889 -394785 -90568 -133066
9529 -133066 -5090 -99070 -87058 -140844 -61344 -9503 82207 40106 126550 -138624 -32244 -592924
9517 -592924 -136487 -255942 113956 -342024 -232194 -98604 -114759 -19910 -112908 -21382 366632
9505 351944 139295 -250808 157154 -434091 -148534 -102164 -35921 265276 20492 74631
9495 74631 -278387 248946 -44073 168330 -233029 -130711 232072 -30493 -312379 -269900
9485 -269900 -393568 -81694 26326 -179114 -93401 -101555 -44218 -158859 -136428 90068 71730
9474 71730 -74714 169040 -17760 -141929 83799 -216457 -217633 39492 -242844 -102763 207831
9462 -114872 -193 36283 317131 -334628 -12546 -93303 -374707 -132774 -443137 -59061 -411637
9451 -411637 -111721 71398 -6590 79393 71059 -244973 42939 252229 -27643 -4183 123147
9439 -210641 11267 -5511 -137447 -20772 -89380 62146 161412 198472 116295 53436 186162
9428 186162 -314647 210133 -226482 82011 149162 -76021 -243908 93540 90094 63062 -445384
9416 58050 -156448 -175845 -160118 200886 -250090 45256 -97249 47633 -177701 36499 286782
9405 286782 -26962 -458017 -407581 47191 -40926 -166068 155419 173021 106313 43368 99593
9394 99593 -67809 -197738 -389010 -170342 -216011 -80547 -177396 -118600 -498380 -4625 -35126
9383 -35126 -262284 -134798 -285355 -265874 106409 -74073 -59243 139289 8454 177625 126882
9372 126882 162589 -84306 -21005 144552 231314 -84646 -182725 -326168 -153962 212673 88779
9360 144693 54106 -269991 110191 -104584 -10829 -151394 -16763 172983 -178708 204808
9349 -60538 -16204 -177690 56899 134790 -118717 230757 277682 -206955 119020 77561 -83097
9337 243044 141048 -115347 -145830 -87181 46845 -28880 103903 194531 -116552 -36559 -48078
9326 -48078 -53131 109844 211618 -243926 -83131 -303116 -331502 -192728 -207662 -19223 -50783
9315 -50783 -156603 -18979 -178405 -108280 -145069 -100299 -133384 -84603 274572 -121429 -83826
9304 -83826 -141204 126444 -127795 -76802 53746 -356551 -127238 -137013 55239 -153358 -3148
9292 -363235 -97771 -98010 -181440 69531 -111050 -79160 -60867 127020 -35424 15314 -109027
9280 -263114 74764 279075 -71861 -122317 33752 -374429 -31443 -51033 447154 -342250 148275
9268 -189650 -2826 -332303 -241125 -190773 45062 -145803 -139330 -49330 -62758 17293 -127647
9256 -5557 -18104 45592 55908 202424 -42745 100621 -169261 -165131 150773 206894 -218597
9244 246331 -423254 -214078 124389 -481600 5052 -109354 -338690 161911 25800 -161307
9233 -279601 102294 -169928 -173054 -402941 -116680 -12209 -74110 -430833 42392 -64133 -13031
9221 5302 -119217 -44894 -152924 -58157 -81640 -99011 -345961 -22923 -4380 314471 -325613
9209 103504 -61280 2092 133631 144980 -222632 -140224 -185623 26684 261180 32265 127731
9198 127731 163497 -326769 228798 -160005 -132385 5137 -173303 -235747 -64574 34279 -43057
9186 -88605 -81085 242441 -132500 -167963 18691 -199959 -191101 313275 -307487 214085 -246296
9174 126006 -12967 65132 -445394 -393352 -23136 228756 -75045 111468 -36975 -30264 52192
9162 -42948 -205386 -1912 206867 -15396 9932 107032 52004 -176520 -90660 -10655 -134987
9151 -134987 106946 -142191 8798 35290 -310880 -23644 47014 -27697 58303 -119426 -63622
9140 -63622 -376138 -25798 13924 -103423 -364804 882 -105558 15358 174661 71617 -363864
9128 -119935 238033 5007 -93476 -60157 -292492 121090 -1703 -123515 -212501 309065 -259791
9116 87138 -180750 -134867 174165 -47753 -117867 -137548 -385206 -83520 -38443 -338767 -19715
9104 113174 29153 90010 -110337 188715 -211442 -224861 127998 -154005 126633 -272220
9093 -232270 -46905 -369164 199952 27421 -21887 -233137 -49767 -299725 -196779 -245489 35041
9081 -301592 -8181 -120554 388261 8207 203830 159061 -50520 -61998 141149 -96807 -45710
9069 -39133 -27251 -453540 54678 -258147 137871 60956 -84351 -296879 -81569 -238014 187717
9057 -315692 -89117 -18036 43883 -102486 226063 16970 67914 114782 25338 204322 -178886
9045 89629 -154475 -152830 -133053 -97944 -341089 20811 -148420 -131940 -273713 -275293 -38550
9033 -124025 -1076 -19525 140960 -70197 90401 -263530 20676 -80765 -206377 -241922 116041
9021 -93429 -193814 35971 -147631 -131486 -433660 24496 -21476 -120639 57465 96434 44196
9009 -18456 -57990 -27508 -72785 63743 -97072 124652 -159294 52419 120551 -201486 -110461
8998 -110461 -80578 10351 20551 -93696 269822 -216749 26838 94010 -100690 -295523 -261410
8987 -261410 -259592 -154238 -293287 -19157 -18010 -9822 29488 159541 -102691 -263604 -67371
8975 1696 141386 -264167 -305185 -312528 -251899 -107797 234280 -6753 -142016 -82130 -13309
8963 137426 -67211 92334 -224076 37536 -23983 85408 277176 41607 -20554 -416547 36255
8951 -83654 -26467 7694 -43040 83951 -165489 -247214 -158842 -102224 -291597 177129 -308919
8939 -129194 -89058 -58550 56469 -156187 317685 -9143 -247350 338875 116266 128693 2424
8927 6564 -21288 235172 295873 871735 1331575 3341669 9605486 4734005 947160 606446
8917 606446 337453 403017 220124 147784 -170083 161589 -357867 -189574 29642 537101
8907 537101 -175275 -47242 -113490 85403 -191348 170515 -25079 -335520 -169469 -332065
8897 -332065 -263333 -69068 98999 -141670 -16827 -118004 -174654 -89494 31602 -53528 -65639
8886 -65639 -29337 63611 10693 -22519 -48010 77662 69092 -91509 74774 128295 128783 -173709
8873 -85414 106221 65271 20316 -350491 166054 -47995 -104864 -84207 158185 142454 73325
8862 73325 -91239 35765 -71365 -44726 63664 -116685 64871 -132918 -15288 -299867 -75575
8850 -14067 -195549 82249 -82411 -248832 -13080 -136409 448030 104107 -147872 -256164
8840 -256164 250831 -252855 182948 276932 -259252 -127108 -200751 -249949 -15067 -538779
8830 -538779 -113769 -78588 311043 -212171 43963 -52581 113579 43532 -155750 -135120 183071
8818 -17131 -252858 181888 191813 -161924 -324146 -11594 134387 -105400 66196 -278660 193082
8806 -60839 128001 -349915 30360 -44490 -125136 54509 42542 62982 81585 -336077 -67938
8794 -236459 88672 -82924 -4620 49894 -226766 387638 -1027 -292265 182838 18794 95093
8783 95093 159330 28900 -120620 -188827 90688 -204444 -210442 -168042 -199893 174989 -51683
8771 -176748 -57891 186945 76721 24335 -104938 -55067 376707 -179183 206346 -290281
8760 -311062 -112957 32838 -128091 146900 -79597 -66459 -106678 84681 -142188 -102433 -403773
8749 -403773 239709 139136 -99204 -119258 65320 -183551 -64238 -167191 -138869 -192134 10043
8737 -245064 -74957 -221397 -30950 -84925 270744 107352 57727 -142259 -205195 228985 -124498
8725 -21858 37251 48908 132015 -63392 118523 -160887 -17386 97629 -180791 -78387 308148
8713 -79808 84232 -42519 -132057 67587 45098 64660 -322863 -66731 179232 326192 -246231
8701 71529 -159826 26351 -200285 -112106 58997 61762 115684 97527 21564 -53588 -73150 -24016
8688 -347014 20627 -22744 78993 -79754 1243 -534899 -205351 -88488 -223376 -109492 -101663
8677 -101663 -47800 44114 23101 259355 -85441 7473 -49867 -154809 136519 -307945 -74027
8665 -172084 -369496 3145 38651 -245982 -242895 -220235 -441042 -434506 -411102 153840 116287
8654 116287 65218 -163273 -248847 -132398 -154307 135209 -268180 273063 -201082 70073
8643 132362 293710 109952 -302086 -271353 -32398 -131906 -382873 -130121 -10071 47646 -109377
8631 3504 -46819 -286073 -55518 -174548 -272560 200401 -237058 -18794 -145820 -87166 4326
8619 47401 63068 -248825 15601 -44026 -140557 39833 -196782 -213073 -94273 -124567 -7927 -62450
8607 -62450 -341589 -80885 77515 -2491 73280 -355126 -62512 -416305 -121172 297287 8141
8595 -145677 -141883 -233681 -163346 -36424 -169756 -12708 -171910 -12383 46567 -74045 34120
8583 112440 -85317 131007 201245 -372587 28496 -144047 197488 -84815 250741 252674 -92694
8571 -139861 -151028 47377 -142737 -72548 -362208 -81624 85002 -179074 -381961 -78183 -3553
8559 362075 119927 180451 251639 -48394 -13296 -326711 89233 112032 -3601 -359065 175941
8547 -27150 -70406 -326285 44696 227625 317101 -175092 115977 177869 -186438 353199 52717
8535 -335549 -97012 107957 -83383 -330313 69034 -1966 -36484 -187269 -61686 200904 104503
8524 104503 -18371 -253070 -73844 127412 391209 281521 36342 329141 -185580 -198904
8514 -198904 -109214 156031 69021 -69559 -104303 110989 123699 -77455 246696 -24147 -345753
8503 -345753 107987 -144903 -291458 341870 -53266 -27041 286105 89912 -56130 -176260
8493 -176260 36262 148435 191224 -41242 149035 -83589 83002 -12977 -257438 -60322 -166697
8482 -166697 15527 -76766 -340908 14737 -43263 -182609 157978 -10366 180893 -155381 -83847
8471 -83847 -105903 -33620 -164185 -340322 -299998 46479 101230 -136519 -79479 82892 429100
8460 429100 83267 -14143 197237 -83814 -109557 -244800 -28956 -286901 -103932 -54521 -306677
8449 -306677 -112342 -29845 -98661 -23002 101575 170449 -56988 -32709 27885 160610 -164067
8437 541443 10301 131506 151074 103969 -235787 288437 -249376 -254202 103973 -127493 -261742
8426 -261742 102014 151659 -490442 202225 -166171 -165192 -72144 41786 20920 -121653 240281
8414 -59104 -180299 -87568 -242288 -29694 -278608 97105 139410 133031 33669 13432 85202
8403 85202 -36582 -122164 173837 75618 -382336 77597 -309085 -88949 -146397 -71763 -101367
8392 -101367 -281364 241484 83333 -268066 -410505 -114987 -106692 -112614 -250952 182764 73513
8380 -28364 -66448 -286599 324227 -198051 -327981 60402 -104289 -129581 -123566 -82304 -4935
8368 -134909 -337065 254052 53522 60824 -78241 -213173 -152538 248300 -81693 45066 -117445
8356 -155557 -241618 164928 91168 -227423 119645 -221991 34594 -350817 -312073 -154538
8345 -239667 -278950 -412794 -70742 -193185 -14708 170872 -91673 309225 -159497 -87333 -51308
8334 -51308 -31355 -16060 -284176 192614 -220068 -244126 -46835 -156568 -390218 -166156 -160891
8323 -160891 -260766 140279 -108546 -203524 327446 -234997 157285 -12487 -316774 185460
8312 -413416 -48489 -86027 121819 20181 -252158 -240319 -382387 -75486 -110191 169550 -194234
8300 217719 115940 101590 -54676 58657 75314 89242 -1555 54819 -105831 349004 -311047
8288 213056 -85407 -29306 -206631 -47502 72269 -162053 -64961 173821 3925 98717 437791
8277 437791 -164606 -88234 35027 -97869 -315184 -187093 -119574 -50950 -162868 7337 -104827
8265 173866 -229201 -240934 -255092 -248098 91103 -16377 -203653 51860 56449 109624 20673 14368
8253 14368 -395415 -192695 31653 -93538 -43880 -47096 -163086 10474 134898 -221406 -250924
8242 -250924 70845 -123707 67329 -43639 -177872 -297568 -5489 76094 -2019 4413 126433
8231 126433 361135 -270222 -74814 102013 -215145 63931 -149354 -23065 -216589 -278079
8221 -278079 89127 217557 -318140 252058 306339 52944 -48914 -233693 40627 -67586 -337198
8210 -337198 197421 79160 -193629 -192487 -76151 33252 73273 58246 47801 52030 205885
8199 205885 -224185 -21029 -103449 -150143 -42278 137635 71438 31643 -104495 -309644 -182981
8188 -182981 174875 274469 -192808 -37706 159214 23584 -295793 156770 -56558 240876
8177 -142288 -57206 -42689 -276088 201621 -40585 -130349 79885 -83834 -123986 68833 -140637
8165 89487 -17383 67736 -134274 177770 -128832 97071 -76525 -313977 325120 -162765 6663
8153 -92329 -248917 -388915 -321816 -231879 -55287 -86109 -118777 -25390 39577 96832 65797
8142 65797 104610 -4134 146926 168241 196027 120254 148102 -211857 -126260 71753 -108849
8130 157133 -20000 -394371 -124754 124657 -334360 -96891 -159802 -252873 129994 255087
8120 255087 122213 -135063 28990 -10975 -248708 1169 -101330 -408665 -72180 94044 -174142
8108 -162258 54679 305607 -133886 -181644 -98631 209411 19306 -123839 -105507 378716 -392037
8096 134551 134109 12551 -100916 140887 137714 314143 -106496 -249312 68846 78627 -155337
8084 -301925 122938 -312678 -10786 -234696 -180849 102478 -103001 -15581 -72956 -175791
8074 -175791 -87356 213794 -306485 -138954 -251375 -88046 -6334 -145165 -27794 -176806 223868
8062 135227 243108 63794 -211019 11724 90562 -87204 233017 -105578 71008 273297 -160702
8050 -9801 180023 44683 -21931 -37802 -151993 -44224 -269927 -14355 -317867 74363 42875
8039 42875 -311360 -95186 93745 -47983 148940 104764 -204480 -118273 -30843 -50135 -338439
8028 -338439 -236328 -215219 78542 -339180 -186281 259824 -102974 243507 -186041 -185883 461796
8016 -84186 -304490 -93296 64348 -191359 18414 -277190 167945 -191804 114383 -32990 71434
8004 -310963 -14434 119671 285913 225255 -354616 115055 -66245 129469 -279857 238737
7993 -105284 96071 -21793 111078 -47433 -258033 -191516 -203119 -132525 -270885 27515 -132910
7981 -145806 -164910 -38423 32691 -26699 66762 -62454 -154263 -397227 -194297 130400 -60786
7969 -11054 48048 -5356 -41853 19055 -81335 -255803 -210858 -326220 130866 -46774 133028
7957 220816 -470315 70345 -340914 -463047 310873 -203033 -371688 -123283 -129224 -10598
7946 -33472 -431555 -121109 -81368 96097 -214456 -76227 -237448 -223393 285540 247618 268812
7935 268812 183240 -79205 -22753 -221077 91149 42045 -163676 -61693 -499 -225877 162221
7923 -33056 -181011 118242 93283 -140026 219292 361076 -229283 -157550 46818 217843
7913 217843 -103045 -44928 -213719 128817 -15443 4194 -172989 57643 -111136 266304 -228608
7901 -78116 165124 -29904 104829 -87629 181432 -160841 -118843 -57080 -93184 103147 13611
7889 -274913 -195311 330413 -43154 -115761 -175159 -93213 -149513 -70188 -116694 -2749 -109014
7878 -109014 83414 -7052 -270574 143010 5022 15341 129828 -112954 54117 -254052 -132279
7867 -132279 -177005 -167991 -16751 -12876 -63175 -211257 -148151 64480 -138783 -147519 -45257 -111081
7855 -111081 -56859 -17599 -344589 -33408 -78345 -197104 60292 -5003 -186425 -146873 -166308
7844 -166308 -80472 157162 124308 37443 118136 -342473 -115304 209768 -141031 -14803 351511
7832 198525 25661 16856 299152 35227 -194373 -243856 -112814 114139 50271 -39068 -301285
7821 -301285 -40898 -377537 129386 55796 133751 30008 1747 275358 208103 82761 -155033
7809 -78523 -39197 -53614 -537111 72811 -51054 -277148 84531 -35167 76967 -44376 282973
7797 -128002 -55467 -157117 297023 -249576 -40738 -131637 -162513 65177 93130 67110 -116872
7785 -516191 -166830 -66591 -2772 -117263 -166027 -21132 -73747 81073 39257 -263880 61632
7773 -106122 124228 28434 -190512 265865 -265850 -66909 -134389 115544 196008 -234563
7762 -344166 -66592 30590 97945 92538 -77790 -72047 -208540 -330740 482524 -1754 -179768
7751 -179768 251463 -83286 152882 -70117 -303859 -114883 15997 -118522 79734 47630 268606
7740 268606 202832 -87477 -101026 67267 -251312 -76913 -40459 -185467 -87456 -91130 -72116
7729 -72116 183661 60212 -133567 -48273 5334 -235205 -54110 324 -12065 -193693 250790
7717 45800 -10718 -58765 -8425 -77269 60729 214351 73446 -203945 121398 319976 317434
7706 317434 138348 99672 22004 52507 223761 -133212 -174142 425068 124925 35233 -66134
7694 145871 -64106 -165946 -122456 133662 34633 125869 218054 -225690 25875 -69102 138580
7682 -313881 -159527 -156643 -173725 276570 191779 287856 -116891 -55170 186352 115323 -332770
7670 -173871 -162056 -212761 -90529 84177 -172260 -521789 -207381 209456 180196 118759 -197107
7658 222334 190812 -387585 -345703 -145766 -60760 -438092 -231967 -118815 -78823 -103202 -382175
7647 -382175 174828 -176746 -132901 140101 144242 111896 176743 -122933 305136 -43627 154760
7635 -83108 -148823 96859 -143505 -125210 -265849 -35820 -76297 -138320 23078 26272 -138161
7623 103494 -39169 -239119 199042 -33845 -40171 -94582 -218572 -186182 -122912 -265570 -248612
7612 -248612 -210058 195680 -86787 -259342 -131062 214463 -6233 325159 -24597 -53094 45920
7600 -437831 -395435 -189499 186081 62103 241543 212978 -99131 -233372 200206 38436 182361
7589 182361 86848 -87601 11962 -289769 -147866 100062 136497 -176721 194057 191075 10159
7577 -296221 -70026 37870 -85445 -264873 -38679 296335 -108364 95455 -179466 179131 -13747
7565 -136893 291729 114124 207330 134834 -5250 -26807 -9116 23554 29621 -94874 -88177 -192223
7553 -192223 -185077 55889 -206017 92458 14082 -94513 130734 -229425 -175987 -57728 -17315
7541 -51895 -11457 147736 -40016 -186375 -19901 4993 -216250 13373 128353 83004 145565
7530 145565 -50429 167565 -40563 200470 88855 139751 -395061 253802 -59233 -134524 -280878
7519 -280878 104991 274196 96965 27859 -83733 171054 -47943 222479 -160053 127677
7508 -37856 29943 -296110 113489 143671 64067 -257928 -156847 -333869 -84445 -427776 145720
7496 -16252 46184 189157 39222 24851 71242 -235142 -130951 100526 33589 -111417 -32926
7484 -210892 -204586 162430 -44890 29347 113407 -2890 105823 75553 -251961 61589 151594
7473 151594 330146 -288 -136106 -264294 17015 -92580 -43071 -244004 157758 -307532 79636
7461 -2047 10008 -257504 54606 125251 265543 -51693 -342071 -149604 317726 187705 -280592
7449 -73109 -8874 -71538 -8427 120441 -269224 -344833 323597 48656 -27685 -80671 -15031 4219
7436 94352 1588 -12371 -169231 -391643 -58428 198325 -59877 -317877 250842 -38400 -179259
7425 -179259 -112722 12084 244488 -56352 37888 -72668 21412 71343 -14759 -193840 82664
7413 -89067 -213188 221134 171190 159058 308350 -49567 258021 142969 -92721 -105028 497324
7401 169940 18706 -282963 52834 -108688 9155 -99910 57750 -114636 140443 -18367 -55117
7390 -55117 -10639 177012 73381 -213202 63921 -35402 71478 -151214 -188637 234620 44713
7378 -19642 -18625 68998 -140908 -76978 -11709 32634 -150545 -130028 185257 -213524 52476
7366 -164859 -444872 44867 -55415 -63124 -122030 51196 75802 59969 177240 134881 -82596
7354 -134379 -36745 191086 -36827 -42201 -73366 133605 -210711 172878 76392 32341 -191057
7342 151374 -208503 27059 63526 -15455 37132 -178482 380155 259447 -72643 -259823 -86979
7330 -11803 -72887 -28445 -457477 53037 283230 -148291 27120 -37425 -39415 99641 52861
7319 52861 -107702 121992 60407 136731 -379260 -257951 -73919 -17797 -32968 -368906 -66331
7307 126844 331705 -49895 -237060 -116913 -148084 -72815 -195270 -345567 -16758 -168463
7297 -168463 63184 197176 -111316 61759 -28323 103431 -59718 272674 -143908 48249 -44572
7285 332587 62205 -373799 -82773 -242941 -300415 -96092 30183 110878 -80307 -14849 8526
7273 -129240 -252959 -421342 -126379 2523 234934 358231 53816 -36003 -3044 -185796 -132545
7262 -132545 -38458 69683 -5292 166079 -53573 165863 -31829 -401806 37441 -225527 126099
7250 195472 140952 -19191 16141 104260 -128410 65999 141043 -140570 88484 7666 211819
7239 211819 161098 -76527 -110338 100747 -44311 -267198 -23352 -206601 405003 396836 -126271
7227 -219864 -95744 360802 64053 109672 -69014 -54737 99758 -422069 -314484 154211 33305
7215 -138190 -105357 -54367 46836 376247 -109920 -192445 359513 -229125 9583 189650 -397878
7203 -176888 -205750 96122 -26037 -37837 -194144 211140 89934 36916 177069 -11230 -377123
7192 -377123 223709 -615 -425685 -5875 74587 -48803 -146183 159809 -359416 219544 379772
7181 379772 -11797 -174746 37349 252290 106877 -102475 159201 -234548 -181047 253745
7170 300579 190861 -122552 -109644 -121683 -192022 -77726 -12629 308228 66056 174060 -301101
7158 31585 -150179 98154 -173002 -128738 -312708 -124800 -24124 898 8065 10606 -264642 -192258
7146 -192258 -76840 -127703 168110 -162894 50978 84631 274197 296872 -124840 208278 254351
7135 254351 -62348 -241754 173900 -232042 -27599 -280400 -239256 250833 79669 -42848 -293704
7124 -293704 71358 186419 78021 -205704 176568 -59325 123450 51682 -200585 105919
7113 160346 -122486 89053 79435 38403 -207765 110472 -294788 -35713 -25508 114001 10718
7101 209102 216567 58903 136026 32112 79314 -78726 25957 -52032 172909 32213 -235049
7089 -380393 -264084 115066 53957 222396 -54166 -202890 107024 205143 -123641 -276243
7079 -276243 -23138 516552 151827 119653 75774 -108849 -583315 -24521 -121063 -174269 -220854
7068 -220854 -50712 8048 151692 5116 49894 -62219 -142818 -99889 151638 -75413 -137760 -43753
7055 18913 -84347 43616 48387 -193844 -232135 -13859 -61191 31201 121855 35022 -126813 196109
7042 171801 264368 35135 -249395 -283256 160900 -31249 85831 -161281 -290339 -63074 -179011
7031 -179011 -93472 137417 -22744 46149 438620 -29890 350996 -144240 -108040 -185161 -241480
7020 -241480 228840 -205561 -344871 21442 27218 -61823 -211572 -185139 196701 -29165 145731
7008 -24050 45574 -131652 -11368 135538 58134 -266436 70216 -270603 255661 123544 117129
6997 117129 15903 -121118 -109074 -373909 214258 -55207 -297919 239922 24206 -45802 -52449
6986 -52449 -66018 -231879 101871 -51827 -82020 -121541 168773 -316460 138233 -150067 63297
6974 -49898 -51626 43543 125806 -35466 115111 295486 -272782 386719 145471 -207190 -194602
6963 -194602 131817 -79954 113888 -34953 -119265 -276023 -108706 -67482 128111 5743 -86411
6951 127738 -40570 231323 -136939 254154 -1622 -30276 -285060 -187762 322421 -23991 -147251
6940 -147251 18799 -24400 150787 -371760 -201185 -75258 258339 88911 -84317 90419 49684
6929 49684 50964 164991 194033 -168437 193663 -64226 -556301 264190 -218968 -94730 53983
6917 14183 6468 26472 -257839 -36329 18408 222952 -324746 326946 133085 -116802 52827
6905 -395198 47096 -117206 -301 -6221 152125 -121527 98698 149775 -143409 58412 -92219
6893 -124576 -30517 131672 -187701 -31980 -149546 -100469 -263355 1514 -265274 -325163 740
6881 81771 139343 -49901 160987 -80484 -200350 -200254 12930 -71013 125887 -238157 -258969 48879
6868 -189043 18027 -135970 -93376 -173404 32549 108219 -44327 -116354 -33685 -172316 -114186
6857 -114186 -257402 -195128 -67745 -9608 -162215 33217 -127964 -36089 -43257 330859 -18657
6845 311558 48545 -158933 -68608 45195 66321 72092 -60012 -143158 -243430 -221834 -387789
6834 -387789 48721 -204047 161821 -49599 -62437 85458 -16673 -102574 -85001 -114503 -309400
6823 -309400 -366680 -307441 -1418 23561 -185598 -45973 -176687 -223583 -215853 231637 -173029
6811 -103018 -150136 -14459 82484 -133709 292535 1228 -75287 -72849 154745 -284686 -59833
6799 -148111 -78164 -215493 100509 285233 86397 274057 108397 -130392 -165796 11106
6788 -55959 86888 -186876 51109 265528 -161357 205692 -265638 259926 -143938 216085
6777 171695 97814 -34488 137700 -67221 -152090 -127707 113702 151820 -170145 116338 50282
6765 -41474 89838 239398 -20645 134794 202256 -142315 206616 -209308 -39444 64910 72259
6754 72259 93294 80280 113162 159227 -119722 -201618 -203073 -63902 -47501 -182235 -220258 -88031
6741 -85300 194865 -129320 -8175 -92070 -264170 -172798 101645 -18714 -133219 58037 -19959
6729 11355 335800 -124824 62585 2411 155983 -132075 -144552 -300311 56515 25279 -237273
6717 -213756 37789 -88644 -3621 234376 257411 -20610 -117759 214248 -134749 -75640 -274655
6706 -274655 -87870 -42542 161181 -119864 -119043 -116309 -144159 -269104 -98684 130959 122389 -194209
6693 -198947 309244 143318 102835 280608 -53114 -4249 -234589 -22827 231340 84286 -268307
6681 17078 10366 -330346 -269762 156374 -321960 -211481 -180347 -141685 -32654 169153 -329030
6669 -116067 129933 -65623 -176099 76027 -151130 -2534 -27880 58944 7466 248378 27790
6657 271314 832 76844 -151992 41260 -159286 -82980 -89316 60070 -173005 -38390 -194855
6646 -194855 102189 -73270 -81796 112320 -124614 -165461 101504 69269 -147759 257959 232760
6635 232760 48290 120622 -347986 -140282 255865 -238334 -180443 141057 209177 55837 -57565
6623 -8334 -172411 -242644 -185312 223666 152402 -369933 -115890 25175 299723 -73219 172725
6611 296719 -226190 -150681 -171026 -133915 49445 -10732 -115408 -70216 -81808 171701 227783
6600 227783 -69168 -80508 -117230 -50771 240704 -314361 202644 -135463 338120 298160 368951
6589 368951 55152 -248309 173534 122880 -114892 185497 244398 173898 -38888 -279430 -19989
6577 -204078 -56091 -58104 -141876 161020 7892 -42035 71676 37676 -11529 -515 90368 19641
6564 -164527 -12320 -255138 -200834 14119 107019 -96815 -142220 137829 328714 -90344 85796
6552 -260723 -124182 -100568 -52291 65198 -50012 -284984 -122313 77237 -200798 -230159 -151130
6541 -151130 -31114 135087 -187934 -40313 -248053 -287857 -228470 -55557 386656 104077 -255578
6529 -45352 -156017 -15318 153395 17999 -86876 -190932 -85905 362829 182798 164856 -38552
6517 -140014 118307 -114459 108297 -228219 217437 -248001 -119108 -118335 114840 65192
6507 65192 2019 -278576 -173801 338813 -44682 -199929 -403981 475940 -318952 172120
6496 -81642 -135380 109305 -300253 -150024 125036 102312 -286019 -62520 6202 73147 -168863
6484 -50273 13364 -320561 182611 -73295 315057 40618 56835 -394986 214026 -229594 63000
6472 127662 116438 -141530 115027 393370 68796 -330721 68793 31114 -307612 -38869 19619
6460 100182 -66393 -110403 297367 173737 437314 -233380 168294 -15492 28502 44788 231082
6449 231082 -171098 -63952 -176106 243992 237528 270296 434578 103893 -119270 144094
6438 -118128 -21721 -106347 116295 171185 140902 56291 65238 50403 -427126 -24290 200330
6426 242365 136187 -214314 -80535 -35098 105691 110044 -300386 -128813 74447 16406 -76620
6414 -247797 -93687 116215 -319811 126356 112003 -76816 -406442 37611 -199333 -387091
6404 -387091 -366227 75226 125130 6437 174100 184529 146350 190554 -118575 104559 -26293
6392 -116347 -100204 17553 123904 24377 -367278 -67256 -47229 46749 119973 -46845 106700
6380 -171642 121859 44376 -254371 144514 -150715 -137064 118522 -134693 -136632 -98336 -158215
6369 -158215 132022 143836 23297 282337 -45387 63273 -17521 140771 -135808 388076 -289635
6357 -23642 210209 129278 214669 -232033 22255 315059 101320 34068 49008 28324 -244031
6345 73979 247264 144358 254868 -77475 -89382 -154688 108445 374876 -159796 -63835 -61659
6334 -61659 -149294 -110613 177105 -57422 -116907 223265 162876 31365 137319 -38635 300992
6322 -155418 2334 -3242 152319 127600 121895 230908 105653 61451 70793 -183397 108407
6310 -117000 -348071 -231340 125952 218933 36427 212508 -150111 15275 4823 344928 7297
6298 92680 42069 37659 274659 -202108 -210721 241397 -253080 440264 130404 -178943 -41259
6286 155178 -196801 -18566 -21147 -70154 -111193 19089 323589 -78237 164307 -151856 183142
6274 89282 191165 139087 -142528 -217082 165549 -99185 204409 77175 98701 41885 -327806
6262 -64568 48000 124505 142107 -150824 81869 22738 2541 -139653 -49920 -171898 -14415
6250 -274386 -39743 9678 -256145 -390512 -22686 351150 300631 -26886 -175037 -308640 17752
6238 155839 -51033 -9150 -190555 -188208 249642 10285 -84365 -304188 -249694 147969 35217
6226 76298 -159499 154216 280952 -29 303844 -93829 -26838 24575 156846 245958 131975
6215 131975 -39013 199477 169383 -353585 -356425 -15571 -309075 -163090 138954 237067 6110
6203 -170626 -245283 214868 -41828 -87485 -77803 -226182 324093 -130617 -83766 -46182 -166814
6192 -166814 101344 188464 -184905 -95918 101156 -135762 115409 -232273 -155197 -52638
6181 240426 185497 167680 97759 181876 98156 -58320 -133054 142408 -248674 -31289 -10994
6169 298158 154798 215909 -32085 -99350 -149944 101935 -108494 68873 -78567 15788 -132221
6157 412807 177062 -286043 25081 245298 -86959 168122 135195 -70604 5762 -58801 -20919
6145 41705 -125581 -234915 14985 -3042 -305734 125850 45578 -103604 331824 -169808 51063
6133 -124163 -156744 -41299 155061 -10743 245404 -220188 156096 -140263 225140 -17625
6122 115991 -37079 -142127 129801 -48945 -76871 -46284 90044 -137342 82899 -20214 -19275
6111 -19275 -121628 -22554 65654 -108994 99810 29611 36272 -176557 -157690 -25505 -89968
6100 -89968 -207170 122769 -112324 135212 97011 93959 52734 10618 -4432 70878 -947 122284
6087 63034 -124416 62861 14799 499834 -121161 -159101 88251 -189972 -172667 -346860 -13252
6075 374761 -106850 153295 173397 9913 14043 69552 27098 -177307 -119432 -586 18025 17832
6063 17832 -198384 -161485 62243 86115 -181307 -141773 220637 -288067 260281 -172142 -263117
6052 -263117 -170650 -18344 124682 70379 -33824 5263 261959 229344 -180593 29491 -8560
6040 -115375 -58593 2773 180570 -60939 -352900 -67860 41535 -205850 -15958 -27890 -31462
6029 -31462 163312 66354 53430 -297949 -58148 -375209 -377896 207595 193720 -175186 -189416
6018 -189416 -152512 -488921 -352724 -155799 65987 -34713 -57384 123634 -29214 -161835 316573
6006 -11699 -252618 101505 -110089 -30403 -50835 49271 -14642 -240405 46705 -12339 -22971
5995 -22971 -431215 -339717 136798 325031 -97042 348150 176206 -177289 -123964 15382 -150910
5983 194215 -128063 -110101 82940 1919 -254324 -40779 20199 42317 -7096 -359225 -82131
5971 310232 143327 74685 -83771 177132 -203623 203801 104296 136994 -13603 70619 -29405
5959 14562 -2990 191506 88422 -49587 -301463 -15637 -211111 -28010 -365267 -55010 9590
5947 42 -18965 168123 251419 -2307 -202183 -135776 165142 -170278 -99087 -158750 -9412 -89919
5935 -89919 40486 -233078 -23841 185543 -200762 -298464 163642 78708 38905 212488 -218505
5923 -139920 -134280 -47107 124051 -283595 291270 -106247 -24338 509173 40576 154533 4227
5911 -177751 -333738 340029 44142 75615 -34008 -5993 215963 -68136 -42126 77107 -21368
5899 411084 -113048 50292 218843 254344 -194699 -97577 152092 -383423 287386 663 -114819
5887 154163 -190864 16668 171718 272570 -92122 247654 -258627 -117906 82411 -123678
5876 -175866 -69915 -25209 -119488 -103212 45675 -159780 -174280 -98918 -47481 -245733 4071
5864 -10542 -77394 -240143 -196264 106141 51194 -86858 -129360 -440938 283932 -229286 135116
5852 8285 424429 -154822 -16731 93806 -247236 -63031 -219893 372204 -92913 -103029 6951
5840 -120394 -185452 12488 314946 191145 -104125 -113038 -166006 8839 13341 3450 -2176 -227963
5828 -227963 10855 39199 114841 -18039 316450 -298523 -209599 23756 60864 498115 -7791
5816 122309 302027 -83764 89847 212607 834 43730 110946 142603 63203 184822 175053 -348023
5803 105962 205143 -10554 -68163 -192640 -125412 109855 144591 -163263 172679 324595 -68936
5791 104368 22826 114838 17176 -26444 26720 -142689 58695 63980 -120593 -241640 -10975
5779 -126672 -62305 -74477 -2506 -87541 267233 -115451 -67826 172364 -83934 231551 -26445
5767 34574 -154759 163856 -63726 393330 6798 -64890 -385249 115512 283612 101054 326568
5756 326568 -194474 148698 98443 123241 -55959 35402 88296 55926 -227111 -160343 -134954
5745 -134954 -170240 -92377 -277722 -116153 152941 14690 21872 173804 134754 335223 -252763
5733 112788 -163896 219190 -226305 132042 -56862 -215296 94052 -194192 -78531 23660
5722 -92211 146206 64963 66518 -255856 -47500 22774 14063 -216053 8397 143546 -219244
5710 -215326 210989 -65363 -112329 -79594 -46053 50832 47825 -96711 -99154 -192065 189088 -1250
5697 35521 3198 -229343 110230 -69084 -136080 128676 18389 -49949 -205070 156181 -142180
5685 10713 -323371 -3248 -210454 65096 -142193 -195352 42268 -398509 -262317 -109260 -113835
5674 -113835 158630 -147183 324525 97101 -17790 177236 274019 48084 -261022 47246 -47611
5662 139750 50742 -164445 -115658 4737 22248 13743 38471 42494 -362241 44556 107139 -247616
5649 -150378 -12984 -228067 -14758 30563 67749 275519 71263 64747 -268300 -230043 43372
5637 -4636 154992 -32504 18736 290422 -66096 195921 95040 -199065 1197 356284 -210203
5625 48578 230103 239776 -28069 -77382 -85729 39993 -147589 42466 -58452 -78078 -153122 99180
5612 77163 25529 199999 -163889 127576 -170 46177 444925 -83198 -135128 -185926 -126516
5601 -126516 66570 205746 -88865 -48311 -40232 -131790 49096 34049 -78766 -81983 -34522 65674
5588 245146 -54620 -68119 414213 6075 146515 -133425 -177552 387956 5391 -59989 21827
5576 176560 -32758 229957 -38384 35450 -98955 -495787 -66671 212476 86329 113962 -82266
5564 224242 -39039 -175040 -134917 -388605 93682 226165 -160385 35011 -279139 195186
5553 -94631 56356 20528 22147 -161530 391361 188925 242281 -188129 221049 -137332 -122179
5542 -122179 -155081 500124 -144985 -669367 32641 -232347 230918 -140882 -142404 -262300
5532 -262300 -199438 104285 57238 -278 179978 -42450 -41679 183264 8274 18941 163411 192250
5520 192250 -192391 -156438 -16477 -224177 232695 66106 173894 -46687 18235 11869 -70611
5508 53444 -21009 -84754 209981 130622 -163518 -37654 -123065 -100546 289 -89561 34926 74536
5496 74536 -126590 16402 80734 305858 -407951 -158501 42473 14560 -267860 3102 -64492
5484 -257506 -170931 434570 -107557 199953 36792 314493 -180532 -10505 -32860 -52537 90052
5472 205465 201503 -518812 11970 110081 -2239 98625 155818 169489 14361 -174541 -100613 -82599
5460 -82599 8114 -13163 -13367 225326 146997 -314165 -95016 69531 -68722 114034 98980 132018
5448 132018 -3283 44222 -22739 -108876 -12666 419454 -187473 258114 28161 98716 -371958
5436 -100686 -56750 26745 -57652 -29388 135087 -119810 -96187 -246502 75320 -67568 31546
5424 297546 -132913 2644 332155 -201087 -150488 -57565 -113081 10688 -143559 4776 -382096
5412 82848 131420 112561 136166 -62381 -180132 -163024 176629 -246154 324036 -49768 -145696
5401 -145696 -162888 437179 220883 -12894 238857 129308 -170521 154691 -75127 156715
5390 207430 100843 125540 196196 198762 -185141 207475 77965 -181461 -35287 215735 -8197
5378 -126294 180292 170151 -56146 81359 105876 279007 -549099 119473 -15364 391582 153400
5366 -273916 40591 136609 102963 216635 -83265 333093 266044 229934 -7715 -126647 -228444
5355 -228444 -332886 -5391 51659 31481 -77482 114458 -265273 -139577 -350708 -41390 264862
5343 -44031 -333333 -308137 230535 -59074 -157791 -42291 -1713 -90539 223726 -143413 23717
5331 -217851 -100742 -127615 -145158 -113845 -60720 -97754 153818 94326 -154616 -289946 100127
5319 113623 -24346 -43135 -80393 43766 -50569 292696 287616 -195546 45151 375782 108237
5307 202181 239953 -436942 -73507 96033 -194784 -152439 -194018 194949 -145802 42790 -111147
5295 -64514 323889 59144 -57187 131922 255655 -138891 -2198 37529 163219 -363132 5118
5283 -66094 3384 43370 -104877 103815 161557 34937 30027 -30400 154255 164253 7275 9419
5271 9419 -115102 -172063 -159272 -393825 -46069 171650 -5662 -32060 16089 -69700 -76398 -327825
5259 -327825 -112781 -52834 -83951 212913 19988 56054 -97442 75857 91952 -26777 -73060
5248 -73060 -3102 -70097 205447 72839 -63412 -15101 -224301 284045 -201754 456765 -49099
5236 -199144 -404790 305898 -76956 -48945 319414 -137485 -40524 -5038 137943 125849 158155
5225 158155 -129706 -86175 10802 -52504 119409 237443 92415 74686 46208 -30045 127009
5213 73540 -209827 56985 -37051 207169 177232 196105 160820 79128 136952 -96327 -38243
5201 -32012 -214798 -418683 -9265 128870 -7710 301 190267 210407 -34400 -24851 336867 54801
5188 -49041 133731 232704 191258 -198665 234193 83432 267303 239969 247227 -387757 -219225
5177 -219225 -110741 181600 255916 -48321 5818 329484 98349 147130 -27020 -255336 -89988
5165 -26441 17844 -67420 -34001 151886 72682 -61382 -9807 -35038 -108522 -132646 259636 82185
5152 2448 107371 109410 -57747 -114259 275276 631606 -22582 205782 60232 255916 90109
5140 -280584 -104325 -186616 294300 -49802 -348561 186991 -456802 178075 49723 -143603
5129 26989 538038 -90124 -134571 -325859 6301 -268909 120396 84447 173439 48239 -202389
5117 35898 104004 -61224 -239723 12167 -92072 183536 237025 33802 -206062 -74350 -228798
5106 -228798 -105334 -5704 299533 -290142 59631 -263909 -268288 -265521 283166 -208857 271492
5094 -64897 -151708 316420 80855 21992 -25290 -15681 -244344 196458 6660 338116 -96133
5082 -194468 -386249 116340 -26684 89589 37087 161271 -158732 -9220 -204763 -60211 194535
5070 -18047 213493 -198791 17381 215698 343824 -155346 69706 -196243 63813 -25936 64763
5058 63274 -86147 -22312 272791 -49835 -170968 -48390 247643 186135 -184736 -132529 -65506
5046 -123208 -313706 499718 -202377 58537 -11226 61392 -5610 -55609 -237127 -43455 30120
5034 40941 -255040 -275891 -253007 -264691 -187924 344355 -232996 270379 -81233 147366 94731
5023 94731 2488 -136870 95568 86388 76251 7529 52850 -83606 111198 -119456 51583 -46715
5010 96876 81776 -22214 -149953 190946 -215969 8115 -12849 -148287 216986 -70651 -125703
4999 -125703 48036 34081 -51934 -17160 150656 116006 42491 -237880 -211327 226519 -152186
4987 -222123 182109 -252167 7649 -207611 -63089 236156 -61807 165719 -189399 57461 -28477
4975 -101833 62199 627 230068 -65566 178104 -137966 84992 32200 229479 367859 126992
4963 -3195 -251254 -195565 -147442 -262688 146151 59032 25190 118497 -99225 166270 291182
4952 291182 51423 168416 197143 330258 -32926 5001 64713 294673 -502619 170957 24821
4940 -218277 -143474 137688 -49 -51870 -83673 -287399 56365 114868 -166814 -62697 -229398
4929 -229398 184382 267136 21683 -27155 -274812 159443 138461 176152 381192 -114334 -266914
4918 -266914 -300457 -135289 146148 -37437 35889 -140147 67586 -259910 138991 -181763
4907 210759 -89745 184289 -218812 -56332 28581 203662 129386 41338 -16496 20591 -183605
4895 -274417 -28286 -238314 126311 21247 39566 177078 65036 135608 7540 19915 -285386
4883 7747 -68017 -73584 41591 -306074 110780 -278701 -45133 -18725 -206045 -196407 8238 57963
4871 57963 217688 -16265 -495237 40503 203918 -179376 -6800 -318 -305667 62132 -12227
4859 100342 148714 130648 20410 234724 -232576 -44571 120412 -25265 -132175 110807 -11029
4847 232114 -27584 -166492 38237 -106369 260306 3512 -371793 23854 110962 -52010 -257810
4836 -257810 92487 99379 177273 73561 -102422 -201140 214433 19129 6430 -129665 121998
4824 219439 -153577 -128499 -160765 236814 19319 -3492 239006 -201353 152944 167114 -111067
4812 79806 -302937 -56587 10444 -3109 -46423 -118011 -139519 43569 154712 -39861 -89866 -65554
4800 -65554 120036 379068 184849 225892 -165991 175910 -211902 -33084 124159 30636
4789 -102658 -261623 -118068 60867 -179797 -232842 -104592 -287404 225388 265820 -58732
4778 5169 13913 28421 42332 -85528 16499 633411 235792 -39508 13807 178089 268254 92543
4765 -107030 30686 37035 154050 146986 -39085 91414 -247417 -270182 -107482 -154219 326523
4753 115138 269125 224669 -260322 -75691 -260671 -221782 284606 194867 -154284 -60233 63409
4741 63295 55172 219901 24810 -66536 80845 42555 4329 56547 -202398 293358 -26769 189710
4728 252935 -379281 59534 5298 58482 58418 -78244 -201321 41636 93053 -188755 -146611 -11280
4715 -250435 249484 -2052 -113586 202457 -60564 74901 -83472 90845 56146 41017 66199
4704 66199 411193 -2845 199289 100762 224341 -139879 95082 -302889 -39369 356475 -134479
4692 132870 37353 -139049 -19779 50949 -20321 -171893 -62878 3230 -196837 -107553 201830
4680 -108841 154314 80862 -63778 -54545 271190 42276 -457754 -18086 -145941 -184131 233961
4668 -174546 -423454 -106309 209528 166723 -221669 -275838 -93148 150103 124466 14004 -127682
4656 -180456 -14346 -53788 83523 117765 275639 -185158 -51149 -298847 142883 217473 -173945
4644 -109611 -221892 -13934 166298 74312 7098 83171 155730 21663 -156446 117995 -11763
4632 -5282 86060 -195317 -291416 147606 -196312 -64651 130204 -158304 -87580 -8972 208240
4620 -96028 43953 243728 73240 -262388 -187678 71597 364956 309220 -49213 98248 54840
4609 54840 330671 -317828 -129765 198515 -71285 291875 27940 83232 112676 123755 -84602
4597 35805 47069 131452 -129645 174437 1415 28899 49931 -22984 -144458 97254 166189
4586 166189 214745 -60008 227158 -136601 -251562 101179 49589 -208840 -58829 -4615 274953
4574 -263135 179776 195470 86678 -410272 203859 -91324 -155215 60602 -50050 -115598 -278450
4563 -278450 14271 -48279 64444 -148608 94581 374864 -221131 -257794 -80768 4388 -210296
4551 147610 -63943 6799 -290662 85676 -222388 36069 -239132 -26002 84807 -217859 70919
4539 -26960 -39098 60065 -78334 -146929 61288 -153662 -116371 -9836 125097 -238708 -135431
4528 -135431 -189755 -226833 240121 -47357 -137347 -49977 -178434 64620 -252483 236650 137357
4517 137357 796 264921 26737 10963 195202 71275 7403 -129761 -312992 187886 -266527
4505 11615 246317 121140 133359 432205 24247 -133640 -249612 350159 -414414 -139125
4494 357219 188160 -160102 52890 -72142 -94460 252773 -90539 130053 -103841 -123835 -144054
4483 -144054 -200728 -107188 -145986 -207478 166092 -361378 309004 86793 -95956 -375829 83413
$$ [...]
##END NTUPLES=NMR SPECTRUM
##END=
