##TITLE=AC1707_ROEFFECT0029_8637995_807HLyJJxx
##JCAMPDX= 6.0         $$ Bruker NMR JCAMP-DX V2.0
##DATA TYPE= NMR SPECTRUM
##DATA CLASS= NTUPLES
##ORIGIN= BRUKER
##OWNER= Administrator
$$ 1.72 TOPSPIN		Version 2.1
$$ 2014-05-22 20:09:56.967 -0700  Administrator@X
$$ Compression mode = diff/dup
##.OBSERVE FREQUENCY= 400.02188249412
##.OBSERVE NUCLEUS= ^1H
##.ACQUISITION MODE= SIMULTANEOUS (DQD)
##.ACQUISITION SCHEME= undefined
##.AVERAGES= 64
##.DIGITISER RES= 22
##SPECTROMETER/DATA SYSTEM= spect
##.PULSE SEQUENCE= noesygpps1d.comp
##.SOLVENT NAME= COFFEE_meoh
##.SHIFT REFERENCE= INTERNAL, COFFEE_meoh, 1, 14.96128
##AUDIT TRAIL= $$ (NUMBER, WHEN, WHO, WHERE, PROCESS, VERSION, WHAT)
$$ ##TITLE= Audit trail, TOPSPIN		Version 2.1
$$ ##JCAMPDX= 5.01
$$ ##ORIGIN= Bruker BioSpin GmbH
$$ ##OWNER= Administrator
$$ $$ E:\/data/COFFEE/nmr/AC1707_ROEFFECT0029_8637995_807HLyJJxx/12/pdata/1/auditp.txt
$$ ##AUDIT TRAIL=  $$ (NUMBER, WHEN, WHO, WHERE, PROCESS, VERSION, WHAT)
(   1,<2014-05-22 20:09:52.108 -0700>,<Administrator>,<X>,<go>,<TOPSPIN 2.1>,
      <created by zg
	started at 2014-05-22 19:58:25.906 -0700,
	POWCHK enabled, PULCHK disabled,
       configuration hash MD5:
       C8 4E 4E 5D D3 5C D8 9E 9F 52 82 E0 59 8A DE 15
       data hash MD5: 64K
       96 BD 72 12 3F B7 A4 10 7C 7E F0 7D 5F 98 42 D3>)
(   2,<2014-05-22 20:09:55.014 -0700>,<Administrator>,<X>,<proc1d>,<TOPSPIN 2.1>,
      <Start of raw data processing
       efp LB = 0.3 FT_mod = 6 PKNL = 1 PHC0 = 0 PHC1 = 0 SI = 128K 
       data hash MD5: 128K
       44 77 4B 31 43 7E 8E D4 96 E2 55 28 A5 54 F8 08>)
(   3,<2014-05-22 20:09:55.936 -0700>,<Administrator>,<X>,<proc1d>,<TOPSPIN 2.1>,
      <pk PHC0 = -86.23169 PHC1 = 0 
       data hash MD5: 128K
       BE 49 A6 D7 C8 39 B8 93 27 F8 DA 65 7D 1C 0E 98>)
(   4,<2014-05-22 20:09:56.358 -0700>,<Administrator>,<X>,<proc1d>,<TOPSPIN 2.1>,
      <abs ABSG = 1 
       data hash MD5: 128K
       2C 31 52 C7 EC AA B7 48 E1 BB F3 C1 1B 22 F7 F8>)
(   5,<2014-05-22 20:09:56.467 -0700>,<Administrator>,<X>,<proc1d>,<TOPSPIN 2.1>,
      <abs ABSG = 2 
       data hash MD5: 128K
       48 4C F6 C6 1C F2 64 FF E5 34 0C 72 F3 08 49 50>)
(   6,<2014-05-22 20:09:56.561 -0700>,<Administrator>,<X>,<proc1d>,<TOPSPIN 2.1>,
      <abs ABSG = 3 
       data hash MD5: 128K
       38 7F C0 AB C2 FF 32 74 E6 C5 13 F9 F5 68 D9 01>)
(   7,<2014-05-22 20:09:56.671 -0700>,<Administrator>,<X>,<proc1d>,<TOPSPIN 2.1>,
      <abs ABSG = 4 
       data hash MD5: 128K
       25 D2 DA 0F 64 B9 FF A8 6B 2E CF 10 5F A1 A2 CA>)
(   8,<2014-05-22 20:09:56.780 -0700>,<Administrator>,<X>,<proc1d>,<TOPSPIN 2.1>,
      <abs ABSG = 5 
       data hash MD5: 128K
       9A CF 57 79 C4 D9 61 71 66 50 36 DD 37 77 2A ED>)
$$ ##END=
$$ 
$$ $$ hash MD5
$$ $$ 3C 3B 80 3C E6 D8 56 EF 18 9A 51 5B 41 55 56 9F
##$RELAX= 
##$RELAX= 
##$RELAX= 
##$RELAX= 
##$RELAX= 
##$RELAX= 
##$RELAX= 
##$RELAX= 
$$ Bruker specific parameters
$$ --------------------------
##$DU= <E:\>
##$EXPNO= 12
$$ [...]
##$TP07= 0
##$TPNAME0= <>
##$TPNAME1= <>
##$TPNAME2= <>
##$TPNAME3= <>
##$TPNAME4= <>
##$TPNAME5= <>
##$TPNAME6= <>
##$TPNAME7= <>
##$TPOAL= (0..7)
0.5 0.5 0.5 0.5 0.5 0.5 0.5 0.5
##$TPOFFS= (0..7)
0 0 0 0 0 0 0 0
##$TUNHIN= 0
##$TUNHOUT= 0
##$TUNXOUT= 0
##$USERA1= <user>
##$USERA2= <user>
##$USERA3= <user>
##$USERA4= <user>
##$USERA5= <user>
##$V9= 5
##$VALIST= <valist>
##$VCLIST= <CCCCCCCCCCCCCCC>
##$VD= 0
##$VDLIST= <DDDDDDDDDDDDDDD>
##$VPLIST= <PPPPPPPPPPPPPPP>
##$VTLIST= <TTTTTTTTTTTTTTT>
##$WBST= 2048
##$WBSW= 25
##$XGAIN= (0..3)
0 0 0 0
##$XL= 0
##$YL= 0
##$YMAX_a= 6655636
##$YMIN_a= -14061203
##$ZGOPTNS= <>
##$ZL1= 120
##$ZL2= 120
##$ZL3= 120
##$ZL4= 120
##$ABSF1= 14.96128
##$ABSF2= -5.596902
##$ABSG= 5
##$ABSL= 3
##$ALPHA= 0
##$AQORDER= 0
##$ASSFAC= 0
##$ASSFACI= 0
##$ASSFACX= 0
##$ASSWID= 0
##$AUNMP= <proc_prof1d_extract.lims>
##$AXLEFT= 0
##$AXNAME= <>
##$AXNUC= <1H>
##$AXRIGHT= 0
##$AXTYPE= 0
##$AXUNIT= <>
##$AZFE= 0.1
##$AZFW= 0.1
##$BCFW= 0
##$BC_mod= 0
##$BYTORDP= 0
##$COROFFS= 0
##$CY= 15
##$DATMOD= 1
##$DC= 0
##$DFILT= <>
##$DTYPP= 0
##$F1P= 0
##$F2P= 0
##$FCOR= 0.5
##$FTSIZE= 131072
##$FT_mod= 6
##$GAMMA= 0
##$GB= 0
##$INTBC= 1
##$INTSCL= 1
##$ISEN= 128
##$LB= 0.3
##$LEV0= 0
##$LPBIN= 0
##$MAXI= 10000
##$MC2= 0
##$MEAN= 0
##$ME_mod= 0
##$MI= 0
##$NCOEF= 0
##$NC_proc= -2
##$NLEV= 6
##$NOISF1= 0
##$NOISF2= 0
##$NSP= 0
##$NTH_PI= 0
##$NZP= 0
##$OFFSET= 14.96128
##$PC= 1
##$PHC0= -86.23169
##$PHC1= 0
##$PH_mod= 1
##$PKNL= yes
##$PPARMOD= 0
##$PPDIAG= 0
##$PPIPTYP= 0
##$PPMPNUM= 2147483647
##$PPRESOL= 1
##$PSCAL= 4
##$PSIGN= 0
##$PYNMP= <proc.py>
##$REVERSE= no
##$SF= 400.020009524975
##$SI= 131072
##$SIGF1= 0
##$SIGF2= 0
##$SINO= 400
##$SIOLD= 131072
##$SPECTYP= <>
##$SREGLST= <1H.CDCl3>
##$SSB= 0
##$STSI= 131072
##$STSR= 0
##$SW_p= 8223.68421052631
##$SYMM= 0
##$S_DEV= 0
##$TDeff= 65536
##$TDoff= 0
##$TI= <>
##$TILT= no
##$TM1= 0
##$TM2= 0
##$TOPLEV= 0
##$USERP1= <user>
##$USERP2= <user>
##$USERP3= <user>
##$USERP4= <user>
##$USERP5= <user>
##$WDW= 1
##$XDIM= 131072
##$YMAX_p= 434054532
##$YMIN_p= -11344
##$CURPLOT= <Network HP LaserJet P1505>
##$CURPRIN= <$Network HP LaserJet P1505>
##$DFORMAT= <normdp>
##$LAYOUT= <+/1D_H.xwp>
##$LFORMAT= <normlp>
##$PFORMAT= <normpl>
##$SURQMSG= 1
$$ End of Bruker specific parameters
$$ ---------------------------------
##NTUPLES= NMR SPECTRUM
##VAR_NAME=  FREQUENCY,     SPECTRUM/REAL,   SPECTRUM/IMAG
##SYMBOL=    X,             R,               I
##VAR_TYPE=  INDEPENDENT,   DEPENDENT,       DEPENDENT
##VAR_FORM=  AFFN,          ASDF,            ASDF
##VAR_DIM=   131072,        131072,          131072
##UNITS=     HZ,            ARBITRARY UNITS, ARBITRARY UNITS
##FACTOR=    0.0627417313425164, 1,          1
##FIRST=     8223.62146879497, 2114,         -63589
##LAST=      0,             3602,            -63558
##MIN=       0,             -11344,          0
##MAX=       8223.62146879497, 434054532,    0
$$ Real data points
##PAGE= N=1
##DATA TABLE= (X++(R..R)), XYDATA
$$ [...]
63803C27098m3K19j61p71j127j335j821k568l077l071k828k702k702k720k829
63788B99562l100l368l428l311l107k759k268j915j933k038j663o87L16N91j03
63773B70789j310k130j820l83J275K085J773R96M97L57J87k17o50q32p16m93l78
63756B69030m04l28R1O80Q61K97o04j108r50m25K19J037J973K702L076L377L776
63739B83300L944L556K911K557K482K203J535Q04L63L90J100K480L814M162L569
63724C19170L189L823M945N605N706N787N918N605M683L630K970K721K514J928
63710C78194P73o15j594j971k333l181m065m150l462k780k350j558o7J434K047
63695C54322J723J092P07Q01J464K535L543M021L796K838J268l43j175j077r06
$$ plain form
63803 327098 327055 327274 327113 326342 325215 323880 322059 319491 316414 313343 310515 307813 305111 302391 299562
63788 299562 296462 293094 289666 286355 283248 280489 278221 276306 274373 272335 270672 269985 270301 270892 270789
63773 270789 269479 267349 265529 265146 266421 268506 270279 271275 271772 272129 272316 272099 271449 270617 269901 269408 269030
63756 269030 268626 268298 268389 269069 269930 270227 269623 268515 267565 267140 267359 268396 270369 273071 276147 279524 283300
63739 283300 287244 290800 293711 296268 298750 300953 302488 303292 303655 304045 305145 307625 311439 315601 319170
63724 319170 322359 326182 331127 336732 342438 348225 354143 359748 364431 368061 371031 373752 376266 378194
63710 378194 378967 378352 376758 374787 372454 369273 365208 361058 357596 354816 352466 350908 350841 352275 354322
63695 354322 356045 357137 357844 358645 360109 362644 366187 370208 374004 376842 378110 377767 376592 375515 374609
63680C74609j390k016j718m64N66N29n0j30M33Q39N00k32m82J83J413K504L012
63663C78106K923K393J539N57k23o22r97k001l837n820o945o919o401o096n866
63648C39791n050l543k060j199p23j33M21M08q1k53L41J180J527J453J728K776
63632C36583M127M911M832M458M538N132N646N731N783O316P212Q068Q970J0305
63618D22612J1855J2878J3222J3708J5121J7256J9304K0733K1559K2154K3093
63607F13495K4830K7117K9057K9970K9871K8842K6459K2259J6496J0011L600k082
63595H59925o417r108j0449j0948j0842j0313r828r825j0317j1256j3020j5838
63583G31764j8990k1219k1993k1831k1330k0439j8770j6235j3183j0192p783o070
$$ plain form
63680 374609 373219 371203 369485 369021 369587 370116 370066 369936 370369 371208 371708 371476 370994 371177 372590 375094 378106
63663 378106 381029 383422 384961 385518 385295 384673 383676 381675 377838 372018 365073 358154 351753 345657 339791
63648 339791 334741 331198 329138 327939 327216 327083 327504 327912 327831 327578 327919 329099 330626 332079 333807 336583
63632 336583 340710 345621 350453 354911 359449 364581 370227 375958 381741 388057 395269 403337 412307 422612
63618 422612 434467 447345 460567 474275 489396 506652 525956 546689 568248 590402 613495
63607 613495 638325 665442 694499 724469 754340 783182 809641 831900 848396 858407 862007 859925
63595 859925 853508 844400 833951 823003 812161 801848 792020 782195 771878 760622 747602 731764
63583 731764 712774 691555 669562 647731 626401 605962 587192 570957 557774 547582 539799 533729
63571E33729m693l248j646R7K065M019N134M842L799L321L912M895N555N959O507
63556E74247P325Q384R787J1600J3726J6053J8503K0896K3119K5421K8116L1025
63544G88202L3681L5997L8017L8774L6277K9276J8826P644j864q730j3080j5266
63532I87754j5507j4092j1771r709q786r034j0030j1701j4334j7863k1670k5151
63520H18106k8000k9914l0620l0307k9459k8078k5745k2607j9680j7678j6237
63509E39781j4658j2889j1264r832q519p523o963o539o074n940o315o478n561
63496D31226l807k239j336p41k49j24l95n25j64L31M61K56J06K25N71J073J714
63479D26383K413L007L342L445L565L856M024L592K637J853J590J251J26j530
$$ plain form
63571 533729 529036 525788 524142 524239 526304 530323 535457 540299 544098 547419 551331 556226 561781 567740 574247
63556 574247 581572 589956 599743 611343 625069 641122 659625 680521 703640 729061 757177 788202
63544 788202 821883 857880 895897 934671 970948 1000224 1019050 1026694 1024830 1016100 1003020 987754
63532 987754 972247 958155 946384 936675 927889 918855 908825 897124 882790 864927 843257 818106
63520 818106 790106 760192 729572 699265 669806 641728 615983 593376 573696 556018 539781
63509 539781 525123 512234 500970 491138 482619 475096 468133 461594 455520 449580 443265 436787 431226
63496 431226 427419 425180 423844 423103 422854 422730 422335 421810 421646 421977 422438 422694 422800 423025 423596 424669 426383
63479 426383 428796 431803 435145 438590 442155 446011 450035 453627 456264 458117 459707 460958 461084 459554
63465D59554k804l326l486l591l493l139k816k666k387j719p97J54J112K027K615
63450D35238K668K412K359K849L770M740N477O139P072Q197Q938R003Q912R373
63436E17147J0439J1826J3745J6679K0394K3934K6601K8201K8250K6021K1819
63425G45056J7393J4353J2726J1702J1226J2000J4182J6993J9662K2095K4518
63414I21906K7011K9493L1614L2423L0648K5698J8334J0100K288m450r717j3101
63402A102247j4446j4262j3608j3403j3834j4552j5410j6805j9160k2285k5518
63391I18964k8361l0639l2040l2012l0405k7911k5467k3286k0819j7703j4333
63380F35988j1388r082p064m851k058J496N461Q897J1026J2053J2835J3698J4121
$$ plain form
63465 459554 456750 453424 449938 446347 442854 439715 436899 434233 431846 430127 429330 429484 430596 432623 435238
63450 435238 437906 440318 442677 445526 449296 454036 459513 465652 472724 480921 489859 498862 507774 517147
63436 517147 527586 539412 553157 569836 590230 614164 640765 668966 697216 723237 745056
63425 745056 762449 776802 789528 801230 812456 824456 838638 855631 875293 897388 921906
63414 921906 948917 978410 1010024 1042447 1073095 1098793 1117127 1127227 1129515 1125065 1115348 1102247
63402 1102247 1087801 1073539 1059931 1046528 1032694 1018142 1002732 985927 966767 944482 918964
63391 918964 890603 859964 827924 795912 765507 737596 712129 688843 668024 650321 635988
63380 635988 624600 615518 608454 603603 601545 603041 608502 617399 628425 640478 653313 667011 681132
63367F81132J3699J2798J1947J1137J0227R649J0069J1563J3642J6012J8748K1802
63355H42425K4869K7722L0179L1747L1781L0086K6894K2291J6238R286K533l325
63343A092726q377j2598j5218j5643j4568j3506j3304j3771j4607j6040j8319
63332I36775k1108k3764k5936k7494k8105k7327k5240k2657k0370j8316j5823
63321F80635j2625r280o459m246k397j060q42k287n474r876j4209j6822j6830
63308E78228j4971j2814j1064r149o435l276n54J295K480L385M255N067N473N064
63294E46984L826K101j9k834o346r772j2116j2988j2677j1699j0571r716r163
63281D55010q464p244n750m609m080l802l223k143r19j98k73o38m47M93J495J844
$$ plain form
63367 681132 694831 707629 719576 730713 740940 750589 760658 772221 785863 801875 820623 842425
63355 842425 867294 895016 925195 956942 988723 1018809 1045703 1067994 1084232 1093518 1096051 1092726
63343 1092726 1084349 1071751 1056533 1040890 1026322 1012816 999512 985741 971134 955094 936775
63332 936775 915667 891903 865967 838473 810368 783041 757801 735144 714774 696458 680635
63321 680635 668010 658730 652271 648025 645628 644568 643726 641439 635965 626089 611880 595058 578228
63308 578228 563257 550443 539379 530230 523795 520519 519965 521260 523740 527125 531380 536447 541920 546984
63294 546984 550810 552911 552892 550058 543712 533940 521824 508836 496159 484460 473889 464173 455010
63281 455010 446546 439302 433552 428943 424863 421061 417838 415695 414776 414578 414305 413667 413220 413713 415208 417052
63265D17052J593J314J427J983K773L366L404L105L109L534L733L390L313M384
63251D57480O085O996O664O144O487P525Q528R359J0450J1908J3323J4430J5537
63238E80916J7121J9191K1256K2910K4261K5704K7384K9164L0981L2921L4805
63227H66614L6160L6748L6893L6972L6949L6570L5727L4360L2427L0391K9335
63216A249146K9980L1720L3195L3601L3031L1727K9690K6909K3406J8968J3348
63205A554721O693o55q643j7191k5531l2579l7994m2105m4780m5272m3446m0368
63193A222850l7235l4413l1870k9722k7882k5888k3733k2116k1097j9278j5373
63182I34243j0155n652k543L71M030P616R761J0318J0228J0197J0234J0198J0135
$$ plain form
63265 417052 418645 419959 421386 423369 426142 429508 432912 436017 439126 442660 446393 449783 453096 457480
63251 457480 463565 470561 477225 483369 489856 497381 505909 515268 525718 537626 550949 565379 580916
63238 580916 598037 617228 638484 661394 685655 711359 738743 767907 798888 831809 866614
63227 866614 902774 939522 976415 1013387 1050336 1086906 1122633 1156993 1189420 1219811 1249146
63216 1249146 1279126 1310846 1344041 1377642 1410673 1442400 1472090 1498999 1522405 1541373 1554721
63205 1554721 1561414 1560759 1552116 1534925 1509394 1476815 1438821 1396716 1351936 1306664 1263218 1222850
63193 1222850 1185615 1151202 1119332 1089610 1061728 1035840 1012107 989991 968894 949616 934243
63182 934243 924088 918436 915893 916264 920294 927910 937671 947989 958217 968414 978648 988846 998981
63169I98981J0129J0230J0399J0309R396P504N232L254J467p06l384o176r074
63156A047561j2588j6701k0347k2487k3338k3845k4262k3932k2547k0828j9649
63145H17037j9000j8233j6976j5385j3687j1920j0028p954n701l560k004j090
63133F91499k34J059K461L384M091N435P524R457J0631J1581J3011J4621J5550
63120G90070J5476J4567J2733R781O197K919J96k502n235p101p434o888o647o976
63106H09156p156o655n681m657l759l019k494k190k096k307k757k983k610k052
63092G58740k093k649k579j119J038K501K643J940J240J193K076L505M539M594
63078G75569M175M244N045O049O872P614Q369R077R907J1077J2308J3118J3718
$$ plain form
63169 998981 1009110 1019340 1029739 1040048 1049444 1056948 1062180 1065434 1066901 1066195 1062811 1056635 1047561
63156 1047561 1034973 1018272 997925 975438 952100 928255 903993 880061 857514 836686 817037
63145 817037 798037 779804 762828 747443 733756 721836 711808 703854 698153 694593 692589 691499
63133 691499 691265 692324 694785 698169 702260 707695 715219 724676 735307 746888 759899 774520 790070
63120 790070 805546 820113 832846 842627 848824 851743 851939 849437 844202 837101 829667 822779 816132 809156
63106 809156 802000 795345 789664 785007 781248 778229 775735 773545 771449 769142 766385 763402 760792 758740
63092 758740 756647 753998 751419 750300 751338 753839 756482 758422 759662 760855 762931 766436 770975 775569
63078 775569 779744 783988 789033 795082 801954 809568 817937 827014 836921 847998 860306 873424 887142
63065H87142J4865J6699J8550K0112K1987K4590K7375K9759L2026L4686L7598
63054A165389M0581M4209M9043N4424N9150O3112O7254P1917P6228P9321Q1285
63043A851913Q2585Q3195Q2745Q1069P8342P5093P2120P0081O8896O7937O6824
63032B680800O5674O4566O3194O1087N7686N2226M4144L3666K1467P639q289k6049
63020C117811m4110o0809p5488q8044r8083j05188j09619j11898j11798j08515
63010B204259j01990r3521q4791p6534o8356n9630n0320m0984l2230k4274j7019
62999A554610j0334m193J306N920R393J1820J3754J5655J7355J8364J8640J8626
62987A670916J8597J8393J7890J7276J6590J5363J3075R762N940J939k550q146
$$ plain form
63065 887142 902007 918706 937256 957368 979355 1003945 1031320 1061079 1093105 1127791 1165389
63054 1165389 1205970 1250179 1299222 1353646 1412796 1475908 1543162 1615079 1691307 1770628 1851913
63043 1851913 1934498 2017693 2100438 2181507 2259849 2334942 2407062 2477143 2546039 2613976 2680800
63032 2680800 2746474 2811040 2874234 2935321 2993007 3045233 3089377 3123043 3144510 3152149 3143860 3117811
63020 3117811 3073701 3012892 2937404 2849360 2751277 2646089 2536470 2424572 2312774 2204259
63010 2204259 2102269 2008748 1923957 1847423 1779067 1719437 1669117 1628133 1595903 1571629 1554610
62999 1554610 1544276 1540083 1541389 1547309 1556702 1568522 1582276 1597931 1615286 1633650 1652290 1670916
62987 1670916 1689513 1707906 1725796 1743072 1759662 1775025 1788100 1797862 1803802 1805741 1803191 1795045
62975A795045j4932k1998k8104l2969l7469m2284m6764m9738n1024n1369n1122
62964A367272m9958m7901m5599m3278m0384l6767l3362l1134k9882k8684k7020
62953I53303k4978k2842k1046k0044j9694j9174j7995j6641j5688j4868j3688
62942G46645j2461j1840j1682j1238j0308r388q713p953o918n887n102m469l913
62929F36773l530l304l046k664k170j509p18k27n18j521k658l402l511k974k203
62914F02818k033k863l964m216l494k682k369k254j942j578j430j439j475j582
62900E69497j687j475q64j95J94K41p6q06j626j879j277k81M53P30O92M40O4k23
62882E61922k50M0O50J421J803J268J09o64n40j37k64q39j195j142j095j342j729
$$ plain form
62975 1795045 1780113 1758115 1730011 1697042 1659573 1617289 1570525 1520787 1469763 1418394 1367272
62964 1367272 1317314 1269413 1223814 1180536 1140152 1103385 1070023 1038889 1009007 980323 953303
62953 953303 928325 905483 884437 864393 844699 825525 807530 790889 775201 760333 746645
62942 746645 734184 722344 710662 699424 689116 679728 671015 663062 656144 650257 645155 640686 636773
62929 636773 633243 629939 626893 624229 622059 620550 619832 619605 619087 617566 614908 611506 607995 605021 602818
62914 602818 600785 597922 593958 589742 586248 583566 581197 578943 577001 575423 573993 572554 571079 569497
62900 569497 567810 566335 565471 565276 565470 565711 565635 564829 563203 561324 560047 559766 560219 560949 561641 562081 562145 561922
62882 561922 561672 561712 562362 563783 565586 566854 566963 566299 565759 565622 565358 564519 563324 562182 561087 559745 558016
62865E58016k001k039j740j036j17O48J046J101R68Q58J024J526K106K486K689
62850E65535K795K636K048J363J177J559J868J541P35M4k32k35j80o6J81N24P92
62833E82085Q05N27J80J44O37J411J961K050J961K160K747L389L684L548L264
62818F10553L277L822M647N139M958M503M470N031N722O104O208O222O187O137
62804F82980O217O440O686P166Q384J0306J1990J2657J2727J3210J4320J5452
62792H08535J6442J7998K0700K4255K8036L1840L5840M0221M5200N1031N7630
62781A177728O4494P1201P7813Q4559R1437R8315J05114J11713J17803J23026
62771B123203J27015J29200J28875J25625J19452J10326R7940Q2167O3420M2380
$$ plain form
62865 558016 556015 553976 552236 551200 551083 551731 552777 553878 554846 555704 556728 558254 560360 562846 565535
62850 565535 568330 570966 573014 574377 575554 577113 578981 580522 581257 581301 581069 580834 580654 580588 580769 581293 582085
62833 582085 582890 583417 583597 583741 584378 585789 587750 589800 591761 593921 596668 600057 603741 607289 610553
62818 610553 613830 617652 622299 627438 632396 636899 641369 646400 652122 658226 664434 670656 676843 682980
62804 682980 689197 695637 702323 709489 717873 728179 740169 752826 765553 778763 793083 808535
62792 808535 824977 842975 863675 887930 915966 947806 983646 1023867 1069067 1120098 1177728
62781 1177728 1242222 1313423 1391236 1475795 1567232 1665547 1770661 1882374 2000177 2123203
62771 2123203 2250218 2379418 2508293 2633918 2753370 2863696 2961636 3043803 3107223 3149603
62761C149603J9652l995k7335m9098o8637q5881j00713j12660j21235j26426j28783
62750B344492j29004j27425j23981j18808j12681j06466j00235r3436q5944p8344
62740A268168p1044o3759n6375m9665m4456m0445l6554l2359k8450k5395k2946
62729G96720k0541j8068j5810j3895j2106j0258q541p337o686o025m755k991j459
62716F68248n32J84J195K458L771N307P221R038J0152J0846J2172J4691J7870
62703G62621K0879K3508K6040K8668L1294L3781L6109L8428M0981M3868M6817
62692A132994M9430N1666N3788N5750N6867N6263N3476M8595M1985L4017K4894
62681A659725J4692L688p454j8037k7851l7012m5229n1704n5927n8259n9394n9536
$$ plain form
62761 3149603 3169255 3165260 3137925 3088827 3020190 2934309 2833596 2720936 2599701 2473275 2344492
62750 2344492 2215488 2088063 1964082 1845274 1732593 1626127 1525892 1432456 1346512 1268168
62740 1268168 1197124 1133365 1076990 1027325 982869 942424 905870 873511 845061 819666 796720
62729 796720 776179 758111 742301 728406 716300 706042 697501 690164 683478 677453 672698 669707 668248
62716 668248 667716 667900 669095 671553 675324 680631 687852 696890 707042 717888 730060 744751 762621
62703 762621 783500 807008 833048 861716 893010 926791 962900 1001328 1042309 1086177 1132994
62692 1132994 1182424 1234090 1287878 1343628 1400495 1456758 1510234 1558829 1600814 1634831 1659725
62681 1659725 1674417 1678105 1670651 1652614 1624763 1587751 1542522 1490818 1434891 1376632 1317238 1257702
62669A257702n8469n6276n3547n0775m7885m4522m0645l6658l2997k9772k6858
62658G79298k4259k2158k0534j8956j6970j4684j2687j1385j0595r846q900p877
62646F00447p029o557o448o380n922m977l908l026k128p55J107K846L818L893
62632E64981L361K486J364J25r30j547j786j951k210k348j993j036K60J557K716
62617E63049L789M878O055P245Q114Q286P852P477P731Q431R028R440J0052J0922
62603F72349J1621J2210J3618J6491K0057K3010K5296K8158L2295L6919M1003
62592I33027M4691M8774N3334N7607O0954O3215O4232O3729O1725N8451N3752
62581A563491M7063L8168K7562J5926L686q742k0670l1445m0712m8270n3911n7683
$$ plain form
62669 1257702 1199233 1142957 1089410 1038635 990750 946228 905583 868925 835928 806156 779298
62658 779298 755039 732881 712347 693391 676421 661737 649050 637665 627070 617224 608324 600447
62646 600447 593418 586861 580413 574033 568111 563134 559226 556200 554072 553317 554424 557270 561088 564981
62632 564981 568342 570828 572192 572317 571387 569840 568054 566103 563893 561545 559552 558516 558776 560333 563049
62617 563049 566838 571716 577771 585016 593130 601416 609268 616745 624476 632907 641935 651375 661427 672349
62603 672349 683970 696180 709798 726289 746346 769356 794652 822810 855105 892024 933027
62592 933027 977718 1026492 1079826 1137433 1198387 1261602 1325834 1389563 1451288 1509739 1563491
62581 1563491 1610554 1648722 1676284 1692210 1695896 1687154 1666484 1635039 1594327 1546057 1492146 1434463
62569A434463n9983o1132o1057n9598n6965n3625m9977m6252m2614l9126l5719
62558H68415l2304k8834k5270k1735j8644j6360j4645j2907j1030r554q789q269
62546F60074p423o309n327m590m058l888m092m147l478k275j333j154j607k311
62532F08082k850k738j738k61J023J927K739L565M205M700N462O768Q475J0402
62518F49761J2611J5164J7893K0537K2892K4877K6656K8601L0913L3405L5887
62507I19197L8480M1046M2793M3136M2717M2674M2882M1897L8842L4441K9881
62496A357986K5597K1775J9173J8567J9879K2546K6413L1644L8047M5141N2616
62485A679384O0146O7002P2625P7406Q2286Q7349R1026R0551Q3264O8315M7984
$$ plain form
62569 1434463 1374480 1313348 1252291 1192693 1135728 1082103 1032126 985874 943260 904134 868415
62558 868415 836111 807277 782007 760272 741628 725268 710623 697716 686686 677132 668343 660074
62546 660074 652651 646342 641015 636425 632367 628479 624387 620240 616762 614487 613154 612000 610393 608082
62532 608082 605232 602494 600756 600495 601518 603445 606184 609749 613954 618654 624116 630884 639359 649761
62518 649761 662372 677536 695429 715966 738858 763735 790391 818992 849905 883310 919197
62507 919197 957677 998723 1041516 1084652 1127369 1170043 1212925 1254822 1293664 1328105 1357986
62496 1357986 1383583 1405358 1424531 1443098 1462977 1485523 1511936 1543580 1581627 1626768 1679384
62485 1679384 1739530 1806532 1879157 1956563 2038849 2126198 2217224 2307775 2391039 2459354 2507338
62474B507338K6996R364m564j7782l3560n2869p4035r3707j08275j15770j17206
62463A925930j15629j13415j10727j06544j00350r2446q3358p3587o3737n4355
62453A011782m5755l8177l1882k6830k2618j8849j5333j1829q170m833k687j737
62441G83082p50J286L854N691O441O696O806O580O055N605N153M145K508Q68m09
62426H43611j677l244m811o125p470r053j0487j1404j2100j2938j3586j3575j3264
62413G23877j3433j4022j4089j3039j1244r341p614o239n482n249m963m298l672
62400F11192l585l699l104j448N81J979K446K529K907L648M226M126L329K192
62386F27319J178Q23J560L211M826N496N317N136N469O177P046Q021Q684Q408
$$ plain form
62474 2507338 2534334 2543698 2539134 2521352 2487792 2434923 2360888 2267181 2158906 2043136 1925930
62463 1925930 1810301 1696886 1586159 1479615 1379265 1286819 1203461 1129874 1066137 1011782
62453 1011782 966027 927850 895968 869138 846520 827671 812338 800509 792339 787506 784819 783082
62441 783082 782332 783618 787472 793163 799604 806300 813106 819686 825741 831346 836499 840644 843152 844020 843611
62426 843611 841934 838690 833879 827754 820284 811231 800744 789340 777240 764302 750716 737141 723877
62413 723877 710444 696422 682333 669294 658050 648709 641095 634856 629374 624125 619162 614864 611192
62400 611192 607607 603908 600804 599356 599937 601916 604362 606891 609798 613446 617672 621798 625127 627319
62386 627319 628497 629320 630880 634091 638917 644413 649730 654866 660335 666512 673558 681579 690263 698671
62372F98671P353O684P229Q550R768J0803J2041J3416J4673J6267J8926K2452
62360H46833K5897K9045L2782L7655M2932M7513N1138N4140N6543N7926N7853
62349A340257N5925N1729M5181L6812K7358J7421P746n92o965j1833j6173k0381
62337A526485k4227k7626l0752l3470l5332l6294l6772l6859l6076l4191l1839
62326A163047k9871k8467k7242k5988k4901k4198k3870k3833k4022k4303k4422
62315H81930k4120k3300k2085k0722j9256j7403j5028j2648j1048j0247r376p856
62303F88841o217n274m932m492l785l189k707j879p57m5K0J68R59J978K678L363
62287F64730M441N319N122M251M117N214O524P098P295P919Q929R730J0197J0729
$$ plain form
62372 698671 706024 712708 719937 728487 738255 749058 761099 774515 789188 805455 824381 846833
62360 846833 872730 901775 934557 972212 1015144 1062657 1113795 1167935 1224478 1282404 1340257
62349 1340257 1396182 1447911 1493092 1529904 1557262 1574683 1582429 1581837 1574872 1563039 1546866 1526485
62337 1526485 1502258 1474632 1443880 1410410 1375078 1338784 1302012 1265153 1229077 1194886 1163047
62326 1163047 1133176 1104709 1077467 1051479 1026578 1002380 978510 954677 930655 906352 881930
62315 881930 857810 834510 812425 791703 772447 755044 740016 727368 716320 706073 696697 688841
62303 688841 682624 677350 672418 667926 664141 660952 658245 656366 655609 655564 655584 655752 656711 658689 661367 664730
62287 664730 669171 674490 679612 683863 687980 693194 699718 706816 714111 722030 730959 740689 750886 761615
62273G61615J1505J2330J3015J3392J3159J2215J1053J0311J0022R798R705J0373
62261H98493J2201J4980J8393K2482K7326L2696L8235M3706M8834N3183N6360
62250A266889N8136N8202N6083N1534M4811L6388K6669J6282O275k469r938j6793
62238A592069k3509l0040l6164m1698m6284m9456n1148n1713n1254m9340m5753
62227A115710m1252l7052l3578l0245k6528k2785j9680j7144j4461j1289q243
62216H53453o206n286m663l490j776k78M63P94J571L164N111O755P980R130J0381
62201H77103J1489J2071J1908J1047R854Q930Q580Q358P391N413L149J588J014
62188I77895J047J359K020L190M752O392P853R060R991J0529J0388R276P182M495
$$ plain form
62273 761615 773120 785450 798465 811857 825016 837231 848284 858595 868617 878415 888120 898493
62261 898493 910694 925674 944067 966549 993875 1026571 1064806 1108512 1157346 1210529 1266889
62250 1266889 1325025 1383227 1439310 1490844 1535655 1572043 1598712 1614994 1621269 1618800 1608862 1592069
62238 1592069 1568560 1538520 1502356 1460658 1414374 1364918 1313770 1262057 1210803 1161463 1115710
62227 1115710 1074458 1037406 1003828 973583 947055 924270 904590 887446 872985 861696 853453
62216 853453 847247 841961 837298 833808 832032 831754 832217 833011 834582 837746 842857 849612 857592 866722 877103
62201 877103 888592 900663 912571 923618 933472 942402 950982 959340 966731 972144 975293 976881 977895
62188 977895 978942 980301 982321 985511 990263 996655 1004508 1013568 1023559 1034088 1044476 1053752 1060934 1065429
62174A065429J810l67j671j832o97J617M768Q430J2503J7051K1968K6729L0642
62161A186380L3350L5009L5844L5667L4004L0533K5222J8222J0126K239m003q265
62149A434328j1575j5080j8837k2180k4980k7874l1196l4159l5453l4538l2065
62138A146391k9055k5977k2838j9870j7566j5868j3938j1305q800p628p665p569
62126I58312o688n886o038o621o550n769n090m801m335l291j952o90N25J826L124
62111I06076M261N159N726N806N235L759J132k392n829q143r077q915p707n343
62097H89748k374j38K35j299l815o109p299p235o448n502m383k751o72J283K579
62082H45820L084L063L138M034N847P789R160J0309J2084J4508J6738J8186J8872
$$ plain form
62174 1065429 1067239 1066872 1065201 1063369 1062672 1064289 1069057 1077487 1089990 1107041 1129009 1155738 1186380
62161 1186380 1219730 1254739 1290583 1326250 1360254 1390787 1416009 1434231 1444357 1446596 1442593 1434328
62149 1434328 1422753 1407673 1388836 1366656 1341676 1313802 1282606 1248447 1212994 1178456 1146391
62138 1146391 1117336 1091359 1068521 1048651 1031085 1015217 1001279 989974 981174 973546 965881 958312
62126 958312 951624 945738 939700 933079 926529 920760 915670 910869 906534 903243 901291 900601 901126 902952 906076
62111 906076 910337 915496 921222 927028 932263 936022 937154 934762 928933 920790 911713 902798 895091 889748
62097 889748 887374 887236 887471 886172 882357 876248 868949 861714 855266 849764 845381 842630 841958 843241 845820
62082 845820 848904 851967 855105 859139 864986 872775 881935 892244 904328 918836 935574 953760 972632
62069I72632J8808J7996J7088J7058J7957J8871J9428K0318K1972K3637K4377
62058A190142K4143K3102K0696J6319J0430M155j897p612j2553j6080j8287k0176
62046A212382k2727k6209l0239l4112l7094l8837l9507l9353l8322l6368l3880
62035H35734l1456k9386k7537k5588k3198k0348j7651j5856j4818j3459j1150
62024F05287q580o836o159o108o367o723o713o066n231m764m515m050l521l321
62010E26333l167k444j234k26K99O56J003J285J826L030M531N518O005O841Q255
61995E58511R353R281Q169O532M697L093K220J772O13j739m299n947o935q174
61981E77147r588j0192r653q755q251q010p607p053o583o084n290m355l851m066
$$ plain form
62069 972632 991440 1009436 1026524 1043582 1061539 1080410 1099838 1120156 1142128 1165765 1190142
62058 1190142 1214285 1237387 1258083 1274402 1284832 1288987 1287090 1279478 1266925 1250845 1232558 1212382
62046 1212382 1189655 1163446 1133207 1099095 1062001 1023164 983657 944304 905982 869614 835734
62035 835734 804278 774892 747355 721767 698569 678221 660570 644714 629896 616437 605287
62024 605287 596707 589871 583712 577604 571237 564514 557801 551735 546504 541740 537225 533175 529654 526333
62010 526333 523166 520722 519488 519262 519561 520217 521220 522505 524331 527361 531892 537410 543415 550256 558511
61995 558511 567864 577145 585314 591846 596543 599636 601856 603628 604241 602502 598203 592256 585321 577147
61981 577147 567559 557367 547714 538959 530708 522698 515091 508038 501455 495371 490081 485726 481875 477809
61967D77809m550m537l764k674j796j152m79J86M44O9o65j233j273p75n1M76O48
61950D56683P44J158J981L032M102N036N726O412P679R691J1595J2264J1627J0753
61936E48483J0663J1541J3048J4615J5382J4689J3056J1935J2013J2264J1251
61925F88940Q847O134L953K236N62j235l010m434n155n164m892m678m298l295
61911F74511j594N69L119O041Q870J0846J1691J1977J2459J3248J3760J3358J1956
61898G90811J0024P997N870L552J479L68K22R6o92j456q82J325L983N615N644
61883H33956M393K396o5l042o635j0563j4041j6425j7876j9041k0018k0109j8734
61870F94196j6263j3640j1460r682q042o422m839l361k008o17J132L399N858P854
$$ plain form
61967 477809 473259 468722 464958 462284 460488 459336 458857 459043 459487 459556 458891 457658 456385 455610 455559 456035 456683
61950 456683 457427 458585 460566 463598 467700 472736 478462 484874 492553 502244 513839 526103 537730 548483
61936 548483 559146 570687 583735 598350 613732 628421 641477 653412 665425 677689 688940
61925 688940 697787 703921 707874 710110 710672 709437 706427 701993 696838 691674 686782 682104 677806 674511
61911 674511 672917 673486 676605 682646 691516 702362 714053 726030 738489 751737 765497 778855 790811
61898 790811 800835 808832 814702 818254 819733 820101 820323 820419 819727 818271 817389 818714 822697 828312 833956
61883 833956 838349 840745 840680 837638 831003 820440 806399 789974 772098 753057 733039 712930 694196
61870 694196 677933 664293 652833 643151 635109 628687 623848 620487 618479 617862 618994 622393 628251 636105
61856F36105R054R807J0801J2351J4184J5906J7508J9136K0511K1023K0644K0321
61844H27351K0966K2123K2185K0194J6907J3819J1412Q896N496J441k381n291
61832I63118p060p750p684p294o623n089k198J489M634O476P542Q745J0124J0812
61818I69242J0095Q071N339K358p20l767o402q090q629q417p997p324n931l995
61804I33833k755l305n365p887j0584j3992j7931k0938k1804k1001j9899j8997
61792G69375j7728j5758j3616j1913j0544r043p316n691m455l626l062k518j679
61779F62426m20Q92J596J447J007J163K159L290L702L430L388M321N992P559Q585
61764G10537R345J0252J1338J2478J3783J5424J7213J8749J9952K0969K1403K0222
$$ plain form
61856 636105 645159 654966 665767 678118 692302 708208 725716 744852 765363 786386 807030 827351
61844 827351 848317 870440 892625 912819 929726 943545 954957 963853 969349 970790 968409 963118
61832 963118 956058 948308 940624 933330 926707 921618 919420 920909 925543 932019 939561 948306 958430 969242
61818 969242 979337 987408 992747 995105 994385 990618 984216 976126 967497 959080 951083 943759 937828 933833
61804 933833 931078 927773 922408 914521 903937 889945 872014 851076 829272 808271 788372 769375
61792 769375 751647 735889 722273 710360 699816 690773 683457 677766 673311 669685 666623 664105 662426
61779 662426 662006 662898 664494 665941 666948 668111 670270 673560 677262 680692 684080 688401 694393 701952 710537
61764 710537 719882 730134 741472 753950 767733 783157 800370 819119 839071 860040 881443 901665
61752I01665J6888J2211P473K898k303q314j3978j8028k0419k1966k3066k3381
61740H09680k2502k0437j7612j4821j2913j2063j1438j0169q393o964o260n896
61728F60212n452m820l882k619j576j473k099k247j144O09J799J884J230N91O39
61713F41652J447K123J477n51k564l397l513m184n625o777o835o129n430m983
61699E96711m577m142l927m095m422m453m066l719l956m604m822m108k978k335
61685E40507k432k778k872k672k348j977j567j234j204j635k281k521j967j078
61671E11941p21j078j449j265p35j45P30J956K781K509J737J832L233N041O320
61656E32687O996P378P608P849Q337Q783Q287O365L653J146q92k749m296m917
$$ plain form
61752 901665 918553 930764 938237 941135 938832 930518 916540 898512 878093 856127 833061 809680
61740 809680 787178 766741 749129 734308 721395 709332 697894 687725 679332 672368 666108 660212
61728 660212 654760 649940 646058 643439 641863 640390 638291 636044 634900 635509 637308 639192 640422 641013 641652
61713 641652 643099 645222 646699 646148 643584 640187 636674 632490 626865 620088 613253 607124 601694 596711
61699 596711 592134 587992 584065 579970 575548 571095 567029 563310 559354 554750 549928 545820 542842 540507
61685 540507 538075 535297 532425 529753 527405 525428 523861 522627 521423 519788 517507 514986 513019 511941
61671 511941 511220 510142 508693 507428 506693 506548 507278 509234 512015 514524 516261 518093 521326 526367 532687
61656 532687 539683 547061 554669 562518 570855 579638 587925 594290 597943 599089 598197 595448 591152 586235
61642E86235m473l670l183k746j578M37K410L501L934M668O134P728Q615Q620
61628F16632Q048O915M857J698k200o153r540j1932j3164j3367j2826j1788j0389
61615E46791q744o983n340m239m002m430m912n176n562o278o830o617n817n052
61601D66809m462l676k730k166k155k159j799j489j766k396k629k149j432j173
61587D34628j597k321k758k644k217j798j408r41n81n54o37l67J55K88j36m07
61571D16705Q5R71J451J381J243J313J426J542J924K677L498M039M270M372M462
61556D51359M505M323L661K456J080J39p6J76L60J63l23p28p69n11l13l69n00
61539D64633m58l07k24j01L26R58J383J555J985L004M164M685M307L334K010L20
$$ plain form
61642 586235 581762 578092 574909 572163 570585 571022 573432 576933 580867 585535 591669 599397 608012 616632
61628 616632 624680 631595 636452 638150 635950 629797 620257 608325 595161 581794 568968 557180 546791
61615 546791 538047 531064 525724 521485 517483 513053 508141 502965 497403 491125 484295 477678 471861 466809
61601 466809 462347 458671 455941 453775 451620 449461 447662 446173 444407 442011 439382 437233 435801 434628
61587 434628 433031 430710 427952 425308 423091 421293 419885 418944 418363 417809 417172 416805 416960 417248 417112 416705
61571 416705 416790 417761 419212 420593 421836 423149 424575 426117 428041 430718 434216 438255 442525 446897 451359
61556 451359 455864 460187 463848 466304 467384 467523 467447 467623 467983 468146 467823 467095 466326 465815 465502 465133 464633
61539 464633 464175 463868 463644 463543 463869 464827 466210 467765 469750 472754 476918 481603 485910 489244 491254 491574
61523D91574j573l129l887l856l290k383j325m65m2Q6K32M45N56O40J018J745
61507D76346K396K594K556K838L626M607N513O417P382Q124Q344Q241Q325Q723
61493E56032R092R262R544J0027J0068Q966O987N017L348J554k79j143m36J025
61479F29064K101K872M180O020P373P631P145O201M482J988l32j584j974k276
61465F72891k714l064l547m814o944r036j0040r774q988q487q305p680n957l417
61451E80124j095J68L31m6k19L59J622K831L375L607M329N500O212O029N456M841
61435F23424L801K238R31L83r2j176k260k365j705j201r58m76M1L7O8J412L962
61418F26064O013O504O178N958N411L746J350o84j935k715l189l264l086k914
$$ plain form
61523 491574 490001 486872 482985 479129 475839 473456 472131 471666 471624 471710 471942 472387 472943 473583 474601 476346
61507 476346 478742 481336 483892 486730 490356 494963 500476 506893 514275 522399 530743 538984 547309 556032
61493 556032 565124 574386 583930 593957 604025 612991 619978 624995 628343 629897 629618 628475 628039 629064
61479 629064 631165 634037 638217 644237 651610 659241 666386 672587 677069 679057 678725 677141 675167 672891
61465 672891 670177 667113 663566 658752 651808 642772 632732 622958 613970 605483 597178 589498 583541 580124
61451 580124 579029 579197 579528 579482 579263 579622 581244 584075 587450 591057 595386 600886 607098 613127 618583 623424
61435 623424 627225 629463 630394 630777 630685 629509 627249 624884 623179 621978 621020 620544 620585 620622 620690 622102 626064
61418 626064 632077 638581 644759 650717 656128 659874 661224 660540 658605 655890 652701 649437 646351 643437
61404F43437k712k380k133k150k149j850j610j988k820l348l234k914k913l220
61390F08016l451l304k782k182j852j815j627q40M43J618K207K319K510L178M098
61375F06536M621M522M455N185O397O864N907M177K686J600M67p90j780k302k501
61360F46044k424k009j524j483j981k469k412j790p61P14K628M500N683O019N869
61345F54604N468M597L146J619P09M70L24j6j42L67J238J905K262K505K435J563
61329F83054J4j321j768j558j316j212r74m46K50R57J593K115K597L209L966M584
61313F93744M904N306O393Q235J0209J1699J2731J3721J4720J5279J5083J4358
61301H26382J3403J1906R201N258R80k584n077o757p997r079j0103j0828j0899
$$ plain form
61404 643437 640725 638345 636212 634062 631913 630063 628453 626465 623645 620297 617063 614149 611236 608016
61390 608016 604565 601261 598479 596297 594445 592630 591003 590163 590606 592224 594431 596750 599260 602438 606536
61375 606536 611157 615679 620134 625319 631716 638580 644487 648664 651350 652950 653417 652627 650847 648545 646044
61360 646044 643620 641611 640087 638604 636623 634154 631742 629952 629191 629905 632533 637033 642716 648735 654604
61345 654604 660072 664669 667815 669434 670143 670613 670937 670921 670779 671146 672384 674289 676551 679056 681491 683054
61329 683054 683068 681747 679979 678421 677105 675893 674919 674473 674723 675680 677273 679388 681985 685194 689160 693744
61313 693744 698648 703954 710347 718582 728791 740490 753221 766942 781662 796941 812024 826382
61301 826382 839785 851691 860892 866150 867130 864546 859469 852712 844715 835636 825533 814705 803806
61288H03806j0529j0472j1017j1401j0793r389p981o802n558m250l194k352j453
61275G08615o51j89M36J978M041N200M772L563K567J851J162P62J067K102L793
61260G41069O111Q489R882R953R534R297Q660O814M222K244J607J954K676L424
61246H25936M012M410M757M956M548L432K328J920J835J123m75k361l975n236
61232H47210o062o056m838k504L22K879M873O694Q661J0128J0118Q912Q085Q405
61218H96827Q721P628N438L539K501J903J528J492J474R62J85j52j8N4M7M42J205
61201I33776J873K618M132O366Q445J0044J1739J3674J5023J5253J4902J4427
61189A052272J3254J0687P149L717Q62j557l488m585m867m851n044n551o151o578
$$ plain form
61288 803806 793277 782805 771788 760387 749594 740205 732224 725422 719864 715614 712420 710068 708615
61275 708615 707964 707775 708211 710189 714230 719430 724202 727765 730332 732183 733345 734107 735174 737276 741069
61260 741069 747180 755669 765551 775504 785038 794335 802995 809809 814031 816275 817882 819836 822512 825936
61246 825936 829948 834358 839115 844071 848619 852051 854379 856299 858134 859257 858782 856421 852446 847210
61232 847210 841148 835092 830254 827750 828072 830951 835824 842518 851179 861307 871425 880337 888422 896827
61218 896827 905548 913176 918614 922153 924654 926557 928085 929577 931051 932013 932198 932046 932028 932082 932129 932571 933776
61201 933776 935649 938267 942399 948765 957210 967254 978993 992667 1007690 1022943 1037845 1052272
61189 1052272 1065526 1076213 1083362 1087079 1087941 1086384 1082896 1078311 1073444 1068593 1063549 1057998 1051847 1045269
61175A045269o789p036p502q003q303q597r193r849j0033r794r667r649r156q162
61161I23536p487p476p279o095m383l013j846q0K328M561O151P455Q812R923J0304
61146I35411R853Q727P030M882K584N47r31j764j971j507k04J881M169N864O749
61131I81320P393Q409R835J1434J3143J4867J6195J6902J7490J8590J9919K0470
61119A155967J9982J9555K0362K2140K3493K3542K2679K1668K0661J9455J8217
61108A387721J7266J6309J4654J2352J0369R184P809M861K64m819r463j3614j7314
61095A435579k0280k2479k4464k6630k8577k9589k9413k8319k6795k5393k4492
61084A149148k3906k3040k1713k0410j9438j8358j6665j4617j2873j1598j0552
$$ plain form
61175 1045269 1038480 1031444 1023942 1015939 1007636 999039 989846 979997 969964 960170 950503 940854 931698 923536
61161 923536 916049 908573 901294 895199 890816 887803 885957 885877 888205 892766 898917 906372 915184 925107 935411
61146 935411 945264 953991 961021 965903 968487 969034 968103 966339 964368 962861 962657 964538 968707 974571 981320
61131 981320 988713 997122 1006957 1018391 1031534 1046401 1062596 1079498 1096988 1115578 1135497 1155967
61119 1155967 1175949 1195504 1215866 1238006 1261499 1285041 1307720 1329388 1350049 1369504 1387721
61108 1387721 1404987 1421296 1435950 1448302 1458671 1467855 1475664 1480525 1480789 1475970 1466507 1452893 1435579
61095 1435579 1415299 1392820 1368356 1341726 1313149 1283560 1254147 1225828 1199033 1173640 1149148
61084 1149148 1125242 1102202 1080489 1060079 1040641 1022283 1005618 991001 978128 966530 955978
61073I55978r766r480r439q968p883o722n895n079l822k378j433j141r16k53O26
61058H83429J197J485K005K939L854M495N372P048R071J0380J0776J1285J2760
61045I66096J4753J6217J6829J6997J6917J6417J5745J5646J6443J7490J8011
61034A147561J8116J8559J9667K0957K1844K2289K2597K2996K3627K4763K6580
61023A389556K8832L1130L3560L6625M0433M4263M7197M9057N0628N3125N7574
61012A861980O4449P3720Q5306R9370J15854J33936J52654J72367J95061K22971
61002C177668K57514K99777L51049M12158M83050N64169O57990P68675R00935
60993G872985J060219J253335J487004J762684K065494K346621K511751K442184
$$ plain form
61073 955978 946212 936732 927293 918325 910442 903720 897825 892746 888924 886546 885113 883972 883056 882803 883429
61058 883429 884626 886111 888116 891055 894909 899404 904776 911824 920895 931275 942051 953336 966096
61045 966096 980849 997066 1013895 1030892 1047809 1064226 1079971 1095617 1112060 1129550 1147561
61034 1147561 1165677 1184236 1203903 1224860 1246704 1268993 1291590 1314586 1338213 1362976 1389556
61023 1389556 1418388 1449518 1483078 1519703 1560136 1604399 1651596 1700653 1751281 1804406 1861980
61012 1861980 1926429 2000149 2085455 2184825 2300679 2434615 2587269 2759636 2954697 3177668
61002 3177668 3435182 3734959 4086008 4498166 4981216 5545385 6203375 6972050 7872985
60993 7872985 8933204 10186539 11673543 13436227 15501721 17848342 20360093 22802277
60985B2802277K060290J402777O34621k4996m13402m87278l07572Q137L13648
60976B5988502M49238K85093k06726r12777j625191k151560k404061k408229k247746
60967A4766543k005284j737561j477957j244137j042072q70228p24874o02850
60959E061580n01148m16687l47290k91810k48827k15906j90322j69893j53041
60950B526656j38638j25977j14515j03644r3008q2912p3965o6505o0685n6760
60940A610047n4691n3697n2841n1852n0775m9185m6525m3162m0150l7803l5344
60929A094022l2196k8849k6089k3912k1701j9124j6473j4296j2879j2007j1160
60918H75336j0134r262q831q514p864p094o713o494n658m176l010k795l101l378
$$ plain form
60985 22802277 24862567 26265344 26899965 26874969 26461567 25974289 25666717 25674854 25988502
60976 25988502 26437740 26722833 26516107 25603330 23978139 21826579 19422518 17014289 14766543
60967 14766543 12761259 11023698 9545741 8301604 7259532 6389304 5664430 5061580
60959 5061580 4560432 4143745 3796455 3504645 3255818 3039912 2849590 2679697 2526656
60950 2526656 2388018 2262041 2147526 2043882 1950874 1867962 1793997 1727492 1666807 1610047
60940 1610047 1555356 1501659 1448818 1396966 1346191 1297006 1250481 1207319 1167169 1129366 1094022
60929 1094022 1061826 1032977 1006888 982976 961275 942151 925678 911382 898503 886496 875336
60918 875336 865202 855940 847109 838595 830731 823637 816924 810430 804772 800596 797586 794791 791690 788312
60904G88312l857m841n766n788n006m380m536n228n849o042n812n516n622o184
60890G13885o600o341n747n575n868n821m896l496k328j570j058q60j218k047
60876F60460k959l760m480m938m669l571k247j457j286j194q13l83l43p12j061
60861F26587r93n54j41q3k59k04L44J099J611J867K200K590K484J486o3j476k414
60844F34081k875k708j720k80N77j3j919m146n768o647p233p754p808o932n461
60829E73394m414m351m712m586l835l098k835k822k633k190j690j338j288j587
60815E32015k036k249k125k025k349k938l224k956k567k611k990k996k216j093
60801D97640m06l62n23n76o74r64j168r45m04O0K68L23L35L70N21O96N32j19p39
$$ plain form
60904 788312 784455 779614 773848 768060 763054 758674 754138 748910 743061 737019 731207 725691 720069 713885
60890 713885 707285 700944 695197 689622 683754 677933 673037 669541 667213 665643 664585 663725 662507 660460
60876 660460 657501 653741 649261 644323 639654 636083 633836 632379 631093 629899 629086 628703 628360 627648 626587
60861 626587 625594 625040 624899 624816 624557 624353 624697 625796 627407 629274 631474 634064 636548 638034 637971 636495 634081
60844 634081 631206 628498 626778 626498 627075 627062 625143 620997 615229 608582 601349 593595 585787 578855 573394
60829 573394 568980 564629 559917 555331 551496 548398 545563 542741 540108 537918 536228 534890 533602 532015
60815 532015 529979 527730 525605 523580 521231 518293 515069 512113 509546 506935 503945 500949 498733 497640
60801 497640 497234 496872 496349 495773 495099 494135 492967 492022 491618 491678 491946 492269 492604 492974 493495 494191 494723 494604 493865
60782D93865o39L3L58j94j095j601j798k256k898k893j824l74M81N76L94J48l63
60765D79920r78j016j64R64J590J642J504J226O73J39J90Q57J602K086K344K258
60749D94837J575N82J00M30R51J090J118J534K172K390J796L93j561l368m036
60734E00003l211j710o49l22l62n27p29o35l4N74M99j09m31j52J85O6m02r07j329
60715D89818j546j332p80m41p64j560k184k176j637j153j218j660j770j200m99
60700D69898m19r57j471j525j188o75k11j13m88q40n62K33Q27P98L88n0l73m65
60682D62807k29J33L31N00J037J913K638K990L222L476L531L365L355L674L910
60667D96653L550K528J105m23j730k566k964l092k878k190j355r33q94o03J93
$$ plain form
60782 493865 493226 493259 493617 493423 492328 490727 488929 486673 483775 480882 479058 478684 479165 479741 480135 480283 479920
60765 479920 478942 477926 477762 478726 480316 481958 483462 484688 485361 485500 485690 486547 488149 490235 492579 494837
60749 494837 496412 496994 497094 497524 498475 499565 500683 502217 504389 506779 508575 508968 507407 504039 500003
60734 500003 496792 495082 494433 494111 493749 493222 492493 491858 491824 492398 492897 492788 492357 492205 492390 492456 492054 491147 489818
60715 489818 488272 486940 486160 485719 484955 483395 481211 479035 477398 476245 475027 473367 471597 470397 469898
60700 469898 469479 468522 467051 465526 464338 463663 463452 463339 462851 462011 461449 461682 462509 463307 463695 463645 463272 462807
60682 462807 462578 462711 463042 463542 464579 466492 469130 472120 475342 478818 482349 485714 489069 492743 496653
60667 496653 500203 502731 503836 503413 501683 499117 496153 493061 490183 487993 486638 485705 484811 484208 484401
60652D84401R81J284J264J239J150R15P86R37J138J174J179J110M57r55k340k776
60636D91944k460k377k852l119k466j194j91J12K5N3K99M85L50j2k06J09Q91J663
60618D81054J785R98j79q34n70J43O93J034J280J106K18p70q20O0P02L68l25m81
60600D85462k00j10k06N9O92R31K64p99j169k74J337K496K563K036J889K408K996
60583E00375L101K816K486K217K022K015K164K203J993J687J419J207J342K317
60569E29364L992N425N894N743N685N794N752N729O225P178P914Q056P872P587
60555F18210O840N078K360m75k344k722k039j200o84j86P68K109L341M162M726
60540F37944N377O332P529Q683R652J0762J2553J5048J7572J9466K0690K1537
$$ plain form
60652 484401 485382 486666 487930 489169 490319 491234 492020 492957 494095 495269 496448 497558 498015 497060 494720 491944
60636 491944 489484 487107 484255 481136 478670 477476 477285 477397 477422 477475 477774 478259 478609 478597 478391 478500 479391 481054
60618 481054 482839 483837 483658 482824 482254 482397 483090 484124 485404 486510 486728 485958 485138 485198 485900 486268 485943 485462
60600 485462 485262 485152 484946 485005 485697 486628 486892 486093 484924 484650 485987 488483 491046 493082 494971 497379 500375
60583 500375 503476 506292 508778 510995 513017 515032 517196 519399 521392 523079 524498 525705 527047 529364
60569 529364 533356 538781 544675 550418 556103 561897 567649 573378 579603 586781 594695 602751 610623 618210
60555 618210 625050 630128 632488 632013 629669 626947 624908 623708 623024 622838 623606 625715 629056 633218 637944
60540 637944 643321 649653 657182 665865 675517 686279 698832 713880 731452 750918 771608 793145
60528G93145K2037K1887K0678J7973J3513P644J356m408r249j3042j5589j6836
60516H39109j7033j6353j4731j2441j0375r193q472p284n398l389j687j43J505
60503G34115L300N252P428R828J2478J5605J9306K3169K6647K9796L3071L6378
60491I56373L8908M0197M0754M1249M1373M0069L6871L2579K8441K4969K1773
60480A343556J8317J4323R384K705o218j6807k7659l7583m5983n2445n6496n7966
60468A087128n7137n4361m9965m4658l9458l4973l1058k7414k4116k1310j8901
60457F83777j6809j5171j4019j3085j2201j1382j0396q820o824n253m506l963
60445E61348l025k100j838k052k083j769j360q48k19P0l36r70j253j447k072k690
$$ plain form
60528 793145 815182 837069 857747 875720 889233 896877 898233 893825 884576 871534 855945 839109
60516 839109 822076 805723 790992 778551 768176 758983 750511 743227 737829 734440 732753 732610 734115
60503 734115 737415 742667 750095 759923 772401 788006 807312 830481 857128 886924 919995 956373
60491 956373 995281 1035478 1076232 1117481 1158854 1198923 1235794 1268373 1296814 1321783 1343556
60480 1343556 1361873 1376196 1385580 1388285 1382067 1365260 1337601 1300018 1254035 1201590 1145094 1087128
60468 1087128 1029991 975630 925665 881007 841549 806576 775518 748104 723988 702678 683777
60457 683777 666968 651797 637778 624693 612492 601110 590714 581894 575070 569817 565311 561348
60445 561348 558323 556223 554385 552333 550250 548481 547121 546273 546054 546124 545788 544818 543565 542118 540046 537356
60429E37356k434j495q91p90l46O28J111N09k47N6J321K513L012L003K811K553
60413E48670K218J753J143O03M78Q29J376J940K629L469M229M708M875M671M017
60398E87608L107K308J743J359J350J981K981L683L999M548N536O143N574M263
60384F36183L459L722M382M461L816L167L181L682L921L526K919K692K920L313
60370F85344L637L603K836J518O75J039J897J969J265J037J854K845L196L335
60356G16050M035N167O020O287O057N416M696M633N602O958P703P566O873N729
60342G98792L956J726m31k238l875n520p012q010q284p907p319p025p093p061
60328G32699o593n941n601n676n859n839n553n096m565l904k927j630l92M54J125
$$ plain form
60429 537356 534922 533427 532536 531746 531400 532028 533139 533648 533401 533457 534778 537291 540303 543306 546117 548670
60413 548670 550888 552641 553784 554387 554865 555694 557070 559010 561639 565108 569337 574045 578920 583591 587608
60398 587608 590715 593023 594766 596125 597475 599456 602437 606120 610119 614667 620203 626346 631920 636183
60384 636183 639642 643364 647746 652207 656023 659190 662371 666053 669974 673500 676419 679111 682031 685344
60370 685344 688981 692584 695420 696938 697613 698652 700549 702518 703783 704820 706674 709519 712715 716050
60356 716050 720085 725252 731272 737559 743616 749032 753728 758361 763963 770921 778624 786190 793063 798792
60342 798792 802748 804474 804043 801805 797930 792410 785398 777388 769104 761197 753878 746853 739760 732699
60328 732699 726106 720165 714564 708888 703029 697190 691637 686541 681976 678072 675145 673515 673123 673577 674702
60313F74702K062L261M429N784P815J0163J1593J1497J0680J0169R992R720R474
60300G81341R606R862R818R704R937R960Q525N122M85m334q710j2222j4456j5317
60286G99321j5200j4615j3845j2972j1948j0724r458q461p755o974o093n747o329
60273F69200p128p092o211n407n153n017m553l844l057k237j717j941k581k590
60259F10672j539k35M04M98P11J177J573J886K367K874K920K434J944J934K321
60244F31941K595K296J373K82l52l87l35o09q49m45M46J000R96J288K653M607
60228F46500N932O199O150O589P461Q269Q878R471R990J0204J0229J0515J1192
60215G57579J1835J2047J1916J1721J1530J1403J1653J2455J3373J3706J3291
$$ plain form
60313 674702 676764 680025 684454 690238 698053 708216 719809 731306 741986 752155 762147 771867 781341
60300 781341 790947 800809 810627 820331 830268 840228 848753 853875 854360 850026 841316 829094 814638 799321
60286 799321 784121 769506 755661 742689 730741 720017 710559 702098 694343 687369 681276 675529 669200
60273 669200 662072 654980 648769 643362 638209 633192 628639 624795 621738 619501 617784 615843 613262 610672
60259 610672 609133 608898 609302 609800 610511 611688 613261 615147 617514 620388 623308 625742 627686 629620 631941
60244 631941 634536 636832 638205 638487 638135 637748 637413 636804 635955 635510 635956 636956 637952 639240 641893 646500
60228 646500 652432 658631 664781 671370 678831 687100 695978 705449 715439 725643 735872 746387 757579
60215 757579 769414 781461 793377 805098 816628 828031 839684 852139 865512 879218 892509
60204H92509J2593J1996J1436J0784J0199R821R414Q561P126N368L705K428J512
60191I97452O08o55k227l667m711n558o460p244p524p273o874o664o641o617o416
60176I19529n890n003l948l016k265j568r98q73j260j754j984k136k661l569m402
60161H78202m856n106n404n630n391m457l018j533l91L95J119J966K774L291L508
60146H55469L434K844J728Q02R26J986K970L331L620M460N594O485P253Q273R267
60131I18442R615R360R118R060Q671P541N771L649J536J01j25M68Q96R01J280
60116I86284K631M373N476N605N150M585M220M192M226L698K366Q33j58o37j216
60101A031628k160l044l283k708j619n61oj29q32j953l240m191m423m242m395
$$ plain form
60204 892509 905102 917098 928534 939318 949517 959338 968752 977313 984439 989807 993512 995940 997452
60191 997452 998060 997405 995178 991511 986800 981242 974782 967538 960014 952741 945867 939203 932562 925945 919529
60176 919529 913639 908636 904688 901672 899407 897839 896841 895968 894708 892954 890970 888834 886173 882604 878202
60161 878202 873346 868240 862836 857206 851815 847358 844340 842807 842416 842811 843930 845896 848670 851961 855469
60146 855469 858903 861747 863475 864277 865203 867189 870159 873490 877110 881570 887164 893649 900902 909175 918442
60131 918442 928057 937417 946535 955595 964266 971807 977578 981227 982763 982864 982739 983207 984103 985004 986284
60116 986284 988915 993288 998764 1004369 1009519 1014104 1018324 1022516 1026742 1030440 1032806 1033639 1033481 1032844 1031628
60101 1031628 1029468 1026424 1023141 1020433 1018814 1018253 1018247 1018118 1017286 1015333 1012093 1007902 1003479 999237 994842
60086I94842n032n491n331n006n018m953m102k687j696j609k029k566l415m800
60072I41107o417p784q782r659j0620j1595j2244j2158j1271j0108r375r249r204
60059H12641q647p555o405n591m977m025k410n05Q54J167P17J90P2N63J731L366
60043G81186M875N765O182O611P064O969N926M280K732J677J011M56j51q40j642
60028H32101k678m004n421o567p286p769q241q748r325j0044j0604j0256q604
60015G32554o371m851m549m830m875m530m003l274k255j284r70j473k220k545
60001F84524k335j987j787j548q64L62J747K674K729K028J323J557L119N425P445
59986G04412Q550Q731Q248P457O851O652O323N033K835P89l50j005j906k963l597
$$ plain form
60086 994842 989810 984319 978988 973982 968964 964011 959909 957222 955526 953917 951888 949322 945907 941107
60072 941107 934690 926906 918124 908465 897845 886250 874006 861848 850577 840469 831094 821845 812641
60059 812641 803994 796439 790034 784443 779466 775441 773031 772526 773380 774547 775264 775454 775526 776089 777820 781186
60043 781186 786061 791826 798008 804619 811683 818652 824578 828858 831590 833267 834278 834734 834583 833743 832101
60028 832101 829423 825419 819998 813431 806145 798376 790135 781387 772062 762018 751414 741158 732554
60015 732554 726183 721332 716783 711953 707078 702548 698545 695271 693016 691732 690762 689289 687069 684524
60001 684524 682189 680202 678415 676867 676003 676365 678112 680786 683515 685543 686866 688423 691542 696967 704412
59986 704412 712962 721693 729941 737398 744249 750901 757224 762257 765092 765881 765531 764526 762620 759657 756060
59971G56060l676l472k965k014r83l89lQ75K264L433M141N104O801Q560R340Q883
59955G91959P593N742L460J207m54j510k422l360l979l990l575l112k764k492
59941G82303k245j989j689j383j148r23m47M97J887L461M919O059O864P519Q201
59926H11886Q764Q693P592N657L580K025J331J588K638L982N024N712O635Q238
59912H83345J0123J1476J1994J1992J1661J0737R000O693M234J771p26l171n319
59899I63810o933p977q629r143r480r253q313p181o391n574l861j270J090K434
59885H83329L228M206N212N718N965O707Q047R266R839R971J0082J0293J0429
59872I82292J0202R334P897O434N326M208K512M49j119j786j951k022j979j907
$$ plain form
59971 756060 752384 748912 745947 743933 742950 742561 742558 743433 745697 749130 753271 758375 765176 773736 783076 791959
59955 791959 799552 805294 808754 809961 809507 807997 805575 802215 798236 794246 790671 787559 784795 782303
59941 782303 780058 778069 776380 774997 773849 772926 772479 772976 774863 778324 783243 789302 796166 803685 811886
59926 811886 820650 829343 836935 842592 846172 848197 849528 851116 853754 857736 862760 868472 875107 883345
59912 883345 893468 904944 916938 928930 940591 951328 960328 967021 971255 973026 972300 969129 963810
59899 963810 956877 948900 940271 931128 921648 912395 904082 896901 890510 884936 881075 879805 880895 883329
59885 883329 886557 890763 895975 901693 907658 914365 922412 931678 941517 951488 961570 971863 982292
59872 982292 992494 1001828 1009725 1016159 1021485 1025693 1028205 1028654 1027535 1025749 1023798 1021776 1019797 1017890
59858A017890k198k832k983j999m44L86j01j339k555l580m539n170m928l677j905
59843I80026q8J851M203O766Q834R906J0038R414P949N609K867O50j75P99L253
59828A051902O074P869P829O048K972r57m874p379p553n852l541j324R18L297
59814A055429N464O981P521O716M414J235j691l728n006n627n223l700j945j212
59800A059628j913l379m760n822o835p892q635q690q263q032q323q668q477p956
59786I61983p945q830j0038j0725j0661j0213r680q976p899o531n198m051k890
59773H58346j540k42O63J400K588M316N858O638P042P785Q880R767J0256J0728
59759I32485J1415J2093J2588J3152J4185J5863J8063K0331K1862K1914K0462
$$ plain form
59858 1017890 1015692 1012860 1009877 1007878 1007434 1007820 1007719 1006380 1003825 1000245 995706 990536 985608 981931 980026
59843 980026 979938 981789 985992 992758 1001592 1011498 1021536 1030950 1038899 1044508 1047375 1048025 1047850 1048649 1051902
59828 1051902 1057976 1065845 1073674 1079722 1082694 1081737 1076863 1069484 1061931 1056079 1052538 1051214 1052132 1055429
59814 1055429 1060893 1067874 1075395 1082111 1086525 1087760 1086069 1082341 1077335 1071708 1066485 1062785 1060840 1059628
59800 1059628 1057715 1054336 1049576 1043754 1036919 1029027 1020392 1011702 1003439 995407 987084 978416 969939 961983
59786 961983 954038 945208 935170 924445 913784 903571 893891 884915 877016 870485 865287 861236 858346
59773 858346 856806 856564 857227 858627 861215 865531 871389 878027 885069 892854 901734 911501 921757 932485
59759 932485 943900 955993 968581 981733 995918 1011781 1029844 1050175 1072037 1093951 1114413
59748A114413J8348J6588J5549J4715J3298J1080Q609O397M187J452j555l975
59736A219106n661p381r380j0735j0803j0398j0559j0875j0325r133q466q488
59724A106902q156p034n966n608n510n090m572m352m246l927l475k961k076o00
59710A043329J209L022M778O460Q050R919J2538J5484J7500J7984J7749J7848
59698A175870J8244J8272J7870J7637J7921J8463J8800J8545J7366J5114J1984
59687A366086Q450N072K351M32j092k803m749o516p925r217j0523j1693j2701
59674A315172j3634j4207j3973j3169j2587j2319j1418r216o296l623j400O58
59662A203988K556M276O297R046J1963J3876J4270J3733J3208J3156J3396J3410
$$ plain form
59748 1114413 1132761 1149349 1164898 1179613 1192911 1203991 1212600 1218997 1223184 1224636 1223081 1219106
59736 1219106 1213445 1206064 1196684 1185949 1175146 1164748 1154189 1143314 1132989 1123856 1115390 1106902
59724 1106902 1098746 1091712 1085746 1080138 1074628 1069538 1064966 1060614 1056368 1052441 1048966 1046005 1043929 1043329
59710 1043329 1044538 1047560 1052338 1058798 1066848 1076767 1089305 1104789 1122289 1140273 1158022 1175870
59698 1175870 1194114 1212386 1230256 1247893 1265814 1284277 1303077 1321622 1338988 1354102 1366086
59687 1366086 1374536 1379608 1381959 1382391 1381299 1378496 1373747 1367231 1359306 1350089 1339566 1327873 1315172
59674 1315172 1301538 1287331 1273358 1260189 1247602 1235283 1223865 1214649 1208353 1204730 1203330 1203988
59662 1203988 1206544 1210820 1217117 1226163 1238126 1252002 1266272 1280005 1293213 1306369 1319765 1333175
59650A333175J2733J1136Q455M473o62o102j0936j5168j9396k3491k6442k7652
59638A240123k7630k7065k6050k4669k3347k2077k0060j6945j3740j1742j1097
59627A015701j1215j1991j3688j5994j8081j9414j9806j9006j7048j4737j2944
59616H41777j1545r786p628n862m925m367l587k478j238m7Q74J345J511J776K308
59601G98128K823K807J991P17j12J41J042J595J587J703K083J835N65o00n35J32
59585H15902qj028j828k057k439l292m035m406m917n737o251o116n840n810n578
59570G56560m707l572k755k226j739j444j530j663j426j030r79j198j147o81k79
59555G30184k63k17N00J895L231L861L918M064M651N419O061O715P668Q802R733
$$ plain form
59650 1333175 1345908 1357044 1365499 1369972 1369310 1363208 1352272 1337104 1317708 1294217 1267775 1240123
59638 1240123 1212493 1185428 1159378 1134709 1111362 1089285 1069225 1052280 1038540 1026798 1015701
59627 1015701 1004486 992495 978807 962813 944732 925318 905512 886506 869458 854721 841777
59616 841777 830232 820446 812818 806956 802031 797664 794077 791599 790361 790314 791188 792533 794044 795820 798128
59601 798128 800951 803758 805749 806466 806354 806495 807537 809132 810719 812422 814505 816340 816905 816305 815770 815902
59585 815902 815894 814866 813038 810981 808542 805250 801215 796809 791892 786155 779904 773788 767948 762138 756560
59570 756560 751853 748281 745526 743300 741561 740117 738587 736924 735498 734468 733489 732291 731144 730463 730184
59555 730184 729921 729704 730204 732099 735330 739191 743109 747173 751824 757243 763304 770019 777687 786489 796222
59540G96222J0385J1120J2268J3851J5809J8241K1193K4076K5329K3029J6420
59529I87943P126j555o925q517p649n943m424l433k779k170j813k348l928n753
59515I37832o997p795q833j0302j1740j2711j3039j2625j1554j0313r387q746
59503H13790q058p227o282n017l251j319J97J105J572J656J426J311J863L171
59489G94937M880O576P843Q358Q343Q526R116R258Q136O226M678L855L292K773
59475H86797K499K376K101J855J968J966R62r10k399k729k435k383k774l264l395
59460H80235k642q10J400K935L706M609O099P487Q023P858P469O900O045N156
59446I44470M395L387J721l82k367m068n705p340q609q986q241o817n635n209
$$ plain form
59540 796222 806607 817727 829995 843846 859655 877896 899089 923165 948494 971523 987943
59529 987943 995069 993514 986589 978072 970423 964480 960056 956623 953844 951674 949861 947513 943585 937832
59515 937832 930835 923040 914207 903905 892165 879454 866415 853790 842236 831923 822536 813790
59503 813790 805732 798505 792223 787206 783955 782636 782833 783938 785510 787166 788592 789903 791766 794937
59489 794937 799817 806393 814236 822594 830937 839463 848579 857837 865973 872199 876877 880732 884024 886797
59475 886797 889296 891672 893773 895628 897596 899562 900524 899614 897215 894486 892051 889668 886894 883630 880235
59460 880235 877593 876783 878183 881118 884824 889433 895532 903019 911042 918900 926369 933269 939314 944470
59446 944470 948865 952252 953973 953591 951224 947156 941451 934111 925502 916516 908275 901458 895823 890614
59432H90614n024m188k619j096j95K42N52R05J628L190N597Q266J0708J2836J4572
59417I35988J5766J6687J7859J9216K0100K0532K1783K4993K9462L2698L1959
59406A187043K5857J5207K942p232j2890j3921j1695p549k094M509J1746J7945
59394A209868K0232J6099N675p681j9384k6411k8506k7346k4850k1911j8438j4437
59382A062910j0717q166o650n277l593j876l82R01J791K017J974K537L865N100
59368A044434N498N208M712M269M186M871O184P377P955Q095Q012P736P760Q949
59354A135246J1293J3616J5017J5856J6800J7778J8572J9562K0972K2048K1966
59343A328726K1012J9989J8858J6998J4418J1730R011N638J374l133p040j0006
$$ plain form
59432 890614 885590 881402 878783 877687 877492 877734 878286 879191 880819 884009 889606 897872 908580 921416 935988
59417 935988 951754 968441 986300 1005516 1025616 1046148 1067931 1092924 1122386 1155084 1187043
59406 1187043 1212900 1228107 1231049 1223817 1210927 1197006 1185311 1177762 1175668 1180177 1191923 1209868
59394 1209868 1230100 1246199 1251874 1244193 1224809 1198398 1169892 1142546 1117696 1095785 1077347 1062910
59382 1062910 1052193 1044027 1037377 1032100 1028507 1026631 1026249 1027150 1028941 1030958 1032932 1035469 1039334 1044434
59368 1044434 1049932 1055140 1059852 1064121 1068307 1073178 1079362 1086739 1094694 1102789 1110801 1118537 1126297 1135246
59354 1135246 1146539 1160155 1175172 1191028 1207828 1225606 1244178 1263740 1284712 1306760 1328726
59343 1328726 1349738 1369727 1388585 1405583 1420001 1431731 1440742 1446380 1447754 1444621 1437581 1427575
59331A427575j2215j4110j6104j8153j9676k0273k0306k0407k0667k0780k0726
59320A224158k0665k0339j9233j7389j5587j4550j4311j4397j4303j3796j3022
59309A046566j2405j2201j2094j1423r883p929o408n762n543m866l450j964j046
59296I51592k92J203L460N634P374R361J2159J5333J7921J9045J7736J3161N821
59283A079508k080q256j1914j3288j2417r370n218j504J338M201P791J1603J4565
59270A054959J6181J6733J6717J6362J5651J4596J3396J2185J0705Q535N728K852
59258A204600L85j605l168m325n333o487p565p994p787p623p743p561o760o030
59244A125004o118o822p476p844p900p409o469n932o452p484q027p951p859p968
$$ plain form
59331 1427575 1415360 1401250 1385146 1366993 1347317 1327044 1306738 1286331 1265664 1244884 1224158
59320 1224158 1203493 1183154 1163921 1146532 1130945 1116395 1102084 1087687 1073384 1059588 1046566
59309 1046566 1034161 1021960 1009866 998443 988560 980631 974223 968461 962918 958052 954602 952638 951592
59296 951592 951300 952503 955963 961597 968971 978332 990491 1005824 1023745 1042790 1060526 1073687 1079508
59283 1079508 1077428 1069172 1057258 1043970 1031553 1022183 1016965 1015461 1016799 1021000 1028791 1040394 1054959
59270 1054959 1071140 1087873 1104590 1120952 1136603 1151199 1164595 1176780 1187485 1196020 1201748 1204600
59258 1204600 1204985 1203380 1200212 1195887 1190554 1184067 1176502 1168508 1160721 1153098 1145355 1137794 1131034 1125004
59244 1125004 1118886 1112064 1104588 1096744 1088844 1081435 1074966 1069034 1062582 1055098 1047071 1039120 1031261 1023293
59230A023293p975p821p801p983q229q605r194r625r439q812q322q170q030p526
59216I05761o490n022l706l295l662l592k277n08M80P82J455K751L810M089L954
59201H94530L851L856M130M918N856O212O060O375P629R015R528R199Q786Q728
59187I88673Q818Q652P978O812N424M040K499M34k080m339n664o036o050o295
59173A002866o934p721q342q658q583q012p103o490o583o765n924m000k240j567
59159I13944j481j085m85l76q31j303j504j548j483j431j894l226m971o295o967
59144H79064p371p818q317q730q751q129p282o995p101o329m243k271j706j586
59130G92435r5K617M704N422N859O801P641P846Q074R071J0561J1767J2267J1983
$$ plain form
59230 1023293 1015318 1007497 999696 991713 983484 974879 965685 956060 946621 937809 929487 921317 913287 905761
59216 905761 899271 894249 890543 887248 883586 879994 877717 877209 877689 878471 879926 882677 886487 890576 894530
59201 894530 898381 902237 906367 911285 917141 923353 929413 935788 943417 952432 961960 971159 979945 988673
59187 988673 997491 1006143 1014121 1020933 1026357 1030397 1032896 1033330 1031250 1026911 1021247 1015211 1009161 1002866
59173 1002866 995932 988211 979869 971211 962628 954616 947513 941023 934440 927675 921751 917751 915511 913944
59159 913944 912463 911378 910893 910517 909686 908383 906879 905331 903848 902417 900523 897297 892326 886031 879064
59144 879064 871693 863875 855558 846828 838077 829948 822666 815671 808570 802241 797998 795727 794021 792435
59130 792435 792340 794957 799661 805083 810942 817743 825384 833230 841304 850375 860936 872703 884970 896953
59116H96953J1148J0533J0853J1678J1819J0981J0048R535Q819P349N499L777
59104A008992K159Q14N27J567K851K974J669k82k084l388m158m566m797m771m369
59089I93138l887l670l344k274q36k58r84k170l101m020n126n860n909n992o720
59074I38987p517p502o787o044n392m647m125m167m303l822l010k867l737m982
59060H70085o005o821p563q080q203p929p274o251n029l811k602j350k20M87O79
59045H00113N74O01J216K474L676L893L067K138J839J946K063K501L682N168O091
59030H41042O381O797P853R386J1243J3574J6250J8631K0234K1197K1620K0920
59018A015128J8335J3950Q755L721q17m787p934j0079j1521j2615j3075j2219
$$ plain form
59116 896953 908101 918634 929487 941165 952984 963965 974013 983548 992367 999716 1005215 1008992
59104 1008992 1011151 1011965 1012492 1014059 1016910 1019884 1021553 1021271 1019187 1015799 1011641 1007075 1002278 997507 993138
59089 993138 989251 985581 982237 979963 979127 978869 977885 975715 972614 968594 963468 957608 951699 945707 938987
59074 938987 931470 923968 917181 911137 905745 901098 896973 892806 888503 884681 881671 878804 875067 870085
59060 870085 864080 857259 849696 841616 833413 825484 818210 811959 806930 803119 800517 799167 798947 799434 800113
59045 800113 800687 801288 802504 804978 808654 812547 815614 817752 819591 821537 823600 826101 829783 834951 841042
59030 841042 847423 854220 862073 871459 882702 896276 912526 931157 951391 972588 994208 1015128
59018 1015128 1033463 1047413 1056168 1059889 1059072 1054285 1046351 1036272 1024751 1012136 999061 986842
59006I86842j0046p485n324l419j314Q41K529L662M487M979M945M560M155L569
58992I92981K423R53j32n87q10j019r53m99Q6P27J651K772L699M531O010Q501
58976A020334J1421J3967J5902J7280J8004J8019J7456J6212J3908J0708P670
58965A180881N787M932M192K966J292o10k682m921p250r434j1183j2454j3669
58952A137847j5253j6986j8146j8410j8135j7726j7114j6047j4467j2495j0342
58941I62726q328o618m961l073j203K87J723L671N677O457N602M253L595L470
58927I73278L078K225J219M4j501l124m197m486m260l814l256k602j796p19N98
58912I50687J992L514N381P394Q867R454R708J0419J1646J2747J3172J2983J2725
$$ plain form
59006 986842 976796 969311 963987 960568 959254 960095 962624 966286 970773 975752 980697 985257 989412 992981
58992 992981 995404 996357 996225 995638 994828 993809 992856 992357 992443 993170 994821 997593 1001292 1005823 1011833 1020334
58976 1020334 1031755 1045722 1061624 1078904 1096908 1114927 1132383 1148595 1162503 1173211 1180881
58965 1180881 1186668 1191600 1195792 1198758 1200050 1199440 1196758 1191837 1184587 1175153 1163970 1151516 1137847
58952 1137847 1122594 1105608 1087462 1069052 1050917 1033191 1016077 1000030 985563 973068 962726
58941 962726 954398 947780 942819 939746 938543 938830 940553 944224 949901 956358 961960 966213 969808 973278
58927 973278 976356 978581 979800 979844 978343 975219 971022 966536 962276 958462 955206 952604 950808 950089 950687
58912 950687 952679 956193 961574 968968 977835 987289 996997 1007416 1019062 1031809 1044981 1057964 1070689
58899A070689J2998J4031J5510J6897J7797J7966J7273J6032J5086J4996J5391
58888A244666J5682J6170J7552J9565K1049K1430K1106K0318J8719J6393J4163
58877A446813J2414J0526Q035N457L275J012k061n841r723j3304j6208j7864j8195
58864A404336j7959j7749j7253j6163j5147j5055j5580j5603j4694j3478j2614
58853A233041j2047j1290j0055q649p876q371r907j1750j3695j6109j8807k0693
58841A083792k1038k0406j9787j9393j8854j8000j6846j5306j3517j1999j0958
58830H97688r872q285o531n126l899k394p28N48J245J693K297L242M338N023M942
58815H84181M581M781N524N914N520M778L863K306K35j171j291j128j901l463
$$ plain form
58899 1070689 1083687 1097718 1113228 1130125 1147922 1165888 1183161 1199193 1214279 1229275 1244666
58888 1244666 1260348 1276518 1294070 1313635 1334684 1356114 1377220 1397538 1416257 1432650 1446813
58877 1446813 1459227 1469753 1477788 1483245 1486520 1487532 1485471 1479630 1469907 1456603 1440395 1422531 1404336
58864 1404336 1386377 1368628 1351375 1335212 1320065 1305010 1289430 1273827 1259133 1245655 1233041
58853 1233041 1220994 1209704 1199649 1191000 1183124 1174753 1164846 1153096 1139401 1123292 1104485 1083792
58841 1083792 1062754 1042348 1022561 1003168 984314 966314 949468 934162 920645 908646 897688
58830 897688 887816 879531 873000 867874 863975 861581 860853 861401 862646 864339 866636 869878 874216 879239 884181
58815 884181 888762 893543 899067 904981 910501 915279 919142 921448 921683 920512 919221 918093 916192 912729
58801I12729m950o147p144p435o535n011l914l505l340l050k306o51J710L575
58787H64026M178M431N698P933J0058J1695J3264J4750J5608J5785J5748J5516
58775I98690J4608J2885J0653P945M523N19l558p313j0469j2676j3859j4429j4594
58762I72925j3993j2547j0985r839q621o854n157m322m062l809m003n289o979
58749H76465p752p568p382p308o499m778k915j214P39K787M043M317M550N341
58735H52826O096O038N298M577M380M798N448N566M701L305K116J224M08J5N66
58720I07362J729K682L402M528O078P342Q039Q517Q765Q277P091N889M831L236
58706I87768O34k600n986r477j3013j6240j8930k1112k2604k3026k2334k0944
$$ plain form
58801 912729 907779 901632 894488 887053 880518 875507 871593 868088 864748 861698 859392 858741 860451 864026
58787 864026 868204 872635 878333 886266 896324 908019 921283 936033 951641 967426 983174 998690
58775 998690 1013298 1026183 1036836 1044781 1049304 1049823 1046265 1038952 1028483 1015807 1001948 987519 972925
58762 972925 958932 946385 935400 925561 916940 910086 904929 900607 896545 892736 888733 883444 876465
58749 876465 868713 861145 853763 846455 839956 835178 832263 831049 831788 834575 838618 842935 847485 852826
58735 852826 858922 864960 870258 874835 879215 884013 889461 895027 899728 903033 905149 906373 906781 906796 907362
58720 907362 909091 911773 915175 919703 925781 933123 941162 949679 958444 966721 973812 979701 984532 987768
58706 987768 988402 985802 979816 970339 957326 941086 922156 901044 878440 855414 833080 812136
58694H12136j9258j7539j6052j4791j3238j1034q648o845n759n129m981n263n245
58681F78354m249k670j397n24L03P78L63m04m07L22N83j30r79j082m06Q05K488
58664F71748M454O438Q482J0470J1370J0056O814L027n61m211p849j0651j2122
58651F97465j2534j2114j0824r134p917p328o738n901n247m867m229l150k038
58638F05444j080qJ150K001K583L296L976L910K898J447k4j351k146k144j861
58623F18091j918j900j074P6L97m4LJ027K324L512M970O527P295P111O793O593
58607F59783N860M587L848M198M842M949M614M068L123J905J098R65J016R09P57
58592G06522N01O8J63J648M140O470Q435J0657J2786J3725J3750J4410J5920J6512
$$ plain form
58694 812136 792878 775339 759287 744496 731258 720224 711576 704731 698972 693843 688862 683599 678354
58681 678354 674105 671435 670038 669514 669817 670595 670958 670554 670147 670469 671052 670922 669943 668861 668455 669260 671748
58664 671748 676202 682640 691122 701592 712962 723018 729832 732859 732298 728087 720238 709587 697465
58651 697465 684931 672817 661993 652859 644942 637614 630876 624975 619728 614861 610632 607482 605444
58638 605444 604364 604356 605506 607507 610090 613386 617362 621272 624170 625617 625593 624242 622096 619952 618091
58623 618091 616173 614273 613199 613275 613672 613628 613631 614658 616982 620494 625464 631991 639286 646397 653190 659783
58607 659783 665643 670230 674078 678276 683118 688067 692681 696749 699872 701777 702875 703840 704856 705765 706522
58592 706522 707023 707091 707254 708902 713042 719512 727947 738604 751390 765115 778865 793275 809195 825707
58578H25707J5070J2597J0411Q610P107O451O736P183P611Q846J1046J3293J5470
58565I56138J8669K2888K6279K7888K9187L1434L3316L2872L0193K6453K1599
58554A256916J4982P408O95m355q079j0602j1628j1209r741p616n526m494m902
58541A201849o338q847j3118j8762k3880k7278k9763l2056l3020l1410k8148k5152
58529I24077k2789k0161j7129j4471j2471j0826r512q630p790o714n938n837n644
58516G76165m472k767j673j459j598j839k150k139j532p57k19M02J321J855J440
58501G60578P74Q86J616J991J730J416J572K254L261M236N010O080Q010J0164
58487H09578J1121J0780J0745J2034J3690J4538J4991J6112J8033K0266K2486
$$ plain form
58578 825707 840777 853374 863785 872395 879502 885953 892689 899872 907483 916329 927375 940668 956138
58565 956138 974807 997695 1023974 1051862 1081049 1112483 1145799 1178671 1208864 1235317 1256916
58554 1256916 1271898 1279306 1280001 1275646 1267567 1256965 1245337 1234128 1224387 1216771 1211245 1206751 1201849
58541 1201849 1195511 1186664 1173546 1154784 1130904 1103626 1073863 1041807 1008787 977377 949229 924077
58529 924077 901288 881127 863998 849527 837056 826230 816718 808088 800298 793584 787646 781809 776165
58516 776165 771693 768926 767253 765794 764196 762357 760207 758068 756536 755779 755560 755962 757283 759138 760578
58501 760578 761352 762238 763854 765845 767575 768991 770563 772817 776078 780314 785324 791404 799414 809578
58487 809578 820699 831479 842224 854258 867948 882486 897477 913589 931622 951888 974374
58476I74374K4030K3735K1279J7651J3450P973R80n984j1189j4512j6487j6907
58464A018393j5666j3706j1694q898m726k50L245O076R041J1663J3189J4309J6089
58451A037065J7871J7871J5346J0812M871j837q188j3414j7779k1364k3148k2527
58439I95579k0671j8944j6907j3511r308n863l589j752m8J298K520M120O052Q070
58425I27046J0284J2486J3794J3794J3028J1591Q551L793j089m843q036j1182
58413I89217j3211j3302j2636j2495j2240j0952r460q721p790n574l213k362k425
58400H74836j789n62K22R75K609M299M740M657N589O941O819N171L577K620J730
58385I22434J116J451K230K515K737L640M443M190L892M881O099N752M663N064
$$ plain form
58476 974374 998404 1022139 1043418 1061069 1074519 1082492 1083472 1077488 1066299 1051787 1035300 1018393
58464 1018393 1002727 989021 977327 968429 963703 963453 966698 972774 981815 993478 1006667 1020976 1037065
58451 1037065 1054936 1072807 1088153 1098965 1103836 1101999 1093811 1080397 1062618 1041254 1018106 995579
58439 995579 974908 955964 939057 925546 916238 910375 906786 905034 904986 906284 908804 912924 918976 927046
58425 927046 937330 949816 963610 977404 990432 1002023 1010574 1014367 1013278 1008435 1000399 989217
58413 989217 976006 962704 950068 937573 925333 914381 904921 896200 888410 882836 879623 877261 874836
58400 874836 873047 872485 872707 873682 876291 880590 885330 889987 895576 902517 909336 914507 918084 920704 922434
58385 922434 923550 925001 927231 929746 932483 936123 940566 944756 948648 953529 959628 965380 970043 975107
58371I75107O858Q099Q554R666J1401J2246J2245J3005J4696J5857J6211J6846
58359A120791J7553J6786J4496J2290J0584Q201N016K407P74r07k662l042j549
58346A200738O07K497M251N745O469O879Q008R747J1247J2700J4793J6888J7779
58333A318348J7816J8232J8850J8576J7507J6325J4499J1367Q084N991M149J214
58321A470958j417j484J95J030J003K152M381N598N697O654Q769J0366J1262J2964
58307A538128J5357J6709J7017J8024J9762K0535K0244K0411K0901K0139J8486
58296A745713J7958J8595J8670J8220J8713J9493J8539J6570J6337J7852J8553
58285A945213J8180J9078K1416K2588K1846K1274K1655K1639K1564K3760K8459
$$ plain form
58371 975107 981965 990064 998618 1008284 1019685 1031931 1044176 1057181 1071877 1087734 1103945 1120791
58359 1120791 1138344 1155130 1169626 1181916 1192500 1200701 1205717 1208124 1208898 1207991 1205329 1202287 1200738
58346 1200738 1201345 1203842 1208093 1213838 1220307 1227186 1235194 1244941 1256188 1268888 1283681 1300569 1318348
58333 1318348 1336164 1354396 1373246 1391822 1409329 1425654 1440153 1451520 1459604 1465595 1469744 1470958
58321 1470958 1469541 1468057 1468252 1469282 1470285 1472437 1476818 1482416 1488113 1494767 1503536 1513902 1525164 1538128
58307 1538128 1553485 1570194 1587211 1605235 1624997 1645532 1665776 1686187 1707088 1727227 1745713
58296 1745713 1763671 1782266 1800936 1819156 1837869 1857362 1875901 1892471 1908808 1926660 1945213
58285 1945213 1963393 1982471 2003887 2026475 2048321 2069595 2091250 2112889 2134453 2158213 2186672
58274B186672L3381L7891M3398M9463N3830N6521N9541O2493O3190O2576O3971
58263B772927O7317O9449P0144P2280P5676P6689P4626P2697P1854O9809O6952
58252C560420O6909O9994P2423P3365P6273Q1940Q6856R0130R5285J03274J10522
58241D487391J15865J22652J31863J40049J46278J54185J64865J74861J83343
58232E821352J93973K07475K20061K31501K46561K65918K84194K99975L18917
58223H089927L43745L70220L96558M27484M65026N04808N45663N93244O49891
58214A2386566P10975P75823Q51853R43311J046998J164204J305281J477162J678916
58205B2341089J915879K205469K562988K995605L516368M146817M895469N749986
$$ plain form
58274 2186672 2220053 2257944 2301342 2350805 2404635 2461156 2520697 2583190 2646380 2708956 2772927
58263 2772927 2840244 2909693 2979837 3052117 3127793 3204482 3279108 3351805 3423659 3493468 3560420
58252 3560420 3627329 3697323 3769746 3843111 3919384 4001324 4088180 4178310 4273595 4376869 4487391
58241 4487391 4603256 4725908 4857771 4997820 5144098 5298283 5463148 5638009 5821352
58232 5821352 6015325 6222800 6442861 6674362 6920923 7186841 7471035 7771010 8089927
58223 8089927 8433672 8803892 9200450 9627934 10092960 10597768 11143431 11736675 12386566
58214 12386566 13097541 13873364 14725217 15668528 16715526 17879730 19185011 20662173 22341089
58205 22341089 24256968 26462437 29025425 32021030 35537398 39684215 44579684 50329670
58197E0329670O703322P775091Q999252J0411294J2064926J4046914J6458395
58190A26788864J9394171K2955563K7251376L2281312L7633924M2089740M3484922
58183C51879872L9325016K8216946J1270572p832651k4523727l5616738m0443094
58176C22276196m0275565l6982746l2114473k6726404k1534035j7051075j3655545
58169A33936353j1561541j0686942j0585141j0634549j0382046r720148q777806
58162F1588180p722623o674549n711728m872751m154958l541289l024915k598795
58154B3286572k242211j935688j675598j460950j279957j121900r89021q84598
58146A1696649q00579p27420o65396o16440n74646n33893m95749m61819m26964
$$ plain form
58197 50329670 57032992 64808083 73807335 84218629 96283555 110330469 126788864
58190 126788864 146183035 169138598 196389974 228671286 266305210 308394950 351879872
58183 351879872 391204888 419421834 430692406 422859755 398336028 362719290 322276196
58176 322276196 282000631 245017885 212903412 186177008 164642973 147591898 133936353
58169 133936353 122374812 111687870 101102729 90468180 80086134 70365986 61588180
58162 61588180 53865557 47191008 41479280 36606529 32451571 28910282 25885367 23286572
58154 23286572 21044361 19108673 17433075 15972125 14692168 13570268 12581247 11696649
58146 11696649 10896070 10168650 9503254 8886814 8312168 7778275 7282526 6820707 6393743
58137F393743l87804l49552l17294k88230k58938k32407k11457j92912j74715
58128C980434j61448j56412j54865j51183j46369j42791j37972j29521j20446
58119B679427j13796j07303r8575r0319q5270q0940p4466o7902o3867o0549n5712
58108A780728n1284m9390m8055m5032m1933m0468l8732l5132l1899l0854k9630
58097A338319k5914k1428j8029j3980q116l623l567o266q875j1894j6167j9235
58085A181225j8997j7692j8117j9009j8223j7342j8845k1416k2287k1835k1898
58074I65564k1848k0274j8413j8096j8183j6663j4432j3497j3245j1952j0272
58063G88689r866j0076r216p827p571q187q395q581r851j1532j2214j2166j2469
$$ plain form
58137 6393743 6005939 5656387 5339093 5050863 4791925 4559518 4348061 4155149 3980434
58128 3980434 3818986 3662574 3507709 3356526 3210157 3067366 2929394 2799873 2679427
58119 2679427 2565631 2458328 2359753 2269434 2184164 2103224 2028758 1960856 1896989 1836440 1780728
58108 1780728 1729444 1680054 1631999 1586967 1545034 1504566 1465834 1430702 1398803 1367949 1338319
58097 1338319 1312405 1290977 1272948 1258968 1250852 1247229 1243662 1237396 1228521 1216627 1200460 1181225
58085 1181225 1162228 1144536 1126419 1107410 1089187 1071845 1053000 1031584 1009297 987462 965564
58074 965564 943716 923442 905029 886933 868750 852087 837655 824158 810913 798961 788689
58063 788689 778823 768747 759531 751704 744133 735946 727551 718970 709119 697587 685373 673207 660738
58050F60738j2857j2535j1823j1191j0039q185o940o970o956o035n503o281o901
58037E48522o157n434o148p108o727n787n545n273m246m065o215r109j0255r719
58023D56734q916p810n994m770n269o027n144l451k865l128k879k442k747k896
58009C92396j698l31o01j668j426q4N59M14Q08J659J887J924K992M366M169K568
57993D07934J482J451J308P12N46Q82Q73O15J010J846K035J590J476J741J664
57978D27165J486K093L277M081M635N816P418Q441Q853R360R793R400Q392P427
57964E17637O026L244m74l787o425q982j1180j2197j2315j2537j2889j2690j2089
57951D21342j1664j0931r042o546m723l516j869K39J878K934M060N121N432N274
$$ plain form
58050 660738 647881 635346 623523 612332 602293 594108 587168 580198 573242 567207 561704 555423 548522
58037 548522 542365 536931 530783 523675 516948 511161 505616 500343 496097 492032 485817 476708 466453 456734
58023 456734 447818 440008 434014 429244 423975 417948 412804 409353 406488 403360 400481 398039 395292 392396
58009 392396 390698 390367 389766 388098 386672 386588 387147 387561 388369 390028 391915 393839 396831 401197 405366 407934
57993 407934 409416 410867 412175 412887 413433 414315 415188 415803 416813 418659 420694 422284 423760 425501 427165
57978 427165 428651 430744 434021 438102 442737 448553 455971 464412 473265 482625 492418 501818 510210 517637
57964 517637 523663 526907 526433 522646 516221 507239 496059 483862 471547 459010 446121 433431 421342
57951 421342 409678 398747 389705 383159 378436 374920 373051 373290 375168 378102 382162 387283 392715 397989
57937C97989N550O237O731P353Q743J0118R983Q337O449M689K391k96k362l731
57923D68181n297p079q070q067q055q530q890q661p988o840m956k646o14R69K211
57908C85668K779K519K206K319J812l93l286m955n343n893o858p048o140n203
57894C52184m753m147l071j989r78K84J336J336P23P48J340J212K13l58l8J3q88
57877C43167j840j931j537j343j304j128p67m0J287K834M043N180O821Q493R174
57862C71109Q968Q886R073Q833Q322Q441Q982Q647P207N883N242M481L170J980
57848D69224J090l71k565m303m903n222n948o356n699m605m029l882l623l301
57834D15507l102k680j747o80M2M78Q29J088J351J857K488K915L236L549L118
$$ plain form
57937 397989 403539 409776 416507 423860 432603 442721 452704 461041 467490 472179 474570 474274 471912 468181
57923 468181 462884 455805 447735 439668 431613 423083 414193 405532 397544 390704 385748 383102 382488 383457 385668
57908 385668 388447 390966 393172 395491 397303 396910 393624 388669 383326 377433 370575 363527 357387 352184
57894 352184 347431 343284 340213 338224 337246 337530 338866 340202 340925 341673 343013 344225 344438 344080 344042 344055 343167
57877 343167 341327 339396 337859 336516 335212 334084 333317 333277 334564 337398 341441 346621 353442 361935 371109
57862 371109 380077 388963 398036 406869 415191 423632 432614 441261 448468 454351 459593 464074 467244 469224
57848 469224 470314 469943 467378 463075 458172 452950 447002 440646 434947 430342 426313 422431 418808 415507
57834 415507 412405 409725 407978 407298 407340 407818 408647 409735 411086 412943 415431 418346 421582 425131 428249
57819D28249J167j440k720k065q60l96n66j017k029l395l851k635o67O95J146
57804D09616J060M51q58k601m252n362n495m506l045j999j316k57J214K381L182
57789C88213M271N494N711M604L247K409J649O28k5L8J24k37m53j09J86rj64j1
57771D15566l88j845l488m346m777n468o044n906n608o035o839o946o160n145
57757C46571m209l213k303j783j431p76J22Q39J283J679K154K849L931N128N699
57742C56540N454N116N167N089M383L658L748M372M574M096L525L322L472L781
57728D16297L900L354K155J082Q13J076J185R79O89K32o43j773k648k946k608
57713D21144j736p32k21m33r81j509k069k658k942k802k575k389j899j043l38
$$ plain form
57819 428249 429416 427976 425256 423191 422331 421935 421369 420352 418323 414928 411077 408442 407775 408470 409616
57804 409616 410676 411127 410269 407668 403416 398054 392559 388053 385008 383009 381693 381436 382650 385031 388213
57789 388213 392484 397978 403689 408293 411540 413949 415598 416226 416201 416239 416363 416126 415673 415564 415750 415741 415577 415566
57771 415566 415178 413333 409845 405499 400722 395254 389210 383304 377696 371661 364822 357876 351716 346571
57757 346571 342362 339149 336846 335063 333632 332856 332978 333817 335100 336779 338933 341782 345713 350841 356540
57742 356540 361994 367110 372277 377366 381749 385407 389155 393527 398101 402197 405722 409044 412516 416297
57728 416297 420197 423551 425706 426788 427601 428677 429862 430841 431530 431762 431119 429346 426698 423752 421144
57713 421144 419408 418676 418455 418022 417041 415532 413463 410805 407863 405061 402486 400097 398198 397155 396817
57698C96817ON34J521K253K121J721J975K656K662J530j81j780k973l615l558
57683D01689k877j859p15N51K096M124O480Q528R901J1311J3859J7528K1356K5200
57669E17172L0215L7048M4748N2180N9274O5494O7788O1666M4774J9028j0353
57658I89034l7286n7014o7440o9286o4988n7367m8849m1018l4254k8113k2408
57647D61011j7526j3701j0677q338o918o241n542m558l971m226m781n076n366
57634C64090n824n710m478k935k229k215j938j238q16r18j131j302j817k798l808
57619C24933m362m286l637k766k213k120j953j267l69J78L34L45J06o07j548k167
57603B98601k120j359o5J176J653J315Q30N73K49j72q3O76J285J235J267K056
$$ plain form
57698 396817 396823 397357 398878 401131 403252 404973 406948 409604 412266 413796 413615 411835 408862 405247 401689
57683 401689 398812 396953 396238 396789 398885 403009 409489 418017 427918 439229 453088 470616 491972 517172
57669 517172 547387 584435 629183 681363 740637 806131 873919 935585 980359 999387 989034
57658 989034 951748 894734 827294 758008 693020 635653 586804 545786 511532 483419 461011
57647 461011 443485 429784 419107 410769 403851 397610 392068 387510 383539 379313 374532 369456 364090
57634 364090 358266 352556 348078 345143 342914 340699 338761 337523 336707 335789 334658 333356 331539 328741 324933
57619 324933 320571 316285 312648 309882 307669 305549 303596 302329 301960 302138 302472 302817 302923 302316 300768 298601
57603 298601 296481 295122 295057 296233 297886 299201 300031 300604 300853 300681 300598 301274 302559 303794 305061 307117
57587C07117K867K538J272L02J88M08L38k48j310k442k933k641k322k544k871
57572B97719k816k823l361l904l833l588l761l802l017k169k496l527l580k287
57558B52755j033p92j086j272j453j668j380l54R07J972K972L954M557M595M280
57543B66954L712K751J590P85N46N57N14L67P4k99l57J36O68N21k99j202j801
57526B75217j925j235K64J688K103J698J347J331J369J463J756J841J421J214
57512B89552K064L381L835L366L149L608L936L575K873K072J070L30O60J747K256
57497C27474J718J019P15K41p10j442j441j143q50j62Q72J237M51n46q55r44j561
57480C24073k239k029j037j99N9M3L8M5K9j97r79k238l196l203k463j621r36l46
$$ plain form
57587 307117 309984 312522 313794 314096 314284 314692 315030 314782 313472 311030 308097 305456 303134 300590 297719
57572 297719 294903 292080 288719 284815 280982 277394 273633 269831 266814 264645 262149 258622 255042 252755
57558 252755 251722 250930 249844 248572 247119 245451 244071 243717 244624 246596 249568 253522 258079 262674 266954
57543 266954 270666 273417 275007 275792 276338 276895 277409 277776 277850 277551 277194 277330 277998 278519 278220 277018 275217
57526 275217 273292 272057 272321 274009 276112 277810 279157 280488 281857 283320 285076 286917 288338 289552
57512 289552 291616 294997 298832 302198 305347 308955 312891 316466 319339 321411 322481 322811 323471 325218 327474
57497 327474 329192 330211 330926 331167 330457 329015 327574 326431 325581 325419 326291 327528 327979 327433 326578 325634 324073
57480 324073 321834 319805 318768 318569 318628 318671 318709 318754 318783 318586 317607 315369 312173 308970 306507 304886 303950 303604
57462C03604J30M50P54J151J560J912K172K142J650J041R13J332J832K201K571
57447C25415K817K647K311K370K710K742K629L116M020M154L206K411K705L407
57433C66660L532L347L617M192M349L966L458L039K738K670K675K215J181K97
57419D07936J26L09K92J83L15O35J074J815K658K926K635K877M210N609N890N372
57403D44862M973M461K956P77n94l14R86K200K703K456J932J911K694L620L919
57388D79542L775L919M498N047N317N470N660O040O844P856Q176P263N876N179
57374E60462N215N126M572M008L671L273K718K289K093J979K014K354K701K622
57360F05097K391K726L651M406M645M923N727O704P239P274P106O821O367N955
$$ plain form
57462 303604 303734 304184 304938 306089 307649 309561 311733 313875 315525 316566 317479 318811 320643 322844 325415
57447 325415 328232 330879 333190 335560 338270 341012 343641 346757 350777 354931 358137 360548 363253 366660
57433 366660 370192 373539 377156 381348 385697 389663 393121 396160 398898 401568 404243 406458 407639 407936
57419 407936 408062 408371 408663 408846 409161 409796 410870 412685 415343 418269 420904 423781 427991 433600 439490 444862
57403 444862 449835 454296 457252 458029 457435 457121 458107 460307 463010 465466 467398 469309 472003 475623 479542
57388 479542 483317 487236 491734 496781 502098 507568 513228 519268 526112 533968 542144 549407 555283 560462
57374 560462 565677 570803 575375 579383 583054 586327 589045 591334 593427 595406 597420 599774 602475 605097
57360 605097 607488 610214 613865 618271 622916 627839 633566 640270 647509 654783 661889 668710 675077 681032
57346F81032N963O443P042P395P464P403P194O700O060N755N973O214N941N492
57332G72071N697O651P521P653P218O629O120O078O958Q431R377R199Q497Q046
57318H76146P878P787P950Q375Q551Q293Q230Q767R368R607J0043J1154J2213
57305I94362J2318J1847J1712J1832J1602J1352J1859J2766J2905J2189J1856
57294A126600J2678J4084J5122J5409J4998J4286J4070J4858J6065J6710J6761
57283A291641J6855J6962J6491J5674J5593J6653J8129J9435K0760K2223K3400
57272A493816K4058K4511K4913K5117K5391K6283K7543K8114K7574K6699K6212
57261A780231K5944K5694K5892K6798K7861K8546K9121L0029L1054L1743L2130
$$ plain form
57346 681032 686995 693438 700480 707875 715339 722742 729936 736636 742696 748451 754424 760638 766579 772071
57332 772071 777768 784419 791940 799593 806811 813440 819560 825638 832596 841027 850404 859603 868100 876146
57318 876146 884024 891811 899761 908136 916687 924980 933210 941977 951345 960952 970995 982149 994362
57305 994362 1006680 1018527 1030239 1042071 1053673 1065025 1076884 1089650 1102555 1114744 1126600
57294 1126600 1139278 1153362 1168484 1183893 1198891 1213177 1227247 1242105 1258170 1274880 1291641
57283 1291641 1308496 1325458 1341949 1357623 1373216 1389869 1407998 1427433 1448193 1470416 1493816
57272 1493816 1517874 1542385 1567298 1592415 1617806 1644089 1671632 1699746 1727320 1754019 1780231
57261 1780231 1806175 1831869 1857761 1884559 1912420 1940966 1970087 2000116 2031170 2062913 2095043
57250B095043L2493L2848L3203L3882L5056L6300L7120L7652L8456L9819M1596
57239B493468M3494M5227M6633M7768M8814M9811N0737N1722N2786N3616N4089
57228C038165N4924N7083O0551O4402O7966P1149P3558P4446P3830P2865P2689
57217C781628P3457P4834P6562P8235P9170P9073P8327P7404P6542P6142P6667
57206D628041P7908P9095Q0077Q1433Q3148Q4101Q3509Q1910P9960P7177P2834
57195E509193O7500O2639N9027N6493N4869N4271N4444N4624N4283N3621N3249
57184F134213N3678N5026N6909N8676N9888O0557O1012O1780O3352O5518O6961
57173F797570O6358O4002O1616O0341N9644N8471N6552N4119N1205M7865M4413
$$ plain form
57250 2095043 2127536 2160384 2193587 2227469 2262525 2298825 2335945 2373597 2412053 2451872 2493468
57239 2493468 2536962 2582189 2628822 2676590 2725404 2775215 2825952 2877674 2930460 2984076 3038165
57228 3038165 3093089 3150172 3210723 3275125 3343091 3414240 3487798 3562244 3636074 3708939 3781628
57217 3781628 3855085 3929919 4006481 4084716 4163886 4242959 4321286 4398690 4475232 4551374 4628041
57206 4628041 4705949 4785044 4865121 4946554 5029702 5113803 5197312 5279222 5359182 5436359 5509193
57195 5509193 5576693 5639332 5698359 5754852 5809721 5863992 5918436 5973060 6027343 6080964 6134213
57184 6134213 6187891 6242917 6299826 6358502 6418390 6478947 6539959 6601739 6665091 6730609 6797570
57173 6797570 6863928 6927930 6989546 7049887 7109531 7168002 7224554 7278673 7329878 7377743 7422156
57162G422156M0828L6507L1169K5507K0340J5786J1743Q582O596N306L970K424
57150G630914R10m66j571k030j660o89P61K764M799N739N215M277M028M401M812
57135G662204N142N408N282M829M871N849P126Q078Q739Q511N600q81r227j6822
57121G704709k2392k5293k3894j6699m305J1548K9977N0057O8980Q3793R4881
57110G951362J05732J19635J38682J65329K02029K49169L05969L73929M57389
57101A0069225N60908O88754Q46976J042861J281523J565131J895195K272283
57093B0222856K693751L156404L662613M219609M830891N491680O191542O911422
57085E7380768P609576Q211389Q614906Q703770Q362953P514123O172928M479979
$$ plain form
57162 7422156 7462984 7499491 7530660 7556167 7576507 7592293 7604036 7612618 7619214 7624520 7628490 7630914
57150 7630914 7631824 7631358 7629787 7627757 7626097 7625408 7626169 7628933 7633732 7639471 7644686 7648963 7652991 7657392 7662204
57135 7662204 7667346 7672754 7678036 7682865 7687736 7693585 7700711 7708789 7717528 7726039 7731639 7730758 7721531 7704709
57121 7704709 7682317 7657024 7633130 7616431 7612126 7623674 7653651 7703708 7772688 7856481 7951362
57110 7951362 8057094 8176729 8315411 8480740 8682769 8931938 9237907 9611836 10069225
57101 10069225 10630133 11318887 12165863 13208724 14490247 16055378 17950573 20222856
57093 20222856 22916607 26073011 29735624 33955233 38786124 44277804 50469346 57380768
57085 57380768 64990344 73201733 81816639 90520409 98883362 106397485 112570413 117050392
57077A17050392K651716Q73652p71272k280925l660998m883326n900910o679679
57069I6398650p209442p497307p561529p429091p132189o704969o183250n603923
57061D1076950n001411m404575l836791l316137k853275k450430k104179j809252
57053A5300900j559826j349485j172010j022082q94787p85627o91690o11824n44750
57044F668819m87890m38791l96672l61513l32406l07813k86725k68606k52577
57035C535826k37547k22732k07432j90920j73196j55311j38199j21717j05594
57026A983178r0502p7175o4973n2474l9173k5500j1318M525K3016M3785O4330
57015A757719P9112P9866N9430J7467l7178r0396j29912j50280j53274j44810
$$ plain form
57077 117050392 119702108 120575760 119804488 117523563 113862565 108979239 103078329 96398650
57069 96398650 89189208 81691901 74130372 66701281 59569092 52864123 46680873 41076950
57061 41076950 36075539 31670964 27834173 24518036 21664761 19214331 17110152 15300900
57053 15300900 13741074 12391589 11219579 10197497 9302710 8517083 7825393 7213569 6668819
57044 6668819 6180929 5742138 5345466 4983953 4651547 4343734 4057009 3788403 3535826
57035 3535826 3298279 3075547 2868115 2677195 2503999 2348688 2210489 2088772 1983178
57026 1983178 1892676 1815501 1750528 1698054 1658881 1633381 1622063 1626588 1649604 1693389 1757719
57015 1757719 1836831 1916697 1976127 1993594 1956416 1866020 1736108 1585828 1432554 1287744
57005A287744j31029j15924j01260q7764p5821o5495n6565m8783m1818l5069k8042
56994E00174k0855j4099q220l284Q18M356P767J1237J4448J7228K0208K4103K8325
56981E82206L0830K9535K3683J4103K821p659j5438k0036k2062k2252k1100j9088
56969E55543j6685j4149j1660r432p274m496r09K519M937P090J0521J5488K0788
56956E52281K5387K8732K9408K5156J5162J398j2847k4927l3167l6705l6074l3069
56944E00735k9128k4391j8908j3680r599o146k260K080O189J0091J4484J9625
56932D49092K5239L1217L7340M2263M3593L9122K7835J0476r838k8036l9742m4161
56920E84400m3884m1897l9384l6219l2357k8158k4028k0305j7209j4696j2541
$$ plain form
57005 1287744 1156715 1040791 939531 851767 775946 710451 653886 605103 563285 528216 500174
56994 500174 479319 465220 457000 453716 454534 458890 466657 477894 492342 509570 529778 553881 582206
56981 582206 613036 642571 666254 680357 683178 675519 660081 640045 617983 595731 574631 555543
56969 555543 538858 524709 513049 503617 496343 491847 490938 493457 498394 505484 516005 531493 552281
56956 552281 577668 606400 635808 660964 676126 677524 664677 639750 606583 569878 533804 500735
56944 500735 471607 447216 428308 414628 405029 398883 396623 398703 404892 414983 429467 449092
56932 449092 474331 505548 542888 585151 628744 667866 695701 706177 696339 668303 628561 584400
56920 584400 540516 498619 459235 423016 390659 362501 338473 318168 300959 286263 273722
56909B73722j0653r047p576o112m937m488m640m683m137l150k094j080j4J188
56895B12299K592M181N791P271Q752J0508J2637J5110J7991K1264K4517K6948
56883C69861K7655K5679K0244J1519J139q530j5742j9851k0830j8999j5269j1000
56871C45876p166l795l33L578P742J1769J5694K0192K5860L2388L8854M5006N1512
56858E87177N8242O2629O0614M9477K9787N216j8957l7700m8170n0669m7679m1758
56846F08209l4444k6556j8665j1010l504L905J1142J8334K5952L4511M4410N5901
56834G08185O8813Q2140R3937J01240R9961Q5829N7165J7486k5020o1344q5583
56823A142809r6368r5932q8250p7143o5001n2857m1214l0433k0476j0979j842
$$ plain form
56909 273722 263069 254022 246446 240334 235397 230909 226269 221586 217449 214299 212205 211125 211111 212299
56895 212299 214891 219072 224863 232134 240886 251394 264031 279141 297132 318396 342913 369861
56883 369861 397516 423195 443439 454958 456097 447567 431825 411974 391144 372145 356876 345876
56871 345876 338710 334915 334582 338160 345902 357671 373365 393557 419417 451805 490659 535665 587177
56858 587177 645419 708048 768662 818139 847926 853142 834185 796485 748315 697646 649967 608209
56846 608209 573765 547209 528544 517534 514030 517935 529077 547411 573363 607874 652284 708185
56834 708185 776998 859138 953075 1054315 1154276 1240105 1297270 1314756 1289736 1228392 1142809
56823 1142809 1046441 950509 862259 785116 720115 667258 626044 595611 575135 564156 562314
56812E62314O736J4903K3366L2710M2831N3135O2657O9513P0606O2597M3773J5566
56800A060707j7072m7043o8087p7738p7816p2139o3792n4339m4659l5554k7486
56789D74982k0297j3626p492k218K127O134J0719J6481K3296L0315L6024L8364
56777E94809L5327K5965J1094o709k3730l6321m2603m3424m1363l8474l5198l1329
56765C68044k7113k3139j9778j7254j5692j4609j3066j0832q791p558o533n118
56753A98561m040m294n341n707n006m063l215k018o53j68q78j752j915j677j550
56738A56284j291o15jL6j81rM89P11M28M9R2O95J464J808J618J512K004K638K603
56719A70334J998J636J665J411P53N37J217K034K128J636J150Q46P23J016J673
$$ plain form
56812 562314 569050 583953 607319 640029 682860 735995 798652 868165 938771 1001368 1045141 1060707
56800 1060707 1043635 996592 928505 850767 772951 700812 637020 582681 538022 502468 474982
56789 474982 454685 441059 433567 431349 433476 439610 450329 466810 490106 520421 556445 594809
56777 594809 630136 656101 667195 660486 636756 600435 557832 514408 473045 434571 399373 368044
56765 368044 340931 317792 298014 280760 265068 250459 237393 226561 217770 210212 203679 198561
56753 198561 194521 190227 184886 179179 174173 170110 166895 164877 164224 164056 163178 161426 159511 157834 156284
56738 156284 154993 154378 154377 154413 154232 154223 154712 155423 155851 155900 155992 156687 158151 159959 161577 163089 165093 167731 170334
56719 170334 172332 173968 175633 177044 177797 178334 179551 181585 183713 185349 186499 187345 188068 189084 190757
56704A90757J997J469M99j06o8M10J039J395J034J74k49L19J339K009K192K114
56688B06324J679Q70K07J77M81N47M19N86J160J857K488K930K875K189J354R27
56672B27070P44J71r37k033k584k578k287j868j280m96K39M50Mn03l57L02O43
56655B14700K96k29m43m23k76J94Q98J260J087J015J518K077J947J250P13P05
56639B26289J056J434J446P78k95r62r04p85j290k167k756k955l056l091k922
56624B09820k604k191j578r61r24j532j993j774j402j478j620j253q00j037j661
56609A87012j627o88L57Q54Q74O62L09k8k10l67n58m05L24J132J388J185R28N54
56591A91696m5k60M86J585J889J360Q95P15J36q60j236m42O83J190J259J541K000
$$ plain form
56704 190757 192754 194223 194722 194616 194548 194958 195997 197392 198426 198600 198351 198670 200009 202018 204210 206324
56688 206324 208003 208873 209080 209257 209738 210285 210704 211290 212450 214307 216795 219725 222600 224789 226143 227070
56672 227070 227814 227985 227048 225015 222431 219853 217566 215698 214418 213922 214161 214611 214615 214112 213755 214057 214700
56655 214700 214996 214767 214324 213901 213625 213819 214717 215977 217064 218079 219597 221674 223621 224871 225584 226289
56639 226289 227345 228779 230225 231003 230708 229746 228842 228057 226767 224600 221844 218889 215833 212742 209820
56624 209820 207216 205025 203447 202486 201562 200030 198037 196263 194861 193383 191763 190510 189710 188673 187012
56609 187012 185385 184697 185054 185908 186782 187444 187753 187725 187515 187148 186590 186185 186509 187641 189029 190214 191142 191696
56591 191696 191651 191391 191877 193462 195351 196711 197606 198321 198457 197597 196361 195919 196602 197792 199051 200592 202592
56574B02592K158K011K045K528L290M013M455M590M761N428O558P524P905Q163
56560B68021R197J1313J3860J5862J6750J6381J4513J0656M745k138q104j1660
56548C59396j2527j1437r516p766o632n807m808l792l374l618l901l861l778l792
56534B74787l530k937k656l032l416l031j980p98K43Q87O66k77r20o68k75o04
56518B52459j200j117n63n27j195j909k376k844l237l178k814k650k649k349j759
56503B22092j305j062q04o24p27q33n68k09k12l67k02O3q9m81n83m74m66k02P46
56484B13693J734J700P52k1j14J73O81J343J484O05l77j86O98O06o61j469r12
56467B19729M2L78M34P54R70O47J12k09l65l32J36P42Q06M84P09J552J939J443
$$ plain form
56574 202592 204750 206761 208806 211334 214624 218637 223092 227682 232443 237871 244429 251953 259858 268021
56560 268021 277218 288531 302391 318253 335003 351384 365897 376553 381298 379160 371056 359396
56548 359396 346869 335432 325916 318150 311518 305711 300903 297111 293737 290119 286218 282357 278579 274787
56534 274787 271257 268320 265664 262632 259216 256185 254205 253407 253650 254537 255203 254926 254006 253338 253063 252459
56518 252459 251259 250142 249579 249052 247857 245948 243572 240728 237491 234313 231499 228849 226200 223851 222092
56503 222092 220787 219725 218921 218297 217570 216737 216169 215960 215748 215381 215179 215242 215153 214672 214089 213615 213149 212947 213693
56484 213693 215427 217127 217879 217858 217744 217917 218598 219941 221425 222030 221653 221467 222165 222771 222110 220641 219729
56467 219729 219771 220149 220583 221337 222307 222954 223066 222857 222492 222160 222296 223038 223844 224328 225037 226589 228528 229971
56449B29971J018J337J656J189M59M17J116J993K632K554J254q63k422k655k228
56434B37428j921j478n22L65M66M3k66n21j073j629j600j037n16l76n32p02m44
56417B25685N07J681K189J862J451J480J676J734J728J484N75o76j211p62k95
56402B39108m31m82J60Q50P43J89J04O97J521K144K095J028l76o04P27K076K014
56385B51563J100P33R85R56M99K61L50K05k93o38n43j68L64R92J429J457J320
56368B60572J343J485J685K171K913L269K832K134J964K310K592K468J958J260
56354B90956Q48J226K096K449J943J488J887K637K766K077R69k85j293j384m99
56339C07881M24P41J022J856K641K652K539L420M977N766N270M379L905L680L289
$$ plain form
56449 229971 230989 232326 233982 235171 235630 236047 237163 239156 241788 244342 245596 244733 242311 239656 237428
56434 237428 235507 234029 233507 233872 234338 234381 234115 233594 232521 230892 229292 228255 227739 227363 226831 226129 225685
56417 225685 226192 227873 230062 231924 233375 234855 236531 238265 239993 241477 242052 241376 240165 239403 239108
56402 239108 238677 238195 238355 239205 239948 240137 240241 240938 242459 244603 246698 247726 247350 246746 247473 249549 251563
56385 251563 252663 253396 254381 255337 255836 256097 256447 256652 256359 255721 255178 255010 255374 256366 257795 259252 260572
56368 260572 261915 263400 265085 267256 270169 273438 276270 278404 280368 282678 285270 287738 289696 290956
56354 290956 291804 293030 295126 297575 299518 301006 302893 305530 308296 310373 311342 311057 309764 308380 307881
56339 307881 308305 309046 310068 311924 314565 317217 319756 323176 328153 333919 339189 343568 347473 351153 354442
56324C54442K848K709K963L369L489K968J897P40k24j013j438j113k12M93O39
56309C72557O75R98J467K060L067M267M905M959N364O451P391P747Q282R328R774
56294D49292Q827P531P212P455P100O289N986O213O318O463P314Q688R826J0711
56280E55225J1781J2745J2927J2507J2231J2239J2280J2662J3781J5118J5936
56269F99432J6618J8140K0483K2846K5078K7690L0750L3875L7167M1052M5475
56258A018606N0303N6065O3235P1151P8938Q7139R6992J08332J19558J29665J38993
56247B018977J47983J56360J63724J69876J74352J76328J75040J69771J59867
56238C512278J45464J27714J07370Q3772N6270K6206l728l1689n7271q0303j00301
$$ plain form
56324 354442 357290 359999 362962 366331 369820 372788 374685 375425 375201 374188 372750 371637 371425 371918 372557
56309 372557 373232 374230 375697 377757 380824 385091 389996 394955 400319 406770 414161 421908 430190 439518 449292
56294 449292 458119 465650 472862 480317 487417 493706 499692 505905 512223 518686 526000 534688 544514 555225
56280 555225 567006 579751 592678 605185 617416 629655 641935 654597 668378 683496 699432
56269 699432 716050 734190 754673 777519 802597 830287 861037 894912 932079 973131 1018606
56258 1018606 1068909 1124974 1188209 1259360 1338298 1425437 1522429 1630761 1750319 1879984 2018977
56247 2018977 2166960 2323320 2487044 2656920 2831272 3007600 3182640 3352411 3512278
56238 3512278 3657742 3785456 3892826 3976598 4032868 4059074 4055346 4023657 3966386 3886083 3785782
56227C785782j16901j29820j38700j43857j46649j48150j48112j46151j43038
56218B524404j39475j34543j27132j18297j10342j03939r7912r1625q5676q0291
56208A435172p4821o9104o3816n9097n4282m9135m4287m0175l6654l3598l0973
56197H79230k8413k5676k3229k1360j9275j6331j3528j2147j1499r828p201n498
56185F85245n417n501m507l064k354k500k839k770j912l63J037J535J493J764
56171F59847K342K643K801L506M754O019P321Q929J0363J0977J1256J2102J3239
56158G56099J3691J3647J4348J6228J8530K0575K2289K3787K5563K8582L2965
56147I86304L7339M0876M5082N1855O0830P0487Q0992R3501J07245J19732J29525
$$ plain form
56227 3785782 3668881 3539061 3400361 3256504 3109855 2961705 2813593 2667442 2524404
56218 2524404 2384929 2250386 2123254 2004957 1894615 1790676 1692764 1601139 1515463 1435172
56208 1435172 1360351 1291247 1227431 1168334 1114052 1064917 1020630 980455 943801 910203 879230
56197 879230 850817 825141 801912 780552 761277 744946 731418 719271 707772 697944 690743 685245
56185 685245 679828 674327 669820 666756 664402 661902 659063 656293 654381 654018 655055 656590 658083 659847
56171 659847 662189 664832 667633 671139 675893 681912 689233 698162 708525 719502 730758 742860 756099
56158 756099 769790 783437 797785 814013 832543 853118 875407 899194 924757 953339 986304
56147 986304 1023643 1064519 1109601 1161456 1222286 1292773 1373765 1467266 1574511 1694243 1823768
56136A823768J36419J39236J35987J26473J12681R6705Q0353O6412N7650N3993
56126B829677N2552N0435M5898L7440K4693J0205k214j1412j9348k7985l8288
56115B951653n1839p0309r2576j14724j33378j46991j54096j53321j45670j34110
56105A754639j20404j04650q8092p3432o1719n1627m2401l4920k9334k4296j9360
56094A104404j5576j3087j0622p922o104n099l429j058L30N08J278L209M690N052
56080A056574N659P072Q033Q212R024J0711J1551J0962J0626J1446J2308J2693
56068A174871J3614J5081J5625J5273J5872J7566J8227J7303J6775J7255J6759
56057A354221J4646J3109J3274J3427J2682J2683J3931J4168J2371J0847J1349
$$ plain form
56136 1823768 1960187 2099423 2235410 2361883 2474564 2571269 2651622 2718034 2775684 2829677
56126 2829677 2882229 2932664 2978562 3016002 3040695 3050900 3048686 3037274 3017926 2989941 2951653
56115 2951653 2899814 2829505 2736929 2622205 2488827 2341836 2187740 2034419 1888749 1754639
56105 1754639 1634235 1529585 1441493 1368061 1306342 1254715 1212314 1177394 1148060 1123764 1104404
56094 1104404 1088828 1075741 1065119 1057197 1051093 1045994 1042565 1041507 1041837 1042345 1043623 1046832 1051522 1056574
56080 1056574 1062233 1069305 1077338 1085550 1094574 1105285 1116836 1127798 1138424 1149870 1162178 1174871
56068 1174871 1188485 1203566 1219191 1234464 1250336 1267902 1286129 1303432 1320207 1337462 1354221
56057 1354221 1368867 1381976 1395250 1408677 1421359 1434042 1447973 1462141 1474512 1485359 1496708
56046A496708J2558J3368J5052J8113K0483K1042K1542K2962K3604K2904K3540
56035A711876K7306L2383L7001M2215M8664N4233N7473N9924O2652O3964O2942
56024B260633O1570O1001N9440N6144N3640N3552N4157N4501N6717O1630O6388
56013B899373O9186P1946P5692P8069P8386Q0194Q5467R1063R4370R7553J02734
56002C824033J08100J12443J18350J27001J35140J41091J48302J58868J69366
55993E042694J77398J86225J98345K10792K21685K34823K52403K70059K84949
55984G079373L01835L24869L50455L75002M02515M37245M75984N15379N59675
55975A0822332O13261O72905P35778Q07578Q94135R93145J103617J234933J396642
$$ plain form
56046 1496708 1509266 1522634 1537686 1555799 1576282 1597324 1618866 1641828 1665432 1688336 1711876
56035 1711876 1739182 1771565 1808566 1850781 1899445 1953678 2011151 2071075 2133727 2197691 2260633
56024 2260633 2322203 2383204 2442644 2498788 2552428 2605980 2660137 2714638 2771355 2832985 2899373
56013 2899373 2968559 3040505 3116197 3194266 3272652 3352846 3438313 3529376 3623746 3721299 3824033
56002 3824033 3932133 4044576 4162926 4289927 4425067 4566158 4714460 4873328 5042694
55993 5042694 5220092 5406317 5604662 5815454 6037139 6271962 6524365 6794424 7079373
55984 7079373 7381208 7706077 8056532 8431534 8834049 9271294 9747278 10262657 10822332
55975 10822332 11435593 12108498 12844276 13651854 14545989 15539134 16642751 17877684 19274326
55966A9274326J588513J811979K082253K417495K826205L318078L914860M632844
55958D1866553N464618O397749P445232Q641325J0019965J1623476J3528710J5840267
55950A20827895J8659940K2088263K6246995L1209863L6732485M1828585M4506952
55943C42100978M2166497L2872978J6914079k638981k1155462l4743862m1901975
55936C33614252m3450366m1269506l7125604l2246912k7390564k2963692j9111407
55929A10056201j5838275j3111365j0877209r051576p551499o327688n344918
55922D1953671m553259l902341l365263k926477k561247k246012j974958j748055
55914A8676059j553904j379405j225063j095608r85154q84948p96502p24128o62709
$$ plain form
55966 19274326 20862839 22674818 24757071 27174566 30000771 33318849 37233709 41866553
55958 41866553 47331171 53728920 61174152 69815477 79835442 91458918 104987628 120827895
55950 120827895 139487835 161576098 187823093 219032956 255765441 297594026 342100978
55943 342100978 384267475 417140453 434054532 431415551 410260089 375516227 333614252
55936 333614252 290163886 248894380 211768776 179521864 152131300 129167608 110056201
55929 110056201 94217926 81106561 70229352 61177776 53626277 47298589 41953671
55922 41953671 37400412 33498071 30132808 27206331 24645084 22399072 20424114 18676059
55914 18676059 17122155 15742750 14517687 13422079 12436925 11551977 10755475 10031347 9368638
55905I368638o04942n53014n11674m76725m41176m06349l76681l49646l20604
55896E327827k92048k68630k48162k26356k05488j89875j77421j63805j50656
55887C405386j41668j34769j25780j16011j08924j03036r5142q6941q1577p6987
55877B334551o9461o0481n3530m7439l9562l2649l1831l6975m4032n1479n9592
55866A807520o5825o7051o4617o1768n8053n1476m3937l8985l6052l2167k7525
55855A260064k4178k1077j5889j0324q370j0206j2763j5288j9484k4889k8768
55844A068828l0237l0605l0169k8389k6375k5668k5367k3782k1814k1276k1239
55833G83907j9632j7076j5567j4548j2088q839p071o678n788m490m422n332n577
$$ plain form
55905 9368638 8763696 8210682 7699008 7222283 6781107 6374758 5998077 5648431 5327827
55896 5327827 5035779 4767149 4518987 4292631 4087143 3897268 3719847 3556042 3405386
55887 3405386 3263718 3128949 3003169 2887158 2778234 2675198 2580056 2493115 2411538 2334551
55877 2334551 2265090 2204609 2151079 2103640 2064078 2031429 1999598 1962623 1918591 1867112 1807520
55866 1807520 1741695 1674644 1610027 1548259 1490206 1438730 1394793 1355808 1319756 1287589 1260064
55855 1260064 1235886 1214809 1198920 1188596 1180226 1170020 1157257 1141969 1122485 1097596 1068828
55844 1068828 1038591 1007986 977817 949428 923053 897385 872018 848236 826422 805146 783907
55833 783907 764275 747199 731632 717084 704996 696157 689086 682408 676620 672130 667708 662376 656799
55820F56799n416o477q548r894j0198j0292r792p944n902n202m866k995l02R78
55806E69949Q40J123K173K903L385M399N129M258K630J896J271j335n620r333
55792E83668j1770j3894j5564j5685j4699j4087j3679j2145r598p100m322n63
55780D50562K541K399p51m184o472q139r070q354o562n347m727l428j730j323
55766C95415k319l118l181l497m269m619m525m748m944m173l030k853l126k202
55752C44811l91L17m40j023p48o43j132j488j834l215n344o609o624o662p255
55737C01720p480o888o136n480m570l754l746m032l476k383j986k242k175j992
55723B45380k601l429l144k273k460l469l504k482k085k536k218q28j0l47m72
$$ plain form
55820 656799 651383 644906 636358 626464 616266 605974 596182 588238 582336 577134 572268 569273 568971 569949
55806 569949 570789 571912 574085 576988 580373 584772 589901 594159 596789 598685 599956 598621 593001 583668
55792 583668 571898 558004 542440 526755 512056 497969 484290 472145 462547 455447 451125 450562
55780 450562 453103 455502 454751 450567 444095 435956 426886 418532 411970 406623 401896 398468 396738 395415
55766 395415 393096 389978 386797 383300 379031 374412 369887 365139 360195 356022 352992 350139 347013 344811
55752 344811 344420 344737 344297 343274 342526 341883 340751 339263 337429 334214 328870 322261 315637 308975 301720
55737 301720 294240 287352 281216 275736 271166 267412 263666 259634 256158 253775 251789 249547 247372 245380
55723 245380 242779 239350 236206 233933 231473 228004 224500 222018 219933 217397 215179 214351 214341 213994 213522
55708B13522J98N37J99M22J527K138J700J398J714J476K42p67j032j676k973l300
55692B15325j851j89K29J22N80J154J136J076J610K188K295K486L133L472L019
55677B35785K645L093L706L597K961K259J294p9j346k115k544k467j447L4P47
55662B46123O14Q66J886K507K096J569J596J487P68J73R6l71j789l194l682l837
55646B46908m506n371n790n964o237o305n914n434m985m111k859k021j740j158
55632A84513p6N54L65L24J000J643J833K374L584M270L643K702K513K423J357
55617B13022l93j903l027l841l869l068k531k934l326k648j371m72R8O87Q35K14
55601A85473l40j67j14j171k682l440l607l988m192l305j861j340j913k329j959
$$ plain form
55708 213522 213720 214257 214456 214878 216405 218543 220243 221641 223355 224831 225073 224306 223274 221598 218625 215325
55692 215325 213474 213285 213514 213636 214216 215370 216506 217582 219192 221380 223675 226161 229294 232766 235785
55677 235785 238430 241523 245229 248826 251787 254046 255340 255261 253915 251800 249256 246789 245342 245376 246123
55662 246123 246737 247603 249489 251996 254092 255661 257257 258744 259512 259685 259781 259410 257621 254427 250745 246908
55646 246908 242402 237031 231241 225277 219040 212735 206821 201387 196402 192291 189432 187411 185671 184513
55632 184513 184437 184991 185356 185680 186680 188323 190156 192530 196114 200384 204027 206729 209242 211665 213022
55617 213022 212629 210726 207699 203858 199989 196921 194390 191456 188130 185482 184111 183639 183737 184424 185259 185473
55601 185473 185133 184966 184852 183681 180999 177559 173952 169964 165772 162467 160606 159266 157353 155024 153065
55586A53065j513j574j686j199j52R03J384J007J90j03O49J901K879L551M324
55571A63626N254O195P184Q124Q594Q487Q307Q301P890O556M608K514J99k349
55557B43490m518n841o666p369p622p123o356n887n538m984m434m037l336k129
55543A67650j077o79m58L3K79j76o33k99K72M8q22j347j310j359j848k592l452
55526A52230m200m227l355k483k469k797k467j666j406j775j879j446j204j556
55512A19300j989k006j774j508j010j45P69J299J335J079Q10O64M64n9p11r30
55496A15588n67j22J09M91J266J947K059J889J883J869J530J186J337J835K159
55481A34459K173K088J974J859J931K125J939J097o5j210k395l463l851l519l305
$$ plain form
55586 153065 151552 149978 148292 147093 146941 147844 149228 150235 150425 150322 150971 152872 155751 159302 163626
55571 163626 168880 175075 182259 190383 198977 207464 215771 224072 231962 238518 243126 245640 245839 243490
55557 243490 238972 233131 226465 219096 211474 204351 197995 192108 186570 181586 177152 173115 169779 167650
55543 167650 166573 165894 165436 165469 165748 165572 164939 164640 164912 164960 164138 162791 161481 160122 158274 155682 152230
55526 152230 148030 143803 140448 137965 135496 132699 130232 128566 127160 125385 123506 122060 120856 119300
55512 119300 117311 115305 113531 112023 111013 110868 111637 112936 114271 115350 116160 116824 117288 117229 116518 115588
55496 115588 115021 114899 115008 115499 116765 118712 120771 122660 124543 126412 127942 129128 130465 132300 134459
55481 134459 136632 138720 140694 142553 144484 146609 148548 149645 149580 148370 145975 142512 138661 135142 131837
55466A31837l697m018l589k856k539k404j898j273j062j003n53K1R7k04l46l74
55450A06139o33q92p52n27p78j287j420j121p04q3Q18J367R60R8k78j43j05j69
55432A00490O9L31Ro36p38j38N97J252J964K401K053J256P73N06k45j324j757
55415A06863j312q34q82j035q08l02K60P98J046P56L09L27O77O21n3q57j406j586
55397A02582j129m0Q11O16k2J43J025J400J037J057J872K316J542M38K70R89J728
55380A16635K084K056J491M14o38j297j917k802l454l222k275j298o22j71N2m4
55364A04992l34o42r83j291j216n49L40Q31O77J75j92q4M08P52M61k90p88o30
55346A01637j52M4j92m69l18K33N69J97m17k23R25J749J138k95j035p21l60o48
$$ plain form
55466 131837 128140 124122 120533 117677 115138 112734 110836 109563 108501 107498 106945 106966 107063 106859 106513 106139
55450 106139 105506 104614 103862 103335 102557 101270 99850 98729 98025 97942 98760 100127 101087 101185 100907 100764 100659 100490
55432 100490 100559 100890 100899 100263 99525 99387 99984 101236 103200 105601 107654 108910 109683 110189 109944 108620 106863
55415 106863 105551 104717 103835 102800 101992 101690 101950 102748 103794 104550 104859 105186 105863 106484 106431 105574 104168 102582
55397 102582 101453 101413 102224 102840 102818 102961 103986 105386 106423 107480 109352 111668 113210 113648 113918 114907 116635
55380 116635 118719 120775 122266 122680 122042 120745 118828 116026 112572 109350 107075 105777 105155 104984 105036 104992
55364 104992 104658 104016 103033 101742 100526 99977 100317 101148 101825 102000 101808 101724 102132 102884 103345 103055 102267 101637
55346 101637 101485 101529 101337 100868 100550 100783 101352 101549 101132 100909 101834 103583 104721 104426 103391 102670 102310 101662
55328A01662j094r87l66K16K91l25j317j836j265p3P06Q69J102J687K001J550
55312A02821P84M30O47J038J109N80l09q30o07k05k38k92K92Q90K73j160j514
55295A03709k33P79j13j814k100p17N97P27K83J67L06K00j66m29m36l76m93p88
55277I9103r47o38K6N27N70M00L73M52M41L60L32L31L51N32Q24P93J32p55j095
55258A02112o39P9L52K4m08l49K26O82N13O2J73J048J883J800Q25k34o75m50j02
55239A06922k50r50j486j093L2Q28O19j44o64q91j318j908j926r42M14J168J181
55222I9592J196J655J977J406K60l42K0M73Q5r01j465j065m7Q89J162N50n81j449
55204A03415j659j563j537j376q94n42o96p43J25J495K084J539Q75J004J665K040
$$ plain form
55328 101662 100568 99581 99215 99431 99722 99397 98080 96244 94979 94906 95612 96481 97583 99270 101271 102821
55312 102821 103605 104035 104682 105720 106829 107409 107100 106270 105663 105458 105220 104928 105220 106110 106383 105223 103709
55295 103709 103476 104255 104142 102328 100228 99511 100108 100835 101118 101285 101591 101791 101625 101196 100760 100384 99891 99103
55277 99103 98156 97518 97544 98071 98641 99041 99414 99866 100307 100667 100999 101330 101681 102213 103037 103830 103962 103207 102112
55258 102112 101473 101552 101904 101928 101520 101171 101397 102079 102592 102654 102827 103875 105758 107558 108383 108149 107474 107024 106922
55239 106922 106672 105722 104236 103143 103175 104003 104622 104478 103814 102923 101605 99697 97771 96829 97243 98411 99592
55222 99592 100788 102443 104420 105826 106086 105744 105764 106237 106322 105421 103956 102891 102844 103733 104895 105445 104864 103415
55204 103415 101756 100193 98656 97280 96386 95844 95148 94405 94530 96025 98109 99648 100523 101527 103192 105232
55188A05232J743R72K34Q7O17J079O81k98q47o71m89p39r16n29P0K95J46nL1K81
55168A06974P23J112J097P58N84P56R51J016J224J637J765J246L94k41m40k90
55152A19266l3n8n39r56n71M41R75L52q95j802j963j530q17k51j48k88k14K7O
55133A11002j75L3M87L21o44j400j211n83j51L05J019J289M58p57j053k71N92
55116A09261Q79Q51R28J126J229R91K57o58r58k49Q28J341J154P46L29j48l62
55099A17545K01J392K264K025Q00n28j082p01p9j7m04l58M79J365J493J002N06
55082A25903J98J2J36O10R14O71L89P03J222J064K95j54K9J87j04m03l33k69o13
55063A30457j001q39k68l1m69j098j239p99k97j58j78J73R27J413J033k4j011
$$ plain form
55188 105232 106975 107947 108181 108268 108885 109964 110645 110347 109500 108829 108340 107601 106685 106156 106226 106521 106667 106662 106693 106974
55168 106974 107697 108809 109906 110664 111248 112004 112955 113971 115195 116832 118597 119843 120237 119996 119556 119266
55152 119266 119233 119175 118636 117680 117109 117550 118525 118877 117982 116180 114217 112687 111870 111619 111471 111183 110969 110996 111002
55133 111002 110827 110860 111347 111668 111024 109624 108413 107830 107679 107984 109003 110292 110750 109993 108940 108669 109261
55116 109261 110140 110991 111919 113045 114274 115265 115522 114864 113906 113657 114485 115826 116980 117726 118055 117907 117545
55099 117545 117746 119138 121402 123427 124227 123699 122617 121916 121837 121820 121416 121058 121537 122902 124395 125397 125903
55082 125903 126101 126113 126249 126859 127773 128444 128833 129536 130758 131822 132117 131963 131992 132179 132075 131672 131339 131070 130457
55063 130457 129456 128617 128349 128318 127849 126751 125512 124713 124416 124258 124080 124253 125180 126593 127626 127602 126591
55046A26591j447j480j562j926k280j988p32Q94J783J471N57j16k95j40K52O63
55030A20245N85j92j013j011j75P20J094J005P05L44J04J45K36p5q39j498j521
55013A18859r94l95J9M01R19J403J528J294J011P68K51n49q57L8J568K292J656
54996A29212O18K36L46J38m82p85j93J103K362K753J874J96j205j662j438j091
54980A31982o96p9N86Q76O53J35l82o23m32o3m4m89q17m94K72Q59R78P96O11O82
54960A34311J065J413J248O72L30M63N27J04m03m25n3K50L16J33m48j343j943
54943A36217j786j102l41L96J028J189P99M53O64J178J630K150K764K911K344
54928A50494J933K519L559L925L640L713M530N485O115O506O612O106M921L246
$$ plain form
55046 126591 125144 123664 122102 120176 117896 115908 115176 116070 117853 119324 119881 119765 119470 119330 119582 120245
55030 120245 120830 120638 119625 118614 118439 119159 120253 121258 121963 122307 122411 122556 122792 122717 121878 120380 118859
55013 118859 117865 117470 117489 117890 118809 120212 121740 123034 124045 124813 125064 124515 123658 123696 125264 127556 129212
54996 129212 129830 130066 130412 130550 130068 129283 129090 130193 132555 135308 137182 137378 136173 134511 133073 131982
54980 131982 131286 131207 131793 132669 133322 133457 133075 132452 132020 131957 131913 131424 130607 130113 130385 131244 132222 133018 133629 134311
54960 134311 135376 136789 138037 138709 139039 139502 140029 140133 139730 139305 139252 139502 139818 139951 139503 138160 136217
54943 136217 134431 133329 132988 133384 134412 135601 136400 136853 137517 138695 140325 142475 145239 148150 150494
54928 150494 152427 154946 158505 162430 166070 169783 174313 179798 185913 192419 199031 205137 210058 213304
54914B13304J054j573l904n180n591n799n789n207m524m637n319n294m109k746
54900A54686k136k061j879j434q77l45j39m91r53p86l3O03J019J853L139L982
54884A54148L947L767M112M597M687M713N253O091O523O268N455M189K665J283
54870B17698J93j010k735m807o675p767p618o230m538l756l972m037l262k350
54856A59134k150k291j875q83p6M6m86j526k770l580l554l044k546j975j085k64
54840A31075q1l48l93j67k09n89o84j79M11N48L94M15O57P86N98K32q4k74m45
54821A31663p06r66r39m67K24P21Q03N74L11K24L59N27M77J90J5L10J036J738
54803A36094J943J547Q53K53j20m07o85p82n37k8N83J266J884K042J534Q34N88
$$ plain form
54914 213304 214358 212785 208881 203701 198110 192311 186522 181315 176791 172154 166835 161541 157432 154686
54900 154686 152550 150489 148610 147176 146299 145954 145815 145324 144371 143585 143552 144155 145174 147027 150166 154148
54884 154148 158095 161862 165974 170571 175258 179971 185224 191315 197838 204106 209561 213750 216415 217698
54870 217698 217891 216881 214146 209339 202664 194897 187279 181049 176511 172755 168783 164746 161484 159134
54856 159134 156984 154693 152818 151935 151859 151905 151419 149893 147123 143543 139989 136945 134399 132424 131339 131075
54840 131075 130994 130646 130253 130086 129877 129288 128604 128425 128836 129384 129778 130193 130850 131636 132234 132466 132382 132108 131663
54821 131663 130957 129991 129052 128585 128809 129530 130333 130907 131218 131442 131801 132328 132805 132995 133010 133320 134356 136094
54803 136094 138037 139584 140437 140690 140570 140163 139478 138696 138159 138131 138714 139980 141864 143906 145440 146274 146862
54786A46862P25O26J64l9L57Q28P73M11M23J003J710K152K368K617L049L596M028
54769A71653M213M377M956O016P043P412O982O077N021L813K195N4k216l880m579
54754B19137m843n471o479p025o489n238m106l498l210k917k520k126j836j582
54740A61797j148m81J28L83L55K73J45n8Q7J058K537L471L310K749K959M379O374
54723A88318P787P759O364M615L500K975K202P55r90k706m577o546p837p777o733
54708A87109n653n012m646m358m123l812l207k322j408o60j26J61J73q2n70j129
54692A50335j371j028m49l00o05o20L2O05J88r65j720j542j013q21q57o09k3M38
54674A39675M71L00K45J44m51j514k292k095j120j57L90P78J241J533J310O13
$$ plain form
54786 146862 147587 148213 148377 148338 148695 149523 150296 150707 151130 152133 153843 155995 158363 160980 164029 167625 171653
54769 171653 175866 180243 185199 191215 198258 205670 212652 218729 223750 227563 229758 229812 227596 223716 219137
54754 219137 214294 208823 202344 195319 188830 183592 179486 175988 172778 169861 167341 165215 163379 161797
54740 161797 160649 160168 160296 160679 161034 161307 161452 161394 161481 162539 165076 168547 171857 174606 177565 181944 188318
54723 188318 196105 203864 210228 214843 218343 221318 223520 224275 223285 220579 216002 209456 201619 193842 187109
54708 187109 181456 176444 171798 167440 163317 159505 156298 153976 152568 151908 151782 151943 152116 152034 151464 150335
54692 150335 148964 147936 147487 147187 146582 145962 145994 146599 146787 145822 144102 142560 141547 140726 139869 139260 139237 139675
54674 139675 140146 140446 140691 140835 140384 138870 136578 134483 133363 133206 133596 134374 135615 137148 138458 139071
54658A39071k16q15q90l74L82Q72R57Q88P10J74o16r18k14R50J435P56m16j032
54640A40704o83J47P27Q41Q23Q90P88K81l21n47m14k43n5K82N00J93m01n98k71
54621A42643J2j2L4M08Q07R94J060Q86R7j059j616j141l70m4J22O71J279J220
54603A45991N32p9k48j54kJ56K45L03N44Q91Q72L74M8K92M40l00j467j865j191
54584A45382k45L74Q26J223J208O37m4m44p09j066j299j081n26n6Q1n6l03m83
54566A43419l89O8O66R32N92k8k12L62J186J548J367J051O99L7q10j186p89j03
54548A48410L49O69J098J484J648J768J902J624P25j44j85M72J056J268J425J610
54532A65179J386M31r25j937k062j387n90l07m44m31k01l02q69j173p14j28k30
$$ plain form
54658 139071 138855 138040 137150 136776 137158 138030 138987 139875 140585 140759 140143 139225 139011 139961 141396 142152 141736 140704
54640 140704 140021 140168 140895 141736 142559 143449 144237 144518 144197 143650 143236 142993 142938 143220 143720 143913 143512 142914 142643
54621 142643 142655 142643 142677 143085 143892 144886 145946 146832 146929 145870 144254 143113 142743 142699 142821 143492 144771 145991
54603 145991 146523 146444 146196 146042 146040 146196 146441 146744 147288 148179 149051 149425 149473 149765 150205 149905 148438 146573 145382
54584 145382 145137 145511 146337 147560 148768 149405 149361 148917 148208 147142 145843 144762 144236 144180 144261 144205 143902 143419
54566 143419 143030 143098 143764 144696 145288 145260 145048 145410 146596 148144 149511 150562 151261 151298 150488 149302 148513 148410
54548 148410 148759 149428 150526 152010 153658 155426 157328 158952 159677 159533 159348 159820 160876 162144 163569 165179
54532 165179 166565 166996 166071 164134 162072 160685 160095 159788 159344 158913 158712 158410 157541 156368 155654 155526 155296
54515A55296o82m70O03J729K169J919J274M91j32l88m07m57n04l24J09N68P57
54498A61551L54o66j627j589n85K75L54L33Q46J183M64o88q90k0P69Q73P57P84
54480A62478P42O53Q54J091P07p7j77O76J416J258R00J339K348K869K483J759
54464A81319J411J583J891J828J308Q08P97J063R29J72p95j551k049k298k240
54449A84176j982j749j574j423j473j799j960j527q52o03o99n69k56l33p24o81
54433A65972q2L67M63Q95J809K148J134m08j128q99o03o81o78j06R27J898K329
54416A73357K093J553J199J071Q00K68k51o11r12j060q00l83m17q39q17l6P72
54399A74987J001J115J677K239K054J358R84J074J069Q11P33R24P55j66j275j567
$$ plain form
54515 155296 154614 154144 154747 156476 158645 160564 161838 162329 162197 161809 161402 160945 160441 160117 160226 160794 161551
54498 161551 161905 161239 159612 158023 157438 157713 158067 158400 159246 160429 160893 160205 159315 159295 160064 160937 161694 162478
54480 162478 163220 163873 164727 165818 166525 166448 166271 166947 168363 169621 170521 171860 174208 177077 179560 181319
54464 181319 182730 184313 186204 188032 189340 190148 190945 192008 192937 193109 192314 190763 188714 186416 184176
54449 184176 182194 180445 178871 177448 175975 174176 172216 170689 169837 169234 168535 167966 167710 167377 166653 165972
54433 165972 165890 166257 166720 167615 169424 171572 172706 172298 171170 170271 169668 168987 168309 168203 169130 171028 173357
54416 173357 175450 177003 178202 179273 180073 180341 180090 179479 178567 177507 176707 176324 175907 175068 174251 174215 174987
54399 174987 175988 177103 178780 181019 183073 184431 185415 186489 187558 188369 189102 190026 190781 190615 189340 187773
54383A87773o28J010K410K976K721J976J015Q4m40k97K46O33O34M31J87LJ99J036
54365B01969K099K598K341J823J270M49m45n82K69J117R84J64m26n70p25j095
54349B11240j469j737k004k311k757l525m422m681l780k219r73m03j92n9kK1J76
54332A80903M78Q01R73P58kr44j319q46r6L35N13O52N02o6m13J10R90J022n3j149
54312A83149j203l46M57M84j69q30r52o96o91j140j526j348q02k76K99J075J626
54295A77111J402O27J39K78N84N42J35l87p51o78q0O66J016Q54M92P8n01j155
54277A80372j431j005q9O81P39R1n14j68J128K241K097R46k6j11L17N72M87M44
54259A86771R07J963L108L596L165K251J336M26n26j094q79k60l1l97q93j187
$$ plain form
54383 187773 187145 188155 190565 193541 196262 198238 199253 199337 198897 198600 198846 199479 200113 200544 200731 200734 200933 201969
54365 201969 204068 206666 209007 210830 212100 212549 212104 211522 211791 212908 213892 214056 213630 213060 212335 211240
54349 211240 209771 208034 206030 203719 200962 197437 193015 188334 184554 182335 181362 180959 180767 180708 180706 180727 180903
54332 180903 181381 182182 183155 183913 183911 182967 181648 180802 180706 181041 181554 182206 182708 182642 182229 182339 183329 184351 184298 183149
54312 183149 181946 181600 182057 182541 182372 181542 180590 179894 179203 178063 176537 175189 174387 174111 174410 175485 177111
54295 177111 178513 179140 179279 179557 180141 180683 180818 180431 179680 179002 178922 179588 180604 181458 181950 182028 181527 180372
54277 180372 178941 177936 177847 178528 179267 179358 178844 178676 179804 182045 184142 185088 185062 184951 185268 185840 186327 186771
54259 186771 187678 189641 192749 196345 199510 201761 203097 203523 202997 201903 201024 200764 200733 200336 199443 198256
54243A98256j354j418j255j008j029j257j209o76m9K32J84O7P0L08Q11J365J618
54226A93656J428R51L37l05p27n77J12P93Q70K39o18j040p49j28J70j1j78J8K02
54207A94443j80j048j782j940j496o07L72Q79O52J42j0J59J07m00j091j680j950
54190A84570j520k75J057J512J169J094J744K269J827Q79N82J231K021K169J727
54175B02056J198Q80P29O51O07M54n0r26j763k130k144k248k461k307j684j187
54159A89675j229j374j036m35j88l39m62m81o43q18o35j70J79M54R86J524J393
54142A86401O38J30L23O60N97M23O11R63R85O87N22P32J181J577J719J617J555
54125B01321J745J932J698J180R68J261J609J636J495J440J415J329J217R75L89
$$ plain form
54243 198256 196902 195484 194229 193221 192192 190935 189726 189050 189001 189233 189417 189484 189554 189862 190673 192038 193656
54226 193656 195084 196035 196372 196067 195340 194763 194875 195668 196538 196777 196159 195119 194370 194242 194412 194401 194223 194241 194443
54207 194443 194263 193215 191433 189493 187997 187390 187762 188641 189293 189435 189425 189584 189691 189291 188200 186520 184570
54190 184570 183050 182775 183832 185344 186513 187607 189351 191620 193447 194326 194908 196139 198160 200329 202056
54175 202056 203254 204134 204863 205514 206121 206575 206525 205599 203836 201706 199562 197314 194853 192546 190862 189675
54159 189675 188446 187072 186036 185601 185413 185074 184612 184131 183488 182670 182035 181865 182044 182498 183484 185008 186401
54142 186401 187039 187169 187492 188152 188749 189172 189783 190746 191731 192418 192940 193672 194853 196430 198149 199766 201321
54125 201321 203066 204998 206696 207876 208844 210105 211714 213350 214845 216285 217700 219029 220246 221221 221610
54110B21610l66p86q22j025j648k175k047j405p86n73j020k173l393l610k523
54095A97258j087l48k49r1L43O71N91J36m32o70k29N42Q06M41L78J220K185K172
54077B03637J362Q99J338K283L225L907M014L369K403J696J216O44K53N39J193
54062B31978J314O60k10r81j816k441k119q98R4P4m05m45m4K56L54N62R62J406
54044B28301J936K646L379L897M187M304M227M104M309M918N516N858O263O916
54030B90761P277O749N629M720M300M086M031M371M858M659L352J498Q4l63J6
54015C46028O75R95O75m2o95j178j763k594l494m272m896n309n448n457n536n528
53999C02161n073m218l487l183l020k678k232j899j660j445j360j443j425j045
$$ plain form
54110 221610 221244 220458 219636 218611 216963 214788 212741 211336 210550 209977 208957 206784 203391 199781 197258
54095 197258 196171 195823 195574 195483 195826 196497 197088 197224 196792 196122 195893 196435 197241 197682 198060 199280 201465 203637
54077 203637 204999 205898 207236 209519 212744 216651 220665 224034 226437 228133 229349 229993 230246 230785 231978
54062 231978 233292 233952 233742 232761 230945 228504 226385 225487 225581 225655 225250 224805 224761 225017 225371 225933 226895 228301
54044 228301 230237 232883 236262 240159 244346 248650 252877 256981 261290 266208 271724 277582 283845 290761
54030 290761 298038 304787 310416 315136 319436 323522 327553 331924 336782 341441 344793 346291 346375 346012 346028
54015 346028 346703 347698 348373 348331 347636 346458 344695 342101 338607 334335 329439 324130 318682 313225 307689 302161
53999 302161 297088 292870 289383 286200 283180 280502 278270 276371 274711 273266 271906 270463 269038 267993
53985B67993m54p9k44r07j522j257J70J838K502K197K178K928L285K218M83n36
53969B80793r22j807l259m117l879l429l498l610l038j846m89P78J619J570Q43
53954B55709M74J065J982K355K246K203K295K279K276K560L047L589M384N510
53940B91974O412O492N883N084M227L244K424K060J911J568J098P25L13j36J6
53925C33295J171K529K991K751K978M010N002N400N648O173O638O642O406O348
53911C97982O579P094P877Q589Q686Q160P536P045O286M945L266J603R5j080j713
53896D72950k027k503l088l266l090l366m453n632o145o209o473p098p793q304
53882D03503q397p872p024o606o879p235p113o734o413n818m583l211k535k615
$$ plain form
53985 267993 267539 267460 267216 266309 264787 263530 263700 265538 268040 270237 272415 275343 278628 280846 281329 280793
53969 280793 279871 278064 274805 270688 266809 263380 259882 256272 253234 251388 250899 251677 253296 254866 255709
53954 255709 256183 257248 259230 261585 263831 266034 268329 270608 272884 275444 278491 282080 286464 291974
53940 291974 298386 304878 310761 315845 320072 323316 325740 327800 329711 331279 332377 333102 333415 333279 333295
53925 333295 334466 336995 339986 342737 345715 349725 354727 360127 365775 371948 378586 385228 391634 397982
53911 397982 404561 411655 419532 428121 436807 444967 452503 459548 465834 470779 474045 475648 475743 474663 472950
53896 472950 470923 468420 465332 462066 458976 455610 451157 445525 439380 433171 426698 419600 411807 403503
53882 403503 395106 387234 380210 373604 366725 359490 352377 345643 339230 333412 328829 325618 323083 320468
53868C20468k861k995l196l429l369l007k826l205l984m579m458l583k527j928
53854B74521j718j364q71q97j602k147j886j368j408j793j709j066m56j26J55
53839B56265L73K74Np9j13m43p46l76M13O19O9k12L90J062P85j43o32l97j34l13
53819B56667n47l26K16O04P98J186J865K278J890J024N36P34J090J216J515K385
53803B73131L342L664L586M014N142O156O455O411O645P214P812Q265Q389P835
53789C58061O538N047M026L581L370L127K737K030Q64n78j914k937l706m326m794
53774C71126n064n096m880m511m200m113m232m432m642m839m966m880m414l551
53760C07306k582k033k199k804l241l227l038l087l361l454l070k369j817j714
$$ plain form
53868 320468 317607 314612 311416 307987 304618 301611 298785 295580 291596 287017 282559 278976 276449 274521
53854 274521 272803 271439 270568 269671 268069 265922 264036 262668 261260 259467 257758 256692 256236 256110 256265
53839 256265 256638 256912 256917 256838 256725 256282 255536 255160 255573 256192 256261 256049 256439 257501 258286 258143 257511 257114 256980 256667
53819 256667 256120 255794 256010 256614 257412 258598 260463 262741 264631 265655 266191 266925 268015 269231 270746 273131
53803 273131 276473 280137 283723 287737 292879 299035 305490 311901 318546 325760 333572 341837 350226 358061
53789 358061 364599 369646 373672 377253 380623 383750 386487 388517 389381 388803 386889 383952 380246 375920 371126
53774 371126 366062 360966 356086 351575 347375 343262 339030 334598 329956 325117 320151 315271 310857 307306
53760 307306 304724 302691 300492 297688 294447 291220 288182 285095 281734 278280 275210 272841 271024 269310
53746B69310j854j753j172l87J42J85j43n42o57k39N79J266J394J097Q46Q22P97
53729B69691N87L86M79Q26J043P51o2r93j533j449q58J6J046K128L066L706L991
53712B82821L834L116J972Q66K39J94O39J477K443K996K787K141J851K438L760
53697C13574N195O072O061N396M639M099L623L059K522K035J299J94p69j000o12
53682C55387k48k75o11j103j603j782j387o20J17P31J263J448R97J93l59n34n74
53665C51040m20J41O81M28m65q21j9J065J208L22p14j208j086n57L9K48j03o21
53647C49158p64m74j37m5j14l3N05J493K412K598K012J416J514K158K663K644
53631C67006K309J985J723J321O98J88L56J339K468K863K387J591R21M11K28O98
$$ plain form
53746 269310 267456 265703 264531 264144 264286 264471 264328 263786 263129 262890 263469 264735 266129 267226 268072 268894 269691
53729 269691 270278 270664 271143 271969 273012 273763 273701 272708 271175 269726 268868 268884 269930 272058 275124 278830 282821
53712 282821 286655 289771 291743 292609 292848 293042 293681 295158 297601 300597 303384 305525 307376 309814 313574
53697 313574 318769 324841 330902 336298 340937 345036 348659 351718 354240 356275 357574 357768 356999 355999 355387
53682 355387 355139 354864 354253 353150 351547 349765 348378 347758 347875 348606 349869 351317 352314 352507 352148 351614 351040
53665 351040 350620 350761 351442 351870 351405 350584 350565 351630 352838 353160 352446 351238 350152 349595 349634 349882 349779 349158
53647 349158 348394 347920 347783 347738 347624 347591 348096 349589 352001 354599 356611 358027 359541 361699 364362 367006
53631 367006 369315 371300 373023 374344 375042 375230 375586 376925 379393 382256 384643 386234 387155 387566 387794 388492
53615C88492J634K275K283K205K567L134L483L744M136M316L933L381L290L508
53601D32381L385K853K430K248J907J345J030J097J024M82p3q5K57K89k43r02
53585D49425j049m52M18O62k30j734k694k486j575q79q17j149j468j572j490j292
53569D31618r79n49k09l27r83j631j617r51k57Q4K86N56O66M44K77O53J372J759
53551D30212J608J452J742K177K144J561R74Q55J151J525J772J861J821J797K097
53536D54749K894L884M495M499M274M407N192O442P648Q290Q324Q361R066J0277
53522E42802J1134J1218J1133J1636J2642J3537J4151J4816J5635J6373J7060
53511F92137J8086J9462K0633K1304K1961K3180K4745K5871K6096K5584K4741
$$ plain form
53615 388492 390126 392401 394684 396889 399456 402590 406073 409817 413953 418269 422202 425583 428873 432381
53601 432381 435766 438619 441049 443297 445204 446549 447579 448676 449700 450182 450109 450024 450281 450570 450327 449425
53585 449425 448376 447924 448342 449004 448774 447040 444346 441860 440285 439406 438589 437440 435972 434400 432910 431618
53569 431618 430639 430090 429881 429554 428571 426940 425323 424372 424115 424199 424485 425041 425707 426151 426428 427081 428453 430212
53551 430212 431820 433272 435014 437191 439335 440896 441870 442725 443876 445401 447173 449034 450855 452652 454749
53536 454749 457643 461527 466022 470521 474795 479202 484394 490836 498484 506774 515098 523459 532525 542802
53522 542802 553936 565154 576287 587923 600565 614102 628253 643069 658704 675077 692137
53511 692137 710223 729685 750318 771622 793583 816763 841508 867379 893475 919059 943800
53500I43800K3918K3440K3471K3703K3530K2721K1750K1290K1395K1448K0908
53489A191374J9956J9255J9220J9714K0364K0799K0637J9705J8575J8355J9400
53478A407354K0580K0509J9364J8603J8785J8639J6841J3907J1491J0239R239
53467A585551P445M830K007n59k696m476o312q689j1398j3447j4108j3716j3140
53454A511292j2791j2683j3118j4574j6808j8778j9725j9943k0073k0078j9434
53443A323287j8194j7204j7098j7444j7287j6233j4688j3062j1211q865o272m134
53431A161595k853k188j649r64o6J153K665M069M894N316O144P854R881J1335
53417A207186J2274J3693J6116J8742K0378K0938K1365K2263K3155K3384K3218
$$ plain form
53500 943800 967718 991158 1014629 1038332 1061862 1084583 1106333 1127623 1149018 1170466 1191374
53489 1191374 1211330 1230585 1249805 1269519 1289883 1310682 1331319 1351024 1369599 1387954 1407354
53478 1407354 1427934 1448443 1467807 1486410 1505195 1523834 1540675 1554582 1566073 1576312 1585551
53467 1585551 1592996 1597826 1599833 1599274 1596578 1592102 1585790 1577101 1565703 1552256 1538148 1524432 1511292
53454 1511292 1498501 1485818 1472700 1458126 1441318 1422540 1402815 1382872 1362799 1342721 1323287
53443 1323287 1305093 1287889 1270791 1253347 1236060 1219827 1205139 1192077 1180866 1172001 1165729 1161595
53431 1161595 1158742 1156554 1154905 1153941 1153875 1155028 1157693 1161762 1166656 1171972 1178116 1185970 1195851 1207186
53417 1207186 1219460 1233153 1249269 1268011 1288389 1309327 1330692 1352955 1376110 1399494 1422712
53406A422712K3665K5318K7748L0006L1501L2401L3383L4986L7193L9543M1744
53395A780200M3975M6457M8959N0977N2356N3413N4421N5315N6006N6644N7314
53384B356037N7658N7185N5843N4053N2101M9774M6811M3528M0712L8770L7165
53373B889637L4874L1384K7020K2355J7651J2981Q488M102o96o362j2619j8845
53361C009970k5009l1549l8261m4008m7923n0258n1696n2431n2486n2359n2558
53350B511432n2812n2432n1282m9674m7589m4870m2107m0408m0075m0260m0142
53339B009781l9674l8976l7802l6101l4369l2903l1236k8910k6269k3865k1475
53328A658201j8485j4996j1916j0028r498j0195j1829j3717j5083j5769j6320
$$ plain form
53406 1422712 1446377 1471695 1499443 1529449 1560950 1593351 1626734 1661720 1698913 1738456 1780200
53395 1780200 1824175 1870632 1919591 1970568 2022924 2076337 2130758 2186073 2242079 2298723 2356037
53384 2356037 2413695 2470880 2526723 2580776 2632877 2682651 2729462 2772990 2813702 2852472 2889637
53373 2889637 2924511 2955895 2982915 3005270 3022921 3035902 3044390 3048492 3047796 3041434 3028815 3009970
53361 3009970 2984961 2953412 2915151 2871143 2823220 2772962 2721266 2668835 2616349 2563990 2511432
53350 2511432 2458620 2406188 2354906 2305232 2257643 2212773 2170666 2130258 2090183 2049923 2009781
53339 2009781 1970107 1931131 1893329 1857228 1822859 1789956 1758720 1729810 1703541 1679676 1658201
53328 1658201 1639716 1624720 1612804 1602776 1593278 1583083 1571254 1557537 1542454 1526685 1510365
53317A510365j7125j7824j7722j6631j5095j3825j3035j2348j1337j0068q887
53306A356468p752o222m201k274j017l23K98J094K138L657N742Q009J0007J1829
53292A377453J3768J5684J7278J8904K1230K4012K5925K6006K4789K3609K3061
53281A611719K2603K1471J9654J7878J6710J5850J4389J1838Q712N831L286M52
53269A770393l052o765r895j2097j3645j5021j6500j8138k0036k2441k5324k7996
53257A579483k9561k9891k9734k9743k9862k9926l0145l0488l0236k8924k7228
53246A253745k6122k5516k4659k3558k2946k2899k2702k2166k1993k2483k2890
53235I95811k2495k1460k0185j8615j6735j4972j3538j2024j0238q785q189p996
$$ plain form
53317 1510365 1493240 1475416 1457694 1441063 1425968 1412143 1399108 1386760 1375423 1365355 1356468
53306 1356468 1348716 1342494 1338293 1336019 1335002 1334679 1334977 1336071 1338209 1341866 1347608 1355617 1365624 1377453
53292 1377453 1391221 1406905 1424183 1443087 1464317 1488329 1514254 1540260 1565049 1588658 1611719
53281 1611719 1634322 1655793 1675447 1693325 1710035 1725885 1740274 1752112 1760824 1766655 1769941 1770393
53269 1770393 1767341 1760576 1750681 1738584 1724939 1709918 1693418 1675280 1655244 1632803 1607479 1579483
53257 1579483 1549922 1520031 1490297 1460554 1430692 1400766 1370621 1340133 1309897 1280973 1253745
53246 1253745 1227623 1202107 1177448 1153890 1130944 1108045 1085343 1063177 1041184 1018701 995811
53235 995811 973316 951856 931671 913056 896321 881349 867811 855787 845549 836764 828575 820579
53223H20579p448o648o323o797p862r310j0937j2264j2931j3317j4133j5482j6759
53210F80368j7400j7247j6320j4838j3392j2587j2388j2170j1469j0405r389q735
53198E24028q628r133j0033j0845j1164j0976j0639j0470j0397j0124r658r370
53186D02591r311q836p421n656m638m514m387l733l082k962l047k854k582k609
53172C36959k766k677k390k103j703j119o82n61l67J34L64k67j422k322k754k906
53156C13418k672j988j439j541j692r87J97M72o14j958k431k060j390o30J57O59
53140B95501O72L82Q1n2J63P40J153Q34R0j05M95J082J092J079J722K685L128
53123C10742K972K885L235L702L863L762L732L934M196M228M030L967M246M421
$$ plain form
53223 820579 813131 806483 800160 793363 785501 776191 765254 752990 740059 726742 712609 697127 680368
53210 680368 662968 645721 629401 614563 601171 588584 576196 564026 552557 542152 532763 524028
53198 524028 515400 506267 496234 485389 474225 463249 452610 442140 431743 421619 411961 402591
53186 402591 393280 384444 377023 371367 366729 362215 357828 354095 351013 348051 345004 342150 339568 336959
53172 336959 334193 331516 329126 327023 325320 324201 323519 322958 322591 322725 323089 322822 321400 319078 316324 313418
53156 313418 310746 308758 307319 305778 304086 303099 303296 303768 303154 301196 298765 296705 295315 294685 294842 295501
53140 295501 296173 296555 296636 296584 296747 297487 298640 299474 299564 299459 299954 301036 302128 303207 304929 307614 310742
53123 310742 313714 316599 319834 323536 327399 331161 334893 338827 343023 347251 351281 355248 359494 363915
53109C63915L804K384R00j24r45j994l141l881m052l957l960m192m565m840m767
53094C30585m289l650l177l036l137l209l019k651k473k617k671k193j407r31
53080B92125r10q47l36M05Q64P04l8r26j290q73k18k0j65m9K80J05p18j372j290
53061B85431r61r86j056n95J44M14J05j56M5N03Q45R20P36M73N13J056J731J897
53043B91059J397O15Jk74k28o0j23n47r06o74K0M97M71M04P86J381J604J348J103
53024B97874J208J356R91M1r97j690k045k252k201j638o11M24J058J250J239J333
53008B95340J738K383K872K807K178J247K27o31q40r4J054J555J057K91P5M32
52992C11691R49J512K174K710K799K490K049J570J019M86O0l40o94p45m84m15
$$ plain form
53109 363915 367719 370103 371003 370879 369934 367940 364799 360918 356866 352909 348949 344757 340192 335352 330585
53094 330585 326296 322646 319469 316433 313296 310087 307068 304417 301944 299327 296656 294463 293056 292125
53080 292125 291215 290368 290032 290437 291301 292005 291967 291041 289751 288878 288660 288640 288475 288426 288706 288811 288093 286721 285431
53061 285431 284470 283484 282428 281833 281977 282391 282496 282340 282385 282888 283733 284653 285389 285862 286375 287431 289162 291059
53043 291059 292456 293071 293072 292798 292570 292510 292387 291840 290934 290260 290280 290777 291248 291652 292438 293819 295423 296771 297874
53024 297874 299082 300438 301429 301470 300473 298783 296738 294486 292285 290647 290036 290460 291518 292768 294007 295340
53008 295340 297078 299461 302333 305140 307318 308565 308792 308161 307321 307227 308281 309836 310893 311184 311259 311691
52992 311691 312640 314152 316326 319036 321835 324325 326374 327944 328963 329449 329509 329169 328475 327730 327246 326831
52976C26831q39j188p04M29J276J407J300J458J768J864J608J029K82j75J26R44
52960C37416J468J339J046J039J001N23j26m81p44j407k226k421j901j498j770
52945C31258k218k114j529j105j088j170j014n64J05P86J042N85k67q28q51p44
52929C20284r31j300j440j104l60N58J255J385J026O75O72P85N93Q8l64n42n51
52912C20729n33m75l43k28k83n84j005j199q52kR09J402J266O28j27n01k80J11
52894C18633P9k95k75M12J074J006M43Ol35j020j859k035j186J52J274J963K348
52877C20385K593K869L254L543L481L193L047L111L065K665J916Q86k35j011j191
52862C51571j216j738k698l435l654l632l489k952k082j498j561j908k080k135
$$ plain form
52976 326831 325992 324804 324100 324529 325805 327212 328512 329970 331738 333602 335210 336239 336521 336346 336472 337416
52960 337416 338884 340223 341269 342308 343309 343832 343706 343225 342481 341074 338848 336427 334526 333028 331258
52945 331258 329040 326926 325397 324292 323204 322034 321020 320456 320561 321347 322389 322974 322707 321879 321028 320284
52929 320284 319353 318053 316613 315509 315149 315707 316962 318347 319373 320048 320720 321505 322098 322186 321822 321280 320729
52912 320729 320196 319721 319378 319150 318867 318283 317278 316079 315227 315225 316134 317536 318802 319430 319303 318802 318522 318633
52894 318633 318712 318417 318142 318554 319628 320634 321077 321083 320748 319728 317869 315834 314648 314800 316074 318037 320385
52877 320385 322978 325847 329101 332644 336125 339318 342365 345476 348541 351206 353122 354008 353773 352762 351571
52862 351571 350355 348617 345919 342484 338830 335198 331709 328757 326675 325177 323616 321708 319628 317493
52848C17493k316k626k939l151k996k266j304p45n87k36L20K31q36j903j965j385
52832B92789j153j281r11J89J183J292O71J9k11l2K87M71M16J99q0k72j30L98
52814B93844P68L57n24p55Q1J014R87K57j87j10j07m92r27j066r17n47k2L70K99
52795B92323j47o25j017j428j744j706j327q74n17k79k10k28QO51J297J468J272
52778B86917J141J084P97L26O8J18J49k8k52l63l54k30l0N0j10k96l43m98r57
52759B87189j232o83M49J219J231J038J163J338J061L71k61n09l63J02Q07J605
52743B94525K288K730K974L163L274K989K201J569J998L305M011K966P36j148
52729C27581j894j746j121l27J15j63o64n10K83P38K30q06j576j724j275m31L84
$$ plain form
52848 317493 315177 312551 309612 306461 303465 301199 299895 299150 298563 298327 298647 298878 298042 296139 294174 292789
52832 292789 291636 290355 289444 289633 290816 292108 292779 292798 292587 292555 292842 293313 293729 293928 293848 293576 293446 293844
52814 293844 294612 294969 294445 293690 293771 294785 295772 296029 295842 295732 295625 295133 294206 293140 292223 291676 291654 292024 292323
52795 292323 292176 291551 290534 289106 287362 285656 284329 283455 282938 282659 282449 282221 282229 282880 284177 285645 286917
52778 286917 288058 289142 289939 290265 290333 290451 290600 290572 290320 289957 289603 289373 289343 289393 289283 288987 288644 288146 287189
52759 287189 285957 285274 285723 286942 288173 289211 290374 291712 292773 293144 292883 292374 292011 292113 292920 294525
52743 294525 296813 299543 302517 305680 308954 311943 314144 315713 317711 321016 325027 327993 328729 327581
52729 327581 325687 323941 322820 322493 322608 322445 321781 321271 321554 322292 322522 321716 320140 318416 317141 316710 317094
52712C17094P43O87N45M08J76K6J60K32k09p92o51K21Q72P82M17J62k69r56j289
52693C18359r33n52p91j236j097m40J6Lp8R6M21O16N17J62j46j61j53o90j733
52674C12180k422k038p87N96J500J491M61q97j381o51K75M41K05M22J021J324
52658C11740J302J435J598J220N16N40J678L030L603L447L195L033K657J868P81
52643C41643m02j501k334k780k814k452j761r98n24n23q49j186j211p00L10J434
52627C23352K213K522K598K564K195J304K16m16l98l28r35k075k757k303j193
52612C26559m13k45j97J7J12o1j01L00P54P02J93k57l88l66l60l63k74J1N13R94
52592C27130J031N17j34m87m91k84J30O54R14P41N10O36R09Q51M94L38N73Q29
$$ plain form
52712 317094 317837 318524 319069 319477 319653 319679 319839 320071 319862 319070 318419 318640 319512 320294 320711 320873 320604 319648 318359
52693 318359 317426 316874 316083 314847 313750 313310 313326 313329 313251 313347 313768 314384 314901 315063 314917 314756 314603 313913 312180
52674 312180 309758 307720 306933 307529 309029 310520 310981 310084 308703 308052 308327 308768 308973 309395 310416 311740
52658 311740 313042 314477 316075 317295 317811 318351 320029 323059 326662 330109 333304 336337 338994 340862 341643
52643 341643 341241 339740 337406 334626 331812 329360 327599 326601 326077 325554 324705 323519 322308 321608 321918 323352
52627 323352 325565 328087 330685 333249 335444 336748 336964 336548 336150 335822 334887 332812 330055 327752 326559
52612 326559 326146 325901 325704 325721 325833 325772 325671 325971 326725 327427 327620 327363 326975 326609 326249 325886 325612 325623 326136 327130
52592 327130 328161 328678 328544 328057 327566 327282 327412 328066 328980 329721 330231 330867 331776 332627 333121 333459 334032 334861
52574C34861P00J30o27j111q68L5Q11P55J32k07l8L9l82r78j299j341j235r26
52556C28451n10m28q61j286j104m43J00L04M42O13N79K85J27M03Q03P71J89n27
52538C27908r34r23n28K31J144J658J304L60k17K04J155J576J083L90L93J091
52522C35895J684J606J129Q76J088J524J912K180K304K311K429K971L833M437
52508C66179M324L624K734J789P13m83j754l181m677n648n483m390l307k921l086
52493C44433l163k687j615m13J63j93q12p49n5K70k42q47p25p6L99N70P03P13
52475C35674L54n8J16R11J676K000K123K403K844L308L810M318M590M379L738
52460C72186L022K624K529K157Q66j142k782l271l055l115l599l830l524l266
$$ plain form
52574 334861 335561 335691 335064 333953 333085 333120 333931 334686 334818 334611 334573 334612 334230 333252 331953 330612 329377 328451
52556 328451 327941 327513 326652 325366 324262 323819 323919 324223 324665 325278 325857 326142 326269 326672 327475 328246 328435 327908
52538 327908 326974 326051 325523 325754 326898 328556 329860 330220 330003 330207 331362 332938 334021 334411 334804 335895
52522 335895 337579 339185 340314 341190 342278 343802 345714 347894 350198 352509 354938 357909 361742 366179
52508 366179 370503 374127 376861 378650 379363 378880 377126 373945 369268 363620 358137 353747 350440 347519 344433
52493 344433 341270 338583 336968 336555 336718 336525 335713 334964 334909 335179 334937 334090 333365 333289 333688 334258 334961 335674
52475 335674 336028 335970 336086 336997 338673 340673 342796 345199 348043 351351 355161 359479 364069 368448 372186
52460 372186 375208 377832 380361 382518 383384 382242 379460 376189 373134 370019 366420 362590 359066 355800
52446C55800l540l904l526k232p03J92J16n22q86m88K79N95K16k85l56j27M6K81
52428C40956R27J759J951J060l36j211j129m89J58P22J404K170K648K535J907
52413C55032J148P11Q73J486K000K019J908K473L905N400O153O344O748P605Q284
52398D12089Q064O729M469J621j283l659n260o278o932p104o596n557m455l633
52384C82215l025k319j376m68l0j39l07N9J043K172K951L312L524L838M220M424
52368D00094M253L849L617L717L708K836Q49j529l049k966j683l29L13M42P13
52353D14835J276J661J533J218J235J616J983K058J840J378Q00M87Q57J808K678
52338D37263K952K864L091L885M809N372N688O251P199Q164Q865R481J0215J0901
$$ plain form
52446 355800 352260 348356 344830 342598 341895 342087 342203 341681 340795 340307 340586 341181 341397 341112 340756 340629 340675 340956
52428 340956 341883 343642 345593 346653 346317 345106 343977 343488 343646 344368 345772 347942 350590 353125 355032
52413 355032 356180 356891 357764 359250 361250 363269 365177 367650 371555 376955 383108 389452 396200 403805 412089
52398 412089 420153 426882 431351 432972 431689 428030 422770 416492 409560 402456 395860 390303 385848 382215
52384 382215 379190 376871 375495 375027 374997 374858 374551 374610 375653 377825 380776 384088 387612 391450 395670 400094
52368 400094 404347 408196 411813 415530 419238 422074 422923 421394 418345 415379 413696 413367 413680 414122 414835
52353 414835 416111 417772 419305 420523 421758 423374 425357 427415 429255 430633 431433 431920 432777 434585 437263
52338 437263 440215 443079 446170 450055 454864 460236 465924 472175 479374 487538 496403 505884 516099 527000
52324E27000J1387J1993J3031J4071J4323J3761J3207J3204J3405J3396J3505
52313F72283J4314J5766J7244J8390J9432K0762K2463K4209K5513K6153K6409
52302I02938K6699K7099K7479K7966K8696K9144K8449K6571K4393K2380J9831
52291A191645J6104J1882Q515O418M855L132J296k28j167j655k283l656n620p201
52277A222037p744p697p771p844p375o488n796n307m402k875j249L7J064K006
52263A160596K898L958N528P466R166J0406J1731J3693J6058J8086J9435K0474
52251A299495K1713K2965K3348K2232K0046J7736J5587J3213J0661Q541O792M404
52239A486733J066j955l548m457o121q551j0743j2573j4687j6851j8112j8601
$$ plain form
52324 527000 538387 550380 563411 577482 591805 605566 618773 631977 645382 658778 672283
52313 672283 686597 702363 719607 737997 757429 778191 800654 824863 850376 876529 902938
52302 902938 929637 956736 984215 1012181 1040877 1070021 1098470 1125041 1149434 1171814 1191645
52291 1191645 1207749 1219631 1228146 1234564 1239419 1242551 1243847 1243619 1242452 1240797 1238514 1234858 1229238 1222037
52277 1222037 1214293 1206596 1198825 1190981 1183606 1177118 1171322 1166015 1161613 1158738 1157489 1157526 1158590 1160596
52263 1160596 1163494 1167452 1172980 1180446 1189612 1200018 1211749 1225442 1241500 1259586 1279021 1299495
52251 1299495 1321208 1344173 1367521 1389753 1409799 1427535 1443122 1456335 1466996 1475537 1482329 1486733
52239 1486733 1487799 1485844 1482296 1477839 1471718 1463167 1452424 1439851 1425164 1408313 1390201 1371600
52227A371600j9519k1116k2271k2408k2269k2255k1604k0005j8571j8160j7944
52216A145478j6834j5311j4589j4582j4029j2270r888p768o261n175m000k372
52204A022399o87J31j29n54l36K75P72J352K312L270L894M755O368P919Q133P130
52188A067004O153N623M734K996R84q03k707n053p294q666r128r156r000q619
52174A027068q020p335o635n928n187m311l232k092j165n14K3N20Q97J233J831
$$ plain form
52227 1371600 1352081 1330965 1308694 1286286 1264017 1241762 1220158 1200153 1181582 1163422 1145478
52216 1145478 1128644 1113333 1098744 1084162 1070133 1057863 1047975 1040207 1033946 1028771 1024771 1022399
52204 1022399 1021712 1021843 1021714 1021160 1020824 1021099 1021871 1023223 1025535 1028805 1032699 1037454 1043822 1051741 1059874 1067004
52188 1067004 1073157 1078780 1083514 1086510 1087494 1086691 1083984 1078931 1071637 1062971 1053843 1044687 1035687 1027068
52174 1027068 1019048 1011713 1005078 999150 993963 989652 986420 984328 983163 982649 982672 983192 984089 985322 987153
$$ [...]
##END NTUPLES=NMR SPECTRUM
##END=
