##TITLE=AC1708_ROEFFECT0029_8638261_155czoN6rI
##JCAMPDX= 6.0         $$ Bruker NMR JCAMP-DX V2.0
##DATA TYPE= NMR SPECTRUM
##DATA CLASS= NTUPLES
##ORIGIN= BRUKER
##OWNER= Administrator
$$ 1.72 TOPSPIN		Version 2.1
$$ 2014-05-23 02:01:50.017 -0700  Administrator@X
$$ Compression mode = diff/dup
##.OBSERVE FREQUENCY= 400.02188249412
##.OBSERVE NUCLEUS= ^1H
##.ACQUISITION MODE= SIMULTANEOUS (DQD)
##.ACQUISITION SCHEME= undefined
##.AVERAGES= 8
##.DIGITISER RES= 22
##SPECTROMETER/DATA SYSTEM= spect
##.PULSE SEQUENCE= zg30
##.SOLVENT NAME= COFFEE_meoh
##.SHIFT REFERENCE= INTERNAL, COFFEE_meoh, 1, 14.98509
##AUDIT TRAIL= $$ (NUMBER, WHEN, WHO, WHERE, PROCESS, VERSION, WHAT)
$$ ##TITLE= Audit trail, TOPSPIN		Version 2.1
$$ ##JCAMPDX= 5.01
$$ ##ORIGIN= Bruker BioSpin GmbH
$$ ##OWNER= Administrator
$$ $$ E:\/data/COFFEE/nmr/AC1708_ROEFFECT0029_8638261_155czoN6rI/10/pdata/1/auditp.txt
$$ ##AUDIT TRAIL=  $$ (NUMBER, WHEN, WHO, WHERE, PROCESS, VERSION, WHAT)
(   1,<2014-05-23 02:01:43.454 -0700>,<Administrator>,<X>,<go>,<TOPSPIN 2.1>,
      <created by zg
	started at 2014-05-23 02:00:37.357 -0700,
	POWCHK enabled, PULCHK disabled,
       configuration hash MD5:
       C8 4E 4E 5D D3 5C D8 9E 9F 52 82 E0 59 8A DE 15
       data hash MD5: 64K
       3E 32 DA 1F E2 E5 60 BD 8E EE C5 E0 7F 88 BC 96>)
(   2,<2014-05-23 02:01:46.376 -0700>,<Administrator>,<X>,<proc1d>,<TOPSPIN 2.1>,
      <Start of raw data processing
       efp LB = 0 FT_mod = 6 PKNL = 1 PHC0 = 0 PHC1 = 0 SI = 32K 
       data hash MD5: 32K
       1C 06 A1 64 3B 8E E7 DB 25 E5 83 13 99 56 02 95>)
(   3,<2014-05-23 02:01:46.673 -0700>,<Administrator>,<X>,<proc1d>,<TOPSPIN 2.1>,
      <pk PHC0 = 92.44995 PHC1 = 0 
       data hash MD5: 32K
       A4 57 3B C6 59 44 3D 0A 04 29 97 24 8D 56 91 33>)
(   4,<2014-05-23 02:01:46.782 -0700>,<Administrator>,<X>,<proc1d>,<TOPSPIN 2.1>,
      <abs ABSG = 1 
       data hash MD5: 32K
       F9 9D 23 3C D7 72 51 33 27 BA 4D F8 B7 E1 66 2E>)
(   5,<2014-05-23 02:01:46.829 -0700>,<Administrator>,<X>,<proc1d>,<TOPSPIN 2.1>,
      <abs ABSG = 2 
       data hash MD5: 32K
       01 C8 09 07 EB 45 63 25 E3 34 00 57 F1 B4 30 BC>)
(   6,<2014-05-23 02:01:46.892 -0700>,<Administrator>,<X>,<proc1d>,<TOPSPIN 2.1>,
      <abs ABSG = 3 
       data hash MD5: 32K
       11 B9 23 55 95 C2 DA 52 10 4C 7B 51 6E 57 01 5C>)
(   7,<2014-05-23 02:01:46.970 -0700>,<Administrator>,<X>,<proc1d>,<TOPSPIN 2.1>,
      <abs ABSG = 4 
       data hash MD5: 32K
       F9 62 D7 FF 0C B0 A1 3E 36 EF BB 97 2B EC 14 A4>)
(   8,<2014-05-23 02:01:47.017 -0700>,<Administrator>,<X>,<proc1d>,<TOPSPIN 2.1>,
      <abs ABSG = 5 
       data hash MD5: 32K
       03 E8 3C CA 38 0A 95 26 A6 B0 5D 5A CA 84 1C EF>)
$$ ##END=
$$ 
$$ $$ hash MD5
$$ $$ 01 FE 89 80 86 5C 7C 2C 79 95 5D 92 82 63 93 87
##$RELAX= 
##$RELAX= 
##$RELAX= 
##$RELAX= 
##$RELAX= 
##$RELAX= 
##$RELAX= 
$$ Bruker specific parameters
$$ --------------------------
##$DU= <E:\>
##$EXPNO= 10
$$ [...]
150 150 150 150 150 150 150 150
##$TP07= 0
##$TPNAME0= <>
##$TPNAME1= <>
##$TPNAME2= <>
##$TPNAME3= <>
##$TPNAME4= <>
##$TPNAME5= <>
##$TPNAME6= <>
##$TPNAME7= <>
##$TPOAL= (0..7)
0.5 0.5 0.5 0.5 0.5 0.5 0.5 0.5
##$TPOFFS= (0..7)
0 0 0 0 0 0 0 0
##$TUNHIN= 0
##$TUNHOUT= 0
##$TUNXOUT= 0
##$USERA1= <user>
##$USERA2= <user>
##$USERA3= <user>
##$USERA4= <user>
##$USERA5= <user>
##$V9= 5
##$VALIST= <valist>
##$VCLIST= <CCCCCCCCCCCCCCC>
##$VD= 0
##$VDLIST= <DDDDDDDDDDDDDDD>
##$VPLIST= <PPPPPPPPPPPPPPP>
##$VTLIST= <TTTTTTTTTTTTTTT>
##$WBST= 2048
##$WBSW= 25
##$XGAIN= (0..3)
0 0 0 0
##$XL= 0
##$YL= 0
##$YMAX_a= 602557
##$YMIN_a= -515086
##$ZGOPTNS= <>
##$ZL1= 120
##$ZL2= 120
##$ZL3= 120
##$ZL4= 120
##$ABSF1= 14.98509
##$ABSF2= -5.573092
##$ABSG= 5
##$ABSL= 3
##$ALPHA= 0
##$AQORDER= 0
##$ASSFAC= 0
##$ASSFACI= 0
##$ASSFACX= 0
##$ASSWID= 0
##$AUNMP= <proc_prof1d_extract_pilot.lims>
##$AXLEFT= 0
##$AXNAME= <>
##$AXNUC= <1H>
##$AXRIGHT= 0
##$AXTYPE= 0
##$AXUNIT= <>
##$AZFE= 0.1
##$AZFW= 0.1
##$BCFW= 0
##$BC_mod= 0
##$BYTORDP= 0
##$COROFFS= 0
##$CY= 15
##$DATMOD= 1
##$DC= 0
##$DFILT= <>
##$DTYPP= 0
##$F1P= 0
##$F2P= 0
##$FCOR= 0.5
##$FTSIZE= 32768
##$FT_mod= 6
##$GAMMA= 0
##$GB= 0
##$INTBC= 1
##$INTSCL= 1
##$ISEN= 128
##$LB= 0
##$LEV0= 0
##$LPBIN= 0
##$MAXI= 10000
##$MC2= 0
##$MEAN= 0
##$ME_mod= 0
##$MI= 0
##$NCOEF= 0
##$NC_proc= -8
##$NLEV= 6
##$NOISF1= 0
##$NOISF2= 0
##$NSP= 0
##$NTH_PI= 0
##$NZP= 0
##$OFFSET= 14.98509
##$PC= 1
##$PHC0= 92.44995
##$PHC1= 0
##$PH_mod= 1
##$PKNL= yes
##$PPARMOD= 0
##$PPDIAG= 0
##$PPIPTYP= 0
##$PPMPNUM= 2147483647
##$PPRESOL= 1
##$PSCAL= 4
##$PSIGN= 0
##$PYNMP= <proc.py>
##$REVERSE= no
##$SF= 400.02
##$SI= 32768
##$SIGF1= 0
##$SIGF2= 0
##$SINO= 400
##$SIOLD= 32768
##$SPECTYP= <>
##$SREGLST= <1H.CDCl3>
##$SSB= 0
##$STSI= 32768
##$STSR= 0
##$SW_p= 8223.68421052631
##$SYMM= 0
##$S_DEV= 0
##$TDeff= 65536
##$TDoff= 0
##$TI= <>
##$TILT= no
##$TM1= 0
##$TM2= 0
##$TOPLEV= 0
##$USERP1= <user>
##$USERP2= <user>
##$USERP3= <user>
##$USERP4= <user>
##$USERP5= <user>
##$WDW= 1
##$XDIM= 32768
##$YMAX_p= 469766531
##$YMIN_p= -709462
##$CURPLOT= <Network HP LaserJet P1505>
##$CURPRIN= <$Network HP LaserJet P1505>
##$DFORMAT= <normdp>
##$LAYOUT= <+/1D_H.xwp>
##$LFORMAT= <normlp>
##$PFORMAT= <normpl>
##$SURQMSG= 1
$$ End of Bruker specific parameters
$$ ---------------------------------
##NTUPLES= NMR SPECTRUM
##VAR_NAME=  FREQUENCY,     SPECTRUM/REAL,   SPECTRUM/IMAG
##SYMBOL=    X,             R,               I
##VAR_TYPE=  INDEPENDENT,   DEPENDENT,       DEPENDENT
##VAR_FORM=  AFFN,          ASDF,            ASDF
##VAR_DIM=   32768,         32768,           32768
##UNITS=     HZ,            ARBITRARY UNITS, ARBITRARY UNITS
##FACTOR=    0.250966925370066, 1,           1
##FIRST=     8223.43324360094, -91621,       -308158
##LAST=      0,             235352,          40874
##MIN=       0,             -709462,         0
##MAX=       8223.43324360094, 469766531,    0
$$ Real data points
##PAGE= N=1
##DATA TABLE= (X++(R..R)), XYDATA
$$ [...]
23850 -26901 200802 88201 -126990 93063 330634 -39381 -79326 93812 187780 122855 69790
23839 69790 -70742 -27564 -179333 385626 -96026 77088 -43803 -4389 -106290 -161208 310356
23827 -308665 80892 -89151 -89968 76329 164870 -93909 -98872 -254927 34218 -153783 -458642
23816 -458642 96536 -113531 -116373 225146 53498 12075 48631 335299 -130529 -22576 124743
23804 -73682 -238913 7127 5343 74087 -225026 182736 327011 46410 -325 13675 154098
23793 154098 134526 31455 -127322 -60684 173296 147080 33369 -227992 248532 287 -105778
23781 -154455 -102039 -62338 -183065 -69219 38603 -283850 274682 341986 219115 344857
23771 344857 46758 297318 56428 64283 -209942 -259345 -343704 -132636 -91984 -227495 -113572
23759 -17666 20563 -272679 64409 116182 -172440 -115946 57665 -21061 151201 -29170 22724
23747 16210 154958 -10344 -85802 -36160 -234460 288045 -124545 -116807 -11688 479426 63336
23735 47286 -237333 222622 -38916 177805 -41833 204883 -230685 -120461 119046 -119646
23724 -152132 -634 165676 310617 -209940 -104633 35422 -77052 -17777 27588 422518 53319
23712 -166786 40853 30560 76872 -1828 91904 291828 -28947 -60640 -456523 -243794 -133941
23701 -133941 -371682 -108397 119502 -24804 -53339 -112364 275078 -18094 217815 202086
23691 202086 439982 45337 -30367 -159036 120377 200343 -56483 177907 97972 -187946
23680 -437283 343287 343414 46838 1676 -34494 145249 89043 -63460 311809 2544 90865 -264009
23667 -139536 97313 3463 134843 63063 -106207 286905 -202922 -34834 73000 148603 49993
23655 54972 107291 12445 205295 -71468 164582 -414458 -169335 -357784 -321259 -237130 34262
23643 154468 -385407 210826 -204132 111906 202308 42293 -294560 282935 112104 -263075
23632 -165013 101430 -127199 -276545 -283128 40513 -198557 -8647 -91068 -367911 -388625 -53801
23620 -46784 85733 -14999 -149132 119085 30646 -35710 -128330 -312876 -42993 -60988 -128951
23609 -128951 235152 119878 -35697 173268 234292 -100431 -3045 166353 -159296 -64127
23598 80348 -68110 -72982 193822 47292 2919 -63638 159819 7531 -935 -2839 -96821 165909
23585 277097 172778 179298 -217222 -12590 -251679 -31625 250845 81463 -221357 3242 -70729
23573 152885 -447407 -150480 97752 -242311 -69880 126861 131297 -23257 -139097 -58415 -125056
23562 -125056 269658 272552 38822 113079 -304647 -170997 -149784 12591 -103651 -296487 24930
23550 139820 278410 -172700 115458 93091 152021 295727 -38198 -35592 -20710 1306 -85010
23538 -61265 52138 250703 235207 -44085 -144443 153499 -127437 82062 358707 -340352
23527 -154943 -5189 -211692 -193817 -85515 219810 -63957 169064 -286093 -23612 33285 -408264
23515 -152382 -219164 -214743 -67118 -21795 -134696 -93486 -104216 194087 56457 -21090 -84940
23504 -84940 272940 -122062 -65210 -44142 57818 -185073 98209 -77293 -8189 13585 -319872
23492 -154048 5554 140560 49587 -67256 -46092 -296578 -243283 119585 267738 -93805 133669
23480 -170026 172369 -129917 -67615 -9015 -118970 -177029 50383 -217583 73569 -240448 -200935
23469 -200935 -218482 -115949 -25689 35781 102642 -263752 -76084 19377 79867 -86049 -308374
23458 -308374 -59860 -297244 -96852 41580 -130061 178933 123100 -84023 299243 -84990 -389481
23447 -389481 185765 -18318 187868 -133790 -291363 -107176 86474 428 -27018 272010 311414
23436 311414 -128702 50364 159370 -144945 170895 73106 -181512 -95843 -108216 120846
23425 223472 -6295 197927 102713 -172491 368115 216692 -174231 -132081 -333573 132910
23414 188247 152874 -165995 15159 429024 -161125 -40458 -398848 -26187 206359 29173
23403 19494 74454 -11894 -69377 -16422 175146 -88542 208542 -136279 -93097 -176667 -37288
23391 167550 92474 99379 -77466 34580 29501 -81404 126083 182061 184049 77186 173742 -141894
23378 -40517 272008 -1808 70340 310058 -47240 21550 171673 25016 238308 -12081 -63352
23367 -63352 -418812 -18482 -67600 -45115 66265 -52200 -107306 -227493 280475 -15891 84405
23355 -229110 -75573 9215 -96101 -35688 -95789 97957 -49816 128571 206030 384974 68008
23343 221286 -468776 -24375 177830 166215 -254815 -140125 -107589 -1589 40898 94037 -531
23331 -262870 265016 106343 -160674 84106 -17785 -261535 -138787 -22299 250332 -147446
23320 12759 120476 -339955 23496 -206115 -83524 81238 -252292 -213458 332441 -162717
23309 138713 51397 -52791 -303015 -81063 -117581 -73660 219425 178472 -91887 -13219 300342
23297 64060 131822 287319 -68002 99994 -14268 -249461 -163881 -123214 -26388 -563450 -31080
23285 -162695 217037 -21279 -32680 82375 -16654 -11863 -53225 -73792 -110397 454939 -460568
23273 -298022 -149098 123665 174562 -333630 46306 -175227 -152355 35431 -183358 120783
23262 -318996 -21397 97276 -76444 80456 51432 -46129 -51364 -127055 212252 22196 -22366
23250 -5132 -253736 -290305 -184499 -215311 -272911 279571 75974 33642 -51352 -487178 273814
23238 82315 -112387 -199231 184215 -350611 -122340 14994 -268651 -280705 173699 -55835
23227 -82707 217521 -135098 -395041 -102579 180204 94132 58925 -392430 -162953 1883
23216 -206076 9270 51139 -144026 16959 40244 -113326 -364542 69347 -44528 -80529 45020
23204 87288 89530 136770 -36563 -225200 159125 -5250 110431 -135381 -33005 -26395 264567
23192 -195592 409518 -268045 189527 -106103 -221211 157722 -171476 95244 249993 -200923
23181 -116331 56124 120937 17964 -45674 -180957 -129936 -183237 -75719 -326248 71701 30910
23169 -217921 -25384 7045 -152047 242577 359181 105546 -34599 -10119 -184534 -96807 -337753
23158 -337753 -85770 257538 -207067 124016 78226 83639 95042 -318054 -10920 69485 -243725
23146 -201307 -68349 62579 125263 102155 289358 -222043 270614 -45859 180715 13181 -108185
23134 124167 -29853 470186 222889 34408 -182220 273970 414254 31447 25664 -25500 -150536
23123 -150536 129927 -46967 132285 -108885 152539 150190 243565 55629 150442 -9393 146527
23111 -237479 230241 32037 -53077 -160054 -80376 -173772 400668 130430 64944 346248
23101 346248 -144792 79367 86639 79762 -120331 -43108 -153737 40705 -169783 -23858 385034
23089 182474 318740 256825 165006 -246643 -52084 -139765 -143031 -16332 -58394 -64417 -90726
23078 -90726 -103871 -205722 -123076 -55576 125718 48482 -124082 8270 229440 204347 -96646
23066 -84196 -101884 160474 148486 -196842 -43810 114910 56508 -291511 141741 -201327
23055 116544 32644 -78413 68026 49588 182134 187440 26935 -187360 -194474 84022 481465
23044 481465 -44433 -175937 -38615 -153981 -96893 157199 163519 -19939 -181391 -45998 -239062
23033 -239062 179181 -97942 215324 -122415 13598 135744 -43407 48638 39551 241894 108366
23021 -143011 72215 270184 -245266 -161842 77749 -96635 -142949 -296452 -19918 166393 -123712
23009 -2241 -116094 -142194 -66445 -232748 -244417 -115197 -324267 -17919 69541 -391130 -169160
22997 -166804 351913 161849 -76089 -245006 -247068 -141930 -6329 209356 28233 56867 -132007
22985 -215809 -93165 118158 12372 -31769 -40458 -398990 -28934 -249803 -264060 -109520 20027
22973 -286609 212072 -148469 -92819 -34079 66601 -53691 -16819 -53051 -50220 123210 -153869
22961 -48730 129832 -46180 -266636 81284 38992 -114136 11640 15781 -27236 -17217 -310035
22950 -310035 -96638 143874 -271420 -108084 -15262 205829 6933 -99206 -59883 -58964 178370
22938 83397 48942 -150574 -28184 -183120 -300808 893 146510 -300353 -38380 -105478 3897
22926 -159053 29715 11498 -54888 229257 -133713 -292296 -210814 132385 -14234 -163718
22916 -163718 -142833 -61579 -81760 -74750 61276 -99327 -151933 91043 27959 -51807 278853
22904 114191 -315897 -281042 -376782 20046 -121810 -102974 -92027 -41570 -114007 -295686 488804
22892 83159 -5795 147844 39260 35869 -1181 -226413 196993 -72962 2177 -173138 -29880 177098
22879 123957 44732 -206683 167160 151026 -121784 132944 141531 -49958 -76232 -64059 -306766
22868 -306766 278614 -309597 74671 73825 14500 -12604 274398 142175 260150 -228301 171361
22856 273136 251408 63203 301811 -89224 160278 120775 -151284 -152874 375113 -435353 -67855
22844 -61401 69131 -18542 81969 143193 -265596 36041 11505 -113606 12859 -53485 -95814
22833 -95814 -106362 -134128 153716 -125673 147312 22275 188998 -236727 191921 52584
22822 113438 -143305 135623 -50243 -57946 -135254 -323902 -26075 -268336 -117616 -92916 -252921
22811 -252921 -163089 1303 -215041 226063 -209756 59232 53293 -69460 -165224 -187043 56230
22799 -59335 -90945 -45218 286335 186045 404891 -129045 -162870 -275001 -417538 82835
22788 163902 120350 -53501 65708 12768 388855 62500 -40847 85770 -21304 182013 -180152
22776 -330746 154513 -208739 242451 79418 -99033 183390 163420 426066 -111201 -78473
22766 -78473 -138386 193947 49477 -74846 -317486 36820 134379 186899 -90148 -103698 96155
22754 238583 -91270 -122404 -171429 -113686 -225456 -236080 -7830 -102590 -108649 96252 -19194 -244526
22742 -244526 115399 191131 146437 -598264 -47343 13775 -98259 -308092 -261279 57315 -164101
22730 -164083 126807 -118133 353690 -175368 -38335 48394 -85675 231073 -141723 49169
22719 -36303 17855 -50463 -416702 137181 -208747 -29940 95673 -149293 295965 3608 352539
22708 352539 26748 -155649 -39594 -65297 31604 83590 88633 -49563 147804 -175224 -88500
22697 -88500 -171230 225600 -118694 -39781 -215348 -437483 -132079 -294317 -380257 -241316
22687 -241316 80001 -367346 222429 -1429 101946 -124515 131096 190063 35781 110306 -87588
22675 -315315 -74889 59202 -2159 -25511 -10144 -203266 23660 -133567 71058 144392 -132207
22663 -240587 -118997 -109580 -59085 -26892 -60319 -84071 163296 -18092 -41833 127759 -290578
22651 40969 34633 -70533 19802 -62127 -60524 -252309 -163657 -11596 -149255 -27477 -5297 -88152
22639 -88152 22875 121410 141683 -40275 -122309 -179222 128368 88040 57537 -116732 262027
22627 242737 -99001 -58163 -98004 -184238 79778 71368 284799 359463 232076 193148 -65278
22615 169536 -23710 -220936 -3926 -246881 -314458 -10783 -209805 18200 44050 -84176 52391
22603 193638 23973 178702 134338 82500 -145790 -205660 -257481 -56326 64429 69790 -38786
22591 79136 135348 -36930 -101241 -266485 -63070 19727 -119033 -41765 90275 -77241 -223140
22580 -223140 -45318 -26426 -320837 236655 -69964 70262 -39641 -178027 -298753 70792 -83780
22568 55793 -66830 214392 157333 -98714 178713 -65513 -1178 -164950 -55047 -129419 112754
22556 -339237 143609 24903 -178539 -90887 -132658 -115963 -79644 -306626 -272561 266958 175996
22545 175996 -235459 -291934 -10287 -131345 -54701 17863 78744 -205758 15818 110394 -60760
22533 78985 -29669 143717 37185 239658 -125231 380082 93261 -29038 3591 -173871 -46271
22521 -122696 -30789 78403 -373739 49793 -47391 -131444 -428504 -312470 -180257 114724
22510 201216 -83045 161056 -40091 -149927 -354937 100432 -108262 79148 344039 174250
22500 174250 97557 -12581 -359042 -32454 -122827 -70096 -40647 345339 -72598 306395 -234690
22488 -290214 144955 64978 -1389 -33752 266958 -191666 -106296 -121197 70196 106280 161263
22477 161263 17089 -64459 -228002 -24293 109319 -260152 -143897 144676 -33081 -55426
22467 -55426 18638 289151 -92487 -127155 16863 316457 24838 -26813 -58403 -73339 -215700
22456 -215700 283437 38471 92828 148217 69702 -188077 371133 -8311 -84874 -94138 -37704
22444 130073 -104783 100716 155226 -137042 -213541 -75735 -210424 -191961 272445 -220310
22433 -63991 -141483 -109475 78534 -371487 34401 -19231 -19931 -336654 -378990 -185031 -146071
22422 -146071 12172 40772 28282 109032 -211880 -233007 72993 127645 -401113 409779 -59367
22410 98467 -46806 180253 -10745 220058 106915 -160997 -151413 -19197 -89769 -32958 -444667
22399 -444667 -351295 -21079 -38061 -105632 -225819 57332 -722 -229302 -6528 121876 -206369
22387 -170087 -46385 149392 -137881 -91930 -30688 359413 -96564 122760 -262435 -137908
22377 -137908 -45397 132645 299011 -100806 -215099 -52004 -41706 196906 -92605 32958
22366 101392 -67577 -291987 197514 159730 -80973 117162 -165797 26761 -264837 -204517
22356 -204517 109863 -128118 -72089 -111555 113481 -197288 -232853 -44839 -161647 -80973
22346 -80973 -177317 169844 -25819 27678 -236496 -168727 -196878 291214 78875 109748 -204294
22334 100259 -122133 96233 -108380 -57755 81665 214520 -467972 -221820 -389077 -153438
22323 293917 -3662 -190031 123438 61257 191399 152781 129486 101015 -22080 51132 -91985
22311 47143 150560 -523026 89203 -198503 180066 17922 100218 -62891 65138 -291047 -32309
22299 -124711 -417540 132715 -209993 -191193 66935 146238 81442 -137369 -338268 202521
22288 149292 39433 -105903 -239337 -84816 79824 -258352 -137919 5851 21469 -374610 -78155
22276 2408 20530 -149324 -238230 -164231 292675 -218453 -52119 -228364 -233530 -15073 -13946
22265 -13946 -197873 -51752 89095 -46916 -56476 -89719 -5495 -188538 -292173 -181059 265039
22253 -53312 299029 246928 40271 -64368 16901 335811 150143 -12608 -94816 -21250 -384785
22242 -384785 -122447 158434 65339 19270 -252879 364958 -75119 57201 -100105 -96447 -153113
22231 -153113 54836 256829 225313 -21580 3190 19562 -2825 28358 63241 -224331 -22699
22219 -243427 243857 202508 91078 -118273 -41127 31484 -273078 -265763 192702 170189 28499
22207 206637 -82513 -277023 52110 -225381 -202751 -96061 -9 -48159 62405 -170584 -284453
22196 -284453 -346469 92702 -92930 -177614 56774 -53163 -48013 305771 334612 -65454 -22292
22184 -12757 373332 125181 119750 -17139 -92424 -481510 137533 -161161 -305081 30367 153652
22173 153652 -134786 -27057 49544 149262 -71989 -40415 -95105 -258990 75014 95704 44872
22161 -119677 -24180 11704 -469435 -93907 -41404 -52187 -40526 36413 132743 -105975 -267532
22150 -267532 178751 -196337 122769 426882 -43320 87691 63952 105530 -202634 -147919
22140 -147919 -261716 -140789 -233089 138221 -36950 -159979 118252 -280098 182299 -531
22129 131766 -153079 219602 -178062 -265452 -147801 -356851 273283 31137 -38534 -248117
22119 -248117 35771 -188895 -135169 57396 63790 -172780 -51843 -219972 198509 -98129 125655
22107 -292828 115013 26406 79572 -191365 172067 131191 114618 -146313 76353 -24983 -310091
22096 -310091 -159150 -141889 -2830 -104790 263674 -74437 -223116 -26567 -5429 -423272 -298509
22085 -298509 215089 -232 416789 -264621 216597 4652 -490570 325827 -225218 -281974 112981
22073 142606 352177 -42990 -3003 -51701 48384 -108625 -74298 -310530 -214021 220957 -20204
22061 -223562 252387 323482 -190634 46076 -163278 98692 -83859 119319 13834 96200 189396
22050 189396 -25264 -28012 -42600 -421463 26158 295139 154621 89076 348741 -97986 120062
22038 -18317 10755 -57816 -153803 -26102 -297541 -36435 -271438 -51799 -291862 -158350 -17674
22026 -159744 -194302 -10726 65289 -8490 101633 -15469 -836 -141437 -102844 282556 146148
22015 146148 -126845 -46156 -222463 -35869 209468 -84816 -108700 34274 -3184 -293304 -265265
22004 -265265 220913 43160 -225700 -118928 77268 57542 -78355 43753 -153538 -69010 -292532
21993 -292532 237703 33928 -133977 78088 -327791 167014 -126085 -152159 10895 -273087
21982 -68929 -82177 182752 -36147 29533 -343831 -214888 242167 -200444 373332 -143073
21971 -181449 69919 -176432 -52779 134144 -39453 61603 18151 -150736 -132912 25985 118015
21960 118015 -230042 -344461 102902 -554664 128073 -6469 -71882 -355847 -196096 84788
21949 -17195 -63396 -67842 -31323 154894 38486 -296783 99211 -244579 -321449 234503 -324148
21937 -148041 -39846 -36609 263329 -81428 -96255 7089 -35766 -7477 2268 -170609 -228066 -144624
21925 -144624 209487 72913 -11950 -26628 -110960 56086 330510 -92202 -3009 -229859 -86426
21913 -5202 -33490 -244865 59903 -70747 -144757 53965 33203 -137347 -62190 -41553 -78167
21902 -78167 -137058 -153476 -115034 -280801 200716 115694 154602 -139243 99452 -96174 -187794
21891 -187794 -55579 140628 39367 97616 -51972 -151911 -319418 -14584 -189940 -96977 59952
21879 -481954 119670 -74528 49231 -179640 -177919 -52723 -331294 -71121 -37161 -53339 -65127
21868 -65127 -145286 87887 -112762 -123939 -29290 91851 67061 115292 153548 -307430 -245321
21857 -245321 -89808 108009 -137187 -31106 -77353 -109890 -144005 -148886 -94899 -119558 -83167
21846 -83167 -157444 -389264 33193 -4185 -95741 213069 -390886 -67675 -207500 -38577 11099
21834 129855 249942 196040 -104375 34052 -35178 -33294 -315041 -21565 -261777 -70432 -135176
21823 -135176 160773 128987 -340635 83235 -75156 -80622 108497 121061 61955 128617 35416
21811 27183 -52023 213695 -13130 199804 -275018 -70141 45960 92214 57280 38662 -392796
21799 -100362 -436287 -256683 91015 -149237 111979 69571 100484 50390 -265661 378681
21788 -128977 22112 112999 109859 24384 -66448 -269676 273852 35855 -191001 -1189 215547
21776 -52650 200568 202533 -75464 -264101 36500 -43472 -143528 -127260 -116787 -635198 -282779
21764 -256688 -30944 -240191 -222969 92919 -188279 -145363 198409 134829 -260942 -112814
21753 -212855 -161871 74675 -261364 -11807 66053 31885 39261 -365487 -141438 305348 41292
21741 -10953 97707 280472 150471 16878 97591 -32835 -77878 114595 14539 60377 -276964
21729 -171335 -95483 -34364 -224585 98416 104406 47124 -309309 -34839 -379239 -284976 -102841
21717 -418424 227302 -150478 193789 108400 7314 -101438 -23549 84161 12627 471650 62577
21705 128209 138375 197801 -35272 -131315 -109694 -250175 -123019 -61427 -217070 -88696 -303611
21694 -303611 -19074 -87714 -207065 113286 -32144 167421 -271747 319660 -109766 166788
21683 -120502 -36841 -50644 -91049 108642 -343871 10870 65226 62254 171211 -436901 -174898
21671 -113910 -357183 -52235 -141978 303754 -185224 -178937 -8329 130800 -250695 -269739 270201
21659 -6509 -72080 -343332 5062 67543 96783 -163162 21960 342858 78212 -4148 -116045
21648 -116045 295719 -96236 251302 218801 109258 92163 -153948 -125672 247764 160035
21638 160035 140989 -320325 -326883 -398658 162056 -147955 55437 -259792 -67069 -236179 -77317
21626 15263 -18650 -40588 152569 -93726 78202 51422 53735 -73600 -15628 161775 -59172
21614 69792 -78189 -251483 156374 -173773 -52230 98222 123204 -271770 132753 142665 -25650
21602 -233039 -177202 -411025 128840 -313331 -34586 100347 -168492 -246833 87240 -269812
21591 -213150 -255394 2594 63605 12294 -240762 50222 -198588 100067 -263417 -298847 -272959
21580 -272959 -133660 145111 -204383 -202394 409411 -319995 96033 -121775 122432 -23754
21569 -4236 -42062 -162795 210009 -218980 252877 291016 135569 109076 -372737 -308683 153556
21557 -309836 -289533 -173536 116971 -182767 -202562 -26846 -9585 13529 -125389 -32604 -151147
21546 -151147 -66493 -451117 -159479 -124915 -282223 -257731 -158302 -144858 -147028 -30216 -164760
21535 -164760 -282040 321965 -256131 -30102 -83010 2809 12685 201017 -62486 -101229 86914
21523 8843 -121775 56990 -36103 -58668 -80688 -89401 -245799 -173161 -350518 87812 -265904
21511 -100648 -312837 -12285 2556 43328 368308 -172629 -86481 150629 -342103 -100729
21500 -34580 57392 -121840 -108505 138886 435703 -49535 130242 295018 -51911 -291413
21490 -291413 292993 -25039 -77856 81393 -38481 -178706 131535 89630 314638 293611 192942
21479 192942 89122 33761 -101026 44454 -261220 -124758 65796 11138 216481 -222962
21468 5321 -102100 10833 -68531 134891 -70130 872 -94153 -223527 325758 -316605 -481053
21457 -481053 -342504 -212065 249874 294297 -194640 2212 -19098 181409 -143315 -68371
21446 -288884 -133513 -74333 6630 225966 -199793 177836 66645 -12248 447414 356236 -14597
21434 427792 179433 -16642 66138 76666 11412 -4949 -52666 -53602 130017 -26388 70236 351958
21422 351958 -176918 333872 101104 44206 6124 187789 -26131 -176081 -116387 -182262 -17477
21410 -77096 -63677 -238940 -301289 113534 -56722 154090 234382 12198 140324 -116915 -337851
21399 -337851 -33967 -341295 -173496 -269003 150846 -203215 240721 -431927 133028 -5697
21388 82199 150127 -51133 -293088 -395422 245989 76777 101420 -12313 -323545 3893 15622
21377 15622 -257302 261946 9428 41392 254084 77011 -242127 -165958 -2219 159505 128393
21366 128393 -369929 87736 48824 -20732 -242051 124175 199411 28821 -43407 -115761 -28170
21354 -44867 -23365 31687 92720 -224292 -219825 -182894 -24067 -143727 -9379 -100191 182522
21342 99342 -83020 -29727 -341032 127248 -41552 -40322 -22417 -281747 2632 -246992 -288488
21331 -288488 -58142 -7821 -87025 73788 13702 -198708 -9357 59031 47276 10177 -353210
21319 -107873 -152684 -70785 43540 -34610 -664263 -45928 27380 -174010 72211 -181790 200005
21307 -203354 -155252 -42620 41733 -170055 27108 218960 -156056 -198967 5767 -16108 -207717
21296 -207717 -127278 -448504 -498289 -202400 -12817 311973 -77112 -217718 -122881 -78132 66396
21284 121288 157925 -387754 -170997 263073 -257345 209385 174654 -159455 -9995 -103401
21274 -103401 -117149 65112 -106341 -21711 9227 -175970 -133451 -90826 334221 223292 -11097
21262 21652 40921 -536501 -164769 -46182 -348993 -24618 27460 -269237 139189 -132002
21251 -100491 -188473 -113802 -238333 -156882 -165327 67198 -192282 -79722 267105 46009 14882
21239 -162955 145860 8376 158465 -126309 207729 76641 -147088 -70558 -37180 101299
21228 117252 22778 89055 391914 122095 -94740 282765 -142385 74812 -220926 2567 161439
21217 161439 -76800 -359616 439053 -345052 49624 -312078 289562 10051 53232 9489 -131523
21205 -108383 61740 86475 10271 222844 -80362 32380 119144 -128371 -129298 186771 -284642
21193 -218331 -81111 -109008 -54876 57548 -135574 138018 -160510 -51362 -25902 -100574 -256883
21182 -256883 -42111 42096 234010 -288372 -115075 -179569 355670 -3822 -523248 -268535
21172 -268535 105341 100295 -129986 -64751 -150451 -124833 240276 -205402 217306 -116043
21161 39518 69215 -44948 106984 -73831 -55040 -134894 -26211 -125488 -205499 58935 -5416 -248346
21149 -248346 -45220 -14233 117578 37293 -62707 98344 -120198 -176940 -293419 -158032 423279
21137 116411 148661 -314551 45220 121871 -136191 -103622 94115 -72151 308092 442877 380872
21126 380872 -30322 -62629 -311352 -388325 38433 -87214 -98135 170872 -388445 -183416 -1503
21114 222113 -16604 66975 34688 -208659 173761 -38300 -121923 -43699 38758 -17026 166811
21102 -93482 21478 286980 -306482 -25809 -2581 -8167 -97421 225061 -268603 -187337 -178481
21091 -178481 -220837 -259762 -208681 -58206 87745 200933 173226 -164650 265249 -61934 -166860
21080 -166860 -192364 29905 -124609 -174105 43424 -80068 212139 -90008 -250469 -282980 55358
21068 8975 -211351 -240719 8409 -36507 243252 -504220 68311 -102100 95063 -205733 -179517
21057 -179517 -117656 140591 -154998 140049 -90389 -84426 -89465 68612 -122871 217332 -311526
21045 156153 138356 47106 223702 -198809 76843 -284552 -20453 -198532 -74224 -106659 -284765
21034 -284765 -25012 329323 216059 -73729 32987 -116069 733 5138 45669 213830 71210
21022 -132711 16344 37382 -80156 -120651 253 -378048 -172852 21221 83333 120691 -237635
21010 -14240 -30412 -192277 -6933 -189278 -14241 -7001 88970 -235953 126351 296 -173248
20998 -236268 84331 144704 -171973 519042 -370 -492478 -36172 -189759 -26423 293262 -68025
20986 -37420 -93034 151997 -177228 -367237 -272456 -45391 -138349 -3693 125976 -192413 -140842
20975 -140842 150018 167079 -13919 -173109 -57280 101244 147815 238415 153270 -217190 -6892
20963 99423 74786 -187843 221446 -297816 -158291 16558 -52368 -431721 74961 -132665
20952 -47422 -354589 100636 111091 -42259 187045 360120 -18948 -40038 -234435 67858 -302571
20940 270665 -47687 351693 -14851 -51776 -50073 -381387 36095 40279 31535 57798 -153631
20928 236435 -181083 10356 -186281 -98792 306469 -73088 157071 -112928 -79404 198351
20917 -59038 -191288 -168515 -165279 -237059 -95350 -321939 -202655 -354690 -33614 271698 -22144
20905 -121626 36190 64527 -121141 -104009 -256419 -251013 11016 -585659 -155712 82455 -229635
20893 -128295 160127 -361669 -93248 -205591 260902 -224443 167234 217436 31724 -294281
20882 99604 -149478 -143454 183947 86117 -530313 15472 81464 -4226 -76000 136161 439068
20871 439068 -150993 289969 128042 -306991 -270209 -232113 -340668 -111605 -183376 -194281
20861 -194281 61883 37856 102383 -18454 -154343 -268411 105599 21792 -135221 -333110
20851 -333110 56651 -81067 92591 -72224 166363 -89796 17969 98925 -314204 -171109 -158754
20840 -158754 -86680 -64623 -96664 -324951 -28771 138025 -56940 341894 43473 12864 -260686
20828 -40036 -186498 -78175 385117 -152214 -131622 227941 -249024 -314667 33521 290077
20818 290077 -30508 -212241 -171108 233469 -13382 98002 130324 130912 311675 49169 -566150
20806 -312386 -90962 -99916 -106612 34598 -152704 217598 86860 10473 59432 -134835 -84782
20795 -84782 -128886 15084 -26500 63456 136082 220900 -6903 -389744 49566 -339429 -138630
20783 94417 145310 2138 -295405 -41823 -60827 -58259 -23786 -93931 156885 -38435 -209061
20772 -209061 -30197 116546 -221235 -267020 -61126 -296427 197730 191093 -206782 -31903 -79373
20761 -79373 -15505 -81315 206700 -52012 -136719 -40851 -147293 46550 70245 29118 304280
20750 304280 175638 -231138 59920 184909 179546 -240168 68656 -46698 -154775 -292368
20740 -292368 -34952 -42993 -91087 99517 -201271 -28008 45254 22358 243262 -109613 -208450
20729 -208450 -110440 90835 50254 -235058 -274010 387327 -208281 24294 59604 -67931 -178942
20718 -178942 112881 34688 -104761 175482 161920 -179878 -71919 -12365 -11746 -147866 -6212
20706 219995 24782 -398103 -10481 168150 51052 290839 17040 -194209 -17495 -41877 -59378
20695 -59378 31669 32087 65479 -448278 120513 -127654 -186161 -134606 -328713 -341273 10243
20683 -90460 -83664 -4080 2598 -297943 -383174 57341 37742 -148526 130651 -93167 -250832
20672 -250832 -45192 -266948 37210 -128866 34074 96590 -150536 213963 -173213 -476967
20662 -476967 -17853 47378 -199930 230600 47762 -226453 -151526 -168457 -129716 33375 -95597
20650 -178273 -476101 -462259 -51688 -209436 -247721 -306175 -41470 -114088 -240540 179600 -158511
20638 2729 -51960 -73643 -189551 137443 202735 -166391 -33212 -47626 -432735 -109180 -315918
20627 -315918 -24031 491 -422682 -311630 140460 65566 40555 -194802 -196485 -12488 334040
20615 -5839 -216122 34683 -15930 -268831 -142469 54347 -196319 -20545 -255448 -434259 91143
20603 -161571 -16547 38236 15336 -162544 60965 -6976 119195 -14008 223434 -61227 5805
20591 403244 -296599 181062 18435 145727 141165 -51612 222250 -128520 42335 57088 98360
20580 98360 -55745 -51573 -76892 121029 290684 212278 -102385 -134977 1472 -121712 41774
20568 -98202 -49695 34205 -408037 -45913 -297394 75051 462800 -170723 36523 18002 -131270
20556 -85234 153933 -264100 -123626 295590 78028 38316 -179899 -131211 -48620 -150720
20546 -150720 46036 -8895 -170592 -43837 190081 -10543 -164032 285037 -121408 -205295 125373
20534 -101937 181501 -166977 -214349 -321664 -104585 -101964 224441 -283153 -188035 -53276
20523 -65358 140036 113580 108557 64131 205202 44448 73945 -198272 -164673 -52430 -253720
20512 -253720 1682 -35953 86423 -215808 5310 -98422 -130537 -187516 -184674 257981 139247
20501 139247 -68394 -150547 106743 -185090 -105036 16392 -240333 99016 -32159 245025 82207
20489 -163156 136596 -149012 -226354 -7164 -20486 260131 -267449 -168037 -151381 -344031 -69478
20477 -252878 151709 -188664 -10062 -256437 -312996 -204448 269496 -444951 -124903 -3587
20466 -226623 102946 70740 -256502 -76366 35633 215227 -204507 -14983 10844 -129067
20455 -213376 -215299 222879 -115634 -282455 -71130 80689 -73079 -17015 -28014 -280499 -37862
20443 -302039 150864 203751 196704 -62449 -271403 252216 300844 -9541 107213 53174 83812
20432 83812 81938 -4850 184611 -279795 -118305 -195208 116254 -289651 -143967 -259448 -165062
20421 -165062 190969 -370470 -72072 -279697 -202384 -282474 125242 183609 87227 -295807
20410 -349580 -151198 -7466 -269101 -123148 124766 49742 51457 -67344 146175 54299 -179294
20398 -236617 -220534 99661 271455 -248478 -146021 -98639 -337819 -386099 -75557 44796 -29837
20386 226472 -68548 17917 163985 7644 -50124 -119639 46129 87234 3709 57353 20726 -178256
20373 135157 -134113 14343 -97004 26480 -106255 -127655 122225 -260161 -193050 215930
20362 253527 -81844 -18794 -369418 -92954 -84862 114591 -358365 -157253 -357899 -171361
20351 17419 -185626 -291193 -94827 157293 -166706 -43614 952 15332 173570 -192505 97197
20339 -33793 9183 -121777 -79574 -43356 22420 73617 -224251 180070 -44827 -148988 45941
20327 -99269 -260314 -105115 132781 146413 8881 195714 -3358 -449219 106973 -239572 -163156
20316 -163156 135620 -457884 -115309 -215270 277675 191709 242053 -73324 -47711 -70012 -401900
20305 -401900 -26323 102313 -103976 -375910 30236 -250119 -295667 -25946 -78982 13456 -179249
20293 -459049 -180914 28702 -91512 -12597 -69968 -37794 95305 -71431 -36109 130124 -134116
20281 70122 -373841 -419654 50114 -329449 -311867 -91104 -58104 -196278 -13764 -263276 -159466
20270 -159466 91919 -393143 165513 -224479 104818 11040 -282615 -162454 37061 285135
20260 285135 -55730 54645 13506 140681 20416 -142807 -318879 175128 182858 -204098 7560
20248 -418447 191072 -106808 271764 187305 6184 123443 -32873 518073 268763 213903
20238 213903 -29594 296984 -102259 -123657 -297738 118756 -207303 -28144 126644 12276
20227 -86999 24075 106497 157646 -47516 -117001 -231513 -3728 -145724 64243 174789 157254
20216 157254 -64477 -92087 -426415 -195671 80092 172965 -279680 35441 237172 -227828
20205 107606 5127 77676 -667963 -84325 23036 -144355 93842 -135149 -100045 72047 -8517
20193 -33872 23824 -147411 52330 -290246 10370 -162482 38269 -183048 214905 5995 -33963
20181 -31572 -205153 -132030 -342722 6170 -23883 110407 69099 268207 -467927 -16327 185858
20169 180586 -295481 -78779 -6057 -419605 5415 -239871 114850 207419 -98325 77798 -345955
20157 -27272 -130671 219301 -179130 -345635 70366 -232853 231917 -124385 -112433 -299708
20147 -299708 -207684 126276 6990 -103191 -183403 438 -142453 101580 -252172 26840 -20566
20135 34030 -49171 56142 -104252 -216706 129208 -65750 12134 171639 98886 -19434 -145151
20124 -145151 -281722 44649 -34092 289741 -59648 -88442 33853 -194725 -36477 -101556 351361
20112 -132953 76225 -120176 -23159 -57154 -389663 -108284 -72937 -29739 -64008 -31181 -102688
20101 -102688 -184734 94539 -145785 38630 -155289 250039 65332 17166 -123761 -63224 -23183
20089 -256312 -75858 -48137 -433837 -276307 75109 -259916 261094 -249872 130470 72898
20079 72898 -72381 -131231 -41248 241548 -140030 -183112 -125927 -123003 -24321 -105119 4818 141844
20067 141844 14433 208590 -125751 -9085 -257755 -60321 50197 8581 -200902 -181562 113288
20055 -438481 169666 -102801 -120666 -127543 76007 -46713 38031 166428 -143169 -156529 -105479
20044 -105479 -195542 10050 145947 255464 25818 -38055 -235836 -195109 113868 -429811
20033 -133804 -112881 -102013 142247 166991 125070 -284486 -216156 130403 80410 -56274 95124
20021 -192263 -150386 185858 -129996 -23041 132770 -98877 -102427 -71682 -33902 -113348 -201032
20010 -201032 -10374 -4519 -70618 -93440 -142661 -299964 -7137 -95083 -145954 -86336 -247312
19999 -247312 -40421 64724 147055 -46761 -170776 57502 23788 100237 -160917 161722 -13530
19987 326392 307193 -7239 -269891 182659 -151594 -256646 13027 107651 -91114 152790 98739
19976 98739 26428 14632 -92314 209268 -55873 35364 -216700 -219114 -47858 108541 146219
19965 146219 170012 134578 -54574 -60818 -61484 58216 -134162 -175670 225632 -7456 -242599 112636
19952 -413384 -16237 -94021 155744 -203180 -451577 -60890 -261999 -78806 147157 127015
19942 127015 -280248 12443 -132448 160849 112581 135348 -111471 324599 46225 52590 -21874
19930 106404 329475 -10600 -85124 -161065 380857 -5048 -356399 -354383 -338107 30107 -123872
19918 -195171 -152948 62679 -214968 -93346 304884 -125103 144715 4276 -340429 39409 116892
19907 116892 -109706 -205707 -30684 9223 87481 -430186 30946 159491 158667 46732 148303
19896 148303 -322305 -192231 -127911 -56302 -34449 -60977 79370 165826 -66643 -92522 -125423
19885 -125423 -384701 -21782 -19363 -255954 -34810 5144 156993 27268 -251113 137373 -181011
19873 -507009 11948 -87135 -158745 -57940 -4652 -239825 155897 -20168 -32352 -73291 161360
19861 -201020 -48110 -71442 -233281 132525 -41015 -449529 -190068 -137508 301522 -33712
19850 157255 -143065 65795 14644 -126569 -142992 152584 -12876 -199398 -239943 -143187 -82821
19839 -82821 -30908 -122661 -403370 43385 -68909 -288980 -66842 204936 -48864 45443 -21411
19827 208322 -50182 93649 -105114 -185841 -43274 -95529 85671 -496 159348 -388270 46311
19815 -25316 12360 -43854 150763 -27787 -143674 -279442 580916 71353 -452486 -53325 -167108
19804 -167108 -355890 53953 -264227 185686 39545 -45063 -202205 247293 -11701 -65080
19794 -65080 266550 -266498 278907 -26924 -10119 -284664 -197889 -37396 90822 123973 -166530
19782 118071 -20312 37530 -340556 187631 -95810 93976 153605 -235097 -584582 -19659 -23373
19771 -23373 -165037 -335322 -116620 -142613 -2070 -53019 90363 -157940 41035 -19525 -152134
19760 -152134 -125792 2469 -68930 -203977 245407 95449 118442 163067 111459 166656 117951
19749 117951 -398577 -338605 -188991 -60209 -349792 -214299 -158297 -263016 -29922 -174266
19739 -174266 62489 -450782 -162668 65046 125019 41128 102079 -115043 140404 -8088 282616
19727 54500 -259942 148560 130548 -12905 -5736 274955 159020 -162715 -193203 165686 -89000
19715 -145636 -14777 187890 -149664 152410 -340872 148273 -90057 -56465 231291 -131809
19704 -49271 39809 193031 -200053 -87251 113148 -78331 -221255 -108200 -207685 1512 185677
19693 185677 -128930 138012 -195466 -107756 258297 -272605 18473 124266 139792 -100790
19682 -317662 223366 -55857 -2988 -144223 -111417 -53514 -516359 -266198 101974 21229 -327375
19670 -17091 -148032 -176990 -245747 82997 -224490 -157936 31282 -292815 -82422 -33637 118448
19658 167452 127154 68175 159898 -94941 -178247 186913 -284760 -247713 93260 -210030 -8079
19646 141771 94657 -256021 -183103 78511 -496855 -129148 -133098 -162186 27461 -15261 -93550
19635 -93550 -134306 -71411 -90158 -23127 -265753 144085 -23326 -135756 -320182 -29225 -88449
19624 -88449 62497 -82861 -14540 262493 108643 -252120 -140654 175518 -504141 133554
19613 185186 248632 -56176 -189012 -263264 5799 -25129 -67258 71929 -441527 58239 136477
19602 136477 -159156 270751 -148798 -313193 11723 194645 156488 274010 39410 -71590
19591 -232829 145732 264251 -139651 -218884 148667 116907 -424968 120383 324480 233125
19581 233125 -274794 -225673 -148053 162359 -155150 289920 -360916 -70212 -384063 -275515
19571 -275515 -220835 -98276 -107259 83031 210930 -227920 276134 -430180 -204171 323515
19560 -41476 -206156 -304822 -295437 -156087 -25846 -65935 184018 206146 103037 -117538 -54954
19548 -202678 24419 62839 -178192 -429769 -303896 -114116 119924 -120615 -108615 -92269
19538 -92269 -197596 -276502 98659 -199279 67037 -8981 77977 1512 -239508 -283020 -52370
19526 -33672 -76024 108728 -35667 -90847 -159336 116912 -340016 240602 75627 -300924 15654
19514 -347753 -24970 -228714 -149616 260911 272333 301879 -64874 -69500 1691 35261 129476
19503 129476 -99673 -11645 77186 41167 -226665 -214761 -302062 44623 42917 -74656 149808
19491 208398 97223 -371382 -98534 -138972 -408591 -345294 -82847 89489 92850 -33973 282074
19479 311930 -24122 73312 -26356 237701 -35376 124979 -201853 -8558 52349 -257601 -64231
19467 -151318 -159000 -100367 -303228 198731 -204835 21541 -46159 -271611 40718 -330308 -182433
19456 -182433 -250132 -354770 184151 28398 -212939 -209636 -34259 15847 155536 -68644 11689
19444 218524 -142977 210816 112046 -187238 13341 -125381 187613 -125914 125136 -153369
19433 -38471 -146474 -90950 -149485 -297979 -282310 -10077 44940 -219829 -68864 51858 -340106
19421 47669 357119 -67849 -133490 -57770 -266697 -62114 -493 -216582 200054 352084 44592
19409 -156216 54646 -55896 -43927 90137 -205990 -78681 84413 -226552 -115173 -58418 -476402
19398 -476402 -144639 -45061 -79727 49313 -12343 -113005 -111215 -45316 -234891 -461412 -58127
19386 -76204 -271287 48825 -106541 -56323 165489 308356 126999 -250555 103421 -224598
19375 -203812 -144970 -32100 -130880 87933 -82130 -120209 -331784 -33610 -217746 133188 90699
19364 90699 65742 -56240 -16055 -273289 -54091 91180 -141001 20430 -281604 53724 -181711
19352 254434 -94546 -29838 -174775 -194955 -158280 -47271 -256271 150104 -45276 -96125 -88310
19341 -88310 98390 167795 -219818 -184892 272650 81686 -109407 23808 128936 -144927 -137994
19330 -137994 -22438 105978 -136354 70035 -431538 -548626 55988 381956 -10255 -195281
19320 -195281 69505 -294708 -454618 -171081 -157142 -385961 77068 63387 -46517 -65375 127681
19308 34236 -266853 -258202 -181334 219206 -156889 -151984 -18542 -25755 -15117 123320 126623 -119262
19295 -90524 224752 -291746 -45714 -158372 -147715 -38110 -55725 10854 -24 43762 -326044
19283 111649 -60557 -243083 -35238 86405 97227 -544924 -278127 -87174 -461257 -10185 128891
19271 -280339 103191 21948 104240 54921 390189 -206607 -73025 -90244 82083 193737 -90900
19259 -48840 -40004 -22575 -53805 144510 200996 220870 -201106 -140865 27811 -204416 -172850
19248 -172850 -133474 -66744 -40822 65120 -297281 -141587 27269 4100 -17718 -143652 -90113
19237 -90113 -91558 82797 75860 64522 168954 21902 225823 -198542 37681 -32531 -302662
19226 -302662 -279602 66428 -466581 -9787 -73122 37003 16120 -97214 -205160 166659 121786
19215 121786 -83775 281128 55810 -4696 159785 -121332 36681 14867 -226720 -189667 -226208
19204 -226208 136420 11400 18466 -51925 188465 -105099 -193689 -49472 -143725 101429 -135685
19192 -145591 -61387 -62802 -285294 -111555 -20422 -5770 -153925 138966 -155423 -127803 -55171
19180 -535173 -210918 -387043 -255019 1551 -235399 -354813 35184 -40831 -79614 -214006
19170 -214006 82590 191714 48846 -198306 -71601 -423637 233279 62579 175166 12093
19159 125519 -247082 256204 -211619 665 243804 -24021 63934 -227614 -303419 181333 -319504
19147 94362 -62327 30333 -255344 -5256 -24675 56665 -84784 -109086 -185326 -228839 -182397 -215274
19135 -215274 -112428 29973 -266824 76211 106607 -214966 76129 218368 114725 1118 -172846
19123 -88209 -55539 46245 20804 -61186 93001 -141655 -174893 -129233 -107319 21992 91803
19112 91803 -51055 28629 -105616 -6435 3326 24491 122109 6737 -207348 -83286 -161982 62914
19099 -170054 -175980 -72533 91016 -175148 -135710 113920 -109865 279660 -262556 -227076 -200626
19088 -200626 -247108 109798 108825 -14169 14477 -375505 -88727 -26558 -143021 117843 10274
19076 25618 -165238 5463 41180 47026 -66313 165493 -199881 -185617 -21761 -199502 77967
19064 -34933 394937 -153400 -170037 51540 -249532 19846 81786 -58019 -17315 -36216 -171235
19053 -171235 138168 -48071 -140372 -103243 56133 201714 -243977 -31638 -85328 78163 118950
19042 118950 -329697 -206974 -213251 21003 -109731 220746 -132124 -28784 -309995 -153853
19031 130886 119485 202639 28964 -54175 178163 416817 224185 167503 106956 -186111 -137497
19020 -137497 38684 -181608 95215 42488 -42498 241096 -16739 -163756 258698 -106341
19009 -77661 135606 -158408 -23919 -54150 118216 -158621 191050 -100004 -170367 -320198
18999 -320198 127961 -161141 28103 85423 -214460 -37473 42867 -36638 -253954 133686
18988 -175281 67057 -161278 271762 -93117 72368 -288654 113901 -30128 51998 146559 -21704
18976 -250296 -76695 -80860 -102153 64924 -24253 -255884 -235024 -207593 -188122 -61707 -36727
18965 -36727 -117774 146671 -144652 -21368 -3914 84112 183589 -168364 -229721 99959 -98003
18953 -272643 -41173 74 -109672 159151 -145025 -173896 177761 -52054 -39114 203132 -277057
18941 164556 50817 1098 29730 -215542 280225 -88126 227298 -18931 612 -130358 328250
18929 118195 -125011 -59206 -140741 260797 55312 -32682 196887 -52782 75649 -143263 -368864
18918 -368864 104937 -175358 2646 -35582 12673 -171046 -70675 -91177 -47525 172836 -64655
18906 80777 175666 -285238 61760 -63305 -277114 202612 259275 -84704 -29286 48997 62687
18895 62687 -92341 -171340 -290723 124392 129326 169684 -104295 45388 10549 121162 2995
18883 -145353 -285582 -99228 -253656 -115081 -121445 -184301 58071 58668 266222 -368889 143520
18871 7906 58233 -107698 17938 -379477 -67140 -117431 -333432 -39413 -394344 -62481 81900
18859 -290777 -277518 -241834 70891 -421474 -258393 -94236 -7020 -103299 -89251 -90984 175000
18847 -6171 2847 114542 146549 147604 970 -98529 -57707 -28855 -255791 -103088 -57711 164455
18834 396392 51178 510911 -152648 135333 -19776 -134206 137259 -134128 -392943 219431
18823 185485 -275951 -360402 71375 -402112 -219365 -104150 -229414 224814 -92532 -81017
18813 -81017 -229319 93653 20335 -104476 244426 -76767 -159006 138226 -5915 74662 169346
18802 169346 10378 25466 147673 -80802 -70887 -64363 30678 -165707 -137673 -19284 81708
18790 -62724 40577 -129575 33475 -420167 83808 222138 191383 -410459 -212913 -79736 58380
18778 341575 -44703 171800 -94375 128573 -329930 -141178 57491 70860 36931 -237108
18767 -62991 -138364 105795 -26222 166501 324317 -159219 113150 -158635 79795 304588
18757 304588 -48122 -3420 -160709 18864 77803 -279130 -209926 -217292 64658 -347958 -38835
18745 -105599 179826 165285 -82413 -259691 -313762 -34224 -8470 264874 186309 -404689 -146727
18733 -240466 85247 33461 -505505 -45395 54858 -97775 -47442 -263511 -61893 -120494 166492
18721 129512 -78721 -160962 -402338 -192529 -204372 -168203 166548 -228770 -129816 -242979
18711 -242979 -221172 -157058 -285815 -477461 65091 -27678 -58208 162801 13898 -153452 -97350
18700 -97350 47461 -365782 70334 -173183 -175628 -189395 -198062 92915 -93898 -194039 -29977
18688 -135884 -206304 -182384 -65078 48775 -403229 210203 -194171 -271863 -130635 29514 -568387
18676 81569 -525174 -195782 -88845 22836 -145430 -271904 -174949 167510 -356462 13122
18665 -16627 -414290 161998 32352 76516 -23726 -37551 81852 -102091 205522 -70952 169461
18653 70041 116090 -268950 -262506 10651 -296519 86412 -5387 -103484 -11678 -6751 -62460 310068
18640 -50820 -50867 171650 -33191 -38576 -155377 -128279 -161777 56481 -244627 173270 -108327
18628 55604 -266722 52285 -166688 130607 46652 -162337 75046 -83222 -555 -421066 144543
18616 244389 -163062 75112 -333312 159137 -12862 290911 -354672 -99781 91157 32676
18605 273143 -163118 191973 -212669 -12149 -30541 -75754 -70730 -113962 -288705 -125005 -495465
18594 -495465 114448 -52294 64199 -58763 -140261 19408 151364 48966 41743 -34722 -201898
18583 -201898 107359 229723 -88980 -222860 -142986 -29439 -243992 -138188 205140 -30798
18572 -12190 -176476 -153627 1377 -42535 113076 -9450 -107512 -9110 -380430 -221725 46600
18560 -47944 -166176 220038 -157230 102034 -112743 130901 361752 -81117 -322192 -110502
18549 -131373 26572 -408567 -97491 14159 -184404 -49970 -139320 83139 -255110 -285687 82841
18537 65224 111423 184960 200203 115555 -246967 -426359 -220786 -223378 329395 -136127 -208126
18526 -208126 -317081 -85862 24904 -126573 18506 -174935 33799 30428 6298 -174128 -114651
18515 -114651 22632 -170149 13830 -370860 123566 20243 104995 -142042 173208 -211091
18504 -43492 -162006 121122 -72351 -15890 344118 205589 -343947 58000 -157849 -221752
18494 -221752 397365 -327279 -227324 115100 -177193 -239923 -26376 -231442 -107875 -76962
18484 -76962 -140393 73442 46698 21325 239177 -99156 -421962 -307501 -159737 73495 254587
18473 254587 43113 29074 149519 -279171 55069 -7792 257027 140924 -134036 -98819 -85531
18462 -85531 156544 -75708 31784 -319786 -11591 -49017 281889 -22834 -127763 146372 -223764
18450 -344257 46957 -114182 106443 -126354 94538 -56608 -271606 -51967 84501 69735 -12638
18438 -118928 418880 46547 -278625 -56579 230108 184362 250688 -320378 -239166 154369
18427 39766 -354120 -267027 -124986 -20796 -232423 12969 -20001 176259 69648 -79351 63666
18415 -468971 -233283 -30521 -207371 140707 7836 -44510 -173622 284069 257324 388299
18405 388299 1618 85209 -114578 46050 -167444 126303 213870 -337437 -338847 -151045 4318
18393 -453584 -40791 -176078 -279815 -184114 -83873 -40299 77994 156119 230839 -81169 33571
18381 -199352 -45348 73605 -113849 -233052 165440 65753 122289 140666 -196012 55283 -12628
18369 -138699 -240429 -101035 -177337 42434 227258 -222638 -2043 211752 201570 -44419 140382
18357 52867 166601 -456840 -196271 10601 118957 -85714 152781 -94041 205407 -67378
18346 -255883 -26321 60755 -210636 -10701 137962 -29486 238667 -17643 -117212 -200753 -175119
18335 -175119 -377801 -180627 9283 81893 6333 -62917 -100367 13901 -43273 -166717 -612 -149845
18323 -149845 338004 -187162 -225181 -223486 -223490 141183 -202282 43979 90581 45504 133905 -139286
18310 128601 146859 -91469 129582 -47675 111879 -114532 -38101 -39032 63452 334669 140274
18298 20233 -48355 167107 86619 104324 -245560 161 119234 -229877 -24904 12865 -346807
18286 -76935 -82438 48820 -74131 -90853 211859 3203 -105620 -225661 -93629 197283 -58866
18274 -249158 4388 -62887 -128480 -68393 8538 64627 229757 139664 -227849 18016 177447
18263 177447 -35344 89297 162159 -3448 -59089 182971 -439 41866 -349869 -55155 -246246
18252 -246246 -41904 -73568 -242308 23450 107035 67239 237885 257170 -307360 77247 -65300
18240 45728 -174263 -171606 -385922 -169944 4760 -45422 -47948 -37734 -192157 -136228 -351307
18229 -351307 45849 -269141 172702 -40222 -137664 -42254 -360133 -83797 198248 -21414 -6322
18217 136241 -48096 63070 -397103 -389093 -295147 -7133 -70941 110409 205427 118284 -76305
18205 23922 -77353 48884 166465 -114262 -61907 73259 -34624 -56181 95693 -172460 -399
18193 -176956 -388566 168344 -235507 182202 -103143 30894 -101378 96793 -88082 46355
18182 24134 -95652 -297949 -206502 -155323 -47837 -2560 -100505 -127723 -106165 -110942 -409915 -48408
18169 -70318 -3529 -60847 -105442 -156394 -46423 -299633 -202878 68525 145794 -130612 -71747
18158 -71747 -167353 120641 18977 -13354 -3173 -52594 -143259 -108188 -11156 63799 88809 -268560
18145 156489 46754 -26951 -36479 112377 -264202 43256 -103495 -298032 -220913 11997 -131844
18133 184006 -443333 -62050 11468 -125368 -13547 178444 -465846 -272276 81302 -62270
18122 -174793 -369321 -78599 -227660 -62890 21389 108181 1075 152685 -50233 -74778 2883
18110 56320 -172477 130892 -101651 -7289 -166102 -198332 33201 29419 -64431 36983 -5593
18098 108308 -119689 87308 -69791 113995 73516 206474 98667 -97386 45310 -259989 -127303
18086 110290 9993 191917 217911 242737 -159512 466858 -161760 -147815 -54685 -105181 101744
18074 -108553 -92103 88681 -276634 -28979 52259 46542 362455 138213 -144737 251623 -373688
18062 -7768 -86742 -145387 -163376 157342 7010 105381 84388 -155631 -55546 -77792 -22587 -183817
18050 -183817 80312 126950 20543 -119588 180765 114057 66014 197765 -35851 25386 -39993
18038 36814 127728 -459780 69320 14160 -151700 -93667 239834 -123854 -85187 11366 8660
18027 8660 99287 -88185 -10316 -286270 -311785 76842 -413435 114346 -164191 -195021 243236
18015 301904 -26178 197358 91533 -119771 -112669 -79439 -132189 25317 -117231 286097 -236485
18003 -161605 145615 31057 -271186 22847 -83897 64 231662 -220731 146033 -80073 248054
17991 -79683 49217 -8837 -142788 113377 136049 78456 46349 -508786 165334 -561649 -61005
17979 -213284 116507 162278 5904 -44876 211227 11312 -409115 -56514 -67701 -43696 -137511
17968 -137511 7064 159483 175332 -68715 -45630 201674 -148727 278968 -170548 61924 -415133
17956 -60037 348829 -333114 63120 52776 -35097 87123 -6965 221970 -309233 -168856 41298
17944 177698 62334 65794 104606 -146936 188682 39185 117436 -26570 125733 37893 182471
17933 182471 199576 57264 -186729 -125806 -241889 337401 -102389 13474 79595 -152989
17922 -58948 -57969 106219 -282256 -208536 148442 -78228 -119306 -38554 -188147 -44220 -194420
17911 -194420 -128673 -201559 -170360 -221466 -1420 93619 -30338 -54106 159635 -198372 -84400
17899 -12216 24717 -1068 -34769 -179712 342844 184925 -206308 71899 -10764 92595 -7094
17887 207885 8963 -51342 17707 -111273 16697 -210966 -233217 35792 177228 174770 264326
17876 264326 -124828 -53111 -246911 -38444 -190674 -97348 -15449 -1603 84354 17595 -101797
17864 -162237 41658 31748 244321 97886 -219822 -189034 -117957 21778 -36524 -275378 -54179
17852 -68616 -261200 337030 -114292 193054 -229241 -38858 586303 22711 -81249 -400054
17842 -400054 -221838 312254 72879 -202609 -140314 -100535 -142036 -136803 -59722 -23793 44260
17830 353721 -178082 149628 123650 -140448 125405 -55990 -23898 -192307 -258227 -26897
17819 129054 -31553 -12748 2361 -14871 -186691 -8307 42325 -24830 -108549 -216766 30417
17807 -5493 -36831 101429 -253090 269991 -116566 -56852 109652 -169371 -16518 -103404 -19453
17795 -142108 98215 -324369 16054 -164277 285130 130182 21329 -134688 -189313 59731
17784 63187 58421 -97625 124988 -71743 -114353 -511291 176348 -215582 105649 253490 159095
17773 159095 -66156 -232360 -539101 -124671 22530 -10179 -168969 -236099 120360 102498
17763 102498 -303610 -514240 -246855 79861 -92078 -103794 -37323 186745 -159873 2767 10908
17752 10908 1478 13084 -297403 -377983 168600 315721 -259295 199937 27708 139878 114243
17741 114243 29238 41741 -57380 -222283 -118638 146132 -233120 159067 -98854 71729
17730 98589 -86828 101145 72384 -96410 4392 292125 -151631 51970 145964 -15122 194707
17718 298089 160193 -196685 195507 125334 60940 64472 418951 -143864 6690 -165071 208149
17706 -36225 227351 16270 139840 -80937 142867 -38649 160178 91969 -358949 256465
17695 167902 96938 -58687 348792 153937 -134961 -4084 329337 129472 -171996 139571
17684 -143085 458981 -50452 -193363 -14363 43340 -35317 200566 105546 137684 -422811 -31751
17672 -162410 -190934 -50721 -259993 2447 38651 128634 25924 -66461 155923 465326 -153992
17660 -503842 75714 441729 375340 38550 50930 -144723 183762 -414684 241154 159888
17650 159888 -78546 109492 106439 -8029 105395 14472 240924 100372 10993 -245696 -151440
17639 -151440 193600 125234 430564 -410155 -221788 -82361 71875 -59591 97666 409279
17629 409279 69502 -23949 -337397 -353682 -106321 176022 -144581 -153947 157479 -157587
17618 -17284 224124 -13993 -502439 72916 238141 -342507 138744 161292 -105356 16322
17607 80442 23732 217928 55796 -54225 -324300 -73255 -53073 -404952 198364 263559 135404
17596 135404 69549 42449 130104 103091 74112 101183 -6831 269756 141739 91696 112095
17585 112095 -348933 -46038 -49616 -175249 265699 126755 -41862 -86477 228615 62457 28208
17573 259655 144149 -161903 66364 -79861 -295724 334825 100373 74134 -142475 105096
17562 83584 297318 405637 25452 -150586 -181420 190541 125210 38607 -128661 211342
17551 231520 162897 70055 58533 -66559 -137195 156648 -7720 196090 15275 -120717 46998
17539 -171515 99624 174874 124786 3073 -82611 -83951 51074 -101672 -140917 36368 -243498
17527 129624 -359021 -233864 292090 185532 449046 226190 120582 138176 -45257 213190
17516 287698 -7863 127364 -116681 -103099 146995 -69599 -141354 -115943 -206142 -65844 23397
17504 4053 138810 743 121209 126679 -148062 -79782 137073 -77222 247229 -104073 40800
17492 357937 293739 189184 -77902 -55378 354166 277930 100460 239123 -226860 146563
17481 96922 -79769 -200826 88931 424535 213624 127814 328049 285095 329976 -39485 270000
17469 103246 40385 73433 118232 -91049 306606 80861 -202243 250201 -157025 -129729 275493
17457 64936 -6341 188535 -20781 148668 311702 187 345072 258743 581836 490057 334466
17446 334466 151438 152127 -68055 221803 246211 -27064 -65858 200755 584639 202335 86597
17434 90783 269990 301624 291965 152669 -234565 301018 391512 340688 331882 428347 347201
17423 347201 25057 189907 165775 324817 384747 477517 134249 46495 679538 515987
17413 515987 81263 275336 257629 280260 -105554 156068 -6698 370892 214357 265091 -284047
17401 95352 -50731 235722 -55727 250968 75335 7219 166700 -112482 35344 126587 210581
17390 210581 49013 251502 -110292 257830 60134 17971 64733 -1658 -178459 -28750 181185
17378 -100365 163343 448680 310147 283955 10340 267042 529168 221743 -30354 183757
17367 233645 76108 52370 -94034 16867 -34458 -342015 179959 255988 202607 15375 -22226
17355 -101849 347432 367178 30252 -246968 -16298 200789 191040 53493 -150805 182397 -38669
17343 221853 336201 103580 109791 2001 393187 80850 -160734 -266495 81064 95097 68146
17332 68146 -41793 148321 22216 4299 105843 342826 -45849 380224 106620 -27600 331516
17320 116508 -7714 -259103 63002 265671 288411 -6342 162300 241877 278674 296403 162450
17309 162450 130926 222937 -81368 326341 282806 121816 -16182 356244 4752 143632 226583
17298 226583 207884 332620 -39914 -58423 372176 -98622 215667 -18717 243763 -4812 282942
17286 295121 90666 145734 418827 401556 105977 374167 -37453 160269 167385 148398 42423
17274 -188134 277027 248107 283255 306726 14503 282235 31674 168863 52732 222311 329240
17263 329240 183690 72355 233728 300605 39671 347484 -141889 -80279 -53951 -12497 -24274
17252 -24274 107419 507394 194800 302968 141370 372789 220167 580903 76135 337511
17242 337511 19672 439457 388431 438901 313461 232392 25880 165732 349893 213020
17232 213020 230449 353066 177964 162135 261773 322807 355655 404433 291334 299648 -33742
17220 332444 281838 239196 14447 -47289 7876 175793 -26464 291451 762242 -100672 152757
17208 272057 5555 221229 369752 262990 155432 120600 304390 400258 133410 148787
17198 148787 410030 412628 71309 194809 174474 27306 25094 198892 528504 409028 235313
17187 235313 176548 196859 36857 150068 141725 289823 354890 391192 385784 227298 609994
17176 609994 422696 310940 413830 86457 -87903 278133 126570 458606 231163 689602
17166 689602 124375 243569 268076 749090 231798 187225 491999 186099 458485 11678
17155 532269 337287 68928 371304 263161 490222 -61683 282519 186403 524163 393947
17145 393947 -16558 231126 346673 388918 240231 391893 474840 139081 156451 313271
17135 313271 305885 167451 99872 302471 134986 605757 377227 568315 291692 396840
17125 396840 152898 220452 469584 387122 19312 183133 432157 264263 403403 28939
17114 465990 -77761 -198490 183955 404934 200310 421118 -225996 557305 362753 257953
17104 257953 410857 228571 28170 178218 634976 208455 369788 491349 375205 290566
17094 290566 559368 258897 520363 599917 294702 -63973 553952 510731 636550 425082
17084 425082 460816 224761 335350 494017 331698 515174 391452 528186 524718 493636
17074 493636 526808 499305 410058 372022 442323 622365 756886 660370 438085 628135 389561
17063 389561 268465 483920 305610 640422 423169 592426 354542 246841 594958 527865
17053 527865 516847 262589 407865 442437 847312 113546 569170 259998 473808 427160
17043 427160 410714 593541 480651 234099 361412 650892 719567 575803 535238 402692
17033 402692 544575 577402 265442 702345 670522 567172 651128 728834 648035 752298
17023 752298 746704 645388 551121 513442 739624 511961 402482 632554 696995 570378
17013 570378 865854 290203 701959 414260 820196 481293 557284 735884 676283 542917
17003 542917 806889 601315 449586 1208504 483347 567786 570400 815992 483404 667593
16993 667593 1114680 498219 724673 554362 958637 563127 913876 747598 767359 932535
16983 932535 804718 728449 1162381 892113 1225262 683556 891306 674544 625835 995082
16973 995082 1287444 604692 582127 815021 929703 711511 943123 866169 703843 891788
16963 891788 655842 916138 657398 968348 1091804 907155 1127235 1203779 915023 1018335
16953 1018335 783381 846887 1200608 1141780 907295 1009790 1239238 1031227 1258447 979891
16943 979891 901746 1183486 1193303 728679 1119046 1311011 1152301 1191999 1286692 1194740 1078729
16932 1078729 1115672 1277824 1404303 991503 995491 1072923 1397685 1043001 1041096 1289052
16922 1289052 1295613 1586548 1269895 1468124 1385228 1521928 1330402 1749671 1388036 1730732
16912 1730732 1496390 1365927 1506712 1548246 1439863 1561392 1488690 1768302 1804276 1784173
16902 1784173 1625581 1576209 1759956 1871253 1557793 1551975 1592544 1448667 1807294 1537128
16892 1537128 1693748 1730120 1958276 1866678 1652193 1664693 1959754 1782376 2069945 2155989
16882 2155989 2256067 2076765 2053914 2204761 2159489 1931621 1983655 2095362 2327496 2191305
16872 2191305 1828786 2148390 2104900 2214439 2085326 2478864 2482504 2452917 2471360 2452117
16862 2452117 2684102 2700695 2507083 2554136 2790194 2843421 2833948 2674750 2915519 2689342
16852 2689342 3032000 2655481 3036195 3129786 2969070 3249189 3161883 3328859 3187106 3182300
16842 3182300 3545224 3539986 3769675 3733363 3796541 3530185 3902678 3807402 3873361 4075032
16832 4075032 4097390 4018690 4120221 4330413 4354522 4323396 4271335 4784284 4817791 4435343
16822 4435343 4996234 4868331 4923170 5337281 5341034 4955777 5323400 5350480 5254598 5637012
16812 5637012 5691376 5761964 6133991 6058879 6352316 6413308 6344778 6766904 7008089 6982969
16802 6982969 6794287 6930570 7390572 7419150 7851947 7744337 8152726 8313698 8730799 8621294
16792 8621294 8799348 9459483 9395922 9415931 9534163 10121782 10281311 10451879 10785882 11047182
16782 11047182 11181007 11476150 12229531 12394291 12585531 13285877 13598364 14008189 14467081
16773 14467081 14610624 15423989 15683883 16298143 16763618 17595366 18140133 18710818 19489988
16764 19489988 19864238 20744861 21329590 22685405 23580549 24509711 25276722 26359261 27491501
16755 27491501 28908027 30089569 31258787 32593869 34191913 35506059 37469096 39188180
16747 39188180 40944960 43148626 45212600 47570608 50569532 53215450 55740194 58766775
16739 58766775 62294665 66047767 69524157 73757068 78068663 82887792 87747729 92692003
16731 92692003 98463163 104522995 110459411 116837496 123652311 130910388 137702491 144580057
16723 144580057 151999300 158556394 164840029 170789436 175903559 179747802 182615232 184754159
16715 184754159 185739153 184615747 182760427 179781381 175942441 170711023 164756772 158593583
16707 158593583 151407367 144461282 137297451 130082206 122897461 116290394 108924485 102764631
16699 102764631 96428630 90966309 85392631 80408015 75673303 71201848 67118245 63118413
16691 63118413 59464383 56387242 53166912 50320215 47366287 45143977 43262791 40840395
16683 40840395 38575384 36941695 34717881 33331539 31830069 30189215 29133367 27800423
16675 27800423 25943063 24991877 24230889 23214490 22112049 21314182 20420233 19640676 18895994
16666 18895994 18559463 17347590 17237765 16685679 15951149 15122938 14288992 14065457 13612222
16657 13612222 13452969 13075221 12351715 12172267 11640460 11037695 11113639 10779378 10316647
16648 10316647 10055481 9554584 9219138 9262049 9021698 8450594 8719654 8078124 8097795 7544808
16638 7544808 7528769 7373847 7174603 7026171 6744226 6609357 6434568 6217161 6112450 5806381
16628 5806381 5506608 5734748 5696788 5719941 4951171 4752858 5065491 4800054 5006073 4816631
16618 4816631 4695706 4393847 4593466 4396523 4246034 4094397 3948703 3902932 4091346 3874546
16608 3874546 3887231 3705019 3332409 3916417 3692291 3484245 3348002 3291140 3371309 3382989
16598 3382989 2744069 3027626 3108207 3056715 2671773 2785856 2917185 2769937 2871093 2741312
16588 2741312 2723106 2431117 2341702 2400295 2527306 2591493 2419508 2718919 2160612 2148289
16578 2148289 2072310 2404460 1997327 2108171 2309748 2277783 2271610 2008022 2391581 1949867
16568 1949867 1812506 2132896 2081278 1626039 1837787 1742201 1599817 1495012 1794189 1506999
16558 1506999 1584248 1371821 1895351 2092449 1295120 1419270 1705690 1439422 1709077 1472621
16548 1472621 1386998 1631666 1032561 1429561 1354235 1283918 1459120 1436445 1258026 1268675
16538 1268675 1676130 1351264 1333193 1004594 1047380 1201808 1187973 1266235 1206075 1045856
16528 1045856 1180882 1021092 1236730 1179939 1271351 1056873 907261 612827 1095204 771843
16518 771843 1178546 1101718 892901 806188 1320945 924547 727302 881340 754272 598311
16508 598311 1092928 884057 756528 737612 934780 755688 396420 601332 660056 940392
16498 940392 594196 905938 493173 730611 853307 717204 449555 646622 879392 277457
16487 703665 721525 583421 655622 680797 473339 786259 937468 562761 818922 473759
16477 473759 743584 621519 697034 590196 776631 561769 648682 704693 475267 375938
16467 375938 304627 377929 633402 565461 490402 555705 537481 697258 355266 454163 845968
16456 845968 553758 272827 603326 952063 741721 557002 639840 410157 243246 531666
16446 531666 448312 815146 354019 229162 715188 597466 396030 470336 504877 383009
16436 383009 656046 415061 -12037 489314 279445 193858 260961 383483 265227 265477 506535
16425 506535 22544 385103 574345 486869 312696 289169 321472 285936 359816 314168 454629
16414 454629 793684 183739 536561 350092 271757 603559 301968 232259 125594 694487
16404 694487 465772 585313 151447 435727 429262 496193 163200 540690 329332 245442
16394 245442 524573 257709 518444 39959 343164 188699 187703 643127 185358 26497
16383 322157 210094 4969 353622 -2036 110182 120985 533011 92011 325698 451931 463462
16372 463462 404229 348700 313348 26688 195805 -18537 25463 644102 298716 518446 91214
16360 62972 236681 219346 446501 484563 118518 114937 263277 153050 328023 141377
16349 125846 377985 234967 59372 374849 57282 -444 13440 -153027 -159282 264941 142541
16338 142541 160235 334213 109603 210961 230600 -211123 -103069 -185849 121095 212162
16328 212162 222763 212748 -82065 -73178 608641 180271 -35695 304096 390565 191890 187469
16317 187469 -96819 469030 88458 325505 439872 -11672 -122170 -97156 346554 213623
16307 213623 315974 74908 262108 130741 -3489 -123326 303937 -45236 378340 307479
16297 307479 71635 182992 200531 191316 125263 320459 -54575 -289479 -76630 140647 90999
16286 90999 263391 310176 360202 190655 62144 -96749 2079 154665 58091 82346 47508
16275 47508 166123 17456 177242 -243016 217482 75023 277331 380175 294564 203800
16265 203800 -94878 39378 -10441 550459 179509 557810 -145349 -43344 -244847 174958
16254 -28362 -29423 -221281 153575 28674 209157 -66483 -79712 -59647 -178511 -19180 441671
16242 -74926 159987 355549 -67626 89773 189298 79072 -60190 81515 -66643 -176676 379487
16230 227050 -50249 113186 80938 202155 -55596 128954 -64973 -39250 -14875 357024 -3215
16218 216783 53207 -115617 -17859 -137940 305600 -200671 58484 -140006 125544 -137855
16207 84610 43843 -300312 -208041 -124584 -292173 -247488 6119 139357 18920 156543 302261
16196 302261 17780 -115630 281281 67674 107638 -129197 88383 21777 122979 134375 252780
16185 252780 151030 62353 -26521 147339 2335 -29889 -184226 -240801 -95005 26774 -58602
16173 -26877 263543 -68040 38144 9300 39322 55952 314151 238450 -81518 113089 -3677
16161 22363 -20608 6359 -175779 44427 82764 143726 -111020 232897 -7597 -155880 -230963
16150 -230963 -58025 11359 -647273 -17673 -142391 115863 219007 -132863 -224633 -278837
16140 -278837 -319632 -127455 54171 -125199 -14622 74309 -169329 -99503 -18614 -493111 120909
16128 212436 182838 161884 185083 142443 -155808 167051 32883 3164 208879 348667 -148257
16116 -59839 -228334 -27217 -62141 54444 -107009 -50084 267610 -341787 19317 -208119 -359412
16105 -359412 -130308 -171090 -137479 -51951 15824 150508 188941 -222406 189324 -33995 -3180
16093 19970 220896 213655 -160912 103297 -109941 -45610 -6960 -34773 129176 -242432 -101654
16081 232734 57206 152932 142679 117797 -52606 91123 -100757 -342882 113811 21679 -247566
16069 11820 -19504 54921 -62299 146489 -59084 126783 -129733 -127236 -311115 -69475 7794
16057 -213467 -118267 236788 -163670 -155076 -164033 -82661 -2325 -316398 -84097 201934 -23256
16045 227002 -338108 80836 -79156 94325 142076 -464204 -157330 80415 186546 -142211
16034 2197 201406 -309090 102035 -42135 367580 -129624 22443 5681 221015 -77851 114954
16022 -159281 -59377 -304721 253056 -104122 -265213 -347091 -33032 2244 -72497 66806 108746
16011 108746 417863 77106 -343530 -178734 235731 112885 265618 -256490 295461 336138
16001 336138 -97570 217477 188018 274329 -228923 -346215 -44507 -184195 136563 62684
15990 165493 230194 -219196 -320577 -14661 305237 61778 422494 220303 517445 416944
15980 416944 44319 41587 226217 266646 4261 -78209 -221949 386658 70801 14893 -170654
15968 13310 61954 21297 7812 -289052 -69609 123758 10727 -160123 -132729 1081 418642
15957 418642 93305 -231330 -50923 -101357 187715 -100943 -33027 180123 -430450 -95182
15946 -18927 177012 276341 253105 -69037 80812 133942 -58470 63541 -26437 -42426 -309089
15935 -309089 -103645 95946 -375136 -392106 -85750 -165610 -143609 -186130 -15383 -69028 -275321
15924 -275321 82351 -3007 -95595 235097 19682 -2961 -68923 3688 323645 -9626 -202108 100302
15911 -53071 141411 3912 213175 -70627 -35600 -104228 -161079 -4312 -93091 -15809 -259397
15900 -259397 144685 215404 8739 184284 177430 -12423 -82217 -417308 187379 -33346 255107
15888 -77131 -63201 7857 27046 118434 -27291 -163149 -18356 80098 168381 72174 3187 -30151
15875 5589 -135637 -208055 -66569 -103297 -185702 293189 -7293 412435 109947 -14358 8208
15863 -108988 -268672 -293802 -102984 -110232 -165725 -63309 -14978 48237 -116862 -150269 -340569
15852 -340569 -118837 -365010 -446825 55509 -249845 75851 199682 148275 125769 231132
15842 231132 -150405 120048 -157888 -114313 26201 -192270 -193804 109952 -113593 233724
15831 113844 137620 -219640 -13017 -8829 127245 74002 42294 -215955 -47606 38685 -274516
15819 -250663 84760 -7435 -203593 -42035 -100495 -102341 165837 46925 105219 -136408 -337683
15808 -337683 -152542 211845 -100949 -10985 -2602 97042 87651 -63495 -187792 -185476 90907
15796 -70080 -145182 -319169 -3401 -155907 11882 -92578 -151685 -103120 165364 95170 -95299
15784 131769 -25661 -127023 225473 210295 15798 -218385 -172385 -386101 -487799 131254
15773 -23322 252415 73773 -135699 -112517 -171519 -93134 -189495 -120636 40351 155797 -232948
15761 31819 -113635 30940 146282 -117925 184548 4161 -123804 197649 -52562 -154135
15751 -154135 28812 2308 183187 -168860 -172304 124985 -16569 95790 -110911 190146 172013
15740 172013 -71302 171255 48215 -153183 -83887 145961 -59204 355908 -351240 -194172
15730 -194172 121588 -196709 -50872 79756 21540 47102 82471 270912 -330569 -175957
15720 -175957 46627 134626 266487 -36753 -95745 -334928 132252 -202291 -330094 154467
15709 -30656 -81378 -197868 57128 -6065 151536 -78942 372985 -125196 122670 -603383 231921
15697 14832 -87918 27394 -48315 134333 -284646 47118 236543 8844 10904 301241 338049
15686 338049 416288 23447 10459 209767 31834 46017 137793 -23181 -144711 197810 -69433
15674 69372 -242112 -364934 -247934 188313 160956 -23662 -425671 -15510 -1652 391593 -258860
15662 -409697 7602 198421 158442 -141255 -445641 -10870 81556 -194724 -211588 65453 281825
15651 281825 -307993 -150608 -38538 -122240 -13403 7407 -2384 -150068 296983 -109750 -224794
15640 -224794 -181200 -269190 129431 48249 -241278 33301 -344631 89358 -108423 63095 -129087
15628 310998 -4880 -74171 53471 61364 372686 113587 278319 121382 311649 436348 -75669
15616 151755 -165880 122140 -460111 107955 -172206 -51037 180610 187396 -187270 108871
15605 -185526 -198732 171347 -114875 -270230 238742 36758 3878 784 -158887 100690 -76898
15593 27398 -76990 294707 -66056 -232826 252012 -124055 152526 -125229 -33680 -117863
15583 -117863 84159 139555 -54612 137023 -112961 -172991 -147181 139623 -301670 -97820 69747
15571 -33004 54043 193096 -41428 154222 157634 -493936 223228 137176 70432 120021 -121127
15559 -55068 124113 16775 -43576 -145142 216863 29322 -103080 -219956 -264314 -2074 -83739
15548 -83739 -931 -61988 -121945 -137362 23943 457934 -117451 57481 -62311 -82632 -32413 136705
15535 188186 247184 151301 187505 155749 21838 -84699 -38107 207031 -261709 178528 -56965
15523 -20573 -6196 18542 -22486 55347 234149 -103961 -453981 24163 -170544 133053 37757
15511 -12815 266907 -274970 50122 -173155 -226611 -183608 118735 -398299 264091 30506
15500 -92815 222417 233248 -184704 -66760 -84110 -88510 -414348 176087 33221 28809 -23158
15488 -78020 -363363 -63502 149988 -124165 -853 45506 -63998 237433 89286 67701 327436
15477 327436 254618 64467 -235430 -24735 137942 -33139 379129 61932 -196321 -45544 23551
15465 -389276 252233 -355072 -277325 -17525 -273659 16504 -353676 -36512 15146 50307 -43747
15453 109514 59334 -152289 -88449 -206857 -112581 -16064 -157751 -155483 51211 102601 -28189
15441 -352568 -52211 -64025 -173047 235789 -51284 -80410 258127 140076 -93301 -261872
15431 -261872 13944 159009 -247711 72819 -94909 98100 37571 -90629 187746 139100 -77450
15419 -594631 31722 -96444 160149 -155286 -18052 -82450 2935 -263222 -312912 -327234 39149
15407 117359 75573 197961 -102137 33723 -212467 -430532 216603 -26844 -258028 -151854
15397 -151854 432138 -112525 91937 -56046 -23729 -256558 87703 -95423 174250 181509 -24192
15385 -382371 -600323 -21633 -78187 44976 -98700 273781 -64692 -45411 257832 32845 266727
15374 266727 -341696 248681 -10598 143061 -214297 333051 -68709 -99459 107291 143702
15364 143702 -13746 -171070 17694 117864 129410 36460 -249126 -47038 89762 -218033 200138
15352 120156 -19886 266959 133345 -93165 184805 -139979 -368502 118968 -154949 261315
15341 4495 90372 -245953 237801 -64057 -14289 -12110 11263 213510 -53582 -346621 -147509
15329 199068 -53084 339514 160500 149375 30844 2636 -51091 -208108 41548 94276 -2099
15317 82174 -102595 -19624 -11426 2077 -107527 -68287 246078 139317 170315 125164 -98110
15305 27858 218569 -78683 112127 -138443 434806 263011 122923 -337455 9079 -92448
15294 -237833 164467 95441 165420 131285 34358 307788 -8407 134205 159211 306221 200675
15283 200675 -188149 -35838 12786 -79598 -327021 344695 -56544 15418 -182389 162717
15272 82733 -179895 -293874 -155839 178772 117857 -92480 159465 41669 234259 345715
15262 345715 -60337 32856 -117771 117206 -101541 107539 -93613 351202 158536 237565
15252 237565 -263762 191050 114895 289605 661880 1187946 1579720 1405876 1556631 831917
15242 831917 232065 -41374 27043 43294 262996 76601 69447 241176 -126648 -198660 -56359
15230 64693 -43715 -52373 -51263 -208979 -219726 203348 21139 113809 229999 259811 27082
15218 120098 -107512 232062 -223061 160350 -112960 57465 10937 -40553 387801 -159458
15207 428486 -40724 39895 66474 350626 267199 147505 -42841 -39682 129500 203934 37124
15195 -16008 20692 60396 90920 -51249 -106045 205801 176613 381602 -84551 -18336 -34160
15184 -34160 273057 156985 -46560 -68981 -105684 -94278 -166160 84012 112229 -129951 -324598
15173 -324598 288186 221313 30956 170724 257065 144691 236547 40120 142016 171720 -250380
15161 -199542 112225 46403 331631 81473 -211466 109501 127331 508890 -137253 -57455
15150 164376 -109201 -79746 -79400 282304 136159 -52475 -75287 -161536 15747 93948 44956
15138 261259 -25541 4641 145884 -154825 -150411 -73040 -102041 192679 236403 -127836 415209
15126 4590 276435 -138717 443850 401795 317270 140664 217211 143795 35398 237499 276508
15115 276508 478571 96662 264543 -253178 -118728 -104474 296809 -15688 121930 -37155
15104 232070 98747 178837 223290 344741 190812 53758 66537 -233767 -70424 79624 13822
15092 -83627 138359 76451 90317 37933 341985 130453 -22391 97510 -124113 314449 -58341
15080 -100047 43019 45171 -139849 140566 206501 37708 -274857 244585 57362 307212 99318
15068 341199 93358 311546 -167291 303047 -50404 95375 63971 307409 -15564 76668 258342
15057 258342 374185 1428 29388 132360 149719 324392 133013 205263 -123038 224337
15046 1606 307146 102680 279342 84127 -101475 -173701 -229846 -60898 73333 88525 108201
15035 108201 89907 297334 384125 478167 164254 589175 -28674 43213 151649 380621
15025 380621 190647 -49060 297110 181660 107031 404425 -272801 170793 100244 249051
15015 249051 291036 -108722 134647 218746 52554 121331 352044 -146188 40772 84793 -58880
15003 504210 303304 139857 300524 347811 -169339 84575 328097 136162 87724 35291
14992 89402 128477 317299 -32962 341127 350957 55045 159188 97990 270567 88736 157511
14981 157511 113326 -249162 340259 125619 303189 326058 183846 351408 -41731 30073
14970 76198 360041 275509 257319 405266 210825 331680 197849 217971 324948 226519
14960 226519 335128 136146 163340 372502 160966 -12462 -17997 399616 377696 178103
14949 -154367 54221 350522 -55834 243761 144347 456546 262128 566198 356790 136998
14938 359038 117151 128598 293505 340490 62247 642035 137933 230675 387257 193977
14928 193977 343007 12479 646745 -131081 20645 372776 248703 278204 -53174 -18382
14917 176071 471867 490506 256339 627728 309760 393246 786 425652 346099 264113 527973
14906 527973 287511 561784 205246 133180 550915 454793 87212 284178 244075 309251
14896 309251 399403 85692 476262 50273 286615 227667 281701 382628 89436 267635 625456
14885 625456 284041 249875 374869 214210 135402 215177 412709 499770 186659 241578
14875 241578 665010 62221 179418 170510 337245 625535 268637 255345 124541 451572
14865 451572 284449 550269 48699 435670 306681 372225 560020 238780 541750 490274
14855 490274 251251 295769 262886 611130 124202 82177 355665 528733 247709 201514
14845 201514 290703 168907 479715 444250 366884 423609 436747 106101 254814 489828
14835 489828 447260 517082 245889 182801 234833 293184 307566 394334 450103 504320 390291
14824 390291 407986 416807 118769 375948 694420 467014 457328 454172 284198 275865 631136
14813 631136 173611 449709 84504 373121 780071 494805 393830 522818 503188 336540
14803 336540 132008 346028 419682 502431 837762 388553 269130 532160 444766 619648
14793 619648 521407 695006 845660 486258 416882 595640 915011 813078 367061 621621
14783 621621 248307 560984 531572 370774 281522 123709 523453 460130 400617 469306
14773 469306 570206 323317 544510 473582 373348 202125 881344 467474 812536 474800
14763 474800 333602 469083 465863 452926 436882 550225 297059 506865 528907 501768 827659
14752 827659 536811 685775 718531 472982 705744 819758 711304 605768 882142 341566
14741 686323 591674 692838 802902 666943 812188 680118 389588 527344 544753 643337
14731 643337 624768 613361 781434 701490 502440 801909 1017976 497059 721126 800301
14721 800301 900496 786023 682762 664610 342987 706477 833298 305023 453922 572881
14711 572881 734290 619830 712504 647242 662789 435996 688653 654459 911897 695917
14701 695917 659982 582379 613536 953642 952788 544206 959452 826150 741345 840623 657503
14690 657503 781054 399516 449854 1047895 840386 650522 875105 766468 755639 888352
14680 888352 984711 864912 915863 673015 1018365 1241898 695756 992285 1162579 911914
14670 911914 884496 835277 744204 1035330 882970 887693 985847 932603 877504 839823 1139729
14659 1139729 844172 1015047 962764 854463 463503 928424 809687 970748 668739 1099197
14649 1099197 756439 928495 745130 709493 714021 1290321 1151938 993345 1191864 1039270
14639 1039270 1257639 1112748 742962 1148181 1081251 1263316 914044 1287879 1197634 1337523
14629 1337523 1175249 1274980 1257261 1122359 1144188 1408865 1242542 1222096 915230 1330386
14619 1330386 1289136 1167238 1330581 1271282 1229942 1552478 1116023 1115494 1343918 1667099
14609 1667099 1359534 1233142 1291696 1121607 1414555 1337753 1377975 1299039 1157866 1495502
14599 1495502 1393361 1617849 1453124 1548440 1397048 1465893 1513202 1460766 1536593 1865276
14589 1865276 1629810 1793983 1754912 1753429 1647246 1415850 2058560 1867574 1856374 1694590
14579 1694590 1644062 1992096 1475256 1931426 1720095 1932422 1869951 2075105 2023073 2007017
14569 2007017 2155921 2066030 2202424 1895691 1760456 2038926 2243435 2391000 2318346 2158957
14559 2158957 2623270 2665999 2409927 2702860 2726813 3023232 3373114 3581006 4261237 5036632
14549 5036632 6812922 10781837 20395225 36485240 41971660 19815422 10867030 5825658
14541 5825658 3027362 2143462 1470783 1541169 1447771 1644793 1743719 1668083 1407562 2000249
14531 2000249 1833054 1822829 1626656 1676250 1834413 2055314 2069588 2005130 2242117 2360974
14521 2360974 2372903 1913327 1980350 2331716 2084867 2494526 2487502 2392469 2528838 2181479
14511 2181479 2608735 2485529 2426722 2581999 2566142 2251146 2518675 2655840 2339945 2629944
14501 2629944 2858871 2594797 2748003 3126979 2898968 2719192 2877684 2989133 2906164 2955912
14491 2955912 3017520 2944712 2806839 2889746 3085001 3216495 3366264 3492457 3154909 3212335
14481 3212335 3127793 3262320 3242089 3481523 3411763 3664287 3477170 3599160 3249303 3838466
14471 3838466 4147904 4078359 3543349 3896650 4052538 3881119 3804419 3996447 3928438 4105108
14461 4105108 4131020 4101952 4066932 4409835 4099306 4043859 4427235 4333391 4581254 4762017
14451 4762017 4418279 4549195 4898528 4922678 4869075 4944344 4950533 4819223 5148859 4988416
14441 4988416 5097909 5257395 5100469 5524426 5760548 5331894 5334675 5640762 5359495 5787457
14431 5787457 5629347 6092836 6280479 6118161 6384140 6391809 6585567 6542470 6691094 6544906
14421 6544906 6708739 6498898 7074819 7212805 7121506 7290044 7402646 7565612 7548155 7530461
14411 7530461 7693876 7892445 8347903 8076114 8179446 8300965 8886792 8927297 8637500 8886902
14401 8886902 9119888 9080513 9577146 9443890 9767099 9926408 10068024 9873495 10444765 10502461
14391 10502461 10529732 10926613 11035691 11182058 11390850 11690713 11768798 12179424 12164675 12562529
14381 12562529 12573432 13019503 13528993 13294934 13896823 13698048 14302541 14387709 15134206 15026726
14371 15026726 15650872 15643403 15953725 16426271 16984945 16828155 17486973 17806542 18091326 18558161
14361 18558161 18672223 19350757 19875764 20599470 20881957 21389404 21815249 22161876 22703026
14352 22703026 23389791 23978264 24388218 24705518 25415206 26289190 26796427 27754363 28290661
14343 28290661 29000620 30056090 30476665 31495787 32520101 33451484 34208828 35078520 36526330
14334 36526330 37460101 38353407 39677868 40818792 42179501 43240820 44996738 46121840
14326 46121840 48076882 49551248 51071839 53214352 54951976 57028431 59021973 61048294
14318 61048294 63436556 65901162 68443948 71121265 73925224 77082039 80296927 83934219
14310 83934219 87496051 91502272 95129269 100073193 104292091 109355466 114655507 119965497
14302 119965497 125539429 132134083 138473741 145480371 152817855 160734248 169104654 178208291
14294 178208291 187945403 197649630 208746816 219887465 232489275 244961260 258564224
14287 258564224 273018128 287832330 303160622 318849617 335495509 351863571 368685188
14280 368685188 385292412 401910477 418046470 432847829 445901348 455685687 463234804
14273 463234804 468269303 469766531 468152489 466917917 463269872 459426490 453830720 446724868
14265 446724868 439122102 425851261 410663066 394217934 376468824 358911101 341396292
14258 341396292 324459764 307554752 291047792 275691076 261066021 247903053 234568000
14251 234568000 221771727 209681667 198754102 188109620 178024736 169034714 160554870
14244 160554870 152792339 144860827 137731711 130869514 124686755 118790085 113998020 108710348
14236 108710348 103573571 99051520 94544282 90519334 86911702 83887373 80229457 76921054
14228 76921054 73895583 71039918 68263483 65706596 63032889 60843593 58942992 56550501
14220 56550501 54853187 52852245 50923967 49314537 47407456 45938329 44900994 43554686
14212 43554686 42319713 40795818 39408980 38235087 37224501 36621686 35570980 34106020
14204 34106020 33347713 32270070 31771629 30613389 29776217 29373820 28309778 27486511 26815010
14195 26815010 26329129 25603106 25172801 24425682 23875674 22771446 22652271 22045707 21490923
14186 21490923 21327197 20270283 19820811 19820111 19365507 18557435 18273415 18027353 17503808 17549905
14176 17549905 17012392 16544288 16263460 15593420 15606162 15199892 14995505 14767726 14509343
14167 14509343 14201682 13865882 13739201 13445974 13135731 12896282 12660311 12608467 12564092 12201499
14157 12201499 11657710 11720532 11613118 11461518 10854607 10439009 10910092 10153044 10374873
14148 10374873 10438114 10220632 9912232 9589513 9692088 9479540 9305081 8717990 8999644
14139 8999644 9217219 9016659 8660782 8685838 8094969 8281754 7930706 7957480 8265107 7513256
14129 7513256 7642233 7449333 7369182 7049032 7569561 7139040 7361466 7016364 7091082 7019935
14119 7019935 6650886 6488721 6549733 6661910 6440149 5981740 6325039 6413725 5951290 6127948
14109 6127948 5795184 5957921 5722809 5932495 5857175 5750557 5574690 5303486 5176137 5629352
14099 5629352 5384045 5348048 4946372 5227581 5336855 5195745 4897182 4966632 4839144 5040460
14089 5040460 4414636 4572245 4559550 4675684 4640295 4644561 4747683 4303165 4663875 4662014
14079 4662014 4323992 4137693 3844701 3949706 3648011 4033624 3929702 3759355 3839020 3645758
14069 3645758 3878507 3371629 3525506 3964385 3838786 3614569 3912031 3503741 3447985 3476422
14059 3476422 3578979 3543887 3506968 3649138 3718283 3353371 3391470 3282824 3172841 3167053
14049 3167053 3197541 3011297 2788875 2818433 2934965 2813395 2829252 2904228 2842998 2576000
14039 2576000 2551675 2938416 2720318 2742517 2756604 2976453 2740481 2738107 2774994 2705922 2683495
14028 2683495 2676845 2715348 2711466 2128849 2630815 2463129 2231294 2183196 2368327 2615749
14018 2615749 2155475 2417272 2291123 2613408 2414615 2087679 2083594 2024292 2150346 2044994
14008 2044994 2019711 2101811 2161790 2161142 2170287 1949056 2078621 2058348 2188305 1847789 1775800
13997 1775800 1999388 1718346 1975179 1709628 1864592 1835329 2236572 2338652 3676705
13988 3676705 6175355 14142781 29717669 43492047 24570044 12918197 7804406 5019716
13980 5019716 4087717 3359772 3227004 2687019 2849516 2473516 2625259 2143267 2559798
13971 2559798 2399065 2109010 2191405 2145034 2068793 1999989 1814056 1943732 2157395 2078032
13961 2078032 2048351 1801752 2018423 1853044 1939362 1613513 1802888 1871112 1737773 1624706
13951 1624706 1696490 1903666 1719318 1700557 1581657 1600504 1529033 1770290 1868538 1549795
13941 1549795 1614273 1635332 1813488 1477822 1554395 1441852 1527048 1449822 1600507 1557324
13931 1557324 1610933 1246668 1454563 1268979 1684003 1131943 1336104 1011271 1491028 1389005
13921 1389005 1194175 1479065 1756985 1504485 1448479 1131320 1458158 1288255 1459030 1132816
13911 1132816 1330257 1218917 1182055 1466664 1414623 1519630 1306321 1196348 1366991 1215826
13901 1215826 1065475 942428 1117144 1135554 936830 1105923 1080195 1353699 1030427 1147522
13891 1147522 829166 971219 1040152 958021 1173531 1315905 774677 976149 1143221 1227472
13881 1227472 1246879 1032377 1002055 1180453 1106744 780771 1093424 1084859 1076707 708182 1033153
13870 1033153 1127676 1097993 1243713 876447 876746 1191393 1143875 765438 323256 1175259
13860 1175259 905839 937545 979977 1097194 664587 1060941 547723 899191 984618 896471
13850 896471 1215494 704805 990322 841287 760778 953426 1046583 913370 772270 1211112
13840 1211112 1073437 1029156 1133765 836834 427532 1042956 1082332 1021321 739944 752838
13830 752838 939894 775608 822934 1216977 540928 804974 1001565 600924 744777 805300
13820 805300 409867 1013093 645878 837800 560100 701459 778965 599166 930473 606468
13810 606468 1039243 779578 716349 631039 784491 732253 831627 1028509 914116 896121
13800 896121 656240 770926 834971 630463 610368 880239 640121 316068 777914 350758
13789 764659 832558 857613 870887 640157 516806 498491 626192 649919 754153 457886
13779 457886 619473 641314 606481 562658 726240 753918 478383 874707 744342 639103
13769 639103 584933 1044513 473411 629717 390802 559163 330603 702739 465515 670182
13759 670182 546014 333589 269797 539300 515738 622745 423833 371950 277814 834637
13749 834637 359016 483055 418641 386262 317345 377719 504820 432850 767397 388024
13739 388024 883281 394191 450729 412842 625740 375113 652842 436688 630959 431703
13729 431703 397311 529468 323950 635331 916753 663717 395349 479534 447108 422984
13719 422984 582410 702440 362815 605387 332507 464705 394975 523840 360742 567471
13709 567471 542177 354307 806648 682758 566510 470887 566948 550299 728937 727080 620130
13698 620130 410369 485032 590476 572764 470380 516792 682701 491115 479114 401335
13688 401335 208038 568887 701156 588449 114650 62354 408192 618900 517832 628308
13678 628308 560798 641191 284168 383987 329049 407933 168820 562934 586439 492299 517975
13667 517975 385982 453484 331343 386348 388554 236302 437980 252040 60463 259884
13657 259884 336125 306632 257846 490000 738001 670159 590969 540403 311056 409966 63432
13645 363372 107280 518859 242393 383828 222785 115262 267936 276540 418147 239011
13635 239011 377234 -32308 474384 496472 144733 453273 456972 375645 249036 649173
13625 649173 306532 406629 389020 332572 316403 377188 367265 462026 235203 585262 123159
13613 115507 434474 -20226 271064 360385 279139 622548 404357 379300 402343 293587
13603 293587 129223 290690 326889 180359 522693 382241 297171 72840 344432 206548
13593 206548 272088 366706 71135 517718 410018 -16558 421275 155618 448877 149027
13582 71799 423233 171640 326861 248508 338651 522095 155647 400626 173968 71654
13571 538137 599960 489950 -16602 462276 113869 428267 77077 303676 336659 561367
13561 561367 234271 134559 399754 580229 48258 236906 183102 264005 101895 178652
13551 178652 -25909 311081 59162 43489 90036 158901 157802 282586 77993 324785 439151
13540 439151 387606 170132 93990 -8156 57090 92427 346500 389908 108883 422022 52574
13528 176945 23136 210887 347039 -326341 166592 596555 49008 72823 454209 534040
13518 534040 154332 38393 245044 522652 272422 308122 104688 66746 337547 300238
13508 300238 353986 314083 257872 200299 310959 -117422 346708 44962 -14015 159828 -189648
13496 324523 125156 29176 215370 139314 308137 125251 263627 235873 109227 278442
13486 278442 224046 186704 111781 154650 -19112 184796 89954 179044 341852 196768 104372
13475 104372 360986 149210 185939 646027 501375 314142 281574 262766 296758 508019
13465 508019 185953 38329 376800 421934 69950 441959 36827 150442 256642 452850
13455 452850 257686 268285 297892 156212 196076 510983 218400 338957 520022 321163
13445 321163 -111625 2173 76188 205993 164626 203259 290241 262439 177362 17317 33082
13434 33082 41768 77454 254183 135616 58923 137871 325424 -55590 577982 311566 153627
13422 235190 18637 464997 129308 -66844 365766 67616 124940 96599 405170 -160241
13411 -20486 39433 137041 54347 -20767 106663 148254 67338 269122 175704 495658 424242
13400 424242 365093 76629 355608 347472 365168 419243 47245 107139 -244904 86852 109552
13389 109552 317918 -106232 -52982 271777 -153005 443377 42079 196718 -14678 183257
13378 19466 -193668 279776 213694 255910 536988 -168519 482101 44340 203465 -48174
13367 132575 25621 -127854 184771 25901 294249 107942 176292 442129 -267521 224104
13356 145340 -194341 214599 73030 46322 381932 129023 310632 153711 272024 -161663
13345 -153067 327269 239832 174768 237356 424418 196256 142592 370980 -354621 370685
13334 278100 67816 330141 190783 201283 349087 121281 381761 71855 370727 160152
13323 302499 384741 310050 354869 144849 166542 150640 273150 329954 335665 17001 -74568
13311 268467 145802 167936 231574 208904 125613 255063 -94774 123954 180654 272036 21903
13299 302431 -89087 216008 92665 66465 117003 173384 80867 62866 125044 -19796 214665
13287 -46628 -48849 139280 361933 -181674 195671 174751 167800 391238 -50358 -177632 -77369
13275 81514 -275426 110634 229704 55242 433190 -50837 82179 -169277 -73112 263545
13264 106744 234492 668643 420457 557017 167336 69553 474300 480140 144552 -173841
13253 204075 42841 141434 21484 137945 -56058 -30190 154532 126634 326501 -232995 438835
13241 -196907 115913 -30036 -23806 -102692 63341 -6133 122175 302268 54009 -58860 -8420
13229 -189342 34073 33196 -226633 3573 -88387 329117 -125653 -74506 176683 154144 150898
13218 150898 141104 14628 54966 201395 -215519 401909 265817 -247 188118 -35885 120682
13206 324519 -103696 -71886 180518 -8797 99701 211952 -148974 -871 281368 84417 164036
13195 164036 -90056 115208 234256 190844 -273300 146127 25733 113342 136810 -76484 -35095
13183 -155869 -96392 206820 159248 -144331 107277 154810 45802 -53725 345420 65068 93473
13172 93473 -15071 58257 461099 -49518 213795 -28554 -268754 399208 174050 -105859
13161 331532 57499 -133109 -59930 -71437 -340933 51433 327752 88871 -1447 249986 144339
13150 144339 400409 118196 209227 -250472 401233 230558 109999 133519 338294 228967
13140 228967 144145 64220 222882 160889 -34265 40585 6342 232067 24121 169710 92472
13129 92472 -145143 508697 -32785 -2609 -8709 427855 71058 -175614 -265485 176565 174443
13118 174443 -242898 57666 -298509 83637 -25356 61565 460046 75288 -70198 216520 -98727
13106 85196 -93893 48034 -99824 168433 -94863 32206 278143 61365 103799 89695 61282
13095 61282 53771 -5136 186015 212985 -94807 92227 125621 217371 327275 417752 143582
13083 -184014 -93605 -48677 -134825 121881 193805 -63872 56588 74978 -97831 348488 -35500
13071 -108646 -113177 252370 115131 78826 -56163 124033 -198637 114768 420521 -124167
13060 -92462 274774 -15374 75059 -81387 300318 149285 -69293 3343 120387 378922 -418712
13048 251335 19895 233408 295770 -88078 -44055 195739 -167342 323324 73235 30641 111350
13037 111350 401572 163773 305466 171802 178683 -144498 18336 125966 97815 258649
13027 258649 261256 409996 209451 181032 152553 98773 67363 -169181 -72995 501147 43496
13015 -77221 -262362 355246 295363 135319 -158938 174429 336616 407123 34857 102162
13005 102162 -262691 222382 -3744 210254 -54025 328966 7774 295919 444596 -8216 119364
12993 -56277 150802 -4009 -22873 -274485 8030 212439 24683 4953 -197442 161489 202116
12982 202116 157588 208778 -138342 244314 5423 -146057 -75319 249587 118803 -202574
12971 -26832 53699 240266 201402 446047 -202415 90274 -123954 241698 -215103 -56418
12960 -153591 224914 -16437 63774 81643 -79934 151710 19957 85007 119939 140326 -272172
12948 -362590 69805 242290 143278 -263343 -83878 315088 55239 -180976 75769 390950
12938 390950 -206987 56328 -29184 216339 -18676 -282364 323207 -60944 99059 59662 157944
12927 157944 123972 -132506 104662 -299471 78762 135233 -63471 -120167 -5245 226356 -95898
12915 222759 236064 109946 16257 295713 -180721 47029 -349702 101357 -168079 51967
12904 -151281 -164707 21072 1577 -79490 -4549 16582 -46983 -103825 -113665 294558 -87888 125638
12891 10034 136994 -109018 -227469 50169 226136 -160633 -79818 -110246 -151569 131508
12880 93525 -136678 15560 -474959 405231 -410461 -212271 149927 92574 72049 86197
12870 86197 -323633 -36240 -15246 -227243 -89506 256806 394690 198199 -88701 136947
12859 170345 -47026 -43869 101844 -205055 248461 99341 45639 -37406 109878 90122 -84792
12847 -314878 -243515 -83318 -132854 48835 48802 174711 -12916 10399 196939 235243 -313412
12835 -332954 224004 214706 -131909 -80290 -39945 -299691 207065 132575 -60486 499443 416575
12824 416575 144435 157653 -58121 40569 27460 391116 -181634 97165 163213 -149829 -223997
12813 -223997 52415 -33045 382266 320010 -258859 -70138 20499 91888 241212 -226421 29556
12801 173212 75370 219261 432169 -565 79656 159839 -51498 121788 178606 41302 -222905
12789 -97775 102551 -145979 -11761 -109283 -141052 200079 221897 197583 11089 -356021 -281769
12778 -281769 94038 -313534 48675 -126019 -212296 -44789 -174877 33326 -43327 -98653 -434721
12767 -434721 -81566 -128800 226390 121645 112524 200376 149445 150749 305350 -32483 -112543
12756 -112543 -190853 -193371 136319 -333107 -49649 -109393 5390 -331298 -283368 130295 189875
12745 189875 -31872 -12919 30363 82815 430601 -130331 339356 400891 -48214 -52985 78719
12733 -40246 172904 -19036 204901 80256 38452 289598 -125876 -68516 146004 -75643 84014
12721 -4123 -77557 144479 -1116 -175761 -9851 -119943 -262417 24907 -9399 145906 198794
12710 198794 45137 616156 34695 301739 103648 104801 -39562 -50632 168929 -86190 87054
12698 12203 89695 175620 168410 -175985 162986 92162 320981 27641 392553 -35754 149374
12686 16032 398713 -125057 199263 83828 197412 240993 16635 38660 274529 153653
12676 153653 230548 22864 -85885 93478 86090 355885 -145810 73973 -39685 112560 -133352
12664 4627 45751 348873 217891 117977 -69044 369065 92584 -433097 191803 215757 35577
12652 54503 -488 204832 319750 420221 -330215 103644 24577 -113463 -95345 -183270 -178843
12641 -178843 85226 -312814 -348917 -27122 -39070 126254 84070 209627 -90554 158390 -120689
12629 663780 187196 173918 168241 234966 130910 -171325 38103 25913 216424 288028 70631
12617 -95488 -194397 283186 203387 -68726 23916 -201015 -28826 85471 -158023 -146545 232637
12605 -203300 153850 -140665 -54931 21958 258142 126826 -118906 214049 325287 51863
12594 402433 -96815 -208424 173590 -94619 328542 -219747 57154 108332 -227760 210534
12583 -44719 23553 114617 -40750 -160809 477757 -65705 283023 335719 274220 119692 177547
12572 177547 186325 443221 22094 -142117 -165314 137079 49555 4826 371645 14663 10878
12561 10878 -50571 -259283 4802 409970 55239 -38376 78269 -31390 87231 -93410 19198
12549 -57547 287569 -111050 224512 -77070 -107760 108933 -93997 -89072 55769 81939 94774
12538 94774 264490 45017 -148205 116386 176179 274867 -171863 -80457 -158633 -315413 -66781
12526 -248652 -307982 -31494 314511 -104151 -98758 73662 -220675 72694 294023 -10062 326165
12514 -277951 -117765 157640 -105490 147738 779 231445 448114 61100 202680 -285708
12503 -61135 -84600 224043 19712 182541 -81630 36925 79512 -79366 -75063 264947 -124408
12491 -524 -236174 137165 -243585 75043 -193800 115016 287842 252372 -104703 165906
12480 59538 14008 151707 -41377 -227027 -121656 -222374 41052 -145336 -174529 153469
12469 336594 34304 1303 -140751 233027 -72036 119653 -122489 -176047 -375596 -221587
12459 -221587 91897 -454947 65353 -264066 -257188 128141 -195978 389537 -11817 -121059
12449 -121059 -128272 -345225 51402 -86357 -13159 -121126 58463 -135809 -113853 121041 150994
12438 150994 -160812 232495 84812 -36192 194390 127888 -221867 -128583 -156265 160261
12427 -77025 -130651 -203096 221996 -5299 126267 108380 94742 -156386 -133767 -338117 -285727
12416 -285727 -172474 56411 178561 -30319 76143 -18667 29687 4059 -142672 227057 -620
12404 22172 238863 -178020 223200 204132 112337 -51903 196294 -344562 -23681 -340804
12394 -340804 -532920 59536 -245606 -334887 -181316 -77055 6639 290103 -164792 9141 224752
12383 224752 -1286 418688 239495 -325059 224845 137397 -18650 -118360 8349 105263 -333408
12371 47951 63688 -78252 -38663 54331 74582 60105 4146 -237937 -197551 82450 108835 177089
12359 177089 322603 -282488 -116792 -158880 262250 73767 -50305 -180739 101612 170797
12349 170797 -42538 -382668 263300 -38300 181729 -336307 33711 136118 -72955 53991
12338 -122801 -135773 -69840 -175877 -276068 -180238 111227 133540 -153814 169760 72359
12327 -220536 59898 -46058 17949 -132119 -191855 308527 -282581 14882 278193 -244833
12316 55221 190142 106276 -32490 -85462 69092 374832 -10871 -184390 111133 8628 16743
12305 16743 -73308 157409 -70595 -24404 -357979 -21742 -221963 32064 -5044 143702 -58134
12293 -286754 -513463 321646 -79622 -143562 54611 -40196 28007 -44721 321194 -233394 170126
12281 36210 283289 -198352 100150 145990 4587 408768 78724 59839 581172 7262 -89866
12269 154439 -50295 -53154 -250399 132558 112558 69401 372565 52310 -136324 272435 178558
12258 178558 -2572 127049 7807 10055 201733 184996 193630 -92754 453452 -181334 303474
12246 87993 224643 -160112 59136 368328 87861 168183 200052 167932 -242312 -53356 114302
12234 -38164 75540 -50887 86339 28619 -123339 202039 -44148 323737 78874 220202 390049
12223 390049 85289 119946 195816 35266 478139 369995 57849 272845 247477 330446 16665
12211 114791 -9021 230503 58294 290077 534370 272040 170442 122622 181542 86023 36644
12199 207102 -57015 16812 149148 -96283 183441 437610 389590 277999 65183 129331 349380
12188 349380 -119375 -13028 108266 -107283 -4987 243077 195066 67543 76002 84508 146503
12177 146503 -35111 360031 231948 -42942 44836 -72000 -133556 -43034 -69486 303597 -103489
12165 297701 186209 46152 354268 456195 -50320 -151573 187058 211987 9195 -202778
12154 37774 -144831 -189671 251284 181543 -394855 -203408 29635 85340 133161 -146173 -93551
12143 -93551 -33462 57992 174507 199424 95454 -42256 35049 -284028 345728 100716 -314946
12131 -75171 22809 146803 60595 -140475 195624 -273155 158046 135411 -55205 98150 -255404
12119 -4747 -332119 27766 79283 22050 22360 39993 135827 -41367 -62378 136074 83986 197903
12107 197903 128177 -8995 155403 24696 -453214 270431 21762 172617 -81320 199802 83452
12095 149004 -129587 -253491 -56017 -188694 79832 152153 260691 293354 86030 -81750 -55344
12084 -55344 330757 149136 80794 285463 515122 1613797 919335 355758 189773 310238
12074 310238 -106803 -117687 121456 -432000 157091 -84374 183944 164142 97395 113315
12064 113315 457234 262816 258565 174856 -154878 -331409 -119049 17997 -244816 -48810
12053 237577 116040 233237 410730 293584 -235307 -276285 330411 -139579 60368 -16457
12042 -435599 160523 -67603 -67365 -196773 -152526 -342994 -122663 23743 -229656 -102360 226274
12030 -182594 130845 -183762 -389166 8660 235633 -191112 395790 27365 -24419 244051
12019 9387 405504 -83672 278645 189665 32003 141112 6464 57162 329292 22433 113512
12008 113512 227472 49195 52547 58827 -256061 -45874 263395 248754 -100547 -96263 -43191
11996 129541 -188931 -277711 -34267 240855 127801 -276591 21589 -172069 -34411 -178316
11986 -178316 -100317 -22295 -26080 -297301 95838 -132783 -107134 -223396 228738 47281 207193
11975 207193 -29333 -88046 197315 -207117 -199143 -494990 -35430 340051 -314899 240577
11964 -144731 132368 -70709 -108530 105660 -222549 -57442 -189895 -152540 -84101 123393
11953 14825 -129077 -201757 -26798 -162648 -136796 242489 -218461 -91445 -41634 -25104 -250696
11942 -250696 -86531 -30303 -183920 -146807 144433 5425 -203332 -17529 235975 -87203 58259
11930 302920 -41534 139536 -110733 -53284 301469 302338 -109850 41365 -146746 -257145 -138876
11919 -138876 206486 -43274 1290 -199055 -36387 368420 -57488 115746 -180303 -59543 80506
11907 248424 -301354 -119583 -92733 51809 112288 166684 -364214 171651 71620 173983
11897 173983 -255343 134191 -64076 -72435 220116 124749 -134276 29414 41280 80322 -139334
11885 44650 117282 -347645 149632 25330 151032 -78044 -189928 -15689 182572 -402520
11874 17769 -148857 -94023 135712 -40297 -193926 80270 -87370 -56711 -288033 -147127 41232
11862 -66569 -171904 -33049 -208736 -98025 -32435 -137545 -114386 -321520 -503183 186174
11851 -166243 -47861 -149757 -148625 8944 96981 176032 977 46589 -35824 -205942 -42767 119442
11838 286015 164481 -15959 222682 -122926 156276 60919 11801 -263783 -217840 -62909
11827 -304815 -267640 -35454 22872 -139938 61963 -198846 126622 -50519 6941 13581 -381647
11815 -35061 -397765 -93879 90501 375308 -211847 -299697 166730 -202346 449663 53010
11804 52287 78142 81186 -250502 -80883 -72116 -28634 -6683 -276117 28616 -119570 -18584 -100426
11792 -100426 38096 5065 96113 227550 -51672 -6537 185170 42026 -452310 145709 -158417
11780 203565 264931 19488 -66051 126697 123038 47795 -314796 122847 158489 127203 -164037
11768 -209537 158518 -141324 34498 -20470 -289389 -350989 136498 100811 231580 47470
11757 85003 -198287 -134690 23376 71133 173550 171628 31327 58032 2160 -7177 -50466 -289962
11745 -289962 83597 -149096 -229006 -3193 165916 131098 -84594 -42746 115613 253312 41095
11733 183860 -251195 -97782 -9501 -142901 -35570 97197 -133177 473314 88350 -128104 -215825
11722 -215825 241893 179541 76408 121759 97580 -72860 -1363 99187 59266 -267223 257807
11710 143431 -157963 -140403 -21263 -261672 -13455 96127 194936 75655 -26340 115448 -78784
11698 -167147 -158361 87755 174432 -137110 -224269 143523 -426969 -11263 165108 27324 -67126
11686 -53727 -42519 -4023 -93743 213900 269403 -231949 -26046 -242880 162707 191213 -78343
11674 63918 -189152 126487 415941 -70021 25906 -243017 -14048 -19472 -95695 313886 -92128
11662 -81155 181167 -159889 -78110 145546 74318 15559 205995 4078 178783 121280 -128677
11650 4748 -273038 204555 -143370 365964 -70003 219915 62841 133885 34683 114053 121568
11639 121568 -51994 -247087 110602 217476 168293 222870 -94797 13122 113322 -97829 54666
11627 -126026 -402857 221628 179925 -44072 -97380 245446 -77153 -321371 176331 -150873
11616 135176 252481 -134832 -221503 138903 -282730 102026 198835 -382710 240631 165188
11606 165188 168488 -170801 -196891 -342443 -61236 173743 -49425 153619 60275 -84705 -147070
11595 -147070 75840 330028 126200 90715 53827 209440 151587 -138360 -119529 -35958 143333
11583 406993 156689 -4145 104328 -110383 87790 148414 75828 278832 105667 155846 -43467
11571 126471 -4641 149351 143824 166110 78224 188946 -147336 191434 124330 171544 -196310
11559 -161147 -12342 32046 -138005 301649 -151399 34553 254127 -186005 90087 248616
11549 248616 76255 -292345 -77757 -50250 93935 252518 58252 -76916 197264 -16000 -333175
11538 -333175 38096 178488 206238 69941 169504 -386334 249617 -282960 98333 153430 -65941
11526 199151 -128570 236407 42364 183222 -80654 -236808 300014 98173 -39711 187453
11515 144801 50934 121576 190510 219543 27160 98642 42526 203095 120462 190794 390789
11504 390789 285884 72759 121852 282940 138765 -19583 -24883 137496 120449 38937 50052
11493 50052 91629 119950 93545 358242 21562 -19575 238919 380809 425701 -87920 51209
11481 357533 -17271 216916 518160 251820 240022 258545 39646 354857 347996 -76390 77911
11469 194110 171337 216843 229761 247703 374 150700 232488 -67902 114892 176461 -110872
11457 263821 155700 134379 219635 174693 -27168 267757 329729 123449 -209889 255803
11446 332752 -309649 -55370 -31728 82934 115324 -181200 -334055 -251882 145581 228251 -39332
11434 -21446 179501 -67437 -24610 -89534 129757 346434 -160123 31955 -89937 142289 -70615
11422 132596 82749 165400 -241347 143031 -68396 153614 -287068 -123877 -153431 -600407
11412 -600407 57074 -69848 491880 -260046 -821 18285 196544 19287 -351959 -202094 -123855
11401 -123855 73283 -124367 175451 182596 -152630 -176015 -382375 207124 -34626 -1017 -50624
11390 -50624 -208698 59341 196645 59952 104974 -94094 -115041 27717 251238 -55561 -41482
11379 -41482 104755 96204 36195 -152151 2165 -286734 18106 15989 -167446 482248 -85645
11367 52303 176715 340455 156582 109883 114525 -57037 -145124 139492 -332049 -93157 227276
11355 -238755 -52395 140552 125631 33758 -44291 -249956 33671 -44013 72551 -151992 154542
11343 -141356 -95555 198197 395086 161741 285251 18304 -52604 10407 -207540 -155769
11333 -155769 -171085 -76302 -214669 319054 10610 95628 -313136 -41837 -152646 327316
11322 51643 315 68182 -166466 -280634 -187565 -148869 230996 -45543 367772 -36554 186018
11310 -164938 64348 -81893 -569934 436004 49062 -8922 -5211 139049 -394790 140281 100073
11299 100073 84801 -83933 -37 -34162 55029 -226935 -23150 169735 30539 -61415 -125991 -269477
11287 -269477 -113281 -99953 304381 -123162 -315396 -295760 -321665 -215190 292133 -70886
11276 23140 -333743 -212904 -212431 36659 42787 -40628 -338189 -195794 164153 -45003 -357794
11265 -357794 -418441 131276 -313184 -98494 54015 181268 -158787 326684 110725 -140291
11254 -307236 -90801 -74532 -59701 -112028 -565173 -1374 25205 66965 11851 239974 -22456
11242 59708 -90793 -79582 -206695 11728 -104599 -113300 295345 -129954 271182 72872 -243729
11230 2108 -78108 251654 317283 -243426 104936 -33163 -219188 88943 38502 -114466 -35075
11218 203392 139110 -511529 -28128 -154526 -198889 -144776 -126003 57176 -95320 -151052 -163178
11207 -163178 -194286 192613 -288945 -43548 -77958 89449 -123649 -17930 -10867 234051 -8368
11195 -123293 110463 -97329 123091 196677 -35762 -221699 10202 -217562 201151 53690
11184 184403 72381 59210 115535 -145389 131599 -391086 156735 -183637 93730 -9731 164514
11172 26390 87289 93577 4993 -206756 -49784 118011 290605 105066 85371 -97323 -171971
11161 -171971 242830 298366 -302213 -188548 -161365 -208530 -100349 199246 -184599 -366161
11151 -366161 -37581 7008 -172177 -36749 170539 -71717 -71175 -4784 101562 76068 -27078 -83811
11139 -83811 -121429 -93720 147167 -84534 137208 131805 -44295 -71872 122155 66784 46573
11128 46573 -45951 15309 -69684 150223 45215 247659 91386 -33196 68929 -14732 290286
11116 -3069 413072 181053 -24095 360517 -242061 -165158 132538 -60357 228160 335079
11106 335079 187589 120880 -92557 12112 -47379 81186 366278 -113836 482700 166177
11095 -60420 321294 -235781 91473 227055 313836 146319 441374 159880 337402 40460
11084 56169 417968 450255 46139 129583 209179 520023 383009 244866 284040 311571 140569
11072 276304 308047 299010 87865 189445 -84286 267940 377920 81959 141516 63023 69766
11061 69766 594782 436615 502573 671479 903967 597766 541962 425563 627579 723279
11051 723279 805979 474398 530972 757375 458881 597923 570479 530519 557100 639296 449413
11040 449413 735173 863595 797887 676992 533568 484529 457210 622863 538438 282932
11030 282932 814176 782253 696825 792185 579422 757318 808576 596107 852506 852012 690830
11019 690830 574156 954868 434621 480673 771470 726866 549673 655250 528497 232618
11008 471286 570563 592136 609254 875384 329883 664342 503376 711906 360699 837007
10998 837007 654953 532621 384699 688868 753735 863615 951048 717301 855093 571578
10988 571578 971707 722078 824270 801208 867751 760259 1073335 923264 1374731 1264967
10978 1264967 1047867 1451231 1534515 1896985 2094298 2389598 2318438 2632227 2896992 2658648
10968 2658648 2885283 2217057 1909034 2068429 1471499 1668927 1329201 1348302 1615612 1690426
10958 1690426 1951568 1924067 1754027 1620369 1851695 1567827 1502451 1110950 1188755 977390
10948 977390 970068 570342 401541 299604 340789 304428 513352 280127 237454 172855 -121490
10936 113219 262882 493794 536731 -155881 225690 335011 295817 111997 -11842 177127
10925 273332 206224 147663 -159374 144556 32392 80924 161100 98807 15160 -50877 -605776
10914 -605776 153739 -15627 -42405 256926 60913 -77609 15807 -175153 -188657 -77890 50403
10902 -111122 69077 -87075 -73997 -214412 116823 132249 -205191 242079 -155499 -322428
10892 -322428 -86740 -252013 -62907 -196866 189371 305106 -11742 33433 -48870 8308 36917
10881 36917 49774 -226984 -65211 -64961 123933 -200118 66681 -46726 30704 -20371 -58870
10870 -58870 106034 -69217 -284763 -97830 -251199 -386795 -27885 366222 98083 -6570 246396
10858 55011 -67683 36919 -65756 305566 34585 -172768 -193406 192919 -108344 113980 9358
10846 -110943 -78255 -253323 -258562 853 -218130 73328 57464 -127192 286654 -10570 207355
10834 36430 117414 -248983 261461 -148955 174022 -37796 -20118 29009 -70664 -207723 -27455
10822 -219192 -28166 -156763 -150342 -141569 -206526 -435483 153983 -91577 -169379 3376 17389
10811 17389 -81881 57475 -99061 -318353 36765 -122566 54851 -78352 107177 -130161 -232944
10800 -232944 -179427 -25650 17411 110914 -104156 -155909 -11694 -147744 81985 150315 70497
10788 9635 -192722 88181 2764 -259412 108714 -293922 -168583 173480 56633 -299650 -152648
10777 -152648 -401580 -127821 83580 -127395 -269442 -84889 -62800 255378 34694 -186076
10766 -44109 -266718 -145455 236507 -71032 45316 -219704 100871 -222993 165748 190103
10756 190103 -151047 66185 -26850 -341451 -177226 -436018 -48680 -204264 -271934 13668
10745 -99296 -203723 157876 261280 -502025 -23751 -60234 -240442 45243 150025 83043
10735 83043 138045 3996 64005 -287047 341413 -55129 -58882 -70794 258371 62785 129263
10724 129263 -57685 28825 -133458 -1575 -147805 -205975 13585 4814 181479 -350152 -18734
10712 -379696 -370061 53021 -61975 -4177 -155927 -274714 274480 -285795 5897 161414 -231802
10700 305151 142063 -46893 62919 -207383 -72315 52057 265586 -159364 175213 185529
10690 185529 -213396 25886 -11824 45681 -100884 76790 79589 -58298 -15948 -37307 86669
10678 -273851 -14708 -148467 141450 20386 43366 61155 -240337 -298007 -137687 81082 -77516
10666 -382619 87089 -11207 35016 249044 92517 -62178 -16468 185527 -159652 -31610 -49876
10655 -49876 -222253 -171984 -116601 -104340 -84343 -116324 274616 -103862 37124 -179790 -120127
10644 -120127 -63236 256899 148208 288260 -22120 -139935 -161159 -199718 -57440 -1700 130506
10632 -19341 -64993 -237575 -82837 -82105 -118515 -123447 -167529 226407 -203812 38697 -32585 24254
10619 16063 -290751 152170 -245234 -33691 43648 -23428 140866 5824 -54437 -247287 -57685
10607 -69155 -143787 -118067 100171 -248394 -67895 -50929 106931 157405 82845 -100663 -89041
10596 -89041 -342549 -207191 -369766 -80078 -272590 -298776 -53005 -51235 -257878 27506 226427
10585 226427 235014 -407151 -6770 279106 -326474 79526 -32316 241618 -53959 -172367 133127
10573 -252024 35920 -22074 -251203 113746 -45821 -207917 35909 293603 301102 -231021 -66610
10561 -137620 -197430 -292178 36103 -129329 -27046 -65096 -112662 45510 -162321 -57133 -227377
10550 -227377 2912 -196421 20271 -173504 -200919 -169242 -107323 61754 47933 3596 -270575
10538 -112318 -14627 88608 20737 -173047 -145807 -319641 199688 -22477 -253596 -74312 77155
10526 61737 89425 -192328 141973 305395 -71361 -98104 38417 26087 262700 -15823 149920
10514 -95026 -275785 405302 1773 -139947 -453865 209047 76399 -115174 221903 -265930
10503 155340 -208790 57029 174372 395917 -390801 -271322 -219900 141987 -20699 -18148
10493 -18148 55391 122821 -24705 201534 -318992 -2517 -199012 -203442 -199255 69704 170067
10482 170067 83536 406667 660236 635795 691021 541009 78999 -267728 174844 -61134
10471 -168649 -223918 -183916 -27645 75043 -303032 -221568 -69623 -125380 -111029 -206921 333635
10459 -2114 282398 -97119 29883 231486 -122348 8780 -290106 -20140 394106 119341 118684
10448 118684 251614 -94505 -233268 184614 -46698 -263932 172654 -206552 170864 77146
10437 81037 -206201 -138549 206195 -153385 307697 173864 27414 -37993 648 -44112 158214
10425 15783 103127 92145 126487 79895 -75923 104430 -15978 60693 -123451 -138349 5272
10413 15597 -118646 -304317 -180238 220621 31987 -108909 37725 204646 200936 -413017
10402 -267220 14003 -274902 -138694 -324 -229655 -129735 112414 -130170 306883 -43694 344102
10390 -94755 132163 40191 218746 288452 -118383 122046 232679 -140784 46849 102889
10380 102889 381674 465265 278471 163240 13664 122102 184113 283854 117368 299559
10370 299559 264256 557774 145249 257584 136648 336521 226564 193798 -39896 154424
10359 161082 135845 329883 48605 195194 47056 19330 381068 176993 186252 331200 276979
10348 276979 571111 453206 240453 559244 102954 349969 550903 408218 452129 390851
10338 390851 135660 140893 195329 -19811 -150231 179908 223974 192877 210139 107649 33897
10326 45349 125286 249289 188961 184115 278046 325581 113924 273636 177787 -12526 -25342
10315 -25342 191591 327878 224958 74695 -12232 -146575 359586 -36310 135802 246550
10305 246550 196786 -158435 -226618 27415 33180 -60566 -93277 -60534 101460 23720 -432415
10293 -248184 -280245 73987 -202759 283924 39279 -198741 -72415 -168331 -182964 -275038 131853
10281 -42412 307638 272255 172353 93642 80589 106315 93432 -36647 49157 -238871 40884
10269 -110358 36357 -106093 47704 -302526 69142 -187381 105853 323019 191160 -131648
10258 86730 548502 321524 106297 225768 224831 392278 -117559 71856 69510 -154904 6961
10246 -329781 -17471 71443 -24878 266956 -171019 209822 -391943 74407 152979 -250773
10235 -174938 -138807 253189 -380421 172024 -250761 -304292 -228622 185134 -225355 445522
10224 -187711 260622 -104389 59158 -23493 -408354 105841 -183203 5443 -87883 -373824
10214 -373824 -64663 -157040 -160399 -403718 152953 178489 -8959 -380505 -12564 -246400 -145195
10203 -145195 -145881 359483 -70267 -7044 -169401 236236 -91084 -229085 -188556 124059 -103014
10191 29597 -27440 -95003 -286469 -445176 89260 -78700 56037 -9638 112052 96224 96482 -36772
10178 -192128 -450326 -332885 89266 -63314 -408577 -202144 -354575 -378509 -193404 -72811
10167 -242120 -227470 327136 84246 -120093 52688 -191558 76943 205382 126025 -128792
10156 210728 76851 -239813 -40235 -124997 -59041 178445 -195704 5505 31226 -367607 85410
10144 -259878 -65645 48832 -421457 -83784 89086 13877 93885 -400240 -43969 -173103 -215505
10133 -215505 -23203 -84005 -9340 -20959 -318480 430 230961 -102342 -65706 112262 -350778
10121 -246088 -121902 79349 -489606 126321 20698 -72473 -317513 149828 245103 151988
10111 151988 -12387 -90367 -79789 -135269 -102775 24963 -65929 2106 -216456 -3523 73269 -481016
10098 63723 63472 77756 236791 -314234 -98040 42471 -293808 -218673 313453 -179400 118970
10086 -5474 -140860 -251392 8740 -49656 -144615 98264 -20460 -36768 -200617 -88501 141311
10074 78476 -118405 -225818 19085 242861 -444786 229701 -50087 -55701 456105 5118 389883
10063 389883 53894 91226 28850 84637 -200595 -137964 -270828 122784 -166891 -110305 -396014
10052 -396014 -196244 -61582 -22052 -210886 152601 318247 -48542 -408000 -130523 86968
10041 -399970 -116251 -105581 -512161 -195109 -7948 -55334 199357 25893 54471 152866 -123140
10029 -240938 130678 -14248 13073 -119233 -149441 -5712 -118773 -179129 -26313 -27184 -126678
10018 -126678 246441 175906 -85461 -50752 -163954 -437717 -40890 51181 -108995 42916 29414
10007 29414 -395042 349703 -166715 238573 -68674 183404 131339 -69343 -90499 -251248
9997 -251248 105003 279149 -267440 130446 -72382 -99030 766 -176639 -320627 14932 21048
9986 21048 -47799 -164716 -247737 -186293 -108411 -75600 -156410 -268935 -143985 -103808 -86274
9975 -86274 -52537 99340 -193306 -238048 -238122 -197786 131 -98726 173795 -294218 -153956 -58997
9962 -436176 250688 -94022 180709 164171 -203273 118214 14638 -93287 -150921 -57184 -82642
9951 -82642 212016 -177302 -113669 -306911 -75862 314744 -44828 -243751 -243923 -38158 134724
9939 186017 -83162 -155487 -63698 54721 -120272 -331597 -182091 -263951 110567 34200 -207491
9927 -138187 40485 65960 -52530 -20751 -78502 -350891 -341528 189778 -82768 -428930 95921
9915 229480 -177701 -226046 -319492 24090 -333244 66974 -83989 -234500 -251093 36055 100868
9904 100868 59706 -274643 -98071 105228 -105400 19688 -324840 -45486 164080 -170750
9893 7257 -132174 150808 -212281 -257677 59522 30117 -209270 22251 73584 -200357 -298612
9882 -298612 -15330 48074 -309682 104779 -7091 -247463 -48928 -61467 -205020 -180825 -61954
9870 -15256 -157716 -439331 111911 27767 -150397 -15056 -14442 -61753 28640 -147518 -45162
9858 22932 -29847 -138426 11073 36898 -172332 -60753 -351616 -129919 235967 -170651 133615
9846 -263998 -6090 -20735 -35308 -242741 40350 -34583 -145697 -242856 -31206 -224069 -309465
9835 -309465 -260600 -35494 139272 -230096 -288201 -223203 204160 18784 -25157 -151366 77706
9823 -88495 -233736 -170956 -68396 -89218 81702 -172440 212333 -176481 -50485 -8515 -357474
9812 -357474 -503295 -317267 -110243 152267 -138556 -162160 200367 -278552 -684 -37461 -76097
9801 -76097 -73705 -97606 -31276 -209561 -291942 147792 -32140 -220118 -27633 36550 -243293
9789 -215754 -214199 259396 95466 -39750 225488 -207211 -195803 11643 166382 45516 -67873
9777 321825 105496 158034 119046 55315 -103757 396951 375777 -200090 -337385 3894 -318996
9765 27348 -24116 -91490 -143105 -149932 125698 -145675 -480895 -134847 367258 -74029 -392245
9754 -392245 -157147 -111788 -149675 -452531 -220313 -87214 -347441 333080 -66485 45569 158052
9743 158052 41145 -165829 -85826 -75389 77141 210737 -480172 -17325 -170146 26523 369
9731 -75165 -133613 667206 191347 -23547 -37234 -232859 -151500 -66992 -162310 -99053 -335274
9720 -335274 -270688 142010 153335 26666 -192169 198680 -216624 308444 174421 194056
9710 194056 -32473 -28560 -130423 7213 -133211 -109127 -12855 -6966 -393773 -107071 -176894
9699 -176894 175961 -229383 291071 -275259 24366 -588856 152883 16516 43057 -375067
9688 -103170 4045 -249549 -399540 -31593 -99840 -234467 87221 165834 17128 42446 10380
9676 -80522 18352 14018 -50105 -310155 -234607 -205352 -97141 -130108 -126938 -68308 -199487 -115481
9664 -115481 101751 -52186 -220396 -253264 21925 -209509 -159329 -203848 14545 136215 -158180
9652 -22902 -36782 -241379 -86856 -367039 -138462 -166507 -301608 47188 -367890 -430244 51397
9640 8524 -327980 111324 14764 237455 -118297 85716 -126529 -21092 -106838 -156472 131927
9628 -36947 -112490 -16351 -246127 -25676 -27253 -64831 -212462 -38731 -331952 -7132 -285765
9617 -285765 40376 -120272 124536 84269 -50424 157027 -58248 114340 -213692 -64872 -298357
9606 -298357 -20910 78763 -19617 -217141 -236879 -238882 -204836 -47361 88012 -48646 -74870 112348
9593 -345827 -194532 -209165 159536 25659 55944 -524637 357071 105302 94821 -120204
9582 185449 -263276 273371 -203150 14230 50252 -351762 95666 758 57228 -310459 -372824
9571 -372824 -291548 -47599 -207934 -406127 324530 -86428 -490513 220448 204327 30362 -268873
9559 -98967 -41097 -112938 -44041 -52149 206850 -98521 -84750 18434 -67473 -101692 -106538 27753
9546 -51636 91626 -201955 -70508 377154 -152458 -7826 -480158 -158145 276506 -292842 -212408
9535 -212408 -141325 -395254 -293526 -333523 124875 -144145 207722 14098 -72561 -179160
9525 -179160 -144859 -334018 -98766 -87995 195533 -163721 146423 -75417 -23274 -164750 -68488
9513 -111854 56081 -360045 116229 23768 221215 -124716 -116576 204206 -489146 202446
9502 164805 20595 -34204 -244300 -46174 -117047 -158029 -55266 -55143 -171008 67934 -55573 -230632
9490 -230632 -172242 -188994 17312 131431 237211 363682 59452 226926 -87810 -177963 11517
9478 45218 94366 -83631 -158432 -3722 126496 186050 -170417 -69616 149884 -68152 -112870
9467 -112870 -187660 -97905 115104 176658 99241 204883 -90943 -55141 -259564 3317 59632
9456 59632 -86188 -66988 -138854 -418826 126469 12401 63969 143180 114243 159757 -307401
9444 -101353 181586 64094 66730 57675 -113126 -62542 -355433 -141769 -276765 155039 7553
9432 -23231 -17525 -72245 122147 -69347 -82991 202593 -140621 66126 -424417 -95345 101913
9420 42321 -36435 -227468 -228834 -187516 27588 -90183 107783 -100762 -334143 -300197 35499
9408 -177283 -113433 -23999 66140 -225156 -25758 150240 -205151 4855 189477 -51826 -389364
9397 -389364 -87883 -44670 183982 -133169 188561 -120126 108890 -38058 -83442 168240
9386 -211129 -147635 4063 -187487 -78860 -79548 -254788 324930 133240 -245859 200219 -103959
9374 -489221 -327528 -136290 319587 -369563 -87193 -387072 -87222 -38855 -14907 336357
9363 -197028 -133447 -229647 54070 -48658 225390 -84619 -601858 -118270 -10106 -150845 134958
9351 -17011 7425 -242284 -338313 30795 -12093 103240 -139895 117508 68166 -167183 -343832
9340 -343832 -32678 -37824 -239284 229431 -274492 -146950 -229515 -43771 -440132 -142017 223873
9328 -217285 97044 -226332 165094 -28317 33099 -120703 60937 -194093 161119 98943 -48389
9316 -265833 156818 -491422 -185846 -104257 -272708 -145869 6486 31448 44774 221484 -21321
9304 -131588 -9258 -202168 -123858 236667 188017 -310557 171745 61161 88562 65918 -71639
9292 75338 -23572 71872 -73485 -323789 -141832 180411 7590 -467199 -269456 -141374 -155125
9281 -155125 78126 33788 -83486 61990 29783 -441383 171125 -302915 -39761 -230389 -213470
9270 -213470 65952 -160878 -211583 -223071 128801 -201000 -206647 -433082 191347 -223184 34165
9258 126853 125415 -178773 274037 -28351 33039 45868 313009 70433 166045 -82160 -83527
9247 -83527 171281 -171025 -261348 -67560 -60721 -108197 45623 -227397 -99964 269818 -373816
9235 66460 136860 -1234 -183702 -399177 138161 -305953 73909 17359 250668 -138043 -104311
9224 -104311 -120426 -168752 -34219 -58529 -214094 -220585 -273752 -484900 -30095 -33274 142838
9212 -42178 230152 -229280 -397270 209589 136049 -133783 52618 -20465 -192367 -142115 262742
9200 -124535 310378 341684 -4737 -134365 -69 -450749 191068 -224412 -110258 -350872 -2246
9188 -434985 6811 28380 190496 -148735 193053 -71800 -136880 -130383 -324288 7979 -149288
9176 -312638 161159 237839 -94191 210980 195050 -199819 -295429 -229450 -76146 -190749 20130
9164 -112412 -301360 -247244 -149647 -180320 -136180 -144327 -159378 170265 126362 -49145 -77955
9153 -77955 -73953 189275 -88019 -20833 -338111 -78493 -96731 -174340 -106991 -16031 16670 6550
9140 -53803 -73628 210078 66938 47490 89550 18461 -177042 -211776 55727 91132 73478
9129 73478 -41653 -231755 -9194 53800 -565033 -102739 78057 -72366 150938 -243384 -265962
9118 -265962 15814 -326593 -349283 -217383 -127967 269573 220093 -218112 45976 -209389 -169350
9107 -169350 -80803 16316 -13167 -151554 -280625 -97490 69102 48045 -322571 -454488 5098
9095 -215017 297951 46470 -167550 -276356 -244173 137587 -109342 184562 -171841 -372738
9085 -372738 105723 -268114 -65519 -20252 21507 -450263 22073 47287 111325 -192237 -91815
9073 -384096 -191661 -308475 44238 102978 -282653 131533 -173521 -258291 43914 48341 -107534
9061 10694 -100132 -127797 30169 48246 82596 -121346 -249208 -227000 169936 -15477 -96575
9050 -96575 176064 -216238 148593 -33510 -122196 64237 -318797 257018 -183709 232962
9039 -45344 -114948 20397 386162 211806 -87095 170189 465663 -211696 211068 -27710 -93128
9028 -93128 -246733 -127680 -205223 -237940 280324 92343 -89718 -250413 -7071 23563 -143038
9016 162074 124051 -111448 -18564 -149575 158441 -261552 7300 233307 -206872 48731 -47868
9004 -259956 356006 -124118 -105429 -173427 54011 92000 14790 -183469 -76105 -178659 -106781
8993 -106781 -157189 -144726 -56829 -37255 -163059 5905 -195151 57950 175447 -537101 229621
8981 248282 -100926 -396752 109225 -209548 134613 199886 -392581 49703 -9472 -95839 -162232
8970 -162232 177564 -209086 61579 -273429 -133853 -245234 89998 -252087 213859 -180636
8959 -331089 759 234131 -241110 28025 13491 -115659 22969 -130418 5551 -192361 -73708
8947 -89 350791 136332 -94795 -44277 62991 183831 1349 -5002 -21093 111850 -119238 -37210
8934 74679 204355 238658 -268519 204335 76366 73732 -69034 374867 216525 529783 581270
8923 581270 2183617 5343058 11905567 4485198 2025294 846459 298937 300990 269046
8914 269046 -60922 -186371 111774 127630 12117 111237 -117413 69422 -75664 207201 -103320
8902 -134384 -97939 71281 26903 -54064 184437 -179258 139122 -102633 133114 223782 20821
8890 53419 -179180 285108 111684 -151439 135029 85061 -26705 -281736 34599 242529
8880 242529 4350 -81564 77796 -12584 -182267 -106456 24680 -266924 -712 -86730 -92624 -103643
8868 -103643 59589 21658 -198291 -36274 -136974 151122 -296277 106429 16060 -229714
8857 275885 -45093 97092 -118049 -186402 -338957 99160 -34784 -88926 -128981 -109415 -154287
8846 -154287 -54679 -30562 -532079 -6706 -98934 -72740 -197866 314719 202044 -100604 -55380
8835 -55380 -214860 -113053 -125931 -114743 146422 -401335 397984 189819 -40962 117028
8824 -212007 55491 -271010 7046 -180082 24955 42876 -39456 55670 -197575 -78656 -382782
8813 -382782 30987 59880 -88379 -163253 -316496 126388 -24803 -100906 10419 -155580 -340981
8802 -340981 72432 -9727 -105209 -206711 -158508 -83500 -14772 -114623 -51309 86551 -304417
8790 -85147 -38655 -145124 -43388 237291 -154714 70031 -290336 -322656 130455 -75102 -47256
8779 -47256 -184691 -54984 54449 168896 94594 -156224 -69220 102071 -166398 -123583 -30683
8767 -374941 -272676 58515 1482 292690 -104747 38501 -72510 -40219 -247092 12650 -182915
8755 263520 -408183 -3801 73280 -262592 64012 65861 -72180 -360900 113440 -151140 151866
8743 143279 -186434 160802 -201205 -35566 -100877 67269 -24159 -257462 -500047 -208691
8732 -204054 -94865 164588 -282601 117369 -6872 -304306 -33396 183837 84021 37800 -70894
8720 -164101 169469 -113019 -198224 61544 -124631 48274 235042 110946 161065 11095 -157389
8708 10314 38947 -90080 -198971 -158770 -83235 45669 331460 -47872 -162146 61200 85502
8697 85502 -181938 -116856 -170872 156820 -82739 358910 -59675 -296208 92184 -397268 52418
8685 -345170 -164881 -97788 22047 63972 272272 -231674 125902 26758 123273 -232354 -46951
8673 67580 -252554 -139936 146863 -333420 21449 -357425 94916 281626 149440 -157753
8662 66715 -148642 -402811 -93291 -89371 264897 125741 -91414 -30572 -248635 186026 -107931
8650 80612 274133 -440763 -148945 -6020 155414 -173071 187085 130828 62494 -278128 87860
8638 154112 2181 -473226 -216739 -283996 205728 -185553 -81685 -319395 85424 -359708 202416
8626 -29989 -143166 -129526 148602 -99461 114059 -111793 384561 -355633 -280720 -19163 100722
8614 -44170 335421 -131505 -266587 -110897 -2002 -202187 302297 -110519 46615 -129981
8603 90002 -133613 69025 84248 -63860 -161771 -103658 -81989 7562 -201068 128923 98396
8592 98396 -189778 -254999 -314572 359926 255744 261943 -128160 73216 -226514 4364 -234899
8580 -112036 134769 -50174 -114400 -227895 -119771 202603 68816 -33906 255 1855 -146566
8568 -137087 320267 -298286 -21714 -60982 203789 326826 -126482 -130246 -286966 143564
8557 96898 -186504 -212088 -139067 -202742 -44921 -238571 -127194 85398 100291 120286 98358
8546 98358 169897 37888 -161881 167743 -218914 -316100 -165761 -78449 211815 -188 -258903
8535 -258903 38380 66161 -124917 -230007 55004 -267986 78806 -79374 -242207 -132198 -84180
8524 -84180 43549 23762 -12244 130124 -362358 -136829 37235 -19880 82838 -230426 104373
8512 -66282 -319871 166680 -86028 -30123 -85539 66524 -45008 -61504 127157 94181 -326277
8500 -194603 -54684 -42884 -304623 -143889 25308 -610136 230107 -177185 -18043 20338 103756
8489 103756 111628 -55007 -11214 41619 -265333 142811 -122179 -12375 -277510 -34344 -10710
8477 211844 -333913 47872 -95209 -224089 -127018 65717 11049 205332 82407 103436 43784
8465 -177641 -72721 -278268 -224115 299365 -88078 -344215 253727 -236771 -251492 -314557 207167
8453 -43673 -20040 -263476 114 -36348 -223252 268320 -253970 52302 189296 -409230 17024
8441 -302775 60023 126051 -114843 -57594 -115953 -30225 -376341 -473249 -25404 -23346 -73737
8430 -73737 -145967 383923 250642 -68537 170054 98042 -385208 113488 -98548 267021 -58750
8418 -237921 59251 69237 123840 -92467 -390473 126806 -338206 -164071 -268144 5114 284971
8407 284971 -75579 -231823 -276411 160465 -165617 -331973 35753 -285309 113602 -40925
8396 -68263 -55636 -55827 -430729 -330419 -222211 -60806 64404 104317 203395 34327 71516 -137907
8383 -115112 -234380 -79359 -214391 -42972 -230407 -42779 -95280 24349 -32490 -42926 28675
8371 -22661 -55756 -339791 -280554 -10561 -351338 -62383 -110207 -103480 347833 -64913 -150200
8360 -150200 26306 -69025 -49128 102259 -234088 -364759 -54659 -166063 -117262 -293283 295173
8348 -113492 -51112 -195627 54641 -130044 360998 37758 51396 -152441 -12306 -216946 -107004
8336 -86809 30970 323698 73645 27660 228578 51275 23140 1302 22044 -65494 89333 -48231
8323 2786 -146821 -73839 -347133 -85910 -83470 72843 -351994 139191 82078 -116247 -73648
8312 -73648 -60797 90263 -69507 -105633 -219376 20607 21679 -143497 -88462 171021 -265376
8300 -113965 32326 -320856 211914 190160 -117980 -326544 -139402 104001 -148506 292864
8289 79726 224460 -65213 -125207 -38133 -110998 -118505 -148991 282947 -68220 -161560 171784
8277 -381850 172908 -281954 74352 -205260 241294 -140671 85850 -231660 -200857 -73626
8266 -131664 -184214 6474 -55234 66857 -136960 -387024 -235617 -222792 83898 -68845 45 34532
8254 34532 -118205 405579 -163622 24756 127645 300577 -238519 -166143 -93123 66796 -458101
8242 -87760 -93841 -23236 52503 68399 35694 37843 -159574 -226711 -112554 -23572 -76887 -36959
8229 -54723 127227 -148922 131530 -258084 -46796 -176814 95607 -403623 164346 11113
8218 292786 -42282 140549 330511 -495072 -187929 -173764 334291 42967 -372020 154429
8207 104997 107370 -187725 -41227 -156947 -66409 107273 233613 114513 -210559 133909
8196 -204929 -70849 -109103 -442930 227797 28748 -199150 54678 8135 187697 68208 -496288
8184 35893 -393832 -55941 -300438 35907 -230207 98967 43770 -91849 242841 -255818 218194
8172 285880 43163 93973 -205640 191507 -123361 -109138 -106888 46092 -93907 -176107 -393912
8161 -393912 -111544 -201092 233038 76 -13687 147378 -17123 278013 -5658 -337034 80781
8149 -57602 -242180 -316860 262924 -224688 339013 -90948 -306026 12012 134896 261290
8139 261290 -240418 -7880 117378 19911 306008 -236665 94134 421323 118000 -168874
8128 -129760 -75212 19923 -28057 215222 -43222 -467951 -100731 -227460 -31248 22681 -367457
8116 -231057 -198244 13728 303800 -127976 -406149 44368 30632 -171483 360741 -67103 -98239
8105 -98239 191061 -32038 -458087 -56451 56521 -66684 98459 -154920 -90262 -336388 -216955
8094 -216955 45916 -52469 -17099 -439058 -217955 -268052 -249726 226646 61861 36825 161617
8083 161617 -236764 -81130 65210 -150723 165243 150252 -115716 29910 138362 -2842 101194
8071 30842 58469 -316484 91844 -398811 -40475 113574 224714 -169461 18438 209665 255232
8060 255232 -35007 58087 195067 -579795 42048 -244554 142519 -240791 -237124 39296 29374
8049 29374 -209388 -29765 281971 253968 -81623 214470 -215779 196518 -156896 -59259 48180
8037 -37509 -62343 -82502 -223549 -9850 -215721 55156 293606 321205 -60722 103777 -43323
8025 62910 30115 88995 105615 -6057 1084 -32601 45930 -346447 186356 -77586 -76393 -86157
8013 -86157 59207 48264 92451 -317361 92149 4958 -46873 -33722 -164772 356576 98788
8001 156881 169366 296357 -71162 -315080 -128446 -246436 10412 16067 -47325 -88231 -79360
7990 -79360 -33772 -63503 -222616 -66853 31002 50129 -89716 -171040 -70263 211851 -358373
7978 -12962 15015 -176821 238682 -86540 -92246 33438 158290 195097 -100230 -158979 32945
7966 73324 -11016 1132 -45454 -106304 -143576 -76241 -120759 -227403 -506337 -59389 -49677 120789
7953 198045 -144866 28664 -87164 -35435 -88264 -11082 72055 180803 -81541 44582 209748
7942 209748 -5325 -52960 -8743 132427 23870 -168738 17784 11896 -10902 -301696 -50070 85845
7929 68928 15622 235982 -189966 -37989 221425 193165 41057 -55337 -161776 -205734 -68107
7917 -164603 -1507 224247 -340012 -26986 -224658 -258567 -150512 -64314 45873 152814 43248
7905 -162625 16831 53985 -43364 48179 -65111 64349 -117289 -88200 -103424 -64752 -16982
7893 -59747 57791 -37260 -316200 -118164 41528 -11798 -106942 -22618 69181 16384 188724
7882 188724 54372 140232 -120120 -130379 -214598 -381415 -175482 -75188 94079 -10075 227036
7870 35074 -153467 56653 -279734 179371 -58355 152872 -46117 -3535 -335277 -190182 -282668
7859 -282668 122860 138193 66730 -6153 -51431 -150592 78282 63835 60291 -277239 135916
7847 -256922 117678 26804 97458 187888 -136772 -33032 -74189 -52891 103863 -41133 -337775
7836 -337775 143993 -176310 -215028 108855 265892 -205678 -29273 -7736 99231 -315087 -193432
7825 -193432 -339219 -171197 -219972 -15535 -90417 -102004 -70546 173920 -157637 -69779 89105
7813 53064 326881 -210511 -89880 103151 -90504 -266711 -135071 -354205 -231440 -32813
7802 148190 -69103 -504114 -49585 241135 -132923 81852 190884 -268369 190827 295433
7792 295433 189568 129401 89462 -30861 -101150 58092 82352 -48519 41930 -291026 -127170
7780 -111177 -194743 -79353 39405 424343 127973 -16622 -15380 200809 -82157 -145418 54329
7768 10623 -73997 45260 246198 -66194 42646 -261979 -133793 73316 -9876 -118574 -228125
7757 -228125 -63086 118507 320143 -202553 -79784 127997 -261007 -106148 49782 -78117
7746 59938 54345 129664 146202 -196011 -171440 78428 -209632 -67176 -229150 168778 -224330
7734 139216 45004 -120790 125574 97160 -159615 341528 -78230 119696 -80285 -106183 201064
7722 232555 -339903 -234078 -81790 -174091 -165184 -74968 -250913 38863 -203467 30928 -375321
7710 43901 132774 95528 -30886 83834 -236022 64275 -224579 -56288 264821 6280 82156
7699 82156 179954 -89357 -108436 200228 191229 -152645 -176604 -246726 -322547 -325936 -155641 125310
7686 -180385 -118307 12801 -185802 -54346 195593 164782 -185869 -119975 -216492 -216446 -8481 -39674
7674 -39674 64878 -92968 32239 -305690 -122992 -98142 -228828 -215466 147096 -336437 -267659
7663 -267659 38636 -152509 -13115 -44429 -144459 771 66280 -72784 -122636 81238 107715 -13556
7650 -229281 114626 79693 -62093 300124 210890 111886 78422 -158519 -107737 -152845 389474
7638 24465 112235 71646 18095 -90941 -40405 -101631 -120768 426156 30889 91617 -221280
7626 -10048 164262 129752 -7283 -142490 -101868 -157759 109548 -116623 29917 -51433 323737
7614 113273 110933 187533 164271 -26764 -322637 257150 243987 -510824 57952 64226 -302953
7602 -235595 59592 -36948 -59314 3953 -307202 -175396 84839 -65390 32826 65601 -153517
7590 -168812 -214477 326486 -98941 -129609 -22121 29360 256726 100877 -165392 100536 51807
7579 51807 -209054 45813 17964 -405440 206582 205828 -343327 92290 -174093 42334 -199086
7567 51181 74120 -178784 192613 73066 64720 104641 73429 -12994 151487 -2992 137376
7555 -129034 243352 140355 -216975 -34153 -256938 -42309 -1007 -30201 -208726 142912 -3705
7543 -157212 53041 -14995 -313003 -159034 61021 31815 -173474 -987 -85087 -82078 -44103 -178824
7531 -178824 122981 -219848 -44094 -248668 -274003 132565 -106329 -202892 -138202 -2591 -455858
7520 -455858 -132326 373947 -93512 -90388 10237 -150158 -65208 -87317 78005 -246752 372719
7508 -137240 287543 -30587 -164002 205004 65038 -528243 -24489 60711 300687 -47240 -140765
7497 -140765 162606 44611 181614 -218442 130760 -303506 63418 -27078 -40473 -41595 -68369
7486 -68369 -50468 -366811 286774 -186170 -409175 -71335 43694 39490 -240332 325102 148246
7474 -223973 105431 219750 -158575 20762 -166125 31660 -59603 30756 -373403 -18234 -63035
7463 -63035 428016 334835 -4387 -139524 135902 102249 -221298 -138839 71972 -213030 47412
7451 -205806 -132120 -209482 -136313 298451 411210 -270916 232755 108332 45231 -2770 -260033
7440 -260033 112935 -277514 37382 44522 182977 106 -28856 -43332 -26487 234655 194077
7429 194077 -41400 -20621 135785 344099 -12077 -11816 104743 -419494 103969 -278842 49176
7417 -168675 -308917 -311416 -546052 -276700 521986 23065 33583 -43660 14280 39669 -27396
7405 -87097 -161433 -156523 125904 -162348 -100433 -50286 -158842 -243683 237220 -31263 196613
7393 -1672 166682 -309442 109490 260970 -33327 -171579 -144988 176525 112041 39768 125094
7382 125094 -134296 -248661 -12020 8350 -282199 14499 203023 86332 -94777 -19041 -47359
7371 -47359 -21218 175922 -337801 -224222 27745 -65829 -39373 106224 406105 -151123 174362
7359 -141981 -218201 118834 -397027 180612 -109819 3159 373517 -217446 -224550 161951 178946
7348 178946 142124 -119362 304648 -83255 16666 -114717 -85946 -58215 -91960 -288066 -127277
7336 -138905 -48366 -531560 -273677 73711 -30502 264176 -426561 -357201 88011 322691 21990
7324 -113319 125231 -14566 134030 90487 303051 59856 189956 -9113 -72459 229001 -273540
7312 -198155 -127656 167286 -15040 183856 -113201 49922 66615 -339192 130460 118406 -147387
7300 65260 -95641 -41141 -20142 -115724 -30305 -128768 143264 51065 -60681 -242319 221070
7288 -132486 77888 -151684 -266452 -110007 81837 50591 -9787 46008 28661 -144194 -7042
7276 -594850 -375707 210611 -116921 -187229 -126361 -20755 -36664 41524 -132636 -248922 170272
7264 -166962 -268397 -163799 -95065 146358 171124 11268 -131505 30687 36237 -162363 54792
7252 145375 97524 105744 -130245 -342329 -29397 -24902 11880 164930 -204379 -86987 -40643
7240 -9324 24079 -193980 18688 -96135 -203569 -79890 104700 -22558 -174675 -194587 90770
7228 -169727 -135021 99519 -126694 107979 49705 164676 -26635 -147062 -17030 -30672 -359577
7217 -359577 -53834 128048 215940 -65100 -184868 25410 -237909 74507 -11213 -279103 -2787
7205 -79661 -319656 -153576 102058 -71406 232186 86632 -56776 -7829 -276692 -8053 117578
7193 164238 -49646 204059 107711 18886 -6141 12166 98857 -145899 -58471 -210948 -1194
7181 87171 146409 -10048 91106 46996 -34010 163681 -51471 432253 -66047 80334 -85826
7169 -93787 52878 -74409 -93489 -62509 -162683 -141980 -45197 -144004 -152234 -98815 48169 22953
7156 -160128 -141843 64216 144189 -151176 -18758 -136483 329779 -73367 -370392 -112596 2332
7144 -18130 154577 -94816 -15971 14027 84624 -151487 -87707 -15514 -136670 -128756 -44342
7132 248991 156137 -90760 122123 -108995 -348587 132319 -142306 29935 147275 216391
7122 216391 70002 -198967 -150235 30219 -240120 -514612 13412 93771 -122731 -300636 -490155
7111 -490155 -4229 -140544 -15823 2080 -140344 -29780 283164 -276061 61453 67960 -4417 115896
7098 213357 121314 -88990 2906 -270387 -76591 234885 -83722 -347351 272024 -99428 135492
7086 -171646 299765 -13006 -51817 151770 -152711 -182623 185661 -46783 216650 -54747 -95372
7075 -95372 -272774 -235196 -268875 -97124 -82530 253478 86201 151840 302958 328838 30244
7063 -33778 98198 -169886 -10502 -8094 54041 5641 -121953 97096 -220117 -201593 48300 144387
7051 144387 -60900 42581 -80091 -147911 -257603 -99432 41399 -262375 33553 100057 447638
7040 447638 84281 -56608 -120008 265987 91653 200060 -192702 -63696 269622 -366754 61998
7028 37591 74688 299180 -93048 130339 -244934 -53797 -145070 193162 -57054 -469088 258062
7016 138828 40576 -74541 278032 134158 -7234 -247092 -167940 -32309 76974 -122623 -2645
7004 -92003 -55514 -205801 -182728 -121441 180348 -79473 177462 -115591 51855 80047 -211236
6992 -52925 -50381 -203783 -38845 -103793 -193764 104141 4083 -239209 3346 324522 28410 260913
6980 260913 191445 -445529 200441 236700 -86979 407072 -427892 -132637 -38399 -26390 -100212
6969 -100212 -157770 -502670 -262533 -54784 -3382 45545 228400 69015 321155 -97706 117342
6957 70999 -112551 -181823 -114398 -264823 -79071 210825 -3972 -69201 -106827 59611 -129333
6945 -65215 8193 273089 -99436 -358282 -161152 23923 39526 -298409 -60440 -94744 -107567
6934 -107567 -108706 -121852 -53299 140073 -45275 162234 -16854 -180096 43747 80091 120780
6923 120780 -40434 156530 -355319 122594 -16985 -142390 -188368 120278 -247515 -104292
6912 175998 145184 -38838 -305620 242016 -259623 -94643 116318 146177 -2540 -122074 137500
6900 242559 -194930 -136979 -312346 133019 9389 270185 -96436 -274011 -17634 -18043 99893
6888 -19415 -75949 47010 31188 -1092 21497 -430588 -5931 39538 -40824 -92650 36107 -286346
6875 -180923 113891 -29594 -289855 -146940 1330 123323 102470 48956 -90009 -13178 91418
6863 -58231 258167 -14428 -100110 -69171 173959 192700 -120536 61823 -137726 -174308 117097
6851 283945 -274895 -232697 -226108 -98178 152182 255404 11987 292504 269528 209400 -321314
6839 -97050 -165832 -26966 -165264 -128198 151068 300498 296579 -220533 210453 38379 203109
6828 203109 75021 -12055 -123809 102846 -2530 26478 40827 -66726 262282 194202 -374361
6816 -62268 63204 -389863 -143034 -228081 204632 45902 -13872 223837 100201 -18694 319806
6804 -82311 -110010 26529 -180366 -281755 70015 -141493 14511 58490 55857 45222 88950
6793 88950 -241212 -57520 121755 72623 50271 134594 -160608 55920 -212642 83617 61327
6782 61327 -120815 76162 283893 -66433 42336 -233061 143232 352036 -260604 -463062
6772 -463062 -24041 -446166 -90573 -3534 -14031 -232040 159367 -83763 15315 260844 221710
6761 221710 -148755 -208546 -163220 -61288 -199832 -164154 76438 -157544 357687 -103990 5085
6749 -68863 -296176 242015 -3948 70686 -190673 81376 -13723 175605 -184633 -67186 12795
6737 -182798 -52264 295218 -58440 -76108 -117245 32996 -75573 61564 317918 -86741 -9775
6725 -151432 162668 110327 82621 -51290 57731 362170 -108268 127157 -168762 -220814 77606
6713 -32318 220643 -227297 24300 -173264 -299058 -225636 44354 172831 304594 -55411 -245121
6702 -245121 -34164 39317 100645 50003 -177775 98756 172282 -154143 34297 -3291 -93960
6691 -93960 165214 429265 114918 13611 -95905 -176745 -73545 -33914 -220161 -62614 170186
6679 -445583 -104708 280644 -18752 -102009 163025 -137166 19450 37027 109101 -98017 -250190
6668 -250190 361043 11576 68902 -190502 31085 -108873 336928 -245476 -411795 279676
6657 179751 40937 22000 6340 -30990 -242854 -209217 -216171 63650 82519 302856 -31144 -334335
6645 -334335 -304911 -359935 108646 88820 -125592 -35097 199328 31636 -138745 -162007 56285
6633 137648 110192 -50838 233450 291898 109276 -3411 223421 -89545 60324 -113098 -136331
6622 -136331 -289475 -132432 -94652 24047 -97348 310683 17496 87636 -183347 -317449 -48091
6610 19491 185949 -1937 161653 -86708 -30495 -176168 -252982 -266299 246897 42986 -417902
6598 -468316 105228 83328 -348523 -65670 -142217 192812 -58441 52418 227167 -5374 94350
6586 -4748 -24382 -57892 27825 -63949 144573 238210 -77440 -169559 -327228 -88638 51877 -149690
6573 -26536 300686 -203979 154988 85132 148678 -5391 220908 105906 -62788 -23983 208309
6561 -64934 -85987 -15374 -80094 73446 -212048 147823 -8839 -1599 -455024 -315804 58081
6549 -106363 -271552 44460 -265496 45741 295943 -43923 150795 -45352 395061 133237
6538 -29288 -209124 -20992 -264127 -115942 -94552 261505 161642 94290 -122050 -210073 230706
6526 176765 250035 -81678 60937 173877 73897 -116303 -123362 325579 238264 -1728 77709
6514 124727 -190668 88745 152102 289985 16855 -162392 -203747 80908 74500 431926 63496
6502 -283752 -22804 -285308 251312 56838 99107 93698 285927 -18055 198349 -201605 23553
6490 142521 152958 -24612 341479 -37369 -75326 -483281 167976 75224 51146 118357 -139036
6478 -248293 145803 304799 -194509 129846 84648 -204928 -308614 205128 134311 -50496
6467 -50785 41677 -151227 -22070 -3020 -55681 51149 -245031 180116 94743 -111112 178139
6455 -49889 -74172 -129777 -224592 -26052 649216 192297 28015 -399098 -88681 -375135 -200744
6444 -200744 -3636 84648 -16263 64766 -21703 -286134 65241 -34002 19623 -252327 123687
6432 53920 218963 -2000 171419 -103939 -2619 192910 5826 -46071 -30881 -114665 10699 -167898
6419 -201139 -4599 -173519 218713 -69768 -87611 250650 204700 202972 79649 77151 202888
6408 202888 -11179 89918 139642 -204051 -119176 -96680 6137 -9112 259426 -105112 -95898 -76546
6396 -76546 -274599 17390 140750 -45261 -166018 -257222 -32752 2555 -94661 -17547 -16374 140549
6383 318516 406651 -349200 -26741 125280 -92226 -77486 208033 -231947 -54522 -106824 71749
6371 -7152 -472953 -14466 139607 -6141 -72937 -158930 -124593 202517 -29812 31818 197049
6360 197049 121775 -103341 50028 -22734 5007 -225000 -42596 62648 151550 18201 184794
6349 184794 148839 -86795 -151988 264845 316530 -16317 -310266 212852 -176553 -279420 332241
6337 59639 384750 -35188 308647 65108 -302421 111761 -51233 -180805 325194 -65252 -142725
6326 -142725 130831 -73506 -253698 -45868 -30821 -48140 -57671 -81728 -85617 127027 238869
6315 238869 180008 -180322 382011 -173475 -283593 -14191 31709 -40974 99646 315857 89611
6303 -41949 -133163 54060 119605 166195 -18935 8923 -305231 -100274 -59274 -101947 -141847 45370
6290 -45040 -134362 -48899 -233135 190172 -73916 132982 -147916 -177153 216995 -170455 9578
6278 -326125 158779 -93594 -17659 -93198 114246 -123895 62404 53150 -72231 -15491 38662
6266 -101146 101857 111632 -166050 69301 -196034 154782 153637 33606 -274614 -58427 -170889
6255 -170889 -131132 147408 13995 154970 -238163 -387 87621 56398 -1611 24757 -1555 -270460
6243 -270460 -167556 -44015 -194722 -96882 -24577 -27080 -82352 141700 -207464 -306623 -18785
6231 146274 -49381 -262238 -121020 -13800 157745 -51003 -175271 118381 492527 -3878 50082
6219 31487 -85113 -118646 -159546 102413 -54722 318412 2548 45803 163064 137062 -61568
6207 193295 39559 -110063 -251751 -11975 76969 -38469 -128882 413260 -116274 -264116 -116810
6195 -12201 -193673 -54854 -107421 -278764 -45372 -131207 91404 51378 75101 89381 -13195
6183 17002 -300818 166397 -56744 -272936 -81047 -5954 -50616 88893 9594 79655 255598
6172 255598 118798 -79983 464675 -207942 -8596 -113422 46119 -254047 18430 132764 145978
6161 145978 -89167 340370 76908 -243598 -91816 -131180 134123 175042 46498 132989 4847
6149 7752 -188219 -364355 -316937 -124334 46561 48276 175608 206571 41543 24303 61567
6138 61567 -112636 -129943 454900 -255797 199060 103688 -129601 40868 -52818 -95948 -82477
6127 -82477 105043 143782 -125160 92835 106978 216275 -257615 159277 45149 121921 217760
6116 217760 -235516 -256600 238909 -328398 -119432 125218 114113 362532 42071 -27077
6105 -109478 97532 -212868 -230507 -385109 -170668 125580 60276 -253448 -13383 83520 -28628
6093 151849 -301211 -116050 -234681 -88908 -182486 95758 115846 -311142 -232761 27821 -68124
6081 116855 -183206 -66942 -147773 -137111 16909 -68141 -30462 -201079 17202 -135740 252242
6069 272733 191458 -160088 -11496 155649 -20193 251948 125347 33000 -34398 -40176 -90835
6058 -90835 247172 -226708 -110172 189472 -346945 -258825 -104825 -58683 172925 33557
6047 284402 206503 -3844 -57690 -61575 102326 -35933 114235 10284 -298919 56574 23936
6035 -132828 -86913 -138280 -173190 -216203 -74071 245932 -154398 -147019 -72549 44658 250936
6024 250936 348333 -13503 -112397 93278 -44725 -57349 -304443 -322174 84559 -47137 -119263
6013 -119263 142064 44826 -20346 -10400 116423 -230604 -176094 319128 -193355 -235228 588898
6001 145722 195086 -37262 146484 227793 51918 -48837 -117074 111519 -18549 -87367 444241
5989 -3618 69329 46142 58799 12541 -117110 -322305 -398655 322301 -242332 -223984 31573
5977 -149357 221186 189959 61827 -19436 161791 -28081 182734 439435 -200147 -82369 18283
5965 -20824 42074 -403425 45265 174492 -117559 195640 -78963 -106052 83102 -259741 -207470
5954 -207470 64899 -270454 178146 281338 -242646 -191794 39031 -226820 -150659 -147022 201671
5942 -6027 245643 282521 -21812 253093 102661 -204334 -76640 15963 -159059 30487 -169292
5930 38921 -16295 -210370 -102490 134568 221101 78738 -89489 241629 -59070 -68350 12420
5918 -173707 -72652 96403 176380 175858 253431 -329371 1140 170589 153954 -145360 316206
5906 17278 65837 -53987 -648 219789 64962 -187402 -119217 -45171 306319 187057 -361754
5894 -73851 -21301 125880 -318101 -86808 180977 -29437 7547 -45899 77571 -182897 -130687
5883 -130687 320577 234121 -215642 27882 -333580 -100829 184591 -346008 135062 140012
5873 140012 -130728 -207099 174840 -187956 -174645 -13722 121536 -173034 -109728 326918
5862 93952 -105108 33687 8771 9314 -141146 -3965 -63950 39267 141725 -294646 160946 -415950
5849 36073 -222886 62222 18006 -198993 -78019 -139760 140079 342005 115920 105663 -238833
5837 -95114 -102577 -136720 -89736 41358 12448 -67724 -92533 -84715 168931 -231772 -171754 130066
5824 53422 -185077 196693 -170516 268928 65497 -315775 -302432 -229012 54448 -37073 -200030
5813 -200030 -99660 118477 -294039 -36368 -325291 -75399 -16867 -86520 291058 342846 -93639
5801 -354381 50443 122335 -430893 70359 -352927 140052 261525 -201884 -72943 -259182
5791 -259182 147880 -17971 309794 51845 -240290 147173 79831 166295 -45411 220791 -42577
5779 100735 -39265 111685 -106397 -22341 29452 271975 17498 34086 -297948 54892 -60974
5767 -102320 19755 88613 -114729 -100048 369446 -123574 -236307 -171367 -162849 -93702 172569
5755 5509 -253032 132524 -128732 -41410 140271 77000 -293095 -163714 324147 21817 -207778
5743 -163677 63562 4583 41040 -20969 -92321 -178540 -121383 -151348 -192906 -119528 492716 -30992
5730 -7289 -170556 523134 188804 -118119 66320 162818 35502 154278 -130071 105745 -307474
5718 -137004 83474 -176285 15281 7919 -176656 -234814 -104916 -57210 -271887 51785 -31750
5706 -99878 -323367 21972 -193836 -31592 63711 -285388 -333086 -41791 111249 210776 -21746
5694 255595 4988 243868 178086 122554 102420 58041 240548 -82710 -116099 223815 75974
5682 56190 216256 177721 64245 -102641 -144948 -22691 433225 78857 -114874 213270 -88122
5670 315234 -214023 -114018 -54769 -251316 162939 -15118 -146310 -166042 -114473 -39602 -208225
5659 -208225 15768 -110374 93850 336257 -158888 -139858 73247 461631 370355 -127065 64679
5647 -68128 120125 16819 -263670 -158884 -208174 -80477 -53649 49678 -87192 -7132 119510
5635 -171609 47735 -304775 31178 30166 115837 -94075 -42079 23966 279434 18074 27090 -60682
5622 95046 -108681 405639 -19456 -168623 6131 13275 1644 90552 -328595 304518 -155199
5610 -129008 222914 -250717 37484 -222737 -29712 -140446 67813 148733 21008 -20755 -163361
5599 -163361 81037 -77538 -30752 -138242 231682 306153 -147358 -81110 -30288 -159726 -161551
5588 -161551 -257231 24464 175536 265216 160823 133607 120558 56317 38618 -514035 20855
5576 -115910 151239 -88482 -131886 28110 -151623 -153335 -210953 99939 -267646 -199395 -30931
5564 160284 319297 104477 -58261 -13048 -260424 149714 119032 -26301 12849 118097 -91974
5552 -195767 -146454 65920 -214661 39239 -91516 -116006 -139709 44093 -170181 -287505 123091
5540 215101 144567 -18418 -167092 -36876 -94761 -11479 -35888 19858 60223 185855 174255
5529 174255 216898 63871 40127 -341777 -30078 -96230 14845 163535 166311 -130629 185656
5517 19400 -26064 -50446 -70838 70498 295688 -117011 -105539 -20341 93407 75398 -84320
5505 107094 -261 12516 -390417 -86540 -90273 -88243 -11422 31507 -19948 40659 58596 111045
5493 111045 127252 -388159 128691 107212 112855 -132974 98676 246622 213750 210249 165990
5482 165990 -280999 133621 195459 -301874 -45341 -4670 179264 -162608 85955 -327128 441634
5470 -172182 76949 -269956 142695 164844 -423975 167872 92567 294743 -174574 -298105
5460 -298105 -338854 -113961 153420 105909 163672 25780 342793 -133361 -66911 157214 118201
5449 118201 211902 325970 330154 -8444 -129942 72998 90930 -69608 142879 -250525 -11752
5437 246518 216320 -237026 76267 45543 2005 48516 -153543 91526 -144442 157316 468917
5426 468917 278746 -342526 -289939 -45065 -112412 -16110 -104025 -60608 137393 5743 -88712
5414 288731 12644 -342033 -116329 -54078 232195 78842 -291017 -184934 266559 -463929
5403 -304841 130209 205339 -59426 -274449 -136296 -124866 -192595 90682 -167069 27934 218539
5392 218539 -123096 104981 -32632 18056 -188257 157983 414274 261824 -344100 -709462
5382 -709462 359468 -206735 -103175 249825 297691 33029 -31237 -7351 -80182 153023 -109491
5370 -109440 -26905 41165 299692 -8240 -293424 -9559 155979 -53911 265089 -287635 370012
5358 -224032 -49143 -5071 -371566 57797 193831 189803 74992 35966 -142331 -311885 37416
5346 23682 200098 -32777 -302149 -166185 264790 -46665 -149736 -77006 233080 195654 212600
5335 212600 -14741 245064 -41238 -239928 -273218 -53380 189683 -46799 56912 249291 74665
5323 70515 130083 -229197 -129028 115817 -163043 116504 -247909 11967 100498 -111630
5312 -85190 -148056 86733 269670 -276320 -46112 -75078 332433 152938 -292403 -208704 83247
5300 358213 -104038 -283705 71043 40378 -134606 -197322 50114 21961 83969 -130360 -120261
5289 -120261 -36884 342592 3652 -44792 107257 -379559 202067 165604 51285 114003 24381
5277 160921 -291806 253667 -159673 -33917 23473 -29989 -380102 220416 163809 197062 -137138
5265 -56570 259152 -101576 -277623 -238223 164079 128053 148717 -60220 -66981 74765 89905
5254 89905 -12125 -290457 72202 -376952 364827 191980 22104 161564 -4437 271951 -114854
5242 -31929 -62581 3072 -49414 59131 93562 159482 -143978 -112974 -151728 288585 -161081
5230 -104506 122540 -12299 402326 -181689 122971 62564 -46382 395191 145924 169870
5220 169870 74901 281739 -123828 13524 -59354 -69572 -185719 -82657 57967 163032 -273447
5208 16131 -251410 -372236 -20529 278921 307217 -83801 -15164 -96194 -350640 304285 -210585
5196 204702 -99590 -96775 92304 72871 -185847 -99600 -99323 31127 -66354 -41272 -146125 11482
5183 34182 1658 20980 -142648 -50395 -199640 175695 93459 316116 337299 54749 -133361
5171 -36938 73268 -131290 25498 294111 6174 -55146 -79240 -266104 -88793 125076 -126551
5159 17499 -378616 -205629 -87306 123234 -14768 63039 -162761 204846 -5540 211678 -54735
5147 20628 49378 264630 177250 260993 167503 -77707 269095 193570 60702 79565 84394 93275
5135 93275 155714 295101 -84095 29138 14015 183650 -114551 -86980 93159 -74881 -317648
5124 -317648 -176258 -206879 -66332 136394 -100061 -559 -108825 356229 -113700 12354 -110314
5112 45060 127887 105519 73057 -3705 38603 -109822 -103499 206818 196268 -159397 -70241 6010
5099 -83796 -108041 -104338 206599 -207327 -19367 -47208 -80116 135586 -147658 96316 -2417
5087 50533 -265778 1939 -271068 98377 -160895 16726 -218753 9693 -108918 32783 -210566
5075 1486 15830 253099 -80125 -121304 108588 -166126 253873 24760 -291045 130761 195955
5064 195955 145866 256005 -246644 157872 -356282 65974 -154548 112329 129603 18467
5053 120717 -67736 -5106 -296629 235149 5160 -47769 -87954 -18423 -208038 -14045 -126477
5042 -126477 190219 -481518 -53730 4982 134081 -191264 -103443 -4586 -124543 63455 -103419
5030 188176 302620 167428 1804 41879 -171631 147181 -10834 -53069 11246 328082 -76191
5018 28521 -82843 -47691 -192294 -78673 -48608 98415 -90385 140293 8260 -48805 120955
5006 -140753 -93990 -105344 -33307 128205 132303 -320888 -68117 -102918 -203262 149545 382833
4995 382833 -59962 23187 34882 38345 206505 -11964 -60563 36370 -27249 -206722 52897
4983 -1704 351484 -125610 380660 85193 119667 55121 94053 304545 -247562 28224 -227753
4971 250209 395046 -20720 33331 50981 -36777 -160282 -315707 -153521 -114760 -281897 -126145
4959 -22636 -135023 -81067 115828 -174300 315826 -25107 37756 130670 -34733 38321 -127410
4947 -27501 272497 344991 -290964 11089 105329 -30959 189011 77557 20721 -196306 208677
4935 -28303 82318 -211064 -128843 -25847 144659 144410 -38649 57998 163833 215188 35682 -176804
4922 85993 -100665 199518 -211188 178321 -153908 -46960 -59236 -316323 130303 108475
4912 108475 -26277 -56679 -29243 -150276 159446 71657 -223652 -122170 206558 156486 -206792
4900 136331 -153622 140175 -60829 -178681 117622 49311 -216520 133002 105830 -17705
4889 -374530 -256840 28272 -29977 55373 -370305 263035 110116 -977 15468 136192 474304
4878 474304 160589 128565 202372 211309 23659 -253414 104442 -47243 138682 20300 -36315
4866 -173719 -178291 104272 -118360 -300445 266035 175408 376958 152293 196700 -123046
4855 -287555 274076 7727 32224 255163 -31124 117812 51898 74652 -17630 50842 -249468
4843 -161242 59863 253080 230919 65419 172368 -333555 -159769 -29619 360351 57743 277551
4832 277551 -4442 -135849 179098 -87581 272272 356916 51871 214057 -94627 178167 -171526
4820 -46421 3923 124635 132587 -12637 207317 55 -473769 -124857 -87027 -29355 -212668 -121786
4808 -121786 93593 20765 -255069 105645 269948 -319023 -5730 -183455 138417 -53123 -36404
4797 -36404 -248253 446375 -30673 66029 -120427 68812 100770 -54467 -81664 -538018 -99224
4785 -473 61070 -38603 334651 68384 -79923 -92960 209967 -59152 -233574 -21951 -209247
4774 -209247 -109468 -167965 93324 -208332 258793 -170347 -111215 20491 133726 92414 448889
4763 448889 10043 131268 22931 226985 -283245 -299246 171881 -17957 62220 -147917 -264553
4752 -264553 -17294 -68458 226460 51087 83317 106000 157589 153151 -76977 -20188 268694
4740 -76234 -51097 2782 -129404 -55385 -8569 -23864 74668 286213 -56162 321983 -87928 281463
4727 -165454 -39859 -272798 -197876 -155452 141147 42952 265350 -77614 -365710 163132 -219733
4715 100667 479943 140012 -83665 -12991 -40753 -76828 128865 -4695 156159 -99467 -75225
4704 -75225 67222 -11974 -96954 -253282 198321 -53309 -189633 182401 -2988 34938 48229
4693 48229 -103218 -69427 112841 76797 771 -29674 -82898 -120857 183129 109168 -145663
4681 -95023 23015 79485 -45554 75346 245621 211962 -171664 -110596 138069 175233 -126460
4669 169243 -134519 27995 24725 -12901 264608 356700 201828 -174964 -7649 -84178 -114015
4658 -114015 -106199 -311152 134121 57612 -75942 -279657 -8710 86903 -65886 -42028 85886
4646 54729 201870 69965 -73465 60607 65098 45093 -115432 13681 -62267 -1230 -10618 228871
4633 123246 173335 175310 99686 -72541 -288999 -345606 140387 -230490 -101390 245106 90509
4621 18044 -6122 254917 -44170 38284 -66009 175431 119660 52849 -183507 -225495 -22179
4609 174354 13939 -195263 -34568 180297 214678 172033 57620 -62755 -151760 -154875 -154208 353281
4596 167373 100623 223857 -5078 90124 209899 179728 -207925 -70249 -238471 -318756 146557
4584 -94617 148454 63140 -178475 9021 -183253 38933 226067 -63758 329297 86540 219209
4573 219209 48847 365592 52380 91162 -110061 162195 -48999 71226 127825 -21322 97004
4561 116235 -181560 102163 31519 91465 -8163 80536 -114614 13636 -129029 -212070 -64573
4549 -167237 -86025 -399501 39938 256885 67875 172146 -33372 254266 275590 56677 478235
4538 478235 -306687 84726 394561 47064 -228040 -9856 -103221 37240 -168977 -271583 -257364
4527 -257364 424279 -42844 -198813 258321 9719 103013 -46280 -257509 8319 276484 -75219
4515 158779 97041 58082 132069 -30834 -303841 83638 316223 135796 235209 -426596 -116204
4503 -358780 226200 38953 140380 -184637 14205 185852 83207 -17212 -95181 23129 -309262
4491 -97776 270550 76176 -78677 129895 33997 -164999 355385 57776 -11000 177937 -77567
$$ [...]
##END NTUPLES=NMR SPECTRUM
##END=
