##TITLE=AC1708_ROEFFECT0029_8638261_155czoN6rI
##JCAMPDX= 6.0         $$ Bruker NMR JCAMP-DX V2.0
##DATA TYPE= NMR SPECTRUM
##DATA CLASS= NTUPLES
##ORIGIN= BRUKER
##OWNER= Administrator
$$ 1.72 TOPSPIN		Version 2.1
$$ 2014-05-23 02:14:48.845 -0700  Administrator@X
$$ Compression mode = diff/dup
##.OBSERVE FREQUENCY= 400.02188249412
##.OBSERVE NUCLEUS= ^1H
##.ACQUISITION MODE= SIMULTANEOUS (DQD)
##.ACQUISITION SCHEME= undefined
##.AVERAGES= 64
##.DIGITISER RES= 22
##SPECTROMETER/DATA SYSTEM= spect
##.PULSE SEQUENCE= noesygpps1d.comp
##.SOLVENT NAME= COFFEE_meoh
##.SHIFT REFERENCE= INTERNAL, COFFEE_meoh, 1, 14.96116
##AUDIT TRAIL= $$ (NUMBER, WHEN, WHO, WHERE, PROCESS, VERSION, WHAT)
$$ ##TITLE= Audit trail, TOPSPIN		Version 2.1
$$ ##JCAMPDX= 5.01
$$ ##ORIGIN= Bruker BioSpin GmbH
$$ ##OWNER= Administrator
$$ $$ E:\/data/COFFEE/nmr/AC1708_ROEFFECT0029_8638261_155czoN6rI/12/pdata/1/auditp.txt
$$ ##AUDIT TRAIL=  $$ (NUMBER, WHEN, WHO, WHERE, PROCESS, VERSION, WHAT)
(   1,<2014-05-23 02:14:43.985 -0700>,<Administrator>,<X>,<go>,<TOPSPIN 2.1>,
      <created by zg
	started at 2014-05-23 02:03:14.579 -0700,
	POWCHK enabled, PULCHK disabled,
       configuration hash MD5:
       C8 4E 4E 5D D3 5C D8 9E 9F 52 82 E0 59 8A DE 15
       data hash MD5: 64K
       15 60 82 6B D7 BD 13 C6 15 AD 5F 46 F4 44 AE 8D>)
(   2,<2014-05-23 02:14:46.907 -0700>,<Administrator>,<X>,<proc1d>,<TOPSPIN 2.1>,
      <Start of raw data processing
       efp LB = 0.3 FT_mod = 6 PKNL = 1 PHC0 = 0 PHC1 = 0 SI = 128K 
       data hash MD5: 128K
       C0 FA FE 13 32 3A 2C 2B C0 A8 44 A9 79 FA D8 B9>)
(   3,<2014-05-23 02:14:47.814 -0700>,<Administrator>,<X>,<proc1d>,<TOPSPIN 2.1>,
      <pk PHC0 = -85.50659 PHC1 = 0 
       data hash MD5: 128K
       9C 46 A4 87 26 C8 79 C2 C3 B7 A4 35 6F A0 17 D1>)
(   4,<2014-05-23 02:14:48.267 -0700>,<Administrator>,<X>,<proc1d>,<TOPSPIN 2.1>,
      <abs ABSG = 1 
       data hash MD5: 128K
       8B 12 9F 5B 42 41 B3 23 08 E6 9E B9 11 EA A7 A9>)
(   5,<2014-05-23 02:14:48.360 -0700>,<Administrator>,<X>,<proc1d>,<TOPSPIN 2.1>,
      <abs ABSG = 2 
       data hash MD5: 128K
       5A 76 DE 6D A7 C8 FA F4 25 1A 68 D9 10 79 8A 78>)
(   6,<2014-05-23 02:14:48.454 -0700>,<Administrator>,<X>,<proc1d>,<TOPSPIN 2.1>,
      <abs ABSG = 3 
       data hash MD5: 128K
       65 10 93 F7 A7 00 E8 EB C1 4E B3 9F 48 28 25 8F>)
(   7,<2014-05-23 02:14:48.548 -0700>,<Administrator>,<X>,<proc1d>,<TOPSPIN 2.1>,
      <abs ABSG = 4 
       data hash MD5: 128K
       66 66 7D 45 58 41 7A EE 43 ED 4A 8D EB 6B F2 52>)
(   8,<2014-05-23 02:14:48.642 -0700>,<Administrator>,<X>,<proc1d>,<TOPSPIN 2.1>,
      <abs ABSG = 5 
       data hash MD5: 128K
       77 F2 BA AB C4 8B 41 A5 9C 0E BF F5 0C 96 A3 F8>)
$$ ##END=
$$ 
$$ $$ hash MD5
$$ $$ 00 13 8B 1D 96 D8 BB BF 56 E3 66 E6 5F E9 8E 84
##$RELAX= 
##$RELAX= 
##$RELAX= 
##$RELAX= 
##$RELAX= 
##$RELAX= 
##$RELAX= 
##$RELAX= 
$$ Bruker specific parameters
$$ --------------------------
##$DU= <E:\>
##$EXPNO= 12
$$ [...]
##$TP07= 0
##$TPNAME0= <>
##$TPNAME1= <>
##$TPNAME2= <>
##$TPNAME3= <>
##$TPNAME4= <>
##$TPNAME5= <>
##$TPNAME6= <>
##$TPNAME7= <>
##$TPOAL= (0..7)
0.5 0.5 0.5 0.5 0.5 0.5 0.5 0.5
##$TPOFFS= (0..7)
0 0 0 0 0 0 0 0
##$TUNHIN= 0
##$TUNHOUT= 0
##$TUNXOUT= 0
##$USERA1= <user>
##$USERA2= <user>
##$USERA3= <user>
##$USERA4= <user>
##$USERA5= <user>
##$V9= 5
##$VALIST= <valist>
##$VCLIST= <CCCCCCCCCCCCCCC>
##$VD= 0
##$VDLIST= <DDDDDDDDDDDDDDD>
##$VPLIST= <PPPPPPPPPPPPPPP>
##$VTLIST= <TTTTTTTTTTTTTTT>
##$WBST= 2048
##$WBSW= 25
##$XGAIN= (0..3)
0 0 0 0
##$XL= 0
##$YL= 0
##$YMAX_a= 6029637
##$YMIN_a= -12863258
##$ZGOPTNS= <>
##$ZL1= 120
##$ZL2= 120
##$ZL3= 120
##$ZL4= 120
##$ABSF1= 14.96116
##$ABSF2= -5.597022
##$ABSG= 5
##$ABSL= 3
##$ALPHA= 0
##$AQORDER= 0
##$ASSFAC= 0
##$ASSFACI= 0
##$ASSFACX= 0
##$ASSWID= 0
##$AUNMP= <proc_prof1d_extract.lims>
##$AXLEFT= 0
##$AXNAME= <>
##$AXNUC= <1H>
##$AXRIGHT= 0
##$AXTYPE= 0
##$AXUNIT= <>
##$AZFE= 0.1
##$AZFW= 0.1
##$BCFW= 0
##$BC_mod= 0
##$BYTORDP= 0
##$COROFFS= 0
##$CY= 15
##$DATMOD= 1
##$DC= 0
##$DFILT= <>
##$DTYPP= 0
##$F1P= 0
##$F2P= 0
##$FCOR= 0.5
##$FTSIZE= 131072
##$FT_mod= 6
##$GAMMA= 0
##$GB= 0
##$INTBC= 1
##$INTSCL= 1
##$ISEN= 128
##$LB= 0.3
##$LEV0= 0
##$LPBIN= 0
##$MAXI= 10000
##$MC2= 0
##$MEAN= 0
##$ME_mod= 0
##$MI= 0
##$NCOEF= 0
##$NC_proc= -2
##$NLEV= 6
##$NOISF1= 0
##$NOISF2= 0
##$NSP= 0
##$NTH_PI= 0
##$NZP= 0
##$OFFSET= 14.96116
##$PC= 1
##$PHC0= -85.50659
##$PHC1= 0
##$PH_mod= 1
##$PKNL= yes
##$PPARMOD= 0
##$PPDIAG= 0
##$PPIPTYP= 0
##$PPMPNUM= 2147483647
##$PPRESOL= 1
##$PSCAL= 4
##$PSIGN= 0
##$PYNMP= <proc.py>
##$REVERSE= no
##$SF= 400.020009572032
##$SI= 131072
##$SIGF1= 0
##$SIGF2= 0
##$SINO= 400
##$SIOLD= 131072
##$SPECTYP= <>
##$SREGLST= <1H.CDCl3>
##$SSB= 0
##$STSI= 131072
##$STSR= 0
##$SW_p= 8223.68421052631
##$SYMM= 0
##$S_DEV= 0
##$TDeff= 65536
##$TDoff= 0
##$TI= <>
##$TILT= no
##$TM1= 0
##$TM2= 0
##$TOPLEV= 0
##$USERP1= <user>
##$USERP2= <user>
##$USERP3= <user>
##$USERP4= <user>
##$USERP5= <user>
##$WDW= 1
##$XDIM= 131072
##$YMAX_p= 396946184
##$YMIN_p= -11812
##$CURPLOT= <Network HP LaserJet P1505>
##$CURPRIN= <$Network HP LaserJet P1505>
##$DFORMAT= <normdp>
##$LAYOUT= <+/1D_H.xwp>
##$LFORMAT= <normlp>
##$PFORMAT= <normpl>
##$SURQMSG= 1
$$ End of Bruker specific parameters
$$ ---------------------------------
##NTUPLES= NMR SPECTRUM
##VAR_NAME=  FREQUENCY,     SPECTRUM/REAL,   SPECTRUM/IMAG
##SYMBOL=    X,             R,               I
##VAR_TYPE=  INDEPENDENT,   DEPENDENT,       DEPENDENT
##VAR_FORM=  AFFN,          ASDF,            ASDF
##VAR_DIM=   131072,        131072,          131072
##UNITS=     HZ,            ARBITRARY UNITS, ARBITRARY UNITS
##FACTOR=    0.0627417313425164, 1,          1
##FIRST=     8223.62146879497, 4592,         -62410
##LAST=      0,             6297,            -62177
##MIN=       0,             -11812,          0
##MAX=       8223.62146879497, 396946184,    0
$$ Real data points
##PAGE= N=1
##DATA TABLE= (X++(R..R)), XYDATA
$$ [...]
61521D58554j866j226r69p56l36Q0L60P40J395K090K509K727L127L917M911N851
$$ 458554 456688 455462 454493 453737 453401 453481 453841 454581 455976 458066 460575 463302 466429 470346 475257 481108
61505D81108O756P767Q641Q852Q438Q399R644J1698J3132J3347J3197J3620J4390
$$ 481108 487864 495631 504272 513124 521562 529961 539605 551303 564435 577782 590979 604599 618989
61492F18989J4700J4381J3744J2659J0602P633M588K146L45q52j043P1K026L843
$$ 618989 633689 648070 661814 674473 685075 692708 697296 699442 699787 698935 697892 697963 699989 703832
61478G03832M928N414N702N891N738N063M073L300L122L358L326K432O22j752
$$ 703832 708760 714174 719876 725767 731505 736568 740641 743941 747063 750421 753747 756179 756801 755049
61464G55049m388p166r886j2129j3544j4121j4073j3525j2497j1059r341p502
$$ 755049 750661 743495 733609 721480 707936 693815 679742 666217 653720 642661 633320 625818
61452F25818n736m246k939j394N39K302L245L592M176N239O165O623P094P796
$$ 625818 620082 615836 612897 611503 612042 614344 617589 621181 625357 630596 636761 643384 650478 658274
61438F58274P796O071L054K86j318k099k631k986l144l355l687l707k971j569
$$ 658274 666070 672141 675195 675481 674163 672064 669433 666447 663303 659948 656261 652554 649583 648014
61424F48014J01J811L492N015O211P001P362P291O822N899M233J604j565m230
$$ 648014 648115 649926 653418 658433 664644 671645 679007 686298 693120 699019 703252 704856 703291 699061
61410F99061n591n812n720n895o202o189n771n368n380n692n881n796n604n324
$$ 699061 693470 687658 681938 676043 669841 663652 657881 652513 647133 641441 635560 629764 624160 618836
61396F18836m810m279m274m793n094m726m189l968l563k346q52p8J40Q67K217
$$ 618836 614026 609747 605473 600680 595586 590860 586671 582703 579140 576794 575942 575864 576004 576871 579088
61381E79088L175L417L990N551P164P770P834Q457R497R775Q869P518O359N196
$$ 579088 582263 585680 589670 595221 602385 610155 617989 626446 635943 645718 654587 662105 668464 673660
61367F73660L724K079M09j457l425m785m918m220l789m193m843m734l611k184
$$ 673660 677384 679463 679872 678415 674990 670205 665287 661067 657278 653085 648242 643508 639897 637713
61353F37713j160m37N32J759K474J983M77j147k033j914j117k25L64O30O93M87
$$ 637713 636553 636116 636648 638407 640881 642864 643341 642194 640161 638247 637130 636905 637269 637899 638592 639079
61337F39079m2o13p93o28o44j117j702j978k011k060k026j552o32K43O43P25J096
$$ 639079 639037 638424 637631 637003 636359 635242 633540 631562 629551 627491 625465 623913 623281 623524 624167 624892 625988
61320F25988K119L439M348M623M768N312O127O748P114P579Q385R521J0992J2719
$$ 625988 628107 631546 635894 640517 645285 650597 656724 663472 670586 678165 686550 696071 707063 719782
61306G19782J4246J4986J4731J3580J1509Q613N582L216J425n43k827m714n835
$$ 719782 734028 749014 763745 777325 788834 797447 803029 806245 807670 807127 804300 799586 793751
61293G93751o808q253r874j0960j1289j1116j0727j0388j0237r932q916p296n822
$$ 793751 786943 778690 768816 757856 746567 735451 724724 714336 704099 694167 685251 677955 672133
61280F72133m764l599k239j468j461q85J277L771M320K624O86K17R73J946K828
$$ 672133 667369 663770 661531 660063 658602 657717 658994 662765 667085 669709 670395 670612 671585 673531 676359
61265F76359L687M243M359M665N798P272P933P417O513N969N578M794L778L340
$$ 676359 680046 684289 688648 693313 699111 706383 714316 721733 728246 734215 739793 744587 748365 751705
61251G51705L913N060O167P176Q328R571J0635J1507J2240J2316J0919Q024M668
$$ 751705 755618 760678 766845 774021 782349 791920 802555 814062 826302 838618 849537 857561 862229
61238H62229J791p35l504o424q607r209q052n622k804m31J301K807M384N737O464
$$ 862229 864020 863285 859781 853357 844750 835541 827489 821867 819063 818632 819933 822740 827124 832861 839325
61223H39325O703O943P442Q078Q479Q042O288L612J334M25L58k15j766l444m207
$$ 839325 846028 852971 860413 868491 876970 885012 891300 894912 896246 896671 897029 896814 895048 891604 887397
61208H87397l888l055k271j683j132m14M63J347K275L567N496P975J0598J2743
$$ 887397 883509 880454 878183 876500 875368 874954 875417 876764 879039 882606 888102 896077 906675 919418
61194I19418J3675J2963J0978Q640O504M524K701J364M88n36j981l159l362k935
$$ 919418 933093 946056 957034 965674 972178 976702 979403 980767 981255 980719 978738 975579 972217 969282
61180I69282k803l316m150n033n856o360o356o116o036o085o079o172o506o732
$$ 969282 966479 963163 959013 953980 948124 941764 935408 929292 923256 917171 911092 904920 898414 891682
61166H91682o564o424o745o924n988m140k715k369k260j280O34K785M689O363
$$ 891682 885118 878694 871949 865025 859037 854897 852182 849813 847553 846273 846907 849692 854381 860744
61152H60744P857Q929R126Q278O886N753M974L740J565q09k304k877l184l307
$$ 860744 868601 877530 886656 894934 901820 907573 912547 916287 917852 917043 914739 911862 908678 905371
61138I05371k745j567n19K5M10R77J736K804M274N607O059N809N838O542P367
$$ 905371 902626 901059 900540 900565 900975 901952 903688 906492 910766 916373 922432 928241 934079 940621 947988
61123I47988P905Q441R109R502R478R554J0075J0721J1239J1791J2299J2238J1593
$$ 947988 955893 964334 973443 982945 992423 1001977 1012052 1022773 1034012 1045803 1058102 1070340 1081933
61110A081933J1120J1121J0852R726Q260P088N830L796J132j684m836q573j2118
$$ 1081933 1093053 1104174 1115026 1124752 1133012 1140100 1145930 1149726 1150858 1149174 1144338 1135765 1123647
61097A123647j4360j5493j6816j8839k0563k0910k0048j8959j8294j8086j8058
$$ 1123647 1109287 1093794 1076978 1058139 1037576 1016666 996618 977659 959365 941279 923221
61086I23221j7838j7062j5668j3986j2413j1104j0065r438r363r629r654r013
$$ 923221 905383 888321 872653 858667 846254 835150 825085 815647 806284 796655 787001 777988
61074G77988p910o848n891m713l489l063l669m073k938p95N07L17k8O69J803K225
$$ 777988 770078 763230 757339 752626 749137 746074 742405 738332 735394 734599 735106 735423 735395 736064 737867 740092
61058G40092K180K813M329N788O591P177Q098R273J0329J1130J1717J2135J2547
$$ 740092 742272 745085 749414 755202 761793 768970 777068 786341 796670 807800 819517 831652 844199
61045H44199J3184J4069J4934J5534J5874J6117J6410J6758J7064J7294J7592
$$ 844199 857383 871452 886386 901920 917794 933911 950321 967079 984143 1001437 1019029
61034A019029J8103J8728J9341K0134K1389K2943K4388K5825K7821L0483L3185
$$ 1019029 1037132 1055860 1075201 1095335 1116724 1139667 1164055 1189880 1217701 1248184 1281369
61023A281369L5482L7615L9795M1718M3333M5459M9094N4583O1924P1094Q1594
$$ 1281369 1316851 1354466 1394261 1435979 1479312 1524771 1573865 1628448 1690372 1761466 1843060
61012A843060R2502J03757J16526J31304J46758J62049J79587K03606K36334K77729
$$ 1843060 1935562 2039319 2155845 2287149 2433907 2595956 2775543 2979149 3215483 3493212
61002C493212L29096L94585M78457N83144P10854Q63776J040244J233684J439238
$$ 3493212 3822308 4216893 4695350 5278494 5989348 6853124 7893368 9127052 10566290
60993A0566290J656623J873789K040726K069604J882713J477796R50051M44727
$$ 10566290 12222913 14096702 16137428 18207032 20089745 21567541 22517592 22962319
60985B2962319Q0674r2364q5368N2647K38619L55945K87711k0371n18346j074579
$$ 22962319 23042993 22950629 22865261 22917908 23156527 23512472 23800183 23779812 23261466 22186887
60975B2186887j547504j850364j969036j938996j812298j635952j443807j256198
$$ 22186887 20639383 18789019 16819983 14880987 13068689 11432737 9988930 8732732
60967H732732j083256r29168p95039o79878n81202m96233m22846l59687l05855
$$ 8732732 7649476 6720308 5925269 5245391 4664189 4167956 3745110 3385423 3079568
60958C079568k60629k23077j91788j65265j42709j24094j09175r6861q5867p5716
$$ 3079568 2818939 2595862 2404074 2238809 2096100 1972006 1862831 1765970 1680103 1604387
60948A604387o6741n9262n3141m8055m3875m0797l9173l9008l9431l9086l7483
$$ 1604387 1537646 1478384 1425243 1377188 1333313 1292516 1253343 1214335 1174904 1135818 1098335
60937A098335l5561l4383l3555l1778k8835k6007k4298k3113k1285j8710j6276
$$ 1098335 1062774 1028391 994836 963058 934223 908216 883918 860805 839520 820810 804534
60926H04534j4517j3116j1610j0057q848q202p989p906p742p469p004o112m804
$$ 804534 790017 776901 765291 755234 746386 738184 730195 722289 714547 707078 700074 693962 689158
60913F89158l674l281l241k619j400p31j344k416k756k491k705l704m700n103
$$ 689158 685484 682203 678962 676343 674943 674212 672868 670452 667696 665205 662500 658796 654096 648993
60899F48993n244n535n684n197m250l609l824m693n534n891n921o015o064n411
$$ 648993 643749 638214 632530 627333 623083 619474 615650 610957 605423 599532 593611 587596 581532 576121
60885E76121l756j764m10pk82j062k248l268l420k891k687l238l707l172k007
$$ 576121 572365 570601 570191 570184 569902 568840 566592 563324 559904 557013 554326 551088 547381 544209 542202
60870E42202j355j488j465n24P54J154L56p72j306j236j020p25n9Q46J328R62
$$ 542202 540847 539359 537894 537370 538124 539278 539634 538862 537556 536320 535300 534575 534516 535362 536690 537652
60854E37652M6q17j274j261q86m92m31o25p14p21j015j433j175j09N69k53k090
$$ 537652 537698 536881 535607 534346 533460 532968 532537 531912 531198 530477 529462 528029 526854 526745 527314 527061 524971
60837E24971l573m272m778n288n324m907m796n261n547n042m072l103k013q31
$$ 524971 521398 517126 512348 507060 501736 496829 492033 486772 481225 476183 472111 469008 466995 466164
60823D66164l47j066k120k195j316p01r68j442j415j159j235j511j467j105r18
$$ 466164 465817 464751 462631 460436 459120 458419 457451 456009 454594 453435 452200 450689 449222 448117 447199
60808D47199j093j336j454j638k009k288k146j659j183r19p75n84k83Ko6p47j700
$$ 447199 446106 444770 443316 441678 439669 437381 435235 433576 432393 431474 430699 430115 429832 429834 429768 429021 427321
60791D27321k052j361l41o2n39p59k13L91K52l89q34j127j830k860l319k623j194
$$ 427321 425269 423908 423567 423505 422966 422207 421994 422385 422637 422248 421414 420287 418457 415597 412278 409655 408461
60774D08461R5P07N26l76j673k700k766j697o5J208J622J554J766K461L083L197
$$ 408461 408556 409263 409789 409413 407740 405040 402274 400577 400512 401720 403342 404896 406662 409123 412206 415403
60758D15403L056L037K919K245J199M61L01L35K24J09K24N33R30J465K185K939
$$ 415403 418459 421496 424415 426660 427859 428320 428621 428956 429180 429289 429513 430046 430976 432441 434626 437565
60742D37565L452L425K620J042r11k654l695l732k774j448p57j053j549j363p36
$$ 437565 441017 444442 447062 448104 447193 444539 440844 437112 434338 432890 432133 431080 429531 428168 427432
60727D27432m74n39j44P46J084K77q72j365j359j664k385k865k666j946j018j89
$$ 427432 426958 426419 426275 427021 428105 428382 427510 426145 424786 423122 420737 417872 415206 413260 412242 412053
60711D12053O2o30j881k699k481j610r28q06r38r08p16o56p90p65l10K40K00o38
$$ 412053 412115 411485 409604 406905 404424 402814 401886 401080 400142 399234 398518 397862 397072 396307 395997 396237 396437 395799
60693C95799j675k078j587o35J49N11O41Q60J213J468J484J376J260J059Q36R83
$$ 395799 394124 392046 390459 389824 389973 390484 391125 391985 393198 394666 396150 397526 398786 399845 400681 401664
60677D01664J829L099M201M860N133M979M349L568L064K689J851M51q85j698k235
$$ 401664 403493 406592 410793 415653 420786 425765 430114 433682 436746 439435 441286 441737 440852 439154 436919
60662D36919k843l349l350k766j759n20N70R63N11k51o72n83j37N44J237J501
$$ 436919 434076 430727 427377 424611 422852 422332 422902 423865 424376 424125 423453 422870 422733 423277 424514 426015
60646D26015J152O25M31M99M22Q5l73r64j644j946j453n95l49r53j482j072j05
$$ 426015 427167 427792 428223 428722 429144 429229 428856 427892 426248 424302 422849 422254 421905 420952 419470 418398 418293
60629D18293L11k14r09r35m41k06n06q04o10j41J23J85L75P16R35R98J125J295
$$ 418293 418604 418390 417481 416546 416105 415899 415393 414589 413979 413838 413961 414146 414521 415237 416172 417170 418295 419590
60611D19590J243J017R74J097R36L82k3J21N31Q33J124J507J601J147O55P84J354
$$ 419590 420833 421850 422824 423921 424857 425239 425216 425337 425868 426701 427825 429332 430933 432080 432735 433519 434873
60594D34873J628J402J035O67J20l53q6J037K256K866K909K714K242J394N52L06
$$ 434873 436501 437903 438938 439605 439725 439372 439286 440323 442579 445445 448354 451068 453310 454704 455256 455562
60578D55562P46J417J915K263K625K970L130L096L156L580M256M774M979N214
$$ 455562 456308 457725 459640 461903 464528 467498 470628 473724 476880 480460 484716 489490 494469 499683
60564D99683N814O550O943O977P006O963O211M473K427R88L03j35n60p28m72L8
$$ 499683 505497 512047 518990 525967 532973 539936 546147 550620 553047 554035 554338 554203 553643 552915 552443 552481
60548E52481P33J818L209M255M426M108M233N210O592P866R086J0586J2399J4279
$$ 552481 553214 555032 558241 562496 566922 571030 575263 580473 587065 594931 604017 614603 627002 641281
60534F41281J6067J7820J9541K1034K2008K2157K1204J8986J5496J0827N234p13
$$ 641281 657348 675168 694709 715743 737751 759908 781112 800098 815594 826421 831655 830942
60522H30942o226j0761j4263j6756j7955j7575j5944j3974j2366j1089r613p589
$$ 830942 824716 813955 799692 782936 764981 747406 731462 717488 705122 694033 684420 676831
60510F76831n336l712l284l479k833m79K873N905Q350J1050J4472J8053K1177
$$ 676831 671495 667783 664499 661020 658187 657708 660581 666486 674836 685886 700358 718411 739588
60497G39588K4061K7141L0188L2620L4358L5716L6604L6465L5077L2969L0901
$$ 739588 763649 790790 820978 853598 887956 923672 960276 996741 1031818 1064787 1095688
60486A095688K9138K7482K5763K4066K2364K0113J6475J1010M018l993j2854k2478
$$ 1095688 1124826 1152308 1178071 1202137 1224501 1244614 1261089 1272099 1276117 1272124 1259270 1236792
60474A236792l2186m0729m7032n0683n1801n0930m9006m6816m4345m1046l6895
$$ 1236792 1204606 1163877 1116845 1066162 1014361 963431 914425 867609 823264 782218 745323
60463G45323l2647k8920k5567k2319j9454j7413j6083j4924j3558j1946j0268
$$ 745323 712676 683756 658189 635870 616416 599003 582920 567996 554438 542492 532224
60452E32224q870q006p396o438n110m095l664l103j867o70n34j165j308n82O3
$$ 532224 523354 515348 507952 501514 496404 492309 488645 485542 483675 483005 482471 481306 479998 479416 479479
60437D79479j53p98j047p86m51k98l07m61p18r01r15r10r64q50l40M08R84J165
$$ 479479 479326 478528 477481 476695 476244 475946 475639 475178 474460 473559 472644 471734 470770 469920 469580 469988 470972 472137
60419D72137J089J088J468K274L116L369K740J620P57O13J124K001L016L915M274
$$ 472137 473226 474314 475782 478056 481172 484541 487281 488901 489658 490271 491395 493396 496412 500327 504601
60404E04601L798K813K207K584L596M353M423M136M011M241M792N523O065O022
$$ 504601 508399 511212 513419 516003 519599 523952 528375 532511 536522 540763 545555 551078 557143 563165
60390E63165N486N028M912M750M236L729L702L963M044L986M106M209L768K900
$$ 563165 568651 573679 578591 583341 587577 591306 595008 598971 603015 607001 611107 615316 619084 621984
60376F21984K383K573K915K800K434K389K680K670J872O07k46p2Q50J634J755
$$ 621984 624367 626940 629855 632655 635089 637478 640158 642828 644700 645307 645061 644989 645839 647473 649228
60361F49228J597J889K840M043N055N669N842N725N706O008O304O104N464M859
$$ 649228 650825 652714 655554 659597 664652 670321 676163 681888 687594 693602 699906 706010 711474 716333
60347G16333M429L859K963J863N11j289l245m618n209n662o417o947o665o051
$$ 716333 720762 724621 727584 729447 729958 728669 725424 720806 715597 709935 703518 696571 689906 683855
60333F83855o081o741o983o247n253m970n356n603n308m841m593m366l703k607
$$ 683855 677774 671033 664050 657803 652550 647580 642224 636621 631313 626472 621879 617513 613810 611203
60319F11203j586j013o97j69Q01K051L345M631O019P574R079R990R837Q756P483
$$ 611203 609617 608604 607907 607738 608539 610590 613935 618566 624585 632159 641238 651228 661065 669821 677304
60304F77304O597N975N292M901N637P609R590R980Q195M918J168k547o182r599
$$ 677304 683901 689876 695168 700069 705706 713315 722905 732885 741080 745998 747166 744619 738437 728838
60290G28838j2298j3759j3969j3478j2824j1989j0672q947p333o161n288m624
$$ 728838 716540 702781 688812 675334 662510 650521 639849 630902 623569 617408 612120 607496
60278F07496m546n377o612p191o608n417m526m301m400m249l494k275j243j060
$$ 607496 602950 597573 590961 583770 577162 571745 567219 562918 558518 554269 550775 548500 547257 546197
60264E46197j577j746p02J114K375K333J513Q91Q57J178J558J807J772J504J383
$$ 546197 544620 542874 542172 543286 545661 547994 549507 550398 551255 552433 553991 555798 557570 559074 560457
60249E60457J743K395K797K631K012J287Q26Q60J197J251O73j03l54P1O93J147
$$ 560457 562200 564595 567392 570023 572035 573322 574148 575008 576205 577456 578129 578026 577672 577743 578436 579583
60233E79583J539K089K820L633M420N120N894P063Q545R645R897R867J0466J1665
$$ 579583 581122 583211 586031 589664 594084 599204 605098 612161 620706 630351 640248 650115 660581 672246
60219F72246J2618J2967J3061J3007J2474J1654J1399J2016J2776J3028J2893
$$ 672246 684864 697831 710892 723899 736373 748027 759426 771442 784218 797246 810139
60208H10139J2553J1779J0774J0479J1271J2185J2245J1834J1822J2047J1691
$$ 810139 822692 834471 845245 855724 866995 879180 891425 903259 915081 927128 938819
60197I38819J0556R028P174M913K666Q99o27k254l473l687l456l841m664m766
$$ 938819 949375 958403 965577 970490 973156 974055 973428 971174 967701 964014 960558 956717 952053 947287
60183I47287l893l057k903k931k609k182j943j697j344j213j343j165k82R18J736
$$ 947287 943394 940337 937434 934503 931894 929712 927769 926072 924728 923515 922172 921007 920725 921643 923379
60168I23379J691N31j600l878n362o075o816p832q445q228p563o736n380l406
$$ 923379 925070 925601 924001 920123 914761 908686 901870 894038 885593 877365 869802 863066 857686 854280
60154H54280j635q03n31Q7J183K057K121J443N22j61n05q13j284j509r59J49R82
$$ 854280 852645 851842 851311 851398 852581 854638 856759 858202 858724 858563 858058 857245 855961 854452 853493 853642 854624
60137H54624J225J429K118L177M260N180N762N923O009O308O185M652J999j27
$$ 854624 855849 857278 859396 862573 866833 872013 877775 883698 889707 896015 902200 906852 908851 908724
60123I08724o69j79N00J462K950M406N241N808O688P633Q089Q167Q224Q046P413
$$ 908724 908055 907876 908376 909838 912788 917194 922435 928243 934931 942564 950653 958820 967044 975090 982503
60108I82503O848O819O662N482L760K873L198L820M033L958L620K658J284M90
$$ 982503 989351 996170 1002832 1008314 1012074 1014947 1018145 1021965 1025998 1029956 1033576 1036234 1037518 1038008
60094A038008O94J021M11j117k873m588o467q492j0249j1404j1945j1969j1545
$$ 1038008 1038702 1039723 1040134 1039017 1036144 1031556 1025089 1016597 1006348 994944 982999 971030 959485
60081I59485j0817j0076r502q919p944o526n316n175o310q042r443j0058r988
$$ 959485 948668 938592 929090 920171 912227 905701 900385 895210 888900 880858 871415 861357 851369
60068H51369r631r417r424r146q095o675n885n993o094n403m319l738l844m220
$$ 851369 841738 832321 822897 813751 805656 798981 793096 787103 781009 775606 771287 767549 763705 759485
60054G59485m591m740m140k555p67J55K13L71J142K050K534K642K711K925L287
$$ 759485 754894 750154 746014 743459 742692 742847 743060 743431 744573 746623 749157 751799 754510 757435 760722
60039G60722L575L349K512J758J752J978J228n94k112k280j776j974l162m392
$$ 760722 764297 767646 770158 771916 773668 775646 776874 776280 774168 771888 770112 768138 764976 760584
60025G60584m873m789m800n192n632n543m692l529k913l345m547n717o159n707
$$ 760584 755711 750922 746122 740930 735298 729755 725063 721534 718621 715276 710729 705012 698853 693146
60011F93146m724l824l407l326l137k660k200k197k742l487l962l980l731l420
$$ 693146 688422 684598 681191 677865 674728 672068 669868 667671 664929 661442 657480 653500 649769 646349
59997F46349k811j453N50K350L225L398L610M129M682N224O095P346Q396Q664
$$ 646349 643538 642085 642635 644985 648210 651608 655218 659347 664029 669253 675348 682694 691090 699754
59983F99754Q150P226O175N143M255L440K362Q05r00k044k189j607j067j185j895
$$ 699754 707904 715130 721305 726448 730703 734143 736505 737310 736410 734366 732177 730570 729503 728318 726423
59968G26423k485k249j105L86J589K295K723L223L970M869N621N884N422M247
$$ 726423 723938 721689 720584 720970 722559 724854 727577 730800 734770 739639 745260 751144 756566 760813
59954G60813K667J094k78j498k419k590j927j267j578k557k763j404N16J362P46
$$ 760813 763480 764574 764296 762798 760379 757789 755862 754595 753017 750460 747697 746293 746809 748171 748917
59939G48917j91j59J162L112M737N517N774O321P516Q820R469R306Q696P977P261
$$ 748917 748726 748567 749729 752841 757578 763095 768869 775190 782706 791526 800995 810301 818997 826974 834235
59924H34235O579N866N090M606M969O159P401Q201R044J0494J2133J3158J3577
$$ 834235 840814 846680 851770 856376 861345 867504 874905 883106 892150 902644 914777 927935 941512
59911I41512J3897J3867J2531R651O191L180P84j328l397n611q070j0459j2223
$$ 941512 955409 969276 981807 991458 997649 1000829 1001613 1000285 996888 991277 983207 972748 960525
59898I60525j3256j3923j4251j3699j2044r932q116o626n078l414j897n58Q04
$$ 960525 947269 933346 919095 905396 893352 883420 875304 868678 863600 860186 858289 857731 858535
59885H58535K285L778N216O539P515P953Q060Q339Q976R544R466Q713P848P354
$$ 858535 860820 864598 869814 876353 883868 891821 899881 908220 917196 926740 936206 944919 952767 960121
59871I60121P133O812O290N713N081M307L528K837J816J02j518j508M12K553L257
$$ 960121 967254 974066 980356 986069 991150 995457 998985 1001822 1003638 1003740 1002222 1000714 1001126 1003679 1006936
59856A006936K834K688L109L056J793m04k994n543p308p529o346m585k595j22
$$ 1006936 1009770 1012458 1015567 1018623 1020416 1020012 1017018 1011475 1004167 996638 990292 985707 983112 982990
59842I82990K592M638N587N852N631M574K951K075K851M584O069P110Q139Q883
$$ 982990 985582 990220 995807 1001659 1007290 1011864 1014815 1016890 1019741 1024325 1030394 1037504 1045643 1054526
59828A054526Q395O285L236L93j254j185L89K635M962P603J0978J4713J7767J9329
$$ 1054526 1062921 1069206 1072442 1072835 1071581 1070396 1070785 1073420 1078382 1085985 1096963 1111676 1129443 1148772
59814A148772J9159J7272J3919R803N731J991j533m553o273o308n403m881n494
$$ 1148772 1167931 1185203 1199122 1208925 1214656 1216647 1215114 1210561 1204288 1197980 1192577 1187696 1182202
59801A182202o972q621j0133j1692j3356j4665j5048j4543j3761j3165j2636j1913
$$ 1182202 1175230 1166609 1156476 1144784 1131428 1116763 1101715 1087172 1073411 1060246 1047610 1035697
59789A035697j1122j0658j0687j1028j1435j1795j2047j2012j1430j0230q706
$$ 1035697 1024575 1013917 1003230 992202 980767 968972 956925 944913 933483 923253 914547
59778I14547p299o092m728k989j170L29J591K909M154M877N034N129N585O405
$$ 914547 907248 901156 896428 893439 892269 892598 894189 897098 901252 906129 911163 916292 921877 928282
59764I28282P403Q355Q914Q987R192J0388J2517J4504J5563J6027J6593J7249
$$ 928282 935685 944040 952954 961941 971133 981521 994038 1008542 1024105 1040132 1056725 1073974
59752A073974J7453J6940J5815J4109J1842R455P643O576N623M051J846l23j977
$$ 1073974 1091427 1108367 1124182 1138291 1150133 1159588 1167231 1173807 1179430 1183481 1185327 1185004 1183027
59739A183027l371m982o618p570p719p829q354q620p877o614n841n429m398k808
$$ 1183027 1179656 1174674 1168056 1160486 1152767 1144938 1136584 1127964 1120087 1113473 1107632 1102203 1097805 1094997
59725A094997j972k461l192l140k838l229m034m315m068m019m132l521j802M30
$$ 1094997 1093025 1090564 1087372 1084232 1081394 1078165 1074131 1069816 1065748 1061729 1057597 1054076 1052274 1052704
59711A052704K579M724P062R403J1462J3293J5140J7189J9490K1874K3858K5043
$$ 1052704 1055283 1060007 1067069 1076472 1087934 1101227 1116367 1133556 1153046 1174920 1198778 1223821
59699A223821K5581K5989K6448K6617K6264K5656K5085K4284K2613J9830J6468
$$ 1223821 1249402 1275391 1301839 1328456 1354720 1380376 1405461 1429745 1452358 1472188 1488656
59688A488656J3385J1005R037O942M487J841p31l118n304p314r183j0860j2172
$$ 1488656 1502041 1513046 1522083 1529025 1533512 1535353 1534622 1531504 1526200 1518886 1509703 1498843 1486671
59675A486671j3050j3662j4122j4195j3537j2165j0374q326o051l760j598Q10
$$ 1486671 1473621 1459959 1445837 1431642 1418105 1405940 1395566 1387240 1381189 1377429 1375831 1376641
59663A376641M004P825J1446J4366J6765J8802K0168K0657K0516J9931J8714J6872
$$ 1376641 1380645 1388470 1399916 1414282 1431047 1449849 1470017 1490674 1511190 1531121 1549835 1566707
59651A566707J4824J2593R298M143k417r114j5232k0964k6526l1584l5589l8294
$$ 1566707 1581531 1594124 1603422 1607565 1605148 1596034 1580802 1559838 1533312 1501728 1466139 1427845
59639A427845l9749l9977l8820l6112l2146k7855k4217k1552j9652j8531j8434
$$ 1427845 1388096 1348119 1309299 1273187 1241041 1213186 1188969 1167417 1147765 1129234 1110800
59628A110800j9084j9671j9899k0442k1870k3671k4828k4907k4088k2521k0271
$$ 1110800 1091716 1072045 1052146 1031704 1009834 986163 961335 936428 912340 889819 869548
59617H69548j7645j5016j2416r727p143n120l933l434l078k129l63J323J635N41
$$ 869548 851903 836887 824471 814744 807601 802481 798548 795114 792036 789907 789544 790867 792502 793043
59603G93043l98J51J714K772K570J546L89m84q09n70j12L33J029K083K791K306
$$ 793043 792645 792796 794510 797282 799852 801398 801787 801303 800494 799924 799812 800145 801174 803257 806048 808354
59587H08354P59q77j982k720l394m071m758n485o109o489o791p293p977q557q727
$$ 808354 809113 808236 806254 803534 800140 796069 791311 785826 779717 773228 766437 759144 751167 742610 733883
59572G33883q122o453m151k425k032k322k097j126j18M80Q35J016Q09K90r1j00
$$ 733883 725761 719308 715157 712732 710700 708378 706281 705155 705037 705517 706352 707368 708177 708467 708376 708276
59556G08276J43O37J498K507L287L940M951O336P442P739P449P284P964R828J2474
$$ 708276 708419 709056 710554 713061 716348 720288 725239 731575 739017 746756 754205 761489 769453 779281 791755
59541G91755J4782J5857J6004J6378J7715J9767K1789K2935K2234J8907J3136
$$ 791755 806537 822394 838398 854776 872491 892258 914047 936982 959216 978123 991259
59530I91259O315L05l584n195n411n336n342n104m564m308m703n467o449q032
$$ 991259 997574 997879 994295 989100 983689 978353 973011 967907 963343 959035 954332 948865 942416 934384
59516I34384j0063j1365j1344j1151j1981j2950j2325j0397r149r226r211q260
$$ 934384 924321 912956 901612 890461 878480 865530 853205 842808 833659 824433 815222 806962
59504H06962p374p303p052n660l978l211k827j407J070L267M432N005N545O168
$$ 806962 799588 792285 785233 779573 775595 772384 769557 768150 769220 772487 776919 781924 787469 793637
59490G93637P035Q381R913J0958J1263J1066J0435R175P485N998N024M228L305
$$ 793637 800672 809053 818966 829924 841187 852253 862688 871863 879348 885346 890370 894598 897903
59477H97903K542K408K791K870J856k05k364l610l749l394l166l218l511m033
$$ 897903 900445 902853 905644 908514 910370 910165 907801 904191 900442 897048 893882 890664 887153 883120
59463H83120m510m348l237j617k02Q47J933L352M893O171P026P480P435O742N549
$$ 883120 878610 874262 871025 869408 869206 870053 871986 875338 880231 886402 893428 900908 908343 915085 920634
59448I20634M388L576K707J131j034k951m226n442p054q426q676p950p093o367
$$ 920634 925022 928598 931305 932436 931402 928451 924225 918783 911729 903303 894627 886677 879584 873217
59434H73217n499m737m702n160m959l617k030j242j151q80J98K142M636P030Q769
$$ 873217 867718 862981 858279 853119 848160 844543 842513 841271 840120 839240 839438 841580 846216 853246 862015
59419H62015R986J1370J3282J5416J7392J9128K0651K2242K4542K7512K9173K6697
$$ 862015 872001 883371 896653 912069 929461 948589 969240 991482 1016024 1043536 1072709 1099406
59407A099406J9390R708R03n369q717q814n766q46M425R491J4068J6727J5437
$$ 1099406 1118796 1128504 1129407 1124038 1115321 1106507 1100741 1099895 1104320 1113811 1127879 1144606 1160043
59394A160043R558N66r087j7206k2413k4500k4303k2739k0034j6253j2066q274
$$ 1160043 1169601 1170167 1161080 1143874 1121461 1096961 1072658 1049919 1029885 1013632 1001566 993292
59382I93292n029k252l56L43N85J466K974M191M859N640O767P573P653P549P829
$$ 993292 988263 986011 985655 985998 986583 988049 991023 995214 1000073 1005713 1012480 1020053 1027706 1035255 1043084
59367A043084Q247Q304Q013P701P514P483P646P812P647P280P361Q251R530J0678
$$ 1043084 1051331 1059635 1067648 1075349 1082863 1090346 1097992 1105804 1113451 1120731 1128092 1136343 1145873 1156551
59353A156551J1819J3425J5503J7453J8653J9021J9102J9695K1082K2572K2990
$$ 1156551 1168370 1181795 1197298 1214751 1233404 1252425 1271527 1291222 1312304 1334876 1357866
59342A357866K1847J9691J7276J4715J1700Q215M666J380j720m889q180j1328
$$ 1357866 1379713 1399404 1416680 1431395 1443095 1451310 1455976 1457356 1455636 1450747 1442567 1431239
59330A431239j3964j5925j7295j8223j8876j9597k0800k2422k3723k4013k3376
$$ 1431239 1417275 1401350 1384055 1365832 1346956 1327359 1306559 1284137 1260414 1236401 1213025
59319A213025k2351k1107j9470j7689j6449j5967j5673j5142j4796j5202j6044
$$ 1213025 1190674 1169567 1150097 1132408 1115959 1099992 1084319 1069177 1054381 1039179 1023135
59308A023135j6311j5410j3691j1925j0633r865r268q229o245l346r8K887N386
$$ 1023135 1006824 991414 977723 965798 955165 945300 936032 927803 921558 918212 918114 921001 926387
59295I26387P517R439J1172J2583J3302J2607R786M892q07n497q089q697p972
$$ 926387 933904 943343 954515 967098 980400 993007 1002793 1007685 1006878 1001381 993292 984595 976623
59282I76623o375m307k344p83Q89L350O307Q649R882J0702J1885J3229J4092J4439
$$ 976623 970248 965941 963597 962814 963703 967053 973360 982009 991891 1002593 1014478 1027707 1041799 1056238
59268A056238J4619J4510J3741J2604J1837J1349J0065P488M616K661J426k10
$$ 1056238 1070857 1085367 1099108 1111712 1123549 1134898 1144963 1152451 1157067 1159728 1161154 1160944
59256A160944k504m506n482n887o584p744q873r630j0192j0949j2080j3288j3907
$$ 1160944 1158440 1153934 1148452 1142565 1135981 1128237 1119364 1109734 1099542 1088593 1076513 1063225 1049318
59243A049318j3521j2449j1373j0496r527q515q063q395q863q799q382q130p997
$$ 1049318 1035797 1023348 1011975 1001479 991952 983437 975374 966979 958116 949317 940935 932805 924808
59230I24808p601p058o856p086p394p629p882p986p559o639n707n047m550m149
$$ 924808 917207 910149 903293 896207 888813 881184 873302 865316 857757 851118 845411 840364 835814 831665
59216H31665l868l450k485j071K08J053J689K215K328J958J679K078L061M093
$$ 831665 827797 824347 821862 820791 820999 822052 823741 825956 828284 830242 831921 833999 837060 841153
59202H41153M798N129N238N452O095P139Q204R026R705J0413J1137J1812J2405
$$ 841153 845951 851080 856318 861770 867865 875004 883208 892234 901939 912352 923489 935301 947706
59189I47706J2781J2727J2194J1245R861Q044O037M017J648j489n073q166j0267
$$ 947706 960487 973214 985408 996653 1006514 1014558 1020595 1024612 1026260 1024771 1019698 1011532 1001265
59176A001265j1646j2647j3302j3738j4243j4624j4124j2406j0135q281p211o655
$$ 1001265 989619 976972 963670 949932 935689 921065 906941 894535 884400 876119 868908 862253
59164H62253o083m948l132j325m09k97n3O71J213J229J467K575M003M803M850
$$ 862253 856170 851222 848090 846765 846356 846059 846006 846677 847890 849119 850586 853161 857164 861967 866817
59149H66817M444L394J399j064l257n231p482r804j1338j1705j1266j0364r064
$$ 866817 871261 874655 876054 874990 871733 866502 859020 849216 837878 826173 814907 804543 795479
59136G95479p606o358n258l896k193m76J110K659M029M982N780P036Q755J0143
$$ 795479 787873 781515 776257 772361 770168 769692 770802 773461 777490 782472 788252 795288 804043 814186
59122H14186J0668J0778J1191J1782J1768J0887R969R952J0589J0552R067O996
$$ 814186 824854 835632 846823 858605 870373 881260 891229 901181 911770 922322 931389 938385
59110I38385N751N450M892L411J734P54L24j14m96n93q99k080l767m822m812m430
$$ 938385 944136 949586 954478 957889 959623 960377 960701 960587 960091 959498 958599 956519 952752 947930 943118 938688
59094I38688m423m728m873m676m311l912l356k367r75J01k7j305k580k976k934
$$ 938688 934265 929537 924664 919988 915677 911765 908409 906042 905067 905168 905141 903836 901256 898280 895346
59079H95346l379m289m789m400l546k901k802l184l579l355k523k065k836m370
$$ 895346 891967 887678 882889 878489 874943 872042 869240 866056 862477 859122 856599 854534 851698 847328
59065H47328n445n715n949o672p464p814p861p880p672o945n976n376n287n156
$$ 847328 841883 836168 830219 823547 816083 808269 800408 792528 784856 777911 771935 766559 761272 756116
59051G56116m310k631o56Q77J573J514J078P33Q24J232J353R13O02J311K761L729
$$ 756116 751806 749175 748519 749396 750969 752483 753561 754294 755118 756350 757703 758616 759218 760529 763290 767019
59035G67019L689L342L225K970K492K792M548O803Q212Q910R977J1646J3256J4559
$$ 767019 770708 774050 777275 780245 782737 785529 790077 796880 805092 814002 823979 835625 848881 863440
59021H63440J5668J5924J4287J0924P216L964P97k481n203o911q070r106r589
$$ 863440 879108 895032 909319 920243 927459 931423 932220 929739 924536 917625 909555 900449 890860
59008H90860q941p352n437l511j605J73J670K819L547L878M107M440M521L878
$$ 890860 881919 874567 869130 865619 864014 864187 865857 868676 872223 876101 880208 884648 889169 893047
58994H93047K797K103K085K225K064J678J254Q94R25J684K856L799M671O451R518
$$ 893047 895844 897947 900032 902257 904321 905999 907253 908147 909072 910756 913612 917411 922082 928533 938051
58979I38051J2889J5377J6886J8182J9817K1711K3379K4192K3618K1541J8284
$$ 938051 950940 966317 983203 1001385 1021202 1042913 1066292 1090484 1114102 1135643 1153927
58968A153927J4338J0257O561L352J59l372o756r241j0849j2215j3594j4745j5724
$$ 1153927 1168265 1178522 1185083 1188435 1188594 1185222 1178466 1169225 1158376 1146161 1132567 1117822 1102098
58955A102098j6836j7857j8268j8297j8750j9582j9664j8377j6470j4866j3470
$$ 1102098 1085262 1067405 1049137 1030840 1012090 992508 972844 954467 937997 923131 909661
58944I09661j1802j0024q603p445o046m260k392p60N25J531K496L556M430M721
$$ 909661 897859 887835 879232 871787 865741 861481 859089 858329 858854 860385 862881 866437 870867 875588
58930H75588M491M058L326K000M57m52o44j000j924k574k070p16N55J458K425
$$ 875588 880079 884137 887463 889463 889920 889468 888824 887824 885900 883326 881256 880540 881095 882553 884978
58915H84978L810N565P449R183J0574J1692J2648J3171J2935J2338J2332J3208
$$ 884978 888788 894353 901802 910985 921559 933251 945899 959070 972005 984343 996675 1009883
58903A009883J4247J4781J4922J4932J4581J3709J2801J2443J2611J2900J3120
$$ 1009883 1024130 1038911 1053833 1068765 1083346 1097055 1109856 1122299 1134910 1147810 1160930
58892A160930J3291J3474J3969J5245J7248J9181K0337K0819K1180K1688K2269
$$ 1160930 1174221 1187695 1201664 1216909 1234157 1253338 1273675 1294494 1315674 1337362 1359631
58881A359631K2701K2615K1666K0003J8181J6448J4421J1705Q291M295j94m813
$$ 1359631 1382332 1404947 1426613 1446616 1464797 1481245 1495666 1507371 1515662 1519957 1519763 1514950
58869A514950r014j2611j5782j8402k0058k0823k1345k1919k2208k2030k1716
$$ 1514950 1505936 1493325 1477543 1459141 1439083 1418260 1396915 1374996 1352788 1330758 1309042
58858A309042k1438k0897k0015j9152j8392j7345j5984j4871j4274j3884j3741
$$ 1309042 1287604 1266707 1246692 1227540 1209148 1191803 1175819 1160948 1146674 1132790 1119049
58847A119049j4467j6125j7811j8937j9912k1006k1547k1108k0431k0202j9713
$$ 1119049 1104582 1088457 1070646 1051709 1031797 1010791 989244 968136 947705 927503 907790
58836I07790j7899j5087j2598j1003r791q498p186n944m713l571k620j715p70
$$ 907790 889891 874804 862206 851203 841412 832914 825728 819784 815071 811500 808880 807165 806395
58823H06395L3O82J633L070M395N046N338N898O636O911O467N610M769M278M212
$$ 806395 806428 807110 808743 811813 816208 821254 826592 832490 839126 846037 852504 858114 862883 867161 871373
58808H71373M020K842O23j639l206m438n828o906o975o248n434m670l680k555
$$ 871373 875393 878235 878858 877219 874013 869575 863747 856841 849866 843618 838184 833514 829834 827279
58794H27279j546n00P94K052L077M406O581R125J1089J2339J3504J4937J6473
$$ 827279 825733 825233 826027 828079 831156 835562 842143 851268 862357 874696 888200 903137 919610
58781I19610J7922J9131J9777J9711J9260J8585J7195J4670J1393P906M029n83
$$ 919610 937532 956663 976440 996151 1015411 1033996 1051191 1065861 1077254 1085160 1089189 1088606
58769A088606n464r711j2956j5272j6630j7200j7653j8289j8373j7207j5360j3863
$$ 1088606 1083142 1073431 1060475 1045203 1028573 1011373 993720 975431 957058 939851 924491 910628
58757I10628j2715j1253r556q395p980p893p932q117q097p591p112p192p249o349
$$ 910628 897913 886660 877104 868709 860729 852836 844904 836787 828690 821099 813987 806795 799546 793197
58743G93197m710l200j716M47K773L757L178K597L102L966M160L945M118M581
$$ 793197 788487 785287 783571 784018 786791 790548 793726 796323 799425 803391 807551 811496 815614 820195
58729H20195M560L698K291Q20k48n43q5P72J791K988M308N599O928Q423R838J0750
$$ 820195 824755 828453 830744 831564 831316 830773 830688 831460 833251 836239 840547 846146 853074 861497 871335 882085
58713H82085J1123J1209J0934R952Q158N614K198k024o342j0096j3610j7529k1383
$$ 882085 893208 904417 915351 925303 933461 939075 941273 939249 932907 922811 909201 891672 870289
58700H70289k3852k4445k3914k2891k1218j8921j6816j5572j4866j3949j2486
$$ 870289 846437 821992 798078 775187 753969 735048 718232 702660 687794 673845 661359
58689F61359j0531q297o327n287n184n191m555l288j754j47J376K430K655K054
$$ 661359 650828 642531 636204 630917 625733 620542 615987 612699 610945 610798 612174 614604 617259 619313
58675F19313Q83n08j732k515k896k998k689j748k45J530L336M891N746N740N307
$$ 619313 620196 619688 617956 615441 612545 609547 606858 605110 604865 606395 609731 614622 620368 626108 631415
58660F31415M808L826J715j301m241o462q041r178r853j0059r917r508q938q363
$$ 631415 636223 640049 641764 640463 636222 629760 621719 612541 602688 592629 582712 573204 564266 555903
58646E55903p624o281m365k659j732j265q61q49j415j694q80L64Q53P71J236K224
$$ 555903 548279 541998 537633 534974 533242 531977 531116 530267 528852 527158 526278 526642 527495 528266 529502 531726
58630E31726K494J617N88J56j02o36j044r41o50n46m61k14J8K60Q96J895K560
$$ 531726 534220 535837 536425 536581 536479 535843 534799 533858 533208 532662 532201 531987 532005 532265 533161 535056 537616
58613E37616K455K029J986K516L420M403N095N221M974M786M715M492M078L628
$$ 537616 540071 542100 544086 546602 550022 554425 559520 564741 569715 574501 579216 583708 587786 591414
58599E91414L053K218J487J398J861K337K673L122L723M335N102O177P279Q285
$$ 591414 594467 596685 598172 599570 601431 603768 606441 609563 613286 617621 622723 628900 636179 644464
58585F44464R834J2319J4669J5312J4206J2778J1980J1489J0736R568P905N922
$$ 644464 654298 666617 681286 696598 710804 723582 735562 747051 757787 767355 775260 781182
58573G81182M549M701O002P338Q532J0245J2465J4510J6470J9091K2157K4454
$$ 781182 785731 790432 796434 803772 812304 822549 835014 849524 865994 885085 907242 931696
58561I31696K5504K5839K5340K2978J8630J3618Q916M303j70l466n082n882o653
$$ 931696 957200 983039 1008379 1031357 1049987 1063605 1072521 1076824 1076654 1073188 1068106 1062224 1055571
58548A055571p023o556n790n425n550o322q295j1429j4818j7892k0866k3538k4979
$$ 1055571 1048548 1041992 1036202 1030777 1025227 1018905 1010610 999181 984363 966471 945605 922067 897088
58535H97088k4959k4421k3829k2463k0034j7653j6217j5099j3456j1672j0463
$$ 897088 872129 847708 823879 801416 781382 763729 747512 732413 718957 707285 696822
58524F96822r646q786q127p883p470o459n338m540l649k385j417j214j145o06
$$ 696822 687176 678390 670263 662380 654910 648451 643113 638573 634924 632539 631122 629908 628763 628157
58510F28157r1j77l88j31K42L02N60J454K254K198J861K136K636K457J917K102
$$ 628157 628066 627889 627501 627370 627612 627914 628474 629928 632182 634380 636241 638377 641013 643470 645387 647489
58494F47489L144M239N092O068P125P793Q175Q958J0298J1517J2057J2195J2708
$$ 647489 650633 654872 659964 666032 673157 680950 689125 698083 708381 719898 731955 744150 756858
58481G56858J4140J6276J8176J8967J8652J7795J6352J3588R227L991j215n827
$$ 756858 770998 787274 805450 824417 843069 860864 877216 890804 900031 904022 902807 896980
58469H96980r313j1282j2133j2574j2405j0937q645o893n619l119J151N319P681
$$ 896980 887667 876385 864252 851678 839273 828336 819691 812798 807179 804060 805211 810530 818211
58456H18211Q946J0584J2362J3027J2327J0851Q674N588J933j981o490j1485j5445
$$ 818211 827157 837741 850103 863130 875457 886308 894982 900570 902503 900522 894032 882547 867102
58443H67102j6920j6340j5275j4476j3686j2682j1377r467o981m631k822j052
$$ 867102 850182 833842 818567 804091 790405 777723 766346 756879 749898 745267 742445 741393
58431G41393R09K286K675L137M699O774Q252R180R998J0027Q313N340K415j53
$$ 741393 742302 744588 747263 750400 755099 761873 770125 779305 789303 799330 807643 812983 815398 815245
58417H15245k877n637p711q950r617r538q586p616p611q195q116o969n376l791
$$ 815245 812368 806731 799020 790070 780453 770915 762329 754713 747102 738907 730791 723822 718446 714655
58403G14655k157n88N26J047J108R56J165K371M269N606N765N550N754N907N295
$$ 714655 712498 711910 712436 713483 714591 715547 716712 719083 723352 728958 734723 740273 746027 751934 757229
58388G57229M222L342K639J939J583J706J721J353J264J879K559K764K923L402
$$ 757229 761451 764793 767432 769371 770954 772660 774381 775734 776998 778877 781436 784200 787123 790525
58374G90525L788M007M767O045O664O310O359P572Q777R166R982J2189J4263J4344
$$ 790525 794313 798320 803087 809132 815796 822106 828465 836037 844814 853980 863962 876151 890414 904758
58360I04758J3042J2011J1139R385P194N740M642K778O65j88K29N97M87O33J309
$$ 904758 917800 929811 940950 950335 957529 963269 967911 970689 971354 971166 971395 971992 972479 973112 974421
58345I74421K108K965M074N244O434Q171J0418J2102J2777J3461J4732J5593J5454
$$ 974421 976529 979494 983568 988812 995246 1003417 1013835 1025937 1038714 1052175 1066907 1082500 1097954
58332A097954J5365J5830J5378J3135J0688R356P825M868K165J669K196J633P48
$$ 1097954 1113319 1129149 1144527 1157662 1168350 1177706 1185531 1190399 1192564 1194233 1196429 1198062 1198810
58319A198810J473L088L502L105L864N661O897P839J0015J2986J4915J5734J6768
$$ 1198810 1200283 1203371 1206873 1209978 1213842 1219503 1226400 1234239 1244254 1257240 1272155 1287889 1304657
58306A304657J7929J8177J7907J7971J7394J5128J2890J2903J4010J3550J1960
$$ 1304657 1322586 1340763 1358670 1376641 1394035 1409163 1422053 1434956 1448966 1462516 1474476
58295A474476J1738J2864J3229J2931J3966J6114J7142J6995J7816J9886K1317
$$ 1474476 1486214 1499078 1512307 1525238 1539204 1555318 1572460 1589455 1607271 1627157 1648474
58284A648474K1728K2604K3974K4310K3701K3738K4434K4546K4556K5865K7762
$$ 1648474 1670202 1692806 1716780 1741090 1764791 1788529 1812963 1837509 1862065 1887930 1915692
58273A915692K8609K9227L1380L3989L4942L5468L8275M2474M5110M6669M9918
$$ 1915692 1944301 1973528 2004908 2038897 2073839 2109307 2147582 2190056 2235166 2281835 2331753
58262B331753N4146N6092N5935N6746N8355N7697N5082N4095N5110N4986N3566
$$ 2331753 2385899 2441991 2497926 2554672 2613027 2670724 2725806 2779901 2835011 2889997 2943563
58251B943563N4319N7979O1590O4508O9184P5385P9979Q3157Q8408R5501J00261
$$ 2943563 2997882 3055861 3117451 3181959 3251143 3326528 3406507 3489664 3578072 3673573 3773834
58240C773834J02335J06260J13599J20934J27030J34844J44915J53998J61937
$$ 3773834 3876169 3982429 4096028 4216962 4343992 4478836 4623751 4777749 4939686
58231D939686J72602J86349J98974K09873K23511K41055K58547K75228K95344
$$ 4939686 5112288 5298637 5497611 5707484 5930995 6172050 6430597 6705825 7001169
58222G001169L19925L45338L71816M04334M43295M84081N27652N81063O45625
$$ 7001169 7321094 7666432 8038248 8442582 8885877 9369958 9897610 10478673 11124298
58213A1124298P15977P93101Q85892R97290J122145J261781J426212J618744J834331
$$ 11124298 11840275 12633376 13519268 14516558 15638703 16900484 18326696 19945440 21779771
58204B1779771K077093K362078K695791L075729L516208M054565M726781N563003
$$ 21779771 23856864 26218942 28914733 31990462 35506670 39561235 44288016 49851019
58196D9851019O616887P974048R723388J1943453J4700622J7989187K1660217
$$ 49851019 56467906 64441954 74165342 86108795 100809417 118798604 140458821
58189A40458821K5500684K9405017L3265523L6437895L7354340L4058239K5556101
$$ 140458821 165959505 195364522 228630045 265067940 302422280 336480519 362036620
58182C62036620J2847950j363295j4050583k3188086k8194978k9596317k8464276
$$ 362036620 374884570 373521275 359470692 336282606 308087628 278491311 250027035
58175B50027035k5990921k3207719k0793251j8990880j7678161j6561264j5389512
$$ 250027035 224036114 200828395 180035144 161044264 143366103 126804839 111415327
58168A11415327j4069926j2641198j1181435r752833q403466p175089o092159
$$ 111415327 97345401 84704203 73522768 63769935 55366469 48191380 42099221
58161D2099221n157480m365496l708967l170776k723938k346250k026438j754597
$$ 42099221 36941741 32576245 28867278 25696502 22972564 20626314 18599876 16845279
58153A6845279j518551j312950j140630j000477q83150p82079o98792o33222n78022
$$ 16845279 15326728 14013778 12873148 11872671 10989521 10207442 9508650 8875428 8297406
58144H297406n27067m81333m41883m04720l67166l32358l02872k76014k49493
$$ 8297406 7770339 7289006 6847123 6442403 6075237 5742879 5440007 5163993 4914500
58135D914500k25860k07360j91964j78086j67914j62395j57987j51807j45300
$$ 4914500 4688640 4481280 4289316 4111230 3943316 3780921 3622934 3471127 3325827
58126C325827j39714j32841j23540j14750j08620j02928r5570q8402q3443p9222
$$ 3325827 3186113 3053272 2929732 2814982 2706362 2603434 2507864 2419462 2336019 2256797
58116B256797p4090o9372o6204o2823n7983n3624n1283m9219m5897m2969m1910
$$ 2256797 2182707 2113335 2047131 1984308 1926325 1872701 1821418 1772199 1726302 1683333 1641423
58105A641423m0970l8439l5912l5309l5468l4606l3584l3791l4213l3367l2061
$$ 1641423 1600453 1562014 1526102 1490793 1455325 1420719 1387135 1353344 1319131 1285764 1253703
58094A253703l1618l1371l0276k9021k8264k6701k3185j8985j5938j4026j2527
$$ 1253703 1222085 1190714 1160438 1131417 1103153 1076452 1053267 1034282 1018344 1004318 991791
58083I91791j1707j1715j1666j1385j2121j3994j4951j3830j2232j1725j1474
$$ 991791 980084 968369 956703 945318 933197 919203 904252 890422 878190 866465 854991
58072H54991j0506r930j0807j1891j1626j0613j0170j0145r936r899j0030r106
$$ 854991 844485 834555 823748 811857 800231 789618 779448 769303 759367 749468 739438 730332
58060G30332o950n614o611q710j0219j1428j2975j3852j3169j2029j1593j0980
$$ 730332 723382 717768 711157 702447 692228 680800 667825 653973 640804 628775 617182 606202
58048F06202r189p345o813o782n931m930n001n507n314n140o064o987o127m134
$$ 606202 597013 589668 582855 576073 570142 565212 560211 554704 549390 544250 538186 531199 525072 520938
58034E20938l175l684m324m602n246o365p251p757q142p993o895n623n155n075
$$ 520938 517763 514079 509755 505153 499907 493542 486291 478534 470392 462399 455504 449881 444726 439651
58020D39651m457l638l523l874l902l839m292m715m181l114k570k424j874j132
$$ 439651 435194 431556 428033 424159 420257 416418 412126 407411 403230 400116 397546 395122 393248 392116
58006C92116r68j060m98N10J006R77J188J771K316K922L690L805K684J454J662
$$ 392116 391148 390088 389590 390100 391106 392083 393271 395042 397358 400280 403970 407775 410459 411913 413575
57991D13575K941L609L194K585K097J283N36R60K450L607L835M061N044O350P404
$$ 413575 416516 420125 423319 425904 428001 429284 429820 430780 433230 436837 440672 444733 449777 456127 463531
57976D63531Q359R555J1013J2756J4794J6648J7586J7420J6347J4258J0979O922
$$ 463531 471890 481445 492458 505214 520008 536656 554242 571662 588009 602267 613246 620168
57964F20168K628k071p441j2669j6369j8207j9011j9380j9148j8216j6925j5484
$$ 620168 622796 620725 613284 600615 584246 566039 547028 527648 508500 490284 473359 457875
57952D57875j3811j1981j0263q791p667p021o471n106k729m48Q17J636K939M312
$$ 457875 444064 432083 421820 413029 405362 398341 391870 386764 384035 383587 384404 386040 388979 393291
57938C93291M824M846N487O614P045O557O129O080N526L904J763l11k335m201
$$ 393291 398115 402961 408448 415062 422107 428664 434793 440873 446399 450303 452066 451755 449420 445219
57924D45219n456o096o629p075o879o039n274m765l812k102l36R20K116L827N648
$$ 445219 439763 433667 427038 419963 413084 407045 401771 397006 393194 391092 390756 391676 393792 397619 403267
57909D03267O636O422N425M192K897J279r86l744o305q119r265r904r771q751
$$ 403267 409903 416325 421750 425942 428839 430118 429132 425388 419083 410964 401699 391795 382024 373273
57895C73273p475o560n639m093k326j321j141j022p93r78j473j468r63j091k366
$$ 373273 365798 359238 353599 349506 347180 345859 344718 343696 342903 341925 340452 338984 338021 336930 334564
57880C34564l671l698k594j523j179j372j613j505r02r7L40L01L76J183K684M383
$$ 334564 330893 327195 324601 323078 321899 320527 318914 317409 316507 316410 316750 317051 317427 318610 321294 325677
57864C25677N883P020P726P978P838P480P182P157P203O821N843M675L673K745
$$ 325677 331560 338580 346306 354284 362122 369602 376784 383941 391144 397965 403808 408483 412156 414901
57850D14901J894J522J646J360j03k240l999n159o071o490n824m382l228k772
$$ 414901 416795 418317 419963 421323 421220 418980 414981 409822 403751 397261 391437 387055 383827 381055
57836C81055k519k190j979j717r65o5O2n32o69J95J141J247Q55P47R09Q24K91
$$ 381055 378536 376346 374367 372650 371685 371620 371682 371150 370481 370676 371817 373064 373919 374666 375575 376399 376690
57819C76690o09j730k567k404j342n23p00j191q71K45J155J200O05r0n62p63q45
$$ 376690 376081 374351 371784 369380 368038 367515 366815 365624 364753 364998 366153 367353 367958 367868 367306 366543 365698
57802C65698r23p98j32R04J684K004K413L368M524N323N918O870Q186R001Q344
$$ 365698 364775 363977 363845 364749 366433 368437 370850 374218 378742 384065 389983 396853 405039 414040 422384
57787D22384N988K760J9j398j867k402l382m269m557m449m388m446m485m463m388
$$ 422384 428372 431132 431151 429753 427886 425484 422102 417833 413276 408827 404439 399993 395508 391045 386657
57772C86657m268m368n013n986o596o579o408o477o523o245n897n777n624n072
$$ 386657 382389 378021 373008 367022 360426 353847 347439 340962 334439 328194 322297 316520 310896 305824
57758C05824m323l815l460k785j686n42L28R43J442J911K370K692K699K523K626
$$ 305824 301501 297686 294226 291441 289755 289213 289541 290484 291926 293837 296207 298899 301598 304121 306747
57743C06747L275M099M494M299L802L268K719K174J857K020K555K911K559J695
$$ 306747 310022 314121 318615 322914 326716 329984 332703 334877 336734 338754 341309 344220 346779 348474
57729C48474J255J836K859L235K787K440K880L651L804L049J912J073P52N93R
$$ 348474 349729 351565 354424 357659 360446 362886 365766 369417 373221 376270 378182 379255 380007 380600 380609
57714C80609j114k121k312j879j644j977k550l155l993m956n348m734l516k333
$$ 380609 379495 377374 375062 373183 371539 369562 367012 363857 359864 354908 349560 344826 341310 338977
57700C38977j370n86l7L58Q65J395J436Q41J14m41j187k217k706j918l98O31P86
$$ 338977 337607 337021 336984 337342 338207 339602 341038 341879 341993 341552 340365 338148 335442 333524 333126 333757 334543
57683C34543P46J135J961L019M219N414O470P564R130J1525J4961J9548K5016
$$ 334543 335289 336424 338385 341404 345623 351037 357507 365071 374201 385726 400687 420235 445251
57670D45251L0703L6205M1867M8088N4159N8093N7515N0504L6205J5647p732k9046
$$ 445251 475954 512159 554026 602114 656273 714366 771881 822385 858590 874237 866505 837459
57658H37459m4211n1776n2990n0397m6175m1362l6198l0954k6094k1793j7816
$$ 837459 793248 741472 688482 638085 591910 550548 514350 483396 457302 435509 417693
57647D17693j4086j0950q640o879n347m219l830m088m548m887m976m745m300m027
$$ 417693 403607 392657 384017 377138 371791 367572 363742 359654 355106 350219 345243 340498 336198 332171
57633C32171m235m836n460n695n253m340l852m508n651n720m292k801k591l212
$$ 332171 327936 323100 317640 311945 306692 302352 298500 293992 288341 282621 278329 275528 272937 269725
57619B69725l426l103k914k774j950o12J08k81r87j210j153j378j885k192j907
$$ 269725 266299 263196 260282 257508 255558 254946 255054 254773 253786 252576 251423 250045 248160 245968 244061
57604B44061r59L08J206J283Q22L76o4p60j286p63P76K099K164J239L37J39P37
$$ 244061 243102 243410 244616 245899 246721 247097 247033 246273 244987 244224 245000 247099 249263 250502 250839 250978 251715
57587B51715J900L135L871L914L477K685J439j04j444k309k894l382l719m063
$$ 251715 253615 256750 260621 264535 268012 270697 272136 272032 270588 268279 265385 262003 258284 254221
57573B54221m854o038o736o171m662l329k951l384l892l836l280k935l345m030
$$ 254221 249367 243329 236593 230422 225760 222431 219480 216096 212204 208368 205088 202153 198808 194778
57559A94778l948k853j671j297j574j808j772j627j299o11J76N58O12J026K139
$$ 194778 190830 187977 186306 185009 183435 181627 179855 178228 176929 176318 176494 177052 177664 178690 180829
57544A80829L379L822L141J796M60m76q79o76O4R01J191O66l15j135j425j144
$$ 180829 184208 188030 191171 192967 193427 192951 192072 191396 191460 192361 193552 194218 193903 192768 191343 190199
57528A90199n18p1l27j156j699j366n83p4K26Q35J580J675J005M31O35J369K077
$$ 190199 189681 189610 189283 188127 186428 185062 184479 184405 184631 185466 187046 188721 189726 190157 190792 192161 194238
57511A94238K577K819K666K310K275K681L001K913K729K663K355J684J311J726
$$ 194238 196815 199634 202300 204610 206885 209566 212567 215480 218209 220872 223227 224911 226222 227948
57497B27948K297K095J257O82O81Q11Q47R63R01m4j860l390l598k802k152k229
$$ 227948 230245 232340 233597 234279 234960 235771 236618 237581 238482 238438 236578 233188 229590 226788 224636 222407
57481B22407k664k903k860k650k235j632j242j475k074k339k149k274l189m113
$$ 222407 219743 216840 213980 211330 209095 207463 206221 204746 202672 200333 198184 195910 192721 188608
57467A88608l967l046k709l361l773k878j319l99k00L11J507K459K155P53o91
$$ 188608 184641 181595 178886 175525 171752 168874 167555 167156 166956 167267 168774 171233 173388 174141 173450
57452A73450j303j036m42m1J41L77O90Q01P06Q63J527K221K314J897J657J960
$$ 173450 172147 171111 170669 170628 170769 171146 171836 172637 173343 174206 175733 177954 180268 182165 183822 185782
57436A85782K449K537K129J790K230L461M498M325L123K029J609J253L88n53j015
$$ 185782 188231 190768 192897 194687 196917 200378 204876 209201 212324 214353 215962 217215 217603 217050 216035
57421B16035j393k351l527l923l423k872k738k557j872q86L5Q76J649K085J979
$$ 216035 214642 212291 208764 204841 201418 198546 195808 193251 191379 190493 190528 191404 193053 195138 197117
57406A97117J504J009O78M36o0j185k798l992l920k739j341k50O56J418J727J471
$$ 197117 198621 199630 200308 200744 200684 199499 196701 192709 188789 186050 184709 184459 185115 186533 188260 189731
57390A89731R89N56J44j60j0O89J522K040K214K269K354K482K484K025J044J35
$$ 189731 190720 191276 191420 191260 191250 191939 193461 195501 197715 199984 202338 204820 207304 209329 210373 210508
57374B10508M2P00J197Q72l1q47j211j159r22q40j100j438j386q48j52M76J037
$$ 210508 210550 211250 212447 213319 213288 212441 211230 210071 209149 208309 207209 205771 204385 203537 203385 203861 204898
57357B04898J383J231O86L00M49R19J276J319J120R63J162J617J691J003J57p
$$ 204898 206281 207512 208198 208498 208947 209866 211142 212461 213581 214544 215706 217323 219014 220017 220174 220167
57341B20167L23K43l84p15l72j7j35k73pK05q2m09j90K34J77k27l43j39j22l77
$$ 220167 220490 220733 220349 219634 219262 219245 219110 218837 218830 219035 218953 218544 218354 218588 218765 218538 218195 218056 217934 217557
57321B17557m98l95m06n99n94j73M78J146J758K113K004J634J484J661J790J635
$$ 217557 217059 216664 216258 215659 215065 214892 215370 216516 218274 220387 222391 224025 225509 227170 228960 230595
57305B30595J487J689K143K473K492K291J996J706J596J819K221K355J976J429
$$ 230595 232082 233771 235914 238387 240879 243170 245166 246872 248468 250287 252508 254863 256839 258268
57291B58268J323J788K427K953L496M119M528M574M581M794M926M766M720N088
$$ 258268 259591 261379 263806 266759 270255 274374 278902 283476 288057 292851 297777 302543 307263 312351
57277C12351N297M703L727L283L393L430L425L934M657M655M021M027N172O463
$$ 312351 317648 322351 326078 329361 332754 336184 339609 343543 348200 352855 356876 360903 366075 372538
57263C72538P093P521Q224Q687Q553Q617R735J1533J3168J4524J5768J6579J6732
$$ 372538 379631 387152 395376 404063 412616 421233 430968 442501 455669 470193 485961 502540 519272
57250E19272J6778J7278J8018J8777K0056K2165K4373K5922K7136K8562K9829
$$ 519272 536050 553328 571346 590123 610179 632344 656717 682639 709775 738337 768166
57239G68166L0546L1505L3672L6547L8774L9884M0274M0012L9076L8300L8675
$$ 768166 798712 830217 863889 900436 939210 979094 1019368 1059380 1098456 1136756 1175431
57228A175431L9920M1042M2087M3912M6403M8289M8791M8347M7678M7186M7182
$$ 1175431 1215351 1256393 1298480 1342392 1388795 1437084 1485875 1534222 1581900 1629086 1676268
57217A676268M7634M7746M6780M5089M3450M1753L9555L7518L6810L7275L7671
$$ 1676268 1723902 1771648 1818428 1863517 1906967 1948720 1988275 2025793 2062603 2099878 2137549
57206B137549L7610L7754L8101L7665L6146L4429L3084L1726L0280K9520K9869
$$ 2137549 2175159 2212913 2251014 2288679 2324825 2359254 2392338 2424064 2454344 2483864 2513733
57195B513733L0759L1643L2556L3307L3288L2531L1960L2083L2342L2141L1646
$$ 2513733 2544492 2576135 2608691 2641998 2675286 2707817 2739777 2771860 2804202 2836343 2867989
57184B867989L1270L1136L1320L1774L1929L1247L0238K9948L0421L0605K9831
$$ 2867989 2899259 2930395 2961715 2993489 3025418 3056665 3086903 3116851 3147272 3177877 3207708
57173C207708K8324K6379K4201K2483K1944K2210K2328K2262K2602K3001K2475
$$ 3207708 3236032 3262411 3286612 3309095 3331039 3353249 3375577 3397839 3420441 3443442 3465917
57162C465917K1245K0558K0660K0553J9924J9610J9912K0143K0144K0464K0867
$$ 3465917 3487162 3507720 3528380 3548933 3568857 3588467 3608379 3628522 3648666 3669130 3689997
57151C689997K0393J9212J8621J8964J9354J9608K0332K0975K0156J8271J7238
$$ 3689997 3710390 3729602 3748223 3767187 3786541 3806149 3826481 3847456 3867612 3885883 3903121
57140C903121J7247J6415J4285J2846J3119J3765J4170J5887J9505K3142K5795
$$ 3903121 3920368 3936783 3951068 3963914 3977033 3990798 4004968 4020855 4040360 4063502 4089297
57129D089297K8988L2898L3982K9417K1680J5894J4443J6630K1636K9127L8428
$$ 4089297 4118285 4151183 4185165 4214582 4236262 4252156 4266599 4283229 4304865 4333992 4372420
57118D372420M9585O3879Q1443R9937J17306J33895J50437J66575J83207K03665
$$ 4372420 4422005 4485884 4567327 4667264 4784570 4918465 5068902 5235477 5418684 5622349
57108E622349K30400K63253L02876L52394M13623M85535N69228O70549P95197
$$ 5622349 5852749 6116002 6418878 6771272 7184895 7670430 8239658 8910207 9705404
57099I705404R46105J128899J354666J633863J973927K386932K891004L496501
$$ 9705404 10651509 11780408 13135074 14768937 16742864 19129796 22020800 25517301
57091B5517301M196871M977305N819200O686959P528756Q308411R010081R562596
$$ 25517301 29714172 34691477 40510677 47197636 54726392 63034803 72044884 81607480
57083H1607480R760391R326988Q120877O285316M174508K130537L28778j207001
$$ 81607480 91367871 100694859 108815736 115101052 119275560 121406097 121734875 120527874
57075A20527874k508065l600619m499686n215404n755338o130236o358580o461460
$$ 120527874 118019809 114419190 109919504 104704100 98948762 92818526 86459946 79998486
57067G9998486o456335o359201o187450n955079n668448n331370m951807m540785
$$ 79998486 73542151 67182950 60995500 55040421 49371973 44040603 39088796 34548011
57059C4548011m108846l667917l233790k822147k443061k101613j801251j543404
$$ 34548011 30439165 26771248 23537458 20715311 18272250 16170637 14369386 12825982
57051A2825982j325430j142150r88670q60225p51285o57272n76095n06471m46185
$$ 12825982 11500552 10358402 9369732 8509507 7758222 7100950 6524855 6018384 5572199
57042E572199l93497l48413l10751k78487k49664k24344k03013j84508j67300
$$ 5572199 5178702 4830289 4519538 4241051 3991387 3767043 3564030 3379522 3212222
57033C212222j51436j37406j24331j11017r7773q5440p3399o0189m5574l0810
$$ 3212222 3060786 2923380 2799049 2688032 2590259 2504819 2431420 2371231 2325657 2294847
57023B294847j7056m093R804K6154M2561N0750M1348J2666k6631o4579r3976j13076
$$ 2294847 2277791 2273698 2283502 2309656 2352217 2402967 2444315 2456981 2430350 2365771 2271795 2158719
57011B158719j22071j22222j16737j09125j00727r1550q2592p5202o9013o2722
$$ 2158719 2036648 1914426 1797689 1688564 1587837 1496287 1413695 1338493 1269480 1206758
57001A206758n6427n1096m6412m1298l6283l3010l1432k9595k6501k3191k0617
$$ 1206758 1150331 1099235 1052823 1011525 975242 942232 910800 881205 854704 831513 810896
56990H10896j8242j5349j2174q962n199n84M118P783R808R853P473K555m231j1628
$$ 810896 792654 777305 765131 756169 750970 750386 754504 762287 772095 781948 789421 791976 787745 776117
56976G76117j8168k2549k4326k4275k3534k2425k0567j7919j4986j2142r449p031
$$ 776117 757949 735400 711074 686799 663265 640840 620273 602354 587368 575226 565777 558746
56964E58746m855k282J386N816R822J2800J5367J8378K1640K3616K2187J6025
$$ 558746 553891 551609 552995 558811 568633 581433 596800 615178 636818 660434 682621 698646
56952F98646N859n662j5681k2740k6673k7734k6538k4256k1856j9293j6113j2572
$$ 698646 704505 698843 683162 660422 633749 606015 579477 555221 533365 514072 497959 485387
56940D85387r314o217k498K075O956J1787J6768K1987K7162L1998L5921L7328
$$ 485387 476073 469856 467358 469433 476389 488176 504944 526931 554093 586091 622012 659340
56928F59340L4081K5243J2099k594j5880k5517l0739l2602l2982l2919l2226l0616
$$ 659340 693421 718664 730763 728169 712289 686772 656033 623431 590449 557530 525304 494688
56916D94688k8351k5691k2581j9277j6578j4855j3448j1517r181p270o274n913
$$ 494688 466337 440646 418065 398788 382210 367355 353907 342390 333209 325939 319665 313752
56904C13752n670n286m802m370m019l487k378o19J300K758L684M700O434Q721
$$ 313752 308082 302796 297994 293624 289605 286118 283740 283121 284421 287179 290863 295563 301997 310718
56890C10718J0760J2216J3821J6422J9570K1793K2174K0870J7922J2698N249k587
$$ 310718 321478 333694 347515 363937 383507 405300 427474 448344 466266 478964 484213 481626
56878D81626q515j1803j3204j3391j2492j0907r277p580n096j544K525O635J0937
$$ 481626 473111 461308 448104 434713 422221 411314 402037 394457 389361 387817 390342 396977 407914
56865D07914J5748K1097K6842L2708L8250M3269M7970N1757N2007M5423L1314
$$ 407914 423662 444759 471601 504309 542559 585828 633798 685555 737562 782985 814299
56854H14299J2818n490k0583l1438l7827l9808l8052l3798k8257k2336j6564j0896
$$ 814299 827117 821627 801044 769606 731779 691971 653919 620121 591864 569528 552964 542068
56842E42068m740K468J0763J9840K9423L9293M9196N9085O9085P8697Q5818Q6740
$$ 542068 537328 539796 550559 570399 599822 639115 688311 747396 816481 895178 980996 1067736
56830A067736P7603N6763K6620o762l6446n7845o9904p4055p2648o7929o1434
$$ 1067736 1145339 1202102 1228722 1221960 1185514 1127669 1057765 983710 911062 843133 781699
56819G81699n3775m5170l6129k7312j8871j0510k089O363J5167K4750L4863M4634
$$ 781699 727924 682754 646625 619313 600442 589932 587843 594206 609373 634123 668986 713620
56807G13620N3315O0015O2540N7644M3416K1310m320k8362m6839n7946o2198o1443
$$ 713620 766935 826950 889490 947134 990550 1011860 1007540 979178 932339 874393 812195 750752
56795G50752n7401n1250m4207l7500l1445k5383j8941j2655o902j169M993J1035
$$ 750752 693351 642101 597894 560394 528949 503566 484625 471970 465068 463899 468892 479927
56783D79927J6279K1087K6183L1056L3758L2196K5237J3225j713j6133k7046l3520
$$ 479927 496206 517293 543476 574532 608290 640486 665723 678948 677235 661102 634056 600536
56771F00536l6297l6320l4269l1148k8201k5961k4003k1838j9589j7600j5917
$$ 600536 564239 527919 493650 462502 434301 408340 384337 362499 342910 325310 309393
56760C09393j4283j2483j0503q549o950n886n298n027m890m547l697k559j836
$$ 309393 295110 282627 272124 263575 256625 250739 245441 240414 235524 230977 227280 224721 222885
56747B22885j857k157k189k026k001k056j965j842j853j743j223o24n16q25r43
$$ 222885 221028 218871 216682 214656 212655 210599 208634 206792 204939 203196 201973 201349 200833 200008 199065
56732A99065o12j66J19K93L95L67L49N95J033J291J206R72Q11Q05J020J399J596
$$ 199065 198453 198287 198406 198699 199094 199461 199810 200405 201438 202729 203935 204907 205718 206523 207543 208942 210538
56715B10538J305P19L07K63M57P78J130J220R42Q30J488K566K994K368J477J157
$$ 210538 211843 212562 212869 213132 213589 214367 215497 216717 217659 218489 219977 222543 225537 227905 229382 230539
56699B30539J216R74M14K09P25J439J553R09P3l53k94pL79Q52J199J164R44J056
$$ 230539 231755 232729 233143 233352 234077 235516 237069 237978 238051 237698 237404 237397 237776 238628 239827 240991 241935 242991
56681B42991J644K326K854L337L568K926J428K39K85R66J023L23j94j59k22q30
$$ 242991 244635 246961 249815 253152 256720 259646 261074 261313 261598 262564 263587 263910 263716 263557 263335 262505
56665B62505j545j849j800j613j264q74q15j069j027l30N92J129J295J480J776
$$ 262505 260960 259111 257311 255698 254434 253560 252745 251676 250649 250319 250911 252040 253335 254815 256591
56650B56591J935J825J573J424J548J859J899J234Q2p55p41j19M66O01J46q53
$$ 256591 258526 260351 261924 263348 264896 266755 268654 269888 269970 269215 268474 268355 268821 269422 269568 268715
56634B68715k039k795k874k712k878l255l231k565j771j467j666j903j873j653
$$ 268715 266676 263881 261007 258295 255417 252162 248931 246366 244595 243128 241462 239559 237686 236033
56620B36033j376j082r23j095j313q43M32J427J054k19q75l80L18M25K81K82n
$$ 236033 234657 233575 232652 231557 230244 229401 229833 231260 232314 232095 231220 230840 231158 231583 231864 232146 232141
56603B32141q37j399r35l1K97J61L41P97Q29M51L45O19P13M92L84M17J97j63o2
$$ 232141 231304 229905 228970 228939 229236 229397 229738 230535 231364 231815 232160 232779 233492 233984 234368 234785 234982 234819 234757
56584B34757N43J040J118J010Q26N83P29J596K429K172J157P82J413K024K048
$$ 234757 235300 236340 237458 238468 239294 239877 240606 242202 244631 246803 247960 248742 250155 252179 254227
56569B54227K148K762L307L376L523M193N147O413Q626J1620J3986J4750J4412
$$ 254227 256375 259137 262444 265820 269343 273536 278683 285096 293722 305342 319328 334078 348490
56556C48490J3529J1516P876L456n46l915o701q161p756o439n691n805o091o231
$$ 348490 362019 373535 381411 384867 384321 380406 373705 365544 357788 351349 345658 339853 333762 327531
56542C27531o335o140n319m222l381k690j934j564k003k696k875k721k790k793
$$ 327531 321196 315056 309737 305515 302134 299444 297510 295946 293943 291247 288372 285651 282861 280068
56528B80068k164j327j152j448j337q59r28j680k184j952j544j414j247q29o89
$$ 280068 277904 276577 275425 273977 272640 271781 270853 269173 266989 265037 263493 262079 260832 260003 259314
56513B59314j347k492l330l386k799k075j651j489j247r62j136j851k309j878
$$ 259314 257967 255475 252145 248759 245960 243885 242234 240745 239498 238536 237400 235549 233240 231362
56499B31362r69l49n2K57L86m7p70j260j534j766j595q12k24o31j340r99K84J008
$$ 231362 230393 230044 229992 230249 230635 230588 229818 228558 227024 225258 223663 222851 222627 221996 220656 219657 219941 220949
56481B20949M63m23o29k07K94N65L90l04r87r50k77L22O75J142J578J342O14M70
$$ 220949 221412 220989 220360 220153 220447 221012 221402 221098 220111 219161 218884 219206 219881 221023 222601 223943 224557 225027
56463B25027J293K077J815P32k70o39k82O49J595J896J498R12L63l22r22q00O4
$$ 225027 226320 228397 230212 230944 230674 230035 229753 230402 231997 233893 235391 236303 236666 236344 235422 234622 234686
56446B34686R05J295J632K166K469K181J581R17M2q99j242q35n63j122j859j643
$$ 234686 235591 236886 238518 240684 243153 245334 246915 247832 247874 246975 245733 244898 244335 243213 241354 239711
56430B39711n11L32N6p92r58R4J542K030J184j7m74k05J61N07J047J436J155O39
$$ 239711 239200 239532 239588 238796 237838 237932 239474 241504 242688 242671 242197 241992 242153 242660 243707 245143 246298 246937
56412B46937Q48J606J626N04n01k22Q14J274P62o7o30r01j072j159r22o5J212
$$ 246937 247785 249391 251017 251521 251020 250798 251612 252886 253648 253581 252951 252050 250978 249819 248897 248832 250044
56395B50044K061J879J192R62J118P48k50q32l85L75N43J67k24m19k77N41J928
$$ 250044 252105 253984 255176 256138 257256 258004 257754 256922 256537 256912 257455 257622 257398 256979 256702 257243 259171
56378B59171K998K992K104J084M67M45R25J386J293Q81R22J512J860J487Q64N00
$$ 259171 262169 265161 267265 268349 268816 269261 270186 271572 272865 273746 274668 276180 278040 279527 280391 280891
56362B80891K80R6K96R49J438J387J293J656K149K215J959J848J951J971J640
$$ 280891 281171 281267 281563 282512 283950 285337 286630 288286 290435 292650 294609 296457 298408 300379 302019
56347C02019Q45k39r15n77K80M38l67r74l70J071K360L081L344L314L351L922
$$ 302019 302864 302625 301710 301133 301413 301851 301484 300510 300140 301211 303571 306652 309996 313310 316661 320583
56331C20583M763M853L763K373J815K283L279M346M968M604L327J966J095N30
$$ 320583 325346 330199 333962 336335 338150 340433 343712 348058 353026 357630 360957 362923 364018 364548
56317C64548O6m9K46M89M84O16J019J326J556K181K953K905K114K112L664N480
$$ 364548 364614 364565 364811 365300 365784 366400 367419 368745 370301 372482 375435 378340 380454 382566 386230 391710
56301C91710O223O588P923R733J0184Q678O464M835L909L278K798K619K961L940
$$ 391710 397933 404521 412444 422177 432361 441039 447503 452338 456247 459525 462323 464942 467903 471843
56287D71843N354O803Q156R523J0744J1498J1990J2652J3096J2457J1067J0467
$$ 471843 477197 484000 492156 501679 512423 523921 535911 548563 561659 574116 585183 595650
56275E95650J1270J2323J2676J3052J4448J6481J8297J9959K1842K3607K4956
$$ 595650 606920 619243 631919 644971 659419 675900 694197 714156 735998 759605 784561
56264G84561K6562K9183L2615L6536M1407M7495N3908N9855O5998P3338Q1587
$$ 784561 811123 840306 872921 909457 950864 998359 1052267 1112122 1178120 1251458 1333045
56253A333045Q9868R8277J07401J16960J26224J35211J44168J52336J58311J61331
$$ 1333045 1422913 1521190 1628591 1745551 1871775 2006986 2151154 2303490 2461801 2623132
56243B623132J61285J58082J51793J42726J30586J14407R4159P1364M7276K1795
$$ 2623132 2784417 2942499 3094292 3237018 3367604 3482011 3576170 3647534 3694810 3716605
56233C716605m711k9993n1991p1032q8279j03182j14379j22147j27829j31562
$$ 3716605 3711894 3681901 3629910 3558878 3470599 3367417 3253038 3130891 3003062 2871500
56223B871500j32661j31735j30273j28417j25078j20139j14734j09423j03757
$$ 2871500 2738839 2607104 2476831 2348414 2223336 2103197 1988463 1879040 1775283
56214A775283r7608r1446q5394p9380p3943o9510o5289o0238n4780n0080m6134
$$ 1775283 1677675 1586229 1500835 1421455 1347512 1278002 1212713 1152475 1097695 1047615 1001481
56203A001481m2074l7883l4188l0875k7434k4237k1876j9782j7187j4823j3842
$$ 1001481 959407 921524 887336 856461 829027 804790 782914 763132 745945 731122 717280
56192G17280j3654j2820j1411j0381r277o962m253l216l882m165l247k460k489
$$ 717280 703626 690806 679395 669014 659737 652775 648522 645306 641424 637259 634012 631552 629063
56179F29063k178q64M26R56J438K355K964K883L044M135N496O338O849P354P652
$$ 629063 626885 626021 626447 627403 628841 631196 634160 637043 640087 644222 649718 656056 662905 670259 677911
56164F77911P731Q131R027R962J0727J1540J2234J2376J2279J2858J4461J6823
$$ 677911 685642 693773 702800 712762 723489 735029 747263 759639 771918 784776 799237 816060
56152H16060J9880K3544K7090L0112L3658L9022M5888N3250O1478P1598Q2962
$$ 816060 835940 859484 886574 916686 950344 989366 1035254 1088504 1149982 1221580 1304542
56141A304542R3671J02943J11049J17110J19175J16487J09783R9657Q6776P3564
$$ 1304542 1398213 1501156 1612205 1729315 1848490 1964977 2074760 2174417 2261193 2334757
56131B334757O3224N6739N2596M9224M5685M0354L1581K0082Q521j435r850j6872
$$ 2334757 2397981 2454720 2507316 2556540 2602225 2642579 2674160 2694242 2702763 2701328 2691478 2674606
56119B674606k2886l0087m1155n6110p2678q9410j05688j19051j26007j25922
$$ 2674606 2651720 2621633 2580478 2524368 2451690 2362280 2256592 2137541 2011534 1885612
56109A885612j21286j13869j03687r1907q1055p1556o1403n0323m0961l4788l0041
$$ 1885612 1764326 1650457 1546770 1454863 1373808 1302252 1240849 1190526 1149565 1114777 1084736
56098A084736k5011k0347j6737j3344r981q001p508o413l799j465p16k61J125
$$ 1084736 1059725 1039378 1022641 1009297 999316 991315 983807 977394 973595 972130 971414 971153 972278
56085I72278K548L168L857N099N740N380N617P362R238J0037J0447J1085J1295
$$ 972278 974826 977994 981851 986950 992690 998070 1003687 1011049 1020287 1030324 1040771 1051856 1063151
56072A063151J1095J1757J3289J4051J3903J4791J7010J8098J6963J5767J6042
$$ 1063151 1074246 1086003 1099292 1113343 1127246 1142037 1159047 1177145 1194108 1209875 1225917
56061A225917J6205J4850J3309J2832J2309J1030J0674J2252J3880J3900J3531
$$ 1225917 1242122 1256972 1270281 1283113 1295422 1306452 1317126 1329378 1343258 1357158 1370689
56050A370689J4248J5267J5708J6627J8686K0439K0960K1532K2891K3700K3482
$$ 1370689 1384937 1400204 1415912 1432539 1451225 1471664 1492624 1514156 1537047 1560747 1584229
56039A584229K4012K5899K7024K6327K5824K6863K7861K7871K8755L1504L4118
$$ 1584229 1608241 1634140 1661164 1687491 1713315 1740178 1768039 1795910 1824665 1856169 1890287
56028A890287L5516L7659M1277M3473M2497M0958M1422M2716M3556M5706N0220
$$ 1890287 1925803 1963462 2004739 2048212 2090709 2131667 2173089 2215805 2259361 2305067 2355287
56017B355287N4523N6670N8597O1892O4420O4655O5224O8435P2301P4638P7037
$$ 2355287 2409810 2466480 2525077 2586969 2651389 2716044 2781268 2849703 2922004 2996642 3073679
56006C073679Q1106Q5048Q7679R1505R8062J04621J09222J14239J21369J28211
$$ 3073679 3154785 3239833 3327512 3419017 3517079 3621700 3730922 3845161 3966530 4094741
55996D094741J33650J40986J51610J61466J68306J76266J88450K01510K12678
$$ 4094741 4228391 4369377 4520987 4682453 4850759 5027025 5215475 5416985 5629663
55987E629663K25332K42034K59323K75247K94582L20194L47237L72778M02788
$$ 5629663 5854995 6097029 6356352 6631599 6926181 7246375 7593612 7966390 8369178
55978H369178M42051M85945N30419N80880O42460P11362P85671Q74380R84931
$$ 8369178 8811229 9297174 9827593 10408473 11050933 11762295 12547966 13422346 14407277
55969A4407277J112459J252837J414847J607117J825834K069447K351877K685966
$$ 14407277 15519736 16772573 18187420 19794537 21620371 23689818 26041695 28727661
55961B8727661L069937L509834M040964M708542N546510O600463P954156R708124
$$ 28727661 31797598 35307432 39348396 44056938 49603448 56203911 64158067 73866191
55953G3866191J1947509J4736750J8084249K1867584K5870074K9970061L4146650
$$ 73866191 85813700 100550450 118634699 140502283 166372357 196342418 230489068
55946B30489068L7982821M0057856L8157136L0599782J7694584J964937j3111178
$$ 230489068 268471889 308529745 346686881 377286663 394981247 396946184 383835006
55939C83835006k4779647l1909352l4833664l4653508l2581295k9573356k6243915
$$ 383835006 359055359 327146007 292312343 257658835 225077540 195504184 169260269
55932A69260269k2946546j9881171j7147322j4766705j2716706j0960042r447889
$$ 169260269 146313723 126432552 109285230 94518525 81801819 70841777 61393888
55925F1393888q122077o939645n890509m979823m202869l547030l004083k564194
$$ 61393888 53271811 46332166 40441657 35461834 31258965 27711935 24707852 22143658
55917B2143658k205930j906184j654289j445951j270882j117598r83968q71965
$$ 22143658 19937728 18031544 16377255 14931304 13660422 12542824 11558856 10686891
55909A0686891p77125o92740o19029n58731n08273m61857m19809l84805l54332
$$ 10686891 9909766 9217026 8597997 8039266 7530993 7069136 6649327 6264522 5910190
55900E910190l24617k97556k76189k57527k37241k17350k02045j89757j76506
$$ 5910190 5585573 5288017 5011828 4754301 4517060 4299710 4097665 3907908 3731402
55891C731402j63361j53540j45494j35758j25606j18243j12206j03984r4522q6948
$$ 3731402 3568041 3414501 3269007 3133249 3007643 2889400 2777194 2673210 2578688 2491740
55881B491740q0375p1998o3012n6526n1768m6130m1093m0441m4098m8765n3116
$$ 2491740 2411365 2339367 2276355 2219829 2168061 2121931 2080838 2040397 1996299 1947534 1894418
55870A894418n7604o0894o1234n9844n8718n6800n2465m7636m5071m3629m0703
$$ 1894418 1836814 1775920 1714686 1654842 1596124 1539324 1486859 1439223 1394152 1350523 1309820
55859A309820l7278l6034l6286l5435l3846l3707l4452l3724l1669l0169k9054
$$ 1309820 1272542 1236508 1200222 1164787 1130941 1097234 1062782 1029058 997389 967220 938166
55848I38166k7010k4931k4421k4324k2586k0171j9323j9377j8138j6037j4993
$$ 938166 911156 886225 861804 837480 814894 794723 775400 756023 737885 721848 706855
55837G06855j4574j3204j1805j2165j3033j1932r676q894r197q125n964n229n868
$$ 706855 692281 679077 667272 655107 642074 630142 620466 611572 602375 594250 588286 583057 577189
55824E77189n419l714l260m805o378o882p133p228o289m911m665n102m313k411
$$ 577189 571770 568056 564796 559991 553613 546731 539598 532370 526081 521170 516505 511403 507090 504679
55810E04679j343j350o86J143K814L814M802N419M611L019K297K256J332m54j861
$$ 504679 503336 501986 501300 502443 505257 509071 513873 519292 523903 526922 529219 531475 532807 532353 530492
55795E30492l266o035r426j1298j1767j2814j4300j3828j0970q186o932n901l976
$$ 530492 527226 521191 511765 500467 488700 475886 461586 447758 436788 428602 421670 415769 411793
55782D11793k114j332j408k300m473p043q005p014n778n152m126k274p99l80j84
$$ 411793 409679 408347 406939 404639 400166 393123 385118 378104 372326 367174 363048 360774 359975 359595 359411
55767C59411K08nr99j729j947k819m636n832n289l984l327l263k912j987p81L57
$$ 359411 359619 359614 358615 356886 354939 352120 347484 341652 336363 332379 329052 325789 322877 320890 320109 320466
55751C20466J094J383J609J759R58j015k575k392j823l138n927p637p515p326
$$ 320466 321560 322943 324552 326311 327269 326254 323679 321287 319464 316326 310399 302762 295247 287921
55737B87921q010q308p361o225n871n695m999m169l532k657j623j428k359l363
$$ 287921 279911 271603 264242 258017 252146 246451 241452 237283 233751 231094 229471 228043 225684 222321
55723B22321l752m095m811n254m926m326l876l207k107j117o03k43K18O34J121
$$ 222321 218569 214474 209663 204409 199483 195157 191281 188074 185967 184850 184247 184004 184222 184856 185977
55708A85977J969K733K543J546Q90J097J573J762J570P30r61k629k930j864p33
$$ 185977 187946 190679 193222 194768 195658 196755 198328 200090 201660 202390 201429 198800 195870 194006 193273
55693A93273k63p9Jl43q14n39M93J375J832K461L310L655L418L351L635L644L298
$$ 193273 193010 192931 192932 192589 191775 191236 191729 193104 194936 197397 200707 204362 207780 211131 214766 218410 221708
55676B21708L181L210K576J291L14q7n64j156j053k92Jm86o12L92J761K434K279
$$ 221708 224889 228099 230675 231966 232280 232193 231629 230473 229420 229128 229129 228643 228031 228423 230184 232618 234897
55659B34897J639P88J85J59J28p15j894k180j608j494k282k969l049l359m487
$$ 234897 236536 237324 237509 237668 237796 237081 235187 233007 231399 229905 227623 224654 221605 218246 213759
55644B13759n712o127n630m457k935j903k099k867k738j470k16M10Q73J327J361
$$ 213759 208047 201920 196290 191833 188898 186995 184896 182029 179291 177821 177605 178015 178888 180215 181576
55629A81576J375K428M327N577N595N337N315M796L467K136J155k05k159l750
$$ 181576 182951 185379 189706 195283 200878 206215 211530 216326 219793 221929 223084 222879 220720 216970
55615B16970m378m453m085k826j178n31r62r07K63J271J223R05R03L92j082k485
$$ 216970 212592 208139 204054 201228 200050 199519 198557 197650 197913 199184 200407 201312 202215 202607 201525 199040
55599A99040l140l858n111n793n161m298m291m575m358m139m307l992k754j889
$$ 199040 195900 192042 186931 181138 175977 171679 167388 162813 158455 154316 150009 146017 143263 141374
55585A41374k342k877k076p41l75n85l5J018J281Q05P99J555K327K953L972N344
$$ 141374 139032 136155 134079 133338 132963 132378 132343 133361 134642 135447 136246 137801 140128 143081 147053 152397
55569A52397O448P138P536P213N748L748K231J358O78P6n34j718l601n138n410
$$ 152397 158845 165983 173519 180732 186480 190228 192459 193817 194495 194571 194037 192319 188718 183580 178170
55554A78170m983m869m903m396l649l396l299k437r44J32L72K77L31P22J567K496
$$ 178170 173187 168318 163415 159019 155370 151974 148675 146238 145294 145426 145798 146075 146406 147128 148695 151191
55538A51191K559J456K34j78l96j326k477k846k785l323m145l942k595j428j319
$$ 151191 153750 155206 155440 155262 154866 153540 151063 148217 145432 142109 137964 134022 131427 129999 128680
55523A28680j876k460k856k895k548k307k495k458j477k28n3j046j989k140j836
$$ 128680 126804 124344 121488 118593 116045 113738 111243 108785 107308 107080 107027 105981 103992 101852 100016
55508A00016j367n84K87N57Q0n48r05j034q21K6J285K290K739K803K535J913J313
$$ 100016 98649 98065 98352 98909 98989 98441 97536 96502 95681 95707 96992 99282 102021 104824 107359 109272 110585
55491A10585J185J355J421J518J981K516K707K946L867N074N512N005M305L698
$$ 110585 111770 113125 114546 116064 118045 120561 123268 126214 130081 135155 140667 145672 149977 153675
55477A53675K698J157l60j563k726l905m710m997n014m787m242l829m053m398
$$ 153675 156373 157530 157170 155607 152881 148976 144266 139269 134255 129468 125226 121397 117344 112946
55463A12946l808k416j625k177l148l371k862k313j953j551j046n37k6M20O20
$$ 112946 109138 106722 105097 102920 99772 96401 93539 91226 89273 87722 86676 86139 86113 86533 87153
55448H7153N91O18P70P76N77N12P56R91Q91N90L46J28k24o15p87o54m28l56m24
$$ 87153 87744 88362 89132 89908 90485 90997 91753 92744 93635 94225 94571 94699 94475 93860 93073 92419 91991 91635 91211
55429I1211l52m5J08l09r21q05K62J301J389Q31N60P96J047J058R84Q31M71J56
$$ 91211 90859 90814 90922 90613 89692 88887 89149 90450 91839 92670 93230 94026 95073 96131 97115 97946 98417 98573
55411I8573K42M54J07q38j618j671j203o43q7M64P47M44m28j439j972j631n99
$$ 98573 98815 99269 99376 98538 96920 95249 94046 93403 93316 93780 94527 94971 94543 93104 91132 89501 88902
55394H8902M28Q13N25K2k26j1N09Q99Q37M97J86k33r99j617j247m8P85O42K13
$$ 88902 89330 90143 90668 90690 90464 90453 90962 91861 92698 93195 93381 93148 92149 90532 89285 89237 90022 90664 90877
55375I0877J53J17j97k18L11L58r04k436k565j368l64j92j14K90M51P9j84J34
$$ 90877 91030 91147 90950 90732 91043 91401 90497 88061 85496 84128 83764 83572 83458 83748 84199 84278 84094 84228
55357H4228N78N62J70j86l77m80n66o47o14k63K84M64R5j36L62J007Q12j04o67
$$ 84228 84806 85368 85538 85352 84975 84495 83929 83282 82668 82405 82689 83153 83248 83112 83474 84481 85293 85189 84522
55338H4522l74K76P21Q04L87n53j333j047J78J221J371R40M03k04p56p88j78N05
$$ 84522 84148 84424 85145 85949 86336 85783 84450 83403 83581 84802 86173 87113 87516 87312 86556 85768 85590 86095
55320H6095O93M71K29J49J59J36lk15l78n23p78r73p20j93j42p05j002o04m34
$$ 86095 86788 87259 87488 87637 87796 87932 87929 87714 87336 86813 86035 85062 84342 84149 84007 83302 82300 81696 81262
55301H1262j181j684m45J825K847J849L38k46r3J05K90M55K10m15o88l08N3j61
$$ 81262 80081 78397 77952 79777 82624 84473 84811 84565 84472 84577 84867 85322 85532 85117 84429 84121 84174 84013
55283H4013o03p50n72p6R03J963K160J331N09M50N78J65l81l04J23O3m77p08m07
$$ 84013 83410 82660 82088 82012 82915 84878 87038 88369 88878 89328 89906 90071 89690 89386 89509 89572 89095 88387 87980
55264H7980k62p53j466j708j410j031q29n17K06J041J284P64J44N2K26N8m12n72
$$ 87980 87718 86965 85499 83791 82381 81350 80521 80004 80210 81251 82535 83299 83443 83495 83721 83779 83367 82795
55246H2795j81L78P02O66L00j57k20K71P08M98j8j04K26M03L62M18L49l45j292
$$ 82795 82614 82992 83694 84360 84660 84503 84283 84554 85262 85760 85742 85638 85864 86267 86629 87047 87396 87051 85759
55227H5759j558j119q54j007p92R3Q14O92J33k59m95o48l18O22J530J747J299
$$ 85759 84201 83082 82228 81221 80429 80522 81336 82028 82161 81902 81407 80759 80441 81063 82593 84340 85639
55210H5639N01m02q85l56Q28J430R30K19J80M50K89j58k84o6J50L71P34R22N53
$$ 85639 86140 85738 84853 84497 85325 86755 87685 87904 88084 88534 88823 88665 88381 88315 88465 88836 89570 90492 91045
55191I1045j41o20o82m41L4N37O74M16L56R06J661J911J499P28j18q19j126j013
$$ 91045 90904 90284 89602 89161 89195 89732 90406 90822 91178 92084 93745 95656 97155 97883 97765 96946 95820 94807
55173I4807p24l32L37J118J433J066M69O1k50n47n80l37k23k93jP62J160N28n24
$$ 94807 94083 93751 94088 95206 96639 97705 98174 98235 97985 97438 96858 96521 96298 96005 96004 96766 97926 98454 97930
55154I7930q64k46N96R19N08l82j125j089l09M93Q08P54M31l81j484k077j837
$$ 97930 97066 96820 97416 98335 98843 98461 97336 96247 95938 96431 97239 97993 98424 98043 96559 94482 92645
55137I2645j454j468j293k09J260J902J390N29J03K09N44P49N66R4k29k00j46
$$ 92645 91191 89723 88430 88221 89481 91383 92773 93302 93405 93614 94158 94907 95473 95567 95338 95138 94992
55120I4992l29n44n53m82m01k1P34J348J382J030O31J91k34k80O3K13o9j73L05
$$ 94992 94663 94119 93566 93084 92683 92662 93396 94744 96126 97156 97787 97978 97744 97464 97527 97740 97671 97498 97803
55101I7803P83O61L55N12Q31O26N0k29j56j07%M63R68R63O73P28R85P43L4k49
$$ 97803 98586 99247 99602 100114 100945 101571 101621 101392 101236 101129 101129 101592 102560 103523 104196 104924 105909 106652 106686 106437
55081A06437L73J389K064K108J558O78Lj59k19p41j484j671j069j91N16R71J049
$$ 106437 106810 108199 110263 112371 113929 114607 114610 114451 114232 113491 112007 110336 109267 109076 109592 110563 111612
55064A11612O01j9k20J3J27p6k32k06l99r83j393r77J06R22O63n12j490j229J04
$$ 111612 112213 112194 111974 111987 112114 112038 111806 111600 111201 110218 108825 107848 107954 108876 109539 109027 107537 106308 106412
55045A06412J282J427Q23J18o38j516j960j334o9O22J95o83j044o14J37M99O7
$$ 106412 107694 109121 109944 110062 109424 107908 105948 104614 104545 105167 105362 104679 103635 103021 103158 103657 103724
55028A03724q45j473j473j222j018n97J35N54K19k22Q9Q49J036M10l63q25j028
$$ 103724 102879 101406 99933 98711 97693 97096 97231 97785 98004 97782 97871 98720 99756 100166 99803 98978 97950
55011I7950q90k64M58P77J012J767K576K316J043J97N50J146Q42p6n19j07O88
$$ 97950 97060 96796 97254 98031 99043 100810 103386 105702 106745 106942 107492 108638 109480 109404 108885 108778 109466
54994A09466J353J664J518J028N34J33m39j188j504q53L91J289J334Q76N56N82
$$ 109466 110819 112483 114001 115029 115563 115696 115257 114069 112565 111712 112103 113392 114726 115602 116158 116740
54978A16740O22L12k31n50n06m61o22p02m82l09m54m40K43J109J163L43m63p23
$$ 116740 117362 117674 117443 116893 116387 115926 115304 114602 114120 113811 113357 112917 113160 114269 115432 115775 115312 114589
54960A14589p12o12j15P26J188Q72L23K01L73L28Jl02m25l62q4K66K41l96j166
$$ 114589 113877 113265 113150 113876 115064 115936 116259 116460 116833 117161 117162 116860 116435 116073 115989 116255 116496 116100 114934
54941A14934j304n90L96R36Q71O72P76J006Q66M01K82Q78J735K449L385M875O150
$$ 114934 113630 113040 113436 114372 115243 115915 116691 117697 118563 118964 119246 120124 121859 124308 127693 132568 138718
54924A38718O194N429N400O667Q004P991O504M249J755n92k268l067l479m121
$$ 138718 144912 150341 155741 162408 170412 178403 184907 189156 190911 190319 188051 184984 181505 177384
54910A77384n046n924o453o325n306l735k543k300k596k719k525k205j670q34
$$ 177384 172338 166414 159961 153636 148330 144595 142052 139752 137156 134437 131912 129707 128037 127203
54896A27203j66k42q32j036m78K99P68J234K293L678M328L754K847K860L841M718
$$ 127203 127037 126795 125963 124927 124449 124748 125516 126750 129043 132721 137049 140803 143650 146510 150351 155069
54880A55069M890M924N392N800N334M102K835J763N79p18j878l130m843o519p045
$$ 155069 159959 164883 170275 176075 181409 185511 188346 190109 190688 189970 188092 184962 180119 173600 166555
54865A66555o196m947m131l598l038k677k671k545j858r08k34R4K62K10k22r48
$$ 166555 160359 155412 151281 147683 144645 141968 139297 136752 134894 133986 133752 133846 134108 134318 134096 133148
54849A33148j829k818l625l714l007k172j860j954j911j496q30j54K23R1k34p5
$$ 133148 131319 128501 124876 121162 118155 115983 114123 112169 110258 108762 107932 107778 108001 108092 107858 107783
54833A07783O52J153P92K8j90M03J208J501J030P4p32q75m62l6J61K96L28Jm29
$$ 107783 108435 109588 110380 110408 110218 110621 111829 113330 114360 114434 113702 112827 112365 112329 112490 112786 113114 113115 112686
54814A12686k30N75R19J66p95p92KN48N23L95K49k30p23l73Q45J801J615P14K5
$$ 112686 112456 113031 113950 114116 113321 112529 112531 113079 113602 113997 114246 114016 113293 112920 113765 115566 117181 117895 117920
54795A17920j65j00J50O92J340J650J461J053P64O91P60R08J071J104Q75N24M67
$$ 117920 117755 117655 117805 118497 119837 121487 122948 124001 124765 125456 126216 127124 128195 129299 130174 130698 131165
54778A31165R40J614J934J844J900K556L586M424M842N086N516O243O979P149
$$ 131165 132105 133719 135653 137497 139397 141953 145539 149963 154805 159891 165407 171650 178629 185778
54764A85778O355M786L028J414j24j528k457k843l149l741m380m741m981n341
$$ 185778 192133 196919 199947 201361 201237 199709 197252 194409 191260 187519 183139 178398 173417 168076
54750A68076n474m819l521k416k009j989j803j396j169j374j700j466l97Q82J365
$$ 168076 162602 157783 154262 151846 149837 147848 146045 144649 143480 142106 140406 138940 138543 139425 140790
54735A40790Q66L06N40J260J537J173J017J881L586N170N780N292M312L615L444
$$ 140790 141656 141962 142502 143762 145299 146472 147489 149370 152956 158126 163906 169198 173510 177125 180569
54720A80569L341K765J661L30r84k123k885l251l589m256n056n432n174m531l777
$$ 180569 183910 186675 188336 188666 187682 185559 182674 179423 175834 171578 166522 161090 155916 151385 147608
54705A47608k968k088j160k24M46L13p48j919k152j442p98q53j209j314j355j681
$$ 147608 144640 142552 141392 141168 141614 141927 141179 139260 137108 135666 134868 134015 132806 131492 130137 128456
54689A28456j961j584o53Q1K37J37J01l0m43q70r42p25n95o38n37o4M91N55j31
$$ 128456 126495 124911 124258 124339 124576 124713 124814 124784 124341 123471 122529 121804 121209 120571 120034 119970 120461 121016 120885
54670A20885j163j814j750j367j263j419j215l55N76P96L42K3L79J118J567J420
$$ 120885 119722 117908 116158 114791 113528 112109 110894 110539 111115 111911 112253 112276 112655 113773 115340 116760
54654A16760R28N64N93P48M33n01j329j230l88K47K66J88L83M63J67K0M69R68
$$ 116760 117688 118252 118845 119593 120026 119525 118196 116966 116578 116825 117091 117279 117662 118125 118292 118312 118781 119749
54636A19749P31n1n20m14j87r4N7L05M95P43J212J458P95n67j493j314o01l39
$$ 119749 120480 120429 119909 119495 119308 119214 119271 119576 120071 120814 122026 123484 124279 123712 122219 120905 120304 119965
54618A19965q04j450j507o27O69J306Q38J16K01Q73J087O77M78P34O09l03j142
$$ 119965 119161 117711 116204 115577 116246 117552 118390 118506 118707 119580 120667 121344 121822 122556 123165 122862 121720
54601A21720j053l66J89N88J089J422J221P86O29P06P26P78R97J001L94n35j194
$$ 121720 120667 120301 120490 121078 122167 123589 124810 125596 126225 126931 127657 128435 129432 130433 130827 130292 129098
54584A29098j459j498j232o04qJ63J43L03M77L60K57N67Q67M17n74j114q64n34
$$ 129098 127639 126141 124909 124305 124297 124460 124603 124906 125383 125743 126000 126567 127434 127851 127277 126163 125299 124765
54566A24765o98j038j026o65k07L25Q68J055O96K49L88J154J853J832J124K73
$$ 124765 124067 123029 122003 121338 121131 121456 122324 123379 124075 124324 124712 125866 127719 129551 130675 130948
54550A30948k94o11q47q92m40N46J631K209J907Q66j76l11O10J586J523N58k07
$$ 130948 130654 130043 129196 128304 127864 128410 130041 132250 134157 135023 134847 134536 135146 136732 138255 138813 138606
54533A38606k76k58o74j095r77n82m52n23l77oK96M57N73N92M88M33L88j9p84
$$ 138606 138330 138072 137398 136303 135326 134744 134292 133769 133392 133386 133682 134139 134712 135304 135792 136225 136613 136594 135810
54514A35810j162o20L01O66L52n5k52l96n49n76m94l51J3O34J046Q81M69L39L80
$$ 135810 134648 134028 134329 134995 135347 135292 135040 134644 134095 133519 133025 132674 132687 133321 134367 135248 135717 136056 136436
54495A36436J87r9k7K98L16j17o12q74q04k53O38J136P37J25L97J459K143J910
$$ 136436 136623 136524 136497 136795 137111 136994 136382 135508 134704 134451 135089 136225 136962 137087 137484 138943 141086 142996
54477A42996J410J216J095Q88J057J864K657K705K191J784J676J561J334J285
$$ 142996 144406 145622 146717 147605 148662 150526 153183 155888 158079 159863 161539 163100 164434 165719
54463A65719J581J942J876J188K26m64p97j263k175l093l361l004k568k280j916
$$ 165719 167300 169242 171118 172306 172532 172068 171271 170008 167833 164740 161379 158375 155807 153527 151611
54448A51611j396r71p82p35q35j127j400j367j188j271j584j643j191m36L45R55
$$ 151611 150215 149244 148462 147727 146892 145765 144365 142998 141810 140539 138955 137312 136121 135685 136030 136985
54432A36985J106O67L8k09j8K93O70J136J255O58l5K26J273J702Q36k75l40M85
$$ 136985 138091 138758 138796 138587 138569 138862 139532 140668 141923 142581 142546 142772 144045 145747 146583 146308 145968 146453
54414A46453J025O61j66o94n56L3M96M28P3JL37P15R72J325J790K013J919J817
$$ 146453 147478 148139 147973 147279 146723 146756 147252 147680 147753 147754 148091 148806 149778 151103 152893 154906 156825 158642
54396A58642J691J127J45n34m51KL27N61P09L51n62j174p92pJ07m13n02L22J318
$$ 158642 160333 161460 161605 161071 160620 160622 160949 161510 162219 162570 162008 160834 160042 160035 160142 159729 159227 159549 160867
54377A60867J572J118P13R48J752K531K642J955R65L35K90N58P55P35O18O42R39
$$ 160867 162439 163557 164270 165218 166970 169501 172143 174098 175063 175398 175688 176246 177001 177736 178354 178996 179935
54360A79935J375J662J649J409J098P97M90J6p89j707k144j808j233j207j834
$$ 179935 181310 182972 184621 186030 187128 187925 188415 188431 187642 185935 183791 181983 180750 179543 177709
54345A77709k631l301l764l672k734j582j309j907k069r94M93J201J176J256J623
$$ 177709 175078 171777 168013 164341 161607 160025 158716 156809 154740 153746 154239 155440 156616 157872 159495
54330A59495J694J191M13l96j257j957k002j210J3J140J898K186J924J185K90
$$ 159495 161189 162380 162793 162397 161140 159183 157181 155971 155984 157124 159022 161208 163132 164317 164607
54315A64607l68o77r35j515k296k596j978r30l46l93m03O0O43Q77P81N22K9o11
$$ 164607 164239 163562 162627 161112 158816 156220 154242 153312 152966 152573 152170 152230 152873 153750 154531 155053 155082 154471
54297A54471q57l54M37P46M07r5l22j91J79N29N19J00l11k90M4K79L38N33R83
$$ 154471 153614 153260 153697 154443 154850 154755 154433 154242 154421 154950 155469 155569 155258 154968 155012 155291 155629 156162 157145
54278A57145J341J241P90M45M10M09J90J55R59K350L042K252Q89M06Q63J050M35
$$ 157145 158486 159727 160517 160962 161372 161781 161971 162126 163085 165435 168477 170729 171618 172024 172887 173937 174372
54261A74372k45l85m23p64r15l16O62J278J316Q87oj028j359p39q9k86q43p20
$$ 174372 174127 173742 173319 172555 171640 171324 171986 173264 174580 175467 175461 174433 173074 172335 172246 171960 171117 170397
54243A70397QL18k41j111j688j768j160J52J409J528M87n49p15l81l26n66n56
$$ 170397 170405 170723 170482 169371 167683 165915 164755 164907 166316 167844 168331 167782 167067 166686 166360 165794 165238
54226A65238j29K68J79l83j000j222r13l61j29o12j650k499k353j117L64J110
$$ 165238 165109 165377 165556 165173 164173 162951 162038 161677 161548 160936 159286 156787 154434 153317 153681 154791
54210A54791J019P15N27J84m35q42o33m5M63P95J017J033Q26N94L58j29o97o57
$$ 154791 155810 156525 157052 157236 156801 155959 155326 155281 155744 156539 157556 158589 159415 160009 160367 160238 159541 158884
54192A58884J11O37J38p15o88K91J175J340J113R63R82J243J800K330K363K004
$$ 158884 158995 159632 159770 159055 158367 158658 159833 161173 162286 163249 164231 165474 167274 169604 171967 173971
54176A73971J748J655J309O26pm39q94j369j569j534j662j940j837j214o54o18
$$ 173971 175719 177374 178683 179309 179302 178863 177969 176600 175031 173497 171835 169895 168058 166844 166190 165572
54160A65572p96o94l09J09N18Q90Q85K49p08j355j391j026o17l78l68n52q26j029
$$ 165572 164776 164082 163773 163882 164400 165290 166175 166424 165716 164361 162970 161944 161327 160949 160581 160029 159203 158174
54142A58174r56m69L32J113J593J760J746J677J645J593J178J55r40j076n5R79
$$ 158174 157218 156749 157081 158194 159787 161547 163293 164970 166615 168208 169386 169541 168601 167525 167470 168449
54126A68449R63L30K89J077J828J949J692J362R17M73L35L26q5p44p20K73J159
$$ 168449 169412 169742 170031 171108 172936 174885 176577 177939 178856 179329 179664 179990 179905 179161 178441 178714 179873
54109A79873P80o66k000k431k009j160l76j04l72o13k91M22R68J172J255J185
$$ 179873 180653 179987 177987 175556 173547 172387 172011 171907 171535 170922 170631 171053 172021 173193 174448 175633
54093A75633N81o11j763k147j686r29m42l41m00l30O8Q85J938K752K943K677K453
$$ 175633 176214 175603 173840 171693 170007 169078 168636 168295 167895 167565 167633 168518 170456 173208 176151 178828 181281
54076A81281K425K288J965J931K498L188L273K782K379K408K536K264J432J64
$$ 181281 183706 185994 187959 189890 192388 195576 198849 201631 204010 206418 208954 211218 212650 212814
54062B12814j173k001j967j443j208j523j880j693r95k66J65M56J030K049K962
$$ 212814 211641 209640 207673 206230 205022 203499 201619 199926 198931 198665 198830 199286 200316 202365 205327
54047B05327K958K032J184J171J521J402J068J501K842M168M936N582O433O910
$$ 205327 208285 210317 211501 212672 214193 215595 216663 218164 221006 225174 230110 235692 242125 249035
54033B49035O434N400M643M435M575M943N352N275M400L210K415J955J195Q0o36
$$ 249035 255469 260869 265512 269947 274522 279465 284817 290092 294492 297702 300117 302072 303267 303347 302711
54018C02711l84M73J166J367J216P46k44j739l217m078m210m014l889l901l964
$$ 302711 302327 302800 303966 305333 306549 307295 307051 305312 302095 298017 293807 289793 285904 282003 278039
54003B78039m022l964l625l127k919l230l647l575k963k228j614j085p50r45j648
$$ 278039 274017 270053 266428 263301 260382 257152 253505 249930 246967 244739 243125 242040 241290 240345 238697
53988B38697k226j968q13N38J278J266J138J462J855J399oj333j761j715j969
$$ 238697 236471 234503 233690 234228 235506 236772 237910 239372 241227 242626 242620 241287 239526 237811 235842
53973B35842k384k344j954j867k107k148j989k162k561k322j194n4L29K40K89
$$ 235842 233458 231114 229160 227293 225186 223038 221049 218887 216326 214004 212810 212756 213085 213325 213614
53958B13614N08O27O80Q18J019J368K109L044L446L053K587K782L339L515L308
$$ 213614 214122 214749 215429 216247 217266 218634 220743 223787 227233 230286 232873 235655 238994 242509 245817
53943B45817L389M009M608M507L709K858K638L081L498L243K535K130K157J920
$$ 245817 249206 253215 257823 262330 266039 268897 271535 274616 278114 281357 283892 286022 288179 290099
53929B90099J013Q2PP95J774K534L198L947M725N375N735N728N467N278N451O073
$$ 290099 291112 291194 291201 291996 293770 296304 299502 303449 308174 313549 319284 325012 330479 335757 341208 347281
53913C47281P057Q070Q574Q315P772P576P547O892N395L773K646J883J209O95
$$ 347281 354338 362408 370982 379297 387069 394645 402192 409084 414479 418252 420898 422781 423990 424685
53899D24685K85m61j686k864l584m074m524m609m262m221n040o132o626o657o926
$$ 424685 424970 424509 422823 419959 416375 412301 407777 403168 398906 394685 389645 383513 376887 370230 363304
53884C63304p424p531p186o917o818o415n610m936m711m617m298l794l234k666
$$ 363304 355880 348349 341163 334246 327428 321013 315403 310467 305756 301139 296841 293047 289813 287147
53870B87147k362k779l858m832m892l990k830k295k798l855m326l417j568q5J51
$$ 287147 284785 282006 278148 273316 268424 264434 261604 259309 256511 252656 248330 244913 243345 243260 243411
53855B43411o18j609k347k844l173l261l034k586k060j464p42j06J5m09p56n33
$$ 243411 242793 241184 238837 235993 232820 229559 226525 223939 221879 220415 219673 219567 219582 219173 218417 217884
53839B17884j50k72o00j90R83J753J432P53N81N33j29j046j241o84k76l69l59
$$ 217884 217734 217462 216862 216672 217655 219408 220840 221593 222174 222707 222578 221532 220291 219607 219331 218962 218603
53822B18603K17J045J647J965K071J861J309O41J18j00O6N34J047J499K100K915
$$ 218603 218820 219865 221512 223477 225548 227409 228718 229359 229477 229377 229443 229977 231024 232523 234623 237538
53806B37538L575L838M017M331M328L691L231M053N883P200P164O453O020N943
$$ 237538 241113 244951 248968 253299 257627 261318 264549 268602 274485 281685 288849 295302 301322 307265
53792C07265N814N462M844L894K933K575K818K740J666J71o52n96m92j073k246
$$ 307265 313079 318541 323385 327279 330212 332787 335605 338345 340011 340182 339530 338934 338442 337369 335123
53777C35123l388m013m102m006m077m365m704n024n280n186m390l129k251k370
$$ 335123 331735 327722 323620 319614 315537 311172 306468 301444 296164 290978 286588 283459 281208 278838
53763B78838l167l843m028l981m001l980l603k859k139j812j722j334m59M09O88
$$ 278838 275671 271828 267800 263819 259818 255838 252235 249376 247237 245425 243703 242369 241910 242319 243007
53748B43007M07o1o59j534k292k049n72J093J571O15p28j397j352j248j334j125
$$ 243007 243414 243353 242694 241160 238868 236819 236247 237340 238911 239526 238798 237401 236049 234801 233467 232342
53732B32342k22R65J695J864J936J938J283j10j183q82M81J617J826J498J270
$$ 232342 232120 233085 234780 236644 238580 240518 241801 241691 240508 239626 240107 241724 243550 245048 246318
53717B46318J307J494J701J782J640J395J191R31N91N60J183K085K559K535K611
$$ 246318 247625 249119 250820 252602 254242 255637 256828 257759 258350 258910 260093 262178 264737 267272 269883
53702B69883L045L483L713M035M547M756M319L738L727M174M198L181J494R5m22
$$ 269883 272928 276411 280124 284159 288706 293462 297781 301519 305246 309420 313618 316799 318293 318388 317966
53687C17966m30q17j908k980k984j680J90J642K092J484K89p28j125j136j176
$$ 317966 317536 316719 314811 311831 308847 307167 307357 308999 311091 312575 312864 312136 311011 309875 308699
53672C08699j185r04m89k81j20M07J128J380R86M69K64K92L64L50l8r41j727j492
$$ 308699 307514 306610 306121 305840 305720 306127 307255 308635 309621 310090 310354 310646 311010 311360 311322 310381 308654 307162
53654C07162l60N80P26N64N15K69k85m19L45J295J501J115Q69Q01M37j10j66M26
$$ 307162 306802 307382 308108 308672 309187 309456 309171 308752 309097 310392 311893 313008 313877 314678 315115 315005 314839 315265
53636C15265J052J198J024J009J477K416L369L584K743J463O92O37P46N93L81
$$ 315265 316317 317515 318539 319548 321025 323441 326810 330394 333137 334600 335292 335929 336675 337268 337649
53621C37649M83R07J322J476J468J700K413L271L616L269K734K525K583K657K788
$$ 337649 338132 339039 340361 341837 343305 345005 347418 350689 354305 357574 360308 362833 365416 368073 370861
53606C70861L108L424L448L197K843K440K074J995K224K318J961J493J387J477
$$ 370861 373969 377393 380841 384038 386881 389321 391395 393390 395614 397932 399893 401386 402773 404250
53592D04250J252O93K67J44qm17q97j195j269j222j236j522k042k348k035j304
$$ 404250 405502 406195 406462 406606 406598 406181 405284 404089 402820 401598 400362 398840 396798 394450 392415 391111
53576C91111p10m66l67l47o90j541k517k926k357j066J20M69O8l48l21j18j04
$$ 391111 390401 389935 389568 389221 388531 386990 384473 381547 379190 378124 378244 378713 378781 378433 378112 377994 377890
53559C77890j41LJ31L7K6M16Q66Q64O56R32J723K321K315J988J666J374J132J012
$$ 377890 377749 377752 377883 377920 377946 378362 379228 380092 380748 381680 383403 385724 388039 390027 391693 393067 394199 395211
53541C95211P97L40J96J103K690L643L419K914L041L554L962M664O244Q179R288
$$ 395211 396008 396348 396544 397647 400337 403980 407399 410313 413354 416908 420870 425534 431778 439957 449245
53526D49245R358R315R801J0386J0440J0168J0335J1238J2380J3105J3341J3613
$$ 449245 458603 467918 477719 488105 498545 508713 519048 530286 542666 555771 569112 582725
53514E82725J4327J5314J6256J7375J9156K1322K2768K2886K2443K2593K3381
$$ 582725 597052 612366 628622 645997 665153 686475 709243 732129 754572 777165 800546
53503H00546K3873K3554K2859K2338K2003K1693K1476K1457K1492K1377K1027
$$ 800546 824419 847973 870832 893170 915173 936866 958342 979799 1001291 1022668 1043695
53492A043695K0346J9293J8214J7752J8131J8804J9126J9093J9106J9240J9183
$$ 1043695 1064041 1083334 1101548 1119300 1137431 1156235 1175361 1194454 1213560 1232800 1251983
53481A251983J8814J8420J8202J7932J7289J6393J5732J5569J5538J4915J3328
$$ 1251983 1270797 1289217 1307419 1325351 1342640 1359033 1374765 1390334 1405872 1420787 1434115
53470A434115J1085Q820O886N199L482J488r78l861o628q585r620j0407j1553
$$ 1434115 1445200 1454020 1460906 1466105 1469587 1471075 1470097 1466236 1459608 1451023 1441403 1430996 1419443
53457A419443j2791j3403j3246j3007j3386j4466j5864j7170j8054j8322j8076
$$ 1419443 1406652 1393249 1380003 1366996 1353610 1339144 1323280 1306110 1288056 1269734 1251658
53446A251658j7698j7524j7632j7920j8201j8092j7222j5697j4148j3029j2057
$$ 1251658 1233960 1216436 1198804 1180884 1162683 1144591 1127369 1111672 1097524 1084495 1072438
53435A072438j0581q366n793l461j786q72m67r6N55J422K381L572N137O812Q133
$$ 1072438 1061857 1053491 1047698 1044237 1042451 1041579 1041112 1041016 1041571 1042993 1045374 1048946 1054083 1060895 1069028
53420A069028R026R836J0839J2059J3560J5513J7705J9450K0242K0424K0834K1861
$$ 1069028 1078054 1087890 1098729 1110788 1124348 1139861 1157566 1177016 1197258 1217682 1238516 1260377
53408A260377K3067K3833K4171K4702K5836K7259K8457K9549L1228L3743L6488
$$ 1260377 1283444 1307277 1331448 1356150 1381986 1409245 1437702 1467251 1498479 1532222 1568710
53397A568710L8796M0799M3024M5476M7634M9192N0315N1169N1729N2107N2611
$$ 1568710 1607506 1648305 1691329 1736805 1784439 1833631 1883946 1935115 1986844 2038951 2091562
53386B091562N3305N3851N3882N3211N1712M9437M6880M4664M2775M0594L7830
$$ 2091562 2144867 2198718 2252600 2305811 2357523 2406960 2453840 2498504 2541279 2581873 2619703
53375B619703L4972L2490L0099K7131K3370J9080J4506R708M711m73n928j1749
$$ 2619703 2654675 2687165 2717264 2744395 2767765 2786845 2801351 2811059 2815770 2815297 2809369 2797620
53363B797620j7965k4578l1377l7585m2151m4724m6062m7209m8472m9476m9900
$$ 2797620 2779655 2755077 2723700 2686115 2643964 2599240 2553178 2505969 2457497 2408021 2358121
53352B358121m9840m9553m9140m8340m6642m3921m1051l9346l9050l9013l8285
$$ 2358121 2308281 2258728 2209588 2161248 2114606 2070685 2029634 1990288 1951238 1912225 1873940
53341A873940l7400l7349l7810l7367l5352l2549l0007k7993k6247k4503k2499
$$ 1873940 1836540 1799191 1761381 1724014 1688662 1656113 1626106 1598113 1571866 1547363 1524864
53330A524864j9995j7159j4523j2376j0664r531r450j0488j1977j3252j4250j5072
$$ 1524864 1504869 1487710 1473187 1460811 1450147 1440616 1431166 1420678 1408701 1395449 1381199 1366127
53318A366127j5471j5227j4662j4205j3707j2742j1479j0651j0561j0583r825
$$ 1366127 1350656 1335429 1320767 1306562 1292855 1280113 1268634 1257983 1247422 1236839 1227014
53307A227014q023n680l502j896q44r4N79J325K289L621N338P294R384J1568J3677
$$ 1227014 1218991 1213311 1209809 1207913 1207069 1206975 1207554 1208879 1211168 1214789 1220127 1227421 1236805 1248373 1262050
53292A262050J5333J6362J7098J8099J9604K1417K3106K4135K3963K2555K0723
$$ 1262050 1277383 1293745 1310843 1328942 1348546 1369963 1393069 1417204 1441167 1463722 1484445
53281A484445J9517J9098J8570J7120J4926J2693J0692Q642O302L688Q22k264
$$ 1484445 1503962 1523060 1541630 1558750 1573676 1586369 1597061 1605703 1612005 1615693 1616515 1614251
53269A614251n246p666r498j1209j3200j5523j8134k0950k3434k4734k4762k4645
$$ 1614251 1609005 1601339 1591841 1580632 1567432 1551909 1533775 1512825 1489391 1464657 1439895 1415250
53257A415250k5542k7173k8236k8197k7887k8098k8351k7608k5817k4033k3126
$$ 1415250 1389708 1362535 1334299 1306102 1278215 1250117 1221766 1194158 1168341 1144308 1121182
53246A121182k2943k2828k2464k1983k1548k1241k1158k1247k1123k0462j9564
$$ 1121182 1098239 1075411 1052947 1030964 1009416 988175 967017 945770 924647 904185 884621
53235H84621j9093j9056j8497j6677j4189j2283j1286j0427r192q048p463p051
$$ 884621 865528 846472 827975 811298 797109 784826 773540 763113 753921 745873 738410 731359
53223G31359o284n536n664o891q654j0397j1888j2927j3401j3578j3797j3993
$$ 731359 725075 719539 713875 706984 698330 687933 676045 663118 649717 636139 622342 608349
53211F08349j3984j4022j4375j4596j3975j2696j1705j1326j0869r877q854q404
$$ 608349 594365 580343 565968 551372 537397 524701 512996 501670 490801 480924 472070 463666
53199D63666q320q149q034q429r332j0326j1045j1240j0670r431q163p518p510
$$ 463666 455346 447197 439163 430734 421402 411076 400031 388791 378121 368690 360527 353009 345499
53186C45499p589p186o114m724l760l707m176m347m009l624l335k702j706j102
$$ 345499 337910 330724 324610 319886 316126 312419 308243 303896 299887 296263 292928 290226 288520 287418
53172B87418j258j458j018m39o14j371j702j214n29l68q65j728k551k961k889
$$ 287418 286160 284702 283684 283245 282631 281260 279558 278344 277815 277447 276582 274854 272303 269342 266453
53157B66453k548k005j089k9M13n5o72o55k69j93l40k23K2p8l21j74J13k01j000
$$ 266453 263905 261900 260811 260782 261195 261140 260468 259813 259544 259351 259011 258788 258810 258732 258411 258237 258350 258149 257149
53138B57149j351r31m02k06K0N72J151J535J983K606L030L009K825K765K829L040
$$ 257149 255798 254867 254465 254259 254279 254851 256002 257537 259520 262126 265156 268165 270990 273755 276584 279624
53122B79624L444L690L345K771K877L808M729N132N373N553M946L278J579Q59
$$ 279624 283068 286758 290103 292874 295751 299559 304288 309420 314793 320346 325292 328570 330149 331008
53108C31008O93J5j251k392l244m209n231n795n909o104o365o008m825l578k978
$$ 331008 331701 331716 330465 328073 324829 320620 315389 309594 303685 297581 291216 285208 280383 276805 273827
53093B73827k862k685k311j839j208m79k35r70k224k871k431j599j300j595j846
$$ 273827 270965 268280 265969 264130 262922 262443 262208 261238 259014 256143 253712 252113 250813 249218 247372
53078B47372j676j234o53J71J083J481J049L21J0K6l59j339k198k219j508o73
$$ 247372 245696 244462 243809 243980 245063 246544 247593 247914 247924 247950 247591 246252 244054 241835 240327 239654
53062B39654m8M54Q99J176J197J031P60L40k53q16j001o69l3O87J543K450K730
$$ 239654 239606 240060 240959 242135 243332 244363 245123 245463 245210 244394 243393 242724 242691 243378 244921 247371 250101
53045B50101J674l01j722j668p65j64j06j17p3j85k06L52J257J699J413Q99M55
$$ 250101 251775 251474 249752 248084 247319 247155 247049 246932 246859 246674 246468 246820 248077 249776 251189 252088 252543
53028B52543j32p71q52k86R1k77p39l84N55R63L79l99l40O29J598J703R80K10
$$ 252543 252411 251640 250788 250502 250593 250316 249577 249193 249748 250711 251090 250691 250351 250980 252578 254281 255261 255471
53010B55471l4J22L79P71J307J408N67o63j051k22R45J579J747J875J932J691
$$ 255471 255437 255559 255938 256709 258016 259424 259991 259328 258277 258055 259000 260579 262326 264201 266133 267824
52994B67824J288J076J122J233J257J208J305J908K987L716L126J372k77q89p45
$$ 267824 269112 270188 271310 272543 273800 275008 276313 278221 281208 284924 288050 289422 289145 288256 287511
52979B87511n94o69q21r68r80o10M3L92J49j69O3P52J290J354J132R90J191J690
$$ 287511 286917 286248 285427 284459 283479 282869 282912 283304 283453 283284 283347 284099 285389 286743 287875 288865 290056 291746
52961B91746K093K061J756J460Q83m26k018k780k426j876j795j711j083l24k8
$$ 291746 293839 295900 297656 299116 299999 299573 297555 294775 292349 290473 288678 286967 285884 285560 285532
52946B85532k3N8m7o88j480j810j654j252n79J73K58n62j205n73Q25J521J070
$$ 285532 285509 285567 285520 284832 283352 281542 279888 278636 278057 278230 278488 277926 276721 276148 276973 278494 279564
52929B79564L03n6l7J91N67P61M74K0p4L3k34q49j275j354j335j215q87p13r52
$$ 279564 279867 279811 279774 279965 280532 281293 281767 281787 281713 281746 281512 280663 279388 278034 276699 275484 274597 273884 272932
52910B72932r38P7J375J446K16p39m66J98J80k99n45n85o93n90J9O71Q12P42J083
$$ 272932 271994 272071 273446 274892 275108 274369 273903 274101 274281 273982 273437 272852 272159 271569 271588 272259 273071 273813 274896
52891B74896J644J643Q74m9n65p04p75q89q58l42Q11K182K964K742J935J319J324
$$ 274896 276540 278183 279057 279008 278443 277739 276964 276075 275217 274875 275686 277868 280832 283574 285509 286828 288152
52874B88152J866K549K834K405J641J320J552J428K41j343j994j453q62j237k240
$$ 288152 290018 292567 295401 297806 299447 300767 302319 303747 303988 302645 300651 299198 298336 297099 294859
52859B94859k802k530k012j919k254k617k806k892k836k398j563q01o59j154j716
$$ 294859 292057 289527 287515 285596 283342 280725 277919 275027 272191 269793 268230 267429 266770 265616 263900
52844B63900j816j527j418j832k373k201j018M38J081O20k43p07o04k32J25K87
$$ 263900 262084 260557 259139 257307 254934 252733 251715 252153 253234 253854 253611 252904 252300 252068 252193 252480
52828B52480J70q5j71J0K80M87O27O02L57K35O48J262J202L08n33o98o40r03j128
$$ 252480 252650 252565 252394 252404 252684 253171 253798 254400 254757 254992 255640 256902 258104 258412 257879 257181 256541 255638 254510
52809B54510q09l03j83k04J34M43qr59j518j615j900k330k072r80PJ81k00o91
$$ 254510 253701 253398 253215 253011 253145 253588 253580 252621 251103 249488 247588 245258 243186 242206 242213 242394 242194 241503
52791B41503j222j487q58N60J614J454O27K30N15Q72P85L06k30m74k84J18L45
$$ 241503 240281 238794 237936 238496 240110 241564 242191 242421 242936 243808 244593 244899 244669 244195 243911 244029 244374
52774B44374K73R6o3k58m81o64q12q38m43L17P15K77k64J19J090J331N82R6P02
$$ 244374 244647 244743 244680 244422 243941 243277 242465 241627 241184 241501 242216 242493 242229 242348 243438 244769 245351 245447 246149
52755B46149J652J936J673J482J300P44K8k61J7N48J081J495J645J571J526J563
$$ 246149 247801 249737 251410 252892 254192 254936 254964 254703 254720 255268 256349 257844 259489 261060 262586 264149
52739B64149J466J295J413J742J663R95M38N90J170J625J861J893J442N37j42
$$ 264149 265615 266910 268323 270065 271728 272723 273161 273751 274921 276546 278407 280300 281742 282279 282137
52724B82137j13J68N2l42n42o35j002j520j687j334o68R5O86O79l3r75j600j789
$$ 282137 282024 282192 282244 281902 281360 280725 279723 278203 276516 275182 274514 274609 275295 275974 275941 274966 273366 271577
52706B71577j507o15N73J196R10M55N70Q88P17K31Q1K95M14L93M39L22k24p50
$$ 271577 270070 269455 270028 271224 272134 272589 273159 274047 274764 274995 275076 275371 275785 276178 276617 276939 276715 275965
52688B75965o64k54j84k40K33Q75N71o92j436p27N50R65L10n91j222j747k291
$$ 275965 275301 275047 274863 274623 274856 275731 276302 275610 274174 273447 273997 274962 275272 274681 273459 271712 269421
52671B69421k584k343j631p69k8N34J003J381J527J378J137J090J326J714J979
$$ 269421 266837 264494 262863 262094 262066 262600 263603 264984 266511 267889 269026 270116 271442 273156 275135
52656B75135J875J479J369K002K942L227K638J918J508Q88k82j302j475j289j570
$$ 275135 277010 278489 279858 281860 284802 288029 290667 292585 294093 294981 294699 293397 291922 290633 289063
52641B89063k009j677o84j16m33r66j042o69k2P86J345J184O03M78J021J504J339
$$ 289063 287054 285377 284693 284577 284144 283178 282136 281467 281445 282231 283576 284760 285363 285841 286862 288366 289705
52624B89705P63J93l71j019j590j935k021j669p22M17R66O62k9o02q71o99q3M29
$$ 289705 290468 290661 290290 289271 287681 285746 283725 282056 281334 281751 282717 283379 283350 282748 281877 281178 281095 281524
52606B81524J84n52q07l07J85J39K9L48P07N18l1l08j74j5j70o52j173j237n34
$$ 281524 281708 281156 280349 280042 280227 280366 280395 280743 281450 281968 281937 281629 281455 281440 281270 280618 279445 278208 277674
52587B77674N34J196J306J435J768J681Q67K21Q32K443L580L161J505j46q38o39
$$ 277674 278208 279404 280710 282145 283913 285594 286461 286682 287514 289957 293537 296698 298203 298057 297219 296580
52571B96580l74o06j011j031q22j001j490j503q08j49n7j16J09J92l77j219j565
$$ 296580 296206 295600 294589 293558 292736 291735 290245 288742 287934 287785 287728 287612 287721 287913 287536 286317 284752
52554B84752j316q73l61K31M59j80j389k227k133j305k18P35J212J089O12J27
$$ 284752 283436 282563 282202 282433 282892 282712 281323 279096 276963 275658 275440 276175 277387 278476 279088 279215
52538B79215j87j02P40K187L258L131K188J451J157P11n9l94K81J416J901J325
$$ 279215 279028 278926 279666 281853 285111 288242 290430 291881 293038 293749 293690 293296 293577 294993 296894 298219
52522B98219L69P4Q33K015K609K276J683J608J995K234K149K181K593K977K790
$$ 298219 298588 298662 299495 301510 304119 306395 308078 309686 311681 313915 316064 318245 320838 323815 326605
52507C26605K040J216O24K9j002k420l615m107m149m294m435l891k517j173p20
$$ 326605 328645 329861 330485 330514 329512 327092 323477 319370 315221 310927 306492 302601 300084 298911 298191
52492B98191j021j364j407j241q85l42R0M7m06r15j223j180o50J64P29Q87J159
$$ 298191 297170 295806 294399 293158 292273 291931 292021 292068 291662 290747 289524 288344 287694 287858 288587 289474 290633
52475B90633J806K217J883J432J737K469K661K387K554L124L075K288K041K974
$$ 290633 292439 294656 296539 297971 299708 302177 304838 307225 309779 312903 315978 318266 320307 323281
52461C23281L964L864L140K733K290Q39j347k948l453l642m187m785m844m240
$$ 323281 327245 331109 334249 336982 339272 340111 338764 335816 332363 328721 324534 319749 314905 310665
52447C10665l171j937j028q89j371j864k017j944j717j266p92o78q22o26N6N37
$$ 310665 307494 305557 304529 303640 302269 300405 298388 296444 294727 293461 292669 291991 291169 290543 290599 291136
52431B91136K46l87m80K11J136J689J689J342J056J200J731K111J937J462J218
$$ 291136 291382 290995 290515 290726 291862 293551 295240 296582 297638 298838 300569 302680 304617 306079 307297
52416C07297J264J190Q34M88L97M39N45R91J958L006L462L282L259M155N735O863
$$ 307297 308561 309751 310585 311073 311470 311909 312454 313445 315403 318409 321871 325153 328412 332567 338302 345165
52400C45165O572M967K952J213l12j931l548m762n359n333m627l266j762q47p11
$$ 345165 351737 356704 359656 360869 360557 358626 355078 350316 344957 339624 334997 331731 329969 329122 328411
52385C28411q31p57n72n07m79l69k99k16L80J780L399M319M326L890L309K620
$$ 328411 327580 326823 326251 325744 325265 324896 324597 324381 324761 326541 329940 334259 338585 342475 345784 348404
52369C48404K208K647L646M004L063J585P34O26N68K78O5k8m24j173j593j144
$$ 348404 350612 353259 356905 360909 363972 365557 366291 366917 367485 367763 367828 367800 367376 366203 364610 363466
52353C63466k09M21N83Q08J420K101K379K241J944J549J000N61O95J417K164K503
$$ 363466 363257 363678 364261 365069 366489 368590 370969 373210 375154 376703 377703 378264 378959 380376 382540 385043
52337C85043K612K820L076L294L930N480P539R014R459R573J0156J1124J1940
$$ 385043 387655 390475 393551 396845 400775 406255 413794 422808 432267 441840 451996 463120 475060
52324D75060J2537J3298J4298J5092J5239J4763J4085J3681J3736J4044J4394
$$ 475060 487597 500895 515193 530285 545524 560287 574372 588053 601789 615833 630227
52313F30227J5022J6372J8353K0227K1484K2341K3178K3852K4103K4147K4332
$$ 630227 645249 661621 679974 700201 721685 744026 767204 791056 815159 839306 863638
52302H63638K4507K4352K4128K4310K4602K4031K2142J9435J6540J3576J0630
$$ 863638 888145 912497 936625 960935 985537 1009568 1031710 1051145 1067685 1081261 1091891
52291A091891Q159O522N420M247K736R94q13k511l882m903n850o935q060r083
$$ 1091891 1100050 1106572 1111992 1116239 1118975 1119969 1119156 1116645 1112763 1107860 1102010 1095075 1087015 1077932
52277A077932j0038j0743j0602r242p231n574m543l449j686M72K276L417M238
$$ 1077932 1067894 1057151 1046549 1037307 1030076 1024502 1019959 1016510 1014824 1015296 1017572 1020989 1025227
52264A025227N227O559Q085R564J0906J2247J3768J5399J6803J7834J8825K0175
$$ 1025227 1030454 1037013 1045098 1054662 1065568 1077815 1091583 1106982 1123785 1141619 1160444 1180619
52252A180619K1565K1946K0577J7958J5395J3613J2128J0104P448M743K355J42
$$ 1180619 1202184 1224130 1244707 1262665 1278060 1291673 1303801 1313905 1321353 1326096 1328451 1328593
52240A328593j995l820n244o726q768j1216j3395j4902j5958j6966j8030j8996
$$ 1328593 1326598 1322778 1317534 1310808 1302040 1290824 1277429 1262527 1246569 1229603 1211573 1192577
52228A192577j9731k0187k0321k0111j9610j8881j8025j7272j6874j6686j6038
$$ 1192577 1172846 1152659 1132338 1112227 1092617 1073736 1055711 1038439 1021565 1004879 988841
52217I88841j4362j1954r799q561q033p739p558p389o584m513j763Pj01j053j054
$$ 988841 974479 962525 952726 944165 936132 928393 920835 913446 906862 902349 900586 900593 900492 899439 898385
52202H98385L55J958K546K251K071K619L702M813N565N838N750N568N409N100
$$ 898385 898740 900698 903244 905495 907566 910185 913887 918700 924265 930103 935853 941421 946830 951930
52188I51930M420L380K085N03j348l156m564n619o612p437p600p022o422o478
$$ 951930 956350 959730 961815 962318 960970 957814 953250 947631 941019 933582 925982 918960 912538 906060
52174I06060o907o783n703m177k924k171j753j479j189o58K07J201J965K247K018
$$ 906060 899153 892370 886667 882490 879566 877395 875642 874163 872974 872316 872523 873724 875689 877936 879954
52159H79954J486J085J191J682J972J668R77L76Q6J21N25J204J727J733J442J326
$$ 879954 881440 882525 883716 885398 887370 889038 890015 890391 890477 890598 891123 892327 894054 895787 897229 898555
52143H98555J407J358J218J394J891K182K070K050K462K902L014L415M970P418
$$ 898555 899962 901320 902538 903932 905823 908005 910075 912125 914587 917489 920503 923918 928888 936306
52129I36306R504J0576J1297J2496J4007J5147J5947J7181J9220K1466K3117K4051
$$ 936306 945810 956386 967683 980179 994186 1009333 1025280 1042461 1061681 1083147 1106264 1130315
52117A130315K4662K5068K5070K4721K4490K4604K4671K4219K3405K2780K2563
$$ 1130315 1154977 1180045 1205115 1229836 1254326 1278930 1303601 1327820 1351225 1374005 1396568
52106A396568K2474K2205K1658K0793J9642J8424J7287J5932J3931J1356Q642
$$ 1396568 1419042 1441247 1462905 1483698 1503340 1521764 1539051 1554983 1568914 1580270 1588912
52095A588912N839K560j167m685p627j0348j3025j4992j5647j5559j5893j6991
$$ 1588912 1594751 1597311 1596144 1591459 1583832 1573484 1560459 1545467 1529820 1514261 1498368 1481377
52083A481377j8196j8938j9241j9264j8985j8447j7759j6760j5223j3433j1960
$$ 1481377 1463181 1444243 1425002 1405738 1386753 1368306 1350547 1333787 1318564 1305131 1293171
52072A293171j0766r086o519l634j240N82K345M413O776R287J1763J3947J5694
$$ 1293171 1282405 1273319 1266800 1263166 1261926 1262508 1264853 1269266 1276042 1285329 1297092 1311039 1326733
52059A326733J7185J8705K0229K1300K1389K0397J8848J7502J6561J5424J3434
$$ 1326733 1343918 1362623 1382852 1404152 1425541 1445938 1464786 1482288 1498849 1514273 1527707
52048A527707J0752Q077N657L143M55j936l796n604p763r892j1455j2644j3970
$$ 1527707 1538459 1546536 1552193 1555336 1555791 1553855 1550059 1544455 1536692 1526800 1515345 1502701 1488731
52035A488731j5277j5937j5932j5991j6499j7058j7377j7887j8976k0040k0068
$$ 1488731 1473454 1457517 1441585 1425594 1409095 1392037 1374660 1356773 1337797 1317757 1297689
52024A297689j8972j7801j7581j8363j9414j9962j9521j7988j5776j3720j2517
$$ 1297689 1278717 1260916 1243335 1224972 1205558 1185596 1166075 1148087 1132311 1118591 1106074
52013A106074j2180j2151j1892j1282j0606j0315j0733j1774j3011j4132j5178
$$ 1106074 1093894 1081743 1069851 1058569 1047963 1037648 1026915 1015141 1002130 987998 972820
52002I72820j6166j6749j6555j5739j4729j3606j2264j1164j1133j2176j3189
$$ 972820 956654 939905 923350 907611 892882 879276 867012 855848 844715 832539 819350
51991H19350j3364j3298j4079j5662j6959j7306j7114j7047j7212j7308j7083
$$ 819350 805986 792688 778609 762947 745988 728682 711568 694521 677309 660001 642918
51980F42918j6428j5401j4272j3260j2202j0823r275p958o800n245l130j016N87
$$ 642918 626490 611089 596817 583557 571355 560532 551257 543299 536499 531254 528124 527108 527695
51967E27695J866L211M473N123N057M800M831M891M197K373K24q16j31J459K855
$$ 527695 529561 532772 537245 542368 547425 552225 557056 561947 566144 568517 568741 567925 567794 569253 572108
51952E72108M027N636P701R535J0928J2398J3992J4736J3812J1523Q558N041J055
$$ 572108 576135 581771 589472 599007 609935 622333 636325 651061 664873 676396 684954 689995 691050
51939F91050k465m316m378l709l359l621m247m894n396o018p273r131j0775j1621
$$ 691050 688585 684269 679891 676182 672823 669202 664955 660061 654665 648647 641374 632243 621468 609847
51925F09847j2237j3488j5055j5753j5198j4240j3560j2782j1375r655q257p190
$$ 609847 597610 584122 569067 553314 538116 523876 510316 497534 486159 476504 468247 461057
51913D61057o058m899m098l611k844j412M00J969K910L190K939K284J360L01q40
$$ 461057 454999 450100 446002 442391 439547 438135 438535 440504 443414 446604 449543 451827 453187 453488 452648
51898D52648k153l733n414o778p601q090q455q426p617o322n404n131m629k844
$$ 452648 450495 446762 441348 434570 426969 418879 410424 401998 394381 388059 382655 377524 372895 370051
51884C70051P9K783L995L658K881K976M427O517P956Q011P031N824M763L711K627
$$ 370051 370130 372913 376908 380566 383447 386423 390850 397367 405323 413334 420365 426189 430952 434663 437290
51869D37290J765J229P75K51q6O6N65J036J401J841K278K357K040J754J762J706
$$ 437290 439055 440284 441059 441310 441224 441290 441855 442891 444292 446133 448411 450768 452808 454562 456324 458030
51853D58030J114M5j168k539m228n906o928p221p372p716p843p367o577n931n309
$$ 458030 459144 459189 458021 455482 451254 445348 438420 431199 423827 416111 408268 400901 394324 388393 383084
51838C83084m326l091k102j500r52k72K66L26j5k80OP84J328R27r9n90OQ43Q55
$$ 383084 378758 375667 373565 372065 371113 370841 371107 371433 371418 371138 371144 371928 373256 374183 374084 373494 373500 374343 375198
51819C75198J92k98n34j069j683j354K0J056O34n93j176p42r1J53J89M02P68R65
$$ 375198 375390 375092 374558 373489 371806 370452 370472 371528 372162 371569 370393 369651 369560 369713 369902 370304 371072 372037
51801C72037P61L21K45J052K433L366L306K811K578K391J638M71l33n70p94j281
$$ 372037 372798 373119 373364 374416 376849 380215 383521 386332 388910 391301 392939 393410 393077 392507 391713 390432
51785C90432j632j577j556k078k963l563l481k796j841q89P8J410L318N424P050
$$ 390432 388800 387223 385667 383589 380626 377063 373582 370786 368945 368056 368134 369544 372862 378286 385336
51770C85336P909Q175P911P062N971N218M690L532J421p19j883k304k941m003
$$ 385336 393245 401420 409331 416393 422364 427582 432272 435804 437225 436506 434623 432319 429378 425375
51756D25375m825m987m787m598m517m694n279n863n665m581l429k796k231j092
$$ 425375 420550 415563 410776 406178 401661 396967 391688 385825 380160 375579 372150 369354 367123 366031
51742C66031L32J204J350J423J929K684L289L654L918M207M612N128N494N369
$$ 366031 366363 367567 368917 370340 372269 374953 378242 381896 385814 390021 394633 399761 405255 410624
51728D10624M748L966L234K567K282L077N112P189P518N469K237m58k069l290
$$ 410624 415372 419338 422572 425139 427421 430498 435610 442799 450317 455786 458023 457565 455496 452206
51714D52206m596n370m720k838r75j39l17j073k266l766m907m910l835k562j818
$$ 452206 447610 442240 437520 434682 433707 433568 433251 432178 429912 426146 421239 416329 412494 409932 408114
51699D08114j671k026k902l975m373l539k017r31p32q89p34k51P6j15p56j518
$$ 408114 406443 404417 401515 397540 393167 389628 387611 386680 385948 385059 384325 384074 384150 384035 383279 381761
51683C81761k153k600k749k289j115J48N89J49j75L26J037R64L48M63J912L979
$$ 381761 379608 377008 374259 371970 370855 371003 371592 371741 371566 371892 372929 373893 374241 374704 376616 380595
51667C80595N864P707R932J2275J4056J4988J5077J4025J1379P313K751j353m553
$$ 380595 386459 394166 404098 416373 430429 445417 460494 474519 485898 493211 495962 494609 490056
51654D90056o727p713p370n799l479j138N32J197Q53l63k214m243n964p327q630
$$ 490056 483329 475616 468246 462447 458968 457830 458362 459559 460412 460049 457835 453592 447628 440301 431671
51639D31671r804j0193r419q071p037o380n499m251l208k757k613k378k036j627
$$ 431671 421867 411674 402255 394184 387147 380767 375268 371017 367809 365052 362439 360061 358025 356398
51625C56398r38N9Q70R86N32j4m92j018j445j428r93o83r02j459j920k130k152
$$ 356398 355460 355519 356389 357375 357907 357893 357401 356383 354938 353510 352517 351834 350932 349473 347553 345423 343271
51608C43271j890j178k11M04K88k40n11k43L39J137K445M379O400P797Q541R200
$$ 343271 341381 340203 339992 340396 340684 340444 339933 339690 340029 341166 343611 347990 354390 362187 370728 379928
51592C79928J0003J0368R539P377M456J553p83k486l841m971n428m611k664n70
$$ 379928 389931 400299 409838 417215 421671 423224 422441 419955 416114 411143 405715 401104 398440 397870
51578C97870Q34J636K461L665N147O645P847Q446Q466Q347Q486Q803R041R215
$$ 397870 398704 400340 402801 406466 411613 418258 426105 434551 443017 451364 459850 468653 477694 486909
51564D86909R455R764J0262J1382J3296J5409J6995J8127J9388K0696K1163K0122
$$ 486909 496364 506128 516390 527772 541068 556477 573472 591599 610987 631683 652846 672968
51552F72968J7702J4289J0080N359N94l990q422j2417j5421j7439j9085k0528
$$ 672968 690670 704959 715039 720398 720992 717002 708580 696163 680742 663303 644218 623690
51540F23690k1077k0339j9093j8302j7841j6980j5615j4200j2760j0991r154p895
$$ 623690 602613 582274 563181 544879 527038 510058 494443 480243 467483 456492 447338 439443
51528D39443p200o416n412m783m639m202l077k091k179l057l693l667l303k753
$$ 439443 432243 425827 420415 415632 410993 406791 403714 401623 399444 396387 392694 389027 385724 382971
51514C82971j867r03n20q38j134p87r3K81K27J62K67K81R5P0N37J275J832K194
$$ 382971 381104 380201 379681 378843 377709 376922 376829 377110 377337 377499 377766 378047 378142 378212 378749 380024 381856 384050
51496C84050K742L424L469K243K72j092j042j56L24j99j212j817j681j255j193
$$ 384050 386792 390216 393685 395928 396200 395108 394066 393910 394234 394035 392823 391006 389325 388070 386877
51481C86877j669k327k731k816k737k577k367k290k542k935k967k439j782j585
$$ 386877 385208 382881 380150 377334 374597 372020 369653 367363 364821 361886 358919 356480 354698 353113
51467C53113j933k371k394j824p34O23J783K190J639N84j27OP59J558K110K536
$$ 353113 351180 348809 346415 344591 343857 344480 346263 348453 350092 350676 350549 350555 351314 352872 354982 357518
51451C57518K940L188L175L119L282L646M001M259M465M596M610M602M609M372
$$ 357518 360458 363646 366821 369940 373222 376868 380869 385128 389593 394189 398799 403401 408010 412382
51437D12382L601K448J391O30o2q56j616k291l154m343n453n921n700n238m874
$$ 412382 415983 418431 419822 420452 420390 419534 417918 415627 412473 408130 402677 396756 391056 385818 380944
51422C80944m520m026l539l353l415l243k452j260k45L70Q63J350J386O54l67
$$ 380944 376424 372398 368859 365506 362091 358848 356396 355136 354891 355261 356124 357474 358860 359514 359147
51407C59147q94p87m21K28J505L096M001L843L447L644M173M384M370M638N046
$$ 359147 358253 357466 357045 357273 358778 361874 365875 369718 373165 376809 380982 385366 389736 394374 399420
51392C99420N067M831N061N849O478O556O668P439Q674R887J1276J3522J6748
$$ 399420 404487 409318 414379 420228 426706 433262 439930 447369 456043 465930 477206 490728 507476
51379E07476K0196K2989K4880K6164K7133K7802K7939K7066K4436J9407J2136
$$ 507476 527672 550661 575541 601705 628838 656640 684579 711645 736081 755488 767624
51368G67624L757m379j1494j7259k1235k3226k4072k5221k7056k8299k7625k5276
$$ 767624 771381 767002 755508 738249 717014 693788 669716 644495 617439 589140 561515 536239
51356E36239k2502j9988j7640j5500j3806j2245j0250q151p052p277p751p432
$$ 536239 513737 493749 476109 460609 446803 434558 424308 416157 409105 401828 394077 386645
51344C86645o550n941n792n737n630n527n151m143k742j713j567k180l029l455
$$ 386645 380095 374154 368362 362625 356995 351468 346317 342174 339432 337719 336152 333972 330943 327488
51330C27488k941j658n27k86n69m57J92O40N24M75J063J789J708P83k4K0P15J523
$$ 327488 324547 322889 322362 322076 321507 321050 321242 321882 322406 322881 323944 325733 327441 328224 328200 328220 328935 330458
51312C30458K291L079L659L711L389L179L077K421P80j317k856l371l117k511
$$ 330458 332749 335828 339487 343198 346587 349766 352843 355264 356044 354727 351871 348500 345383 342872
51298C42872j830j391j422j596j234k36O21O67K53K00O46R91Q61N41L99M77Q13
$$ 342872 341042 339651 338229 336633 335399 335163 335784 336451 336704 336904 337550 338541 339402 339943 340342 340819 341632
51281C41632J639K852L686L486K651K228K584L006K750J992J343R36N55L69Q29
$$ 341632 343271 346123 349809 353295 355946 358174 360758 363764 366514 368506 369849 370785 371340 371709 372538
51266C72538J802K523K620K601K885K995K284J006j7n64j026j422j341r48j101
$$ 372538 374340 376863 379483 382084 384969 387964 390248 391254 391237 390673 389647 388225 386884 385936 384835
51251C84835k043k846k707k184k301k998l366l119k882k964k885k391k093k541
$$ 384835 382792 379946 377239 375055 372754 369756 366390 363271 360389 357425 354540 352149 350056 347515
51237C47515l238l241k428j509r41m86N2L26Nn00l49P29K057K697K289J186Np52
$$ 347515 344277 341036 338608 337099 336158 335672 335724 336050 336055 335555 335206 335935 337992 340689 342978 344164 344169 343417
51219C43417p84o8R95J732J771J432J400J957K667K919K650K348K351K456K236
$$ 343417 342633 342565 343560 345292 347063 348495 349895 351852 354519 357438 360088 362436 364787 367243 369479
51204C69479J684J280J480K220K974L217K778J914R82R0q74j764j995j151K22
$$ 369479 371163 372443 373923 376143 379117 382334 385112 387026 388008 388098 387224 385460 383465 382314 382536
51189C82536R52M60o68j563k047k416k698k686k516k539k625k252j394p43p64
$$ 382536 383488 383948 383280 381717 379670 377254 374556 371870 369354 366815 364190 361938 360544 359801 359037
51174C59037j007p53m1L88J8q63j492j318m12O68J423J819K106K337K336K123
$$ 359037 358030 357277 357236 357624 357642 356779 355287 353969 353557 354225 355648 357467 359573 361910 364246 366369
51158C66369J995K056K042J802J633J848K240K282J720P03m09j167j133l11O40
$$ 366369 368364 370420 372462 374264 375897 377745 379985 382267 383987 384690 384281 383114 381981 381670 382310
51143C82310Q69R4j229k366k803k464j684q99k22N04J176J304O76j44l89O5Q29
$$ 382310 383179 383273 382044 379678 376875 374411 372727 371828 371606 372110 373286 374590 375266 375122 374733 374798 375627
51126C75627J641K420K882K769K376K203K047J221k03j099o78M47J067Q19L36
$$ 375627 377268 379688 382570 385339 387715 389918 391965 393186 392983 391884 391206 391653 392720 393539 393875
51111C93875K01L65M67K74j84n62l85M24J289J632J568J590J753J715J560J850
$$ 393875 394076 394441 394908 395182 394998 394436 394051 394475 395764 397396 398964 400554 402307 404022 405582 407432
51095D07432K699L434L470K977K291J254k25j379j284k46L93J1m89p2R55J454
$$ 407432 410131 413565 417035 420012 422303 423557 423332 421953 420669 420423 420816 420827 420338 420266 421221 422675
51079D22675J042M00J63K18K55M17J023J976K780L063K911K769L099M039N261
$$ 422675 423717 424117 424280 424498 424753 425170 426193 428169 430949 434012 436923 439692 442791 446830 452091
51064D52091O228O729P085P799R049J0548J1852J2707J3049J2725J1397Q887N626
$$ 452091 458319 465048 472133 479932 488981 499529 511381 524088 537137 549862 561259 570146 575772
51051E75772K506K74p99o57N82K185K901K106O41j28K3L2r55k635m141m889m640
$$ 575772 578278 578552 577753 577096 577678 579863 582764 584870 585511 585383 585406 585438 584483 581848 577707 572818 568178
51034E68178l407j754o12m18q09j483k703m541o134o374n085k962p18J226K562
$$ 568178 564771 563017 562405 561987 561178 559695 556992 552451 546317 539943 534858 531896 531178 532404 534966
51019E34966L275L771M265M397M057M076N172O474O318M529K720K002J578K84
$$ 534966 538241 542012 546277 550674 554731 558807 563979 570453 576771 581300 584020 586022 587600 587884
51005E87884j475k368k037j355r97p19j37N94J108J386J695K237L061M119N293
$$ 587884 586409 584041 582004 580649 579652 578933 578796 579390 580498 581884 583579 585816 588877 592996 598289
50990E98289O440P491Q444R363J0446J2009J4214J6754J9004K0517K1395K2197
$$ 598289 604729 612220 620664 630027 640473 652482 666696 683450 702454 722971 744366 766563
50978G66563K3440K5067K6413K6862K6610K6570K7457K9250L1699L4978L9478
$$ 766563 790003 815070 841483 868345 894955 921525 948982 978232 1009931 1044909 1084387
50967A084387M5102N1209N7183O2802O8041P2858P7202Q0943Q3706Q5017Q4714
$$ 1084387 1129489 1180698 1237881 1300683 1368724 1441582 1518784 1599727 1683433 1768450 1853164
50956A853164Q2981P9866P5049O8278N9888N0628M1096L1491K1901J2483L352
$$ 1853164 1936145 2016011 2091060 2159338 2219226 2269854 2310950 2342441 2364342 2376825 2380177
50945B380177n484j3890k1373k7262l1141l3168l4030l4535l5135l5722l5938
$$ 2380177 2374693 2360803 2339430 2312168 2281027 2247859 2213829 2179294 2144159 2108437 2072499
50934B072499l5687l5269l4994l4857l4683l4503l4534l4954l5890l7534l9905
$$ 2072499 2036812 2001543 1966549 1931692 1897009 1862506 1827972 1793018 1757128 1719594 1679689
50923A679689m2512m4578m5728m6207m6365m6207m5636m4772m3710m2229m0015
$$ 1679689 1637177 1592599 1546871 1500664 1454299 1408092 1362456 1317684 1273974 1231745 1191730
50912A191730l7119l3885l0573k7344k4459k2161k0385j8869j7548j6538j5770
$$ 1191730 1154611 1120726 1090153 1062809 1038350 1016189 995804 976935 959387 942849 927079
50901I27079j4926j3742j2140j0177q150o615n808n109l709j813n78n50q40l18
$$ 927079 912153 898411 886271 876094 867944 861329 855521 850412 846703 844890 844312 843762 842922 842604
50887H42604Q99J823K109K391L200M344N472O598P756Q663R218R874J1033J2349
$$ 842604 843503 845326 847435 849826 853026 857370 862842 869440 877196 885859 895077 904951 915984 928333
50873I28333J3183J3626J4416J5847J7383J8521J9503K0745K2147K3454K5008
$$ 928333 941516 955142 969558 985405 1002788 1021309 1040812 1061557 1083704 1107158 1132166
50862A132166K7398L0566L3972L7678M2455M8638N5631O2977P1184Q0807R1282
$$ 1132166 1159564 1190130 1224102 1261780 1304235 1352873 1408504 1471481 1542665 1623472 1714754
50851A714754J01567J11593J22207J33622J44943J55351J65003J74255J82721
$$ 1714754 1816321 1927914 2050121 2183743 2328686 2484037 2649040 2823295 3006016
50842C006016J89483J93852J95368J93389J87165J76207J60242J39203J13707
$$ 3006016 3195499 3389351 3584719 3778108 3965273 4141480 4301722 4440925 4554632
50833D554632Q5388N6164K7187j127k8142n2596p3289q9681j01688j09213j12169
$$ 4554632 4640020 4696184 4723371 4722244 4694102 4641506 4568217 4478536 4376848 4267635 4155466
50822D155466j10782j05658r7732q8221p8436o9454o2112n7320n5945n8006o2339
$$ 4155466 4044684 3939026 3841294 3753073 3674637 3605183 3543071 3485751 3429806 3371800 3309461
50811C309461o7578p3353q0092q7713r5224j01703j06964j10861j12694j11957
$$ 3309461 3241883 3168530 3088438 3000725 2905501 2803798 2696834 2585973 2473279 2361322
50801B361322j09266j05679j01295r5414q8048q0313p3028o5830n8199n0616m3934
$$ 2361322 2252056 2146377 2045082 1949668 1861620 1781307 1708279 1642449 1584250 1533634 1489700
50790A489700l8091l2332k6509k1376j7477j4358j1121p450l975j744j280k057
$$ 1489700 1451609 1419277 1392768 1371392 1353915 1339557 1328436 1320986 1317011 1315267 1313987 1311930
50778A311930l020l670m328n172n603n150m478m724o021p453q436r306j0409j1414
$$ 1311930 1308910 1305240 1300912 1295740 1290137 1284987 1280509 1275785 1269764 1262311 1253875 1244569 1234160 1222746
50764A222746j1887j1960j2065j2391j2878j3339j3392j2666j1210r396p296m662
$$ 1222746 1210859 1198899 1186834 1174443 1161565 1148226 1134834 1122168 1110958 1101562 1094266 1089604
50752A089604j571J427M077O732R646J2485J4978J7511K0606K4150K7609L0738
$$ 1089604 1088033 1089460 1093537 1100269 1109915 1122400 1137378 1154889 1175495 1199645 1227254 1257992
50740A257992L3754L7108M1376M6959N3500N9998O5910P1737P8070Q4467Q9916
$$ 1257992 1291746 1328854 1370230 1417189 1470689 1530687 1596597 1668334 1746404 1830871 1920787
50729A920787R4093R7431J00141J01858J02207J01109R8457R4069Q8059Q0728
$$ 1920787 2014880 2112311 2212452 2314310 2416517 2517626 2616083 2710152 2798211 2878939
50719B878939P1897O0721M6440K9117R685j0487k9998m7725o2874p4666q2187
$$ 2878939 2950836 3011557 3057997 3087114 3096799 3086312 3056314 3008589 2945715 2871049 2788862
50708B788862q4925q3398p8978p2958o6000n8293m9927m1178l2821k6188k2463
$$ 2788862 2703937 2620539 2541561 2468603 2402603 2344310 2294383 2253205 2220384 2194196 2171733
50697B171733k1764k3261k6225l0640l6577m3417n0072n5758o0230o3344o4742
$$ 2171733 2149969 2126708 2100483 2069843 2033266 1989849 1939777 1884019 1823789 1760445 1695703
50686A695703o4152o1772n8179n3890m9146m4074l8815l3385k7593k1450j5497
$$ 1695703 1631551 1569779 1511600 1457710 1408564 1364490 1325675 1292290 1264697 1243247 1227750
50675A227750j0422o289k494J468N519R419J3186J6787J9753K1525K2029K1638
$$ 1227750 1217328 1211039 1208545 1210013 1215532 1224951 1238137 1254924 1274677 1296202 1318231 1339869
50663A339869K0725J9519J8300J7369J6877J6810J7007J7064J6575J5696J5154
$$ 1339869 1360594 1380113 1398413 1415782 1432659 1449469 1466476 1483540 1500115 1515811 1530965
50652A530965J5395J5982J6225J6119J6244J6909J7982J9433K1528K4428K7931
$$ 1530965 1546360 1562342 1578567 1594686 1610930 1627839 1645821 1665254 1686782 1711210 1739141
50641A739141L1679L5354L8760M1884M4832M7414M9068M9420M8685M7177M4829
$$ 1739141 1770820 1806174 1844934 1886818 1931650 1979064 2028132 2077552 2126237 2173414 2218243
50630B218243M1671L8358L5551L2953K9770K5950K2089J8096J2866N639k911j1157
$$ 2218243 2259914 2298272 2333823 2366776 2396546 2422496 2444585 2462681 2475547 2481186 2478275 2467118
50618B467118j7549k1049k1337j9152j5928j2645r252n385j244K482N059N899
$$ 2467118 2449569 2428520 2407183 2388031 2372103 2359458 2350206 2344821 2343577 2346059 2351118 2357017
50606B357017M772K132j256n330j0873j8342k7034l5923m4751n3708o2325o9378
$$ 2357017 2361789 2363921 2362665 2357335 2346462 2328120 2301086 2265163 2220412 2166704 2104379 2035001
50594B035001p3866p5684p5436p3935p1728o8768o4735n9888n5261n1555m8201
$$ 2035001 1961135 1885451 1810015 1736080 1664352 1595584 1530849 1470961 1415700 1364145 1315944
50583A315944m4143l9348l4892l1536k8903k6129k2826j9108j5188j1277p660
$$ 1315944 1271801 1232453 1197561 1166025 1137122 1110993 1088167 1069059 1053871 1042594 1034934
50572A034934m456j424J736M915P622R506J0774J1970J3321J4479J5026J5093
$$ 1034934 1030478 1029054 1030790 1035705 1043327 1052833 1063607 1075577 1088898 1103377 1118403 1133496
50560A133496J5231J5712J6390J7302J8892K1308K3906K5973K7618K9380L1112
$$ 1133496 1148727 1164439 1180829 1198131 1217023 1238331 1262237 1288210 1315828 1345208 1376320
50549A376320L1968L1570L0509K9494K8498K7224K6071K6034K7690L0584L3716
$$ 1376320 1408288 1439858 1470367 1499861 1528359 1555583 1581654 1607688 1635378 1665962 1699678
50538A699678L6477L9108M2394M6962N2705N8736O3922O7605O9994P1976P4595
$$ 1699678 1736155 1775263 1817657 1864619 1917324 1976060 2039982 2107587 2177581 2249557 2324152
50527B324152P8541Q3975R0622R7825J04516J09492J12071J12569J11831J10180
$$ 2324152 2402693 2486668 2577290 2675115 2779631 2889123 3001194 3113763 3225594 3335774
50517C335774J06928J01042R2145Q0722O7481N2724L6356J8438l92j9022l6443
$$ 3335774 3442702 3543744 3635889 3716611 3784092 3836816 3873172 3891610 3891218 3872196 3835753
50506C835753n2260o6505p8910q8545r4387r6107r3967q8091p8424o5589n1284
$$ 3835753 3783493 3716988 3638078 3549533 3455146 3359039 3265072 3176981 3098557 3032968 2981684
50495B981684l7220k3877j0776K190J4185K4084L1014L4131L2538K5909J4872
$$ 2981684 2944464 2920587 2909811 2912001 2926186 2950270 2981284 3015415 3047953 3073862 3088734
50484C088734M48j6601l5555n5185p3835r0044j02892j12030j17712j20516j20711
$$ 3088734 3089182 3072581 3037026 2981841 2908006 2817962 2715070 2603040 2485328 2364812 2244101
50473B244101j18050j12575j05324r7805r0750q3840p6525o8750o0929n3592m7067
$$ 2244101 2126051 2013476 1908152 1810347 1719597 1635757 1559232 1490482 1429553 1375961 1328894
50462A328894m1210l5568k9996k4897k0536j6438j1952p108k384K098O413J0136
$$ 1328894 1287684 1252116 1222120 1197223 1176687 1160249 1148297 1141189 1138805 1140903 1147316 1157452
50450A157452J2773J4796J7338K0652K3748K5861K7435K9294L1580L3838L5328
$$ 1157452 1170225 1185021 1202359 1223011 1246759 1272620 1300055 1329349 1360929 1394767 1430095
50439A430095L4793L0881K3594J4850O888N22m501q098r737r398p783n660l572
$$ 1430095 1464888 1495769 1519363 1534213 1541101 1541623 1537122 1529024 1519287 1509889 1502106 1496446 1492874
50426A492874j963r15J70J958M297O520Q444J0512J3048J6004J9348K3150K7230
$$ 1492874 1490911 1489996 1490166 1492124 1496421 1502941 1511385 1521897 1534945 1550949 1570297 1593447 1620677
50413A620677L1353L5637M0249M4752M8463N1395N4101N6460N7451N6467N4218
$$ 1620677 1652030 1687667 1727916 1772668 1821131 1872526 1926627 1983087 2040538 2097005 2151223
50402B151223N1856M9727M7320M3999L9419L3433K6105J7543P539m218j7318l0354
$$ 2151223 2203079 2252806 2300126 2344125 2383544 2416977 2443082 2460625 2468164 2463946 2446628 2416274
50390B416274m1953n1827o0390o7563p2505p4548p3854p0981o6203n9536n1275
$$ 2416274 2374321 2322494 2262104 2194541 2122036 2047488 1973634 1902653 1836450 1776914 1725639
50379A725639m2119l2703k3190j3568m240L911J0225J4733J7691J8833J7497J3542
$$ 1725639 1683520 1650817 1627627 1614059 1609819 1613730 1623955 1638688 1656379 1675212 1692709 1706251
50367A706251P675P54o823j4734k2124k7961l2020l5022l7702m0096m1986m3608
$$ 1706251 1713926 1714680 1707857 1693123 1670999 1643038 1611018 1575996 1538294 1498198 1456212 1412604
50355A412604m5488m7541m8922m8891m7563m5514m2907l9488l5283l0876k6746
$$ 1412604 1367116 1319575 1270653 1221762 1174199 1128685 1085778 1046290 1011007 980131 953385
50344I53385k2769j8627j4491j0941q319o419m825l315j913p62OL35L38K86M79
$$ 953385 930616 911989 897498 886557 878238 871819 866994 863679 861766 861004 861010 861345 861683 861969 862448
50329H62448J066J963K953L924M971O213P533Q619R253R455R487R732J0492J1630
$$ 862448 863514 865477 868430 872354 877325 883538 891071 899690 908943 918398 927885 937617 948109 959739
50315I59739J2625J3165J3481J3826J3927J3480J2990J3427J5115J7646K0917
$$ 959739 972364 985529 999010 1012836 1026763 1040243 1053233 1066660 1081775 1099421 1120338
50304A120338K5331L0783L6345M1452M6560N2050N7056N9901N8963N2550L9244
$$ 1120338 1145669 1176452 1212797 1254249 1300809 1352859 1409915 1469816 1528779 1581329 1620573
50293A620573J9705k305k2072l7062m7227n2948n4345n2456m9237m5754m1569
$$ 1620573 1640278 1637973 1615901 1578839 1531612 1478664 1424319 1371863 1322626 1276872 1235303
50282A235303l6486l1647k8037k4910k0821j5640j0519o241k459J460N715J0100
$$ 1235303 1198817 1167170 1139133 1114223 1093402 1077762 1067243 1061002 1058543 1060003 1065718 1075818
50270A075818J4223J7645K0202K2214K3990K5300K5651K5063K4072K2959K1450
$$ 1075818 1090041 1107686 1127888 1150102 1174092 1199392 1225043 1250106 1274178 1297137 1318587
50259A318587J9320J6983J5166J4111J3346J2209J0295P327K954k890r403j5269
$$ 1318587 1337907 1354890 1370056 1384167 1397513 1409722 1420017 1427344 1430298 1427408 1418005 1402736
50247A402736j9815k3365k6255k8008k8024k6609k4603k2321j9686j7187j5778
$$ 1402736 1382921 1359556 1333301 1305293 1277269 1250660 1226057 1203736 1184050 1166863 1151085
50236A151085j5736j6517j7742j9435k1054k1341j9710j7037j4555j2666j1241
$$ 1151085 1135349 1118832 1101090 1081655 1060601 1039260 1019550 1002513 987958 975292 964051
50225I64051j0374j0120j0116j0100j0295j0682j0505r338q020p656q080q239
$$ 964051 953677 943557 933441 923341 913046 902364 891859 882521 874501 866845 858765 850526
50213H50526p817p408p175o483n135m062m247n488o674o949o347n438m716m304
$$ 850526 842709 835301 828126 821643 816508 812446 808199 802711 796037 789088 782741 777303 772587 768283
50199G68283m126m207m509m577l918k903k626l421m146l682k512j852j698r53
$$ 768283 764157 759950 755441 750864 746946 744043 741417 737996 733850 730168 727656 725804 724106 723153
50185G23153N88J743J667R54N01L09j4l58m83o48j135j479r91K32J384J923J995
$$ 723153 723741 725484 727151 728105 728606 728915 728901 728543 728060 727412 726277 724798 723807 724039 725423 727346 729341
50168G29341K017K300K962L836M646N447O709Q600J0623J2372J4254J6900K0117
$$ 729341 731358 733658 736620 740456 745102 750549 757258 765858 776481 788853 803107 820007 840124
50155H40124K3188K6079K9583L4150L9226M3966M7972N0997N2491N2040N0006
$$ 840124 863312 889391 918974 953124 992350 1036316 1084288 1135285 1187776 1239816 1289822
50144A289822M7290M4574M2058L9672L7182L4222L0688K6957K3270J8926J2681
$$ 1289822 1337112 1381686 1423744 1463416 1500598 1534820 1565508 1592465 1615735 1634661 1647342
50133A647342M159n524j4850k3287l1167l8519m4648m8899n1319n2315n1988n0182
$$ 1647342 1651501 1645977 1631127 1607840 1576673 1538154 1493506 1444607 1393288 1340973 1288985 1238803
50121A238803m7002m2971l8675l4511l0705k7370k4500k1969j9666j7537j5555
$$ 1238803 1191801 1148830 1110155 1075644 1044939 1017569 993069 971100 951434 933897 918342
50110I18342j3703j1971j0231q184n594k640P8J911K544K005M97j675m059o191
$$ 918342 904639 892668 882437 874253 868659 866019 866097 868008 870552 872557 873054 871379 867320 861129
50096H61129p851r147j0131j0449r638p891o189n409n414n380m919m397m149l928
$$ 861129 853278 844131 834000 823551 813913 806022 799833 794424 789010 783630 778711 774314 770165 766237
50082G66237l375k555j633m15J263K921L777L749L640M229N465O649P115O743
$$ 766237 762862 760307 758674 758259 759522 762443 766220 769969 773609 777838 783303 789952 797067 803810
50068H03810O121O127P022P911P592O009M402L797L898L776L082K027O34j133
$$ 803810 809931 816058 823080 830991 838583 844592 848994 852791 856689 860465 863547 865574 866208 865075
50054H65075k623k845j814p25m36m02K42J205J514J246J634L345N545P227Q631
$$ 865075 862452 859607 857793 857068 856632 856230 856472 857677 859191 860437 862071 865416 870961 878188 886819
50039H86819J0661J3396J6101J8438K0853K3678K6645K9444L2165L4876L7275
$$ 886819 897480 910876 926977 945415 966268 989946 1016591 1046035 1078200 1113076 1150351
50028A150351L9023M0011M0067L8789L6068L2384K8372K4393K0780J8012J6158
$$ 1150351 1189374 1229385 1269452 1308241 1344309 1376693 1405065 1429458 1450238 1468250 1484408
50017A484408J4438J1730P268O78q104j8304k8118l5834m1179m5045m8010m9748
$$ 1484408 1498846 1510576 1517844 1518522 1510418 1492114 1463996 1428162 1386983 1341938 1293928 1244180
50005A244180m9795m8237m5454m1775l7634l3569k9773k5903k1590j7014j2834
$$ 1244180 1194385 1146148 1100694 1058919 1021285 987716 957943 932040 910450 893436 880602
49994H80602r671p706o567n607m450l300k676k945m166o121q242r869j0944j2127
$$ 880602 870931 863225 856658 851051 846601 843301 840625 837680 833514 827393 819151 809282 798338 786211
49980G86211j3749j5002j4772j3138j1267r906q731p229n513m039l131l005l681
$$ 786211 772462 757460 742688 729550 718283 708377 699646 692417 686904 682865 679734 676729 673048
49967F73048m683n332n515n551n343m404k945j974j805j356L20K477L581L318
$$ 673048 668365 663033 657518 651967 646624 642220 639275 637301 635496 634140 634460 636937 640518 643836
49953F43836K853L243M340N251N307M554L637L232L287L058K103R12J69j92o49
$$ 643836 646689 649932 654272 659523 664830 669384 673021 676253 679540 682598 684701 685613 685782 685590 684941
49938F84941j241j628j802k069k478k856l317m096m984n481n516n425n253m687
$$ 684941 683700 682072 680270 678201 675723 672867 669550 665454 660470 654989 649473 644048 638795 634108
49924F34108l751k955k566k276j743j080n83l11p4L83J228K264K889K682K053
$$ 634108 630357 627402 624836 622560 620817 619737 619154 618843 618769 619152 620380 622644 625533 628215 630268
49909F30268J871K521L670M859N884O590O927P187P615P768O905N230L953L728
$$ 630268 632139 634660 638330 643189 649073 655663 662590 669777 677392 685160 692065 697295 701248 704976
49895G04976L680K506J41k261l721m277m572n066n711o151o163n911n678n449
$$ 704976 708656 711162 711303 709042 705321 701044 696472 691406 685695 679544 673381 667470 661792 656343
49881F56343m986m287l618l028k297j450q58o12k82M60J326J895K145K217K040
$$ 656343 651357 647070 643452 640424 638127 636677 635819 635207 634925 635385 636711 638606 640751 642968 645008
49866F45008J578J125R66J054J391K240L551M630M991N179O032P359Q108P784
$$ 645008 646586 647711 648677 649731 651122 653362 656913 661543 666534 671713 677745 685104 693212 700996
49852G00996O861N825M573L040J707J049R22Q19M06m60j784l204m081m166l968
$$ 700996 707857 713682 718255 721295 723002 724051 724973 725792 726198 725738 723954 720750 716669 712503 708535
49837G08535m085m437m561m359m113l815l092j887p64k54k42k61k21m02q16r69
$$ 708535 704450 700013 695452 691093 686980 683165 680073 678186 677422 677168 676926 676665 676444 676042 675226 674257
$$ [...]
##END NTUPLES=NMR SPECTRUM
##END=
