##TITLE=AC1709_ROEFFECT0030_8638127_oUKuzT60n3
##JCAMPDX= 6.0         $$ Bruker NMR JCAMP-DX V2.0
##DATA TYPE= NMR SPECTRUM
##DATA CLASS= NTUPLES
##ORIGIN= BRUKER
##OWNER= Administrator
$$ 1.72 TOPSPIN		Version 2.1
$$ 2014-05-23 02:37:59.190 -0700  Administrator@X
$$ Compression mode = diff/dup
##.OBSERVE FREQUENCY= 400.02188249412
##.OBSERVE NUCLEUS= ^1H
##.ACQUISITION MODE= SIMULTANEOUS (DQD)
##.ACQUISITION SCHEME= undefined
##.AVERAGES= 8
##.DIGITISER RES= 22
##SPECTROMETER/DATA SYSTEM= spect
##.PULSE SEQUENCE= zg30
##.SOLVENT NAME= COFFEE_meoh
##.SHIFT REFERENCE= INTERNAL, COFFEE_meoh, 1, 14.98509
##AUDIT TRAIL= $$ (NUMBER, WHEN, WHO, WHERE, PROCESS, VERSION, WHAT)
$$ ##TITLE= Audit trail, TOPSPIN		Version 2.1
$$ ##JCAMPDX= 5.01
$$ ##ORIGIN= Bruker BioSpin GmbH
$$ ##OWNER= Administrator
$$ $$ E:\/data/COFFEE/nmr/AC1709_ROEFFECT0030_8638127_oUKuzT60n3/10/pdata/1/auditp.txt
$$ ##AUDIT TRAIL=  $$ (NUMBER, WHEN, WHO, WHERE, PROCESS, VERSION, WHAT)
(   1,<2014-05-23 02:37:52.675 -0700>,<Administrator>,<X>,<go>,<TOPSPIN 2.1>,
      <created by zg
	started at 2014-05-23 02:36:47.018 -0700,
	POWCHK enabled, PULCHK disabled,
       configuration hash MD5:
       C8 4E 4E 5D D3 5C D8 9E 9F 52 82 E0 59 8A DE 15
       data hash MD5: 64K
       2D 4D 9D 40 E8 B0 95 24 B5 83 67 9C 69 1D B8 3B>)
(   2,<2014-05-23 02:37:55.612 -0700>,<Administrator>,<X>,<proc1d>,<TOPSPIN 2.1>,
      <Start of raw data processing
       efp LB = 0 FT_mod = 6 PKNL = 1 PHC0 = 0 PHC1 = 0 SI = 32K 
       data hash MD5: 32K
       E9 9F 7E E2 B8 F0 F4 45 C8 9E 2E E1 B1 0E 55 77>)
(   3,<2014-05-23 02:37:55.940 -0700>,<Administrator>,<X>,<proc1d>,<TOPSPIN 2.1>,
      <pk PHC0 = 93.99902 PHC1 = 0 
       data hash MD5: 32K
       B9 06 F9 77 04 89 E4 A8 C6 79 8F 4C 15 53 A0 4F>)
(   4,<2014-05-23 02:37:56.050 -0700>,<Administrator>,<X>,<proc1d>,<TOPSPIN 2.1>,
      <abs ABSG = 1 
       data hash MD5: 32K
       DC 94 A3 F5 4B 93 F7 95 E6 A3 D5 64 D8 B6 32 E9>)
(   5,<2014-05-23 02:37:56.112 -0700>,<Administrator>,<X>,<proc1d>,<TOPSPIN 2.1>,
      <abs ABSG = 2 
       data hash MD5: 32K
       36 E4 EA A6 2A E1 17 75 FF C5 1B 50 38 72 60 1D>)
(   6,<2014-05-23 02:37:56.159 -0700>,<Administrator>,<X>,<proc1d>,<TOPSPIN 2.1>,
      <abs ABSG = 3 
       data hash MD5: 32K
       FD CD 53 C3 8D E2 DE B8 A5 31 B3 E3 AD 2E 4D 6F>)
(   7,<2014-05-23 02:37:56.206 -0700>,<Administrator>,<X>,<proc1d>,<TOPSPIN 2.1>,
      <abs ABSG = 4 
       data hash MD5: 32K
       66 2C 48 0F CC 35 B7 AE 44 B9 8C C4 1A FC A6 9B>)
(   8,<2014-05-23 02:37:56.253 -0700>,<Administrator>,<X>,<proc1d>,<TOPSPIN 2.1>,
      <abs ABSG = 5 
       data hash MD5: 32K
       F9 1A C4 3E AA 33 7E EF B9 44 11 02 6F 71 B5 17>)
$$ ##END=
$$ 
$$ $$ hash MD5
$$ $$ FF D8 00 F7 F9 CF 1F 0A 06 73 D2 60 B0 AE C9 4C
##$RELAX= 
##$RELAX= 
##$RELAX= 
##$RELAX= 
##$RELAX= 
##$RELAX= 
##$RELAX= 
$$ Bruker specific parameters
$$ --------------------------
##$DU= <E:\>
##$EXPNO= 10
$$ [...]
150 150 150 150 150 150 150 150
##$TP07= 0
##$TPNAME0= <>
##$TPNAME1= <>
##$TPNAME2= <>
##$TPNAME3= <>
##$TPNAME4= <>
##$TPNAME5= <>
##$TPNAME6= <>
##$TPNAME7= <>
##$TPOAL= (0..7)
0.5 0.5 0.5 0.5 0.5 0.5 0.5 0.5
##$TPOFFS= (0..7)
0 0 0 0 0 0 0 0
##$TUNHIN= 0
##$TUNHOUT= 0
##$TUNXOUT= 0
##$USERA1= <user>
##$USERA2= <user>
##$USERA3= <user>
##$USERA4= <user>
##$USERA5= <user>
##$V9= 5
##$VALIST= <valist>
##$VCLIST= <CCCCCCCCCCCCCCC>
##$VD= 0
##$VDLIST= <DDDDDDDDDDDDDDD>
##$VPLIST= <PPPPPPPPPPPPPPP>
##$VTLIST= <TTTTTTTTTTTTTTT>
##$WBST= 2048
##$WBSW= 25
##$XGAIN= (0..3)
0 0 0 0
##$XL= 0
##$YL= 0
##$YMAX_a= 651564
##$YMIN_a= -551919
##$ZGOPTNS= <>
##$ZL1= 120
##$ZL2= 120
##$ZL3= 120
##$ZL4= 120
##$ABSF1= 14.98509
##$ABSF2= -5.573092
##$ABSG= 5
##$ABSL= 3
##$ALPHA= 0
##$AQORDER= 0
##$ASSFAC= 0
##$ASSFACI= 0
##$ASSFACX= 0
##$ASSWID= 0
##$AUNMP= <proc_prof1d_extract_pilot.lims>
##$AXLEFT= 0
##$AXNAME= <>
##$AXNUC= <1H>
##$AXRIGHT= 0
##$AXTYPE= 0
##$AXUNIT= <>
##$AZFE= 0.1
##$AZFW= 0.1
##$BCFW= 0
##$BC_mod= 0
##$BYTORDP= 0
##$COROFFS= 0
##$CY= 15
##$DATMOD= 1
##$DC= 0
##$DFILT= <>
##$DTYPP= 0
##$F1P= 0
##$F2P= 0
##$FCOR= 0.5
##$FTSIZE= 32768
##$FT_mod= 6
##$GAMMA= 0
##$GB= 0
##$INTBC= 1
##$INTSCL= 1
##$ISEN= 128
##$LB= 0
##$LEV0= 0
##$LPBIN= 0
##$MAXI= 10000
##$MC2= 0
##$MEAN= 0
##$ME_mod= 0
##$MI= 0
##$NCOEF= 0
##$NC_proc= -8
##$NLEV= 6
##$NOISF1= 0
##$NOISF2= 0
##$NSP= 0
##$NTH_PI= 0
##$NZP= 0
##$OFFSET= 14.98509
##$PC= 1
##$PHC0= 93.99902
##$PHC1= 0
##$PH_mod= 1
##$PKNL= yes
##$PPARMOD= 0
##$PPDIAG= 0
##$PPIPTYP= 0
##$PPMPNUM= 2147483647
##$PPRESOL= 1
##$PSCAL= 4
##$PSIGN= 0
##$PYNMP= <proc.py>
##$REVERSE= no
##$SF= 400.02
##$SI= 32768
##$SIGF1= 0
##$SIGF2= 0
##$SINO= 400
##$SIOLD= 32768
##$SPECTYP= <>
##$SREGLST= <1H.CDCl3>
##$SSB= 0
##$STSI= 32768
##$STSR= 0
##$SW_p= 8223.68421052631
##$SYMM= 0
##$S_DEV= 0
##$TDeff= 65536
##$TDoff= 0
##$TI= <>
##$TILT= no
##$TM1= 0
##$TM2= 0
##$TOPLEV= 0
##$USERP1= <user>
##$USERP2= <user>
##$USERP3= <user>
##$USERP4= <user>
##$USERP5= <user>
##$WDW= 1
##$XDIM= 32768
##$YMAX_p= 464979933
##$YMIN_p= -845924
##$CURPLOT= <Network HP LaserJet P1505>
##$CURPRIN= <$Network HP LaserJet P1505>
##$DFORMAT= <normdp>
##$LAYOUT= <+/1D_H.xwp>
##$LFORMAT= <normlp>
##$PFORMAT= <normpl>
##$SURQMSG= 1
$$ End of Bruker specific parameters
$$ ---------------------------------
##NTUPLES= NMR SPECTRUM
##VAR_NAME=  FREQUENCY,     SPECTRUM/REAL,   SPECTRUM/IMAG
##SYMBOL=    X,             R,               I
##VAR_TYPE=  INDEPENDENT,   DEPENDENT,       DEPENDENT
##VAR_FORM=  AFFN,          ASDF,            ASDF
##VAR_DIM=   32768,         32768,           32768
##UNITS=     HZ,            ARBITRARY UNITS, ARBITRARY UNITS
##FACTOR=    0.250966925370066, 1,           1
##FIRST=     8223.43324360094, 109343,       -343846
##LAST=      0,             -49668,          -7576
##MIN=       0,             -845924,         0
##MAX=       8223.43324360094, 464979933,    0
$$ Real data points
##PAGE= N=1
##DATA TABLE= (X++(R..R)), XYDATA
$$ [...]
23852 274857 236993 128938 -303930 47692 -30520 -53219 75663 -276367 68514 -183875 -192902
23841 -192902 137489 -384631 -161897 -92535 131525 296057 -60076 -9801 109157 -20125
23830 -108291 -337590 47878 -18413 -116392 -75386 113 -138055 55992 -104133 15661 -3988
23818 -116156 -226915 -366520 -13468 275237 -92786 -29200 -127471 117139 99703 104712 146212
23807 146212 36609 29647 129649 -239614 152203 250721 -175384 -38355 -195136 -150894 -92348
23796 -92348 10138 91893 144561 -115785 137488 32987 -57369 342307 -248606 61162 162157
23785 162157 -537414 -142446 -67243 100341 -169654 47927 37994 293010 -115785 -150094
23775 -150094 -95747 -132007 322986 -10833 -30159 124056 338270 160784 -127476 -66345
23765 -66345 -241727 248058 -25702 328390 9961 179819 139939 -122174 -122323 68239 -40432
23753 -169396 -354887 -210743 98009 53019 -199051 -64507 29051 -29216 -187333 -165564 185461
23741 -233008 1204 147841 -363869 366564 184612 34134 -241366 -125283 -464816 212518
23730 -8244 52137 65773 -293446 102835 -134500 -40953 -259683 -83604 110676 -86365 150247
23718 69234 105939 181840 224940 93495 -62097 -6716 58069 50064 -180494 125925 127080 -80669
23705 -218399 -134168 -504742 -153478 -12985 -63272 -93318 275016 27524 161604 -146437
23694 32637 295419 -189424 73700 -34631 68251 -250283 -103227 93745 134864 141147 90827
23683 90827 -87291 50905 -386692 65579 -171591 388846 -225357 15626 -26022 37079 -54528
23671 36611 -52738 -109064 85011 -35817 -338782 141679 -191675 172269 -185985 -121090 96301
23659 129841 416518 191667 -60824 -130306 -281738 99567 -355062 -33268 261693 -384642
23648 -105918 -42484 -346754 47275 -118354 77400 80487 -259678 321085 -10643 -119956 378731
23636 -16498 115854 -48535 195239 5688 284439 -127259 131765 157748 -190730 -61924 465512
23624 20230 86747 -128397 80940 -16489 138220 223917 20803 7172 246525 -102674 -63783
23613 -63783 -360087 8471 157583 -212804 -229792 -51445 -37933 54047 -162074 122801 137413
23602 137413 -225428 -139613 78463 279810 70840 -74989 292064 -191883 91692 268354
23592 268354 -231190 81207 -156410 169696 138977 -122157 259739 -150598 -78215 163436
23581 83400 127340 -153916 -91667 -239213 276943 -198263 207053 -375675 -16234 85928
23570 -134408 -173999 203756 52531 144311 -12393 -89262 126064 269760 40801 -189311 72527
23558 -238483 212226 -82607 -240738 -24745 -21590 -42633 87444 178698 -261645 -109997 -65073
23547 -65073 -131684 -112291 86474 49065 -303083 -111694 207613 222807 -34849 -16826 134336
23535 -220261 -110598 -373568 60993 -242929 -380858 -253292 -97089 163615 271697 108879
23524 -194729 2696 191599 -316807 106013 147425 -197004 -138535 74940 -215331 153696
23513 -425775 -18629 -184952 -216194 -73120 266820 -3291 163423 77110 190985 425352 -31550
23501 -315550 113943 -16194 -32891 -122445 -79994 -105406 -165976 -267995 181247 20393 -341867
23489 1896 -61659 118975 -23582 -177203 -160017 148183 108471 168050 -124135 24464 294815
23478 294815 340763 152155 120114 -227344 -399367 63726 54389 -137733 -240169 -29951 -80461
23467 -80461 153608 260282 -149463 -114531 180255 -202614 -53444 -170927 -69363 108316
23456 -213736 -271763 -260628 -136701 -139181 -38335 -85219 39394 129911 -204304 -84156 -139605
23445 -139605 194942 -3621 13903 309398 6137 192581 -143224 -128449 -368555 219760 78319
23433 -67103 -10126 -179752 -194395 181427 60886 -170091 -70388 128025 -43782 236434 140818
23422 140818 151909 -88328 -5926 87755 -95260 -50832 264855 206491 97529 195115 -223621
23410 156731 -146464 -292084 75834 -164956 85092 259388 -151542 -308420 -5616 -5743 -36853
23399 -36853 367098 -16898 -233898 -73700 46087 -1770 -335729 -224104 -62845 -177056 -32811
23387 183503 79483 -94926 4604 26084 -31905 145756 -271085 177972 313476 -111755 -66553
23376 -66553 88615 9422 -225975 -58 -412303 -88070 -166466 -154380 86658 -29587 -42825 453610
23363 183666 66584 -40422 185184 90212 76269 -217765 342009 -94334 -115159 18049 21813
23352 21813 226605 2005 -33683 -41101 61001 88542 18297 -15910 961 99553 225000 -166751
23339 -102858 -79744 267642 32482 -162542 -232919 -190572 -118702 -75916 -283514 43597 89326
23328 89326 -100866 -156036 55678 -260054 117102 60698 -90561 200623 -32508 -119968 -57061
23316 190236 81538 173223 -120255 80562 159476 51508 10947 193934 -135713 -106703 2858
23304 144368 -256541 -26012 -171047 34785 -13750 -20164 -1283 -267468 276385 -120160 155123
23292 -224875 -88577 38145 32112 -348252 135632 -122892 123925 -27047 223268 -229356
23281 -109782 68581 163448 -95000 277364 96947 -171718 -343479 -111092 106086 46072
23270 -259037 -90325 143481 -52195 -106747 121281 117152 -204877 -36155 26329 -52902 316136
23258 199969 -10879 -150993 -354350 -103616 15983 39061 191565 137590 13019 -132253
23247 -78397 -73591 312694 -232898 -58131 -90602 45556 -92597 279866 -159865 -94226 176394
23235 47614 -138331 -199880 -89753 -232746 114448 203273 -44517 -79981 -155306 -221399 -159461
23224 -159461 272707 -175196 -180974 182583 -99313 1228 -298271 -127220 49038 -349579 271784
23212 139014 95160 -65024 -70995 -152792 385786 -174146 245519 6261 -105659 54343 -86098
23200 133954 -67158 -79930 235364 -97619 -32771 -32748 69564 -41945 -71199 76377 41850 26327
23188 26327 168692 55562 -244615 -293899 255674 -213345 -189138 329255 179961 38487
23177 -158262 -281821 -54471 72913 -98450 62397 -148462 -572847 96515 -10491 -161908 -84042
23166 -84042 -12361 -24375 79916 -148395 78682 -97951 50542 -189358 -96382 18311 33998
23155 33998 304567 396929 70936 -54649 -82209 207442 -91833 68796 56420 129489 -18420
23143 50854 334360 -90254 49150 68024 -194433 309852 34204 188356 65937 61312 -112571
23131 181827 -75748 216521 84007 280291 106011 191081 332546 108129 -66058 142190
23120 361248 86670 -140812 31797 28254 53207 -338306 -134618 200556 142073 -30677 202772
23108 -66824 129635 -41022 -37019 -14008 -81505 -258450 37615 179869 6491 157628 -131053
23096 -175627 -119635 15214 -172154 40014 -100286 -216452 247105 14877 -98553 -91066 -99639
23085 -99639 -193443 137001 -174770 51873 5430 -239616 -135616 197118 172956 63662 -212949
23073 152633 -215234 268612 -8 133115 -214800 -147863 -293699 -155367 -138565 -6904 57194
23061 176847 -224170 220431 -181781 -111760 -59569 170817 233805 -7801 123056 63602 70536
23050 70536 352513 249934 25021 -103438 -136640 -340608 -97830 11027 171639 -195654
23039 249474 -284778 -114015 -103962 143705 104693 78341 -220784 99403 247716 -316443
23028 -39828 161016 -21500 244996 225203 39398 -263339 65265 155602 5025 165530 -209182
23016 -87719 -76321 444614 40998 -170827 -558 197438 -67115 -198855 -235420 -61505 -147658
23005 -147658 -432053 -196843 92165 -273311 392774 37 22086 -192145 -42988 -280926 -44121
22993 -189913 115013 -83281 -75567 -545965 -196801 -75705 106444 82601 271321 17173 -177132
22981 32261 -166325 -81349 96068 -155939 -117374 19624 200206 139261 -27042 23501 -127579
22969 -131271 94686 -158156 -59485 144702 -103325 -96120 -107122 -77158 -30744 149429 -10674
22957 -13762 206031 -150986 -291938 68197 -63554 50857 -74943 -212690 60448 -232401 149180
22945 -383477 211760 94752 -236679 -74470 147158 -367893 -147412 137612 50040 -171756
22934 -78806 -166163 29591 -182464 -91400 55429 -107024 -138296 29473 103636 -173677 -167220
22923 -167220 -95788 -135874 -169852 -410933 100864 -17639 258623 191604 65971 -270247 -116343
22911 116796 -219356 -126392 -39104 165224 -69955 144133 328917 -159658 -154543 -380138
22901 -380138 -125446 -208808 203726 173136 312799 52652 47903 -206498 242026 -422246
22890 -165291 -244037 2982 154902 69361 -276953 -169652 61081 -55208 -173573 -46675 -44325
22879 -44325 66064 143234 276105 -148316 -44658 200829 96 68330 -118652 95996 3329 -35337
22866 -316042 -161455 -217946 -154835 -169565 429546 -542069 -311427 -276784 -8904 -218865 237845
22854 -5197 222975 81644 -172508 -21633 158082 130781 151079 -54012 170856 79214 -2933
22842 -40691 -161113 -149442 58682 904 89983 71378 -50707 -389700 140764 -116751 -74932
22831 -74932 105601 -473527 -21837 147842 -296136 186500 56737 -174586 80586 -151849
22820 44805 52343 -41963 -244811 -10452 -30910 7662 -55522 175761 -37595 136028 -1134 34679
22807 -9561 -226346 -152367 -311595 -22405 -724 -102968 142347 42896 -312885 -256139 -152878
22796 -152878 -157412 -231963 70595 -77786 -107671 -29162 -12526 -267759 -152596 -68155 91205
22784 -484021 -47945 -108231 86235 64972 -218107 317393 -117732 10869 262293 198149 -93329
22772 -302943 58323 71781 109318 -190888 95533 -282915 -237043 -96070 54156 -31685 -61605
22761 -61605 -7380 315392 28399 -205793 -42232 -88279 116208 -20050 -62916 -266049 -11446
22749 436164 400296 -174424 220109 -77323 259980 -222886 97850 224738 -320478 79994
22738 35116 -193576 -315459 -133458 93445 -19652 42702 66955 -172194 -161175 -674 -206925
22727 -206925 13420 94776 -92237 270747 -297629 66164 -56067 -22853 -250075 -110243 20316
22715 -280576 -49545 -119312 -167195 355545 27164 -10446 -97211 239440 -40190 112093 -400471
22703 293808 -213494 -205951 2248 249101 -94556 229687 -59075 -215133 2344 244162 5628
22691 87288 226233 -175332 37961 86794 342661 248693 -89698 -352256 41836 -55420 104513
22679 228363 100605 -150124 97186 131540 47247 -131977 -342257 -81217 -40654 -1540 -74136
22668 -74136 292646 -318047 18464 34295 36960 -30908 170291 220390 179074 60552 219692
22657 219692 32727 -22231 -349036 -3097 128207 -363663 -236025 37818 -227232 -149060 -117051
22646 -117051 -9248 79119 21811 91417 148567 144691 9654 57534 149567 -131281 -284356 97825
22633 142678 -47189 -240398 -28904 -292360 85473 -154848 55047 -37515 270545 1457 178263
22622 178263 -97806 -45551 -137703 -20068 82447 -264845 -186126 399943 -18768 344821 -380263
22610 159457 -165718 -367003 80012 -85471 -12627 399107 -80140 -43753 -3989 158938 -150156
22598 -248357 -12537 59186 -341736 116435 78822 -226806 195630 -68409 21025 -276963
22587 18833 -284358 -247013 96531 -109252 -26071 279405 132472 -136610 -220697 -147093 -182617
22576 -182617 180152 79925 -255167 30390 25904 211551 -152373 -128356 -149283 -229684 -82310
22564 -16888 -122485 -200967 -164438 -244263 227130 41509 171804 71859 -95132 -41948 -82789
22553 -82789 11373 275523 72786 79174 -75068 -235954 -231672 414460 208059 -58709 -75520
22542 -75520 -115512 -15138 -30929 25108 197934 -63515 -227563 -42829 -263389 328861 341748
22531 341748 75894 11983 43413 -116740 -171762 6871 71996 -86974 -422066 6571 -47802
22519 53388 37654 178186 176208 83055 49902 147011 144964 65073 136102 -307213 -86912 31765
22506 -298116 -348694 17294 103349 -61427 205470 -97911 -172546 -88206 -211148 -51342 -52289
22495 -52289 52510 -166722 200111 -46572 -29766 126857 160647 -113132 -40893 44709 -126680
22483 -32305 -68236 -123868 -137605 -163883 31791 -102959 -47367 -88240 -50322 -28535 -10545
22471 -54442 76599 -133172 327132 -111214 -233877 -102210 -182236 104092 269477 202652
22461 202652 77281 -233774 -104042 -363709 61070 -146396 186973 81764 -313607 -2318
22450 122407 84392 32316 -115942 -367260 -111844 47870 -109453 -122947 -209507 -94245 -91215
22439 -91215 196191 -71116 -310437 -105113 51029 -104470 -114678 455219 69243 63186 -40523
22427 -291409 102819 -90267 -251554 -170250 75598 220906 -85252 -158022 -48164 -29906 -283547
22416 -283547 -428530 55114 -188070 -216687 272261 121698 164759 -93684 164487 -194138
22405 4684 -33477 128656 -26540 238737 -262126 -174897 18322 188 -67488 -72111 91707 52470
22393 52470 -35875 -90472 -88738 307437 164122 -145160 45842 -62972 -239001 -33699 -90564
22382 -90564 170658 -71839 -97184 -326 -128035 -305904 -94776 114451 61818 55904 -23540
22370 283570 2836 -35797 24934 38176 200357 -176896 132327 -54202 -308572 -144626 -307288
22359 -307288 77434 -179922 125473 -199578 -22742 -140120 -13858 -208945 26949 -144008
22348 50973 -28848 50302 -66288 -324599 48626 -233793 -70039 -141391 136634 73963 176210
22337 176210 287665 -21133 -288141 -61050 -77917 171878 143444 -302637 -63275 -85893 -69072
22326 -69072 79099 10149 -93595 143081 173714 -135981 -258119 -284530 -16715 26274 -107097
22314 -50687 21989 -109815 -66647 -61038 29925 -281881 50662 -238563 -123008 61573 -184549
22302 -167321 -262060 132361 114210 127513 222968 15366 -236774 191282 19387 -110174 -67350
22291 -67350 33221 2768 -39551 112918 -71114 51233 298881 -5358 -182605 171075 -310216
22279 -67391 -153751 -36748 288304 -88761 -21847 -247524 64488 56679 120223 62949 -19045
22267 34956 -163462 -89349 -287126 -89859 25862 76453 38298 -271069 -188540 -148357 147683
22255 374676 -25322 -66094 61219 97267 51933 -63762 -165064 135360 105160 -29102 56089
22243 134869 -109000 -126904 -215073 -138045 2117 234664 -72988 260525 -73691 -294088 77437
22231 49495 -301254 -69653 -122182 -34927 -117293 -200435 -59615 135856 -37661 -383101 158642
22219 -171871 369693 -162320 -337846 33135 -86739 -158695 -228750 236424 -20388 -921 -41517
22208 -41517 209719 -88278 -128730 28712 231110 117933 47342 383253 -68697 -28322 152814
22196 5942 132732 126551 -10444 -152894 -8474 -98996 -21059 -84695 201603 263619 -200144
22184 6591 59204 67585 -470581 -42996 -91158 252980 142008 -181045 -16372 2102 54852
22173 54852 -273376 -80001 -388213 -132350 -33304 41135 119416 8872 2258 -31829 -172243
22162 -172243 -39588 -264292 -315238 -147526 258980 -46275 -132632 -299181 -51972 53228 -220227
22150 -500 -74052 43784 -35139 78970 218355 141866 -242567 -47933 -192139 8795 58127 60679
22138 60679 -39134 72713 335829 277159 -14131 -41217 240598 -40305 -191771 -258010 -107493
22126 -31542 319531 -290112 -137106 -103398 -214184 6427 -111376 -164321 -178718 -121010 146648
22114 36518 -52755 -73733 -36464 144266 -288714 -86601 286998 105051 89793 118023 -87869
22102 200038 -215312 203081 161247 107939 -31802 -130092 149571 -341140 35278 -20417 -154707
22091 -154707 133212 246441 -353081 12246 -31910 126456 -109154 -156210 252693 84763
22080 161397 -215707 444812 -160003 -230630 -332396 139869 15530 -321430 -321497 -229292 4996
22068 6522 -119967 -402160 -104429 -53585 -241241 -29798 -43156 70255 70488 87482 36141
22056 -123333 80811 -263461 176230 -92992 -281343 -112367 198300 -41638 -168444 37944
22045 -141151 49082 -303525 71201 -27372 -88458 -83993 18628 -244027 -53004 202408 -179938
22033 -114699 320188 -156556 380593 47673 22280 -97841 64915 -215256 -93317 94653 -171531
22021 187152 -97769 -11102 8191 -32531 -180034 254663 -116227 -7865 -10578 -89572 -97715 174706
22008 -321512 69977 40922 -204886 70019 -299339 -260056 -144104 -132018 -105991 -124640 52289
21996 147036 -94204 48522 30691 -500751 -178822 103625 7820 -72634 91967 -14724 103017
21984 110379 80393 29998 -146328 484814 345004 93145 -68020 34597 175922 112306 -112203
21972 123399 130847 44275 -4295 126204 279612 -133346 -109279 237154 -144072 41451 3390
21960 -245307 108257 -156897 -9238 194012 -32562 157765 -180511 107425 98856 -173913
21949 -205131 -285259 -51614 -218429 -254749 -45258 -76367 -120648 -14801 -16189 -146039 -304226
21938 -304226 -182747 -191151 137642 -133117 -142822 -150238 85827 -277308 -105259 -150355 -230315
21927 -230315 -117178 216187 -204107 -58080 -93366 361463 -343382 -77375 -134107 -391814
21917 -391814 72479 234110 -59556 182331 41431 -57793 219978 -116388 278696 116245
21906 -242047 -218641 -24478 309908 -111467 -52995 104795 174469 -37763 -64809 67123 100485
21895 100485 177769 -52388 48669 -79634 86688 -154277 -231946 -102778 122046 -325753 -146476
21883 -213711 -282060 333984 -49322 -162379 -37968 -105610 -111347 -35844 34230 154283 107422
21872 107422 -293064 -83813 312170 -11490 -87373 98213 -74266 108708 -197389 -145892 277373
21860 -28410 -66360 63054 -108988 -339569 -417970 -38544 -196137 32005 34667 12680 -122552
21848 -19146 -77607 -67757 108470 -443563 37505 228919 57398 -101336 243763 -120783 55123
21836 -401428 228639 252797 -67951 135525 -3342 -146731 64716 143867 288776 -177629 -61406
21824 -301047 -93323 -257444 -208543 -284779 -30878 -260940 109078 19073 -85080 182802 -121107
21812 382277 232713 173062 206341 -141389 36512 118574 66006 100325 -267548 111260 -101827
21800 -256463 276087 80577 311087 32815 30477 -238015 -90972 216435 214608 81517 60546
21789 60546 -353110 203017 -41204 -105138 401846 170872 -7723 -298742 -269369 -100153 41045
21777 158913 50080 175611 -36154 51077 -132083 -7284 -216170 -142918 168175 -65862 -178025
21766 -178025 306295 -128362 -141749 -72347 105806 -106146 -94685 87362 132915 -148675
21755 -41107 -55058 -317091 40149 67617 -222430 -218352 100210 -337649 149061 -33412 -38635
21744 -38635 71598 -332373 -14111 -391545 -130995 146367 -55801 87310 -42974 -254160 -99611
21732 -57323 -139369 -325564 -120542 253093 26192 -83489 71129 194224 -85011 -93440 69388
21720 -302267 2437 -174161 142179 -62817 -197929 -124127 20607 -50595 68787 -428801 -201467
21708 57150 105890 105052 -113563 -308860 -27803 -346607 120538 -136204 157737 6590 -198249
21696 -60484 -45806 -221669 -272979 101063 -462507 51457 -77714 59416 16858 -63668 55959
21684 -33740 -218558 82430 -31949 50023 86751 -394298 156638 -231994 -432215 -2977 -125678
21673 -125678 -137456 -209690 -98560 -160815 -61833 -12981 -37649 17863 -123847 -28187 165681
21661 17851 -271842 -223662 -482021 -414751 -170020 -294873 115973 -271438 136916 -56021
21650 220369 -64756 -16063 369897 59864 333062 -261181 -115232 -7511 94226 9235 40535
21639 40535 -234075 -496379 54863 273925 215564 257992 -88572 -362778 -308353 -38676 -187733
21628 -187733 42016 62646 -190835 -123551 143005 98585 -77750 121211 -118171 86898 133179
21617 133179 -56595 -280266 -18926 -177589 -76516 -290578 -93442 118253 -121811 8812 -212408
21605 111783 -160222 44727 -14175 -314739 -129711 -49644 83763 103499 -160879 -108511 211839
21593 -62910 -272430 225345 39548 55006 172643 -367306 -342225 -214558 -180943 120537
21582 164994 -362234 149436 -53603 -50749 -347318 150560 38210 -126288 252936 4288 -419384
21570 -25730 -63500 102303 121558 -61794 22827 118707 -310461 -533395 -183713 -30746 -321790
21559 -321790 -250177 69571 -14957 -144688 -160283 -54975 -45240 -53273 30671 -286479 170123
21547 -95185 16473 -188428 -56831 -322538 -88204 -101051 -52187 -103152 -49051 156391 -204160
21535 -102118 -202611 -106200 -12030 81104 -18539 -237870 403745 -21195 -338160 151056
21524 -196901 -46807 -24640 28917 89023 -342395 -74745 148440 -151380 -18489 -320488 -155122
21512 150297 -97658 210095 63173 49456 -25582 71763 239905 -128611 -213217 -349824 -215793
21501 -215793 80443 -80899 77767 -106504 -18406 2422 239086 51138 9253 -9923 -109414 -28080
21488 -170983 111034 121222 -24501 -74685 -29116 75960 93411 -224636 96191 -150640 1793
21476 -74359 -247394 173314 141192 -297878 -109767 404917 -81905 -114788 -105789 -271075 -183655
21465 -183655 100427 -197767 109597 -107876 55307 86022 -49728 82925 -161500 -147313
21455 -147313 -19344 131424 -194790 -402381 -52891 -268608 -29965 138374 97183 -101588
21444 -107829 -133928 -231083 -211214 -43566 128986 -51824 -128443 396322 552462 585503 433847
21433 433847 81231 161039 422208 108702 -31379 19484 -204457 112881 104755 67767 -37316
21421 -36835 -134623 -88760 3158 134652 -378744 -316518 -58386 -29395 -43094 105369 -260692
21409 -318320 -52106 233503 -15871 148372 -67646 67864 159618 75238 167967 -29025 -132137
21398 -132137 -322520 2967 2673 -249525 -107247 -25337 -143272 -36763 -252741 -38683 -156349
21387 -156349 -65682 -168770 -384414 -37001 -34810 152343 393190 56306 -185196 1508 -155554
21375 -44918 -149739 -196705 -100711 142297 92366 -321868 4042 -140121 33862 14783 -10274
21363 -289252 -88462 -164098 -64490 -39242 -358699 -214790 -25239 309983 -9265 -238605 -2584
21351 3134 -203746 69618 94523 120067 -385483 2369 -496082 -108391 -161722 96299 -255060
21339 -187582 -306946 -83338 -235056 -28420 -479348 25563 200632 67620 -344569 252276
21328 18585 75221 -130230 387162 -307512 -323961 80914 -120954 -217664 -16924 -99175 -65675
21317 -65675 -143211 27267 -202940 203611 121848 -132535 -104580 -255316 -53979 -96796 -206353
21306 -206353 30710 3960 -41173 -107101 -168091 80989 -185789 -197339 -12658 73565 -213226
21294 76017 126358 219639 69419 -42272 -246774 -86727 67874 -15602 100427 -155794 30024
21282 101857 -90628 197020 -63428 413181 -96799 204303 121925 127063 86945 -76322 -96060
21271 -96060 -97593 -133217 -26278 125562 -84472 -36852 -290308 -51712 -284638 -11543 -37028
21260 -37028 27457 46520 -28281 -144087 6670 266032 -50236 -130891 -134297 -127056 -287032 -223036
21248 -223036 113108 57929 227635 317388 -105496 -51930 47672 -21094 -99887 187915 -382060
21236 -36147 -78450 -204837 332002 -292847 176976 -87982 108367 262926 -321977 242479
21225 -199011 45741 45256 -128222 29722 -29368 138635 100155 -68367 -385520 -30412 36414
21213 -204127 140167 129563 -158018 45063 -151045 -343622 221940 -130675 -90030 -324495
21203 -324495 94930 -181704 96517 -159624 -159213 93911 74239 -241976 -9287 96890 -67513
21191 -84585 -105011 -33065 -199233 123541 68163 -303529 88967 -107923 -82239 85587 -291949
21179 207124 -137686 306155 -55523 -199451 -178131 -297515 -106240 -119173 -40253 158030
21168 23054 -10213 -143701 178047 -25347 -7745 190518 68091 -20540 -231141 -28173 -263069
21157 -263069 -101854 56065 -167367 -57093 -179776 -120690 -29470 213867 -236430 -66942
21146 -315503 -113602 -299368 57310 -310130 47852 99141 -220000 265304 -125920 -125071 -218162
21135 -218162 59671 8875 -137847 -266939 301533 -7885 -85355 -213936 -206686 -161404 -154187
21124 -154187 -8920 -246951 -170154 33069 68384 18913 -12754 114747 75462 -82623 -304832
21113 -304832 269019 -94239 83363 -132002 38676 353068 -51672 -196051 -133669 -146918 -154032
21102 -154032 -269513 -180751 -31221 150185 -269125 296630 163597 -199070 199210 -339227
21091 -30893 118574 77947 249467 -105959 -46935 26493 -294377 31177 -136956 -82189 1611
21079 -172271 141942 -121157 13014 -75680 140798 65638 100007 -140972 -286067 -56060
21068 -181669 8627 43003 -106043 -157938 179191 362006 -260514 155473 -9474 8095 -17280
21056 68862 -82872 -376263 -33411 -199769 -129427 -87311 18602 -147172 -151192 253513 -311564
21044 175106 -455706 241237 -24651 -125716 120709 21013 26005 306554 -44391 -79136 -249151
21033 -249151 -17841 149213 -86019 -80333 84556 21556 -5008 -95698 -144028 163428 -286113
21021 -169421 -54441 29079 -44671 115042 -100110 366701 44254 3745 15160 84812 198394
21010 198394 39184 100702 -127598 -264178 -242192 340078 -35319 -20446 134368 -78934 49282
20998 31429 -172856 145436 158579 24058 45860 -250488 167433 270856 32925 60628 -308178
20986 -6064 -195349 -49175 -292598 86393 -63132 141796 35836 85007 36003 198908 -330648
20974 -135104 -224940 -44180 -231807 191001 -11098 -424068 69310 168901 -31905 -192853 -191566
20963 -191566 -245684 51389 -197852 -57312 -158314 -61390 -55963 -180907 -201276 -133226 -160655
20952 -160655 -243408 -234986 -335877 -37693 -11237 198310 5800 -138427 -72974 141226 135748
20941 135748 127831 150379 -59940 214021 -130529 -8899 -119031 -292293 -88603 51940 -101466
20929 17197 100609 -170391 62023 110514 87168 -248000 -101289 -255724 -24386 -98405 -280883
20918 -280883 -85283 74971 -66103 -17025 -190640 -159515 -85322 285377 -27364 277996 27787
20906 -382679 113353 -147890 -74279 112498 -52865 -93166 -168336 149220 -104105 -62554
20896 -62554 -304600 279896 58755 -17564 99396 -11745 58547 83204 -11667 -229622 -227188
20885 -227188 -380405 -117671 -135239 1293 -240519 -286788 -12437 -42352 -177317 -247081 46887
20873 -127978 -330091 -60902 -364375 -105606 -56275 -151197 -182023 237285 191529 -3894 -96438
20862 -96438 241013 178474 4799 -76817 -70965 81335 624540 -288430 -439 -2626 -69607 92142
20849 -167339 85368 166752 176061 273612 36472 3106 -115963 45783 -184908 -313537 224914
20837 226032 -24962 -36393 22898 -511421 231287 -138786 -23560 -151305 96471 530832
20827 530832 65864 -94413 -272943 -92815 -169670 14064 -4033 -42954 -123464 -216732 136102
20815 53735 -293362 34959 228692 68102 -34402 124128 -34114 66455 -171826 14575 42961
20804 42961 -39401 260990 -329758 -16806 205166 -74418 74154 -120038 -366339 23589 -182098
20792 -58912 -21585 419049 123206 438737 -385930 154834 37684 225347 -214807 92750
20781 -186841 -295494 355746 83827 131498 320928 -30267 -5448 50444 -212422 -145762 334777
20769 -11718 -59053 176507 -244813 73099 113719 -12841 -67702 -106153 107689 -62126 -30699
20757 5628 18793 -223279 -262873 259911 -99931 -92184 -314888 -201147 -254678 140264 -24029
20745 -457565 -186664 168272 -52891 99943 181371 314964 -135298 -214490 -41375 -348797
20735 -348797 117639 -72781 -4878 71145 -19677 75949 -148402 -1889 30863 109613 51345
20723 -169120 -27317 -125130 105945 -411124 -370285 30668 -170702 52516 77044 -160796 -349172
20712 -349172 18380 5954 133310 44009 -188120 -9654 -60953 -168778 89766 186512 -19087
20700 78810 84038 -165882 196506 -104281 129641 -277449 -146943 109385 -99840 -496393
20690 -496393 -58733 -167727 115731 -77838 86897 62364 -84382 212399 -97610 81989 -44410
20678 -382016 -138946 -288537 -149741 303236 19356 -183251 -63364 181529 -59041 -141634
20668 -141634 -240151 251866 79146 -91370 -533195 -6729 167506 -200894 -10937 -347117 460027
20656 -236441 -324337 120277 -38482 82941 -22354 -30051 207274 -350562 317146 -238481 74375
20644 -293542 -313662 -73405 -165094 -91341 142070 -188371 386506 -130853 -142213 -266903
20634 -266903 -56023 141634 -182010 22497 181145 -351375 32687 11941 -127336 8912 134567
20623 134567 -64856 -72410 -84911 -181745 69569 233581 -216053 119045 68636 -62393 -216206
20612 -216206 -35632 86473 266354 87031 13216 -51059 9770 -194358 20726 -341895 -61712
20600 138021 -378603 254821 -205638 1167 -243538 -227688 -199785 -130658 118489 -274247
20589 -21446 -7114 -199586 -43281 -19915 -115228 -28203 -25466 -268320 -125937 -108861 -35127
20577 -332902 -49160 176419 62052 94377 27853 -194921 69016 1938 -258828 118293 -31957
20565 -213274 124057 -126299 75258 81773 19377 59065 -237342 -41653 -314606 -83612 100701
20553 -154285 70747 -169179 -243179 74185 -96484 -194911 -392215 163204 -324621 130360
20542 130396 22493 176686 -354335 21934 166972 -113223 -129716 -24251 -201318 -134816
20532 -134816 -196176 -132563 -118347 324218 17047 -42433 21895 -276535 -102658 -229252 -149315
20521 -149315 -71812 -97787 -183998 -36672 -81016 -207769 121605 78290 -368292 -26171 -99244
20510 -99244 222844 247292 -11010 -4086 -57745 132936 236457 33643 52973 -185719 161980
20498 179277 -55329 161617 30746 -171243 263018 91836 -257311 -79615 167723 125627
20488 125627 67291 -11723 157221 12035 132649 -3250 163413 86129 -229235 153675 188385
20477 188385 181203 -193943 -100209 -9295 46858 -124174 -18811 259846 214788 -138120 -96596
20466 -96596 -172569 472031 -51844 143214 -62578 85170 -243243 208601 126430 -252464 -36684
20454 310250 -183222 -414950 -216371 91845 -126436 28859 -236564 1099 -346378 242705
20443 295670 48033 39217 238385 -182207 -192192 -402155 -292127 22456 59874 -24411 -12723
20432 -12723 113456 -92647 83007 141936 26634 -165772 -238971 -61786 -310440 -89240 -218320
20421 -218320 153692 -149620 -412309 42424 -140617 82682 25564 10013 -16445 32775 199886
20410 199886 -307563 496334 -51737 -391414 -456769 137509 -53487 302408 -37047 38958
20399 115783 -85913 158475 -24822 69167 2033 255663 2718 -127269 164544 -37242 63102
20387 254756 -260729 -63638 187041 292147 -237398 -337171 147142 -214733 -190970 -276052
20377 -276052 108091 -93581 -117450 -106370 -114418 -324317 -34829 -107134 -9331 -70241 252553
20365 112389 -225288 -42604 59677 -196513 -64695 -444794 -239761 166848 42020 254515
20355 254515 -26752 -73653 -335348 120742 -204745 249347 -198409 -62097 76822 -220272
20344 -424875 192909 -6718 222934 -363097 -114508 -62742 82685 54960 -50790 -169671 38607
20332 -84475 -322044 -239981 -107700 -342329 107452 211936 127875 -100363 139910 69465
20321 -239161 -157496 -67535 226155 -13580 -172450 -10934 24352 77572 53153 -343240 -122101
20309 -76999 -245860 -3523 288137 -95999 -17981 331831 -188161 -238980 -383942 -213228 -40173
20297 -204949 56644 84535 121991 -228613 -136582 30293 -72679 -75252 90865 84453 95173 -241691
20284 96323 167986 -23235 -235714 39062 31018 -78800 -25141 327921 -51693 -201243 -115814
20273 -115814 110369 -244471 220037 95499 35654 66219 129380 -166014 122445 -246939
20262 203166 -47144 112052 69840 -97589 -186966 -221586 5744 -52755 -41697 -48623 -46071 -155633
20250 -155633 15969 -298801 -280437 -144602 75308 216661 -104667 165414 -291628 28465
20239 68181 139309 -236033 -489649 98857 -71491 -69566 -291262 -305558 -15467 -210034 60312
20227 -119820 25008 177730 137886 -68155 -131660 -239051 -177533 -258066 -385650 -232389 -44412
20215 -112241 -294954 -113770 -197717 -200273 -129598 -371676 -37061 195184 -179398 28808 -67935
20203 -201305 -126579 268365 -151629 -88064 -242630 -110974 90545 -238698 -198175 56256
20192 -373693 -283767 -39756 -40704 45058 -189453 -53318 -146663 -165530 125032 -264593 269755
20180 98507 -209310 -241911 -48239 122970 -202268 77352 -120994 -262215 175062 280194
20170 280194 -10331 -169619 -50261 14491 -157499 -348171 -63539 82466 -118584 -173984 -255753
20159 -255753 80187 -180868 -185608 67730 2882 -3815 -40376 223404 30884 -111539 -101079
20148 -101079 -148776 34754 -252048 -188289 -217704 252473 -200507 -184334 163811 -131591
20137 -22181 -241222 -6265 104519 169392 -156122 -282854 -247914 -8736 159879 -67368 119428
20125 -152097 166234 84910 311499 38798 -250149 -32 206981 -84761 285426 118693 -5852
20113 -107257 108913 89632 -280829 -246276 20935 -55565 -90884 -34001 79852 10368 6229
20102 6229 -92993 41269 71612 -194853 -67172 98697 31201 -536424 59915 157701 -18482
20090 -182644 -168437 39962 -175630 -89955 -16358 -216015 -238794 -91884 -117931 -64506 -361077
20079 -361077 101239 52881 -194906 84308 54845 142101 -367826 188645 -341623 -74972
20068 -347919 44117 -302865 108343 -116067 172151 -197881 -398669 97316 -322377 59957
20057 -212573 228710 -105061 -209113 105346 15054 -116316 115494 3034 -21211 -13283 56693
20045 -29082 4743 39283 -77547 -290435 -345583 -174530 -19662 82541 176186 -98713 182095
20033 22618 -107614 -302762 -123529 -468902 -638071 -35533 -7725 -208340 132315 -88829
20022 23790 -72480 -172461 -248525 91107 -28184 21485 140035 105075 -55108 166255 127853
20011 127853 4021 135235 185935 55320 -24664 -114249 -18071 -160922 146982 -153854 -133382
20000 -133382 -177243 -95833 -23685 406849 -296818 -86015 -532200 -108889 -79414 -76735 -273744
19989 -273744 -53732 -53231 -126267 12243 121247 258480 75959 -197142 -197913 -12788 11528 -21062
19976 -100578 -137659 13937 -218191 63745 -62945 -186610 -182255 203722 186048 276283 108914
19964 -370614 166191 -227517 -121031 308195 -53473 258937 39609 208661 -275470 -232371
19954 -232371 55951 172637 54127 -186842 -66696 -110836 37753 227848 7747 -64099 -22474
19942 -97349 140184 49039 -111495 129930 -134121 -31864 -174826 -296206 -356632 75266
19931 499769 132023 109655 -195475 -112107 -125612 33572 -232653 -175420 -59537 267974 -272765
19919 7038 57248 88763 -138548 -139867 7389 -10111 219159 51759 37538 91716 62557 -69911
19906 -131516 -123353 168861 -255023 -9388 -256964 -86584 81418 -151463 -71877 52572 -53980
19894 -435095 -27756 -162088 66125 -52206 215262 -299841 -73257 148432 -307149 -118255
19883 -225876 -98108 -40429 -43136 82851 8468 -267836 -168928 75543 -4952 71401 -573395 104518
19870 -498207 -159370 -113479 -111285 -301807 -339369 123652 209957 -216506 -226471 91098 -144954
19858 184078 -41242 -155239 -33013 -160190 -130103 92171 -232073 -78173 121637 -543788
19847 -63492 -172166 -144030 -16570 107814 26202 11464 -60833 -41616 -127209 78402 -146615
19835 -210850 48431 -198315 -108251 372263 185098 -20074 -237770 105513 -19060 43150
19824 -247459 28784 -276400 -154220 -30728 -25152 -182341 -210467 355964 86747 -445021 -62892
19812 -100639 -48835 -80218 -356126 -189305 -228427 -338249 167911 -150921 -30494 -79216
19802 -79216 -65687 -245146 -96384 -96041 -380598 -90884 49605 -146436 220639 -7963 -176712
19791 -176712 -347786 -24785 -46829 -45599 -310548 -16790 -211437 -144851 314739 145068 164564
19780 164564 53475 62013 -313212 -15884 -58142 -29167 -156094 -296927 50680 45125 159366
19769 159366 77397 -395535 -11847 83327 -252979 24664 258300 113650 96591 327927
19759 327927 -314383 -93905 -110269 -239056 9923 -32111 -79049 -112199 -419758 183285 -29876
19747 -371190 -278897 -82018 -61607 -26357 -49951 -159108 -35590 -405390 -36474 -94421 207221
19735 -168503 -35218 -129986 -147628 154808 123871 -52329 -50510 -164653 -173877 -156933 -130139
19724 -130139 -49983 101628 -106958 341025 -182855 -297381 -152875 514 -84547 -137123 74322
19712 80327 161395 -2169 -121083 29030 51726 -70308 71106 -158620 -340385 -191636 -50602
19700 -87914 136694 -95095 303455 -84196 53147 -268515 -24981 8672 126818 27727 157886
19689 157886 -29353 -238398 391553 -204028 244641 175648 -13207 -289605 -141137 -95171
19679 -95171 -247146 -41004 -284963 -183793 -114065 -64164 -276295 296554 53739 66961 -154410
19667 -341440 77297 -285365 135370 40812 -120781 -33719 -134200 -39671 -160362 254712
19656 -276407 -21626 -4960 -45734 111052 -165347 158896 -355606 -6818 -346853 -87129 -48460
19645 -48460 -189678 -77409 -49831 148889 151662 213719 -32901 -69831 -49787 53320 273397
19634 273397 -77617 -280650 158038 -81561 -225994 -72559 -62422 -420043 -137960 -6099 171996
19622 11579 -193861 166894 -126556 92251 125877 38740 -54064 160887 -55697 -201870 83502
19610 -37444 -9374 -305800 191724 -62951 89085 -403205 -197487 -478593 -126024 -254420
19600 -254420 160384 -204935 107738 145324 46931 -526648 -254804 231984 -206533 -266066
19590 -266066 -216720 -66197 -293197 -298781 143643 -297463 84622 98503 -74419 -45518 319689
19578 -177217 -162787 136612 -77801 20591 23984 -44903 -316104 24797 179483 61384 -107305
19566 -146089 72331 13134 -211177 -111306 -299585 46351 -12497 -100824 116093 -206869 -317179
19555 -317179 -196507 -287334 -210889 -86022 -20614 273882 -131080 -107389 -184672 170390 -8197
19543 -260965 5029 -77577 -89382 -32359 -279211 -91968 -122858 16695 -18102 85341 166050
19532 166050 91057 215530 -56667 -83404 -62462 -105108 -128409 6801 89038 29735 82222
19521 82222 -62467 66820 -315854 -46014 -178038 143153 -78018 -408202 -352396 -333469 95434
19509 44297 102120 -95461 23505 -63059 -191898 -275110 204867 143293 -307049 19635 -188091
19497 54337 -28030 -158364 -223464 4216 -144701 29317 -179680 383512 223142 -221490 93264
19485 152812 86146 -244382 58620 117944 -82193 -905 80006 -168219 -424853 -173740 -416021
19474 -416021 -301555 -94790 39471 -22853 -219231 -225415 -139226 -156895 -245890 1291 47389
19463 47389 -39573 -396807 -238898 76075 7500 -26925 109972 -337475 -327399 144192 -105045
19451 -39040 399262 25354 -144890 47347 287629 -24989 -29288 -336898 -67647 244359 -136183
19439 -237001 309193 159546 -185918 50490 -186891 -167328 334087 -399497 -363531 -257447
19429 -257447 -30052 -62027 -213731 -20886 -61058 -197831 48645 -212165 -342462 -134291
19418 -22034 -228637 -102217 -299026 -67758 13807 45001 -33969 -227299 -83884 -108294 295793
19406 -116298 150337 -66041 -121663 113965 -123416 37742 -138535 -43871 -123154 205993
19395 74392 -60345 28611 -118594 226102 -361825 151416 -141040 65637 -56580 -18107 -134018
19384 -134018 -137177 -49892 412146 -9306 -69748 -138664 149142 -173028 253912 -9608 -317563
19373 -317563 -38682 238741 -118152 -280249 27416 -154144 -46405 -159471 137428 -259540
19362 11834 196529 6699 -2418 -130275 113126 -58291 -193703 -35962 1011 -50945 -334797
19351 -334797 75013 -440833 6604 42532 39543 99576 242409 -104213 -18013 -2216 61985
19339 -15094 -221846 -287478 -81891 -162025 141588 -146176 -234908 -261467 -207755 -103168 -168809
19328 -168809 -70858 -551402 -32044 372522 -327088 46770 174933 -170242 -47503 -8702 -258945
19317 -258945 -36472 160192 15101 191555 -166884 215450 -18814 -72701 -176723 31098
19306 -235986 -154904 192578 -33941 -136835 273941 -354617 109551 -65047 -104933 -145947
19296 -145947 -190974 -384541 -405014 -237247 -154697 -193118 -35289 332056 18714 170774 48968
19284 -7670 -206547 -343105 115474 -121296 -5587 -31607 -256030 -191515 26805 -199612 28157
19272 -177544 -326154 -272816 96012 25556 -214434 -214492 218568 -5281 -102827 -22825 215144
19260 124818 245601 36093 80663 -61300 72143 -166463 203803 -275321 -232280 133380
19249 161814 -126147 30257 50039 -219412 -293744 121006 -177636 -12123 -199831 -26887
19238 -98355 -158820 133150 212682 -341333 -48500 -184591 49853 -66008 -376294 -81871 48074
19226 -27231 287397 -319530 127798 155704 -154665 -87236 -23791 -257664 -406145 -118157
19215 -7714 -118046 29902 -83091 181673 23390 -147825 32273 -133845 -205832 46147 -197934
19203 -34271 -120908 -102493 135852 79854 -4596 -227806 -198826 -137291 -101166 243782 77980
19191 -148144 -12822 -274147 -127052 -43241 -202161 143609 254186 -67880 -136809 -13454
19180 89735 -65841 -82936 -297918 13510 10795 -126166 4905 291230 264779 -43833 288124
19168 127822 173002 -111409 -155817 305472 118049 -161312 -373592 36580 -47972 -184507
19158 -184507 -289786 130246 238804 -148101 -28410 47806 305798 -161481 -8615 -61254
19148 -61254 47927 126780 -9170 -93468 347517 3014 -39077 239841 -68717 56022 -160416
19136 -49619 -332796 98407 -52419 -183460 -203665 -31858 135909 -179931 -161647 -54228 -19214
19124 55211 -334924 -50202 -214054 -265649 10929 -158092 -128343 268116 37408 -168993 -60753
19112 140008 -223176 -195399 -348935 23914 -241014 -38304 -204443 -214 -157403 -22524 -14755
19101 -14755 84243 -186614 154668 -19096 20716 -317930 -104410 78504 -50955 -202261 16355
19089 -222735 305994 -289894 -20172 -143945 -93388 -192426 -330494 154642 -233551 95205
19078 -220467 40421 325601 -56524 206217 -349730 -96341 -298898 89954 -212040 -241465
19068 -241465 8920 8808 -331404 -75659 -8824 -72555 168764 -167682 -178730 -196142 112509
19056 -132323 75631 5646 -86093 -121690 220360 -82433 -306799 -32563 -188857 -295651 -87875
19044 -127902 -44572 -122295 36245 -179362 -147578 30965 -232025 -61115 21478 112687 -33214
19032 24214 -141943 132616 -254991 -26886 218465 -189879 76532 -74273 362878 -221265
19021 -216395 -201032 -100723 146732 234585 68381 -108549 -280773 -189489 -357598 -413310
19011 -413310 33305 -69520 -50505 -110471 27699 -98708 -221851 116570 -225825 74087 -187059
18999 -34028 91915 -133761 69669 -435064 -281347 -142121 -12029 11424 285702 -19735 114383
18987 17933 -333884 -8044 -57347 210759 266684 51845 146354 8626 -963 95625 216399 260211
18975 260211 -187912 -220241 -81168 112333 -138812 -209764 -270151 -207409 -15556 -251204 -298054
18964 -298054 -67716 -82315 -500455 -92221 -184537 -23576 36787 -234211 -39331 164526 -425535
18952 -259546 -101730 -38102 -100530 167536 -123013 -69112 -140942 16740 208148 -185029
18941 205698 124871 288874 212761 -247678 -97508 137023 -84607 300378 -137933 -25029
18930 -79743 -14788 70459 10249 -24653 899 173035 -59221 80595 -328162 111030 -310642
18918 143645 -189026 -210535 128113 134564 -4430 -376172 243660 -10186 -105354 62152 -175391
18906 -35579 1883 -138957 -128669 340165 13998 143241 -60503 191088 -343971 256915 63561
18894 233372 -38438 3931 -151183 -342327 224392 -110095 -113923 -119289 58694 -254189 -197863
18883 -197863 -122924 -124790 -58747 17772 -264550 -196233 -209764 93617 70025 5418 55737 -51247
18870 -176607 136773 114990 94645 87663 -273812 -99685 155960 -147924 151901 -245672
18859 -47163 -324489 -180625 -407018 100010 -237387 195652 119875 -151385 20152 268597
18849 268597 90713 215172 -223485 12679 -196209 -48795 104279 248019 -251315 345582
18838 269425 142268 154258 -113192 -21113 -79552 117620 24405 80704 -7855 116016 -300563
18826 123941 168504 118701 -136002 -218884 172686 34867 -189258 -321939 162551 198516
18816 198516 115314 16731 149027 -180873 270034 151850 110141 -279007 324109 429554
18806 429554 17245 -59927 -181194 350298 -65317 283338 -41183 145111 7415 -199627 -223886
18795 -223886 -62705 -72290 13067 -319602 -449059 -116657 -139245 -66452 177443 5331 -84 68270
18782 94809 35809 -159318 -218212 64237 18588 62525 -387766 159074 73149 -26897 -321695
18771 -321695 -43664 -81185 -51086 75476 -18539 -132495 -38777 -167920 -157870 -156043 -14839
18759 -168615 -76486 -37444 -273041 -192687 189761 9328 168575 -77554 -22629 -209650 -478912
18748 -478912 162451 -42867 -20314 -280243 -135936 -127284 -153521 -168048 -220789 -416277 -251804
18737 -251804 -71649 -169850 -31999 -308004 58348 -100278 208430 -237844 140027 -191222
18726 -26884 -105721 -396658 -208408 -253243 74144 -348835 43942 146280 255604 -34442 -129345
18715 -129345 -132580 45693 -124677 -292800 -90417 -179991 7787 14983 -203954 -65863 347092
18703 -83269 -95192 -227862 122949 51878 -68995 230608 -251318 -76168 11950 16189 -143265
18691 21377 -54676 -52258 -99918 -10358 -233643 -393609 52553 -176830 -165059 -108369 234535
18679 -22283 -30918 -272719 -126452 -86163 62168 -288143 -149996 197493 115161 -61145 131988
18667 356208 -281605 -113948 -226787 -143312 -83160 -213866 -180682 -265744 75412 -110525
18656 -375580 -112561 -311088 -113729 -134635 73016 31163 -17851 85448 -245829 208501
18645 -152658 6029 61695 -28603 -38604 -175317 -155799 -90659 146185 -163841 64087 65353
18634 65353 169307 314138 74188 -223566 150214 -228898 67958 66881 -411984 252331
18623 -361088 -136486 7991 -62825 243646 -76835 -124665 -29790 122895 169743 -215211 111925
18611 32320 90843 -36633 63166 112938 155982 119540 -25431 -189807 -151423 9429 -13762 -17202
18599 -17202 49217 -129153 -174231 -171933 252852 -271550 -53501 -103346 295988 -55726 -261061
18588 -261061 112541 129349 34747 -48026 252669 196416 68354 -86571 343462 -92616 -78286
18577 -78286 575 -317033 124247 -74070 164839 24342 -53723 -52678 -64717 -3309 -72254 -82183
18565 -82183 188865 -88852 -92390 92120 -73725 310224 89174 122252 -101408 85218 71041
18554 71041 278 21413 -94615 -64140 -144394 12423 -235879 -106382 3576 -41362 61136 -82806
18541 184573 -147809 -104121 -165216 127314 -89106 -260403 150405 -173250 418043 16117
18530 -330989 49156 -180447 -45275 -153008 -158064 -125018 -276411 -478519 -27674 -1652 142828
18518 -157465 -46947 186940 -197971 163574 146932 -317418 41588 -98387 25176 21000 38914
18507 38914 98001 -56358 32454 -37326 -115189 221894 -310878 -236211 62496 -33782 31618
18495 -88293 277117 -27365 22696 -8571 -146468 -57598 -189507 -148629 193779 -4624 55287
18483 153698 -35046 -302220 -356999 -375367 16939 247381 148053 21781 -132729 30822 13592
18471 -249289 -137582 -139404 158771 -11206 -125711 -195610 -141878 33398 17651 -69863 -381847
18460 -381847 -709 -185740 -310098 -184536 -291187 220920 -39731 -216952 -20280 -330173
18450 -330173 135178 255062 79184 270789 168468 -82810 8133 -171914 -378700 17238
18439 -101119 -5767 -77877 -192138 -123054 -172948 -90313 127139 29694 240149 -156675 -192595
18428 -192595 -64157 4646 -113033 -23035 -300974 -1013 -42380 -24320 -254421 -23855 108478
18416 191093 -252503 -282629 -338154 288632 -177906 -78914 -238034 9525 71486 40497 -56986
18404 -231193 249977 -41337 -37660 -185114 132435 2585 -77915 -448013 -164179 -130991 27960
18392 -147866 88262 -54461 -164428 237294 298238 150378 -95119 -40794 -26580 82552 140027
18381 140027 -114939 70756 -353446 -194154 -282726 -142437 -166908 -19197 -80020 -160871 36868
18369 -180861 293215 82175 -224584 106312 -30491 -290026 -162324 -24258 -59989 151869
18358 -1512 38777 -32348 -118667 21922 96941 -190551 -66403 -378159 133553 -29728 90770
18346 60047 75562 -366231 -204051 -163193 106905 48780 -159892 282792 114733 -399307
18335 68134 95061 -54641 -4763 88548 -66034 45094 60072 -256879 -41208 210435 150976
18324 150976 8180 -369604 -128307 -56642 298769 139580 -156791 -40964 17011 -128214
18313 -40516 982 -175235 -188328 -335568 84815 -101966 -173613 -136572 19749 -181471 -181727 18247
18300 -31693 13959 -228049 22063 -20421 -308589 145347 -256902 153850 189951 -10334 -85347
18289 -85347 277555 -178187 -223099 -143634 -237371 346968 -272238 99980 -92918 280936 88732
18277 -91849 114109 103754 -214330 77580 92761 15648 -119112 234344 126987 -145703
18266 -228896 -251512 -19770 174889 -130356 -116006 -221562 -189809 -16989 352286 36419 77290
18255 77290 239392 -10649 -10970 151880 180910 -351163 -108448 -412332 534 -150485 157494
18243 60164 -355653 -261831 261181 -208534 89001 226224 -178799 307370 124774 -274722
18232 -33163 -108710 -73893 -165084 47745 -23112 134930 60971 95255 96740 300085 -25184
18220 -118740 -178651 -241204 188520 -34402 -289605 -47982 -378085 141178 -49838 26059 31131
18209 31131 -128452 -144111 -295197 -98474 116369 -93232 306456 119674 -107021 41996
18198 -188688 65215 7245 -49620 -203812 -116729 -291831 -243079 10368 213243 158058 -18574
18186 62548 -88040 -458216 -39046 -135561 -32220 58599 -141290 386720 -35482 -31393 -7887
18174 -108820 71301 -197263 -156158 16225 -7727 104773 50548 150236 -150266 148370 127335
18163 127335 27361 -164262 -362898 179786 -216301 77941 129691 -97295 308234 -221354
18152 127441 -321936 -57406 -305853 -466526 50954 2786 -161538 -352172 -209256 163526
18141 -89538 -220029 -154996 168723 -175258 -124953 -11883 -143578 -155173 -132607 -166057 -129971
18130 -129971 -121916 -332977 -79403 -192997 -18449 191668 -48819 -30275 43066 -109186 150942
18118 156613 -172453 -129303 361311 -283891 330756 -320281 9247 -134229 -73023 -95466
18108 -95466 70567 244451 -112522 -174469 -65094 -128926 217973 -161254 171928 -45255 85873
18096 -332563 -44169 82311 -60728 -64816 -211810 -202544 -64498 309956 192230 -210090 -29522
18084 -85704 -201992 -180887 505564 -258126 -108045 -58052 -195445 -15568 -399331 -190401
18073 -129660 103264 -342507 192043 -110818 -40341 -271199 101884 -287480 133242 85763
18063 85763 -213567 -263617 -192893 -410706 -55427 124252 182403 -34319 -971 -107281 -122682
18052 -122682 223450 -26142 66390 263425 -3310 145557 -119612 49650 207876 110354 -177564
18040 -78491 452540 -468487 -75420 136897 -9182 -15204 -273571 110870 -50101 157581 -195183
18028 -153547 -217693 -240153 -52428 -56439 144460 -174982 177096 -62587 -465673 435934 -34567
18016 -378993 -65339 234994 -177731 -118810 -215803 -377382 -28435 -259217 -187589 301054
18005 -3423 -95584 59084 -397585 -323363 309989 -25816 177082 -228299 110204 206695 -296663
17993 -246022 -150807 -346641 -213183 -113919 -272833 232038 -41030 -250890 26943 147165
17983 147165 312473 95471 -280781 58588 -277802 -96748 127885 5708 -37314 133783 -26791
17971 -135670 200344 -118898 136870 49779 27218 31376 -271637 -5890 236421 -102127 -144221
17960 -144221 -84220 -64614 104720 81628 -64970 217691 99134 -12054 -227853 -34623 -250452
17949 -250452 -55834 10347 43946 -285391 -349677 116200 213040 -119074 -22873 136819 -92195
17937 95253 -246214 -258945 223397 467175 -99321 90205 -175688 -73763 -85168 29084 -426689
17925 -189491 180950 -88209 -122360 -110528 90570 181204 -147638 -87995 46828 -47336 -53159
17914 -53159 287116 172346 183405 -389490 -210105 167282 -310830 221590 -9580 -51187
17904 -51187 204981 120846 -241272 -360656 -107300 161699 166653 -50298 -95059 73688 -226454
17892 357173 228662 484526 -132277 105449 -21102 4072 -7365 79122 -109714 -84690 141710
17880 218727 37635 -182877 -190879 -162817 42978 309997 382601 -77232 494962 -239780 98738
17868 -171398 -293512 -185252 52243 -220220 45782 100668 -43647 9721 -48548 354290 -3502
17856 252391 72827 -174572 -101979 -11974 -196990 -400 -361197 309801 161729 -18308 130440
17844 -144668 162446 -178215 85504 162551 40248 77687 -252278 59585 -154761 90986 -29920
17832 75217 -45907 67996 -135509 25176 -60865 216741 -289640 -108681 12963 367162 70267
17820 74881 -114070 -26843 126625 79193 -116045 110647 -432766 -130189 -273338 -318977
17810 -318977 484493 -120510 -5329 -212620 210077 -159960 170810 -277347 -261011 164290
17799 -278300 209149 112985 59097 -326058 75538 -55098 -45501 -425097 279876 3397 -259553
17787 54390 -292554 83061 110247 85675 -7952 -162187 47922 99042 -29570 -71148 -170776
17776 -170776 -144304 -157254 127067 -84532 -36510 254794 69560 118676 58314 52025 159776
17765 159776 -7381 -388330 -20236 7585 -366621 92489 202409 -229438 -93367 29491 130955
17754 130955 103258 -263290 -29002 8474 -319151 20648 62800 65773 185648 -331088 -638673
17743 -638673 -154200 139385 -9353 -41729 -62957 -232357 -121761 -167115 -187590 -90127 -521466
17732 -521466 113557 69924 -45416 35103 123205 -349022 -50547 92782 -67678 -141634 110647
17720 14299 -67827 -191025 86664 162860 185118 69435 152970 51928 159883 95542 25410
17708 187432 -217626 289599 91660 238493 103368 -213272 159394 229188 115320 -139204
17697 -19620 -118585 -56190 124570 -17898 123148 -73870 318868 181426 -2053 -311544 37780
17685 420945 95040 134087 341061 2336 -123145 192877 -159310 164188 -274482 99162
17674 35258 -196732 -26992 -85168 121130 -60330 -326341 -276369 107479 -97131 -152199 104703
17662 -64563 197218 118696 -101403 279668 -63222 81401 39558 259203 264205 -48911 68883
17650 292435 111768 33143 231524 245176 -251776 -103409 -32555 302343 14497 447141
17640 447141 -154101 237184 -74280 139394 -26409 13353 62156 295179 -90111 -114332 150690
17628 233666 37279 142856 -123189 -128338 -71066 187659 56533 -141421 66259 120417 150424
17617 150424 41045 130829 365443 119668 -404 -26323 -113613 -12313 -4839 164605 11911
17605 -104148 -67573 49973 50525 -116046 -87416 -4360 -79002 -364133 -34491 -190683 -337904
17594 -337904 226867 20224 -135626 112870 73325 -123741 -74668 374496 157589 -135822
17583 101868 -159894 -23439 -54801 -448556 -27698 124710 127186 -94027 468216 114406 185809
17572 185809 54606 227146 100388 193067 8332 -318857 1856 -325797 -70855 89323 147563
17561 147563 -281073 76612 120329 -185595 -192682 137039 -116227 60723 -194378 -12654 113547
17549 291416 16405 -77866 157294 226181 -398540 85406 -184214 118299 -110185 219361
17538 107755 362105 -199397 183706 -86038 157979 -153737 67797 182149 -15300 296448
17527 122922 36047 -6628 263444 456922 121505 205427 105399 188390 220929 167564 79669
17515 -306606 293700 59970 194856 -278875 -148143 134289 -202708 345023 196043 101368
17505 101368 -47013 154886 300420 20089 232567 281634 155880 -198597 13276 204823
17495 204823 281100 501533 140281 258722 232220 -86023 229015 -17346 149166 127497
17485 127497 283307 227957 -56824 -150300 212671 -86123 139553 125270 179571 366708 60518
17473 49048 47801 198367 -89429 26238 -4040 321528 255925 130451 -22682 278850 188545
17462 188545 97787 53280 30006 347881 43944 254761 254045 410830 375986 503800 221133
17450 297224 188498 -22886 207708 465149 123768 183127 441934 308567 134988 396878
17440 396878 169027 119911 192541 318162 366380 349326 -137447 281577 333855 51171 578835
17429 578835 162845 286265 386569 213355 395364 48024 294534 441824 -35115 444731
17418 311819 287150 408999 118 501266 456123 378300 80088 271968 -51307 251156 -169919
17406 471835 235764 236756 -9976 -122693 23990 106404 -83235 46679 150052 -135406 221417
17394 65003 148104 31097 110807 -1240 219476 -90984 13442 256656 81302 336710 87906
17382 364844 -183999 456788 307320 167327 -95715 221773 201210 -157686 353463 161195
17371 314700 108177 -76430 338285 130819 -186316 136706 186938 -3428 -212377 269172
17360 -65949 210949 -126885 125191 -36129 -68999 -239041 -94026 158838 195861 10123 182110
17349 182110 106708 332341 -93176 170536 124849 266923 -25582 394946 194029 -82200
17338 264357 147539 125670 428632 240853 377826 -32508 335626 146858 152714 68323
17327 281168 151582 -231604 149160 -134663 369407 210515 -148043 124988 -75006 377402
17316 516801 60149 166131 -90962 -3775 109820 160222 171797 -77207 165916 88211 -59115
17304 -327 217988 119972 135434 162312 -13626 221617 765 290441 -47529 -6403 179122 3719
17291 22358 121218 83237 -15574 -51384 176776 161996 -75082 421319 228144 347248 213033
17280 213033 354762 -22164 -60724 307199 33184 22178 214517 568500 549672 64887 6629
17268 399735 114746 194852 187848 114674 352352 357370 196526 279648 109223 173218 -181904
17256 362553 309756 311833 75834 144361 -69357 117595 298800 459805 235132 185538 316667
17245 316667 226258 202607 456945 -99569 -161843 -103189 14946 419524 398401 306383 209740
17234 209740 572182 191547 82072 365603 330935 36773 200037 355301 438649 -18905
17223 249725 186779 -3447 235640 692732 341026 290477 81556 147636 431924 139296 204251
17212 204251 126289 302699 617889 162614 259213 585409 265055 232955 194621 68451
17201 -16072 512357 77437 260490 201503 -17394 130030 336048 289713 136072 149848 -47934
17189 362934 330432 603390 356288 294215 79390 451745 396510 442249 -50388 352878 409065
17178 409065 205326 128241 -45661 230246 436898 436033 -33072 386249 68464 300866 51723
17166 560384 7447 200300 -94402 271804 358196 -47004 535725 134295 336309 479404
17156 479404 450998 -105340 193207 99862 78470 550087 120097 343875 524115 127637
17145 142318 283003 275007 241715 168415 480205 190986 300288 520966 190800 417979
17135 417979 472693 507699 303958 444786 187962 250081 570536 267389 346161 162426
17124 492759 435768 432345 416359 534186 410433 440229 170494 349706 663744 446974
17114 446974 420176 250910 -1814 692637 336151 439750 342350 533368 302517 296122 342945
17103 342945 357562 120269 271000 420965 446412 274873 504901 331686 223651 238399
17093 238399 187781 652833 557741 158315 360567 578883 323970 398637 489444 639451
17083 639451 443281 443112 585312 540256 453842 404669 595138 138204 359116 186970 385758
17072 385758 401121 475956 317915 407802 426383 468214 791517 325910 324791 408065 427513
17061 427513 394620 549786 359517 587971 532889 489406 566455 759910 499665 730272
17051 730272 418396 317416 323698 613070 803845 261840 559860 383500 256650 362311
17041 362311 400722 720921 777112 435766 407294 335569 333028 459565 705783 703189 359022
17030 359022 464618 687138 771489 858971 873142 447178 582047 634662 416281 578370
17020 578370 498964 672847 683119 813567 658879 729089 638154 759252 493430 632292
17010 632292 579843 631505 765359 799698 715585 647629 779633 573274 707334 721013 861284
16999 861284 925410 1084754 996960 860852 1154983 904420 1142145 685598 726579 553323
16989 553323 736656 736070 873741 833648 819087 668710 700435 1223344 599862 1038714 1181226
16978 1181226 428019 923870 1019615 921965 787016 882841 686810 878160 932824 956048
16968 956048 1233122 868966 782074 805526 684297 969875 973590 834825 846808 1074161
16958 1074161 834210 1078890 1118043 730658 1070287 642192 1207305 1026210 1037522 1085427
16948 1085427 1074639 1197075 894710 1263368 1219571 1076389 1223663 1125185 1207950 1505119
16938 1505119 1153929 1258234 1271229 1399930 1418111 1277344 1150823 1334572 1027700 1325312
16928 1325312 1447316 1123944 1295952 1579180 1427484 1211136 1136898 1316651 1123029 1838004
16918 1838004 1478464 1273358 1453043 1532825 1626259 1300066 1528688 1572187 1535815 1378512
16908 1378512 1837271 1808441 1774673 1657192 1881265 1851420 2124672 1558435 1523206 2060481
16898 2060481 1850376 1476123 2403180 1810941 1735220 1847187 1975927 1805021 1997901 2136527
16888 2136527 2033314 2129476 2058276 2363893 2257552 1852771 2547472 2000994 1930338 2689539
16878 2689539 2423843 2209866 2468132 2354383 2314228 2078599 2376829 2290726 2343004 2809463
16868 2809463 2637895 2624701 2814382 2837865 2737640 3127924 2747291 2786299 3128000 2991137
16858 2991137 3263090 2971319 3162494 3162091 2964957 3605077 3244121 3167253 3247346 3455569
16848 3455569 3315684 3443123 3873849 3626991 3555726 3613448 3797166 4030480 3777880 3813977
16838 3813977 4188159 3923761 4210723 4197281 4321489 4522966 4619366 4495815 4663089 4476250
16828 4476250 4909246 4630834 4817686 4920234 5206019 5589299 5003806 5693826 5338733
16819 5338733 5483176 5580426 5540201 5684804 5735403 6221059 6557128 6583512 6337691 6510429
16809 6510429 6881489 7108231 7424816 7146014 7304244 7739714 7887611 7955761 8028103 8435198
16799 8435198 8348352 8623187 9038615 9198119 9122301 9519150 9919368 10252312 10112191 10600451
16789 10600451 10618469 11053250 11642913 11506947 12090627 12033917 12695228 12792065 13808181 13735266
16779 13735266 14348365 14601346 15332188 15504137 16024468 16606451 17393580 17766128 18472771
16770 18472771 19084807 19470788 20381473 20775879 21440066 22570653 23246099 23784801 24897280
16761 24897280 26086745 27025443 27822247 29397008 30549562 31601853 32718158 34322523
16753 34322523 35849668 37526449 39078758 41134074 42953923 44894968 47121572 49646005
16745 49646005 51848928 54108484 57618934 60440513 63636348 66998128 70468019 74698351
16737 74698351 78934661 82975207 88107848 93407167 98333381 103695449 109906218 116157759
16729 116157759 122480597 129418577 136285451 143248645 150191044 157600019 164252588 170579834
16721 170579834 176229391 181769639 185466724 188639375 191068911 192201312 191697329 190564908
16713 190564908 187519233 183974702 178961465 173762597 167224725 160669674 153292756 146144895
16705 146144895 139010335 131824549 124539978 117461107 110853244 104366360 98515225 92703778
16697 92703778 87296157 82070248 77187978 73131161 68821653 64948117 61211238 57841859
16689 57841859 54846645 51876679 49254891 46922318 44099333 42015844 39865089 38241065
16681 38241065 36500317 34657233 33104097 31516915 30369762 28716189 27859418 26434287
16673 26434287 25615320 24362951 23606124 22170722 21888538 20523219 20186016 19291801 18636232
16664 18636232 17659554 17190355 16841678 16100056 15364560 14935675 14473380 13981855 13580894
16655 13580894 13336013 12896205 12236782 11625467 11316526 11265368 10883036 10487792 10251846
16646 10251846 10265425 9742147 9616443 9296645 8861589 8390230 8652478 8555534 8129774 7789164
16636 7789164 8023568 7467215 7264866 7185949 7207575 6516907 6843305 6517273 6503475 6373428
16626 6373428 6091456 5756675 5997855 5585463 5364420 5326321 5122936 5262457 5152878 4888157
16616 4888157 4827331 4872637 4534515 4536134 4600607 4370450 4366520 4339754 4124284 4164933 4020074
16605 4020074 3971960 3952735 3830903 3614911 3477753 3446925 3468490 3418138 3336209 3367479 3517164
16594 3517164 3468370 2981630 3277101 2832188 3207058 3223280 2677346 2955215 3175142 2935937
16584 2935937 2512845 2742524 2620549 2705443 2482220 2499001 2641207 2373195 2175231 2609073
16574 2609073 2520577 2164780 1869188 2414584 2086586 2205856 2093728 1960930 2014315 1930758
16564 1930758 1688392 1865322 2179041 1830319 2043259 2258965 1594046 1837067 1979100
16555 1979100 1536935 1738360 1965091 1599649 1477589 1645236 1505754 1891411 1442902
16546 1442902 1494167 1556445 1673982 1613868 1367780 1527873 1337909 1236608 1542588 1767623
16536 1767623 1784400 1435423 1377702 1344350 1568237 1386809 1260584 1188756 1216915 1483712
16526 1483712 1314402 1168376 1171239 1501806 846505 1098056 1270735 1145476 983660 1426387
16516 1426387 777173 944701 1090617 1353519 1244534 1231249 1110168 1074936 1003775 1032937
16506 1032937 1090883 1254783 581683 1028649 744050 1159723 830014 1027856 943950 933816
16496 933816 770033 855210 1107993 650007 942321 546336 764801 993209 641202 946465
16486 946465 800262 794297 914152 584610 845390 575856 906764 802669 698556 897812
16476 897812 870233 785079 619139 605597 478059 607262 562393 671468 658536 589394 942562
16465 942562 494269 711730 724694 579618 636236 329282 776952 523690 459194 830732
16455 830732 641833 390814 413262 583071 520897 799139 574993 339737 601222 502058
16445 502058 343271 349268 523894 746702 694091 339758 746283 569423 858328 619783
16435 619783 318391 524808 699384 485209 575887 521155 581916 475734 530532 393373
16425 393373 518711 421579 542048 561789 636184 23499 502631 297764 636710 237745
16414 402143 402295 345379 407518 170760 221883 508938 319301 5657 144993 299649 293307
16403 293307 599660 561393 226705 366451 130058 161157 528822 506118 317215 20534
16392 374509 298405 335784 163731 337931 144474 113038 223941 159952 -12743 78614 202742
16381 202742 678786 270686 182653 146680 -62624 133114 420294 237429 75756 167452
16371 167452 -3544 308098 485829 284035 330724 296627 388034 293379 136275 540944 -14614
16359 422531 353268 397725 282240 -60230 315891 88302 176863 361255 349950 388143 43324
16347 568916 -171518 103026 -121855 130457 98257 211898 22976 -8571 -208460 260592
16336 200008 147960 111703 245147 -204516 -16290 125818 22658 223055 260968 309191 -154483
16324 284472 107331 317169 -273275 390265 -13606 372743 28116 150786 116862 -7027
16313 253371 91847 272999 48496 -120830 200309 157666 92198 -257811 14853 319874
16303 319874 157977 -100369 37517 452504 124244 -110561 137560 149923 -19529 118198
16292 203432 -24536 129471 -38366 145161 244251 215709 109547 -136202 360142 248324
16282 248324 186876 448847 -53337 247416 291273 208513 316625 197624 -111173 135622
16271 -16694 133829 99193 113570 159263 213402 -248035 116259 -44401 -191175 331894 -17963
16259 126639 -108649 -118416 18472 -13763 57690 -55892 164784 -38968 88808 98279 -8093 283841
16246 -48289 366898 124819 133358 65610 383228 156193 135630 60403 -256397 195879 -2302
16234 -41413 204044 291293 48432 -154112 51772 -103604 42328 380378 150387 20267 91115
16223 91115 -127466 131660 -128342 -75201 -209017 278317 81527 173322 114900 400558
16213 400558 216642 78331 -93209 99095 37372 -115504 490346 -25717 211047 176146 173101
16202 173101 7046 198608 -57894 167383 -113461 283003 170634 -5564 106325 273446
16192 273446 -103621 62834 180638 -140066 330946 32842 121495 197100 -2832 -469 184871
16180 -426836 -13383 -148549 -19726 -150602 -1513 72832 97354 -155978 296148 185121 162210
16169 162210 186249 76496 -114631 -306208 30764 -218754 18262 199396 217019 47533 -108102
16157 122537 -67684 -57328 -35873 -317593 228001 -58291 -268244 832 424802 241305 -38807
16145 -9355 141261 54456 385528 57292 -69202 133738 -161400 41469 367988 -81112 -151920
16134 -151920 -29501 59683 -39550 -204249 -51915 -5937 148696 -2542 478046 -305455 306857
16122 65395 33870 -331057 -237261 294275 -213962 25869 -50376 -73571 34812 -52016 37827
16110 242533 225494 -176135 -27026 144106 117417 -285695 13732 -162918 -221280 80012 -10619
16098 324404 22639 10721 -5132 -54770 104777 201696 83268 -123357 152733 -73360 59884
16086 -60250 -80266 46709 -88244 177244 -229687 304926 -399173 -243100 -205618 -204287 -144898
16075 -144898 -129492 32590 -12345 -266681 -303721 18086 -84295 1005 89664 -31203 131016
16063 -280878 233725 -70689 96556 -151792 102092 -159911 -77811 191621 -231710 119928
16052 102627 -171223 -215477 47006 182078 -239231 -235270 126753 45621 40669 -245467 69995
16040 -173453 -172255 16648 -9411 -119142 344284 239269 -220911 326715 -152925 11754 -60717
16028 -169305 -5924 -167965 -17116 -97353 -325485 185577 225836 -118124 214777 -217787
16017 -10933 -181311 -315378 -214447 53641 -205215 -144955 -213810 -137000 -184579 -47194 133656
16005 -170702 119 147716 -205436 -335543 258056 -110312 -287364 -45896 8704 -36817 -165272
15994 -165272 23923 -274698 -119386 -69593 -175712 -54961 263312 76784 46049 325458
15984 325458 64318 338314 578159 224632 298775 461012 168217 84724 -25396 86581
15973 -237117 59126 -102796 -61352 -59530 -302623 -110258 172614 -156925 135184 -237321
15962 294660 -92769 106531 82348 -236397 38709 -164054 179904 108945 178942 164927 107026
15951 107026 -95571 3900 -202430 8336 153121 84237 -36716 15320 -64553 -40436 -176933
15940 -176933 -259073 -208589 -50658 29017 -250160 128673 21548 -65262 -290068 308359 268855
15929 268855 -27093 -247557 34024 32645 -42332 54377 53725 275972 306160 -115031 -175914
15918 -175914 14169 11464 237633 -122934 -55387 -342441 134364 -42406 -177740 -375304
15908 -375304 -470069 61673 261561 9493 18214 9519 156707 -175501 354995 65789 144998
15897 144998 196150 -143139 152840 -30693 -86828 -331556 -22571 -82670 147246 -25258 26448
15885 -25003 17991 201007 -2701 120030 243381 -130270 -63810 -183999 199008 146933 -143166
15873 168779 176376 -137787 -119297 173767 -82794 -112670 -93921 171837 80704 -32424 -182322
15862 -182322 35590 -62981 -266054 -113006 -33800 86881 -352301 -32986 88490 158935 -232320
15850 243988 -107728 -66208 -230794 81897 306712 49530 -102363 158374 102371 10544
15839 -386502 190574 11317 -40064 -195042 -303166 4574 112804 -95949 175120 -283631
15828 67710 -518146 -86510 94313 43503 -37677 155534 8455 -148704 -145243 -47870 292115
15816 -48324 -35680 -231696 135209 181057 -384347 -261613 129561 -16435 37100 7455 -86005
15804 38386 78980 -102693 -217169 276205 4989 -19491 17399 158619 122129 81443 -111935
15792 -193733 -106323 31526 -138423 -205352 280794 57362 9372 41779 -255271 -7491 -4214
15781 -4214 -319295 -4731 234314 -314643 -154780 -111585 -93030 -143510 87837 244603 42888
15769 255242 -55742 -301627 2656 -135607 -79259 -173118 69617 270205 212373 -280218 73726
15757 37374 119942 -225444 130768 -61857 -69204 -139547 203498 -261805 -63665 -164266 38885
15745 65829 12623 -290232 61753 -136032 35730 -96416 88023 -73874 -2989 211047 216338
15734 216338 -500949 306574 11287 38546 -132560 188058 99608 -159957 66734 -135429
15723 -245887 1397 186452 103127 -96963 63631 -29543 448733 -103959 147797 -456996 3214
15711 -114704 -87846 -37076 -90147 -82315 -137712 180955 -212706 -53921 16694 -42829 42341
15699 104791 56113 -109604 -265250 9647 -108358 -266127 248135 34600 -277367 -312930
15689 -312930 -135133 -34679 -110495 -118358 -258253 39835 -182213 -144537 -105836 -46159 -282349
15678 -282349 -170635 -145346 247436 22843 -153710 -216712 125759 86950 122617 -90052 94157
15666 -37524 167952 -106781 -103945 -41907 36567 -96689 21487 109712 260427 174631 -239339
15654 -12384 -91838 179163 -107545 29676 497985 307893 78069 364624 -303813 -234786
15644 -234786 120495 -112718 -72891 174407 -226517 306574 -237179 -307996 -160071 -19418
15633 -410830 -91673 95619 160713 65422 -129083 -112827 149760 113605 -338978 -67030 -58745
15622 -58745 -70652 77504 161310 349888 279151 149441 67054 -216546 -235012 -308469 115443
15610 -28525 -149909 -34108 -187299 -21686 -22771 -118412 122352 119410 -146369 -17562 132831
15598 112242 50928 -18115 -90483 -280227 -126070 -103639 -269798 -96056 -240537 -271524 86665
15586 83605 292360 209915 67524 -143720 -50931 -130994 -39226 -177075 -73044 -306529 -118282
15574 -109588 -1798 -111745 -51211 220253 259512 -244861 -438090 -141798 -153033 184930
15563 -128700 210630 33451 -133616 -232608 -37239 -67691 -183357 -21457 -152615 149974
15552 -72741 -393225 -59042 82156 -142236 -21770 44307 4300 -81223 173668 -54855 -158224
15541 -158224 111898 -117286 52527 243065 -72259 297253 26644 -109310 -41678 -92465
15531 -92465 -62355 -180598 -84775 247129 -349946 -140551 -57725 16291 298094 123126
15520 -104417 -48838 274679 80210 -94185 -128523 -217223 120559 127604 46090 -10636 39781
15508 177278 3500 -126457 -262127 -159236 -33749 -245127 -147242 -86554 153891 131563 106718
15497 106718 257067 -170345 175200 -9831 -286580 -394282 20688 188846 -168184 -356281
15487 -356281 -52293 -66748 232885 22663 53671 -188479 159772 -98982 135790 102865 -18787
15475 376049 176160 -82845 71982 50404 59064 -179121 28708 -194648 -35164 124912 11988
15463 -5084 -110510 15324 242156 289076 54658 -177408 -13387 538282 91138 664620 -21707
15451 449532 98419 -302766 125771 44464 -277590 -286085 226492 -35840 130287 124654 18180
15439 -295674 -152945 247507 -59082 -53377 -21099 -152710 -97356 148708 161393 -193911 91941
15427 -54802 -181183 58621 130946 -217537 -90102 40489 -462461 241524 210559 -95153 -381912
15416 -381912 -136171 -5697 226007 -50527 59039 -36530 -227159 -63267 -189161 52671 17951
15404 9797 -255312 -4603 -15507 -50469 -56309 56643 47699 88628 153447 26773 -238968 -238462
15392 -238462 33665 82578 4386 -20597 -50315 -323963 64551 229669 -125871 -267445 171251
15380 493924 -79331 -7189 216652 -386803 296894 -167316 69329 -479489 -115072 25358
15369 -67804 -14055 153048 -18189 81657 310645 87615 216810 192189 59788 -12719 142443
15357 10631 -167900 -167891 84908 -145947 118406 -313592 -60683 106455 139665 180774 211794
15346 211794 131247 -372768 -384096 -54077 96999 -23207 121331 350805 74650 -207187 229726
15334 85187 280044 230433 116468 -118873 -125130 -204783 407605 -83848 280883 -79284 -218157
15323 -218157 157378 421270 -44629 -23857 -83815 213219 -154920 -298721 -45163 169585
15312 46558 -131197 359303 163338 -261930 99429 -245282 -290429 360321 90112 99816 48426
15300 662342 41993 141805 385865 54438 158837 23355 -57266 -168757 -35535 -75282 -97790
15289 -97790 488176 -184659 -174771 58995 -237286 58390 -18433 -35855 93462 399553 151825
15277 -292937 342901 -237977 101434 296998 -242564 -39119 -403454 316140 25531 17638
15267 17638 -229500 -141346 34660 -104586 -327917 296255 70586 27123 -219250 45725 231283
15256 231283 52242 303736 278447 412211 -190241 441492 430091 135202 458532 1166083
15246 1166083 1420155 1469513 1406978 1527401 817327 402324 173700 87355 13058 -165529
15235 181300 118187 -117680 74862 -284474 55841 260347 -66432 131273 157761 27895 199684
15224 199684 106043 140093 411091 141511 -177389 69800 168571 75325 -20769 91872 109029
15213 109029 109106 -46198 -124084 372 157124 215672 95716 -45835 37118 -158681 133688 100302
15201 100302 -76578 138089 35900 8385 97234 395932 262207 -27835 -80126 -394800 204176
15189 165440 -307989 197563 82468 233 142813 -15086 9050 67996 -164043 31787 -378998
15177 -119747 255635 30212 426403 59860 -42707 91890 231233 -334022 -9998 -124108 305716
15165 -40702 97073 60407 -103608 161211 -152162 324777 135263 97602 6229 157595 116710
15154 116710 368242 41436 61530 146309 42400 153283 -75403 133785 -65599 138742 127403
15143 127403 101568 -9697 110285 233441 152653 245264 505148 186505 313810 -2317 374690
15131 -54045 35599 -325643 450845 350172 -3925 91520 -198762 80255 -86636 82486 -25632
15119 -92589 245871 216510 -11534 445176 203500 33254 331156 183770 346744 41819
15108 154856 -27707 -313693 -83505 214939 359656 -170658 -227721 271718 -204733 -57884
15097 217326 29608 -25480 259766 -11150 -21593 -34881 317511 176057 1231 175565 -40033
15085 -105331 46215 116634 339635 356334 93464 164983 69584 -344589 -55496 54420 191695
15074 191695 521185 80718 163571 193628 -14223 523350 98296 299 445602 -28056 252779
15062 160984 183851 279956 89489 243730 71400 141406 31543 68746 324956 230588 -15177
15050 134446 74685 155049 64363 223043 467060 177442 61356 -88558 -140388 360456 361751
15039 361751 250636 -107736 -246826 213151 13022 -18519 148525 224265 222449 341688
15029 341688 375960 -331652 292318 126758 288284 37744 189226 175595 -80510 212550
15018 448569 371730 76287 387246 -256612 -72917 232754 161720 -59379 321064 298898 143195
15006 -31033 364983 71586 333327 260552 -55815 205531 139638 80605 334592 429732 -2014
14994 226643 252332 42373 179866 163826 170782 291510 680329 86263 154862 133483 401027
14983 401027 307895 46676 56200 353910 234356 10413 356447 151400 59642 77489 105405
14972 105405 87410 545113 481292 -23965 -17581 45097 496201 162012 257903 220299 293103
14961 293103 256159 430992 279112 432266 476968 192178 281524 196207 416083 431769
14951 431769 -112210 7094 181695 177588 680004 212482 525673 -39895 125252 -124773
14940 266710 476534 289151 361809 244321 718194 490551 481362 166098 -78807 30640
14929 305177 196002 87387 -79770 171382 282999 152802 34799 133233 335158 280193
14919 280193 610763 74081 74819 145739 216031 203949 292566 313950 -274723 -157170 156270
14907 206440 400851 344707 217532 -60452 489508 290840 34368 169229 34437 458228
14897 458228 458828 340719 355006 304251 259743 251769 612116 419900 442664 469917 280721
14886 280721 253162 215117 585615 464602 258525 121879 259060 343300 138820 360415
14876 360415 421749 350441 502389 374309 702788 -51179 575201 76789 -41105 162807
14865 380825 148093 81709 413339 444214 550804 296681 505974 763127 27475 241302
14855 241302 111578 609582 187510 558024 633733 28535 413258 349620 354374 448845 771834
14844 771834 395744 503846 657216 361010 502837 35216 293120 315348 99229 685822
14834 685822 534951 309911 609984 533342 211858 390876 520448 424082 439590 406911
14824 406911 196524 179052 418311 345798 343141 738284 302839 240494 794430 496885
14814 496885 414093 14077 315150 619498 265010 478994 331547 330516 571265 362529
14804 362529 631440 830051 878830 554481 409013 336383 460146 437660 756458 481006
14794 481006 543972 420440 555258 688194 341954 471722 464534 788455 517734 379653
14784 379653 527331 649959 746624 643960 551283 483462 162107 633160 572919 485747
14774 485747 510182 561979 557687 355152 402848 528651 763317 485617 419115 409734 445290
14763 445290 344347 417380 740073 199941 843320 811106 519028 721967 590313 724976
14753 724976 733262 697097 400330 416363 611260 706739 713819 392310 556688 780928 419504
14742 419504 751563 620719 307631 826832 675757 860686 664876 827210 357528 731958
14732 731958 692261 890679 773195 1055509 826621 527725 688266 852104 720355 1017421
14722 1017421 954141 549271 1044970 1050685 892231 1090287 636149 710073 1017085 1236334
14712 1236334 752522 988995 845246 802084 636537 755003 832997 1078874 705442 655448
14702 655448 920681 810305 540184 946670 774590 687102 841045 929708 609165 868949
14692 868949 779302 1138492 894164 960091 663316 748761 956251 1067628 1127859 1017001
14682 1017001 612317 1021781 958301 862859 820075 1057442 983567 1073382 956831 955227 834055
14671 834055 831187 698909 713223 738126 891478 1080613 1086873 916767 1256523 1206558 1122950
14660 1122950 1182959 1184033 1402018 1289678 1626410 1021148 905789 1037859 1081342 1018958
14650 1018958 992641 1057486 1325092 985250 1234024 1475604 1430672 1260858 1361954 1395242
14640 1395242 1247173 1302846 1346308 1192123 1710420 1349596 1396639 1279978 1430970 1384707
14630 1384707 1477380 1436285 1543801 1371971 1175550 1437948 1163738 1369992 1254663 1554614
14620 1554614 1130104 1464341 1179974 1704618 1456744 1798494 1591049 1603350 1563801 1696076
14610 1696076 1772477 1525345 1497213 1526765 1582647 1736717 1668617 2016714 1814573 1660086
14600 1660086 1539358 1343874 1741443 1902841 1615717 1800161 1573713 1992232 1556529
14591 1556529 1702162 1757693 2120786 1564937 1761320 1815191 1956170 1937477 2256372 1901289
14581 1901289 2135077 2276713 2163777 2376660 2102985 2176063 1993538 2138918 1970415 2064009
14571 2064009 2236011 2192627 2246455 2577645 2325983 2588475 2447136 2693302 2485511 2813291
14561 2813291 2659907 2774484 3043173 2825141 2973719 3138439 3327282 3385119 3943462 4212255
14551 4212255 4921447 6030940 6904305 11653402 21134972 34662680 39203683 27839358
14543 27839358 12774080 7609915 4829785 2911746 2019229 2432169 1855726 1961362
14535 1961362 1881026 2002247 1970624 2071650 2271415 1990890 2048169 2364529 2378759 2361156
14525 2361156 2358011 2212298 2386992 2727776 2361711 2422651 2379225 2711839 2482336 2500124
14515 2500124 2616627 2586791 2766664 2385491 2618443 2226693 2754176 2948289 2926095 2859844
14505 2859844 2800615 2748369 3055674 3147703 3072819 3161805 2994812 3159959 3138888 3044044 3452442
14494 3452442 3096992 3137953 3397970 2879329 3796244 3420442 3317969 3735916 3593499 3935917
14484 3935917 3755228 3995441 3573958 3719140 3987176 3971967 3830154 4088810 4109913 4184908
14474 4184908 3849127 4167123 4405098 4394391 4261594 4030038 4213916 4145353 4447017 4691292
14464 4691292 4717085 4711297 4931833 4820463 4916195 4808111 4981828 5194503 5456636 5219643
14454 5219643 5714531 5479726 5440031 5657099 5718745 5382048 5620162 6026249 6045714 5688147
14444 5688147 5920705 5891856 6391283 6084729 6488040 6306893 6522562 6758253 6698874 6756663
14434 6756663 6463346 6982137 6900652 7158405 7103767 6971072 7511521 7173368 7394872 7485426
14424 7485426 7441861 8283050 7865531 7846698 8319375 8076223 8379914 8536160 8545982 8707398
14414 8707398 8734325 8731622 9130683 9396616 9325588 9065748 9927746 9699559 10028030 10074244
14404 10074244 10307338 10433501 10481457 10528365 10632816 11091585 11020470 11580609 11325672 11760417
14394 11760417 11964315 12060799 12639330 13005868 12773880 13083670 13298911 13823009 13735171 13686725
14384 13686725 14139570 14227727 15172573 14882264 15167508 15609901 15859264 16096748 16682848
14375 16682848 16859966 16949613 17523258 17890654 18224885 18088509 18877565 19128990 19901076
14366 19901076 20100507 20714845 20689255 21203417 21804703 22067739 22977099 23175656 23715133
14357 23715133 24301826 25118053 25498702 26156057 26579604 27341878 27912151 28985437 29585206
14348 29585206 29957363 30755233 31702213 32271815 33500980 34201639 35145994 36328502 37221567
14339 37221567 38242852 39232606 40476396 41878650 42709078 44039458 45605906 46669352
14331 46669352 48179616 49612325 51026167 52852233 54644694 56212960 58526689 60172539
14323 60172539 62067719 64341572 66313500 69026594 71635429 74211369 76833725 79981364
14315 79981364 82935776 86276531 89530003 92985154 96887126 100377378 104632897 108727492
14307 108727492 112934898 118016642 122877419 128593649 134345159 140249710 146644381 153395945
14299 153395945 160485976 167618213 175934461 184435647 193335611 202502267 212388798 222453163
14291 222453163 233572289 244810384 256513454 268649492 281710935 294887956 308756515
14284 308756515 323142106 337390455 352047435 366821404 381526382 395821624 409711527
14277 409711527 423042535 435492922 446482471 455916617 462769950 464979933 462377107
14270 462377107 459702006 458547102 459225661 455479436 452070233 443708907 432874917 420049037
14262 420049037 406116001 391145292 375590631 359636527 343741748 327615449 312150544
14255 312150544 297229710 282412197 268728396 256163302 243428199 231179049 219794873
14248 219794873 208672912 198244978 188491493 179585299 171244390 163050198 155297023 147917348
14240 147917348 141248287 134947438 129108672 123710569 118399766 113060602 108179006 103682793
14232 103682793 99567279 95723315 92092327 88326668 84873635 81658293 78643690 75661165
14224 75661165 72440574 70126446 67509014 65499583 63362551 61116797 58654384 56680979
14216 56680979 55046961 52839044 51809022 50269442 48786370 47197444 45492964 44048280
14208 44048280 43218273 42420574 41375265 39975271 38666383 37412310 36355836 35549647
14200 35549647 34761185 33694269 32689153 32096938 31225814 30643206 29723990 29184230 28264663
14191 28264663 27749912 27030756 26158744 26056695 24922941 24753402 24022759 23816170 23205675
14182 23205675 22564123 22079426 21625762 21393850 20942915 20309035 19915443 19479322 19261521
14173 19261521 18604933 18310913 17801963 17575216 17540993 17009908 16594314 16513080 16276702 15982621
14163 15982621 15415635 15137157 15295838 14944227 14275372 14351553 13607581 13878589 13762200
14154 13762200 13448482 13041097 12977049 12667664 12521112 12367165 12138529 11719814 11906751
14145 11906751 11349251 11298779 10992830 10551578 10505529 10461707 10239662 10144028 10324403 9772296
14135 9772296 9934676 9799790 9649899 9353789 9439196 8929179 9230811 8680377 8606293 8901329
14125 8901329 8600855 8534186 8371467 7965535 8145440 7949482 7978974 7712386 7554715 7797841
14115 7797841 7781119 7298327 7019582 7053360 7035005 7289823 6713212 7024959 6914875 6596731
14105 6596731 6531650 6542827 6334510 6419896 6175024 6310756 6150437 6382596 5682167 5783494
14095 5783494 5874377 5584184 5435036 5869133 5569762 5359962 5563545 5530124 5459891 5383758
14085 5383758 5492614 5155962 5089387 5083127 5094361 5084060 4947028 4810542 4734598 5154065
14075 5154065 4726955 5063166 4716515 4674810 4310261 4326883 4584119 4578541 4188955 4070897
14065 4070897 4398409 4527809 4133174 3847243 4393032 4471187 4317338 4509781 4410733 4611013
14055 4611013 4057571 4341795 3821089 3467958 3744437 3986541 3596201 3462256 3290355
14046 3290355 3602173 3376828 3503206 3471112 3240499 3324558 3330130 3246134 3134801 3471884
14036 3471884 3337359 3216899 3228073 3089896 3256110 3407009 3343226 3404697 3243960 2952375
14026 2952375 2973717 3380633 2929550 2829849 3123036 3165845 3052764 2708331 2679662 2950710
14016 2950710 2815501 2856163 2712818 2628332 2690168 2674092 2432380 2339929 2102258 2533953
14006 2533953 2327837 2423179 2508924 2236657 2455709 2459172 2297654 2261198 2483405 2030112
13996 2030112 2410828 2152110 2035138 2631833 2372415 2939198 2723797 3860185 6336083
13987 6336083 14262496 28967235 39267467 32593335 16920505 9625434 6333367 5196267
13979 5196267 3989614 3481355 3565023 3418206 3089182 3152681 2918545 2643610 2690715 2818518
13969 2818518 2473851 2475618 2570391 2319902 2178993 2216677 2399631 2220576 2235045 2115099
13959 2115099 1983648 1862107 1920594 2062899 1933912 1932115 2098018 2092382 2180887 1585892
13949 1585892 1623569 1690963 1674258 2208431 2032295 1930343 1715954 1715880 1961925 1811293 1830209
13938 1830209 1643787 1750263 1782323 1440185 1560936 1911772 1938466 1609766 1608348 2006234
13928 2006234 1490298 1548233 1636117 1496455 1464142 1998338 1428812 1297247 1621533 1499140
13918 1499140 1482110 1529159 1360992 1612895 1296444 1567975 1593638 1390256 1675895 1412011
13908 1412011 1390632 1257921 1454894 1678266 1316867 1243944 1741881 1165278 1234584 1597580
13898 1597580 1253301 1323374 1781888 1322717 1417418 1155830 1311332 1252548 1124760 1397240
13888 1397240 1097910 1186851 1053918 1464821 780788 1359652 981787 1260842 1204799 1264149
13878 1264149 1135521 1100342 1485260 1215692 1104390 1099839 1150250 837811 1064913 1056527
13868 1056527 1029822 1022283 739684 1295173 1255856 1052765 1043375 1093240 1047168 1227927 974542
13857 974542 1132137 1040064 1223378 1193822 976478 1331965 1015364 1348189 1025841 855995
13847 855995 982906 974276 1472696 800568 1168682 1034134 892865 1149622 972374 963783
13837 963783 992074 1340156 1157724 1003536 1058587 933511 1159166 1085943 1098426 963331
13827 963331 811258 907963 1076011 1007860 799744 1041247 771775 873144 1105909 637715
13817 637715 1068031 1113558 885479 636185 772620 1175937 1022522 730102 1067117 843055
13807 843055 1011748 747685 729533 768794 1015680 857656 892433 949185 820467 767712
13797 767712 853601 851956 694843 604728 733832 860536 271915 770458 771314 643580 936726
13786 936726 907013 641678 860078 755718 565927 855940 986369 798223 739461 892137
13776 892137 772227 694002 594832 618724 794866 986451 780584 714262 733702 808137 912587
13765 912587 823965 716689 964513 715914 769673 844493 692636 886850 968523 818699
13755 818699 633779 811280 951138 592312 460832 1008219 606702 838961 716096 699862
13745 699862 940907 781447 636616 519260 536323 700863 673548 482695 1107657 749966
13735 749966 988240 802227 898057 733502 601756 720536 954696 696369 340469 266348
13725 266348 829262 545440 718895 632920 607579 437071 763215 501317 650865 607408
13715 607408 472690 999397 310138 673247 306668 642273 550763 390117 626494 372962
13705 372962 701070 752947 209751 546666 762459 471434 262718 452806 834260 498357
13695 498357 508288 512882 512019 152185 518563 1012067 480234 127881 332516 379448 499609
13684 499609 231239 68582 594345 727480 527357 730973 395195 282437 338669 470282
13674 470282 427025 460670 713447 422012 198567 460050 353515 336604 325817 436548
13664 436548 541957 465044 569669 411200 368858 334090 759418 309560 672475 597490
13654 597490 277123 417420 203757 516041 455637 542655 558019 440620 775168 449913
13644 449913 403230 364756 393807 681325 267333 335329 244828 622684 761215 551643
13634 551643 517107 379923 559602 701156 333967 391691 542596 537032 390268 658097
13624 658097 381999 53700 352355 543479 530146 469375 452213 309549 464241 36255
13613 378105 478157 461837 294809 274099 412943 370383 378716 335726 482253 170003 661032
13602 661032 379380 308583 465495 363650 487458 356860 505257 355451 328212 260927
13592 260927 465243 207339 327331 577640 493177 215335 364058 658106 357506 186511
13582 186511 601641 380176 510206 382454 302537 577483 272075 44439 352453 563965
13572 563965 177921 628607 -71830 86627 362627 191055 -122608 416745 589310 272022
13561 564649 135314 321244 335302 615952 17814 498641 107832 456772 354638 460140
13551 460140 438973 275701 128002 287193 278402 167573 312957 263168 328541 479106
13541 479106 82891 -128702 -142162 328225 202172 573853 299069 383865 -113321 -55932
13530 342706 69247 390149 273059 380554 94172 166163 333644 365724 271646 270289 310818
13519 310818 217611 289959 326472 370024 366616 472877 46094 349310 233567 265993 343934
13508 343934 280044 253309 307549 636607 254935 48329 199341 317130 579707 279097
13497 100156 308475 267766 59968 345850 165033 161316 545382 531236 79588 585344 130637
13485 126514 101228 101319 143261 138003 115240 335975 250657 132747 181051 283875 158697
13474 158697 390469 151645 183027 246668 309541 402059 571232 6195 421957 243402 359183
13463 359183 118218 -299860 87336 267522 232189 67452 236876 241036 401439 155487
13452 165423 235468 389537 198718 96211 88736 273091 536043 -17980 55129 197559 24645
13440 263751 307872 266743 -139350 41888 375401 53355 334263 197158 65521 309016
13430 309016 164388 293109 297279 40204 291542 287060 168840 102727 131844 150773 235709
13419 235709 72735 221996 97704 258657 24988 332238 296312 329463 259675 107538 217818
13408 217818 -51385 -121625 374567 186381 220942 127047 285407 347287 22522 -89445 165124
13396 333155 313879 290442 286378 -17588 120996 204253 19145 108664 82345 247744 370159
13385 370159 473669 424065 517468 59838 320990 54554 268926 544527 200432 295713
13375 295713 375770 481367 86466 149233 358252 116372 298373 186721 328630 246321
13365 246321 330954 218146 113614 3818 298081 92119 371214 134347 -13910 316017
13354 318707 171661 323307 321542 -72783 235139 312838 26040 328113 350123 394086 90696
13342 769195 250698 271099 342748 269252 -85652 118257 558723 -44091 94453 435007 33811
13330 164229 539703 220628 79968 282059 326741 360899 212470 -41448 333946 54457
13319 466838 319081 231256 344408 355033 309129 270107 210496 108823 265718 -30795 446975
13307 -132907 374567 228093 290677 102865 509938 219636 261977 186424 51616 26545
13297 26545 77070 215231 -91388 326505 -174885 144132 142250 267423 371701 58706 155882
13286 155882 -80754 135493 148298 -2454 259125 135582 -102393 50923 144044 -5342 103217
13274 168344 107061 239809 70388 264391 219929 139058 -16715 120790 510265 183457
13263 55017 -50111 151456 212458 68907 342393 336599 196554 -242817 -6234 405390 -151407
13251 208928 -45476 288995 -42445 239689 460369 -130401 81099 -24794 270887 434962
13241 434962 -57501 132805 -98532 115801 82257 349070 169948 -28780 194523 62294
13230 429354 139385 183613 88626 66992 249320 117907 246186 -98965 297022 -4241 200452
13218 -19878 -54307 -115045 146446 202596 -34779 115495 -226673 5894 123173 237288 12531
13206 -172929 -21694 -74840 325600 128994 -143330 123190 -8680 74605 -312 96124 231660
13195 231660 149657 137940 -199857 127373 175688 -26571 253581 255918 -19547 17811 -138281
13183 8772 -93588 -15651 476738 118519 -55175 -107006 96183 30172 281 125841 107087 4344
13170 33111 196252 213659 64577 73285 75980 192661 11535 177571 2115 -156709 153243
13158 98235 -15782 -21802 217536 237004 30285 59566 170983 216140 69318 269197 229793
13147 229793 -238896 268970 192888 351597 399035 117516 115527 190727 -630 41299 359871
13136 359871 254051 254069 342192 -59063 237451 17250 -374328 317678 96583 84612 -56100
13124 -30158 166936 -218750 -22335 176125 186776 70082 140856 -8781 63976 130792 -149887
13112 194356 -307701 236265 169598 63230 -15485 -188392 70225 151263 -16942 240865 -17064
13100 71478 643397 18043 115889 263707 -167037 229398 119939 -241991 176578 209872
13090 209872 312867 189588 -329883 270838 -63298 109212 60189 -157256 90779 142982
13080 142982 436105 568399 259774 100519 145534 151525 -261944 178276 91864 165843
13070 165843 177769 12028 -165319 636749 328088 109975 173360 78479 123144 88826 -60342
13058 258603 -75231 224331 181821 310640 -160035 121973 -20120 -29783 20449 27017 57216
13047 57216 279799 41624 90357 212768 -145288 14235 84603 7967 -5992 -17622 307791
13035 -159330 -13655 243683 72775 146067 196601 439779 -104626 441933 77348 124491 185398
13024 185398 338258 549527 113267 139509 248864 192741 282263 206410 299303 -217668
13013 42099 136348 228721 -11427 -89390 417000 23891 19825 169844 68534 228875 -187926
13001 263348 255731 96437 -109763 57948 -19322 109701 -26529 22704 73194 80997 92138
12990 92138 303308 154351 63603 230518 -153183 31937 -144400 273913 104346 72105
12980 72105 189144 223421 -358302 -164681 310523 244768 52277 -282589 336768 294714
12970 294714 137387 -63942 68317 113760 -96328 55790 -107551 355004 170308 79085 -5746
12958 153363 -242593 -183519 -91926 210777 30913 45529 223483 168056 -178983 168001
12947 -347513 -217148 129183 180227 123 -192579 107500 203528 -55455 202520 91673 186588
12936 186588 32797 247546 -130078 95968 73255 -7532 112709 -258131 219297 177474 12133
12924 21683 79883 280504 -15446 -48072 -191648 -137589 -374133 72574 89127 281532 417905
12913 417905 145190 -33196 -91466 262752 -39117 -146448 192710 -208560 270246 -64254
12902 92900 -40881 -44128 -208216 144869 -4214 276724 -70633 156850 -204831 -45741 -31690
12891 -31690 72530 126590 162368 372580 94552 -454656 -162596 107834 200866 66880 -38009
12879 240392 228454 174661 377075 84257 133395 386871 -171553 306193 361282 368709 8250
12867 251887 21274 8922 -261941 -229401 -177426 49108 121874 -45144 -179856 -155130 178094
12855 -136579 -370197 111541 113394 -270599 390648 326585 100439 72618 -353377 180834
12844 116797 -223499 219699 214999 -26677 -173528 28158 31425 186587 344484 -56888 19737
12832 139744 -296251 143892 104034 -85457 -101092 -62224 152439 -53022 44787 111897 -151840
12820 138138 167119 -42720 -257495 211377 49843 -52301 -152958 -159271 -28093 53967 -96133
12808 -5252 38335 -137128 -32911 -170395 118807 373849 -135766 29748 -27716 5110 -178704
12796 -214470 121922 244710 79253 62348 -105996 -84860 71457 -105576 -84431 -157435 -37491
12784 134195 285068 -22305 -176955 68504 -47764 -6973 -14768 273778 57971 119772 179129
12773 179129 131666 3779 3276 -94994 -19033 -87648 38678 -36187 172102 30285 353486 -85171
12760 -182761 144906 -49129 135010 114164 274097 -112104 -137403 -54558 203430 122247
12750 122247 12325 14274 195506 134605 -131640 238542 -136706 390664 -32499 107133
12739 26924 74235 -71650 53342 110114 41557 -28299 83151 40402 30830 203220 17155 -35013
12726 189145 -335799 20306 -53322 47110 -58634 208486 -12401 32775 170988 156491 160623
12715 160623 -24196 68867 169437 -170680 -168677 48242 78981 245404 169808 280472 181771
12704 181771 60661 245925 479990 327708 334229 289281 316032 -19243 176498 -46601 145326
12692 230090 183678 129110 197663 143120 109454 122739 423780 346635 352133 108435 -154890
12680 118823 90471 -96188 88578 202138 689054 208162 -69026 -249651 359067 219215
12670 219215 133954 -23269 -134213 263909 132891 -296863 166866 -72786 35981 88935
12660 88935 -97033 -200447 119130 -30959 -71764 372912 126197 280223 6937 97183 63565
12649 63565 2503 150554 -18412 49564 -81520 16937 128717 71654 230605 -131346 -312720
12638 -312720 195319 79615 436992 352050 274959 89855 -89363 198470 -102086 468748
12627 193289 299189 214185 342348 29782 -177629 76684 -152506 256558 121469 95993
12617 95993 104162 -193096 219539 65014 192025 -241380 24788 130302 101758 272204 -19575
12605 153792 -27251 -61440 14072 120999 474330 263465 212579 73246 354206 -138707
12594 279071 -134750 281738 149963 -100993 152579 210298 50306 140595 -43874 97995
12583 25740 216406 -220133 152494 99360 41981 -230151 -185300 -49060 -6128 56012 234431
12572 234431 -75852 116111 -72801 52775 13709 344124 86277 -116233 276425 -191236
12561 173200 138211 -82467 178904 7047 235466 -56941 158995 114525 -235782 -20541 281120
12549 336978 304885 -305161 -108885 161871 148169 -118897 -130000 141625 -53636 84119
12538 -174313 -222500 -56073 -229656 -18723 149111 37159 328669 -49003 105622 456087
12528 456087 99578 -11232 117187 91323 150621 8414 294047 90306 155882 -46697 190625
12516 3044 15280 -85780 -11485 218285 68665 -35163 64981 91279 -30370 -176744 214948
12504 431953 -126900 -126457 249433 96470 305958 154502 135386 267830 -19485 -261843 -196350
12493 -196350 4028 -55429 332263 -33613 4021 -160554 331836 -392591 -161598 34429 75743
12482 75743 3019 21536 -269722 -122144 -157461 71620 14579 -143776 205409 279719 -71053
12470 224231 -329570 -107508 178425 -104107 -39891 -26845 -226203 -222557 88059 253642
12460 253642 -52590 -60906 243698 54626 170391 -237701 20168 -124520 160052 -142483
12449 -176947 -116261 -77013 53174 118191 34581 103602 -13688 16598 29548 46443 -227739
12437 -284474 228 -249254 886 -63842 -24420 144427 -167539 -9365 -2192 135752 54275 235775
12425 235775 27250 80629 181620 -130229 86875 -348776 51557 37415 -281536 164807
12414 -349701 -187167 -6426 87264 381172 -21617 358623 -99956 -8354 23512 -14481 -137819
12403 -137819 -101543 -180462 292102 38868 -9157 213935 -42529 212499 195441 -89806 244873
12391 -5290 -161738 -206411 85749 147012 81505 247950 -47056 129072 -82785 158052 213666
12380 213666 226198 -76025 194600 -103233 30622 36143 -157876 151658 34517 -182626 152341
12368 -304590 -182976 -22189 35136 391296 -40275 -232010 49577 69689 -110939 228562
12357 140512 -119904 -314292 157272 -19552 167552 181687 175251 106194 169736 130755 -67688
12345 34654 288647 -62697 -275175 43747 -225970 -36304 149613 -210278 104473 -505773
12334 -214752 -101470 257412 -101631 -107396 -129028 142734 -203951 99681 -189646 -102171
12324 -102171 222528 298987 82257 40129 184954 -21210 -333685 135500 -165954 -140023
12314 -140023 141109 -55864 3864 -202633 125570 72376 -247171 -65283 -405810 -98612 28229
12302 -160526 -63458 147873 14124 -191650 293871 -165474 -75448 -86928 -297315 32817
12291 152346 -18131 317631 31681 66906 350280 293975 530939 228900 -37477 5004 -23338
12279 4207 55926 262859 -115040 90941 207200 235855 316239 33424 330265 102853 265949
12268 265949 91109 -107944 55341 86274 -64196 -49454 -19790 -92914 70454 -46643 118326
12256 295757 248521 -96934 156161 282933 -118921 85539 201766 300261 334419 -97613 311664
12244 62003 242655 475735 39068 210177 360247 260443 174265 -102334 140949 249734
12234 249734 84240 47751 252634 375087 -26508 77759 360007 263519 80079 76422 372972
12223 372972 40316 230292 181275 -95159 517427 165426 246524 226929 158312 -40194 5460
12211 4096 113023 -21533 345851 135957 62817 251421 226739 445698 174029 356875
12201 356875 354608 103298 280098 278947 -331742 280527 342923 14844 4909 260894 184270
12190 184270 71608 273479 119519 153169 290942 407458 179573 170245 159149 233902 139161
12179 139161 11683 331704 280633 371310 86514 171398 230139 335636 -190196 94937 315416
12168 315416 132036 258389 195610 -5472 56179 208378 110068 -124236 219249 -87917 31945
12156 -330182 -234439 341273 16924 -233155 135624 140255 72265 -202402 44006 581517 126043
12144 -322398 -274387 -37711 90809 141861 10581 14288 -211100 -228791 123357 111796 -97080
12132 82809 23745 119508 -99947 277163 134836 212236 38652 298017 -11858 93792 275452
12121 275452 -14213 57493 110579 120348 94874 -89480 79900 -281564 327262 221937 -97468
12109 -470463 -210708 -342526 -177507 411364 46708 78446 -22782 163832 325953 25818
12098 -295585 53697 -126281 215346 46136 -72391 -98471 49540 77748 -59820 -138668 -29161
12086 81917 -208426 219198 411716 -126955 182040 -345155 -20105 186347 127761 274128
12076 274128 -43985 44020 422649 362411 710674 1359087 1507650 491557 209908 381353
12066 381353 106151 34961 85143 33649 -128873 7815 -1907 205773 226280 133324 -22253
12054 187427 -104129 -18068 -170354 -215769 151668 36010 -360891 -84226 -161249 217514
12043 18559 116837 72654 -136185 34405 184240 -171398 16768 39227 97422 -211939 -305325
12032 -305325 172102 -87227 -82635 11402 -60883 77717 159848 -91719 287661 -114324 28594
12020 -36024 146934 -54294 182339 -231130 154287 88687 271921 125155 61756 -105973
12009 162579 36403 122457 -187993 21794 305787 -154756 313767 -22576 85714 393949
11999 393949 -88427 -157888 220417 -122446 -61805 47074 -5208 -62619 -387 64377 -30171 52240
11986 36558 -53035 -239659 231612 -329235 -215930 -109766 -90904 -223328 -77424 -108688
11976 -108688 -111992 9236 165078 115107 -510792 -37983 -85861 -188944 -92391 -76260 -274880
11965 -274880 183672 26776 281858 -348154 188855 -44163 57160 134221 153039 -129487
11954 189436 162854 205481 -227444 159385 -139580 -379306 148690 40373 -152696 -225828
11944 -225828 71009 -162695 353555 52418 -194622 41113 67384 -29687 113226 -220276
11933 -203317 -382022 -73695 87353 -133601 40416 66964 80506 300439 162775 -17042 -149364
11922 -149364 133758 33524 -159962 -102054 88804 28779 249598 -448926 42855 36511 -166193
11910 200272 138619 -200453 -274989 -233501 125079 -156674 42825 64557 50961 51757 166466
11899 166466 248819 41709 17046 -136147 -377628 143408 -5323 -7414 -4843 192035 -110792
11887 80072 -137482 -360987 -294778 271476 106570 141749 143757 -45106 -371716 285266 3306
11875 -46527 40387 -27 -72050 21508 231426 -288255 253791 -398882 143825 83625 -127841
11863 214213 -225475 -106017 -123387 385452 122340 44878 58267 2148 -144307 95707 49215
11852 49215 -256164 -223775 -85679 218107 -49473 132592 -160253 -87675 71569 -222198 98331
11840 -189246 -195736 -250365 142242 -77784 -92306 -457456 -312601 -228867 -40064 -285967 48934
11828 -290538 -173410 157165 115629 39548 -13544 35123 -278466 -20267 -136246 -22791 82626
11816 280578 247739 -307331 -190410 -172470 49758 -311664 312687 -200385 -76270 -20323
11805 -146584 -20402 25966 100292 56406 113942 159709 69891 -102069 -52434 -494107 -186134
11793 -48895 162856 325463 -177929 139951 243048 84742 32431 -127145 -6874 -23129 23843
11781 26203 244847 -194086 -158156 149533 46489 56270 -6496 -79205 -268380 128339 229960
11770 229960 -146571 -220726 -38570 -2535 -199084 -41267 157541 418079 34528 -442114 -118243
11758 99991 -341855 -220452 -5348 -109043 20164 279165 -178642 -138519 11238 168014 -30885
11746 -46362 -275951 -136553 174389 -47197 -171943 141659 168334 226997 232066 -348745 207114
11734 96952 -22031 -319685 189530 -348417 92272 -138279 121552 270997 -105921 178129
11723 432458 279258 -194697 179857 -27127 46625 -55731 334255 315474 59861 107644 114737
11712 114737 -49357 113588 -308008 -269377 -90220 133252 -107315 -220055 124918 247649
11702 247649 -41117 83173 -69199 67160 196770 65276 145383 -62244 -14292 2001 381401
11691 381401 -23848 2222 -196865 -68450 -100232 -72360 3014 81795 76431 -3202 64768 173523
11679 173523 36955 -71320 50833 111110 183790 -117997 -13728 -78238 14218 -255934 407107
11667 1646 -302658 183130 128061 -193677 153601 -256100 -176756 48359 5623 -158361 143977
11655 -97768 46775 26217 117851 -138085 -12073 217220 15263 -214948 172248 289772 -176
11643 -118180 -98134 178548 29342 -87800 64841 -44567 -95016 116557 271214 207583 177166
11632 177166 251976 7892 156598 33990 -22127 110167 142170 -7310 170861 78501 -9194
11620 13327 -177313 396230 61379 -197413 45638 214569 -238620 -50407 -194068 181640
11609 -31664 306912 -13346 87274 35204 167025 60256 23150 135837 -91360 149098 79133
11598 79133 12716 163232 -107442 136769 362868 112612 -119384 133535 181249 100655
11588 100655 185726 289196 158876 384509 63762 -2404 394814 -4728 -225830 53874 -15263
11576 192598 251532 -77510 -79442 11378 63023 336723 -15820 44615 -342933 69128 271805
11565 271805 -46165 81726 -147132 -175759 223437 222763 71878 253881 125539 -10597 -41218
11554 -41218 134189 198417 157671 336298 321927 103574 83014 -19336 260089 20189 356825
11543 356825 160400 313035 35201 172107 369321 153418 220623 227725 162169 -235059
11532 401164 -202698 79833 -82185 -24021 150605 27119 49671 199194 73015 -20662 178244
11520 398039 -54656 126505 -154647 372405 211720 -43072 -204150 127747 92159 55974
11510 55974 167081 245050 423783 -121511 36758 124956 128054 210859 593753 196575 -32168
11498 202586 165112 -81770 15392 255519 218525 12658 -180314 59057 194446 106756 104635
11487 104635 132617 34285 344315 -35332 77603 289051 329248 84313 264331 158635 153752
11476 153752 624228 471684 79143 305093 531837 25965 189561 527340 282599 56479
11465 314239 217860 35585 -127514 74819 256569 82978 109331 311023 16679 364805 322512
11454 322512 59100 672125 -388705 -196746 -149245 42027 402796 171253 109518 202530
11444 202530 -65945 -92811 24409 -83637 -245070 171812 -42087 253038 -281526 142905
11433 241835 113476 141255 226331 103681 192186 148676 294199 119876 -2851 57780 86851
11422 86851 -92093 -79793 82850 -30309 122698 140945 -116275 28372 210549 36809 43535
11411 43535 -140889 137822 139890 -27267 -199371 80998 79196 -60989 348997 59124 -144035
11399 -130279 -27873 211486 280450 -13077 -58177 12741 -182797 36688 236773 -87042 260712
11387 -171194 -209834 -234048 -65558 296708 16830 -79855 -43757 -69859 14894 101029 201813
11376 201813 368161 -295517 -203879 40051 -34160 146331 -342954 7215 83741 -49295 -43624
11365 -43624 107451 -32755 242183 -648 -112209 -113738 162651 -78535 57063 -64879 144258
11353 34793 26965 -47173 -169443 -150461 -83208 -265636 -140708 39024 -151906 60431 -192937
11341 260102 -118865 217485 120574 35160 35125 -191288 7256 14424 15586 373732 112983 86499
11329 86499 -127519 -190329 -223426 -200650 -101723 -53140 200952 114878 -101649 56392 79523
11318 79523 -207009 -127040 355433 33760 216974 48877 50795 -144374 -142940 33690 68974
11307 68974 9266 211298 201380 68809 -162622 -201145 223281 211967 3345 -68221 120902
11295 -105711 -7208 111681 254108 -110044 -35362 14403 194328 -316695 799 -19130 -234523
11284 -234523 -206753 38225 -53786 -39681 -55912 -17139 7716 368945 -97343 260830 343776
11273 343776 -217657 -97094 -89299 -69547 -542959 235602 -41505 -11642 179223 -81816 -235057
11262 -235057 256906 145751 -141003 77873 -187803 204062 -43225 104108 -275216 7201
11251 383645 164690 160704 -93253 80035 44949 107496 -74483 375313 78390 -146386 253609
11239 -57055 293376 7914 -147112 119891 -395824 -86031 234670 -33283 46198 67338 34478
11228 34478 -121743 -290568 189387 -276476 -130798 -107465 -280462 114494 -287643 118323
11217 -179484 -172231 174944 -229644 -137071 -548937 -146801 -181826 -183338 -13758 -140171 -492463
11206 -492463 112273 -253023 -249364 -80482 -299224 -74728 23076 -163454 -335457 -321682 13836
11194 -279477 -195456 44438 108400 -45352 -38124 154593 112725 -173067 -326672 167928 -186933
11182 107639 161097 -105140 -29775 42171 34487 13397 -62540 -508331 -154770 -327064 281378
11170 -15118 -430053 -405866 -62009 462186 -41190 83584 -100692 -232827 212799 -179979
11159 -190641 -31107 248294 -109837 -66102 -175046 -162000 -45481 13810 -66570 -296474 49483
11147 119020 99904 39742 -61059 -365865 22346 175707 -110153 -149625 264830 -22740 -3845
11135 41130 10942 -154203 -217794 -168849 -31396 -139917 80861 -57792 -31323 -71489 209365
11123 -105506 -268950 -169929 8144 389054 398726 -23724 52056 82141 208577 147917 185296
11112 185296 278719 -399265 18105 68231 97140 -3250 3547 205882 135760 -203908 99589
11100 322287 81231 36286 289982 58216 428105 175417 219987 322071 311847 -48252 338487
11088 109995 -233060 424047 127288 147278 307659 -55779 3721 347462 237453 317678
11078 317678 167894 515023 300623 362193 341893 -59953 359359 303412 479184 503119
11068 503119 201540 152288 389820 368988 641352 790033 602897 585309 512265 264879
11058 264879 342134 843624 586863 452355 779459 821911 664727 1053500 677311 568312
11048 568312 602516 839024 1021374 586878 900070 690233 749135 897107 610010 791264
11038 791264 435477 694344 655218 747841 972993 698121 707509 919889 755214 840780
11028 840780 578089 978329 737109 813110 762138 697266 633535 891500 802444 696451
11018 696451 1154117 848278 617069 603660 604864 514543 871982 792896 860987 433802 957570
11007 957570 848060 548852 278938 865630 729704 618175 633824 850115 1364303 723271
10997 723271 721249 841104 533414 627890 795425 636140 742203 648792 740983 1051628
10987 1051628 863012 1261861 1144341 896844 918687 1307313 1241321 1403018 2056934 1728199
10977 1728199 1688788 2022590 1841914 2646514 2581274 2900110 2839437 3106423 2937028 2848193
10967 2848193 2769779 2741581 2309530 2200604 2233316 2035997 1995515 1854671 2574933 2361411
10957 2361411 2400223 2116480 2099549 1951274 1818487 1302807 1307692 924635 1039268 897567
10947 897567 910533 594780 278105 491464 216574 284456 217705 385598 421615 243603
10937 243603 -33629 -22768 -145457 468278 355867 126247 -34970 149108 13781 57609
10927 57609 195973 289682 -105634 276948 312391 -172850 19718 -71099 163083 -23631 -139793
10916 -139793 144526 253786 -14770 143245 98843 -185711 132972 52015 96307 -59103
10905 48098 59745 -51539 162884 -174523 148436 -133388 -37482 -240361 142943 -97260
10894 188849 174949 -90741 -319036 -72399 -470848 -464281 -238502 -144928 -215761 -327646 29109
10882 98421 36463 125138 -106587 -165465 65341 -503205 60748 -150860 -226142 27430 26052
10871 26052 180319 113406 97033 1051 -81411 -24672 42181 -192320 287048 -23110 222084
10859 77270 -7207 -338956 -154109 -241950 193185 170529 -103306 -159846 -27720 -155495 -113441
10848 -113441 -284376 1619 355296 -27147 55213 65479 -134667 -117880 391853 27161 151893
10837 151893 -165695 -329744 -97781 178003 -28774 292794 -415022 -93121 137797 173165
10827 173165 274740 -215759 179858 -148649 -18066 79219 -65440 -64270 -146931 80182 -10907
10815 -316725 129973 365703 -130175 -100193 -138850 35147 61412 293752 -88960 383112
10804 -92865 -60405 -340918 -112063 -8493 146430 38373 -162101 -145700 136924 -100159 48807
10792 -244798 274557 -101824 -267787 -292953 -161027 134296 -68097 -166273 2895 -50045 -9459
10780 108298 -113825 81625 -345678 228526 -320922 -69239 152760 -85338 -67757 -151829
10770 -151829 -156318 214474 -237015 88297 4203 33570 -66139 -218614 153080 -200991 -272476
10759 -272476 265351 -68546 157523 -1947 -41303 -225547 93221 126259 36087 -575801 -335027
10748 -335027 235830 -13986 -208039 144108 120157 -4599 -409200 10088 -365042 290156
10737 -154015 -33978 -241637 -260877 -47528 125871 260654 -144810 -68587 159695 55517
10726 43672 52240 -198109 153337 -70586 -72649 -170165 -297390 -185756 112116 40706 -144924
10714 -171222 -217532 -186063 -21939 254114 -249403 239345 228925 279631 -115854 76593 16107
10702 165191 -193318 -208146 -262984 85250 -148316 -147539 118245 39873 -365401 -37213 -392552
10691 -392552 -256645 12879 -3440 -65460 -50406 141320 -58895 88474 -8584 -244848 -367331
10680 -367331 -90939 3142 21701 -70886 -87541 -34978 17356 -167860 -245894 -147304 1324 -218074
10667 -69176 23305 -34437 82428 -259898 -339056 74208 18806 -207676 -125107 -210889 36126
10655 270411 -68380 -382335 -443174 -95691 -252486 70658 -48926 138543 -91347 -104655 -182907
10644 -182907 -12283 -13936 -76889 -245762 -143491 140966 126255 341195 -161992 293722
10633 -175457 -27634 -242351 -109219 -126090 -86650 -20896 17357 -56067 113126 7614 -57856
10621 117413 184775 263936 -55694 -60705 -466810 158356 41947 109387 -268002 -152685 -89373
10610 -89373 -88163 -1910 -114548 -16378 -11674 -95395 -214328 -77183 -35568 -245325 -249335 146059
10597 -59072 77114 -37806 -23761 -166821 -31318 17173 34019 6623 -344565 -104652 -164423
10586 -164423 -30348 -19428 -59280 139763 -139834 238223 -130394 -285054 -167544 38738
10575 -102835 30414 259155 14092 80418 -162347 -233472 -286889 27419 -133976 -92228 -206926
10564 -206926 -41608 -201049 -429488 -101355 -88222 24452 -48177 41662 -277843 86577 -18504
10552 -152789 -62413 -172441 172004 -360495 -140453 204471 -139140 -229577 -43330 34584
10541 18376 10662 -39751 -28041 -198594 -87664 3504 -169725 -26099 151382 -19684 95381
10529 128409 -277947 -81314 -145762 91756 -133490 -63316 -19212 -230391 -56626 -80742 -135228
10518 -135228 -63573 96726 73706 2240 401389 -114834 -1115 -121858 172112 49376 -71779
10506 57982 -42198 -9287 -189515 -251627 -151997 -51584 29458 -169608 128850 28007 -7496
10494 -339952 -65095 36711 150674 135046 -81443 136416 164751 -348648 -141661 381000
10483 19267 199045 140695 -38954 532852 628051 974096 126618 88352 97253 13545 159991
10472 159991 138179 -266827 -226598 -55932 -299952 -107871 -100363 184704 130918 246399 49597
10460 -12028 -143714 195894 226141 -39453 290464 -65388 57096 -111038 182204 124649 203379
10449 203379 185846 -93640 164327 324652 -212912 -21451 43471 116143 259874 -172940
10438 -304705 -62781 375478 19135 -60827 33409 203100 -284763 32885 259210 -328384
10427 -175999 -20021 89369 32471 -115512 -3277 -65616 -13968 158948 -16572 133308 -121391
10415 -101200 65839 -60992 112933 181903 -105958 52793 162903 -180787 223241 -250151
10404 36083 123661 -155772 -370944 -38250 -190498 -197784 -129988 -218224 26886 87134 232334
10393 232334 138642 119129 280792 131682 42195 -152705 -188907 197089 11362 204094
10383 204094 327734 231844 186862 -170544 -19386 162858 91033 367792 269782 266867 311799
10372 311799 351857 597291 429474 25292 285929 622252 248778 413057 624208 472162
10362 472162 400366 181208 123129 -98546 203060 404674 58561 313255 430797 299072
10352 299072 385465 306542 780274 746980 498301 422998 268740 315794 319159 623089 240392
10340 294591 337774 204520 370752 -134073 204517 -21552 331862 -22992 -120596 460495
10329 214789 68758 -193520 203075 226750 212595 259373 129560 -11632 116116 -100008
10318 -48845 118808 54965 144071 -99215 157399 -7141 175956 164840 -214211 -184692 20793
10306 188221 82438 -57510 35421 -57222 367541 -249123 -36606 -106123 171279 38315 -90018
10294 128428 108109 -66521 -27482 96026 179396 91228 -233542 -285833 133784 -18662 42099
10282 -858 -200499 2925 -166977 -125403 51617 -217565 -244182 221764 -79488 -83672 292607
10270 81206 99764 -224564 192306 -45765 -193744 -133054 58588 220637 286085 215286 464524
10259 464524 320681 333713 444646 628137 298193 -165371 245209 -29059 -97460 29309
10248 -65990 416794 -52375 -117438 -267229 -91665 -8013 -27752 122532 -183305 -174852 -30449
10236 -977 311835 -146747 -236185 43171 200310 -207494 -245964 113360 84573 95369 -25789
10224 -183712 -195458 -241272 -105443 19541 -1865 14683 -135156 -117603 156955 -57224 -83640
10213 -83640 -2052 -225371 -347922 -652 -119624 -42984 165884 200249 -142866 -60578 216769
10201 -40292 -215770 -49061 -68112 70004 -34977 -28132 93318 -3700 -75601 51145 -303522 47165
10188 -200381 -209935 -302880 -66171 -112631 98691 -395127 212291 130693 -86399 177044 -92904
10176 -371185 -52601 21842 -155836 117996 551634 -313440 -42289 -175888 14334 121400
10166 121400 -69275 -187871 146240 -150373 53991 7240 -203858 62710 -82583 -278785 -8634
10154 101089 50758 148839 218662 179570 155178 163389 408482 -46504 -99007 326399 -75339
10142 25579 -348633 143942 91291 -150306 -196537 269939 -33765 157621 -243853 56718
10131 -539020 58679 -187687 311066 99830 49266 -270965 -50627 -34212 -199953 15856 291611
10120 291611 -176725 83685 -185630 -7151 105415 72854 -52689 101668 -308229 -285489 -120734
10108 69790 -105140 -356015 73582 23508 44293 -44609 114958 -95484 -126642 -102372 -165885
10097 -165885 -45257 -213662 -15958 -157042 53337 -21037 -268008 497 -22451 -169246 -257920
10086 -257920 8667 82885 -246724 88339 53249 -69637 -38404 -89832 -402930 -141654 -275139
10075 -275139 33232 -289307 -271422 108526 -130781 -136400 -86742 -76227 105496 -97022 -400716
10064 -400716 -104612 291529 -192197 22562 231876 189816 173920 -324716 -249212 96671
10053 -149305 -29102 -476484 -182436 -87320 211208 -210331 9405 -94980 62169 -106219 -103243
10042 -103243 -354496 -23193 -18322 -460715 -133563 -389522 111883 -184972 230135 -239527
10031 -416150 -189328 -135746 -187733 -33357 260285 -17950 -126161 239715 -6708 -85163 -10289
10019 206566 50980 55424 157263 -103708 202374 199461 -127705 -183396 -54131 192947 -62083
10007 -315294 41405 49060 -67797 226157 57116 -262215 -182076 -231893 -82986 -325659 -248025
9996 -248025 -85113 56011 14738 -433639 18508 -20997 -196287 -236098 59878 12048 24599
9985 24599 145049 64108 -212551 112098 16713 -56633 -126970 -390660 -168735 212336 -315976
9973 -16297 -90230 -27168 131894 -32529 -199133 -186301 72999 -41920 -355266 161646 -234995
9961 -63788 -367707 -318630 228736 -109709 -86094 -71437 -6579 -148100 -365294 116132 -78670
9949 178125 388414 82542 -28387 124495 -107606 -25172 -471438 90390 105409 -166496 -89027
9938 -89027 -6062 -130116 -119011 207449 -167500 -285324 89781 -155387 -240716 -109325 275487
9926 -57667 -20465 -25508 99825 -119014 -215636 -59168 -255597 -34096 -317021 -110706 232401
9914 15453 -93477 18496 -3615 17754 -208932 17517 -166784 30273 -243813 74031 102445
9903 102445 -366368 -122494 -40183 214132 -207903 -129097 155552 -178291 -80617 -72431 -35276
9891 -77784 57569 -127704 -40037 365202 405769 55953 -22304 -116095 -135501 -16393 -228229
9880 -228229 61840 -257161 -273959 49872 -211690 -223243 -256715 -36917 -233186 -290581 -47190
9868 61070 79524 -176058 56296 22318 362861 149680 -64842 193009 82746 -165295 211865
9856 -216790 13781 -77055 -23264 -39883 -13123 240719 -207514 50837 99453 -100497 208032
9844 -224690 -300085 -158510 21276 -239507 -92219 -29740 -143703 -162804 153608 92479 -279519
9832 -32478 35821 -518241 35261 -67953 101508 58983 -151290 97801 177505 -180501 242995
9820 -417454 -2561 509106 -132033 -162470 -43589 -17435 -27775 88438 218133 70315 -331702
9808 -161321 -179502 147819 157136 -285668 381701 -113640 88318 -68343 -118499 -102239 77202
9796 84046 -78278 224593 151389 -128139 -131913 20917 -114153 156995 103432 254902 -172154
9784 -205755 -32067 57782 -319786 -37396 -280942 -136055 22419 -21572 -101864 -49419 -80924
9773 -80924 49212 -48041 -120083 -157422 161878 79662 -122441 78886 -436015 192745 183382
9762 183382 -110655 14949 -73220 -37190 88260 60904 -86346 -111744 -142311 -28695 -116835
9751 -116835 245175 45970 -191349 -184633 71980 -200042 -65769 50043 -384745 27594 44828
9740 44828 -77448 -74552 -117118 195990 -62284 119075 -260447 -318343 -1400 -273857 -86413
9728 113363 15659 96273 3588 -152366 -5208 -179868 -100743 27824 -155212 -354570 83357
9716 -160282 239994 -173688 -421317 -67433 -220951 -413689 3342 92221 379342 -171500
9705 133026 83337 -266483 92950 -399101 -212777 -20332 40770 -249099 -73742 302824 -194418
9693 -507692 -54636 405767 -91664 -155384 -29855 -333372 -40109 144331 -195318 -163320 114197
9681 -109601 240614 -54257 82390 154245 -288030 -34644 -229543 -107256 36822 -195321 -167372
9670 -167372 -151520 -67125 157134 -81643 -228650 -140995 -52564 75794 -258300 93087 70334
9659 70334 -206753 45087 -81581 -110319 -99104 -80278 -157705 -97735 38522 -118087 -136849
9648 -136849 -295287 -221844 195437 200579 27177 155166 -268749 -122436 54972 -196010 51029
9636 55330 218380 -2134 21184 -58816 94457 -208920 -154237 -37326 278121 2131 128066
9625 128066 -8788 -25307 -110442 166270 -179223 186162 21336 181373 -160556 43296 -301423
9613 -140421 -90037 -63792 -314277 -284471 -349971 -22651 -342508 -292622 -160671 -257457 216756
9601 -127077 -360239 -279688 -21870 -102110 7465 -4151 -108135 -124663 -59870 6798 -102571 122680
9588 57197 6308 -71410 -82076 44720 3827 94275 -170095 44979 -78609 29019 41337 49330
9576 49330 -47340 73750 -251989 -84983 -191158 -19871 -3314 10000 -214290 164834 105349
9565 105349 -59054 119712 -18642 -12061 1333 -140594 36531 -176231 33529 49399 -117157
9553 -161803 67974 112716 148759 191699 48919 -7337 -127512 -178856 85642 7324 261680 -84951
9540 287342 159823 -32651 -377638 -45297 9351 -103810 -25512 -487134 -797 -162603 -215936
9529 -215936 -215658 -102459 -403886 -12254 147191 352858 -132867 -478644 -44901 -240006 -25670
9517 326587 85606 -192767 81667 37828 -48490 -108725 -22380 489210 -174693 -500700 -358521
9506 -358521 -107795 135844 -167338 -417147 -104606 -185139 -264823 -72902 141011 -101736
9495 -70714 19362 40613 -212807 -64722 -150918 145588 -307045 -122123 -257037 -184672 -79106
9483 -196832 205158 71947 -228177 -323255 -39053 -306823 48140 -135585 -342062 -96059 -164338
9472 -164338 310672 239402 -81042 158303 277574 -46664 -146006 68154 -226598 -5759 -242865
9461 -242865 214280 144076 258996 -201617 22300 -19004 -87140 146692 161872 -16333 91559
9449 39783 -421542 35748 -231118 -374457 -105800 -83058 -34521 64077 -486233 -85164 -102818
9438 -102818 -137147 -86348 -161296 -55073 -24283 -21141 149050 -45042 -451035 293100 -289964
9426 101748 308172 260033 -175086 -175680 -29426 -4237 41564 -136155 -90832 65450 -102224
9414 321409 -259032 70543 -79522 -132532 -29107 -19753 75626 -266631 -133475 -51467 -68941
9403 -68941 -126753 105297 -13521 -149000 275654 -67763 -142232 42923 -49949 -117589 -137 58509
9390 242173 -168975 -45926 -92290 41226 -94106 145228 -229683 -310108 -78819 -6526 -170863
9379 -170863 -477100 43146 -80749 -324876 -23109 105851 -225394 -178911 -10961 -29682 102195
9367 85370 63729 -45498 19660 -108528 22176 64676 82003 -124843 114862 257175 -137644
9355 -50039 40344 -280789 -211610 -84908 -28486 169123 77654 218564 -97063 42730 45863
9344 45863 -195126 -188249 -110560 102329 -255994 153150 -89134 12222 -117055 -262020 276106
9332 42776 -172300 162670 -252231 -151854 -92331 273118 -207070 194033 107371 96536
9322 96536 110586 -27700 -329535 -100473 -158938 150237 8457 -273316 -152233 -203818 -56975
9310 -48211 -78863 -185510 -165804 -320538 168942 -64087 -4024 -433883 98968 245682 -34974
9298 92980 -186256 -80421 -288700 149005 61329 -82545 -73325 113947 -114050 -119529 -328198
9287 -328198 -197789 -376315 2053 -408030 124459 -214312 146153 -313474 -186331 -468717
9277 -468717 -360505 265893 -309906 -237243 -37299 245202 127405 166583 22122 -72086 -177352
9266 -177352 57180 -67409 136598 -326302 -256940 -208231 25220 49476 71845 -282080 -418626
9255 -418626 -91131 -213399 207064 -252957 -109740 -18809 -184323 -124204 -83953 -51132 29988
9243 -353641 287212 368161 -340992 -280993 -484120 -237305 -322405 -45997 -5856 30724 19047
9232 19047 -291993 -22898 -22053 -213521 -33337 -81260 11666 163573 284252 -54043 46321
9220 89974 148572 130571 -144081 147331 -122979 -26507 -143473 -155948 56853 -101764 105175
9208 -48716 48267 101666 -57110 79877 75424 -217379 -83586 103791 89977 83276 -270786 -3942
9195 -58514 -165092 -304589 133683 96093 -122941 -156785 -401655 9255 -280489 229427 229121
9184 229121 143415 -130422 260049 -300281 30733 -215140 223889 105172 -136604 -124776
9174 -124776 -255674 -100019 132190 -103655 250087 -52173 -255650 236110 -297540 -1679
9163 214655 -6192 76917 -193834 -30771 58922 -194658 27436 238150 141157 -131534 -11232
9151 -255396 -68540 1333 -336309 26343 -175597 -114808 -283772 -93250 -342374 -128643 -33416
9139 -67981 -173521 -305747 -14532 -95490 -173158 -410152 -53209 160848 38014 -105686 -109454
9128 -109454 -368138 43669 -133283 250793 104428 -280511 -26541 -107418 235868 -155226
9117 108176 210047 277065 65604 129778 242561 -408041 94324 119122 -232117 198439 -122041
9105 59416 14170 -175026 134499 -122693 -143395 -250555 8342 -44544 281662 148041 -304671
9093 264997 -115573 -349572 -9789 73011 48406 -61005 394002 -201199 -154493 -30644 -4459
9081 -187699 -218018 -91685 -33686 33690 -193756 85478 81261 198066 91834 -107903 -117574
9070 -117574 107505 -436034 -127676 4565 -113334 -46988 431621 20277 -500908 -103095
9059 131577 82424 71955 273836 53123 237299 48093 -198710 -127732 93812 -117603 87801
9047 -194393 -473622 91201 30332 44410 -103005 206065 -305078 -197924 -84880 -182775 147573
9035 -154888 25008 -160633 67982 414721 185713 271883 -24625 -295109 82073 84786 -263507
9023 -92995 -91265 -79983 -329428 50881 -352384 -101127 6301 -302287 188358 255069 267440
9012 267440 -347694 -23808 176840 -139401 77024 -142891 -190127 -86505 -128926 -170345 -226169
9001 -226169 -144777 -85615 -169273 -181176 -137963 -15934 -139201 9944 -137351 -180042 90033
8989 -48759 54342 102094 24355 187234 -106263 84535 -547125 -295833 177626 258283 -80027
8977 -9653 -268260 112213 154548 52143 -343177 67232 -185689 63921 -226482 -105427 160213
8965 -82949 -369973 -1506 -204790 -22781 -242636 -114697 84340 -48878 137373 -226747 -105487
8953 35541 -147647 -230286 -174984 17394 -108040 154834 67816 119530 -189587 -72342 -42622
8942 -42622 84076 -82899 -82576 56837 -117386 -32666 24393 27505 384673 -36356 -158218 66136
8929 -285493 137906 299022 359390 79990 484603 378885 1791685 5151916 7714020 5929117
8919 5929117 1679965 895009 98728 222131 -100913 188153 286325 52318 -322596 -64800
8908 337279 138205 262455 10566 -215793 -103784 -426910 -209198 -262096 186546 147177
8898 147177 -139128 96871 -6540 -326718 249357 -59794 -134180 153081 133982 83720 -160345
8886 96871 -149146 232312 -129491 -311038 290934 -79643 -183252 -4355 -115873 -73160 229431
8874 -26837 -109321 -150045 -322194 9855 216292 -323004 -295013 -311129 -39861 354194 -135676
8862 108283 58998 -208995 -4620 59505 -103963 123945 -15233 -81590 -238540 -80289 169135
8850 -443515 63234 -339274 -245082 -100810 3635 -143968 -158263 -311780 -52155 291201 38227
8838 -52830 119555 273589 -111148 -82496 -137859 -140622 26407 -326922 66245 6779 182739
8827 182739 84887 134546 65187 -32026 -325069 258801 -266594 -16215 -6276 -94953 -107756
8816 -107756 -223464 -208997 -65073 -173557 -31398 44327 -45244 61773 -37693 -19693 -43431
8805 -43431 -99911 -372050 -141532 -171957 -158664 -103765 -148048 -48633 -153846 386624 -162312
8793 20503 176357 129507 -177366 -26186 95266 265001 -190616 -186265 -235097 -345398 -302541
8782 -302541 73445 155682 59117 -82728 -43648 -240955 -335954 -80777 184515 -220175 -313366
8771 -313366 78585 -363078 -156970 213021 -200453 85833 95638 -236226 -110139 -109908 214189
8759 -143980 -262716 -109413 -185701 534399 66705 -319946 128953 221866 51580 203605
8749 203605 63052 -106088 -129202 -44015 -7839 96062 -169242 107248 -112359 23330 66507
8738 66507 -147961 213967 41535 -166700 145900 -98286 -92227 3994 -87414 4836 -159465
8726 -103953 -321775 -167660 45504 107190 -91369 -282636 20375 -44031 33120 8460 30766
8715 30766 134447 -81425 -5078 -90874 264615 -42224 -48058 -289008 196793 65021 110571
8704 110571 64170 -110043 113395 -359739 -94968 -470346 -290349 51890 11365 58480 -166813
8692 496803 -97607 -230525 -88266 -118533 -253702 -229555 -304714 -95401 -327521 -45535 -159465
8681 -159465 -260905 -96847 -71902 -168006 -183239 -385533 -278613 -35053 70556 32337 -161874
8669 55774 -347736 -226165 -92978 -441184 9807 199002 161026 60618 -31332 116115 194229
8658 194229 -110202 177892 -140657 99747 -26893 -11975 -121393 -19270 -58487 49308 -86096
8646 -186363 -353568 124428 122118 16388 -212706 -237986 -43501 -322979 374434 184529 -12633
8634 -315145 63381 -367584 255540 174068 90720 221617 -40620 -94977 5090 126962 119164
8623 119164 -164561 -123461 -211397 44745 216282 -157293 -132015 117065 -171671 85081 -31354
8611 160188 -129896 41718 -23730 -135428 -155361 -160066 252542 -154404 -22803 175333 -376791
8599 141233 -113643 -141737 -130545 57308 -119904 280620 12596 -111672 251066 -195162
8588 25181 -249446 -308234 -129843 -269940 -267010 -305007 19763 -166595 69208 222045 220147
8577 220147 208097 -101961 315991 -40249 -295546 301754 -98450 -231726 -21871 88979 138548
8566 138548 -82224 138025 -203039 116012 -26882 74590 16893 -225532 119593 31640 267061
8555 267061 341592 48327 -148246 179866 88871 149435 146641 -210292 -200889 -230798 -157104
8544 -157104 258388 -244050 -184869 48082 -355403 -133016 -6169 -304837 -31717 5968 -7912
8532 -118030 320488 -247103 -287336 102861 42753 -227374 -43219 -234116 -139396 73535 -2759
8520 91090 -112804 42761 143239 -134067 114922 -118381 -316708 63694 -104980 -202813
8510 -202813 -6579 -344484 77159 169064 66267 -24979 -120983 172379 -184768 -238472 59807
8498 -70229 244051 1210 -129983 -357014 89777 -41865 -100448 -157111 -142767 262130 33231
8486 171056 128302 -48260 -90527 77931 64011 -114678 -158616 6324 -230293 16090 -23649
8474 191994 -40672 -590 -139200 -176709 -362104 -259328 -65086 37682 -158127 -146321 228453
8462 -56188 -384198 183740 90090 -52259 -196022 -178910 -158101 -76931 -116663 -76559 34385
8450 -161006 64731 204971 -58247 -49466 -35672 -7562 -315145 17650 -64083 -243754 19797
8438 -242757 -253874 181199 -158956 -230364 -44254 -198091 -310680 -40449 121422 -8354 -198240
8427 -198240 -207624 87 -165989 -153496 -239160 297087 188409 -139525 -264587 166089 -19565
8415 17953 -351025 218600 -310613 219978 -231118 -148322 162698 5432 90119 401819 -93521
8403 -267462 466747 436661 -119890 -197942 -141324 66493 1469 164201 -183006 -6816 44610
8391 -109969 -19173 -141715 -350 -159591 -360948 115959 -72973 -167855 -154596 539 -186739
8379 -177707 -226079 -149667 91088 90991 -133137 120529 -85081 -171234 100669 144250 49605 -104062
8366 -29712 -255290 -289066 -221068 70292 -118955 -279013 -130320 -30720 274505 -39572 -83508
8355 -83508 -139369 -166418 151943 -274692 -6512 133856 -145308 -32039 223098 -67957 71840
8343 -150472 39464 -117291 213316 -89182 160311 -67326 100016 -46536 68922 -170891 29271
8331 192085 -143235 196282 -78824 -85444 8370 49004 181225 -154087 -356 -365724 -60552
8319 -166052 40148 -24803 -116758 -268159 -373484 -17009 -181559 -65728 88036 22244 -385261
8307 -13885 -477853 201366 124046 -256546 -30522 -85012 -7315 -197521 24591 45171 231192
8296 231192 218011 63026 130378 -327804 135548 -57743 4981 14422 -102782 85019 108990
8285 108990 -140845 -21105 -39182 94096 131783 -114794 24320 -22616 -38396 114439 -124318
8273 -135645 1733 -278222 -133177 -471129 -80638 -142871 -10349 -143686 82464 101087 -39135
8261 43050 -7827 -105744 -110640 375298 -35676 103394 -49608 -276466 136621 -187297 -87725
8249 12883 -100182 -206510 -137406 142697 -60773 229909 130147 180773 -65364 -23463 -176493
8238 -176493 153789 -142798 -37233 20788 64259 165992 -46718 -120452 -160160 -165734 -66530
8226 100382 60120 -48000 59913 -64134 222612 -109469 78562 167145 -29344 -307923 -283093
8215 -283093 -149479 66487 43529 261250 -21632 -95858 -116771 91095 -156967 -170585 19140
8203 -146694 -310542 -76153 390480 10150 15881 -29525 -48427 22581 -111602 -181340 180593
8191 60717 -21583 150151 -29215 -215622 -122959 -73596 68197 89069 -217089 -108634 -64450
8180 -64450 -61461 -272636 -137313 -68945 -297309 -90169 -129155 -19500 -70121 256437 243615
8169 243615 -2721 -12400 -237465 -63194 -105479 65848 -79258 -72775 82339 4707 -57987 -305741
8157 -305741 128888 53974 320421 206075 -134794 -6294 -186375 66887 -139341 -184983 -156715
8146 -156715 80524 -40281 -279031 -195614 -395499 -79732 -325218 198376 97247 47213 56844
8135 56844 -131442 117908 81879 28121 21475 118146 -124250 -133352 88819 -127122 88913
8123 36051 -110756 -163327 273090 -62682 -106557 -9621 -76347 -134844 -63305 -165921 -262192
8112 -262192 239641 -73380 -133484 -14643 221675 148726 -323355 91864 -45835 3245 4911
8101 4911 166555 -75405 -204738 -23334 185802 115364 -70494 111930 -3092 -17231 -37877
8090 -37877 241833 -102571 291429 196169 162070 68235 13864 -325578 39498 -43388 66257
8078 119073 266324 296806 123154 1272 6492 -278360 -147327 57636 -219283 66063 70942
8067 70942 -125670 -51810 -262832 98153 -318627 45776 319788 249134 -302177 132889 -15021
8055 -67453 -63554 -223184 -35185 -12610 -20122 206618 -205809 259470 40553 -147312 119309
8043 115517 -146666 19388 120640 -417728 27519 -37118 268258 -286889 -107734 -128758
8033 -128758 -36863 -49119 -69633 127287 -114506 -129958 14395 85017 -52930 53315 -72734
8021 158662 169891 -121406 268159 -205107 -295349 290671 -60364 -119170 95044 113023 -90999
8009 -295379 -7115 -79902 39533 -27754 -66899 -66165 -103555 -214147 -485658 184904 188882 -195730
7996 53028 5068 -134667 -37895 -66405 -26940 -195963 -198360 -260092 -35864 149427 123827 -104820
7983 -36871 -163909 129223 -193460 27003 254906 -370137 264065 -36154 14400 14164 -392982
7971 -140741 178921 -219533 118473 82909 94946 -343805 111282 69714 -12249 -202653
7961 -202653 73836 -108303 -136812 -299641 -313378 -212339 -63418 224178 -233819 22471 -10467
7949 -182641 -57597 -17999 -7878 25365 -273030 -80810 -44795 -172112 -105640 -331778 -313796
7938 -313796 21597 -125950 185108 -235169 52896 204184 -192349 197736 -246025 -202891
7928 -202891 -241277 30350 -243064 -76890 -193237 -112454 -119251 44617 -341325 172352 123767
7917 123767 196212 49903 -25024 -40261 -163400 28891 -111458 25044 131025 -91642 256491
7905 -69123 -205540 -183693 803 -39549 60314 173205 -242472 76315 -382712 -120709 48798
7893 -118385 -171908 -42861 -88287 191654 -235219 234775 -420849 265431 -171668 -5498 -71123
7882 -71123 -121270 -99854 3350 115847 270021 174510 154330 -155743 -83806 -65515 40911
7870 -83229 -93018 142690 -145750 -95196 -25883 234851 -225203 -106533 106053 -440153 29723
7858 -205148 -56176 -124072 -377370 2972 61268 -61528 131897 216550 -467371 -907 34965 -24485
7845 121445 -146236 -89917 -336375 -89366 -456572 -96952 -194171 -10763 -306243 -148611 137837
7833 -182372 114065 161033 7114 194677 58437 -225487 225601 -50670 -199080 -171709 144450
7821 -76051 -34940 -145421 129733 -161800 -217473 154132 132011 162356 31459 33243 258300
7810 258300 8873 143457 -283181 -283130 -60146 -217014 315236 -198678 161995 8766 -298615
7798 -97492 -1652 -21143 -165352 -17152 -357143 -177224 127050 36871 100514 -119922 70448
7786 25987 -317303 -235756 283516 -80116 -464453 -53642 -273530 -264205 98938 31687 -49510
7774 -131401 26478 298476 -486326 -288595 118124 66326 -116459 104854 -106569 80125
7763 149314 -98147 97601 304994 -199373 -72667 197296 149294 125263 -409260 111053 -263231
7751 -163042 216510 37440 -25144 98418 42202 41129 -77393 45118 24979 309567 -335249
7739 -163956 -311964 40611 -124161 36642 -110507 -257404 79539 -206942 84162 55157 89418
7728 89418 7450 329058 136234 103574 -89309 45718 -149458 -281578 -85868 -148761 259009
7716 -260106 -21036 87133 -43579 -241595 -13323 -129003 -261128 -70951 246676 98822 -300049
7704 310707 177972 -121132 47649 171151 105121 224833 59499 43567 14868 3203 -612159
7692 -71607 -106190 172301 100033 -179486 55254 -114890 -27455 -119468 -23951 -225844 -5382
7680 -427862 47032 8460 -41324 -72 -231650 35887 98410 57904 -87322 -123505 -334683 -130584
7667 -66326 169954 262681 -73389 69436 113966 -154799 -272655 -3769 -150593 -6729 214652
7655 224846 -276984 -207196 12344 -307335 152252 -78608 -203033 297226 -52564 54279 226865
7644 226865 92249 242814 -156431 -312879 202847 -348146 117999 -2799 -6945 -31781 223346
7632 -58487 404704 -100282 80311 -136550 73285 -31067 -222747 74296 -143841 -243886 -242531
7621 -242531 7754 6456 -258242 79909 213388 62065 144186 120495 9524 27004 11114 101489
7609 101489 -105234 19235 220409 -35754 108828 31461 -154260 -125874 173314 -10797 -271778
7598 -271778 -31366 -31075 -137126 11976 -128585 -274560 -73022 -69001 -263991 -274344 -245669
7587 -245669 31779 -191359 21740 127675 17471 -274938 145920 -338416 -378230 7518 -237102
7575 -56903 -219765 325103 -124421 30526 33624 330174 -49627 79080 39267 -142150 77936
7563 -273935 396762 47409 26080 6933 -335132 -99016 -64998 -55352 14145 -144136 26941
7551 -337749 40779 -305383 -169727 -57092 -447582 -53867 -41533 131177 -95230 -46444 -2843
7539 138309 -145792 -40137 -56498 -159074 69874 52953 -231540 -153381 -130295 -44184 -163375
7528 -163375 -275368 -418600 140971 267101 281702 -138172 125157 32811 -162137 -284599
7518 -284599 -42524 -259965 -272323 53824 -200775 35403 -387809 96994 37402 104070 -271994
7506 -156718 128979 194796 -63277 104831 222034 31494 -147135 -252247 -73058 -41554 -131078
7495 -131078 51013 97638 -22356 271977 -13437 -236488 6128 14580 -144612 -41276 -106950
7484 -106950 135691 -12526 -96816 -201532 -180299 -183440 -351985 -47871 -113055 -11807 107323
7472 -61424 45754 -259226 36480 -138869 -133616 -110248 -303895 70126 56450 -37307 -40374 64098
7459 -136499 115961 -7745 131329 -91941 -48204 21530 59440 -31094 -462511 -231869 -87488
7447 -185015 -59448 -139449 -73947 -73690 135535 -157137 -7111 -83034 -329502 -169777 143344
7435 102941 -216157 97093 -87898 -8109 38989 -149028 124987 -49996 237896 -112986 -62718
7424 -62718 -253465 -151222 11910 103509 274696 36442 -534329 -199229 -83869 169620 184813
7413 184813 232428 74185 93400 -137610 257502 -304961 144989 -110401 -114494 142577 213626
7402 213626 -295840 -49022 -121315 -54367 132564 335214 -294698 -273716 -219646 -217496 -467565
7391 -467565 58091 -210207 262965 135150 155578 -405322 81947 26816 -460651 -159900
7380 -279009 -133674 -23499 140203 1007 -308947 -116961 -23319 -9026 6520 -46944 -73999
7369 -73999 -115899 -260436 -127618 -22758 -265273 -179935 -274363 36582 -1645 -11509 88620 121996
7357 121996 -25935 84891 -194385 6237 191443 -158942 -158969 -78795 -234825 -49091 -95885 53739
7344 200359 -144707 -148565 -102546 -280722 -29772 -236221 -68212 88506 -173036 -152068 -29115
7332 265190 -333111 -27510 -128067 -169295 24080 -162180 77305 80488 36935 333252 -83993
7320 -5469 126617 -250380 20228 247111 -51717 -38518 -98066 6862 119258 -47531 -70502
7309 -70502 339543 36976 200368 -148509 -299909 -84069 -8533 -96675 -174911 -74877 162127
7297 -235101 -132254 -83735 23971 -110413 -198122 -87924 -378035 105037 -27165 -83391 -152135
7286 -152135 146293 47988 -92682 59462 -175158 11252 -133278 10634 146634 29245 -74144
7274 -88127 -27430 218887 -401184 105984 -132206 144686 -191625 120721 -126575 18909
7263 -384101 274981 227866 -345882 190832 277400 -107939 103163 279463 37560 189721
7253 189721 105513 290222 203340 243540 -105349 -38811 -235112 7425 -63644 111111 106691
7242 106691 12464 347997 -76997 -11 -114581 70063 -132807 -170563 67321 108362 -265246
7230 216612 156092 2329 -299066 -24730 -238805 6612 131758 -14774 -58640 -89972 64399
7218 -381141 62633 -11449 -103260 -140981 -183578 225069 -154474 -63595 -348094 -71002 -168422
7207 -168422 -186522 28555 -68469 -42494 -186299 230060 -176370 12907 -2831 32878 40166
7196 40166 -224671 17573 136036 -345557 -252462 64976 73614 -374095 124809 -146551 -23105
7184 16214 -85042 -11980 -180339 -397316 -49868 -148503 -161501 -21711 -109020 112399 -232303
7172 -161696 -248933 -21547 -16821 -216808 -18191 121871 -175507 -270091 -182849 398615 -78117
7160 -389934 -63160 -202310 -188955 -235668 246712 -53192 57268 -345294 -361073 -244144 -130079
7149 -130079 -130139 -140726 38417 101020 254820 -105739 452401 -63228 -223128 60332 389248
7138 389248 15195 82512 -276594 262584 131451 -230105 838 -439160 -100737 50212 -124840
7126 -186822 -236513 185668 229688 -451892 -149548 236768 -129284 111788 -203074 -181404
7116 -181404 80560 30245 33722 -121552 132026 -82235 65021 156684 90927 -112789 66128
7104 -27451 -267684 -51295 147978 7768 -26142 -137036 -508372 373925 20659 15464 -521771
7092 84248 16010 -70034 94423 -87797 -209836 -162839 17015 -25195 20944 -55243 -111745 -195398
7080 -195398 -32545 176129 -208717 158028 -254466 25272 234565 -241100 -201537 51378
7069 66204 11988 261385 -14283 304185 -328241 -14422 -12963 -184697 -245920 95715 8160
7057 -45311 -251142 286781 -93604 -228270 -297561 -139092 -84833 98256 -14338 33448 190951
7046 190951 180936 425344 -202274 -234901 90119 -223970 -134946 -160028 47538 -12435 179553
7034 -314625 -25489 -137884 245812 109962 -251419 155410 -302413 -119435 -9975 -160593
7024 -160593 -95068 290475 -113295 -129361 32734 337216 212704 67567 108809 159442 -39589
7012 74383 -91476 -348362 -135490 -48701 80230 -10242 -69362 247049 72901 20239 -83472
7000 210469 -172766 -77187 222765 -197213 66944 -233401 -151371 -154928 -269078 147486 94898
6989 94898 -57411 -74603 -68304 -243555 246407 357188 -161576 88753 -38438 -217512 203397
6977 14727 288116 207270 -208050 429022 -104090 34302 -93660 -26016 -153574 -177449 23804
6965 87961 -98895 -200347 99663 58886 -35187 -196274 -141458 27924 -34546 151216 -166880
6953 -100732 -284510 -261518 38422 131353 -253522 -127693 -18887 -76226 142462 -79896 199086
6941 172200 -141773 -127036 -225728 184966 -151660 123038 82053 -20797 109930 102898 -219838
6929 78701 -4940 117919 -156833 -36235 303863 -33299 -216300 -32401 -6976 -180997 90499
6917 372554 59809 140295 -379354 51597 -352240 -37087 124388 -230556 -215907 52652 122527
6906 122527 78432 57291 -104699 137487 -366281 -274667 242898 104273 -103968 46504
6895 -111660 -14801 -57866 -188989 206278 -495664 -150477 308957 16397 124036 -86398
6884 369731 26036 -143957 209581 -163015 215216 -216435 -150013 121135 -60056 23828
6873 -32399 184050 80484 -268929 -82786 54582 -364242 -298271 -90882 -269901 20039 -66996
6861 178566 -83271 36069 75128 -35039 -161149 -63241 -118248 48915 -152150 -216887 -440230
6850 -440230 -215383 -88036 -261149 -95007 86891 -10989 33896 258340 115422 -291538 151906
6838 -58976 16114 89159 -222563 -71789 -273572 -124879 39914 78414 -102833 -12740 123052
6826 -121523 343063 -140953 305853 -35698 231114 153268 -34415 -345301 110110 127605
6816 127605 -154690 -127831 63368 -47335 165047 -227166 30751 25007 72390 -46068 -127089
6805 -127089 -105126 -164453 12266 -38771 293628 147115 75536 -380227 200805 203439 170505
6794 170505 317707 -456426 -310268 108273 -420129 -210429 103987 277059 -228321 35042
6783 -218402 -60007 -365022 -203123 36429 -384147 141838 59007 292090 369918 -63132 298312
6771 2390 -87512 -152706 48101 199831 -195413 30293 44088 -78288 -106128 -41761 54966 -241107
6758 -201480 241779 -71393 33393 -27969 180392 41799 30752 -153035 -81349 3226 66121
6747 66121 68076 162931 -157287 56766 -423399 48979 -54664 -164678 -330861 121842 -291084
6735 -110504 18168 310779 -176680 -41067 218445 -8778 71507 -94356 159941 -72368 -232115
6724 -232115 -225795 -14271 53998 -235973 -170031 -485878 178732 -9281 480879 -142030 -226946
6713 -226946 301340 76073 11218 40292 185559 -160207 -32083 -33542 -143856 119524 126518
6702 126518 460881 -51021 33917 61641 -109039 5021 20380 133010 146951 -94071 182703
6690 41893 64285 163458 48166 75320 58096 -5147 -358851 -20351 -108070 -231914 -75907 173989
6677 -429628 -175505 69741 -122632 -70599 129887 -108684 -63729 -50418 -24206 -618370 34519
6665 388795 77942 71967 136941 153399 44959 199719 90485 34827 -206550 53292 -283197
6653 36271 -180844 -84061 334707 -22006 -73167 -36431 100772 -15675 133085 23194 98883
6642 98883 80707 -77624 61497 -74215 -349912 -70348 19653 273683 157559 83838 17763
6630 -190105 671 -158237 80932 -167489 -122952 109736 -115301 -75473 446976 -244252 -28146
6618 -143385 133212 -52941 -95585 182743 52443 50618 -114465 -314639 -186798 -202784 -19808
6606 -163490 90019 -232330 -235220 -563216 -92998 52181 -205238 -138672 -456283 174366 -58036
6594 88949 -94060 -141445 -174732 107085 120521 -50741 68855 -952 92387 3543 -17525 -112066
6582 -112066 -84616 -31337 101816 -414736 160184 48733 -133959 69253 120858 -123598 108149
6570 70006 467998 -23565 -184248 -152841 -107008 -137074 -189775 254917 -146454 -178564 -35423
6558 -186132 -89452 -317029 248124 -52167 -253325 -96115 169806 -65766 -773 208036 -157852
6546 -118768 -3406 -200820 -102756 10763 220877 -58865 -165410 -170544 111567 441220 36477
6534 -267993 58114 -285130 -293408 223802 -44163 -166017 97188 -80951 6111 121995 2932
6522 84338 -184145 -131956 -83078 130478 246219 -8693 314196 -21350 -31200 335553 -61998
6510 43370 14833 34845 -186871 -178202 -386387 -94757 -89194 277047 47656 119618 -307030
6498 -71441 -115134 -79319 259205 237856 -455997 74139 323852 -434485 121126 -46498 -47179
6487 -47179 -123062 215315 -93372 33651 32420 89074 -44541 -50835 406231 -272436 -357617 -283492
6475 -283492 234276 -158247 26424 -142542 465539 73890 -35548 -10283 -32763 -283167 -223846
6464 -223846 -363518 34845 46230 8454 -104889 -217441 -139713 125331 -177762 87277 -124412
6452 -130940 27065 114535 65444 -81364 389321 93554 -24422 267202 14415 516871 247181
6440 -24127 -169369 238341 19390 -202085 -1091 -237836 -180964 -369021 -173314 308263 -432913
6428 -28460 -239773 43921 -80946 -229012 182352 -348908 -1836 -4136 255971 108625 -76348
6416 169863 78777 125109 -34619 -145070 -36292 -309247 120000 5358 -215191 39294 -201831
6404 -30116 -105084 -101814 80822 -32800 -18905 282521 300677 192687 -27308 -79579 -20055 -149228
6392 -149228 -97881 116234 -50194 322442 -165708 -195116 -182146 -121066 -56648 -88738 238356
6380 -127836 -318325 -147349 41215 -87464 54393 -40868 293956 128140 -34509 318152 -25119
6368 193006 171736 111048 -53983 -224809 1683 341545 -219965 -80871 -126726 136096 135406
6357 135406 -229354 121260 201205 73634 -165848 -88492 -234506 65492 107724 69590 -13709
6345 128017 48888 -51213 53526 149724 136879 -34432 107695 279239 -311894 -79244 -80116
6334 -80116 -88983 107345 -10220 5234 -346686 -191565 84274 63074 59518 59045 82247 394212
6322 394212 259964 -319505 -33649 96 -282738 45310 -198185 -20332 -41949 194023 -246276
6310 -91897 93135 93198 -220392 109653 -255796 154224 -120850 -92840 -8674 256667 -193563
6298 -943 70146 308676 -209908 83327 400431 -224380 217236 63741 -85615 287510 -96275
6286 -103023 170529 -169634 27715 254224 -122469 -76924 1565 -9193 281196 -78620 -250528
6275 -250528 -208990 54720 -20866 -63292 280992 -355877 -312256 29514 162188 35747 237910
6264 237910 -104353 -50112 -199315 -69634 218402 -16812 23636 -35894 97579 -76891 285952
6252 24754 177106 -207349 395004 -116960 -188444 -149444 4862 -51581 439849 -5599 -277158
6241 -277158 -16464 26410 -147882 -387673 -38035 -152163 -139501 -41293 193194 -240977 -98537
6229 90176 -104095 -368345 139414 105435 -166201 196005 81673 54276 -263405 172517
6218 126325 -34529 -230594 -157934 42743 -67209 181687 -260209 -194926 -105352 249810 -70969
6206 121693 -426153 -125055 -235219 56049 -147259 -225453 28122 28396 -134735 -35664 641637
6194 152454 321268 -31362 -143460 -504018 -193280 -121359 -57406 -89651 260249 -60327 -23576
6182 162623 -139144 -90670 -28364 -189435 6615 -87434 -150336 -55249 182943 -158536 100941
6170 -366912 -139863 79467 57494 254612 37077 59276 -6927 -251012 -74414 146280 -46717
6158 286770 487790 -115619 -19562 61295 -148791 -38366 50755 -45863 -30762 24269 138155
6147 138155 -110362 -312371 -316381 -185550 28890 30813 -53008 576793 -220230 -78803 -9321
6135 76655 86327 74818 -64058 -27648 118893 -144623 32459 35008 89140 103462 249015 -286590
6122 55034 286661 69484 -136772 89930 -121514 -358598 -154918 156708 191922 -80037 -186687
6111 -186687 -257207 -108557 -347898 -132959 -19978 69515 -330113 -144628 -95024 -104438 -15022
6099 -15535 -4685 -68304 63916 -258634 193774 -220020 15245 57313 51725 2943 -420084 418570
6086 79873 50462 205151 16874 -76979 -145109 -47363 -444124 153530 137530 76642 135380
6075 135380 138349 19431 54883 -291141 -146148 -30409 115827 177640 231896 -29607 -188808
6064 -188808 48578 -203694 -136586 -4533 -85270 51067 109936 -40676 223220 49978 32951
6053 32951 416120 -21342 -149155 -96008 23655 -141973 -58662 -488879 81946 177592 -37143
6041 -48487 154249 -168257 -4686 7610 158806 219606 25094 -201908 -300 288935 -31407 -42844
6029 -42844 101225 -438612 -129307 -84835 67249 67705 101905 -208012 62210 -181563 24650
6017 218714 273880 178158 118772 73903 -268227 243516 17201 19603 214649 -184914 -117400
6006 -117400 147508 206234 -7230 -9874 113853 114299 -138390 -29565 12838 -83199 -78059 218651
5993 42441 -173414 185236 -234719 -247705 -342540 -229530 167711 -208163 -135044 106590
5982 188000 75270 -383542 126633 -188392 -163118 149286 68179 -82409 -17501 65579 -27401
5970 -150494 129288 -120343 33645 -27574 107430 90564 -247178 -328368 286883 299979 -166570
5958 -63068 85099 542 -155600 191541 206020 -349774 67881 -28461 -41155 266319 300088
5947 300088 101427 -90806 -56487 -133904 165432 246851 310495 -81258 -32231 -148036 -36139
5935 -181600 -350713 29767 -19997 -290029 53258 -284417 160328 -101041 65535 -72410 -112151
5924 -112151 30934 -107606 12413 -224467 67848 -23335 -208341 -38546 -52178 48712 -117852
5912 -27845 240708 247118 -250006 -134304 51002 251757 -309613 367289 23991 -114458 56713
5900 3996 -295105 -234006 -354416 235685 23219 -125143 86406 449708 -53802 -46033 8450
5888 -57641 67694 74836 7980 -72283 328802 96147 177600 -46138 52499 279762 -266978 -134862
5876 -134862 -51752 37887 -155786 18142 -193678 34022 57551 -237997 220267 389125 352918
5865 352918 7842 -86920 2748 -50089 -171928 -114119 -274486 -168033 -14741 -185505 96007
5853 17015 -104796 92163 213244 58064 25828 20884 228509 308251 42251 155202 200074
5842 200074 166156 -143804 90282 -229060 -204045 23130 -138132 -150799 126826 -267359 -37208
5830 161364 -127170 -232395 70830 -25506 -30286 8452 22810 -67994 25030 -19492 -171951
5819 -171951 205450 -54937 -445014 99747 -182477 -317845 25235 150700 -293603 -25859
5808 -78171 -15966 145938 -14235 67579 212104 90911 163739 146910 123549 121240 289257
5797 289257 -155797 -119531 138848 -161937 26665 207579 -241050 -36658 247650 -133895
5786 79707 79469 -210496 -91664 338620 106314 -116312 -121723 294697 -472864 278864 91894
5774 204102 -238693 20954 -66037 -152774 146995 80297 200451 -363765 -95509 16113 -34470
5762 -234297 77712 -103099 9107 -113577 -238193 -169133 -379837 -121138 152407 49946 202545
5751 202545 91005 -152188 -76777 -126594 -8454 -342786 123367 -244926 322838 89405 185899
5740 185899 297648 60036 6932 27916 -164891 -17302 315448 189024 -58117 -158125 144306
5728 303419 -40501 -55312 -136947 -21409 91481 18917 -122511 85882 62452 105164 312639
5717 312639 -65197 252397 -208208 54155 -69129 174874 -8363 -138149 -291081 -232822 -213109
5706 -213109 62134 287785 -208326 -179417 -295561 76535 54279 247901 122159 -75660 330731
5694 -60702 259235 -169288 243646 -9524 107967 -213575 -306166 94749 -74263 -111950 -25878
5682 280142 -183945 274792 -104177 305045 -160712 231449 256218 43838 20474 77702
5672 77702 29261 144369 -247264 145756 -241682 -151193 30915 -294634 -92846 45763 -126195
5660 -199387 58978 105578 -230281 356123 73062 186477 -183480 107752 148886 -9776 97347
5648 218585 -295970 49901 -20379 10176 94483 195482 -254982 184122 -407087 -520725
5638 -520725 85446 -361214 -185841 59084 -188537 38296 32590 205987 -21704 271982 -259451
5626 -275920 -77029 88150 -273789 -491992 109136 227387 50986 30860 -182590 -57895 -172437
5615 -172437 -4647 -195106 -170446 -96169 92799 -370767 95231 30919 -88302 -114423 72323
5603 37285 384837 -152799 99858 -47439 -188213 185647 166211 -22127 -231518 -15234 9301
5591 436632 220291 -188927 21003 -57967 111502 71868 136248 -261644 -114350 -92299 5625
5579 110716 36969 -20808 -274494 -17020 -248715 134926 -137046 151493 -72174 74702 -89081
5567 -215657 193745 -18896 -126960 29009 -246230 20621 101092 -199067 -204110 199821 12032
5555 185356 -215952 -37982 33961 89442 -296264 139106 267426 -140329 -68172 -205275
5545 -205275 245447 -58999 149411 -213030 -199008 -113676 29184 104370 -67283 -30712 104106
5533 -237411 -102690 -65181 162028 222665 13309 -201552 -11631 89672 235128 35321 353815
5522 353815 109603 -278700 171413 55935 168752 -86107 -344977 30558 -104012 -75538
5512 -75538 -111970 169594 -106131 97761 -119392 -67726 28366 -191893 287856 -81037 11524
5500 -292375 -58216 -69402 -310422 -382765 189291 -43537 -226958 -66356 -11962 -356716 200273
5488 -44705 278269 105371 -392639 -367055 -122983 20872 223992 -42332 13753 104561 48399
5476 229862 216377 -187074 105495 -190405 -56140 -87791 93915 -285074 -161239 -45746 134161
5464 22588 278968 68524 -236233 125056 -163279 -42002 233993 -42844 180270 -281758
5453 -17152 2703 138947 -49008 362842 575842 -115507 58781 343547 68999 121826 -49466
5441 21362 -162345 254460 103202 -224040 -17422 52119 29148 10913 -47533 -267774 -157926
5430 -157926 -23553 -29540 -96930 -178536 -35340 25414 154623 -150957 274020 -252702 -180578
5419 -180578 -81007 -268731 48909 91009 -387330 -169133 1956 187494 64716 33212 -134412
5407 -165119 44115 291648 66128 4942 191973 97305 121692 -111042 -155747 154700 -42416
5395 -108337 -113210 109108 -41180 -193864 -41293 82786 241002 190323 22138 -188729 240160
5383 278767 -24987 59428 -102055 20597 -271879 279093 -221109 42529 -40181 265252 -148182
5371 175447 -61128 317182 -131985 -140395 -246232 11546 -169995 63788 -193357 -186542 232551
5359 232577 -106723 71910 -5819 93486 67646 -291985 86024 175532 219137 -87019 68323
5347 -200768 267160 -28880 31151 119655 -171917 32451 151426 -38106 -116579 31159 -470518
5335 -307074 -93105 -101660 -92022 -76052 108283 32120 -104788 -373505 5465 159957 11995
5323 113527 220591 -156524 160987 -52028 1792 -150676 326354 213252 -120320 -213969
5313 -213969 62401 -115581 77422 -65664 -66329 195982 -211448 2274 24347 125322 -322819
5301 -9800 318748 153562 -125767 -262503 -41075 -280607 -97605 -323511 -133928 -113789 -250626
5290 -250626 -169679 -101897 -108616 -195822 16314 -117713 424356 44288 46534 120829 -43696 144269
5277 -118760 -222412 -46756 303795 161910 -102925 -74185 -107479 -65327 -113970 -87323 -197169
5266 -197169 -122413 -111977 -121784 -303274 53376 114272 69605 -395655 -286714 -23473 18552
5254 461900 -170982 -93539 56318 121888 105113 -343275 72068 61048 -15739 170358 69555
5242 78059 283019 236815 244973 52914 349433 -82233 46957 94252 -143095 143897 -81103
5230 127280 -3692 123187 73872 45571 -421531 12245 -23463 122372 209119 13894 -189277
5218 -15295 66661 279759 117339 8645 147890 -248599 99224 12806 186893 18000 -387536
5206 206565 -169128 -48042 4621 127431 -21470 -99422 -155272 7415 -31644 142007 -375835
5194 96505 71115 -284960 -17577 354054 -2584 165615 -53748 -269210 311236 -385580 -65666
5182 -148757 -75036 -96420 46590 -104335 99068 -171270 958 125529 63603 -263569 124065
5170 -73232 69488 -19406 -184063 83836 -72441 -216526 -88166 24320 47345 14374 303661
5159 303661 -228580 18302 22725 285491 196127 -239608 -113944 20590 69360 178884 -213915
5147 384635 179285 27947 117845 -26602 171025 -152233 343458 -157463 254365 233390
5137 233390 -110201 8842 883 -103210 -70347 28088 37542 -91520 9940 -58736 -56035 -39279
5125 -39279 43464 6279 44279 -174738 -26673 -128283 290675 268354 159246 362268 -50694
5113 104300 -9925 -340895 -185025 -226761 265117 115480 335995 -91453 154470 -79190 -55242
5102 -55242 -113927 101578 -41520 256637 -216232 -62455 228258 163980 -68933 80710 -320873
5090 -377108 142257 -160258 -62092 -198142 122241 109985 63475 -194543 -134993 57316 -6906
5078 157334 -513975 68045 248902 -155931 -1309 5957 -140941 28195 141652 60775 -8293
5066 -180210 -413577 51845 309057 348539 -114637 61016 114785 263206 -89609 -243653 125151
5054 119796 391626 -28901 -77038 -90343 -317193 -48179 -176958 191700 -123845 -131518 134559
5042 202669 91579 236210 95479 -40365 -179674 -68107 73431 267043 31076 -307477 64985
5030 225808 -543541 -125687 -210424 355402 -143066 -258049 101822 182044 66151 113307
5020 113307 158047 -75951 -80295 -165799 -130068 120223 -442061 -284278 -111783 -108860 -277755
5009 -277755 -53912 294458 -108457 89208 -124388 -68383 -152184 115218 -177982 149214
4998 -175768 -136303 59911 -48936 -69718 185295 -100982 -188905 -341473 -39182 24932 -23116
4986 105286 48801 7541 110166 186563 -88500 43550 -102736 -69439 127407 117728 -141239
4974 -414202 120187 -102902 77208 -292240 206869 -51425 111701 -86986 -2771 -105759 51151
4962 -51488 257834 501122 104327 241148 -143458 105615 -7232 23279 -183000 71339 -93932
4950 -326067 -153251 58364 520 161438 6151 -220998 -42776 20652 -52489 -58940 -321244 -47720
4937 40330 365954 -120580 -264059 -323070 -42818 -80431 -30800 33854 -348231 88419 7973
4925 -132156 414079 -62859 -183557 -102340 94454 -314247 -8726 -170508 -144650 58124 300043
4914 300043 -295255 187549 -31780 81849 -500874 -82322 111572 -67637 -14388 -225477 44355
4902 106788 86901 43097 30473 -108241 249251 3469 50856 -153031 -52795 14039 30073
4891 30073 73983 1686 -245998 81168 30140 -178 -25019 191418 -102614 -192823 29234 90351
4879 90351 103626 -224312 34666 -4856 180235 38192 126778 15477 -204699 35797 -157622
4867 199776 -16084 -86640 34537 -152288 77860 -125585 -264957 -108009 284958 104071
4856 -73096 -81108 -184649 -20162 89787 304007 138811 -144964 -131410 126810 -476010 241702
4844 119735 -141043 67797 -185737 -116218 110653 -197539 -192626 343576 346694 39276 -84937
4832 -25663 -38752 385107 164692 61415 219908 184351 222680 25952 109593 -118902 162805
4820 61130 -7437 107589 -160552 -69251 -154739 222425 -134821 83364 326443 135494 -171608
4808 -76738 -21577 -69987 141755 21373 -134578 312472 -15838 -2494 -138227 -52420 -141902
4797 -141902 113943 -156447 125933 -220537 157220 156588 -84349 17619 160885 214222 -85411
4785 236492 -78991 -136557 168245 368560 234227 -2062 -144589 -280060 2719 -15578 -167051
4774 -167051 99590 57345 -41737 -101134 44284 -238064 195183 -224774 -192712 -73479 99450
4762 327179 66423 102068 117081 57023 26849 -49581 207078 -309940 -165287 -159345 -179513
4751 -179513 -102201 -53870 -149502 -186509 -44686 234399 -137825 -50401 -224657 195331 -58956
4739 147555 -93478 -96007 222667 -318725 -48692 -41945 86801 -6958 36509 153434 217000 -198582
4726 452840 345254 60691 208778 -292949 -117758 185879 199111 110006 244290 10120
4715 79892 -105548 -213421 -129310 -67952 79469 -22985 116330 100239 -110253 146705 65742
4703 96258 -31869 -51269 167140 -147710 320049 -152108 -212332 52568 -201928 273748 -8813
4691 -242596 -64766 158295 -128461 209766 96540 72421 65190 -93778 -41398 39038 18931
4679 20452 -113382 23741 62744 81467 -83707 145823 12036 -80066 123504 -144039 -167443
4668 -167443 -154238 -102756 -137702 -38320 -19090 -2076 53296 36167 -90728 62531 18701 -12947
4655 126545 107360 -157655 -115151 158276 9838 92303 242869 -28227 -75214 -180378 -162446
4644 -162446 110028 74976 -219300 209526 -40385 21737 113094 59892 -89678 149675 -113360
4632 -269276 36580 -190608 58670 -100652 -58212 -246786 22887 35176 128263 118934 101267
4621 101267 342473 -77452 -147093 121047 -170173 78176 125785 76108 -18629 -108052 -77182
4610 -77182 166823 194853 61593 -29974 -124833 107579 -176866 -68459 -31607 41984 97358
4599 97358 -194933 -665 -183726 78164 -313380 -43249 -175495 -23096 -1431 -68647 150317
4587 -193865 -6150 -262529 -37946 117628 138811 -169397 117540 -177965 -304845 56330 -29908
4575 59375 49208 175297 -53336 -126574 51105 339198 14557 160265 197385 202673 117165
4564 117165 64542 83942 148586 76351 -67435 -147169 12555 -127291 129310 -11363 74842
4552 231284 -65047 -175411 93479 -60292 88783 254087 -377071 77478 -75769 -7302 230268
4540 -298 32036 203385 114225 74637 48775 -195615 -5491 5596 -96444 244762 -63308 -298806
4528 -298806 -193201 -208913 58322 103905 -511068 118006 90825 -145495 -187115 -197307 42491
$$ [...]
##END NTUPLES=NMR SPECTRUM
##END=
