##TITLE=AC1709_ROEFFECT0030_8638127_oUKuzT60n3
##JCAMPDX= 6.0         $$ Bruker NMR JCAMP-DX V2.0
##DATA TYPE= NMR SPECTRUM
##DATA CLASS= NTUPLES
##ORIGIN= BRUKER
##OWNER= Administrator
$$ 1.72 TOPSPIN		Version 2.1
$$ 2014-05-23 02:50:58.489 -0700  Administrator@X
$$ Compression mode = diff/dup
##.OBSERVE FREQUENCY= 400.02188249412
##.OBSERVE NUCLEUS= ^1H
##.ACQUISITION MODE= SIMULTANEOUS (DQD)
##.ACQUISITION SCHEME= undefined
##.AVERAGES= 64
##.DIGITISER RES= 22
##SPECTROMETER/DATA SYSTEM= spect
##.PULSE SEQUENCE= noesygpps1d.comp
##.SOLVENT NAME= COFFEE_meoh
##.SHIFT REFERENCE= INTERNAL, COFFEE_meoh, 1, 14.96125
##AUDIT TRAIL= $$ (NUMBER, WHEN, WHO, WHERE, PROCESS, VERSION, WHAT)
$$ ##TITLE= Audit trail, TOPSPIN		Version 2.1
$$ ##JCAMPDX= 5.01
$$ ##ORIGIN= Bruker BioSpin GmbH
$$ ##OWNER= Administrator
$$ $$ E:\/data/COFFEE/nmr/AC1709_ROEFFECT0030_8638127_oUKuzT60n3/12/pdata/1/auditp.txt
$$ ##AUDIT TRAIL=  $$ (NUMBER, WHEN, WHO, WHERE, PROCESS, VERSION, WHAT)
(   1,<2014-05-23 02:50:53.536 -0700>,<Administrator>,<X>,<go>,<TOPSPIN 2.1>,
      <created by zg
	started at 2014-05-23 02:39:23.503 -0700,
	POWCHK enabled, PULCHK disabled,
       configuration hash MD5:
       C8 4E 4E 5D D3 5C D8 9E 9F 52 82 E0 59 8A DE 15
       data hash MD5: 64K
       DF 26 F6 4A 41 38 15 75 59 12 73 31 08 4A 42 7D>)
(   2,<2014-05-23 02:50:56.489 -0700>,<Administrator>,<X>,<proc1d>,<TOPSPIN 2.1>,
      <Start of raw data processing
       efp LB = 0.3 FT_mod = 6 PKNL = 1 PHC0 = 0 PHC1 = 0 SI = 128K 
       data hash MD5: 128K
       93 FC 61 E1 20 0B 4C 2C 10 A4 9F 26 B2 B1 8D 18>)
(   3,<2014-05-23 02:50:57.426 -0700>,<Administrator>,<X>,<proc1d>,<TOPSPIN 2.1>,
      <pk PHC0 = -83.99048 PHC1 = 0 
       data hash MD5: 128K
       A5 B2 22 71 46 69 73 75 5A BD 0A 6C 4E 2F 2C 44>)
(   4,<2014-05-23 02:50:57.848 -0700>,<Administrator>,<X>,<proc1d>,<TOPSPIN 2.1>,
      <abs ABSG = 1 
       data hash MD5: 128K
       B6 F7 60 F5 B1 98 D6 A6 6A 64 5E E6 47 91 BB 65>)
(   5,<2014-05-23 02:50:57.989 -0700>,<Administrator>,<X>,<proc1d>,<TOPSPIN 2.1>,
      <abs ABSG = 2 
       data hash MD5: 128K
       8D 5A 2B A6 AC E7 3C 0F 5B 2B 88 DE 32 8F BB 7D>)
(   6,<2014-05-23 02:50:58.098 -0700>,<Administrator>,<X>,<proc1d>,<TOPSPIN 2.1>,
      <abs ABSG = 3 
       data hash MD5: 128K
       40 E0 73 C7 B7 7C AE D6 F1 AE DE 00 B2 41 FC B6>)
(   7,<2014-05-23 02:50:58.192 -0700>,<Administrator>,<X>,<proc1d>,<TOPSPIN 2.1>,
      <abs ABSG = 4 
       data hash MD5: 128K
       BC 53 BE FA B4 80 BD 1A 76 5C EE 46 3B 7D 50 07>)
(   8,<2014-05-23 02:50:58.301 -0700>,<Administrator>,<X>,<proc1d>,<TOPSPIN 2.1>,
      <abs ABSG = 5 
       data hash MD5: 128K
       B3 2A 42 B6 85 AD B9 7A 7A 19 DA 23 07 3A 86 DF>)
$$ ##END=
$$ 
$$ $$ hash MD5
$$ $$ B5 7D D7 EC A5 15 16 F9 54 3C D5 DD 61 9D A3 18
##$RELAX= 
##$RELAX= 
##$RELAX= 
##$RELAX= 
##$RELAX= 
##$RELAX= 
##$RELAX= 
##$RELAX= 
$$ Bruker specific parameters
$$ --------------------------
##$DU= <E:\>
##$EXPNO= 12
$$ [...]
150 150 150 150 150 150 150 150
##$TP07= 0
##$TPNAME0= <>
##$TPNAME1= <>
##$TPNAME2= <>
##$TPNAME3= <>
##$TPNAME4= <>
##$TPNAME5= <>
##$TPNAME6= <>
##$TPNAME7= <>
##$TPOAL= (0..7)
0.5 0.5 0.5 0.5 0.5 0.5 0.5 0.5
##$TPOFFS= (0..7)
0 0 0 0 0 0 0 0
##$TUNHIN= 0
##$TUNHOUT= 0
##$TUNXOUT= 0
##$USERA1= <user>
##$USERA2= <user>
##$USERA3= <user>
##$USERA4= <user>
##$USERA5= <user>
##$V9= 5
##$VALIST= <valist>
##$VCLIST= <CCCCCCCCCCCCCCC>
##$VD= 0
##$VDLIST= <DDDDDDDDDDDDDDD>
##$VPLIST= <PPPPPPPPPPPPPPP>
##$VTLIST= <TTTTTTTTTTTTTTT>
##$WBST= 2048
##$WBSW= 25
##$XGAIN= (0..3)
0 0 0 0
##$XL= 0
##$YL= 0
##$YMAX_a= 6581246
##$YMIN_a= -14272733
##$ZGOPTNS= <>
##$ZL1= 120
##$ZL2= 120
##$ZL3= 120
##$ZL4= 120
##$ABSF1= 14.96125
##$ABSF2= -5.596931
##$ABSG= 5
##$ABSL= 3
##$ALPHA= 0
##$AQORDER= 0
##$ASSFAC= 0
##$ASSFACI= 0
##$ASSFACX= 0
##$ASSWID= 0
##$AUNMP= <proc_prof1d_extract.lims>
##$AXLEFT= 0
##$AXNAME= <>
##$AXNUC= <1H>
##$AXRIGHT= 0
##$AXTYPE= 0
##$AXUNIT= <>
##$AZFE= 0.1
##$AZFW= 0.1
##$BCFW= 0
##$BC_mod= 0
##$BYTORDP= 0
##$COROFFS= 0
##$CY= 15
##$DATMOD= 1
##$DC= 0
##$DFILT= <>
##$DTYPP= 0
##$F1P= 0
##$F2P= 0
##$FCOR= 0.5
##$FTSIZE= 131072
##$FT_mod= 6
##$GAMMA= 0
##$GB= 0
##$INTBC= 1
##$INTSCL= 1
##$ISEN= 128
##$LB= 0.3
##$LEV0= 0
##$LPBIN= 0
##$MAXI= 10000
##$MC2= 0
##$MEAN= 0
##$ME_mod= 0
##$MI= 0
##$NCOEF= 0
##$NC_proc= -2
##$NLEV= 6
##$NOISF1= 0
##$NOISF2= 0
##$NSP= 0
##$NTH_PI= 0
##$NZP= 0
##$OFFSET= 14.96125
##$PC= 1
##$PHC0= -83.99048
##$PHC1= 0
##$PH_mod= 1
##$PKNL= yes
##$PPARMOD= 0
##$PPDIAG= 0
##$PPIPTYP= 0
##$PPMPNUM= 2147483647
##$PPRESOL= 1
##$PSCAL= 4
##$PSIGN= 0
##$PYNMP= <proc.py>
##$REVERSE= no
##$SF= 400.0200095387
##$SI= 131072
##$SIGF1= 0
##$SIGF2= 0
##$SINO= 400
##$SIOLD= 131072
##$SPECTYP= <>
##$SREGLST= <1H.CDCl3>
##$SSB= 0
##$STSI= 131072
##$STSR= 0
##$SW_p= 8223.68421052631
##$SYMM= 0
##$S_DEV= 0
##$TDeff= 65536
##$TDoff= 0
##$TI= <>
##$TILT= no
##$TM1= 0
##$TM2= 0
##$TOPLEV= 0
##$USERP1= <user>
##$USERP2= <user>
##$USERP3= <user>
##$USERP4= <user>
##$USERP5= <user>
##$WDW= 1
##$XDIM= 131072
##$YMAX_p= 370544630
##$YMIN_p= -11121
##$CURPLOT= <Network HP LaserJet P1505>
##$CURPRIN= <$Network HP LaserJet P1505>
##$DFORMAT= <normdp>
##$LAYOUT= <+/1D_H.xwp>
##$LFORMAT= <normlp>
##$PFORMAT= <normpl>
##$SURQMSG= 1
$$ End of Bruker specific parameters
$$ ---------------------------------
##NTUPLES= NMR SPECTRUM
##VAR_NAME=  FREQUENCY,     SPECTRUM/REAL,   SPECTRUM/IMAG
##SYMBOL=    X,             R,               I
##VAR_TYPE=  INDEPENDENT,   DEPENDENT,       DEPENDENT
##VAR_FORM=  AFFN,          ASDF,            ASDF
##VAR_DIM=   131072,        131072,          131072
##UNITS=     HZ,            ARBITRARY UNITS, ARBITRARY UNITS
##FACTOR=    0.0627417313425164, 1,          1
##FIRST=     8223.62146879497, -1448,        -68236
##LAST=      0,             93,              -69141
##MIN=       0,             -11121,          0
##MAX=       8223.62146879497, 370544630,    0
$$ Real data points
##PAGE= N=1
##DATA TABLE= (X++(R..R)), XYDATA
$$ [...]
65031 189756 188817 187195 184810 182054 179527 177599 176262 175295 174472 173601 172501 171101 169653 168807 169254 171150
65015 171150 173947 176883 179538 181846 183805 185505 187330 189674 192358 194663 196157 197277 198911 201605
65001 201605 205343 209850 214689 219136 222425 224382 225658 227046 228576 229474 229106 227803 226613 226316 226898
64986 226898 227961 229392 231436 234265 237686 241204 244227 246281 247286 247627 247786 247826 247368 246055 243878
64971 243878 241006 237550 233653 229665 225979 222707 219624 216485 213301 210305 207716 205584 203843 202409
64957 202409 201145 199801 198143 196260 194646 193840 193958 194613 195198 195216 194477 193163 191658 190153 188473 186468
64941 186468 184489 183213 182974 183510 184367 185268 186029 186505 186882 187733 189428 191620 193577 194917 195712 195967 195382
64924 195382 193746 191316 188726 186715 185887 186424 187843 189289 190239 190812 191335 191857 192294 192816 193791 195424
64908 195424 197639 200226 202926 205499 208000 210928 214816 219682 225123 230872 237007 243641 250754 258368
64894 258368 266533 274950 282895 289728 295419 300503 305700 311523 317891 324001 328893 332291 334627 336187
64880 336187 336729 336162 335033 333790 331943 328551 323384 317083 310389 303843 298118 293830 290837 288212 285202
64865 285202 281835 278523 275557 273155 271469 270169 268365 265338 261184 256504 251705 246836 241921 237128
64851 237128 232650 228555 224732 220974 217261 213925 211349 209512 208093 206934 206094 205444 204700 203934 203585
64836 203585 203802 204182 204303 204107 203591 202663 201557 200880 200913 201285 201655 202244 203258 204422 205608 207468 210701
64819 210701 214975 219337 223505 228089 233555 239617 245718 251613 257392 263334 269786 276917 284642 292969
64805 292969 302094 311735 320667 327510 331797 333809 333734 331721 328505 324962 320926 315275 307482 298411 289403
64790 289403 281266 274434 269333 265995 263722 261610 259248 256765 254508 252804 251644 250533 249142 248203
64776 248203 249096 252284 256746 261285 265715 270356 275146 279982 285411 292109 299922 308161 316684 325874
64762 325874 335556 344663 352207 358199 363445 368786 374526 380266 385169 388747 391507 394560 398511 402908
64748 402908 406741 409187 409868 408762 406100 402196 397187 391004 383668 375472 366780 357717 348243 338574
64734 338574 329384 321342 314419 307928 301500 295795 291876 289960 289240 288890 288762 288949 289303 289771 290770 292718
64718 292718 295378 298041 300275 302297 304821 308701 314321 320965 327060 331458 334251 335968 336383 334707
64704 334707 330798 325509 319795 313983 307982 301730 295254 288581 281775 274957 268392 262628 258262 255209
64690 255209 252540 249552 246755 245217 245061 245336 245386 245579 246553 248427 251065 254508 258746 263542 268900 275319
64674 275319 283197 292255 301771 311147 320015 328231 335980 343469 350240 355269 358130 359539 360193 359534 356417
64659 356417 350806 344069 337555 331466 325240 318560 311833 306024 302071 300142 299423 298968 298741 299429 301274
64644 301274 303631 305915 308462 312093 317140 323307 330353 338498 348112 359264 371650 384816 398318
64631 398318 411728 424564 436336 446692 455394 462025 465810 466022 462564 455994 446954 435846 423088
64618 423088 409331 395174 380917 366859 353651 341925 331623 322080 312882 304350 297049 291125
64606 291125 286432 283007 280932 279665 278087 275592 272913 271465 271937 273863 276535 279831 283897 288427
64592 288427 292732 296435 299800 303419 307849 313422 320031 327034 333662 339613 345093 350345 355475 360740
64578 360740 366536 372940 379596 386215 392725 398575 402396 403050 400971 397881 394999 391936 387515 381256
64564 381256 373770 365933 358085 350054 341678 333132 324780 316826 309251 302059 295424 289411 283711 277919
64550 277919 272128 267041 263398 261387 260610 260446 260381 260213 260101 260374 261207 262510 264085 265725 267145 268027
64534 268027 268312 268332 268405 268362 267681 266153 264186 262290 260380 257867 254556 251193 248841 247784 247414 247249 247600
64517 247600 248940 250978 252917 254481 256128 258198 260438 262599 265018 268222 272216 276622 281374 286878
64503 286878 293388 300531 307615 314397 321438 329609 339153 349316 358990 367580 374971 380849 384602 386037
64489 386037 385700 384202 381538 377446 372146 366381 360859 355914 351556 347591 343832 340368 337485 335158
64475 335158 332958 330596 328198 325765 322861 319343 315963 313647 312435 311719 311234 311094 311123 311044 311312 312835
64459 312835 315682 318876 321706 324440 327401 330135 332053 333262 334148 334629 334475 334034 333957 334427 335262 336669
64443 336669 339241 343151 347821 352574 357341 362645 369088 376924 386055 396378 408143 421775 437386
64430 437386 454782 474137 496375 522592 553320 588663 629056 675600 729695 792561 865087
64419 865087 947900 1041422 1145673 1259823 1382045 1510198 1642656 1777985 1913626 2045426
64409 2045426 2168900 2280721 2378771 2461288 2526562 2573283 2600549 2607543 2593577 2558579 2503441
64398 2503441 2430107 2341486 2240799 2130422 2011360 1884271 1750978 1614873 1480128 1350797
64388 1350797 1230147 1119968 1020386 930761 850789 780457 719200 665807 619230 579032 544977
64377 544977 516596 493170 473687 456891 441906 428853 418324 410135 403131 396312 389536 382889
64365 382889 376011 368498 360491 352413 344428 336595 329314 323083 317919 313369 309181 305696 303544 303071
64351 303071 304130 306347 309498 313510 318091 322644 326792 330787 335043 339375 343026 345295 345728 343966
64337 343966 340138 335378 331138 327726 324188 319896 315534 312114 309791 308265 307654 308115 309038 309556 309732
64322 309732 310415 311982 313981 315989 317932 319435 319785 319011 318277 318575 319460 319677 318770 317353 315924 314118
64306 314118 311344 307613 303406 298984 294226 289048 283636 278263 273183 268714 265123 262240 259461 256407
64292 256407 253446 251251 249945 249048 248295 248155 249361 252169 256173 260679 265134 269403 273801 278693 283986
64277 283986 289191 294168 299519 306002 313723 322151 330785 339466 348039 356045 362872 368101 371626 373535
64263 373535 373969 373129 371414 369379 367437 365612 363766 362038 360783 360067 359537 358784 357450 354843 350044
64248 350044 342871 334456 326327 319032 312058 304903 297682 290725 284244 278607 274454 272159 271352 271223 271162
64233 271162 270957 270560 269950 269229 268671 268574 269057 270010 271250 272720 274429 276170 277467 277990 277889 277548 277078
64216 277078 276285 275031 273357 271301 268877 266260 263698 261213 258740 256603 255462 255546 256245 256799 257144 257750
64200 257750 258813 260037 261209 262537 264283 266416 268904 272114 276570 282376 289153 296659 305215 315354
64186 315354 327138 339943 352924 365596 378023 390450 402637 413474 421377 425263 425126 421635
64174 421635 415338 406532 395748 383943 372079 360736 350123 340138 330432 320769 311511 303350 296399
64161 296399 289968 283512 277411 272440 268827 266307 264741 264074 263924 263891 264264 265732 268301 271127 273566
64146 273566 275835 278411 281348 284545 288126 292077 295834 298775 300943 302876 304829 306527 307572 307750
64132 307750 306980 305300 302948 300237 297372 294516 291958 290048 289058 289284 291111 294658 299384 304364 309040
64117 309040 313640 318868 325339 333184 342011 351289 360868 371018 381734 392293 401805 410111 417679
64104 417679 424644 430435 434498 437029 438801 440605 443084 446739 451652 457342 463140 468609 473365 476768
64090 476768 478303 478284 477655 476930 475665 473227 469711 465668 461162 455645 448859 441358 433839 426284 418177
64075 418177 409397 400458 391929 384053 376992 371001 366105 361981 358488 355980 354701 354144 353532 352811 352586
64060 352586 353062 353666 353965 354399 355660 357697 359820 361609 363296 365377 368323 372639 378658 386056 393887
64045 393887 401448 408969 417295 426963 437824 449475 461737 474568 487639 500288 511877 521994
64033 521994 530223 536002 539087 540073 540038 539556 538317 535849 532205 527738 522628 517117 511956 508035 505515
64018 505515 503743 502043 500168 497917 494840 490630 485459 479605 472938 465117 456287 447330 439323 432732
64004 432732 427079 421482 415606 410025 405501 402122 399400 397093 395458 394724 394833 395813 397876 400911 404350
63989 404350 407882 411864 416679 422017 427255 432286 437568 443547 450384 458002 466014 473898 481699 490344
63975 490344 500736 512699 525277 537883 550571 563345 576022 588922 603012 619050 636939
63964 636939 656101 676135 696927 718549 741334 765877 792843 822876 856562 894179 935604
63953 935604 980971 1031474 1089054 1155269 1230930 1316850 1414422 1525352 1651391 1794432 1956145
63942 1956145 2137137 2336920 2554997 2791441 3046016 3317155 3602122 3897640 4199854
63933 4199854 4504073 4804985 5096937 5373821 5629292 5857614 6054041 6214199 6333900
63924 6333900 6410275 6442599 6431255 6376344 6278148 6138606 5961362 5750596 5510816 5247796
63914 5247796 4968492 4679448 4385803 4092027 3802759 3522303 3253777 2999312 2760787
63905 2760787 2539874 2337551 2154007 1989035 1842219 1712744 1599267 1500117 1413614 1338152
63895 1338152 1271981 1213095 1159716 1111078 1067461 1029112 995243 964311 935098 907205 880720
63884 880720 855863 832990 812493 794582 779289 766559 756117 747480 740515 735842 734280 736002
63872 736002 740628 748002 758357 771805 788202 807468 829534 853966 880246 908401 938758 971027
63860 971027 1004267 1037880 1071917 1106197 1139841 1172086 1202955 1232523 1259885 1283381 1301734
63849 1301734 1314719 1322919 1327022 1327082 1322357 1312100 1296546 1276725 1253320 1226260 1195556 1161878
63837 1161878 1126020 1088457 1049674 1010291 970399 929452 887366 845249 804497 765692 728877
63826 728877 694331 662343 632646 604855 579086 555513 533716 513312 494864 479153 465740
63815 465740 453197 440803 429083 418610 409258 400925 394031 388736 384272 379677 374864 370501 367070
63802 367070 364387 361885 359097 355920 352551 349128 345516 341601 337620 333922 330529 327313 324359 321633
63788 321633 318491 314282 309439 305230 302198 299565 296502 293258 290595 288739 287487 286842 286836 286985 286614 285652
63772 285652 284577 283648 282672 281523 280390 279377 278233 276696 274967 273653 273247 273665 274251 274345 273851 273229
63756 273229 272950 273129 273657 274349 274900 275038 274930 275203 276355 278338 280818 283480 285866 287347 287710 287556 287818
63739 287818 289077 291563 295333 299859 303849 306318 307793 309743 312687 315642 317641 319052 320920 323587
63725 323587 326573 329479 332387 335525 339136 343620 349275 355774 362302 368273 373565 377999 381125 382802
63711 382802 383629 384343 384997 385093 384353 382892 380690 377546 373800 370565 368729 367997 367402 366619 366198 366492 367004
63694 367004 367142 367214 368217 370740 374365 377995 380624 381984 382822 384397 387278 390596 392764 393003 391909
63679 391909 390613 389754 389376 389341 389495 389645 389700 389762 389905 390057 390304 391089 392755 395013 397253 399348 401695 404356
63661 404356 406594 407523 406924 405102 402271 398520 394208 389819 385385 380481 375013 369614 365021 361372 358412
63646 358412 356106 354581 353573 352455 350946 349423 348341 347660 347097 346825 347556 349928 353930 358966 364405
63631 364405 370062 376177 382899 389837 396275 401897 407119 412600 418561 424819 431349 438501 446638 455838
63617 455838 466099 477566 490280 503815 517499 531193 545708 562309 581813 604230 629132
63606 629132 656099 684638 713933 742985 771076 797921 823288 846647 867262 884390 897238
63595 897238 904997 907369 905183 900170 893819 886490 877705 867149 855186 842424 829120 815145 800311
63582 800311 784410 766989 747515 726066 703692 681823 661338 642392 625074 609854 597241
63571 597241 587230 579324 573022 568195 565103 564069 564994 567085 569344 571471 574070 577732 582205 586850
63557 586850 591659 597333 604389 612717 622146 632996 645803 660845 678232 698263 721433 748139
63545 748139 778489 812210 848559 886423 924677 962343 998301 1030921 1058112 1077782 1088531
63534 1088531 1090432 1085366 1076246 1065489 1054173 1042541 1030783 1019020 1006884 993656 978778 961920
63522 961920 942672 920569 895481 867792 838249 807747 776993 746153 715081 684227 655008
63511 655008 628799 605747 585036 566052 548662 532633 517657 504054 492556 483159 474889 467006
63499 467006 459658 453000 446471 439680 433354 428504 424997 421760 418281 415144 413048 411977 411496 411366 411621
63484 411621 412288 413162 413828 414059 414385 415995 419635 424760 430128 435074 439768 444454 449067 453530 457805
63469 457805 461492 463882 464581 463719 461580 458510 455209 452433 450114 447293 443293 438591 434259 430907 428480
63454 428480 426721 425434 424505 424094 424665 426527 429425 432868 436758 441440 447143 453609 460330 467080 474186
63439 474186 482272 491729 502592 515051 529829 547642 568362 591135 615347 641027 668278 696819
63427 696819 726092 755097 781847 803810 819697 830567 838722 845871 852866 860710 870886 884587
63415 884587 902135 923170 946962 972627 999506 1027308 1055402 1082038 1104885 1122472 1134661
63404 1134661 1141697 1143498 1140238 1133053 1123587 1112921 1101250 1088389 1074140 1058174 1039887 1018707
63392 1018707 994576 968084 940059 910981 880873 849769 818165 786946 757015 729105 703676
63381 703676 680677 659530 639742 621583 605943 593537 584478 578527 575360 574474 575213 577111 580125
63368 580125 584510 590641 598948 609656 622409 636422 651194 666979 684419 703924 725549 749311
63356 749311 775338 803723 834389 867119 901557 937063 972577 1006733 1038285 1066466 1090783
63345 1090783 1110442 1124302 1131711 1133217 1130163 1123692 1114483 1103265 1090912 1077748 1063230 1046696
63333 1046696 1028216 1008353 987254 964367 939092 911494 882316 852559 823194 795145 769259
63322 769259 746100 725839 708505 694304 683427 675416 669034 663055 657038 650959 644209 635381 623187
63309 623187 607356 588654 568348 547770 528067 510022 494080 480445 469045 459495 451398 444682
63297 444682 439373 435107 431259 427567 424204 421070 417526 413157 408485 404525 401758 399798 397943 395794
63283 395794 393390 390982 388707 386496 384343 382540 381349 380510 379495 378294 377497 377428 377700 377931 378381 379459
63267 379459 381058 382892 385100 387878 390819 393335 395625 398441 401841 404930 407041 408537 410175 412280
63253 412280 414910 418267 422382 426737 430859 435130 440432 446960 453916 460541 467138 474825 484495 496169
63239 496169 509207 522919 537004 551600 567002 583330 600510 618570 637862 658858 681734
63228 681734 706253 732040 758808 786276 813966 841292 867852 893612 918905 944318 970437
63217 970437 997429 1024801 1051740 1077766 1102939 1127382 1150795 1172522 1191916 1208446 1221565
63206 1221565 1230665 1235227 1234935 1229662 1219397 1204164 1184048 1159455 1131416 1101475 1071059 1040979
63194 1040979 1011626 983553 957653 934797 915514 900030 888460 880833 877087 877171 881127 888937 900268
63181 900268 914519 931186 950201 971795 996008 1022359 1050020 1078208 1106347 1133940 1160511
63170 1160511 1185795 1209910 1233151 1255492 1276340 1294909 1310887 1324495 1335611 1343014 1344939 1340521
63158 1340521 1330240 1314782 1294027 1267670 1236363 1201497 1163987 1124066 1082316 1040064 998461
63147 998461 957916 918814 882135 848680 818150 789643 762917 738555 717097 698559 682761
63136 682761 669516 658440 649007 640960 634333 629099 625052 622100 620276 619414 619156 619388 620389 622381
63122 622381 625169 628447 632267 636984 642636 648500 653452 656941 659633 662806 667021 671649 675852 679579
63108 679579 683184 686453 688751 690071 691239 692849 694530 695565 695801 695610 695236 694568 693437 691898 690303
63093 690303 689223 689189 690246 691854 693328 694321 694819 694866 694574 694330 694699 695971 697873 699830 701567 703381
63077 703381 705714 708549 711493 714509 718216 723118 728893 734940 741527 749690 759856 771140 782415
63064 782415 793660 805865 819892 835953 854039 874314 896957 922004 949544 979879 1013320
63053 1013320 1049940 1089674 1132615 1179027 1228951 1281915 1337215 1394551 1454134 1516024 1579560
63042 1579560 1643808 1708409 1773532 1838970 1903868 1967635 2030632 2093471 2155864 2216681 2275040
63031 2275040 2330894 2384538 2435953 2484641 2529644 2569421 2601910 2625002 2637063 2637154 2625049 2601125
63019 2601125 2566119 2520876 2466419 2404183 2335951 2263542 2188808 2113959 2041451 1973295 1910666
63008 1910666 1854382 1805461 1764812 1732579 1708280 1691675 1683092 1682821 1690572 1705732 1727824 1756318
62996 1756318 1790196 1828088 1868953 1912394 1958267 2006107 2054950 2103586 2151064 2197125 2242121
62985 2242121 2286304 2329163 2369574 2406493 2439154 2466559 2487184 2499475 2502388 2495227 2477254 2447964
62973 2447964 2407727 2357724 2299103 2232562 2159013 2080356 1999128 1917370 1836098 1755903 1677720
62962 1677720 1602738 1531782 1465086 1402624 1344328 1290030 1239565 1193016 1150456 1111249 1074080
62951 1074080 1038111 1003815 972164 943222 916127 890260 865711 842532 820334 798921 778676
62940 778676 759912 742381 725897 710950 698161 687411 678015 669466 661563 654189 647487 641926 637578
62927 637578 633560 628902 623793 619274 615767 612672 609382 605926 602482 599024 595686 592772 590118 587081
62913 587081 583550 580376 578370 577360 576618 575708 574448 572595 570228 568084 566827 566106 564991 563206 561341
62898 561341 559840 558410 556607 554504 552557 551103 550189 549618 548971 547818 546125 544345 542950 541976 541160
62883 541160 540411 539980 540165 541017 542350 543906 545413 546533 546924 546446 545284 543913 542933 542806 543519 544497 545083
62866 545083 545167 545063 544747 543676 541718 539777 538915 539039 539111 538601 538092 538363 539488 541131 543181 545736 548744
62849 548744 551932 554894 557168 558545 559382 560185 560826 560659 559547 558213 557393 557229 557753 559172 561169 562625
62833 562625 562807 562307 562076 561990 561352 560546 561075 563727 567545 570916 573128 574628 576273 578687 581952 585607
62817 585607 589042 592000 594598 597063 599729 603081 607262 611615 615269 618233 621360 625158 629232 633121
62803 633121 637062 641569 646726 652329 658391 665043 672191 679756 688190 698341 710707 725014 740601
62790 740601 757116 774804 794177 815563 839099 865207 894789 928734 967372 1010671 1058819
62779 1058819 1112282 1171411 1236335 1307142 1383722 1465460 1551525 1641440 1734797 1830366 1926035
62768 1926035 2019742 2109874 2194515 2271003 2336748 2390097 2430072 2455756 2466453 2462022 2442517
62757 2442517 2407876 2358646 2296768 2224994 2145592 2060171 1970521 1878751 1786477 1694598 1604155
62746 1604155 1516774 1433837 1355703 1282233 1213740 1150867 1093660 1041355 993254 949441 910430
62735 910430 876291 846378 819891 796487 776231 759088 744644 732304 721515 711759 702639 694258
62723 694258 687342 682689 680473 680237 681436 683671 686530 689787 693979 700293 709414 720740 733186 746714
62709 746714 762560 781923 804888 830805 859300 890573 925015 963000 1005019 1051594 1103019
62698 1103019 1159436 1221154 1288542 1361500 1439369 1521490 1607572 1697295 1789820 1883877 1978030
62687 1978030 2070480 2158803 2240293 2312572 2373672 2421718 2454954 2472104 2472492 2455951 2422999 2375032
62675 2375032 2313972 2241718 2160194 2071694 1978542 1882458 1784855 1687816 1593917 1504698 1419984
62664 1419984 1339203 1262867 1192155 1127534 1068538 1014675 965808 921769 882258 847161 816350
62653 816350 789049 763897 739882 716950 695680 676715 660476 646890 635174 624201 613308
62642 613308 602650 592845 584520 578031 573133 568947 564771 560979 558522 557470 556739 555539 554360 553993
62628 553993 554157 553824 552533 550723 548986 547660 546935 546654 546052 544434 542221 540711 540682 541794 543525 545922
62612 545922 549122 552824 556901 562026 568978 577429 586103 594103 601621 609378 617954 627807 639359 652757
62598 652757 667898 685028 704990 728484 755299 784746 816756 852021 890892 932628 976022
62587 976022 1020445 1065803 1111614 1156628 1199459 1239198 1275081 1305865 1329984 1346380 1354896 1355774
62575 1355774 1348980 1334277 1311895 1282948 1249061 1211585 1171229 1128460 1084180 1039827 996758
62564 996758 955635 916501 879333 844330 811768 781781 754327 729234 706278 685422 666994
62553 666994 651404 638534 627559 617510 607948 599063 591321 585141 580615 577230 573946 569965 565532
62540 565532 561767 559590 558929 559028 559283 559612 560202 561193 562592 564314 566171 568027 570090 572998 577403 583407
62524 583407 590607 598835 608731 621314 636996 655291 675534 697647 722060 749221 779451 813084
62512 813084 850404 891458 936142 984362 1035802 1089671 1145067 1201594 1259131 1316846 1372857
62501 1372857 1425151 1472467 1514008 1548708 1575371 1593506 1603527 1606167 1602136 1592532 1579133 1563950
62489 1563950 1548653 1534641 1523411 1516396 1514396 1517484 1525585 1538902 1557583 1581122 1608335 1637865
62477 1637865 1668467 1698752 1726944 1751092 1769457 1780610 1783322 1776589 1759892 1733320 1697460 1653126
62465 1653126 1601118 1542152 1477123 1407498 1335382 1262998 1192091 1123782 1058765 997484 940331
62454 940331 887955 841238 800636 765594 734987 708198 685473 667195 653118 642333 633675 626118
62442 626118 619229 613459 609656 608034 607903 608532 609914 612344 615666 619346 623054 626676 629837 631858 632213
62427 632213 630761 627610 623039 617511 611435 604919 597979 590851 583854 577005 570134 563294 556752 550620
62413 550620 544816 539337 534192 529089 523629 517912 512613 508322 505101 502723 500952 499447 497791 495914
62399 495914 494217 493027 492135 491115 489991 489386 490071 492373 495833 499398 502222 504401 506668 509338 512009
62384 512009 514451 517220 520919 525254 529484 533561 538131 543439 548981 554433 560268 567026 574497 582149
62370 582149 590017 598568 607870 617550 627669 639050 652453 667808 684567 702586 722421 744932
62358 744932 770908 800880 835001 873103 915070 960979 1010581 1062802 1116146 1169505 1222063
62347 1222063 1272405 1318341 1357934 1390404 1415834 1434375 1446002 1450663 1448251 1438709 1422523 1400930
62335 1400930 1375217 1345977 1313344 1277802 1240396 1202316 1164604 1128041 1092889 1058882 1025925
62324 1025925 994643 965738 938979 913448 888740 865229 843045 821513 799928 778363 757377
62313 757377 737325 718304 700457 683975 668995 655637 643879 633304 623417 614347 606798 601049
62301 601049 596446 592205 588228 584759 581683 578738 576091 574203 573269 573191 573861 575043 576245 577263 578597
62286 578597 580819 583672 586466 589243 592765 597165 601311 603899 604770 604816 604941 605507 606580 608285 610788
62271 610788 614072 617879 621999 626756 633034 641475 651682 662615 673942 686739 702620 722398 745797
62258 745797 772298 801924 835202 872604 914183 959710 1008979 1061818 1117676 1175273 1232809
62247 1232809 1288504 1340815 1388208 1429028 1461804 1485698 1500638 1507102 1505766 1497224 1481955 1460477
62235 1460477 1433419 1401360 1364745 1324174 1280701 1235626 1190027 1144732 1100748 1059387 1021774
62224 1021774 988391 959166 933767 911726 892550 875944 861799 849749 838937 828467 817970
62213 817970 807466 796767 785393 773128 760359 747719 735601 724142 713482 703792 695162 687615
62201 687615 681174 675774 671228 667442 664643 663140 662868 663360 664194 665345 667114 669915 674179 680157 687610
62186 687610 695857 704372 713281 723110 734119 745988 758034 769506 779774 788537 795927 802304 807951
62173 807951 813010 817620 821944 826205 830949 837229 846244 858816 875412 896489 922341 952579 986220
62160 986220 1022434 1060750 1100307 1139430 1176434 1210530 1241442 1268278 1289468 1303911 1311748 1313744
62148 1313744 1310278 1301355 1287341 1269186 1247729 1223182 1195603 1165680 1134621 1103270 1071836 1040707
62136 1040707 1011073 984266 960683 939895 921663 906254 893740 883635 875499 869369 865208 862352
62124 862352 859991 857977 856756 856666 857668 859693 862868 867358 873211 880366 888632 897666 907069 916456 925358
62109 925358 933216 939667 944810 949055 952726 955759 957668 957900 956545 954740 953966 954814 956764 959212 962134
62094 962134 965460 968467 970423 971496 972348 973160 973810 974931 977948 983728 991700 1000556 1009519 1018751 1028867
62079 1028867 1040335 1053177 1067084 1081881 1097881 1115607 1135140 1155914 1177163 1198353 1219170
62068 1219170 1239324 1258555 1276771 1294158 1311104 1327936 1344703 1361348 1378113 1395463 1413500
62057 1413500 1431712 1449406 1465979 1480528 1491783 1498990 1502535 1503111 1500509 1493829 1482711 1467611
62045 1467611 1448924 1426516 1400197 1370001 1335865 1297740 1256317 1213123 1169527 1125960 1082362
62034 1082362 1038973 996445 955493 916733 880604 847231 816520 788489 763336 741136 721766
62023 721766 705070 690696 677721 665006 652182 639947 629178 620041 612113 604924 598123 591473
62011 591473 585036 579219 574442 570923 568775 567992 568286 569320 571288 574904 580659 588382 597507 607313 616820
61996 616820 625168 632385 639248 646053 652108 656748 660218 662968 664642 664422 662042 657862 652242 645454
61982 645454 637857 629548 620124 609472 598526 588503 579500 570628 561468 552583 544576 537459 531178
61969 531178 525950 521667 517591 513178 508813 505250 502572 500177 497680 495462 494248 494281 494968 495407 495409 495901
61953 495901 497949 501437 505119 508149 511111 515304 521344 528867 537307 546434 556204 566572 577618 589561
61939 589561 602512 616441 631486 648039 666193 685247 704085 722092 739445 756364 772367
61928 772367 786602 798782 809418 819052 827566 834442 839400 842500 843698 842654 839090 833273 826107
61915 826107 818760 812062 806126 800628 795588 791831 790580 792567 797641 805164 814645 825902 838673 852178
61901 852178 865175 876570 885944 893396 898835 901620 900925 896409 888566 878550 867630 856533 845185
61888 845185 833196 820635 808091 795951 783979 771788 759474 747547 736397 726057 716298 706720
61876 706720 696929 686840 676693 666665 656730 647167 638822 632429 627841 624403 621925 620781 621071 622362
61862 622362 624464 627949 633534 641242 650566 661277 673682 688054 704140 721433 739916 760342
61850 760342 783630 809943 838490 868292 898873 929975 960843 990306 1017676 1043122 1066871
61839 1066871 1088290 1106067 1119211 1127550 1131327 1130696 1125831 1117349 1106400 1094307 1082324 1071608
61827 1071608 1063153 1057484 1054572 1054235 1056507 1061394 1068346 1076287 1084173 1091243 1096647 1099235 1097968 1092428
61813 1092428 1082727 1069054 1051490 1030149 1005437 978286 950128 922263 895025 867849 840411
61802 840411 813475 788327 765640 745229 726685 709780 694337 680223 667600 656814 647890 640339
61790 640339 633483 626803 620052 613364 607271 602300 598449 595312 592684 590717 589392 588217 586714 584943
61776 584943 583274 581837 580463 579103 578033 577583 577870 578827 580312 582002 583297 583648 583157 582692 583139 584550
61760 584550 586248 587761 589321 591379 593926 596534 598837 600693 602048 602890 603303 603424 603401 603405 603434 603010 601399
61743 601399 598392 594682 591193 588346 586161 584640 583516 582037 579631 576752 574479 573270 572639 572016 571417
61728 571417 571164 571454 572348 573763 575383 576951 578693 581058 584033 587231 590655 594741 599421 603775 606961
61713 606961 609027 610475 611522 612209 612780 613368 613543 612601 610250 606683 602267 597480 592908 588836 584957
61698 584957 580825 576483 572339 568590 565142 561953 558996 556005 552710 549357 546537 544377 542283 539635
61684 539635 536463 533195 529931 526250 521754 516681 511897 508199 505635 503574 501453 499274 497282 495414
61670 495414 493374 491140 489079 487495 486316 485248 484036 482506 480575 478404 476476 475365 475352 476222 477420
61655 477420 478491 479454 480712 482533 484721 486852 488758 490626 492732 495222 498061 500981 503507 505322
61641 505322 506652 508093 509986 512102 514007 515532 516774 517804 518536 518811 518478 517468 515914 514112 512257
61626 512257 510286 508095 505797 503557 501265 498661 495834 493329 491658 490871 490707 490901 491156 491074 490374 489045
61610 489045 486973 483620 478501 471949 464946 458085 451116 443717 436246 429461 423778 419152 415354 411917
61596 411917 408089 403386 398227 393573 389830 386473 382841 378949 375355 372485 370330 368663 367336 366333
61582 366333 365657 365220 364877 364507 363962 362950 361225 359035 357121 356016 355513 355119 354807 354874 355165 355044 354299
61565 354299 353546 353372 353458 353000 351871 350917 351016 352115 353388 354181 354619 355256 356348 357652 358861 359958 361110
61548 361110 362415 363899 365532 367114 368376 369397 370683 372611 375002 377391 379412 380695 380917 380501 380783
61533 380783 382755 385821 388607 390826 393431 396844 400094 402101 402881 402866 401822 399311 395827 392586 390282
61518 390282 388639 387129 385519 383752 381780 379676 377645 375853 374446 373601 373323 373267 373093 372935 373248 374228
61502 374228 375560 376679 377050 376362 374785 373064 372052 372029 372612 373282 373839 374375 375074 376052 377234 378306 378897
61485 378897 378876 378426 377859 377474 377541 378222 379385 380540 381189 381403 381965 383634 386184 388470 389682 390253 391150
61468 391150 392575 393900 394714 395240 395693 395963 396137 396634 397488 398051 397871 397286 396696 395811 394255 392530 391620
61451 391620 391868 392860 394270 396144 398396 400619 402479 403861 404649 404884 405103 406034 407858 410154 412626 415440
61435 415440 418814 422676 426794 430782 433971 435831 436711 437691 439457 441721 443972 446250 448740 451068 452623
61420 452623 453484 454480 456310 459025 462370 466102 469723 472374 473503 473508 473261 472977 472066 470194 467956 466109
61404 466109 464571 462802 460865 459307 458032 456173 453415 450659 448825 447605 446120 444361 443126 442684
61390 442684 442357 441531 440428 439651 439470 439779 440323 440723 440587 439888 439098 438774 439141 440097 441405 442809 444165
61373 444165 445553 447108 448764 450354 451954 453877 456271 458989 461875 464835 467504 469232 469763 469789 470451
61358 470451 472246 474651 476958 479286 482523 487276 493221 499713 506736 514789 523907 533389 542657 551799
61344 551799 560935 569610 577358 584504 591688 598736 604641 608696 611218 613153 615412 618480 622066 625021
61330 625021 626114 625119 622880 620282 617560 614593 611360 607944 604541 601666 599953 599566 600104 601211 602908
61315 602908 605253 608150 611702 616288 621977 628274 634756 641638 649353 657898 666994 676569 686672 697060
61301 697060 707336 717404 727390 737084 745736 752384 756255 756976 754703 750049 743634 735683 726167 715246
61287 715246 703464 691565 680274 670041 660839 652278 644214 637111 631590 627655 624637 621887 619401
61274 619401 617811 617977 620444 624937 630331 635453 640051 644779 650162 655898 661384 666609 672129 678336
61260 678336 685265 693166 702682 714055 726443 738515 749689 760386 770985 780945 789140 794856 798254
61247 798254 800017 800711 800405 798783 795693 791564 787109 782609 777801 772533 767149 762018 757017 751818 746516
61232 746516 741660 737854 735473 734494 734278 733961 733525 734237 737452 743125 749954 756812 763402 769676 775435
61217 775435 780705 785831 790887 795476 799358 802938 806876 811564 817034 822918 828385 832616 835620 838120
61203 838120 840518 842563 844316 846716 850602 855789 861842 869298 879179 891435 904867 918775 933867
61190 933867 951064 969913 988694 1005838 1020812 1033754 1044736 1053512 1059803 1063639 1065462 1065915 1065454
61177 1065454 1064144 1061852 1058567 1054369 1049020 1041856 1032428 1021195 1009266 997309 985024 971835 957772
61164 957772 943320 928642 913411 897362 880639 863600 846667 830361 815128 801069 788102
61153 788102 776484 766826 759536 754515 751470 750130 750029 750452 750867 751227 751704 752301 752789 752749 751550 748612
61137 748612 743946 738294 732573 727356 722915 719468 717156 716023 716283 718435 722930 729791 738704 749343
61123 749343 761522 775229 790685 808277 828301 850763 875395 901709 929059 956937 985248
61112 985248 1014094 1043275 1072307 1100957 1129372 1157469 1184521 1209534 1231811 1251002 1266879
61101 1266879 1279361 1288634 1294936 1298262 1298357 1294931 1287744 1276561 1261120 1241233 1217160 1190027 1161618
61088 1161618 1133315 1105235 1076670 1047325 1017759 988748 960637 933432 907174 882155 859042
61077 859042 838631 821131 805834 791998 779855 770115 762593 756126 749917 744209 739521 736059 734117
61064 734117 734141 735931 738448 740856 743220 745960 749418 754272 761401 770690 780836 790998 801904 814534
61050 814534 828534 842933 857837 874293 892867 913399 935887 960500 986779 1013787 1041162
61039 1041162 1069319 1098584 1128821 1159915 1191950 1224769 1257827 1290549 1322606 1354096 1385804
61028 1385804 1418812 1453363 1488537 1523644 1559322 1596479 1634822 1673618 1713478 1756061 1802023
61017 1802023 1850522 1900871 1953607 2009759 2070166 2135904 2208505 2289427 2380007 2482163 2598391
61006 2598391 2731008 2882263 3055457 3255544 3489145 3765127 4094848 4490354 4962400
60997 4962400 5521840 6182798 6962732 7880537 8958383 10223858 11698892 13374344 15194476
60988 15194476 17074542 18937120 20724990 22375296 23794101 24879444 25584215 25955214
60980 25955214 26103639 26135139 26105424 26026976 25890377 25659866 25254672 24560456 23484204 22013018
60970 22013018 20228887 18272927 16291834 14399776 12665301 11116100 9752283 8560920
60962 8560920 7526239 6633543 5869344 5220787 4675158 4219379 3840061 3524339 3260654
60953 3260654 3038989 2850973 2690060 2551316 2430866 2325679 2233672 2153405 2083460 2022387
60943 2022387 1969113 1922838 1882297 1845600 1811033 1777709 1745278 1713470 1682197 1651751 1622562
60932 1622562 1594965 1569377 1546276 1525603 1506428 1487639 1468829 1450152 1431547 1412659 1393493
60921 1393493 1374462 1355630 1336452 1316540 1296179 1275606 1254325 1231860 1208984 1187324 1167625
60910 1167625 1149108 1130691 1112213 1094113 1076669 1060082 1044707 1030488 1016595 1002356 988237
60899 988237 975059 962554 949682 936313 923474 911735 900438 888993 877929 867908 858466 848568
60887 848568 837927 827007 816138 805552 795966 788075 781394 774450 766404 757825 749659 742057 734512
60874 734512 726621 718299 709641 701009 692997 685866 679162 672231 665050 658166 651922 646078 640310 634717
60860 634717 629716 625681 622800 621029 619911 618650 616758 614605 612944 611853 610557 608495 606154 604458
60846 604458 603623 603061 602294 601396 600508 599403 597782 595645 593086 589954 586001 581277 576198 571269 566827
60831 566827 562946 559483 556268 553311 550757 548678 546990 545545 544195 542902 541950 541896 542954 544491 545539
60816 545539 545836 545913 546115 546056 545400 544663 544658 545311 545554 544507 542398 540206 538608 537475 536300 534845 533224
60799 533224 531480 529426 526928 524033 520597 516253 511170 506569 503772 502699 501858 499867 496543 492504
60785 492504 488420 484846 482120 479981 477725 475006 472069 469004 465434 461325 457441 454397 451785 448942
60771 448942 446148 444315 443751 443989 444636 445646 446840 447974 449349 451642 454965 458666 462283 466080 470387
60756 470387 474880 478865 482005 484518 486894 489585 492752 496152 499386 502251 504642 506242 506711 506182 505137
60741 505137 503728 501708 499113 496485 494079 491327 487493 482502 476760 470466 463695 456976 451199 446794
60727 446794 443389 440356 437402 434522 431693 428832 425892 422822 419534 416088 412838 410242 408545 407721
60713 407721 407661 408216 408997 409369 408868 407648 406366 405523 405034 404563 404163 404304 405170 406187 406561 406241 406015 406552
60695 406552 407653 408708 409579 410647 412117 413805 415692 418190 421616 425777 430316 435080 439888 444364
60681 444364 448455 452739 457648 462705 467147 471158 475713 481224 487106 492734 498074 503063 507127 509838
60667 509838 511542 512840 513795 514023 513188 511027 507293 502160 496421 490862 485710 481045 477274 474645 472585
60652 472585 470224 467481 465071 463538 462847 462846 463481 464467 465224 465374 464951 464093 462844 461323 459686 457815 455369
60635 455369 452211 448550 444643 440736 437293 434883 433630 433092 432800 432668 432772 433072 433580 434522 436012 437695
60619 437695 439002 439723 440165 440711 441397 441973 442293 442479 442652 442674 442389 442099 442422 443532 444800 445473 445528 445586 446121
60600 446121 447047 447972 448516 448467 447950 447475 447551 448224 449211 450418 452050 454234 456859 459871 463396 467447 471654
60583 471654 475354 477822 478563 477739 476329 475542 475827 476596 477044 477056 477268 478422 480805 484216 488347 493211
60567 493211 499205 506681 515503 525109 535004 545085 555536 566567 578204 590184 601941 612775
60555 612775 622042 629220 633929 636043 635711 633223 628940 623446 617528 611880 606951 603194 601192 601239 602992
60540 602992 605864 609646 614514 620599 627968 636899 647800 660789 675639 692043 709629 727689 745252
60527 745252 761412 775392 786419 793956 798098 799375 798193 794780 789622 783424 776497 768654 759930
60514 759930 751061 742943 735875 729594 723876 718890 715016 712520 711382 711342 712131 713695 716226 720166 726306
60499 726306 735643 748788 765603 785758 809587 837969 871256 908708 949121 991769 1036552 1083462
60487 1083462 1132067 1181236 1229115 1273438 1312117 1343669 1367227 1382292 1388449 1385151 1371845 1348538
60475 1348538 1316305 1277078 1232836 1185001 1134429 1081815 1028204 975301 925092 878885 836791
60464 836791 798332 763365 732108 704554 680378 659281 640924 624587 609535 595761 583789
60453 583789 573603 564314 555180 546469 538998 533184 528793 525279 522049 518655 515039 511459 508134 505180
60439 505180 502924 501820 501840 502337 502747 503073 503436 503538 502980 501826 500456 499054 497644 496469 495882 495786 495524
60422 495524 494494 492753 490904 489454 488355 487254 486129 485467 485692 486658 487943 489450 491331 493463 495444
60407 495444 497039 498191 498672 498331 497761 498007 499368 501059 502429 503914 506240 509144 511594 513170 514611
60392 514611 516877 520058 523415 526291 528777 531439 534478 537437 539917 542303 545383 549350 553656 557751
60378 557751 561364 564062 565318 565328 565170 565772 567189 569173 571775 574888 577847 580197 582440 585308 588636
60363 588636 591684 594262 596747 599102 600859 602140 603856 606492 609349 611466 612892 614569 617221 620797
60349 620797 624954 629635 635006 641095 647785 655139 663392 672384 681212 688795 694722 699172 702024 702637
60335 702637 700753 697078 692518 687163 680520 672521 663819 655153 646871 639069 631833 625279 619560 614825
60321 614825 610998 607637 604241 600736 597527 595134 593747 593042 592425 591750 591744 593317 596403 600131 604377 610436
60305 610436 619605 631719 645854 661922 680541 701584 723947 746895 770547 794643 817594 837315
60293 837315 852414 862130 865701 862591 853208 838817 820784 800211 778194 755914 734389 714391
60281 714391 696649 681781 669741 659489 649536 639015 628189 617891 608623 600264 592530 585355
60269 585355 578853 573166 568486 564894 562039 559274 556375 553828 552115 550976 549732 548106 546281 544366
60255 544366 542355 540576 539563 539375 539483 539508 539644 540211 541195 542458 543967 545515 546608 547046 547413 548489
60239 548489 550254 551861 552576 552425 551913 551547 551794 553053 555305 557940 560311 562456 564933 567990 571272
60224 571272 574442 577702 581450 585768 590643 596360 603090 610169 616451 621591 626500 632262 638970 645996
60210 645996 653076 660711 669548 679715 690652 701363 710930 719106 726540 734218 742505 750658 757336
60197 757336 761733 764355 766555 769162 771733 773321 773670 773141 771701 768799 764420 759489 754851 750418 745783
60182 745783 741096 736696 732247 727013 720939 714919 709880 705923 702331 698275 693598 689084 685833 684232
60168 684232 683762 683811 684181 684622 684515 683558 682282 681308 680443 679172 677761 677131 677704 678951 680086 680697 680783 680640
60150 680640 680743 681332 682181 683021 684013 685467 687423 689980 693660 698822 704952 711185 717317 723672 730212
60135 730212 736575 742849 749456 756292 762814 769041 775609 782692 789638 795848 801243 805711 808911 810964
60121 810964 812537 813887 814521 814230 813784 814084 815176 816557 817905 819008 819434 818872 817515 815673 813363 810642
60105 810642 807888 805271 802280 798343 793664 788968 784591 780218 775375 769835 763736 757652 752382 748333
60091 748333 745260 742863 741375 741214 742256 743854 745487 747180 749388 752614 756823 761052 763946 765050
60077 765050 765295 765789 766423 766062 763845 759793 754325 747809 740588 732948 724828 715923 706236 696329 686920
60062 686920 678427 670955 664523 659110 654534 650430 646475 642697 639450 636930 634801 632590 630427 629020
60048 629020 628822 629628 631148 633514 636818 640635 644554 648910 654369 660838 667377 673213 678268 682579 685848
60033 685848 687975 689531 691098 692270 691877 689269 684957 679892 674458 668435 661613 654069 645976 637611
60019 637611 629600 622715 617210 612560 608008 603116 597719 591756 585445 579366 573955 569096 564512 560355
60005 560355 557012 554461 552266 550148 548195 546575 545452 545093 545653 546887 548494 550634 553593 556965 559804
59990 559804 561766 563635 566502 570821 576338 582410 588158 592779 596065 598451 600394 601985 603128 603634
59976 603634 603040 600867 597329 593345 589611 586052 582406 578804 575473 572333 569325 566810 565277 564907 565719
59961 565719 567795 570989 574727 578444 582025 585558 588995 592297 595524 598446 600467 601356 601669 602005 602188
59946 602188 601718 600692 599694 598943 598188 597367 596767 596474 596156 595524 594675 593894 593356 593106 593093 593223 593525 594234 595560
59927 595560 597474 599901 602991 606958 611744 617084 622862 629204 636223 643779 651463 658818 665660 672173
59913 672173 678515 684376 689237 693016 696055 698526 700335 701692 703097 704489 705040 704238 702639 701035 699382
59898 699382 697133 694229 691163 688294 685772 683924 683160 683567 685030 687594 691262 695672 700486 705835 711913
59883 711913 718363 724633 730755 737129 743735 750173 756375 762617 768887 774899 780684 786425 791644 795271
59869 795271 796679 796071 793701 789423 783331 776243 769091 762180 755338 748448 741515 734487 727360 720323
59855 720323 713641 707557 702333 698137 694787 691892 689336 687369 686159 685656 686043 687955 691949 697963 705482
59840 705482 713980 722996 732061 740915 749677 758466 766868 774092 779802 784580 789348 794345 798961 802651
59826 802651 805685 808585 810965 811517 809244 804234 797037 787943 777380 766454 756332 747231 738686 730675
59812 730675 723795 718308 713668 709156 704463 699502 694193 688765 683810 679702 676144 672514 668510 664310
59798 664310 660311 656854 653998 651423 648725 645855 643137 640818 638782 636789 634760 632794 631042 629574
59784 629574 628251 626819 625317 624290 624281 625194 626433 627571 628510 629088 629090 628776 628938 630122 632047 634018 635744
59767 635744 637542 639819 642505 645015 646816 648073 649558 651800 654648 657915 662046 667531 673839 679715
59753 679715 684741 689905 696294 703764 711358 718632 725929 733495 740927 747728 754043 760459 767079 773046
59739 773046 777228 779312 780040 780326 780428 780100 779246 778105 776932 775786 774567 773087 771199 769025 766897
59724 766897 764949 763037 761274 760226 760180 760575 760683 760542 760654 761066 761490 762089 763292 764816 765745 765767 765592
59707 765592 765901 766610 767496 768899 771291 774594 778318 782054 785531 788613 791557 794970 799163 803878 808824
59692 808824 814066 819573 824839 829396 833376 837040 839973 841233 840250 837258 832951 828072 823302 819116
59678 819116 815498 811837 807278 801375 794512 787574 781011 774346 766852 758568 750236 742364 734890 727835
59664 727835 721708 716930 713261 710118 707201 704594 702544 701368 701336 702401 704228 706605 709577 713114 716891
59649 716891 720516 723666 725965 727126 727374 727250 726841 725577 723039 719456 715091 709683 703025 695735 688868
59634 688868 682877 677531 672727 668821 666017 663851 661610 659121 656899 655450 654532 653275 651036 647920
59620 647920 644325 640353 636050 631953 628716 626182 623512 620408 617629 615932 615034 614077 612825 611911 612039
59605 612039 613275 615159 617311 619838 623047 626663 629639 631123 631433 631507 631538 630867 629313 627757 627129 627493
59589 627493 628518 630135 632205 634128 635366 635926 635830 634625 632035 628731 625799 623621 621787 619813 617457
59574 617457 614584 611248 607773 604371 600938 597587 594945 593369 592180 590293 587442 584323 581768 580335
59560 580335 580354 581662 583337 584330 584438 584263 584355 584865 585859 587362 589130 590871 592677 594850 597392 600173
59544 600173 603465 607817 613391 619899 627100 634993 643691 653575 665344 679260 694496 709845 724958
59531 724958 740148 755016 768054 777735 783391 785111 783695 780959 779114 779191 780486 781880 783046 783997
59517 783997 784165 782752 779647 775271 769657 762342 753240 743092 732843 722841 712773 702274 691492
59504 691492 681139 672015 664458 658284 653104 648558 644313 640184 636359 633323 631423 630676 630929 631911 633086
59489 633086 633906 634448 635481 637578 640440 643437 646587 650535 655636 661546 667783 674260 681058 688044 695127
59474 695127 702680 711228 720678 730221 739132 747313 754787 761018 765206 767236 767877 767958 767693 766977 766056 765654
59458 765654 766681 769883 775558 783358 792574 802812 814256 827077 840776 854390 867236 879238
59446 879238 890560 901100 910312 917429 921923 923750 923018 919464 912585 902418 889866 876088 861876
59433 861876 847822 834646 822921 812673 803614 795603 788639 782633 777562 773734 771592 771455 773671
59420 773671 778698 786667 797098 809437 823574 839423 856464 874434 894055 916076 939482 961595
59408 961595 980297 995435 1007657 1016550 1020532 1018271 1009728 996254 980389 965491 954666 949292
59396 949292 948449 949926 951834 953237 953337 950552 942914 929521 911256 889982 867468 845338 825381
59383 825381 808991 796254 786202 778067 771819 767427 764307 761918 760456 760467 761936 764195 766696 769545
59369 769545 773120 777394 781874 786277 791051 797006 804351 812335 819984 827012 833807 840770 847992 855512
59355 855512 863576 872537 882670 894032 906423 919593 933639 949029 966003 984106 1002534 1020823
59343 1020823 1038861 1056338 1072546 1086801 1098802 1108533 1115963 1120820 1122584 1120860 1115845 1108165 1098069
59330 1098069 1085169 1069354 1051591 1033292 1015133 997075 979348 962651 947301 932877 918995
59319 918995 905962 894425 884706 876704 870090 864386 859086 853946 849055 844543 840352 836253 831998 827507
59305 827507 823087 819226 815925 812456 808260 803900 800610 798936 798406 798526 799573 802237 806993 814003 823093
59290 823093 833529 844107 853760 861913 868194 872060 872800 869790 862862 852794 841370 830561 821560
59277 821560 814880 811075 810671 813443 818531 825500 834660 846080 858939 872172 885212 897716 909147
59264 909147 919070 927383 933734 937097 936593 932527 926135 918450 909786 900152 889653 878521 867163 856225
59250 856225 846324 837674 830133 823545 817895 813219 809579 807065 805694 805375 806110 808190 812026 817758 824949
59235 824949 832582 839472 844994 849520 853932 858575 862877 865962 867336 866882 864579 860545 855247 849387
59221 849387 843504 837673 831581 825019 818431 812806 808761 805896 803350 800800 798431 796120 793304 789748
59207 789748 785837 782001 778394 775276 773013 771382 769499 766920 764294 762404 761033 759357 757209 755235
59193 755235 753909 753012 752150 751377 751148 751872 753586 755932 758452 761016 763913 767470 771716 776449 781396
59178 781396 786259 790840 795246 799702 804118 808149 811863 815973 821172 827566 835043 843791 854006 865302
59164 865302 876862 888109 898883 909014 918066 925506 930904 933968 934603 932917 929034 922964 914725
59151 914725 904475 892408 878682 863666 848136 833032 819001 806263 794783 784427 774986 766185
59139 766185 757705 749204 740412 731240 721785 712420 703915 697174 692461 689044 686013 683401 682074 682627
59125 682627 684931 688668 693619 699256 704799 710087 715876 722859 730836 739282 748301 758521 770251 783121
59111 783121 796315 808851 820019 829993 839751 849925 859962 868827 876272 882853 888863 893859 897363
59098 897363 899506 900849 901831 902493 902506 901453 899321 896821 895030 894534 894920 895088 894037 891499 888016 884407
59082 884407 881042 877522 872981 866748 858867 850099 841241 832284 822476 811474 800174 789919 780982
59069 780982 772402 763328 753987 745243 737769 731799 727124 723060 718857 714444 710372 706903 703646 700316
59055 700316 697263 694855 692813 690609 688138 685649 683412 681806 681281 681753 682413 682611 682610 683045 683918 684588 684496
59038 684496 683503 681882 680390 680075 681435 683946 686813 689962 693933 699085 705406 712873 721530 731375 742555
59023 742555 755405 769828 784935 799889 814830 830292 845745 859448 869954 877299 882462 886050
59011 886050 887838 887515 885590 883314 881578 880110 878113 875642 873809 873535 874739 877029 880529 885448 891362
58996 891362 897599 904041 910814 917385 922650 926017 927925 929216 930257 930607 929288 925501 919378 911933
58982 911933 904147 896391 888924 882452 877741 874990 874016 874761 877165 880862 885525 891344 898750 907916 918867
58967 918867 931724 946256 961517 976500 990971 1005171 1018954 1031744 1043069 1052481 1059202 1062521
58955 1062521 1062459 1059469 1053634 1044758 1033119 1019460 1004218 987340 968915 949478 929750 910552
58943 910552 892864 877296 863474 850482 838071 827035 818369 812449 808971 807232 806399 805940 805817
58930 805817 806004 805906 804699 802239 799218 796435 794159 792184 790119 787659 784779 781732 778739 775950 773776
58915 773776 772796 773023 773710 774304 775233 777279 780625 785032 790512 797130 804486 812112 820175 829177 839176
58900 839176 849950 861764 875282 890814 908040 926273 944633 962411 979861 998171 1018019
58889 1018019 1038674 1059216 1079968 1101721 1124131 1146079 1167160 1187473 1206149 1221578 1233158
58878 1233158 1241534 1246915 1248467 1245632 1238865 1228645 1214905 1197929 1178876 1158897 1138563 1118480
58866 1118480 1099495 1081808 1064757 1048010 1032177 1017788 1004487 991783 979824 968787 958241
58855 958241 947740 937449 927568 917725 907586 897603 888463 880072 871675 862772 853488 844290 835661
58842 835661 827807 820389 812726 804430 795585 786330 776770 767367 758792 751126 743825 736692 730278 724969
58828 724969 720343 715928 712077 709564 708614 708780 709537 710710 712520 715465 719827 725110 730289 734787 738888
58813 738888 743124 747688 752522 757402 761695 764574 765799 765907 765432 764389 762743 760796 758759 756382 753397
58798 753397 750034 746750 743645 740368 736370 731251 725160 718899 713312 708535 704263 700702 698705 698911
58784 698911 701148 704669 708525 711869 714513 717210 720756 724947 729019 732854 736760 740192 741928 741736
58770 741736 740717 739575 737596 733915 728868 723415 718001 712630 707430 702488 697642 692990 689161 686674
58756 686674 685423 685108 685605 686681 688006 689715 692225 695185 697411 698321 698672 699476 701010 703382 707161
58741 707161 712708 719534 726951 734720 742549 749778 756250 762806 770138 777749 784774 791131 797139 802627
58727 802627 807377 811868 816668 821467 825622 829316 833295 837670 841812 845296 848242 850882 853430 856333
58713 856333 860058 864660 869834 875120 879758 882809 883865 883242 881036 876526 869059 859036 847376 834488
58699 834488 820412 805497 790116 774046 756935 739274 722208 706518 692379 679931 669367
58688 669367 660450 652499 645004 638013 631927 627045 623143 619401 615067 610312 605982 602383 598920 595207
58674 595207 591834 589629 588778 589157 590883 593949 597874 602341 607766 614614 622648 631391 640834 651047
58660 651047 661483 671279 679862 686767 691329 693178 692672 690327 686239 680559 673985 667150 660038 652633
58646 652633 645650 639900 635311 631280 627654 624698 622367 620250 618068 615817 613780 612671 613264 615427
58632 615427 618056 620380 622676 625201 627224 627866 627325 626474 625831 625640 626384 628307 630824 633250 635824 639358
58616 639358 644240 650392 657696 665735 673531 680307 686251 692029 697892 703719 709277 713960 716934 718149
58602 718149 718537 718672 718087 716544 714920 713849 712477 709743 706198 703355 701815 701202 701454 702980 705924
58587 705924 710253 716177 723652 732028 741053 751443 763431 775635 786695 797215 808641 820747
58575 820747 831851 841140 849243 856819 864176 872238 882366 894963 909334 924899 941624 959497
58563 959497 978710 1000226 1024981 1052502 1081072 1108953 1134637 1156684 1174609 1189443 1202036
58552 1202036 1211245 1215199 1213903 1209158 1202408 1194321 1186016 1178663 1171813 1163920 1154677 1145041 1134746 1121666
58538 1121666 1104240 1083099 1059818 1035475 1010998 987475 965330 944099 923545 904236 886827
58527 886827 871674 859202 849596 842076 835673 830714 828251 827940 827935 827181 826384 826261 826198 825260 823424 821192
58511 821192 818962 817205 816315 815775 814377 811733 808808 806650 805357 804478 803602 802374 800778 799539 799433
58496 799433 800137 800612 800518 800302 800081 799678 799721 801349 804624 808526 812775 818448 826439 836450 847868 860628
58480 860628 874809 890240 906763 924186 941925 959384 976461 992758 1006708 1016685 1022654 1025449
58468 1025449 1024811 1019750 1010693 999640 988216 977132 967446 960434 955957 952702 950409 950314 953150 958339
58454 958339 965449 974722 985729 997086 1007897 1017954 1026244 1030972 1031511 1028766 1023302 1014872 1004096
58441 1004096 992674 981441 970043 959016 950157 944123 939671 936106 934516 935609 938300 941608 946139
58428 946139 952481 959835 967555 976465 987316 999277 1011168 1022824 1034100 1043914 1051506 1057408 1061975
58415 1061975 1064208 1063165 1059381 1053794 1046476 1037480 1027731 1017916 1007633 996721 986259 977231 969267
58402 969267 961747 955002 949456 944765 940852 938653 938812 940643 943244 946501 950218 953563 956391 959771
58388 959771 964115 967997 969941 970268 970170 970099 970064 970405 971279 972356 973773 976317 980064 984218 988905 995481
58372 995481 1004193 1013233 1021182 1028823 1037461 1047061 1057281 1068762 1081994 1096208 1110703 1126067 1142934
58359 1142934 1160731 1178574 1196020 1211996 1224720 1233929 1241716 1249928 1258106 1265049 1270781 1275672 1279239
58346 1279239 1281224 1282624 1284473 1286944 1290563 1296653 1305487 1315680 1326459 1338756 1353050 1368184 1383573
58333 1383573 1400490 1419675 1439663 1458937 1477703 1496053 1512579 1526559 1539376 1551917 1562620
58322 1562620 1570016 1575174 1579716 1583506 1586358 1589940 1595678 1602589 1609367 1616770 1625788 1635466 1644869 1655291
58308 1655291 1668054 1681991 1695639 1710216 1727800 1748086 1769440 1791659 1815176 1838974 1861824
58297 1861824 1884365 1907710 1931290 1954114 1976681 1999671 2022448 2044933 2069093 2096358 2125378
58286 2125378 2154455 2184199 2215624 2247911 2280447 2314751 2351723 2389276 2425496 2462014 2501423
58275 2501423 2543542 2587040 2632491 2680842 2731028 2782030 2835126 2891293 2948877 3006777 3067276
58264 3067276 3132526 3200928 3270344 3341957 3417329 3494519 3571168 3648775 3729779 3812917 3895612
58253 3895612 3978578 4063961 4151361 4239791 4331132 4427655 4528620 4633164 4743672 4862331
58243 4862331 4987602 5118140 5256601 5405177 5561351 5722944 5893162 6075331 6267052
58234 6267052 6465475 6673997 6897329 7134216 7381807 7643099 7923026 8221348 8536640
58225 8536640 8873063 9235759 9623922 10036226 10478426 10957554 11473824 12026995 12625308
58216 12625308 13278881 13990287 14761862 15606184 16538458 17565387 18693859 19944197 21342576
58207 21342576 22908532 24665003 26654012 28928814 31541552 34558327 38080251 42235228
58199 42235228 47163327 53030162 60035954 68382687 78250763 89844238 103445421 119395042
58191 119395042 138047502 159760404 184773509 212829025 242802150 272863116 301181554
58184 301181554 326438018 347537524 362931707 370544630 368643319 356924605 336890079
58177 336890079 311309548 283259283 255290769 229014515 205138212 183798488 164888924
58170 164888924 148180697 133306684 119807235 107283341 95527230 84530855 74403844
58163 74403844 65274351 57211638 50193010 44126379 38898152 34399154 30524939 27180351
58155 27180351 24291461 21802258 19658890 17807163 16203311 14814442 13607598 12548671
58147 12548671 11611972 10780820 10038361 9366790 8755337 8199758 7693401 7226642 6794882
58138 6794882 6398900 6037029 5704194 5398491 5121147 4869692 4638007 4423284 4226418
58129 4226418 4045487 3875254 3713341 3560794 3416426 3276481 3140259 3010652 2888949
58120 2888949 2774046 2666411 2567496 2475502 2386953 2302266 2224655 2153874 2086272 2020829 1959779
58109 1959779 1903275 1848712 1795637 1746227 1700387 1655203 1609822 1566357 1525402 1485050 1444918
58098 1444918 1406793 1370674 1334334 1297567 1262961 1231792 1202788 1175444 1150846 1128665 1107010
58087 1107010 1085867 1067199 1051019 1034722 1016857 998462 980277 961802 943389 926051 908892
58076 908892 889873 869386 849951 832265 814804 797436 781880 768227 754462 740039 726731
58065 726731 715310 704605 694389 686004 679428 672816 665656 659327 653908 647494 639494 631605 624605
58052 624605 617132 608570 600258 592783 584887 576216 568503 562754 557692 552156 546724 541820 536506 530359
58038 530359 524467 519471 514545 509293 504662 500963 496931 491726 486060 480387 473827 465835 457267 448917
58024 448917 440517 431970 424006 416894 409967 402981 396575 391044 386165 382395 380461 379527 377714 374822
58010 374822 372580 371843 371490 370630 369816 369433 368821 367759 367073 367105 367231 367445 368605 370562 371845 371887 371844 372592
57992 372592 373642 374587 375904 377695 379341 380876 382959 385079 385696 384673 383505 382622 380591 376800 372727
57977 372727 369510 366320 362304 358254 355045 352136 348970 346285 344734 343590 342056 340629 340026 339944 339883
57962 339883 340034 340413 340295 339344 338184 337104 335590 333836 333217 334306 335774 336240 335912 335497 334914 334138 334027
57945 334027 335125 336748 338339 340682 344750 350275 356339 362535 368816 375224 382443 391508 402251 413143
57931 413143 423328 433595 444590 455405 464796 472600 479031 483811 486862 488738 489447 488048 484287
57918 484287 479466 474732 469749 464037 458323 453362 448529 442827 436400 429972 423670 417576 412490 408961
57904 408961 406211 403103 399612 396430 393714 391013 387857 383781 378516 372773 367986 364713 362161 359778
57890 359778 358110 357447 356999 356374 356592 358409 360733 362024 362468 363504 365796 368766 371545 373403 373816 373040
57874 373040 372133 371722 371327 370459 369515 368960 368576 368303 368853 370542 372414 373419 373699 373897 374120 374431 375401 377177
57856 377177 378899 380049 381529 384459 388684 393341 397934 401942 404478 405495 406378 408142 409884 410238 409412
57841 409412 408421 407158 404716 401095 397145 393251 389305 385585 382422 379406 376030 372718 370146 368036
57827 368036 365741 363570 362336 361993 361847 361699 361670 361324 360249 359219 359541 361332 363430 364915 365747 366073
57811 366073 365853 365164 364151 362755 361025 359373 358005 356540 354689 352676 350454 347396 343557 340278 338505
57796 338505 337359 335558 333464 332467 332968 334395 336622 339881 343545 346470 348472 350369 352722 355573 359085
57781 359085 363297 367539 371215 374859 379246 383821 387338 389797 392361 395552 398900 402298 406198 410260
57767 410260 413133 413929 412887 410453 406834 402635 398723 395019 390440 384530 378326 373142 369128 365423
57753 365423 361355 357217 354200 353558 355426 358532 361475 364065 366952 370367 373974 377669 381675 385867
57739 385867 389717 392839 395100 396435 397168 398135 399774 401428 402276 402502 402743 402843 402190 400996 400091 399636
57723 399636 399028 398013 396862 395528 393602 391121 388594 386259 384058 382182 380789 379367 377262 374681
57709 374681 372347 370365 368342 366322 364608 362916 360805 358738 357579 357180 356659 356036 356353 358101 360661
57694 360661 363408 366254 368978 371103 372574 373549 373475 371536 368120 364594 361431 357827 353555 349948 348451
57679 348451 349217 351753 356065 362566 371569 383441 398723 417744 440703 468373 502075 542612 589614
57666 589614 641835 697270 752903 805169 850852 886826 909083 913455 898158 865269 819596 766741
57654 766741 711980 659490 611604 569058 532062 500545 473543 449633 428426 410747 396958
57643 396958 386070 376953 369436 363563 358688 354145 350201 347576 346426 346337 346960 348050 349198 350056 350621
57628 350621 350984 351008 350542 349746 349035 348896 349746 351643 354048 356103 357135 356766 354947 352290 349910 348251
57612 348251 346480 343749 340654 338509 337577 337162 337126 337959 339367 340232 340247 340316 340945 341457 341291 340933 340905 340752
57594 340752 339736 337850 335665 333733 332422 331649 330604 328500 325740 323485 322009 320560 318969 318083 318141
57579 318141 318018 316739 314673 312525 310184 307416 304776 302977 301956 301246 300686 300270 299982 300214 301524 303530
57563 303530 304938 305164 304960 304922 304472 303095 301504 300719 300873 301795 303781 306775 309668 311577 313151 315568
57547 315568 318849 322209 325494 329094 332894 336398 339613 342768 345471 347141 348114 349361 351212 353178
57533 353178 354920 356649 358563 360568 362548 364457 366253 368025 369971 371896 373200 373663 373835 374305 375159
57518 375159 376534 378856 381972 384846 386917 389058 392311 396311 399956 403077 406376 410097 413796 417222
57504 417222 420458 423364 425750 427972 430600 433649 436821 440134 443540 446252 447409 447241 446753 446432 446091
57489 446091 445799 446018 446820 447818 448835 449954 450950 451470 451762 452472 453707 455025 456355 458183 460679 463336
57473 463336 465649 467626 469446 471069 472373 473424 474541 476287 479203 483257 487783 492274 496890 501827
57459 501827 506596 510553 513858 517298 521276 525513 529574 533223 536465 539685 543497 548045 552764 557243
57445 557243 561864 567051 572432 577401 582039 586727 591305 595473 599634 604454 609902 615595 621737 628639
57431 628639 635585 641354 645863 650230 655142 660256 665373 671083 677773 684792 691110 696323 700736 704929
57417 704929 709464 714558 719914 725233 730841 737302 744533 751930 759338 767194 775667 784327 792822 801249
57403 801249 809724 818088 826183 833951 841221 847892 854326 861142 868653 876876 885881 895534 905174 914281
57389 914281 923351 933335 944315 955532 966668 978187 990253 1002227 1013457 1023903 1033807 1043477
57377 1043477 1053556 1064715 1076720 1088439 1099055 1108801 1118339 1128020 1137922 1147991 1157899 1167341
57365 1167341 1176669 1186683 1197650 1209075 1220596 1232456 1244936 1257979 1271613 1286126 1301496
57354 1301496 1317192 1332813 1348477 1364335 1380246 1396138 1412151 1428244 1444205 1460273 1477169
57343 1477169 1495221 1513972 1532854 1551723 1570448 1588642 1606224 1623772 1641919 1660711 1679873
57332 1679873 1699279 1718850 1738294 1757283 1775780 1794109 1812864 1832663 1853580 1874883 1895811
57321 1895811 1916438 1937301 1958354 1979128 1999834 2021349 2043938 2066913 2089809 2112995 2136729
57310 2136729 2160559 2184227 2208369 2233663 2259901 2286510 2313401 2340736 2368399 2396310 2424702
57299 2424702 2453508 2482074 2510176 2538801 2569104 2600968 2633494 2666586 2701030 2737040 2773723
57288 2773723 2810301 2847174 2885304 2925002 2965837 3007515 3050323 3094576 3139949 3185723 3231625
57277 3231625 3278076 3325462 3373534 3421807 3470215 3518975 3568100 3617653 3668236 3720538 3774452
57266 3774452 3829331 3885155 3942812 4003244 4066991 4134511 4205922 4280051 4354615 4427951 4500153
57255 4500153 4572355 4645522 4720250 4796974 4875979 4957720 5043278 5133555 5227564 5322454 5415883
57244 5415883 5507651 5598529 5688598 5777752 5866727 5956011 6043960 6127382 6204061 6273729 6336737
57233 6336737 6393171 6443775 6490651 6536071 6580797 6624070 6665133 6704534 6743973 6785048 6828216
57222 6828216 6873065 6919544 6968546 7021099 7077369 7136803 7198883 7263235 7329158 7395605 7461661
57211 7461661 7526810 7590822 7653720 7715687 7776722 7836567 7895326 7953906 8013316 8073541 8133536
57200 8133536 8192311 8249578 8305294 8359094 8410531 8459761 8507746 8555705 8604315 8653377 8702191
57189 8702191 8750171 8797025 8842550 8886622 8929339 8970756 9010381 9047303 9080992 9111738 9140221
57178 9140221 9167135 9193459 9220654 9250156 9282743 9318372 9356263 9394990 9432923 9468899 9502181
57167 9502181 9531766 9556402 9575803 9591750 9607772 9627802 9654401 9686781 9719838 9746131 9760148
57156 9760148 9760961 9750897 9732529 9707534 9677253 9642663 9603482 9558129 9504723 9441720 9367859 9282361
57144 9282361 9185544 9078922 8964751 8845823 8725551 8607693 8495820 8393076 8301923 8223555
57134 8223555 8157576 8102526 8056395 8016210 7977550 7935209 7884515 7822002 7745607 7655103 7552384
57123 7552384 7440906 7324931 7209217 7098365 6995335 6900844 6814876 6738196 6671456 6613401
57113 6613401 6561350 6513424 6469297 6429213 6394033 6366810 6353074 6358808 6388756 6446896 6537732
57102 6537732 6667070 6842976 7077047 7384529 7783193 8292877 8935923 9736416 10717865
57093 10717865 11901488 13305093 14940171 16808163 18899422 21192165 23644250 26183157
57085 26183157 28716161 31171005 33538854 35874423 38243999 40663449 43073246 45354612
57077 45354612 47358225 48928928 49933916 50296650 50016775 49158307 47816653 46091157
57069 46091157 44074725 41850224 39483233 37015276 34466860 31850675 29186596 26510506
57061 26510506 23873913 21335607 18949854 16757058 14780253 13026371 11489474 10154511
57053 10154511 9001130 8006924 7149858 6410118 5771034 5218375 4738909 4320224 3951994
57044 3951994 3626627 3338320 3081977 2853208 2648546 2465099 2300381 2152669 2020803
57035 2020803 1903128 1797188 1700867 1613355 1534589 1464360 1402309 1348111 1301186 1260914 1227748
57024 1227748 1203409 1189368 1185797 1192653 1210837 1241051 1281949 1330471 1383506 1437549 1486330 1520095
57012 1520095 1528675 1506208 1453947 1379457 1292984 1203418 1116444 1035183 961274 895016 835617
57001 835617 782482 735942 696177 662123 632365 606621 585297 567997 553588 541560 532218 525638
56989 525638 521446 519597 520292 523033 526761 531060 536300 542475 548809 554654 559697 562916 562325 556407 545314
56974 545314 530357 513041 494961 477899 463207 451220 441474 433338 426414 420833 417328 416615 418728
56961 418728 423415 431051 442378 457189 473970 491080 507573 522573 534510 541574 542669 537658
56949 537658 527031 511667 492765 471852 450823 431693 415723 402833 392224 383502 376894 372716
56937 372716 371339 373473 379800 390361 404833 423004 444110 466042 486448 504519 520460 533072
56925 533072 539235 536326 524168 504323 478790 450061 421173 394374 370071 347663 326969 308317
56913 308317 291894 277623 265251 254247 244195 235580 229374 225448 222355 219181 216608 215448 215196
56900 215196 215038 215302 216649 218550 219976 221219 223671 227945 233482 240020 248253 258772 271300 285221
56886 285221 300026 315022 329329 342574 354864 365756 373745 377269 375929 370538 362351 352586 342409
56873 342409 332965 325280 320175 318162 319368 323608 330600 340206 352658 368638 388960 414014 443435
56860 443435 476157 510599 544925 577472 606861 631335 648188 654669 649872 635370 613963 588358
56848 588358 561178 535215 512758 494913 482047 474583 472890 476893 486477 502139 524830 555393
56836 555393 594423 642041 696933 755768 814257 868830 916827 955345 980701 989423 979692 952216
56824 952216 910268 858864 803253 747782 695814 649946 611595 580600 555993 537351 525167
56813 525167 520150 522809 533654 553141 581045 616002 655651 696963 736539 771059 797674 813930
56801 813930 817607 807200 782855 746790 702787 655178 607854 563593 523928 489532 460643 437234
56789 437234 419119 406088 397823 393791 393683 398008 407610 422220 440004 458855 477625 495533 510880
56776 510880 521139 524171 518888 505077 483455 456014 425635 394983 365805 339058 315220 294391
56764 294391 276380 260780 246937 234188 222452 212299 204037 196985 190159 183461 177584 172807 168497
56751 168497 163982 159483 155862 153648 152476 151489 150246 149173 148961 149618 150459 151053 151692 152651 153467 153383 152216
56734 152216 150457 148763 147668 147415 147719 148016 148252 149016 150553 152203 153304 154098 155081 156005 156383 156600 157542
56717 157542 159224 160747 161642 162426 163685 165381 167308 169515 171933 174095 175621 176683 177772 179172 180780
56702 180780 182184 182918 182865 182433 182124 182008 181805 181332 180663 180017 179760 180243 181284 182112 182194 181817 181439 180871 179724
56683 179724 178313 177370 177022 176819 176683 177047 177999 179025 179782 180463 181176 181533 181188 180395 179770 179698 180138 180846
56665 180846 181784 183321 185805 188745 190882 191525 191483 192102 193643 195256 196299 196938 197528 198149 198839 199675 200539
56648 200539 201291 202168 203521 205241 206944 208561 210177 211479 212097 212375 213039 214131 215019 215420 215608 215581 214928
56631 214928 213688 212456 211407 210044 208171 206349 204995 203784 202366 200984 199837 198422 196123 193132
56617 193132 190264 188092 186579 185379 184236 183230 182705 182770 182940 182621 181847 181097 180513 179888 179358 179326 179602
56600 179602 179388 178409 177384 177047 177324 177840 178630 179901 181471 182870 183772 184123 184165 184480 185599 187408 189204
56583 189204 190417 190955 190989 190919 191433 192889 194654 195784 196353 197258 198653 199659 199957 200587 202530 205376 208132
56566 208132 210676 213586 217074 220939 225314 230746 237624 245981 255647 266177 276775 286644 295345 302691
56552 302691 308548 312850 315467 316045 314468 311554 308672 306451 304414 302070 299620 297279 294738 291874
56538 291874 289264 287309 285365 282404 278245 273595 269257 265758 263278 261371 259154 256359 253878 252688
56524 252688 252528 252186 250875 248783 246550 244710 243438 242288 240346 237128 233277 229994 227882 226659 225799
56509 225799 225029 224246 223306 221965 220049 217770 215785 214565 213769 212730 211547 211017 211381 211892 211890 211529 211080
56492 211080 210392 209611 209592 210779 212291 213016 213130 213667 214928 216235 217074 217580 217925 218005 217809 217490 217005 216190
56474 216190 215268 214882 215497 217004 218821 220207 220694 220536 220535 221157 222039 222631 222946 223283 223547 223364 222660 221709
56456 221709 220796 220195 220214 220792 221301 221237 220950 221307 222748 225042 227729 230377 232550 233972 234729 235054 235040 234759
56438 234759 234465 234399 234509 234568 234416 234029 233583 233514 234146 235197 236054 236591 237125 237562 237303 236239 235035 234121 233173
56419 233173 232061 231453 231813 232580 233074 233525 234383 235243 235425 235197 235456 236424 237502 238206 238512 238532 238545 239113 240420
56400 240420 241659 241855 241133 240548 240792 241715 242964 244395 245922 247526 249332 251226 252627 253165 253282 253649
56384 253649 254275 254804 255330 256228 257401 258474 259530 260989 262864 264752 266389 267683 268422 268575 268645 269066
56368 269066 269541 269630 269701 270497 271958 273300 274142 274823 275654 276646 277959 279845 282060 283910 285006 285495 285665
56351 285665 285771 286204 287265 288771 290284 291646 292939 294164 295303 296454 297575 298494 299473 301117 303310
56336 303310 305017 305828 306861 309145 311887 313542 314122 315192 317843 321812 326275 330303 332870 333800 334650
56321 334650 337258 341386 345103 347552 349872 353020 356181 358078 358729 359086 359737 360712 361956 363284 364300
56306 364300 364938 365834 367803 371145 375656 381014 387027 393772 401464 409937 418325 425669 431629 436294 439682
56291 439682 442041 444255 447097 450263 452944 455192 457891 461469 465561 469891 474671 480106 486320 493696
56277 493696 502456 511939 521174 530189 539868 550474 561299 571936 582957 595049 608257 622388
56265 622388 637552 654004 671991 691818 713634 737238 762708 791084 823758 861302 903545
56254 903545 950589 1002960 1060986 1124934 1195621 1273972 1359986 1452985 1552812 1659942 1774547
56243 1774547 1896247 2024382 2157413 2292266 2425461 2554854 2679219 2796350 2902877
56234 2902877 2995861 3073202 3132542 3171380 3188722 3185393 3162480 3120696 3061534 2987664 2901626
56223 2901626 2805190 2700335 2589705 2475591 2359499 2243041 2128194 2016326 1907987 1804048
56213 1804048 1705925 1614257 1528422 1447830 1372745 1303493 1239797 1181266 1127603 1078160 1032293
56202 1032293 990334 953007 919673 888514 858815 831738 808260 787639 768615 751011 735357
56191 735357 721811 710054 699575 689709 680126 671460 664527 658929 653610 648755 645661 644438 643459 641585
56177 641585 639446 637897 636737 635729 635457 636273 637609 639142 641518 645124 649307 653556 658359 664045 669947
56162 669947 675541 681411 688270 695982 704288 713477 723556 733762 743722 754298 766615 781040 797615
56149 797615 816564 837805 860888 886019 914432 947436 985917 1030765 1082618 1141108 1205754
56138 1205754 1277834 1359844 1452677 1554649 1663347 1776728 1892130 2006164 2116341 2221254
56128 2221254 2318883 2406717 2484241 2553335 2615459 2670267 2717538 2758118 2791763 2816077 2828788
56117 2828788 2829442 2818025 2794057 2758165 2712410 2657730 2592895 2517025 2431068 2335847 2231389
56106 2231389 2119817 2006417 1895865 1789548 1688395 1595755 1514882 1445522 1385481 1333971
56096 1333971 1291015 1255234 1224826 1199637 1180034 1164908 1152888 1144313 1139893 1138578 1138773 1140412
56084 1140412 1143884 1148189 1152207 1156593 1162449 1169338 1176490 1184600 1194468 1205206 1215728 1226578 1238361
56071 1238361 1249998 1260749 1272382 1286960 1303869 1321309 1339289 1358771 1379284 1399811 1420801
56060 1420801 1442911 1465048 1485952 1506383 1527429 1548092 1566993 1585050 1604013 1623708 1643130
56049 1643130 1662813 1683708 1705239 1726920 1750211 1776217 1803299 1829677 1856602 1886086 1917336
56038 1917336 1948499 1980175 2014023 2049591 2085771 2123723 2165042 2208606 2252539 2297615 2345380
56027 2345380 2394825 2444456 2495835 2551241 2609526 2668215 2727949 2790840 2856103 2921593 2988156
56016 2988156 3058277 3131874 3207650 3286992 3372107 3461770 3553334 3647509 3746773 3850781 3957998
56005 3957998 4070103 4189830 4316077 4446150 4581223 4724516 4875802 5032996 5197388
55996 5197388 5371889 5555892 5747482 5948725 6163018 6389320 6625124 6872943 7137528
55987 7137528 7419114 7716133 8031950 8371694 8735219 9121019 9534300 9982885 10468009
55978 10468009 10988074 11548715 12159842 12825903 13549248 14340073 15212408 16173844 17231053
55969 17231053 18402286 19712455 21180686 22827455 24690692 26821095 29268567 32093083
55961 32093083 35386842 39270524 43877699 49365885 55931782 63784257 73109816 84099989
55953 84099989 97007340 112142724 129842213 150479826 174409269 201629424 231329024
55946 231329024 261849079 291280008 318105195 341131346 358820390 368985967 369489373
55939 369489373 359442713 339873932 313371299 283103929 251902721 221778119 193870735
55932 193870735 168657458 146219028 126441866 109133318 94087749 81117190 70039603
55925 70039603 60651902 52731663 46064227 40456628 35732050 31731671 28326869 25418134
55917 25418134 22920407 20759000 18877611 17236348 15798654 14528579 13399921 12396707
55909 12396707 11502678 10698850 9971768 9314791 8719841 8176022 7677173 7222468 6808169
55900 6808169 6426204 6071930 5745900 5446709 5169075 4910231 4671438 4451742 4246512
55891 4246512 4053571 3874753 3710028 3555812 3410404 3275525 3151157 3034243 2923840
55882 2923840 2822338 2730147 2644134 2562734 2487887 2420449 2358255 2300117 2247266 2199316 2152893
55871 2152893 2105685 2058039 2009389 1957141 1900441 1841453 1781743 1721010 1660272 1602448 1548556
55860 1548556 1496932 1447330 1402130 1362215 1325226 1289399 1255835 1225517 1197229 1169868 1144007
55849 1144007 1119821 1096126 1072603 1050261 1028757 1006006 981515 957359 934823 912755 890251
55838 890251 868326 847883 828531 810390 794556 780830 767389 753609 740855 729810 719533
55827 719533 709845 701950 695829 689564 682136 674487 667087 659065 650523 642975 636560 629427 620862 612402
55813 612402 604966 597654 590393 584899 581708 579089 576303 575188 576826 579363 581016 582834 586490 591471
55799 591471 596482 601638 607225 611983 614581 615329 614664 611412 604327 594149 582573 570299 557487 544883
55785 544883 533137 522083 511779 503071 496165 489978 483874 478511 473915 468356 460430 450915 441403
55772 441403 432546 424782 419191 416156 414380 412496 410500 408639 406426 403861 402022 401058 399091 394651
55758 394651 388820 383446 378486 372732 366018 359067 352109 345202 339120 334481 330692 326937 323361 320175
55744 320175 316565 311757 306265 300876 295373 289494 284103 279954 276221 271696 266730 262595 259599 257184
55730 257184 255253 254080 253407 252854 252658 252905 252645 250968 248355 245875 243654 241304 239187 237930 237169 236039
55714 236039 234532 233225 232041 230461 228716 227715 227929 229157 231072 233191 234712 235264 235446 235913 236312
55699 236312 235882 234588 232921 231042 228965 227106 225883 225133 224565 224359 224697 225271 225809 226466 227171 227404 227318
55682 227318 228211 231016 235110 239388 243683 248198 252431 255812 258726 261771 264537 266112 266286 265413 263749
55667 263749 261803 260594 260515 260613 259999 259159 258832 258497 257416 256414 257040 259347 261980 264150 266103 267839
55651 267839 268796 268795 268171 266959 264963 262401 259525 255848 250851 245109 239557 233994 227683 221129 215778
55636 215778 211960 208555 204834 201197 197844 194143 189932 186282 184243 183527 182983 181839 180157 178521 177531
55621 177531 177184 176755 175736 174699 174580 175271 175757 175543 175076 174713 174198 173307 172205 170963 169447 167843 166612
55604 166612 165741 164711 163332 161984 160889 159815 158620 157430 156154 154516 152776 151740 151747 152141 152068 151351
55588 151351 150353 149438 148864 148816 149310 150242 151636 153614 156128 159001 162217 165846 169720 173524 177249 181322
55572 181322 186401 193159 201992 212522 223641 234426 244824 255102 265030 274088 282032 288634 293132
55559 293132 294732 293533 290318 285581 279422 272210 264556 256634 248228 239459 230836 222604 214730 207539
55545 207539 201648 197190 193702 190886 188859 187597 186752 186134 185766 185364 184438 183068 181939 181344 180772 179766
55529 179766 178603 177682 176673 174793 171703 167770 163552 159388 155489 152153 149662 147881 146126 143762
55515 143762 140961 138559 136996 135808 134398 132817 131357 129860 128049 126202 124749 123431 121634 119597
55501 119597 118513 119199 121143 122997 123653 122780 120840 118818 117657 117685 118541 119592 120274 120329 119986 119727 119654
55484 119654 119332 118547 117843 117880 118559 119309 119927 120557 121019 120871 120122 119337 119002 119167 119657 120218 120458 120035 118917
55465 118917 117271 115309 113485 112497 112679 113607 114691 115781 116869 117673 118072 118502 119238 119729 119360 118520 118115
55448 118115 118315 118591 118711 118869 118958 118645 118047 117538 116985 115999 114846 114212 114140 114128 114217 114995 116389 117466 117715
55429 117715 117641 117802 118088 118284 118638 119407 120376 121150 121518 121426 121026 120811 121136 121662 121898 122210 123478 125736 127981
55410 127981 129464 130286 130613 130344 129854 129992 130773 130955 129642 127611 126313 126041 125854 125001 123713 122643 122034
55393 122034 121534 120642 119338 118207 117794 117992 118370 118869 119673 120544 120974 120946 120833 120614 119942 119038 118671 119059
55375 119059 119533 119528 119146 118582 117772 116919 116525 116588 116500 115986 115356 114627 113405 111998 111515 112230 112882 112480 111798
55356 111798 112114 113286 114254 114811 115571 116523 116942 116755 116747 117228 117523 117203 116909 117343 118032 117820 116374 114553
55338 114553 113267 112526 111934 111703 112542 114450 116258 116791 116109 115107 114242 113393 112776 113040 114280 115685 116474
55321 116474 116634 116489 116163 115777 115621 115793 116063 116317 116614 116654 115870 114350 113047 112621 112634 112338 111686 111142 110951
55302 110951 111089 111478 111836 111743 111287 111195 111947 113181 114333 115282 115988 116178 115968 116147 117180 118466 119310 120100
55284 120100 121606 123545 124767 124713 123849 122820 121997 121802 122594 124078 125450 126268 126644 126581 125708 123913 121730
55267 121730 119914 118868 118546 118559 118406 117936 117584 117808 118305 118234 117266 116063 115548 115946 116660 116950 116617 116126
55249 116126 116108 116723 117568 118188 118507 118667 118746 118839 119188 119947 120869 121393 121018 119605 117536 115576 114302 113582
55231 113582 112951 112554 113203 115178 117394 118244 117160 114997 113017 111752 110787 109496 107943 106986 107323 108576
55215 108576 109778 110645 111791 113624 115683 117269 118166 118486 118426 118457 119153 120471 121732 122618 123526 124596 125213
55198 125213 125070 124900 125332 125681 124790 122685 120468 118919 118033 117701 117876 118185 118230 118285 119007 120407 121793 122686
55180 122686 123138 123201 122780 122082 121584 121411 121272 121109 121266 121852 122447 122643 122546 122592 123107 124113 125293 126154 126474
55161 126474 126533 126737 127143 127578 128014 128441 128622 128356 127897 127693 127862 128235 128736 129359 129937 130267 130270 129768 128486
55142 128486 126667 125298 125098 125607 125848 125584 125281 125108 124817 124552 124903 126003 127166 127627 127246 126409 125678
55125 125678 125566 126225 127317 128435 129512 130498 130909 130264 128801 127268 126130 125459 125296 125506 125535 125089 124909
55108 124909 126027 128293 130451 131706 132388 132945 133197 132962 132657 132764 133195 133578 133787 133857 133767 133638 133837 134601
55090 134601 135703 136698 137306 137509 137458 137395 137517 137886 138534 139423 140201 140383 140084 140134 140922 141608 141116 139610 138202
55071 138202 137477 137195 137235 137782 138514 138674 138242 138121 138764 139378 139003 137789 136719 136458 136819 137058 136524 135364
55053 135364 134618 135122 136291 136611 135488 133999 133588 134594 136266 137645 138130 137683 136828 136148 135668 135044 134315
55036 134315 133900 133883 133953 134128 134764 135694 136107 135619 134788 134260 134061 133992 134088 134339 134533 134694 135095 135516 135152 133622
55016 133622 131514 129663 128479 128212 129054 130577 131795 132283 132610 133239 133774 133808 133749 134128 134681 134868 134710 134468
54998 134468 134023 133309 132908 133472 134908 136724 138760 140958 142878 144103 144742 144945 144456 143352 142667 143308
54982 143308 144741 145660 145663 145365 145132 144725 144137 143777 143727 143669 143666 144220 145360 146426 146979 147353 148066 149212 150571
54963 150571 151835 152533 152264 151235 150223 149817 149981 150405 150926 151505 152117 152757 153331 153597 153500 153422 153665 153778
54945 153778 152993 151381 150001 149666 149983 149929 149113 148175 148028 148905 150184 151083 151445 151729 152271 152962 153780 155215
54927 155215 157720 161023 164472 167865 171501 175563 179939 184594 189609 194892 200247 205643 210925 215287
54913 215287 217613 217578 216068 214325 212906 211465 209231 205621 200698 195224 190129 185875 182331 179100 175798
54898 175798 172248 168710 165720 163414 161250 158820 156714 156009 156956 158673 160164 161167 162017 163172 165012
54883 165012 167644 170736 173772 176581 179421 182640 186599 191742 198208 205327 211990 217568 222114 225675
54869 225675 227925 228597 227779 225619 222118 217358 211652 205414 199206 193814 189718 186443 182962 178897 174839
54854 174839 171442 168818 166975 166051 165723 165046 163475 161525 159907 158504 156839 155101 153885 153125 152106
54839 152106 150560 149000 147840 146819 145629 144597 144326 144885 145673 146013 145637 144713 143623 142728 142211 142020
54823 142020 141962 141884 141857 142195 143161 144565 145779 146311 146260 146065 145924 145768 145719 146161 147162 148232 148984 149751 151119
54804 151119 152891 154121 154325 154184 154690 155889 156953 157306 157141 156852 156556 156386 156689 157517 158210 158031 157126
54787 157126 156451 156718 157707 158659 159028 158747 158022 157135 156438 156344 157156 158870 161216 163971 167145 170728 174450
54770 174450 178102 182037 186944 193000 199686 206602 213958 221860 229569 236079 241260 245795 249992 253128
54756 253128 254164 252700 249172 244403 239141 233794 228452 223157 218007 212912 207531 201853 196613 192614
54742 192614 189704 187015 184240 182005 180727 179753 178226 176391 175383 175771 176873 177636 177775 177794 178192 179007
54726 179007 180117 181677 184059 187454 191775 196930 202974 209822 216904 223247 227868 230159 230110 228416 226153
54711 226153 224011 221736 218488 213822 208226 202684 197810 193478 189248 185083 181480 178791 176609 174130
54697 174130 171089 167981 165341 163267 161796 161186 161391 161683 161314 160309 159130 157858 156326 154900 154378
54682 154378 155013 156153 156991 157238 156990 156435 155870 155592 155516 155162 154217 152936 151901 151561 152011 152944 153787 154076
54664 154076 153742 152913 151663 150273 149475 149866 151087 152114 152411 152320 152309 152401 152496 152671 152916 153046 153128 153528 154260
54645 154260 154652 154002 152313 150229 148575 148069 148927 150405 151225 150824 149916 149508 149769 150230 150641 151066 151393
54628 151393 151302 150702 149797 148840 148114 147985 148573 149468 150121 150475 150874 151483 152167 152895 153852 155048 156117 156681
54610 156681 156765 156761 157032 157533 157815 157467 156561 155574 154871 154536 154666 155464 156826 158207 159172 159813 160332 160556 160296
54591 160296 159917 160057 160823 161749 162469 162969 163188 162849 161879 160575 159208 157815 156617 156238 157048 158454 159290
54574 159290 158967 157944 156993 156386 156006 155886 156154 156520 156371 155556 154703 154474 154834 155326 155750 156158 156475 156640
54556 156640 156999 157921 159071 159646 159397 158892 158705 158958 159775 161404 163477 164813 164584 163330 162317 162209 162866
54539 162866 164078 165909 168414 171468 174804 177887 179956 180625 180295 179709 179269 179105 179385 179973 180091 179006
54523 179006 177045 175349 174595 174489 174477 174306 173744 172416 170287 167995 166408 165976 166512 167329 167559 166812 165637
54506 165637 164992 165130 165402 165250 164889 164702 164463 163729 162758 162477 163392 164901 165845 165587 164470 163318 162670 162517
54488 162517 162675 163137 163910 164685 164997 164779 164544 164926 166172 168084 170199 171929 172788 172758 172332 172064 172132 172432
54470 172432 172982 173957 175398 177111 178976 181101 183476 185547 186478 185885 184157 181975 179840 178238 177886
54455 177886 179205 181595 183757 184930 185384 185582 185403 184527 183137 181710 180392 179084 177939 177201 176660 175805
54439 175805 174559 173358 172464 171665 170819 170230 170289 171056 172350 173930 175416 176369 176730 176947 177441 178148 178766
54422 178766 179231 179681 180080 180179 179829 179203 178726 178882 179933 181647 183411 184756 185697 186462 187040 187217 186976 186603
54404 186603 186369 186305 186375 186717 187536 188753 189943 190693 190986 191174 191588 192280 193167 194286 195796 197701 199669
54387 199669 201182 201900 201984 201978 202268 202659 202637 202074 201474 201369 201645 201633 200817 199338 197864 196999 196668 196072 194469
54368 194469 192132 190275 189855 190710 192076 193568 195207 196776 197794 198178 198478 199344 201066 203631 206788
54353 206788 209945 212443 214175 215702 217557 219630 221367 222365 222639 222457 222072 221507 220513 218829 216481 213763
54337 213763 211030 208616 206759 205291 203576 201236 198854 197456 197218 197244 196773 196014 195498 195203 194817 194416
54321 194416 194237 194019 193280 192226 191713 192077 192524 192127 191150 190793 191540 192205 191128 188227 185352 184314 184966
54304 184966 185676 185421 184746 184645 185262 185995 186344 186193 185638 184961 184539 184402 184132 183564 183246 183752 184786 185540
54286 185540 185816 186146 186809 187359 187327 186886 186522 186420 186468 186598 186829 187161 187673 188554 189806 191029 191732 191845 191830
54267 191830 192314 193655 195673 197612 198537 198073 196807 195815 195740 196396 197214 197866 198442 199237 200485 202187 204012
54250 204012 205372 205861 205691 205587 206076 206960 207668 208034 208421 209007 209307 208728 207385 205995 204960 203989 202717
54233 202717 201305 200123 199119 197937 196569 195460 194895 194692 194690 195178 196462 198136 199275 199364 198746 198041 197457
54216 197457 196862 196298 196033 196181 196539 196845 197037 197187 197379 197711 198261 198899 199260 199039 198348 197677 197476 197784 198275
54197 198275 198543 198281 197332 195845 194478 194145 195187 196807 197667 197114 195638 194155 193235 193104 193820 194987
54181 194987 195616 194880 193050 191328 190756 191528 193175 194951 196108 196295 195869 195530 195575 195760 195858 195924 196008 196030 196011
54162 196011 196033 195897 195305 194439 193817 193411 192580 191210 190219 190356 190989 190782 189248 187031 184983 183698 183688 185113
54144 185113 187253 189018 190157 191302 192681 193565 193377 192655 192330 192474 192446 192064 191936 192539 193525 194230 194581
54127 194581 195116 196180 197415 198258 198755 199510 200753 201864 202164 201929 202101 203051 204168 204764 204900 205018 205203
54110 205203 205250 205224 205504 206279 207334 208327 209145 209942 210960 212229 213372 213848 213516 212827 212269 211841 211285 210721
54092 210721 210695 211608 213260 214981 216060 216192 215706 215269 215170 215027 214523 214280 215493 218618 222811 226927 230741
54075 230741 234957 240197 246315 252641 258700 264624 270827 277236 282946 286920 288958 289662 289435 287956 284866
54060 284866 280496 275573 270567 265745 261556 258345 255748 253001 249903 247067 245125 244146 243930 244456 245707
54045 245707 247372 249011 250421 251707 253133 254966 257328 260142 263458 267722 273365 280132 287344 294940
54031 294940 303642 313711 324099 333433 341475 349007 356509 363645 369982 375496 380226 383970 386572 388186
54017 388186 389111 389654 390198 391058 392125 392963 393291 393036 391937 389677 386594 383718 381667 379923 377640 374877
54001 374877 372466 370786 369229 366967 363842 360255 356485 352342 347457 341740 335491 329128 322877 316775
53987 316775 310866 305216 299730 294239 288918 284394 281224 279285 277857 276269 274350 272384 270840 270120
53973 270120 270283 270917 271396 271355 270869 270172 269366 268467 267613 266987 266554 266064 265425 264919 264828 265012 265110 265181 265777 267207
53953 267207 269095 270967 273004 275827 279619 283783 287420 289897 291175 292055 294009 298096 303867 309764
53939 309764 314746 319164 323904 329292 335148 341365 347924 354592 361065 367277 373229 378746 383787 388804
53925 388804 394444 401028 408688 417820 428972 442250 457106 472636 487858 501886 514200 524628
53913 524628 532852 538259 540742 541393 541715 542262 542666 542896 543619 545069 546408 546718 546093 545148 543873 541638
53897 541638 538168 533900 529347 524586 519486 514077 508463 502578 496175 489026 481086 472518 463601 454592
53883 454592 445712 437214 429317 421955 414748 407383 399960 392836 386190 379877 373685 367589 361793 356557
53869 356557 351959 347714 343326 338562 333734 329317 325366 321495 317419 313242 309128 305006 300815 296864
53855 296864 293607 291087 288880 286599 284243 281957 279752 277670 276032 275161 274854 274367 273091 271121 269100
53840 269100 267578 266625 265954 265297 264629 264092 263807 263804 264158 265010 266329 267656 268354 268150 267360 266484 265742 265113
53822 265113 264703 264820 265623 266808 267826 268416 268854 269609 270835 272291 273667 274806 275652 276310 277272 279229
53806 279229 282364 286061 289633 293125 297044 301533 306356 311626 317869 325185 332886 340273 347379 354698
53792 354698 362448 370341 377765 384019 388738 392331 395670 399099 402043 403764 404119 403412 402000 400403 399214
53777 399214 398336 396737 393581 389267 384769 380292 375321 369735 364022 358473 352966 347621 342864 338657
53763 338657 334323 329397 324134 319033 314391 310496 307627 305534 303447 300950 298377 296021 293479 290232
53749 290232 286481 282891 279761 276947 274435 272527 271480 271234 271495 271877 272059 271975 271776 271517 271078 270472 269927
53732 269927 269498 268853 267728 266363 265232 264585 264469 264953 266026 267404 268767 270086 271515 273097 274792
53717 274792 276600 278402 279908 281105 282557 284846 287803 290656 292905 294633 295986 296883 297420 298140 299518
53702 299518 301404 303313 305161 307370 310271 313731 317503 321625 326129 330542 334137 336771 339092 341688
53688 341688 344355 346506 348019 349212 350168 350613 350526 350403 350753 351629 352656 353155 352310 349801 346482 343953
53672 343953 343142 343627 344453 345097 345399 345199 344593 344115 344144 344384 344416 344374 344529 344530 343770 342326 340829 339513 338137
53653 338137 336854 336323 336664 336999 336486 335359 334534 334491 334945 335334 335277 334719 334018 333853 334738 336520 338492 340032
53635 340032 341132 342326 344139 346544 348985 350940 352372 353541 354586 355566 356780 358617 361071 363666
53621 363666 365990 368036 370022 372214 374974 378567 382783 387074 391242 395596 400245 404698 408554 412191
53607 412191 416301 420979 425795 430573 435496 440493 445182 449509 453913 458606 463191 467272 471048 474944
53593 474944 478964 482792 486256 489286 491635 493172 494273 495403 496296 496027 493990 490343 485497 479771 473840
53578 473840 468867 465622 463672 461908 459752 457466 455503 453987 452773 451592 450125 448259 446252 444354
53564 444354 442443 440392 438662 437980 438402 439219 439870 440461 441253 442173 443070 443981 444870 445564 446229 447476 449572
53547 449572 451866 453459 454183 454574 455144 456124 457709 460013 462817 465723 468582 471528 474739 478426 482933
53532 482933 488484 494911 501881 509298 517176 525311 533449 541726 550609 560401 571039 582265 593768
53519 593768 605388 617504 630963 646135 662190 677929 693325 709689 728195 748710 770202
53508 770202 791900 813872 836807 861409 887729 914975 942206 969257 996651 1024576 1052347
53497 1052347 1079037 1104306 1128472 1152029 1175232 1197959 1219924 1241125 1262020 1282979 1303791
53486 1303791 1324134 1344331 1364946 1385662 1405422 1423926 1442240 1461464 1481380 1500916 1519452
53475 1519452 1537122 1554256 1571112 1587789 1603712 1617425 1627572 1634117 1638148 1640588 1641532 1640670 1637726
53462 1637726 1632444 1624693 1614801 1603398 1590803 1576911 1561808 1546136 1530640 1515499 1500234 1484113
53450 1484113 1466630 1447812 1428112 1407923 1387232 1365922 1344281 1322934 1302345 1282675 1264110
53439 1264110 1246902 1231040 1216256 1202536 1190302 1179891 1171086 1163370 1156456 1150424 1145521 1141999
53427 1141999 1139979 1139303 1139622 1140877 1143535 1148177 1154880 1163155 1172412 1182371 1193141 1205115 1218752 1234241
53413 1234241 1251371 1269884 1289927 1311997 1336391 1362877 1390991 1420504 1451466 1483826 1517256
53402 1517256 1551484 1586773 1623920 1663679 1706169 1750918 1797406 1845503 1895368 1947090 2000565
53391 2000565 2055626 2112120 2169872 2228669 2288264 2348279 2408027 2466621 2523433 2578429 2632020
53380 2632020 2684565 2736043 2786118 2834329 2880179 2923126 2962608 2998150 3029544 3056913 3080506
53369 3080506 3100319 3115899 3126603 3131969 3131719 3125504 3112913 3093765 3068261 3036771 2999706 2957697
53357 2957697 2911723 2862866 2811988 2759700 2706458 2652586 2598342 2544067 2490151 2436835 2384390
53346 2384390 2333584 2285448 2240091 2196117 2151834 2106907 2062234 2018315 1974618 1930773 1887582
53335 1887582 1846303 1807438 1770834 1736589 1705163 1676635 1650377 1625596 1601913 1579403 1558331
53324 1558331 1538804 1520512 1502860 1485495 1468487 1451747 1434639 1416769 1399014 1383022 1369450
53313 1369450 1357258 1345078 1332847 1321650 1312371 1305101 1299671 1296042 1293958 1292785 1292164 1292572 1294812
53300 1294812 1299019 1304606 1311274 1319691 1330838 1344859 1360913 1378165 1396603 1416772 1438952 1462850
53288 1462850 1487951 1513940 1540756 1568347 1596367 1624018 1650316 1674723 1697587 1719723 1741429
53277 1741429 1761954 1780059 1795049 1807144 1816901 1824448 1829307 1830849 1828784 1823345 1815154 1804866 1792709
53264 1792709 1778322 1761215 1741465 1719731 1696501 1671645 1644966 1616908 1588263 1559300 1529688
53253 1529688 1499390 1469133 1439725 1411211 1383001 1354671 1326366 1298494 1271235 1244318 1217183
53242 1217183 1189456 1161306 1133279 1105766 1078844 1052581 1027132 1002399 978006 953874 930564
53231 930564 908723 888416 869272 851088 834048 818525 804937 793428 783298 773028 761468
53220 761468 748860 736201 723715 710577 696142 680776 665248 649887 634630 619500 604685
53209 604685 590431 577049 564671 552827 540698 528149 516157 505826 497254 489706 482544 475478
53197 475478 468213 460512 452621 445018 437652 429973 421869 414080 407330 401461 395799 390061 384431 378896
53183 378896 373131 367222 361962 357996 354878 351474 347357 343444 340988 340145 339846 338983 337363 335482 333728
53168 333728 332057 330295 328429 326580 324896 323496 322382 321327 320012 318361 316702 315447 314600 313664 312145
53153 312145 310134 308272 307131 306693 306556 306522 306773 307421 308133 308391 308013 307269 306511 305916 305592 305713 306332 307075
53135 307075 307317 306775 305878 305340 305411 305737 306001 306463 307626 309567 311860 314101 316199 318174 320001 321764
53119 321764 323639 325511 326900 327478 327455 327181 326614 325551 324261 323413 323303 323490 323305 322466 321134 319611 318097
53102 318097 316524 314494 311657 308277 305197 303077 301896 301373 301554 302626 304330 305991 307100 307555 307365
53087 307365 306476 304962 303107 301216 299534 298340 297764 297478 296922 296027 295391 295499 296087 296591 296946 297472 298101
53070 298101 298268 297737 297151 297444 298808 300501 301658 302112 302318 302523 302226 300646 297653 294011 290688 288172
53054 288172 286491 285531 285042 284643 284207 284096 284671 285736 286814 287840 289126 290716 292304 293730 295024 295928
53038 295928 295986 295288 294548 294184 293901 293474 293312 293681 293926 293217 291815 290882 291121 292182 293326 294121 294496 294694
53020 294694 295164 296073 296871 296884 296332 296163 296846 297923 298875 299691 300362 300592 300573 301324 303470 306103 307683 307839
53002 307839 307459 307158 306633 305701 304983 304994 305240 304906 304074 303530 303537 303546 303170 302811 303082 304083 305528 307180 308831
52983 308831 310231 311506 313402 316525 320346 323489 325185 326072 327344 329482 332044 334385 336133 337095 337173
52968 337173 336567 335847 335580 335816 335984 335450 334269 333371 333776 335595 337946 339802 340696 340668 340000 339193 338734 338499
52950 338499 337702 335848 333493 331589 330306 329004 327288 325479 324024 322939 321994 321023 319886 318489 317013
52935 317013 315771 314708 313350 311477 309532 308136 307456 307267 307432 307976 308780 309402 309281 308175 306489 305108
52919 305108 304712 305238 306188 307269 308411 309303 309506 309079 308552 308122 307451 306483 305854 306037 306633 307019 307224 307528
52901 307528 307655 307150 306403 306395 307365 308415 308616 307924 306826 305711 304921 304898 305754 306959 307905 308603 309460 310460
52883 310460 310969 310435 309027 307472 306408 305996 306041 306282 306496 306457 306022 305358 304948 305207 306126 307415 308873 310448
52865 310448 312040 313516 314959 316652 318708 320869 322808 324473 326010 327425 328490 328944 328635 327483 325484
52850 325484 322865 320161 317909 316137 314296 311868 308988 306266 304006 301887 299512 296981 294707 292855
52836 292855 291248 289718 288251 286774 285094 283099 280922 278930 277703 277868 279630 282391 285085 286955
52822 286955 287943 288364 288477 288424 288318 288263 288352 288656 289015 288944 288064 286694 285691 285579 286148 287000 287996 288923 289214
52803 289214 288642 288023 288545 290296 292041 292584 291897 290659 289262 287749 286386 285606 285341 284934 283895 282441
52787 282441 281108 280090 279175 278151 277028 275957 275105 274607 274520 274817 275475 276500 277863 279525 281494 283646
52771 283646 285442 286169 285677 284634 283790 283243 282738 282304 282069 281691 280723 279543 279192 280030 281200 281779 281879
52754 281879 282162 282765 283338 283813 284465 285313 286062 286572 286941 287144 287179 287587 289259 292427 296156 299079 300480
52737 300480 300633 300399 300619 301641 303187 304711 305956 307041 308113 309185 310332 311756 313532 315501 317469
52722 317469 319285 320657 321213 320950 320386 319994 319626 318709 316913 314478 311971 309883 308441 307571 307014 306529
52706 306529 306024 305449 304686 303697 302791 302556 303335 304745 305872 306055 305435 304666 304223 304215 304754 306077 308115 310256
52688 310256 311789 312452 312364 311687 310687 309943 310040 310998 312218 313018 313119 312786 312683 313377 314620 315323 314632 312967
52670 312967 311590 311282 311768 312273 312119 310973 309154 307732 307646 308587 309390 309651 310179 311579 313234 314314 315111
52653 315111 316555 318804 321146 323127 325012 327065 329053 330601 331566 331877 331405 330212 328678 327120 325416
52638 325416 323149 320129 316814 314219 313223 313769 314879 315644 316102 316966 318619 320701 322594 323993 324960 325626
52622 325626 325982 325898 325313 324396 323417 322461 321477 320645 320334 320471 320280 319115 317392 316219 316134 316603 316840 316721
52604 316721 316717 317217 318182 319320 320330 321002 321205 320933 320365 319833 319625 319840 320527 321910 324193 327067 329715
52587 329715 331474 332286 332404 332004 331349 330999 331375 332212 332840 332953 332803 332740 332927 333430 334216 335016 335523 335738 335878
52568 335878 335968 335876 335694 335670 335679 335199 334031 332725 332001 331879 331599 330377 328127 325505 323339 322020 321426 321280
52550 321280 321385 321460 321108 320191 319071 318223 317784 317768 318458 320137 322478 324587 325733 325765 324967 323798 322724
52533 322724 321919 321149 320232 319504 319429 319924 320570 321362 322673 324458 326107 327266 328140 328855 329124 328978 329329 331252
52515 331252 334824 338967 342325 344279 345365 346776 349144 351805 353669 354675 355724 357155 358166 358064
52501 358064 357242 356288 354910 352532 349445 346443 343635 340533 337269 334814 333836 333961 334425 334950 335705 336690
52485 336690 337472 337512 336719 335664 335035 334866 334676 334483 335088 336918 339097 340392 340782 341340 342713 344480 346028
52468 346028 347345 348782 350572 352759 355160 357371 359269 361472 364640 368278 370942 371815 371406 370448 368862
52453 368862 366324 363221 360386 358147 356218 354289 352266 350090 347746 345377 343086 340757 338358 336264
52439 336264 334930 334311 333831 332891 331296 329443 328214 328369 329704 331094 331695 331854 332423 333461 334190 334136 333711
52422 333711 333570 333916 334584 335436 336367 337206 337836 338290 338662 339105 339961 341584 343890 346344 348636 351207 354816
52405 354816 359752 365740 372579 380493 389659 399631 409533 418821 427558 435791 442821 447404 448729 447004
52391 447004 442941 436953 429143 420017 410801 402795 396499 391525 387312 383771 381283 380220 380569 381913
52377 381913 383651 385276 386642 388040 389912 392420 395418 398934 403471 409476 416531 423363 428771 432352
52363 432352 434247 434603 433649 432046 430654 429782 428966 427623 425779 424063 423125 423186 423997 425048 425879 426333 426620
52346 426620 427123 428109 429566 431265 433012 434909 437381 440826 445165 449834 454311 458616 463196 468400 474226
52331 474226 480587 487595 495443 504139 513616 524022 535616 548307 561584 575078 588999 603727
52319 603727 619151 634740 650245 665986 682347 699279 716433 733584 750761 768187 786271
52308 786271 805523 826251 848345 871401 894891 918213 940899 963052 985377 1008496 1032300
52297 1032300 1056172 1079527 1101779 1122027 1139479 1154260 1167207 1178604 1187638 1193473 1196421 1197564
52285 1197564 1197493 1196050 1193147 1189265 1184990 1180590 1176237 1172239 1168778 1165712 1162881 1160352 1158096 1155758
52271 1155758 1153188 1151049 1150403 1151695 1154446 1157931 1161801 1166030 1170812 1176743 1184630 1194650 1205941 1217419
52257 1217419 1228953 1241375 1255442 1271160 1288123 1306084 1324945 1344335 1363438 1381373 1397767
52246 1397767 1413000 1427657 1441591 1453733 1463106 1469871 1475003 1479052 1481689 1482514 1481749 1479850 1476900
52233 1476900 1472858 1468126 1463358 1458645 1453291 1446569 1438511 1429836 1421184 1412545 1403486 1393872 1384209 1375189
52219 1375189 1367030 1359478 1352351 1345775 1339932 1334941 1331066 1328630 1327566 1327378 1327746 1328850 1330885 1333690
52205 1333690 1337132 1341457 1346740 1352326 1357413 1362087 1367202 1373219 1379710 1386119 1392594 1399851 1408402 1418024
52191 1418024 1427807 1436784 1444760 1452357 1460009 1467097 1472536 1476028 1478190 1479484 1479676 1478404 1475533 1470721
52177 1470721 1463402 1453706 1442876 1432206 1421918 1411609 1401421 1392095 1384050 1376989 1370429 1364120 1357986
52164 1357986 1352204 1347398 1344326 1343158 1343395 1344548 1346522 1349165 1351870 1353978 1355416 1356577 1357609 1358099
52150 1358099 1357533 1355924 1353886 1352190 1351373 1351676 1353102 1355380 1357975 1360332 1362159 1363396 1364044 1364186 1364037
52135 1364037 1363704 1362958 1361656 1360380 1360199 1361691 1364605 1368652 1374055 1381005 1389192 1398467 1409603 1423665
52121 1423665 1440734 1459835 1479979 1500717 1521808 1543071 1564630 1586669 1608813 1630375 1651328
52110 1651328 1672438 1694182 1716133 1737695 1758802 1779520 1799572 1818870 1838151 1858413 1879847
52099 1879847 1901708 1923027 1943110 1961596 1978475 1993816 2007146 2017400 2023923 2027119 2027537 2024756
52087 2024756 2017962 2007438 1994534 1980199 1964482 1947684 1930959 1915236 1900293 1885504 1870941
52076 1870941 1857142 1844310 1832524 1822430 1814895 1809992 1806865 1804635 1803031 1802298 1802997 1805790 1810882
52063 1810882 1817621 1825159 1833528 1843578 1855829 1869885 1885040 1900852 1916921 1932761 1948247 1963731
52051 1963731 1979246 1993984 2006919 2017595 2025922 2031588 2034230 2033940 2031050 2025615 2017705 2008051 1997698
52038 1997698 1986961 1975294 1962285 1948225 1933565 1918404 1902823 1887117 1871324 1854969 1837726
52027 1837726 1820012 1802529 1785500 1768820 1752645 1737226 1722270 1707028 1691070 1674595 1658013
52016 1658013 1641691 1626120 1611737 1598409 1585432 1572349 1559444 1547269 1535967 1525189 1514319
52005 1514319 1502542 1489105 1473850 1457240 1439542 1420300 1399058 1376334 1353282 1330441 1307417
51994 1307417 1283819 1259949 1236363 1213294 1190814 1169159 1148387 1127963 1107106 1085549 1063657
51983 1063657 1041878 1020322 998821 977155 955265 933495 912584 893168 875237 858266 841846
51972 841846 826021 811091 797369 785145 774627 765901 759173 754992 753841 755404 758570 762300 766209
51959 766209 770222 774091 777523 780402 782522 783292 782115 778857 773683 766777 758762 751170 745726 742950
51945 742950 741882 741364 741308 742597 746183 752444 761080 771322 782368 793799 805519 817354 828938
51932 828938 839906 849744 857466 861985 863092 861627 858344 853019 845015 834316 821454 806814 790703
51919 790703 774003 758057 743725 731045 719924 710698 703829 699512 697883 699226 703574 710248 718116
51906 718116 726279 734289 741804 748301 753186 756027 756626 754970 751188 745510 738128 729075 718252 705609
51892 705609 691280 675548 658796 641653 625081 609989 596605 584508 573431 563813 556312 551041
51880 551041 547727 546459 547779 551893 558236 566028 574956 585058 596168 607736 619096 629644 638766
51867 638766 645817 650314 652198 651841 649771 646336 641721 636297 630689 625337 620206 615285 611144 608483
51853 608483 607151 606190 604991 603913 603412 603113 602147 600096 597045 592967 587640 581156 574020 566691 559452
51838 559452 552758 547204 542909 539302 535809 532536 530016 528469 527648 527300 527466 528244 529489 530896 532245
51823 532245 533392 534042 533768 532376 530162 527635 525047 522462 520306 519439 520321 522266 523973 524815 525290 526115
51807 526115 527274 528186 528438 528004 526939 525324 523514 522004 520923 519936 518806 517841 517604 518302 519613 520954
51791 520954 521769 521730 520905 519695 518401 516913 514980 512697 510534 508946 508137 508064 508345 508250 507278 505846 505013
51774 505013 505382 506629 508241 510266 513091 516954 522081 528882 537452 547103 556864 566268 575170 583152
51760 583152 589740 594975 598968 601025 600139 596478 591479 586149 580147 572996 565310 558083 551445 545020
51746 545020 539032 534010 529604 524768 519305 514402 511353 510419 511261 513820 518141 523624 529151 534057 538679
51731 538679 543750 549394 554878 559329 562565 565038 567112 568779 570131 571670 573765 576119 578154 579647
51717 579647 580563 580528 579129 576645 573815 570837 567294 563253 559714 557515 556334 555339 554362 553791 553489 552568
51701 552568 550413 547552 545278 544623 545687 547665 549390 550004 549371 547972 546499 545506 545210 545417 545713 545840
51685 545840 545759 545272 543845 541117 537420 533410 529294 524899 520563 517284 515545 514440 512665 510292 508783
51670 508783 509085 510356 511178 511529 512795 515991 520844 526866 534434 544082 555202 566177 575677 583125
51656 583125 588069 590053 589405 587401 585113 582582 579646 577178 576724 578997 583315 588529 593952 599173 603432
51641 603432 605585 604585 599908 591789 581182 569276 556790 543830 530568 517903 507124 498978
51629 498978 493249 489235 486386 484405 483028 481997 481289 481152 481804 483094 484502 485481 485813 485649 485281 484918
51613 484918 484630 484450 484452 484701 485173 485712 486064 485985 485359 484205 482596 480675 478822 477682 477778 479070 481123 483767
51595 483767 487370 492298 498398 505262 512758 520935 529498 537866 545697 552847 558684 562025 562150 559569
51581 559569 555482 550837 546373 543232 542753 545494 550953 558438 567910 579766 594087 610444 628392
51568 628392 647920 669314 692649 717629 744058 772323 802977 835754 869431 902994 936682
51557 936682 971469 1007785 1045129 1082680 1119598 1154679 1186235 1212430 1231366 1241011 1239800 1227676
51545 1227676 1206091 1176780 1140967 1099878 1055327 1009205 962755 916770 872193 830009 790865
51534 790865 755279 723943 697226 674515 654676 637099 621808 608605 596823 586113 576820 569224
51522 569224 562865 557042 551656 547120 543648 541126 539565 539125 539539 540006 540042 540229 541686 544721 548298 550939
51506 550939 551923 551438 549825 547066 543023 537840 531966 525972 520463 515989 512843 510880 509601 508442 507140
51491 507140 505911 505214 505194 505447 505423 504920 503972 502461 500267 497661 495061 492363 488965 484552 479428 474051
51475 474051 468823 464460 461807 460818 460257 458989 457169 455632 454546 453295 451405 448906 445966 442857 440221
51460 440221 438709 438326 438609 439341 440554 441920 442921 443672 444881 446810 448919 450779 452717 455267 458535
51445 458535 462492 467412 473624 481166 489987 500130 511421 523364 535645 548239 560596 571176
51433 571176 578517 582570 584500 585308 585189 584060 581999 578950 574514 568333 560518 551621 542432 533819 526396
51418 526396 520143 514583 509464 505118 502002 500135 499187 498936 499306 500077 500992 502274 504589 508096 511727
51403 511727 514002 514673 515103 516774 519841 523534 527534 532236 537749 543414 548584 553427 558680 564989 572724
51388 572724 582112 593236 606121 621057 638661 659433 683546 711259 743244 780214 822444 869824
51376 869824 921996 978110 1036776 1096631 1156620 1215220 1269665 1316604 1353499 1378936 1391806
51365 1391806 1391025 1376331 1348809 1310361 1263050 1209099 1151023 1091228 1031535 973161 916849 862946
51353 862946 811795 764362 722133 685994 655447 629278 606740 587684 571753 558108 546043
51342 546043 535343 525867 517158 508767 500730 493439 487145 481734 476856 472119 467300 462559 458345 454910
51328 454910 452080 449598 447488 445744 443931 441591 439034 437176 436377 435928 434969 433550 432414 432078 432580
51313 432580 433837 435747 438017 440426 443187 446597 450427 454168 457810 461696 465597 468690 470778 472733
51299 472733 475196 477398 477945 476379 473279 469109 463775 457360 450636 444569 439709 436183 433906 432584
51285 432584 431763 431103 430603 430546 431334 433275 436353 440220 444561 449334 454511 459793 464868 469679 474129 477669
51269 477669 479696 480308 480293 480390 480922 482016 483682 485627 487511 489450 491834 494519 496695 497664 497347 495887
51253 495887 493311 489892 486336 483151 480116 476750 473103 469696 466878 464580 462590 460808 459274 458125
51239 458125 457464 457137 456822 456353 455720 454707 452935 450493 448126 446480 445478 444661 443778 442717 441291 439595
51223 439595 438305 438062 438657 439257 439287 438723 437801 436930 436769 437772 439666 441858 444284 447340 451046 454899
51207 454899 458594 462310 466182 470093 474177 478896 484277 489537 493848 497120 499748 501955 503734 505091
51193 505091 505941 505946 504785 502498 499374 495719 491975 488767 486531 485202 484448 483965 483393 482313 480693 479095
51177 479095 477997 477124 475830 474049 472410 471474 471228 471364 471727 472359 473275 474275 474991 475235 475349 475922 477047
51160 477047 478208 479113 480217 481982 483985 485385 486056 486636 487557 488683 489849 491104 492294 493073 493482 493962
51144 493962 494600 494894 494484 493524 492094 489934 487158 484623 482949 481655 479855 477487 475238 473485 471996
51129 471996 470576 469353 468481 468052 468280 469227 470393 471167 471764 473154 475893 479482 483036 486146 488898 491476
51113 491476 494074 496876 499870 502901 506075 509777 514088 518551 522750 526750 530611 533812 535732 536580
51099 536580 537323 538664 540454 542147 543426 544221 544472 544116 543182 541672 539442 536406 532871 529502 526925
51084 526925 525361 524625 524337 524088 523598 522924 522567 523086 524436 525887 526834 527542 528732 530523 532290 533691
51068 533691 535320 537941 541471 545236 549027 553316 558457 564384 571379 580484 592481 606644 621202
51055 621202 635209 649454 665235 682537 699884 715899 730438 744131 757400 770475 784042
51044 784042 799069 815609 832136 846411 856925 863416 866268 865814 862257 855932 847432 837449 826528
51031 826528 814984 803102 791284 779828 768497 756589 743580 729646 715469 701792 689318
51020 689318 678827 670997 666086 663947 664247 666498 670105 674746 680699 688407 697633 707409 716999 726651
51006 726651 737133 748655 760483 771664 782044 792500 804134 817156 830616 843279 854629
50995 854629 864926 874500 883339 891327 898504 905002 910935 916396 921297 925246 927931 929736 931603 934174
50981 934174 937442 941364 946377 953037 961646 972627 986784 1004540 1025183 1047481 1070957 1095983
50969 1095983 1122833 1151416 1182030 1215645 1253173 1295016 1341501 1393056 1449517 1509880 1573275
50958 1573275 1639710 1709278 1781080 1853639 1926067 1998020 2068622 2136267 2199643 2258251 2311784
50947 2311784 2359666 2401544 2437708 2468700 2494994 2517350 2536960 2554728 2570676 2584464 2596176
50936 2596176 2606224 2614727 2621379 2625616 2626543 2623069 2614667 2601675 2584368 2562105 2534080 2500546 2462440
50923 2462440 2419956 2372500 2320058 2263502 2203301 2139101 2071144 2001138 1930915 1861000 1791392
50912 1791392 1723158 1658186 1597661 1541712 1490306 1443482 1400704 1361031 1324160 1290607 1260659
50901 1260659 1233845 1209667 1188113 1169099 1151947 1135878 1120690 1106657 1094106 1083362 1074731
50890 1074731 1068216 1063452 1060036 1057603 1055594 1053532 1051801 1051557 1053416 1056643 1060069 1063428 1067333 1072309
50876 1072309 1078455 1085775 1094202 1103359 1112924 1123238 1135039 1148530 1163168 1178491 1194752 1212499
50864 1212499 1231845 1252411 1274010 1297275 1323581 1354187 1389434 1428936 1472606 1521128 1575194
50853 1575194 1634791 1699790 1770970 1849814 1937376 2033868 2139257 2253538 2376321 2506866
50843 2506866 2644831 2790475 2943731 3103363 3267252 3433124 3598755 3761855 3920084
50834 3920084 4070853 4210903 4336647 4445447 4536420 4609720 4665519 4704283 4727681 4738353
50824 4738353 4738761 4730917 4717355 4701590 4687135 4676326 4670210 4669052 4672362 4678575 4685091 4688705 4685909
50811 4685909 4673176 4647453 4606525 4548779 4472857 4378039 4265096 4136316 3994389 3841422
50801 3841422 3679322 3510939 3340374 3171955 3009002 2853570 2707023 2570572 2445328
50792 2445328 2332087 2231171 2142415 2065305 1999248 1943739 1898225 1861840 1833353 1811437 1794975
50781 1794975 1783116 1775035 1769611 1765393 1761013 1755763 1749689 1743100 1736073 1728487 1720188 1710852 1699814
50768 1699814 1686513 1671170 1654680 1637659 1619768 1600124 1578251 1554614 1530433 1507031 1485066
50757 1485066 1464216 1443743 1423475 1403996 1385905 1369350 1354525 1342111 1332744 1326381 1322715 1321999
50745 1321999 1324776 1330919 1339649 1350715 1364953 1383427 1406572 1434494 1467590 1506275 1550401 1599530
50733 1599530 1653719 1713564 1779379 1850708 1926636 2006286 2088915 2173857 2260521 2348280 2436233
50722 2436233 2523154 2607737 2688855 2765629 2837365 2903388 2962700 3013746 3054711 3084215 3101715
50711 3101715 3107375 3101874 3086522 3063441 3035349 3005031 2974908 2946959 2922886 2904197 2891914 2886029
50699 2886029 2885348 2888064 2892497 2897109 2899935 2898399 2889878 2872227 2843739 2803088 2749833 2684877 2610083
50686 2610083 2527495 2439200 2347741 2256062 2166772 2081759 2002576 1930749 1867277 1812093 1764568
50675 1764568 1724631 1693111 1670867 1657809 1652932 1655158 1663917 1678931 1699588 1724722 1752990 1783308
50663 1783308 1814731 1846019 1875662 1902566 1926555 1948041 1967289 1984253 1998989 2011915 2023584
50652 2023584 2034449 2044889 2055189 2065327 2075046 2084305 2093564 2103484 2114556 2127249 2142285 2160425
50640 2160425 2182066 2207323 2236417 2269564 2306510 2346496 2388817 2433084 2478913 2525719 2572999
50629 2572999 2620441 2667555 2713652 2758497 2802455 2845323 2885262 2919688 2947258 2968196 2982290
50618 2982290 2987128 2978980 2955515 2917752 2869941 2817938 2767139 2720972 2680738 2646696 2619009 2597533
50606 2597533 2581177 2568176 2557101 2547161 2537373 2525878 2510390 2489129 2461082 2425650 2382510 2331979
50594 2331979 2275246 2213963 2149598 2083268 2016131 1949596 1884820 1822132 1761397 1703064 1648412
50583 1648412 1598512 1553318 1512245 1475214 1442464 1413457 1386818 1361612 1338091 1316869 1297973
50572 1297973 1281156 1266700 1255270 1247183 1242246 1240158 1240633 1243307 1248052 1255323 1265693 1279049 1294628
50559 1294628 1311877 1330837 1351768 1374879 1400552 1429242 1460892 1494802 1530258 1566879 1604140
50548 1604140 1641147 1677359 1713162 1749100 1784732 1818816 1850737 1881242 1911666 1942808 1974792
50537 1974792 2007755 2042406 2079940 2121535 2167869 2219045 2274937 2335564 2401110 2471742 2547572
50526 2547572 2628768 2715552 2808146 2906796 3011649 3122298 3237399 3354971 3473088 3590125
50516 3590125 3704393 3813859 3916289 4009377 4090660 4157618 4208214 4241281 4256356 4253295 4232195
50505 4232195 4193571 4138489 4068723 3986887 3896243 3800154 3701741 3604099 3510528 3424272 3348140
50494 3348140 3284495 3235298 3201636 3183240 3178798 3186767 3205509 3232463 3263504 3293528 3317769 3332610
50482 3332610 3335312 3323287 3293921 3245447 3178052 3093976 2996327 2887925 2771375 2649767 2526559
50471 2526559 2404607 2285788 2171624 2063777 1963575 1871447 1787249 1711008 1643005 1583269
50461 1583269 1531323 1486365 1447510 1413989 1385398 1361666 1342590 1327499 1315616 1306626 1300551 1297181
50449 1297181 1295974 1296514 1298648 1302126 1306466 1311397 1317251 1324695 1334163 1345562 1358416 1372194 1386660
50436 1386660 1401946 1418174 1434940 1451300 1466268 1479265 1490182 1499349 1507513 1515617 1524423 1534365
50424 1534365 1545737 1558716 1573072 1588151 1603412 1618951 1635390 1653331 1673062 1694682 1718339
50413 1718339 1744310 1772993 1804883 1840532 1880422 1924725 1973110 2024893 2079436 2136254 2194593
50402 2194593 2253170 2310640 2366281 2419858 2470855 2518087 2559985 2594982 2621720 2639359 2647678
50391 2647678 2646438 2634645 2611056 2575541 2529460 2474642 2412769 2346078 2277705 2210481 2145828
50380 2145828 2084567 2028314 1979155 1938175 1905285 1880431 1864000 1855819 1854640 1858951 1867582 1879088
50368 1879088 1891167 1901277 1907432 1908012 1901313 1886058 1862279 1831143 1793873 1751170 1703640 1652380
50356 1652380 1598939 1544867 1491375 1439286 1389190 1341608 1297031 1255828 1218161 1183935 1152797
50345 1152797 1124328 1098482 1075759 1056753 1041663 1030558 1023909 1022182 1024788 1030108 1036980 1045649
50333 1045649 1056722 1069553 1082334 1093604 1102939 1110066 1114036 1113749 1109067 1101120 1091681 1082387 1074304
50320 1074304 1067804 1062791 1059215 1057452 1058063 1061217 1066482 1073213 1081028 1089731 1098887 1107750 1115802 1123143
50306 1123143 1130195 1137172 1144083 1151137 1158716 1166898 1175437 1184367 1194188 1205046 1216083 1226200 1235528
50293 1235528 1245627 1258015 1272773 1288867 1305529 1322885 1341152 1359584 1376488 1390189 1399752
50282 1399752 1404758 1404714 1398959 1387231 1370218 1349672 1328043 1307755 1290436 1276686 1266612 1260437
50270 1260437 1258366 1259984 1264296 1270460 1278109 1286819 1295751 1304155 1311938 1319297 1326036 1331715 1336369 1340621
50256 1340621 1344988 1349458 1353885 1358507 1363838 1370183 1377488 1385705 1395198 1406657 1420571 1436909 1455500
50243 1455500 1476620 1500823 1528175 1558083 1590077 1624235 1660454 1697703 1734677 1770907 1806616
50232 1806616 1841585 1874942 1906065 1934886 1961017 1983286 2000512 2012044 2016974 2013494 1999983 1976659
50220 1976659 1945494 1908628 1867528 1823608 1778744 1734679 1692347 1652078 1614021 1578059 1543666
50209 1543666 1510350 1477984 1446244 1413912 1379388 1342085 1303042 1264118 1226930 1192558 1161659
50198 1161659 1134334 1109985 1087703 1066832 1047177 1028892 1012443 998401 986858 977041 967839 958789
50186 958789 950250 942615 935693 928985 922258 915688 909698 904810 901427 899462 898266 897026 895226 892826
50172 892826 890253 888245 887246 886781 885784 883785 881430 879581 878360 877506 877199 877850 879319 881139 883417 886795
50156 886795 891367 896343 901067 905802 911240 917715 925234 933760 943027 952442 961572 970434 978941 986483
50142 986483 992631 998010 1003930 1011231 1020011 1030347 1042615 1057026 1073538 1092504 1115034 1142305
50130 1142305 1174812 1212594 1255909 1305218 1360528 1421156 1486253 1555269 1627677 1702388 1777837
50119 1777837 1852801 1926969 2000496 2073120 2143996 2212310 2277571 2339078 2395445 2444994 2486280
50108 2486280 2517738 2537040 2541602 2530071 2503038 2462253 2409643 2347263 2277508 2202617 2124135
50097 2124135 2043374 1962213 1882771 1806297 1733083 1663730 1599810 1542643 1491822 1445634 1402925
50086 1402925 1363937 1329218 1298443 1270718 1245690 1223721 1205099 1189590 1176875 1166942 1159739 1154805
50074 1154805 1151646 1150314 1151151 1153925 1157747 1162078 1167397 1174357 1182470 1190222 1196573 1201842 1206793 1211302
50060 1211302 1214390 1215395 1214596 1212731 1210319 1207524 1204257 1200172 1194881 1188426 1181354 1174123 1166630 1158593
50046 1158593 1150275 1142577 1136409 1132137 1129626 1128659 1129274 1131711 1136083 1142176 1149711 1158738 1169536 1182099
50032 1182099 1196048 1211114 1227330 1244567 1262245 1279902 1297737 1316181 1335092 1353755 1371507
50021 1371507 1387966 1402834 1416038 1428053 1439512 1450418 1460146 1468336 1475433 1482324 1489860 1498668
50009 1498668 1508865 1519850 1531119 1543577 1559442 1580350 1605957 1634737 1665634 1698379 1732626
49998 1732626 1767608 1802620 1837295 1871408 1904820 1937479 1968937 1997800 2021978 2039418 2048244
49987 2048244 2046501 2032626 2006465 1969253 1922258 1865921 1800829 1729279 1655241 1582551 1513218
49976 1513218 1447481 1385258 1327294 1274903 1228815 1188552 1152998 1121275 1092949 1067758 1045527
49965 1045527 1026234 1009725 995418 982677 971455 962193 955063 949748 945991 943881 943365 944015 945579
49952 945579 948438 953079 959365 966685 974596 982926 991387 999475 1006700 1012539 1016227 1017098 1015288 1011767
49938 1011767 1007442 1002371 995957 987724 977792 966726 954997 942538 928839 913603 897248 880530
49926 880530 863782 846927 830340 815187 802542 792438 784186 777350 771930 767783 764644 762826 763187
49913 763187 765909 769763 773134 775625 778182 781878 787077 793700 801630 810631 820363 830799 842306 855065
49899 855065 868701 882713 896931 911190 924870 937194 947813 956642 963230 966809 967077 964539 959846
49886 959846 953113 944055 932579 919073 904202 888597 872693 856872 841723 827928 815600 803912
49874 803912 791910 779729 768578 759338 751687 744875 738949 734658 732427 731933 732607 734083 736196 739025
49860 739025 742995 748579 755781 764240 773860 784903 797330 810555 824132 838194 852719 866747
49848 866747 878988 889162 898079 906296 913217 917792 919612 918934 915991 910822 903663 895001 885143 874087
49834 874087 861957 849334 837042 825792 816108 808267 802060 796870 792322 788827 787215 787844 790284
49821 790284 793888 798354 803628 809633 816391 824267 833690 844572 856268 868160 879984 891430 901773
49808 901773 910281 916947 922428 927273 931500 934944 937523 938918 938435 935659 931079 925664 919914 913695
49794 913695 906903 899792 892502 884660 875617 864935 852674 839549 826835 815748 806697 799397 793647
49781 793647 789516 786703 784401 782202 780627 780280 780933 782018 783620 786231 789772 793709 798158 804070 812010
49766 812010 821296 830621 839103 846488 852808 858201 862809 866556 869148 870435 870512 869392 866883 862936 857753
49751 857753 851317 843146 832869 820884 808212 795865 784572 774823 766873 760699 756165 753096 751087
49738 751087 749483 747780 745969 744375 743360 743261 744234 745951 747784 749692 752619 757547 764320 771877 779593
49723 779593 787876 797360 808018 819294 830874 843088 856601 871690 887677 903081 916490 927345
49711 927345 935817 942111 946183 948004 947671 945133 940119 932513 922683 911451 899970 889513 880929 874041
49697 874041 867866 861670 855668 850481 846106 841684 836314 829948 823536 818420 815461 814557 814921 815899 817574
49682 817574 820652 825845 833374 842945 854155 867001 882047 899936 920621 943113 966093 988704
49670 988704 1010590 1031230 1049394 1063385 1071838 1074402 1071876 1065887 1058423 1051413 1046307 1043632 1042799
49657 1042799 1042479 1041482 1039464 1036705 1033032 1026980 1016341 999860 978458 954671 930988 908859 888940
49644 888940 871562 856684 843894 832982 824333 818314 814381 811246 808024 804925 802786 802144 802685 803352
49630 803352 803021 801422 799335 797557 795729 792598 787465 780854 773719 766560 759661 753545 748633 744721
49616 744721 741353 738484 736254 734304 731984 729332 727308 726850 728014 730113 732334 734058 735010 735449 736065
49601 736065 737447 739660 742352 745000 746969 747714 747308 746606 746568 747425 748733 750049 751285 752478 753682 755147
49585 755147 757198 759761 762286 764297 765795 766956 767790 768407 769346 771187 773892 776921 779962 783154 786654
49570 786654 790489 794979 800818 808385 817263 826704 836352 846203 856174 866035 875565 884368 891770 897334
49556 897334 901325 904164 905528 904596 901245 896445 891337 886459 882026 878307 875330 872793 870808 870249 871684
49541 871684 874249 876338 877339 878028 879251 880948 882657 884309 886166 888525 891937 897290 905061 914697
49527 914697 925326 937015 950786 967375 986503 1007477 1029949 1053693 1078064 1102200 1125560
49516 1125560 1147702 1167563 1183616 1195087 1202752 1208280 1213084 1217991 1223530 1229902 1236699 1243148 1248675
49503 1248675 1252751 1254151 1251005 1242017 1227390 1208330 1186018 1161488 1136138 1111609 1088954 1068252
49491 1068252 1049158 1031545 1015564 1001433 989392 979692 972325 966790 962221 957809 953174 948543 944608
49478 944608 942123 941415 942235 943989 946082 948119 949978 951765 953700 956005 958910 962630 967148 972028 976596
49463 976596 980431 983719 987148 991380 996434 1001496 1005528 1008177 1009863 1010836 1010543 1008381 1004805 1001029 997545
49448 997545 993538 987998 980956 973345 966025 959293 953066 947158 941576 936829 933730 932665 933289 935302
49434 935302 939125 945318 953563 962911 973042 984702 998790 1015510 1034537 1055494 1078039 1102144
49422 1102144 1128695 1159217 1194146 1231363 1267165 1298909 1326377 1350344 1370201 1383450 1387585
49411 1387585 1382351 1370290 1355371 1341183 1330054 1323121 1320548 1321601 1325018 1329802 1335726 1342987 1351463
49398 1351463 1360552 1369727 1379029 1388936 1399773 1411246 1422465 1432469 1440794 1447478 1452495 1455337 1455408
49385 1455408 1452708 1447811 1441133 1432548 1421830 1409208 1395250 1380458 1365245 1350238 1336233 1323830
49373 1323830 1313306 1304860 1298718 1294870 1292913 1292413 1293325 1295797 1299526 1303540 1306833 1309066 1310405 1310752
49359 1310752 1309517 1306317 1301563 1295918 1289366 1281341 1271877 1262100 1253268 1245665 1238845 1232695 1227713 1224243
49345 1224243 1221897 1219897 1217676 1215016 1211952 1208779 1205927 1203510 1201007 1197536 1192503 1185988 1178661 1171364
49331 1171364 1164643 1158564 1153010 1148133 1144380 1142094 1141298 1141880 1143734 1146652 1150389 1155016 1160879 1167923
49317 1167923 1175295 1182074 1188322 1195069 1203234 1212851 1223369 1234416 1246122 1258864 1272907 1288226
49305 1288226 1304682 1322278 1341117 1360943 1380894 1399927 1417439 1433302 1447366 1459034 1467236
49294 1467236 1470573 1467846 1459022 1445768 1430583 1415162 1399797 1384305 1369004 1354537 1341246 1329117
49282 1329117 1318087 1307985 1298394 1289093 1280620 1274020 1269872 1267777 1266866 1266641 1267281 1269270 1272814 1277521
49268 1277521 1282621 1287481 1291893 1295806 1298953 1300975 1301929 1302468 1303332 1304691 1306171 1307650 1309927 1314392 1321957
49253 1321957 1332583 1345975 1362290 1381572 1402594 1422971 1440685 1455011 1465704 1471782 1471719 1464647
49241 1464647 1450952 1431823 1408655 1382870 1355932 1329364 1304667 1282966 1264537 1248971 1236073
49230 1236073 1226297 1220073 1217179 1217257 1220431 1226613 1234525 1242442 1249991 1258338 1268373 1279530 1290726 1301651
49216 1301651 1312598 1323664 1334724 1345713 1356384 1366178 1374943 1383437 1392547 1402276 1412077 1421889 1432202
49203 1432202 1443320 1455267 1468295 1482738 1498292 1514086 1529591 1544873 1559917 1574430 1588571
49192 1588571 1603122 1618422 1633595 1647388 1659457 1670407 1680830 1690848 1700414 1709580 1718439 1727260
49180 1727260 1736736 1747882 1761643 1778762 1799866 1825324 1855062 1888921 1927293 1971073 2020727
49169 2020727 2075527 2133691 2193025 2251304 2306328 2355926 2397861 2429814 2449964 2458229 2456994 2450184
49157 2450184 2441245 2431930 2422759 2414121 2406623 2400644 2396019 2392259 2388943 2385975 2383721 2382931 2384304 2387948
49143 2387948 2393393 2400186 2408357 2418233 2429942 2443234 2457761 2473388 2490202 2508251 2527267 2546705
49131 2546705 2566175 2585819 2606090 2627106 2648372 2669216 2689475 2709686 2730750 2753357 2777503
49120 2777503 2802494 2827699 2853494 2881221 2912049 2946186 2983537 3024829 3071574 3125093 3186299
49109 3186299 3256694 3338939 3435674 3547538 3672468 3807186 3949642 4100008 4258552 4421602
49099 4421602 4579642 4720849 4838009 4932227 5008864 5068946 5104464 5102739 5056357 4969791 4856952
49088 4856952 4732228 4603103 4469921 4331121 4187924 4044846 3907508 3780738 3667848
49079 3667848 3570301 3487657 3418300 3360485 3312689 3273272 3240381 3212320 3187765 3165602 3144994
49068 3144994 3125765 3108408 3093434 3080744 3069614 3059060 3048179 3036545 3024513 3012930 3002204
49057 3002204 2991750 2980534 2968145 2955152 2942528 2930876 2920176 2910039 2900191 2890854 2882715 2876381
49045 2876381 2871787 2868236 2865094 2862441 2861044 2861748 2864904 2870257 2877222 2885179 2893551 2901755 2909257 2915748
49031 2915748 2921198 2925738 2929524 2932730 2935532 2937977 2939981 2941594 2943204 2945141 2947010 2947689 2946288 2943081
49017 2943081 2939296 2936052 2933709 2932203 2931508 2931469 2931516 2931097 2930468 2930617 2932234 2935011 2938141 2941232 2944433 2947927
49001 2947927 2951719 2955851 2960374 2965007 2969234 2972940 2976658 2980886 2985326 2989088 2991589 2992968 2993635 2993736
48987 2993736 2993177 2991992 2990419 2988644 2986654 2984422 2982104 2979880 2977601 2974802 2971199 2966967 2962300 2956804
48973 2956804 2949786 2941231 2932066 2923151 2914327 2904841 2894478 2883768 2873227 2863024 2853566 2845775 2840440
48960 2840440 2837627 2837123 2839148 2844163 2852143 2862427 2874243 2887085 2900718 2915216 2930990 2948336
48948 2948336 2966933 2986118 3005674 3025864 3046641 3067334 3087440 3107336 3127823 3149186 3171051
48937 3171051 3193060 3215457 3239131 3265267 3294680 3327270 3362326 3399577 3439582 3482744 3528478
48926 3528478 3575998 3625575 3678170 3733877 3791678 3850915 3912126 3975942 4041946 4109299 4177955
48915 4177955 4248480 4320869 4394221 4467533 4540196 4611759 4681769 4750005 4816471 4881091 4943659
48904 4943659 5004088 5062380 5118305 5171419 5221437 5268280 5311804 5351873 5388744 5422944 5454610
48893 5454610 5483301 5508568 5530343 5548642 5563304 5574343 5582218 5587422 5589967 5589533 5585895 5578946 5568585
48880 5568585 5554914 5538415 5519578 5498449 5474827 5448727 5420217 5388919 5354148 5315643 5273791
48869 5273791 5228986 5181141 5130087 5076187 5020291 4963192 4905384 4847292 4789514 4732716 4677390
48858 4677390 4623731 4571706 4521150 4471828 4423531 4376264 4330377 4286365 4244466 4204572 4166558
48847 4166558 4130562 4096825 4065460 4036584 4010539 3987714 3968183 3951728 3938068 3926806 3917313
48836 3917313 3909239 3903242 3900744 3902634 3908459 3917096 3927901 3940889 3956084 3973225 3992102 4012705
48824 4012705 4034905 4058238 4082242 4106874 4132464 4159287 4187270 4216077 4245425 4275239 4305467
48813 4305467 4335786 4365656 4394705 4422973 4450727 4478200 4505547 4532869 4560075 4586926 4613469
48802 4613469 4640359 4668477 4698225 4729300 4761040 4792722 4823673 4853491 4882276 4910373 4937726
48791 4937726 4963713 4987686 5009535 5029582 5048093 5064961 5079666 5091446 5099704 5104406 5105948 5104529
48779 5104529 5099717 5090656 5076599 5057278 5033142 5005326 4975148 4943349 4909934 4874702 4837578 4798348
48767 4798348 4756586 4712272 4666132 4618899 4570504 4520510 4469125 4417224 4365497 4314192 4263695
48756 4263695 4214640 4167306 4121477 4077223 4035248 3996082 3959416 3924642 3891674 3860706 3831506
48745 3831506 3803522 3776587 3751023 3727200 3705499 3686674 3671584 3660348 3652118 3645901 3641282 3638203
48733 3638203 3636397 3635337 3634555 3633762 3632800 3631697 3630728 3630291 3630779 3632550 3635821 3640403 3645734 3651338 3657143
48718 3657143 3663215 3669335 3675008 3679784 3683338 3685368 3685711 3684641 3682844 3681021 3679605 3678782 3678622 3679141 3680350
48703 3680350 3682315 3685037 3688306 3691838 3695574 3699713 3704456 3709934 3716358 3723895 3732213 3740424 3747818 3754525
48689 3754525 3761115 3767600 3773219 3777321 3780088 3782163 3783841 3784894 3785162 3784986 3784982 3785470 3786153 3786296 3785250 3782863
48673 3782863 3779371 3774940 3769491 3763059 3756070 3748957 3741558 3733185 3723284 3711782 3698769 3684132 3667581
48660 3667581 3648688 3626717 3600803 3570653 3536903 3500440 3461484 3419736 3375337 3329236 3282570
48649 3282570 3236151 3190721 3147183 3106194 3067783 3031730 2998130 2967196 2938696 2911994 2886585
48638 2886585 2862116 2837993 2813638 2789313 2766064 2744404 2723455 2701811 2678994 2655528 2631905
48627 2631905 2608130 2584208 2560417 2536888 2513447 2490130 2467487 2446105 2426166 2407755 2391345
48616 2391345 2377662 2367169 2359799 2354960 2351712 2349287 2347742 2347778 2349550 2351903 2353189 2352641 2350665 2348011
48602 2348011 2345166 2342376 2339708 2337105 2334815 2333719 2334578 2336876 2338988 2339694 2338999 2337235 2334011 2328606 2320961
48587 2320961 2311676 2301184 2289519 2276899 2263966 2251225 2238608 2225851 2213136 2201089 2190150
48576 2190150 2180158 2170684 2161695 2153693 2147247 2142583 2139799 2139164 2140903 2144766 2150181 2156817 2164633 2173311
48562 2173311 2182012 2189797 2195976 2199881 2200635 2197415 2189894 2178409 2163982 2148140 2132244 2116668 2100899
48549 2100899 2084573 2068070 2051930 2036146 2020379 2004441 1988168 1971174 1953258 1934815 1916407
48538 1916407 1898130 1879951 1862419 1846454 1832491 1820420 1810346 1802684 1797297 1793145 1789306 1786069
48526 1786069 1784662 1786065 1790390 1797293 1806528 1817868 1830614 1843512 1855331 1865349 1872985 1877019 1875721
48513 1875721 1868162 1855219 1839035 1821679 1804615 1789164 1776809 1768775 1765481 1766452 1770676 1777173 1785509
48500 1785509 1795707 1807597 1820426 1833415 1846387 1859390 1871750 1881991 1888679 1890900 1887816 1878364
48488 1878364 1861922 1839252 1812505 1784122 1755621 1727362 1699413 1672503 1647878 1626283 1607507
48477 1607507 1591066 1576845 1564765 1554316 1545048 1537191 1531170 1526673 1522850 1519332 1516447 1514474 1513346
48464 1513346 1513187 1514461 1517332 1521382 1526160 1531666 1538095 1545463 1553570 1561960 1569800 1576117 1580271 1582031
48450 1582031 1581371 1578604 1574487 1569598 1563663 1556146 1547465 1538824 1530669 1522079 1511992 1500428 1488153
48437 1488153 1475769 1463526 1451532 1439664 1427581 1415203 1402965 1391480 1381309 1373058 1367021 1362476
48425 1362476 1357939 1352558 1346805 1341510 1336768 1332209 1327798 1323737 1319900 1315861 1311328 1306218 1300541 1294438
48411 1294438 1288086 1281351 1273884 1265786 1257747 1250298 1243265 1236234 1229080 1221861 1214660 1207846 1201983 1197133
48397 1197133 1192638 1187879 1182837 1177720 1172622 1167784 1163505 1159431 1154546 1148365 1141556 1134998 1128833 1122923
48383 1122923 1117554 1113017 1109046 1105306 1101927 1099002 1096078 1092778 1089450 1086628 1084342 1082523 1081472 1081211
48369 1081211 1080871 1079468 1076954 1073983 1071131 1068911 1067905 1068169 1068990 1069847 1071113 1073238 1076017 1079356 1083906
48354 1083906 1089942 1096348 1101719 1105952 1109799 1113556 1117293 1121751 1127772 1135242 1143691 1153436 1164997 1177952
48340 1177952 1191659 1206677 1224144 1243986 1264884 1285706 1305831 1324506 1341163 1356053 1369434
48329 1369434 1380717 1389711 1398138 1408474 1421760 1437867 1457134 1479966 1505428 1532301 1561229 1593977
48317 1593977 1630851 1670781 1713608 1760282 1811064 1865713 1925413 1992592 2069075 2156355 2257188
48306 2257188 2374774 2511117 2668950 2854840 3077968 3347002 3671374 4064287 4540225
48297 4540225 5110631 5786771 6585891 7529689 8640087 9944624 11478860 13258437 15233097
48288 15233097 17279575 19256986 21064579 22629106 23840511 24529532 24534706 23800964 22420846
48279 22420846 20594517 18552479 16490937 14540181 12764555 11182727 9790977 8576895
48271 8576895 7524668 6618875 5846943 5197123 4655162 4205068 3832367 3524723 3270525
48262 3270525 3059317 2883270 2736283 2612075 2504840 2411306 2330276 2260254 2198901 2144401
48252 2144401 2095795 2052047 2012142 1975995 1944060 1916034 1890843 1867760 1846746 1827984 1811834
48241 1811834 1798843 1788936 1781073 1774560 1770271 1769641 1772764 1778273 1784659 1790876 1796184 1800313 1803383 1804732
48227 1804732 1802218 1793717 1779139 1760253 1738966 1716585 1694070 1671688 1648602 1623937 1598182 1572610
48215 1572610 1547523 1522121 1495980 1469500 1442823 1415462 1387311 1359076 1331364 1304014 1276685
48204 1276685 1249508 1222895 1197139 1172392 1148664 1125788 1103813 1083334 1064863 1047898 1031218
48193 1031218 1014193 997325 981484 967210 954864 944743 936675 929829 923257 916463 909485 902704
48181 902704 896638 891545 887125 882838 878580 874737 871537 868624 865440 861833 858165 854928 852331 850282
48167 850282 848686 847588 846884 846072 844665 842782 840953 839366 837752 836011 834318 832614 830704 829033 828474
48152 828474 828974 829294 828692 828035 828514 829962 831322 832181 832876 833548 834123 834903 836224 837742 838926 840007 841446
48135 841446 842820 843362 843512 844672 847311 850413 853069 855523 858258 861047 863577 866219 869565 873627 877985
48120 877985 882360 886684 890987 895494 900419 905456 909910 913594 917180 921375 926189 931256 936520 942277
48106 942277 948800 956172 964297 972916 981834 991199 1001386 1012585 1024774 1037942 1051938 1066258 1080485
48093 1080485 1094892 1110047 1125849 1141636 1157283 1173407 1190273 1207212 1223494 1239162 1254641
48082 1254641 1270058 1285392 1300842 1316554 1332327 1347931 1363348 1378432 1392709 1405891 1418227
48071 1418227 1429971 1440875 1450605 1459438 1468120 1477207 1486792 1496621 1506204 1515017 1522884 1530083 1536944
48058 1536944 1543536 1549752 1555296 1559475 1561489 1561227 1559403 1556655 1552862 1547631 1540986 1533191 1524249 1514050
48044 1514050 1502757 1490652 1477842 1464468 1450939 1437539 1423906 1409311 1393359 1376160 1357945
48033 1357945 1338880 1319209 1299301 1279514 1260047 1240763 1221091 1200391 1178644 1156610 1135184
48022 1135184 1114763 1095270 1076439 1057941 1039626 1021817 1005027 989278 974114 959424 945637
48011 945637 932856 920471 908053 896049 885093 875236 866425 859106 853550 849080 844846 841002 838197
47998 838197 836192 834025 831483 829371 828221 827689 827461 827800 828823 829976 830731 831207 831666 831918 831703 831240
47982 831240 830934 830806 830562 830009 829131 827999 826786 825611 824182 822003 819142 816423 814594 813650 813198 812935
47966 812935 812445 811049 808559 805826 803888 802654 801053 798447 795317 792481 790173 788088 785983 784037
47952 784037 782790 782789 784023 785748 787194 788509 790580 793850 797743 801528 805346 809979 815927 823126 831390
47937 831390 840557 850221 859801 869053 878150 887133 895739 903983 912553 922139 932509 942638 951688 959524
47923 959524 966273 971824 975974 978811 980737 982150 983114 983207 981635 977777 971816 964772 957813 951580 946104
47908 946104 941002 935577 928980 920695 910982 900799 891284 883247 876843 871585 866817 862359 858571 855736
47894 855736 853715 852372 851935 852561 853818 855145 856699 859219 863039 867775 873038 878941 885677 893048 900739
47879 900739 908776 917371 926516 936019 945777 955732 965650 975210 984196 992517 1000090 1006874 1012825 1017661
47865 1017661 1020819 1021894 1020980 1018427 1014477 1009386 1003661 997704 991280 983769 975003 965451 955572 945368
47851 945368 934728 923752 912477 900691 888412 876350 865448 856026 847717 840211 833675 828455
47839 828455 824684 822300 821140 820818 820755 820590 820522 821109 822764 825500 829074 833241 837888 843034 848639 854454
47823 854454 860172 865787 871670 878181 885334 893008 901390 910967 922111 934826 948953 964401 981134
47810 981134 999058 1018121 1038384 1059898 1082527 1106034 1130219 1154723 1178698 1200993 1220914
47799 1220914 1238497 1253685 1265428 1272305 1274176 1272584 1269037 1263356 1254418 1242162 1227985 1213164
47787 1213164 1197873 1182116 1166762 1152960 1141024 1130604 1121653 1114482 1109012 1104631 1100887 1097790
47775 1097790 1095402 1093525 1091822 1089897 1087283 1083786 1079838 1076039 1072311 1067927 1062521 1056637 1051101 1046157
47761 1046157 1041383 1036201 1030310 1023792 1016875 1009518 1001413 992623 983959 976249 969393 962714 956070 949933
47747 949933 944417 939121 934131 930316 928238 927497 927609 928818 931444 935083 939177 943933 949966 957440 966253
47732 966253 976687 989009 1002635 1016531 1030495 1045312 1061591 1079048 1096994 1114935 1132514
47721 1132514 1149386 1165395 1180535 1194603 1207118 1217655 1226023 1232131 1235983 1237741 1237461 1234822 1229491
47708 1229491 1221729 1212260 1201540 1189521 1176115 1161509 1146015 1129985 1113940 1098461 1083900 1070404
47696 1070404 1058148 1047246 1037512 1028689 1020758 1013727 1007355 1001637 997366 995532 996101 997996 1000431 1003736
47682 1003736 1008766 1016002 1025346 1036290 1048112 1060373 1073382 1087778 1103544 1119911 1136271 1152599
47670 1152599 1168889 1184753 1199764 1213607 1225757 1235706 1243791 1251026 1257701 1262802 1265288 1265307 1263561
47657 1263561 1260070 1254274 1246022 1235761 1223901 1210521 1195622 1179390 1162462 1146018 1131141 1117809
47645 1117809 1105185 1093253 1083381 1076567 1071915 1067825 1064151 1062141 1062589 1065174 1069510 1075745 1084056 1094516
47631 1094516 1107559 1123640 1142242 1162107 1182767 1205065 1229924 1257348 1286913 1318374 1351349
47620 1351349 1385078 1418975 1452730 1485354 1514768 1538984 1557259 1569524 1575242 1573668 1564984 1550326
47608 1550326 1530554 1505580 1475097 1439619 1400566 1359448 1317095 1273736 1229827 1186538 1145090
47597 1145090 1105764 1068153 1032358 999255 969370 942229 917312 894973 875770 859387 845004
47586 845004 832369 821676 812582 804205 796146 788752 782227 776174 770250 764757 760286 757088 754860 752843
47572 752843 750078 746102 741520 737504 734612 732520 730928 730078 730084 730402 730404 730061 729549 728512 726294 722793 718669
47555 718669 714764 711531 708794 705717 701238 695008 687868 681152 675636 671391 668221 665704 663057 659752
47541 659752 656336 654024 653269 653251 652958 652231 651478 650941 650686 650897 651611 652386 652777 653025 653842 655540 657794 660184
47523 660184 662500 664434 665485 665484 664921 664508 664534 664790 664877 664408 663145 661308 659685 659109 659733 660962 662119
47506 662119 662977 663617 664056 664245 664327 664638 665387 666465 667611 668708 669878 671322 673036 674662 675665 675808
47490 675808 675388 674799 673932 672301 669871 667406 665773 665132 665201 665959 667578 669765 671888 673922 676639 680559
47474 680559 685151 689519 693433 697300 701496 706265 711935 718478 725005 730426 734664 738600 742686 746344
47460 746344 748984 750957 752995 755215 757266 759118 761033 762905 764277 765076 765918 767570 770480 774853 780754
47445 780754 787907 795780 804159 813537 824704 838066 853508 870806 889877 910565 932419 954865
47433 954865 977585 1000564 1023666 1046302 1067693 1087510 1105978 1123151 1138248 1150055 1158074 1162997
47421 1162997 1165954 1167475 1167364 1165360 1161531 1156019 1148854 1140274 1131022 1121956 1113392 1105023 1096428 1087343
47407 1087343 1077468 1066478 1054517 1042337 1030579 1019108 1007393 995385 983530 971991 960405
47396 960405 948580 936967 926113 916025 906443 897571 890090 884423 880251 876854 873873 871740 871381
47383 871381 873392 877487 882866 889121 896489 905196 914905 925063 935448 946069 956714 967014 976852
47370 976852 986353 995464 1003874 1011375 1018002 1023740 1028303 1031251 1032201 1030868 1027099 1020967 1012814 1003131
47356 1003131 992262 980097 966122 950155 933055 916260 900353 884562 868074 851403 835817
47345 835817 821744 808499 795534 783106 771613 761025 751269 742526 734820 727887 721760 716884 713242
47332 713242 709980 706496 703347 701371 700318 699168 697619 696412 696168 696729 697827 699704 702707 706758 711532
47317 711532 716779 722157 727078 731096 734265 736947 739488 742169 745048 747567 748713 748042 746329 744741
47303 744741 743484 741760 739026 735787 733009 731202 730321 730206 730745 731695 732713 733656 734693 736084 737905
47288 737905 740027 742387 745275 749282 754795 761553 768879 776427 784493 793502 803412 813843 824610 835727
47274 835727 846960 857742 867715 877142 886687 896905 908004 919803 931746 943140 953604 963242
47262 963242 972327 981000 989411 997957 1007031 1016600 1026219 1035426 1043899 1051299 1057207 1061176 1062661 1060923
47248 1060923 1055349 1045965 1033445 1018620 1002220 985050 968030 951840 936806 923333 912142 903750
47236 903750 897863 893579 890125 887231 884969 883596 883534 885129 888273 892446 897233 902684 909139 916825 925680
47221 925680 935423 945733 956479 967816 979890 992376 1004516 1015825 1026661 1037864 1049761 1061686
47209 1061686 1072491 1081387 1088187 1092925 1095535 1095945 1094278 1090829 1085900 1079744 1072591 1064572 1055670 1045849
47195 1045849 1035235 1024131 1012963 1002357 993042 985388 979067 973518 968804 965668 964649 965482 967615
47182 967615 970943 975650 981639 988649 996889 1007034 1019476 1033960 1050106 1067915 1087520 1108688
47170 1108688 1130856 1153542 1176558 1199900 1223532 1247151 1270070 1291447 1310820 1328259 1343875
47159 1343875 1357380 1368384 1377006 1383808 1389004 1391971 1391715 1387805 1380809 1371907 1362114 1351779 1340695
47146 1340695 1328608 1315590 1301950 1287938 1273691 1259445 1245665 1232904 1221500 1211399 1202262
47135 1202262 1193860 1186403 1180391 1176110 1173446 1172346 1173119 1175941 1180209 1184984 1190154 1196616 1204926 1214147
47121 1214147 1222448 1228728 1233283 1237030 1240485 1243423 1245069 1244502 1241242 1235598 1228307 1219809 1210129 1199385
47107 1199385 1187919 1175770 1162524 1148088 1133293 1119269 1106351 1093913 1081174 1067824 1054045
47096 1054045 1040352 1027434 1015717 1004964 994536 984081 973728 963694 954117 945329 937827 931730
47084 931730 926599 922086 918475 916302 915644 916107 917354 919353 922130 925571 929479 933663 937988 942458 947176
47069 947176 952176 957360 962698 968233 973682 978225 981077 982254 982549 982757 983151 983615 983973 984098 983943 983583
47053 983583 983099 982431 981504 980538 980076 980709 982905 986963 992773 999579 1006373 1012779 1019364 1026950 1035766 1045315
47037 1045315 1054862 1063924 1072522 1081157 1090396 1100243 1110080 1119338 1128103 1136892 1145996 1155260 1164327 1172856
47023 1172856 1180621 1187721 1194694 1202154 1210287 1218810 1227365 1235746 1243773 1251168 1257621 1262873 1266846 1269816
47009 1269816 1272210 1273988 1274350 1272525 1268753 1263977 1258575 1252012 1243997 1235383 1227426 1220554 1214412 1208822
46995 1208822 1204012 1199970 1196235 1192554 1189307 1187109 1186295 1186922 1188861 1191655 1194573 1197184 1199780 1203092
46981 1203092 1207715 1213898 1221575 1230367 1239806 1249868 1261093 1273834 1287607 1301593 1315680 1330436
46969 1330436 1346006 1361605 1376384 1390349 1403992 1417344 1429988 1441937 1453855 1466082 1477813
46958 1477813 1487703 1495281 1501351 1506958 1512282 1516833 1520400 1523289 1525599 1526866 1526764 1525798 1524848 1524250 1523852
46943 1523852 1523866 1525009 1527675 1531504 1536052 1541394 1547679 1554512 1561326 1568155 1575490 1583428 1591501 1599448
46929 1599448 1607723 1616973 1627312 1638343 1649672 1661172 1672806 1684427 1695829 1706942 1717812 1728231
46917 1728231 1737405 1744307 1748553 1750686 1751332 1750309 1746939 1741026 1733031 1723333 1711907 1698843 1684607
46904 1684607 1669538 1653631 1637184 1621244 1606932 1594595 1584065 1575496 1569440 1566241 1565835 1568136
46892 1568136 1573198 1580963 1591219 1603828 1618672 1635436 1653822 1673972 1696210 1720250 1745073 1769789
46880 1769789 1794268 1818680 1842753 1865801 1887284 1907009 1924887 1940767 1954478 1965875 1974950
46869 1974950 1982067 1988015 1993629 1999347 2005221 2011256 2017633 2024661 2032636 2041655 2051513 2061919 2072881
46856 2072881 2084745 2097706 2111545 2126055 2141504 2158321 2176369 2194893 2213164 2230856 2247725
46845 2247725 2263300 2277118 2289027 2298994 2306707 2311708 2314003 2314354 2313714 2312332 2309557 2304663 2297768 2289811
46831 2289811 2281664 2273641 2265905 2259005 2253609 2249936 2247864 2247514 2249286 2253257 2259068 2266642 2276554 2289291
46817 2289291 2304350 2320628 2337633 2355833 2375617 2396291 2416475 2435269 2452634 2468687 2483098
46806 2483098 2495402 2505511 2513517 2519168 2522030 2522139 2520027 2516011 2509901 2501668 2491949 2481549 2470757
46793 2470757 2459570 2448279 2437317 2426733 2416329 2406183 2396462 2386859 2376953 2367224 2359005 2353052
46781 2353052 2348728 2344906 2341232 2338149 2336094 2335130 2335041 2335432 2335968 2336785 2338287 2340267 2341766 2342306 2342771 2344391
46765 2344391 2347175 2350178 2353108 2356767 2361812 2367977 2374831 2382655 2392107 2403432 2416418 2430895 2446928
46752 2446928 2464677 2484178 2505099 2526648 2548042 2569246 2590922 2613465 2636354 2658579 2679399
46741 2679399 2698523 2715910 2731748 2746411 2760127 2772726 2783831 2793205 2800822 2806867 2811749 2815873
46729 2815873 2819289 2821818 2823717 2825846 2828921 2832876 2837301 2842287 2848475 2856345 2865705 2875839 2885941
46716 2885941 2895542 2904654 2913415 2921520 2928291 2933447 2937388 2940353 2941594 2939910 2934851 2926958 2916911 2904844
46702 2904844 2890410 2873050 2852174 2827584 2799864 2770011 2738519 2705140 2669710 2632915 2596003
46691 2596003 2559855 2524494 2489371 2454073 2418872 2384704 2352496 2322426 2293879 2266122 2238944
46680 2238944 2212695 2187860 2164638 2142842 2122166 2102496 2083888 2066241 2049274 2032969 2017786
46669 2017786 2004141 1991832 1980336 1969568 1959995 1952076 1945954 1941646 1939145 1938278 1938877 1941204 1945826
46656 1945826 1952886 1961841 1972058 1983371 1995845 2009264 2023096 2036719 2049510 2060975 2071086 2080255
46644 2080255 2088700 2095951 2101291 2104551 2106222 2106891 2106902 2106521 2106096 2105968 2106499 2108341 2112438 2119489 2129422 2141590
46628 2141590 2155561 2171586 2190211 2211521 2234951 2259812 2285724 2312428 2339419 2366046 2391819
46617 2391819 2416301 2438710 2457956 2473155 2483912 2490091 2491596 2488466 2480942 2469264 2453601 2434310
46605 2434310 2412151 2388074 2362875 2337088 2311123 2285345 2260036 2235323 2211191 2187692 2165243
46594 2165243 2144484 2125672 2108343 2091924 2076424 2062098 2048488 2034494 2019580 2004434 1990070
46583 1990070 1976718 1963904 1951236 1938608 1925852 1912710 1899246 1886033 1873853 1863266 1854279
46572 1854279 1846250 1838320 1830188 1822394 1815735 1810545 1806636 1803631 1801086 1798567 1796006 1793899 1792892 1793241
46558 1793241 1794800 1797192 1799750 1801672 1802782 1804008 1806602 1810837 1815879 1820869 1825747 1831018 1837170 1844478
46544 1844478 1852969 1862360 1872270 1882671 1893946 1906416 1920022 1934593 1950236 1967219 1985525 2004687
$$ [...]
##END NTUPLES=NMR SPECTRUM
##END=
