##TITLE=AC1710_ROEFFECT0030_8638173_unTmHUejkH
##JCAMPDX= 6.0         $$ Bruker NMR JCAMP-DX V2.0
##DATA TYPE= NMR SPECTRUM
##DATA CLASS= NTUPLES
##ORIGIN= BRUKER
##OWNER= Administrator
$$ 1.72 TOPSPIN		Version 2.1
$$ 2014-05-22 20:33:24.905 -0700  Administrator@X
$$ Compression mode = diff/dup
##.OBSERVE FREQUENCY= 400.02188249412
##.OBSERVE NUCLEUS= ^1H
##.ACQUISITION MODE= SIMULTANEOUS (DQD)
##.ACQUISITION SCHEME= undefined
##.AVERAGES= 8
##.DIGITISER RES= 22
##SPECTROMETER/DATA SYSTEM= spect
##.PULSE SEQUENCE= zg30
##.SOLVENT NAME= COFFEE_meoh
##.SHIFT REFERENCE= INTERNAL, COFFEE_meoh, 1, 14.98509
##AUDIT TRAIL= $$ (NUMBER, WHEN, WHO, WHERE, PROCESS, VERSION, WHAT)
$$ ##TITLE= Audit trail, TOPSPIN		Version 2.1
$$ ##JCAMPDX= 5.01
$$ ##ORIGIN= Bruker BioSpin GmbH
$$ ##OWNER= Administrator
$$ $$ E:\/data/COFFEE/nmr/AC1710_ROEFFECT0030_8638173_unTmHUejkH/10/pdata/1/auditp.txt
$$ ##AUDIT TRAIL=  $$ (NUMBER, WHEN, WHO, WHERE, PROCESS, VERSION, WHAT)
(   1,<2014-05-22 20:33:15.296 -0700>,<Administrator>,<X>,<go>,<TOPSPIN 2.1>,
      <created by zg
	started at 2014-05-22 20:32:09.046 -0700,
	POWCHK enabled, PULCHK disabled,
       configuration hash MD5:
       C8 4E 4E 5D D3 5C D8 9E 9F 52 82 E0 59 8A DE 15
       data hash MD5: 64K
       0E 38 55 32 9A 18 F7 F4 CB B4 EB 84 40 34 69 A3>)
(   2,<2014-05-22 20:33:21.171 -0700>,<Administrator>,<X>,<proc1d>,<TOPSPIN 2.1>,
      <Start of raw data processing
       efp LB = 0 FT_mod = 6 PKNL = 1 PHC0 = 0 PHC1 = 0 SI = 32K 
       data hash MD5: 32K
       DB AE 8D B9 1C CA 2A ED 80 B2 D3 53 3E 5D EF F1>)
(   3,<2014-05-22 20:33:21.483 -0700>,<Administrator>,<X>,<proc1d>,<TOPSPIN 2.1>,
      <pk PHC0 = 92.10938 PHC1 = 0 
       data hash MD5: 32K
       1D 84 C5 3C F0 7F E8 63 90 72 B2 45 11 DB 1E 95>)
(   4,<2014-05-22 20:33:21.608 -0700>,<Administrator>,<X>,<proc1d>,<TOPSPIN 2.1>,
      <abs ABSG = 1 
       data hash MD5: 32K
       31 ED 12 E6 D7 81 BB E9 0F 6E BD 1B 6B 2A 82 90>)
(   5,<2014-05-22 20:33:21.671 -0700>,<Administrator>,<X>,<proc1d>,<TOPSPIN 2.1>,
      <abs ABSG = 2 
       data hash MD5: 32K
       B5 0C 4E 75 C9 80 86 D4 53 30 58 74 D5 F3 65 3F>)
(   6,<2014-05-22 20:33:21.733 -0700>,<Administrator>,<X>,<proc1d>,<TOPSPIN 2.1>,
      <abs ABSG = 3 
       data hash MD5: 32K
       98 A3 0B 93 7C 59 77 42 27 F6 59 8F C6 10 3C 24>)
(   7,<2014-05-22 20:33:21.811 -0700>,<Administrator>,<X>,<proc1d>,<TOPSPIN 2.1>,
      <abs ABSG = 4 
       data hash MD5: 32K
       C2 4A 26 78 F9 75 56 B1 32 7E AA 9A 55 13 2B 4D>)
(   8,<2014-05-22 20:33:21.858 -0700>,<Administrator>,<X>,<proc1d>,<TOPSPIN 2.1>,
      <abs ABSG = 5 
       data hash MD5: 32K
       90 A6 26 03 4F FB 67 4F 1C 62 1E C3 C3 B2 46 C5>)
$$ ##END=
$$ 
$$ $$ hash MD5
$$ $$ 8E 56 20 B0 48 96 0D 38 4A FA 4A C2 CA EC D3 8B
##$RELAX= 
##$RELAX= 
##$RELAX= 
##$RELAX= 
##$RELAX= 
##$RELAX= 
##$RELAX= 
$$ Bruker specific parameters
$$ --------------------------
##$DU= <E:\>
##$EXPNO= 10
$$ [...]
150 150 150 150 150 150 150 150
##$TP07= 0
##$TPNAME0= <>
##$TPNAME1= <>
##$TPNAME2= <>
##$TPNAME3= <>
##$TPNAME4= <>
##$TPNAME5= <>
##$TPNAME6= <>
##$TPNAME7= <>
##$TPOAL= (0..7)
0.5 0.5 0.5 0.5 0.5 0.5 0.5 0.5
##$TPOFFS= (0..7)
0 0 0 0 0 0 0 0
##$TUNHIN= 0
##$TUNHOUT= 0
##$TUNXOUT= 0
##$USERA1= <user>
##$USERA2= <user>
##$USERA3= <user>
##$USERA4= <user>
##$USERA5= <user>
##$V9= 5
##$VALIST= <valist>
##$VCLIST= <CCCCCCCCCCCCCCC>
##$VD= 0
##$VDLIST= <DDDDDDDDDDDDDDD>
##$VPLIST= <PPPPPPPPPPPPPPP>
##$VTLIST= <TTTTTTTTTTTTTTT>
##$WBST= 2048
##$WBSW= 25
##$XGAIN= (0..3)
0 0 0 0
##$XL= 0
##$YL= 0
##$YMAX_a= 603399
##$YMIN_a= -516495
##$ZGOPTNS= <>
##$ZL1= 120
##$ZL2= 120
##$ZL3= 120
##$ZL4= 120
##$ABSF1= 14.98509
##$ABSF2= -5.573092
##$ABSG= 5
##$ABSL= 3
##$ALPHA= 0
##$AQORDER= 0
##$ASSFAC= 0
##$ASSFACI= 0
##$ASSFACX= 0
##$ASSWID= 0
##$AUNMP= <proc_prof1d_extract_pilot.lims>
##$AXLEFT= 0
##$AXNAME= <>
##$AXNUC= <1H>
##$AXRIGHT= 0
##$AXTYPE= 0
##$AXUNIT= <>
##$AZFE= 0.1
##$AZFW= 0.1
##$BCFW= 0
##$BC_mod= 0
##$BYTORDP= 0
##$COROFFS= 0
##$CY= 15
##$DATMOD= 1
##$DC= 0
##$DFILT= <>
##$DTYPP= 0
##$F1P= 0
##$F2P= 0
##$FCOR= 0.5
##$FTSIZE= 32768
##$FT_mod= 6
##$GAMMA= 0
##$GB= 0
##$INTBC= 1
##$INTSCL= 1
##$ISEN= 128
##$LB= 0
##$LEV0= 0
##$LPBIN= 0
##$MAXI= 10000
##$MC2= 0
##$MEAN= 0
##$ME_mod= 0
##$MI= 0
##$NCOEF= 0
##$NC_proc= -8
##$NLEV= 6
##$NOISF1= 0
##$NOISF2= 0
##$NSP= 0
##$NTH_PI= 0
##$NZP= 0
##$OFFSET= 14.98509
##$PC= 1
##$PHC0= 92.10938
##$PHC1= 0
##$PH_mod= 1
##$PKNL= yes
##$PPARMOD= 0
##$PPDIAG= 0
##$PPIPTYP= 0
##$PPMPNUM= 2147483647
##$PPRESOL= 1
##$PSCAL= 4
##$PSIGN= 0
##$PYNMP= <proc.py>
##$REVERSE= no
##$SF= 400.02
##$SI= 32768
##$SIGF1= 0
##$SIGF2= 0
##$SINO= 400
##$SIOLD= 32768
##$SPECTYP= <>
##$SREGLST= <1H.CDCl3>
##$SSB= 0
##$STSI= 32768
##$STSR= 0
##$SW_p= 8223.68421052631
##$SYMM= 0
##$S_DEV= 0
##$TDeff= 65536
##$TDoff= 0
##$TI= <>
##$TILT= no
##$TM1= 0
##$TM2= 0
##$TOPLEV= 0
##$USERP1= <user>
##$USERP2= <user>
##$USERP3= <user>
##$USERP4= <user>
##$USERP5= <user>
##$WDW= 1
##$XDIM= 32768
##$YMAX_p= 464302921
##$YMIN_p= -726464
##$CURPLOT= <Network HP LaserJet P1505>
##$CURPRIN= <$Network HP LaserJet P1505>
##$DFORMAT= <normdp>
##$LAYOUT= <+/1D_H.xwp>
##$LFORMAT= <normlp>
##$PFORMAT= <normpl>
##$SURQMSG= 1
$$ End of Bruker specific parameters
$$ ---------------------------------
##NTUPLES= NMR SPECTRUM
##VAR_NAME=  FREQUENCY,     SPECTRUM/REAL,   SPECTRUM/IMAG
##SYMBOL=    X,             R,               I
##VAR_TYPE=  INDEPENDENT,   DEPENDENT,       DEPENDENT
##VAR_FORM=  AFFN,          ASDF,            ASDF
##VAR_DIM=   32768,         32768,           32768
##UNITS=     HZ,            ARBITRARY UNITS, ARBITRARY UNITS
##FACTOR=    0.250966925370066, 1,           1
##FIRST=     8223.43324360094, -236197,      -71011
##LAST=      0,             262597,          -67333
##MIN=       0,             -726464,         0
##MAX=       8223.43324360094, 464302921,    0
$$ Real data points
##PAGE= N=1
##DATA TABLE= (X++(R..R)), XYDATA
$$ [...]
$$ plain form
19563 122652 -194051 -235403 -9972 8575 12994 -29142 -52111 -251393 140163 -175239 -422836
19552 -422836 -9043 117797 -49396 -13815 -116329 -47839 28193 -136861 14531 -1913 137151
19540 186863 -159994 -54932 160472 -17923 86935 -43974 40811 -257724 151619 39096 -199729
19528 -75325 73065 -247857 81063 -204579 -186453 33480 -269344 -165900 16127 -73630 71897
19516 -169353 -306626 -139215 -42586 -218340 93522 -268018 227613 -35307 -366987 81037
19505 68451 260108 -94025 -150959 -63707 -11815 5062 -76352 46749 -66631 -489740 -42352
19493 -314372 14981 26104 27235 -167643 -24145 -352583 245104 36326 -195675 -354499 -286960
19482 -286960 23821 54016 -107419 91780 -210535 275483 22812 -13488 57762 -35176 -254794
$$ packed form
19563A22652a94051m1352i972H575M419b9142k2969j99282A40163a75239k47597
19552d22836i043A17797d9396a3815j02514d7839B8193a36861A4531a913A37151
19540A86863a59994e4932A60472a7923H6935d3974D0811b57724A51619C9096a99729
19528g5325G3065b47857H1063b04579J8126C3480b69344J03444A6127g3630G1897
19516a69353j37273a39215d2586j75754I3522b68018B27613c5307l31680H1037
19505F8451J91657i4025n6934f3707a1815E062g6352D6749f6631m23109d2352
19493c14372A4981J1123J131a67643b4145l28438B45104C6326a95675j58824O7539
19482b86960B3821L0195a07419I1780b10535B75483B2812a3488E7762c5176k19618
$$ plain form
19471 -254794 -545888 -273713 -135997 -8640 272396 203249 -53230 -168677 -226533 -96438 -160390
19460 -160390 104779 91981 274193 -51294 -133784 76703 69374 204979 -90863 139454 35411
19448 -24369 -10141 18726 101326 -125937 -99298 12174 -141770 -21738 -36491 -128393 102116
19436 -116224 -345831 -287769 -174008 -35050 107246 -273867 143939 -345747 -257601 33161
19425 -221939 11331 36127 -231553 -99109 -157864 -105377 75586 196649 55831 -63804 -183375
19414 -183375 24778 88700 -174076 94197 -135893 56177 -282153 130482 -132790 -161268
19404 -161268 -51966 -12802 -113802 -78702 -286052 -259445 66742 -31282 -229137 187252 47329
19392 48202 85007 -85872 -268820 -124668 -122622 -359820 -225269 62102 -179312 1036 171033
$$ packed form
19471b54794k91094K72175a35997h640B72396o9147e3230j15447n7856i6438o3952
19460a60390A04779j2798J82212e1294q2490G6703p329J35605i0863A39454C5411
19448b4369a0141A8726Q2600a25937K6639A2174a41770b1738j4753r1902A02116
19436a16224k29607N8062J13761c5050A07246b73867A43939c45747Q8146C3161
19425b21939A1331K4796b31553i9109n8755N2487G5586J21063E5831f3804j19571
19414a83375B4778O3922a74076I4197a35893E6177b82153A30482a32790k8478
19404a61268e1966a2802j01000L5100k07350K6607F6742c1282j97855A87252D7329
19392D8202L6805h5872j82948a24668K046k37198J34551F2102a79312A036J69997
$$ plain form
19381 171033 5183 -276396 -9974 -434651 132759 30900 51149 50979 -164579 137556 -256931
19369 -219355 -273776 -190674 123 -96126 57405 -334925 259519 317387 -110570 130832 6786
19357 153580 -413663 127348 136916 -202656 -18124 -365916 -72476 95090 -230027 -250838 179561
19345 -244623 195148 -220397 -406685 -172371 70935 -184280 229363 67964 255364 -349530
19334 -439384 -167826 -346590 -37556 -75917 -97833 108758 -288453 -133944 -113090 40780
19323 242004 -398893 -167600 -346510 48506 -24347 -38649 -268464 -73404 136662 -167731
19312 -155824 139687 -160763 90828 38720 28743 3955 18020 -58539 -26791 145779 10789
19300 -112429 6024 -282471 -70164 -44110 -68379 9273 -8512 -98961 -288866 -148559 -198202
$$ packed form
19381A71033E183b76396i974m24677A32759C0900K0249j70a64579A37556b56931
19369b19355n4421Q3102A23i6126E7405c34925B59519N7868a10570A30832F786
19357A53580d13663A27348R568b02656a8124l47792g2476I5090b30027k0811A79561
19345b44623A95148b20397j86288a72371G0935a84280B29363F7964J87400c49530
19334d39384a67826j78764c7556l8361k1916A08758b88453a33944K0854D0780
19323B42004c98893a67600j78910D8506b4347j4302k29815g3404A36662a67731
19312a55824A39687a60763I0828C8720r977C955J4065e8539b6791A45779A0789
19300a12429F024b82471g0164K6054k4269I273h512r0449j89905J40307m9643
$$ plain form
19289 -198202 42088 -20999 -362136 2285 -193244 41730 -293579 -54584 124919 -82994 -14248
19277 94857 118783 -78076 35235 21940 -177085 -84169 159944 4495 -140085 -81428 142525
19265 13047 -69865 20256 -394037 70081 16638 167494 -17310 104316 36815 -218223 37546
19253 -213681 -220000 -167718 -317206 -290138 -258619 -122753 -157715 55109 -217247 -60423 192067
19241 -129425 90957 -285785 -85737 -3839 -143283 41792 9389 -444308 130039 64626 -102948
19229 236324 -106596 135232 -19467 -272493 -65449 -145369 -82094 -251289 195077 -53813
19218 -122721 -338854 -186841 272762 89040 -94676 247382 132271 85798 -120129 -151393
19208 -151393 109029 -263209 82537 -136129 -115718 -90589 65064 -91886 -38259 37682 -182595
$$ packed form
19289a98202D2088b0999l41137B285a93244D1730b93579e4584A24919h2994a4248
19277I4857K3926g8076C5235j3295a77085h4169A59944D495a40085N8657A42525
19265A3047f9865B0256c94037G0081A6638J50856a7310A04316C6815b18223C7546
19253b13681o319N2282j49488K7068L1519a22753l4962E5109b17247f0423A92067
19241a29425I0957b85785h5737c839j39444D1792I389d44308A30039F4626a02948
19229B36324a06596A35232a9467k53026f5449p9920O3275j69195A95077e3813
19218a22721k16133J52013B72762H9040i4676B47382j15111m6473a20129l1264
19208a51393A09029b63209H2537a36129K0411K5129F5064i1886c8259C7682a82595
$$ plain form
19196 108460 -243425 -33257 -272597 -131994 -140650 -103505 -126244 -194167 -5854 -6894 -32068
19185 -32068 138738 -366359 -58751 70642 -81008 -89956 37983 -97142 33565 101202 -34793
19173 38482 23845 -113422 -29815 170784 -319206 -129290 -9540 316315 -253008 245612
19162 -108280 407996 27688 -299660 -4915 -412773 -22341 -36074 -21032 157903 151088 -311669
19150 131507 -117778 18912 21794 -215278 -350351 163523 -42108 96426 -52051 212554 -1703
19138 -51296 105198 -252235 -7396 -419149 -18221 24210 -242913 -86985 -156838 -1181 149730
19126 7496 76899 -15136 34925 -196420 62560 -105490 -114364 130571 116877 -368807 -14519
19114 -43498 -212276 -225453 264215 65337 -206162 -196581 74295 -227871 115824 35870 -241863
$$ packed form
19196A08460b43425c3257k39340a31994q656L7145k2739o7923e854j040k5174
19185c2068A38738c66359e8751G0642h1008q948C7983i7142C3565O7637c4793
19173C8482j4637a13422b9815A70784c19206a29290i540C16315b53008B45612
19162a08280D07996B7688b99660d915m07858b2341j3733J5042A57903o815c11669
19150A31507a17778A8912K882b15278j35073A63523d2108I6426e2051B12554a703
19138e1296A05198b52235g396m11753a8221B4210b42913h6985o9853a181A49730
19126G496O9403a5136C4925a96420F2560a05490q874A30571j3694c68807a4519
19114d3498j68778j3177B64215F5337b06162R581G4295b27871A15824C5870b41863
$$ plain form
19102 664 -250940 -343853 -100600 -111447 73601 -2566 -37099 180500 -208305 23053 -291126
19090 -12413 142002 -72135 -196061 -231307 -100761 -25631 -404652 -57433 55329 187004 -113599
19078 204070 54309 88903 -167954 -210470 151245 318374 -161902 220263 -63660 -35795
19068 -35795 -212887 -24349 31831 -10725 80843 250213 -127063 -48338 -19594 72113 -91006
19056 -256485 26463 13991 79897 36104 167204 198993 -415944 -70819 -160074 -66589 -82287
19045 -82287 12426 261266 66818 -32065 -51660 35392 -107318 -120598 179486 62249 70651
19034 70651 154566 -363279 -75129 181937 -207201 329887 396778 -12414 126979 130105 -136644
19022 61823 92190 103485 109982 65939 304452 -86488 68609 26837 -2327 -15163 203256 -87590
$$ packed form
19102F64b50940r2913a00600j0847G3601b566l4533A80500b08305B3053b91126
19090a2413A42002g2135j23926l5246a00761b5631l79021e7433E5329J31675a13599
19078B04070E4309L4594a67954m2516A51245J67129a61902B20263f3660K7865
19068c5795j77092b4349C1831a0725H0843J69370a27063d8338a9594G2113i1006
19056b56485B6463j2472O5906C6104J31100L1789d15944g0819q9255f6589j5698
19045h2287A2426K48840F6818c2065j9595C5392a07318j3280A79486F2249Q402
19034G0651Q3915c63279g5129A81937b07201C29887O6891a2414A26979L126a36644
19022F1823L0367J1295O497m4043K38513h6488F8609B6837b327j2836B03256h7590
$$ plain form
19009 -21605 194995 33960 -80521 -75913 -330324 -144983 54320 28309 64708 -220044 74235
18997 -444594 -92140 -48362 -196987 -13465 -72456 -24409 18257 -60186 165072 -19539 317856
18985 27710 -193344 -47184 60178 -178848 46351 135360 -283162 -56417 153402 -366383 -147299
18973 90754 10786 -160510 -161589 -357241 -350733 225053 -143677 -81176 -134984 -89999 -175090
18962 -175090 -96158 11443 -1253 -45070 18257 328723 199681 -181414 -9318 198196 -202283
18950 -160500 -228721 -171604 159233 -59202 135219 330393 104665 -258063 8206 -46773 226941
18938 -355758 125342 126105 -98493 118162 213313 -106051 247103 -563336 -234920 -81456 -471840
18927 -471840 -49425 222740 -109103 -197391 -149765 -18359 -178814 -107722 -270810 370257
$$ packed form
19009b1605A94995C3960h0521M608k54411a44983E4320k6011L6399b20044G4235
18997d44594i2140M3778j48625a3465n8991b4409A8257f0186A65072a9539C17856
18985B7710a93344d7184F0178a78848D6351Q9009b83162e6417A53402c66383a47299
18973I0754A0786a60510j079j95652O508B25053a43677O2501n3808M4985q5091
18962a75090P8932A1443a253m3817A8257L10466j29042a81414i318A98196b02283
18950a60500o8221N7117A59233e9202A35219J95174A04665b58063H206d6773B26941
18938c55758A25342P63i8493A18162R5151a06051B47103e63336b34920h1456l90384
18927d71840d9425B22740a09103q8288M7626a8359j60455P1092j63088C70257
$$ plain form
18916 -228586 -177844 -31805 -38311 -181848 -296494 60987 -269264 77082 141537 29670 -103741
18904 147649 -252321 -54955 -59558 -161167 56377 -32809 -318940 -85746 -33913 -164239 -18647
18892 -62205 -93753 26967 194165 -14775 178868 -89227 -87713 91633 432922 28490 20595
18881 20595 180976 -211107 -100794 84171 -83976 128911 284886 110034 -139216 -299047
18871 -299047 -252161 -280431 -87627 -236724 -491375 -117825 122657 -103318 -101192 -87737 278092
18859 -77008 -193838 -72818 -62847 3416 -124875 -181605 -135530 -124220 -327476 95324 -246340
18847 48104 -61645 15533 265329 201219 103722 -178466 46514 85589 90313 156024 16538
18835 -172860 85586 65694 75463 -154060 -64007 7979 303391 -271435 -24460 -398084 -127000
$$ packed form
18916b28586N0742c1805o506j43537j14646F0987b69264G7082O4455B9670a03741
18904A47649b52321e4955m603j01609E6377c2809k86131h5746c3913j30326a8647
18892f2205l1548B6967J67198a4775A78868h9227J514I1633L41289B8490p895
18881B0595J60381b11107a00794H4171h3976A28911J55975A10034a39216j59831
18871b99047M6886k8270h7627j49097k54651a17825A22657a03318K126J3455B78092
18859g7008j16830g2818R971C416a24875n6730M6075J1310k03256I5324b46340
18847D8104f1645A5533K49796o4110r7497a78466D6514L9075M724O5711A6538
18835a72860H5586j9892R769a54060f4007G979K95412b71435b4460l73624a27000
$$ plain form
18823 -5301 175111 -187410 191453 -186068 164904 -149952 96802 22839 -85842 300221
18812 -221407 -415809 -33448 13136 44007 410257 215514 130486 -25806 165702 -423068
18801 -28899 151110 3506 -162130 -76857 2778 201056 186819 -380545 -61265 -143096 -97577
18790 -97577 -109326 -37515 -38706 -276640 -337305 -217870 -213160 -109824 -231727 105245 -447556
18778 -367947 -96754 67753 110647 -303227 78834 -123968 -376413 64527 -282055 -78460 -292262
18767 -292262 -80293 281821 -108006 7869 321845 -41504 -26444 -247256 -5956 48193 -90520
18755 -10569 -249529 179689 -171201 -98820 -199613 33847 -18190 -473141 -1261 -34246 -85163
18744 -85163 -16967 17431 -68654 -59634 -19218 28362 -154610 107439 191842 -2409 -277815
$$ packed form
18823e301A75111a87410A91453a86068A64904a49952I6802B2839h5842C00221
18812b21407j94402c3448A3136L0871L66250j94743q5028b5806A65702d23068
18801b8899A51110C506a62130g6857B778J98278j4237c80545f1265q1831M5519
18790i7577j1749c7515j191k37934o0665J19435M710J03336j21903A05245d47556
18778c67947i6754F7753M2894c03227G8834a23968k52445F4527b82055g8460k13802
18767b92262h0293B81821a08006G869L13976d1504J5060k20812e956D8193i0520
18755a0569k38960A79689a71201P2381j00793C3847a8190m54951a261l2985n0917
18744h5163a6967A7431f8654R020a9218B8362a54610A07439Q4403b409k75406
$$ plain form
18733 -277815 -86930 15012 -159617 -290998 -374341 -33262 -116629 39034 -118950 -430038 -70006
18721 -116457 -45745 -313045 -109376 -125124 335066 -71140 166336 14067 228960 -82269
18710 61675 -228660 -33477 308332 -64155 -61939 -118120 -17197 64964 89022 -139264 27045
18698 222460 -555988 55965 -376798 -108633 32422 146872 224382 112939 -79015 45 -344993
18686 -84619 -84245 -303107 -127308 -92957 -251185 -70221 365078 111798 -25064 -30835 -62451
18675 -62451 -299622 -56705 54725 -17558 183464 -178627 -274603 -64369 158534 -127636 -286353
18664 -286353 -177177 -121974 111767 46433 35488 -170175 -339472 144898 32734 -193640
18653 166137 -73037 -255519 18051 136818 489060 97573 -4776 391378 23640 23501 -408032
$$ packed form
18733b77815h6930A5012a59617j31381q3343c3262q3367C9034a18950l11088g0006
18721a16457d5745k67300a09376j5748C35066g1140A66336A4067K14893h2269
18710F1675b28660c3477C08332f4155K216n6181a7197F4964K4058a39264B7045
18698B22460e55988E5965c76798a08633C2422J14450P7510j11443g9015D5c44993
18686h4619L74k18862a27308L4351j58228g0221C65078A11798b5064n771l1616
18675f2451k37171e6705E4725a7558A83464a78627r5976f4369A58534a27636j58717
18664b86353J09176N5203A11767D6433j0945a70175j69297A44898C2734a93640
18653A66137g3037j82482A8051J18767L52242I7573d776C91378B3640j39d08032
$$ plain form
18641 217876 -76055 -31269 -83082 81760 36450 -379302 -369657 -285752 281492 329539 -376120
18629 -90680 135270 -9360 -92863 -280334 173713 -182562 -152422 134215 -334229 -90760 5999
18617 56889 -343903 -18912 161638 -60160 -107362 101395 -345048 -144986 65848 -76441 -353960
18606 -353960 -80589 31469 -1063 89102 29792 87525 26198 150556 75581 -365700 -57857
18594 285641 -28394 28362 75271 -79277 -32991 -15985 -23284 10809 -59320 -85796 21788 70166
18582 70166 -25828 23875 -86844 -67647 -88005 142294 -52402 -3048 -77123 -128365 -48271 -161045
18570 -161045 -27492 109806 2686 -202281 -562177 283362 -192959 82051 -163360 -27759
18559 -107293 -209253 195059 -141817 -143907 -232545 44503 -30224 -220856 -65090 -138034 -17973
$$ packed form
18641B17876g6055c1269n1813H1760C6450c79302R645Q3905B81492M8047c76120
18629i0680A35270i360q3503j87471A73713a82562L0140A34215c34229i0760E999
18617E6889c43903a8912A61638f0160m7202A01395c45048a44986F5848g6441k77519
18606c53960h0589C1469a063H9102B9792N7733B6198J24358p4975c65700e7857
18594B85641b8394B8362M6909g9277c2991a5985p299A0809e9320k6476B1788M8378
18582G0166b5828B3875h6844J9197k0358A42294e2402c048p4075n1242d8271j12774
18570a61045b7492A09806B686b02281l59896B83362a92959H2051a63360b7759
18559a07293j01960A95059a41817k090q8638D4503c0224j90632f5090p2944a7973
$$ plain form
18547 275060 202794 3074 -240771 284607 -511658 -165403 -70418 38568 -333960 -157844
18536 176647 200480 -118436 -13383 5382 -282912 52550 46608 176383 -171509 -440533 217183
18524 131141 -120901 -90288 76825 -39146 -328227 42288 -437243 140725 6939 -141048 41987
18512 -254666 -72061 159080 -40402 -111865 -81221 306543 -211859 -73847 -153732 158889 -22528
18500 -72979 227854 159621 -34996 -70774 153468 -95185 -187315 80010 115422 -56910 109277
18488 -17136 -76848 -33345 -119001 -15510 -65737 -23949 289144 -9469 124515 -29570 66114
18476 -118228 -101523 -83625 -325828 -63265 -430299 84104 103169 14484 -49621 45646 8305
18464 103089 -679 50994 104105 -354414 -125986 -45646 -10885 -53503 -51189 78525 77132 173401
$$ packed form
18547B75060p2266C074b40771B84607e11658a65403g0418C8568c33960a57844
18536A76647K3833a18436a3383E382b82912E2550n942J29775a71509k69024B17183
18524A31141a20901L0613G6825c9146k89081D2288d37243A40725F939a41048D1987
18512b54666g2061A59080d0402p1463L0644C06543b11859g3847p9885A58889b2528
18500g2979B27854o8233c4996l5778A53468i5185r2130H0010L5412e6910A09277
18488a7136n9712c3345q5656a5510n0227b3949B89144i469A24515b9570F6114
18476a18228J6705J7898k42203f3265l67034H4104J9065A4484d9621D5646H305
18464A03089f79E0994N3111c54414a25986d5646a0885m2618K314G8525j393R6269
$$ plain form
18452 173401 -9277 -49322 -50174 -303606 -280013 33093 112595 -14260 406328 75341 248609
18441 248609 -50778 -182237 41090 102487 -449098 -195258 -198453 -245872 65605 173889 280079
18430 280079 -131521 2413 -170133 75539 -193091 -109340 -26788 -250423 -78168 -172808 62159
18418 -178909 -60434 -151147 107976 56076 -116668 -59634 -256169 -21232 149071 -178016
18407 -139402 129565 130759 -102520 -22524 5685 -60244 191995 138130 23948 -210996 161635
18395 -305295 -61899 194181 -52440 93680 189365 -160615 343270 -74774 -133172 188124 -116440
18383 -78869 239945 -132849 43311 37268 -190896 -121943 -67640 -56834 18998 -102199 284464
18371 -328550 -285892 -45321 -253981 -81541 -18096 -47744 29196 97379 264852 185964 -99767
$$ packed form
18452A73401i277m0045q52k53432K3593C3093P9502a4260D06328G5341J73268
18441B48609e0778j31459D1090O1397d49098a95258l195m7419F5605J08284J06190
18430B80079a31521B413a70133G5539a93091Q3751b6788k23635g8168r4640F2159
18418a78909f0434r0713A07976n1900a16668N7034j96535b1232A49071a78016
18407a39402A29565J194a02520b2524E685f0244A91995n3865B3948b10996A61635
18395c05295f1899A94181e2440I3680R5685a60615C43270g4774n8398A88124a16440
18383g8869B39945a32849D3311o043a90896O8953N4303J0806A8998a02199B84464
18371c28550M2658d5321k08660h1541a8096k9648B9196O8183J67473p8888i9767
$$ plain form
18359 -370115 153327 -69334 66906 -145990 -108934 -397412 -32091 -48997 -154937 -190556 216229
18347 198688 -270842 -333 -233384 -53616 23351 -200362 -17814 -221639 122209 -318856 45910
18335 -264357 -326297 -145458 216244 -151164 185577 212638 -125452 -5266 -196597 -177090
18325 -177090 -83089 -80044 -176127 -16810 131764 -335585 -307317 -306878 -254605 -135919 -19479
18313 29623 112942 -121026 -197265 -332558 -149099 -90417 -91907 -66977 107106 -48713 -54864
18302 -54864 -232152 -52260 -20392 -83713 -439729 38591 -6026 -140963 -180367 -26372 -290003
18291 -290003 29383 -202192 -124490 101450 17749 -60165 85737 -175967 -15779 -17639 -316021
18280 -316021 275096 -43509 -278383 59466 28110 -203398 -185332 -329664 -152223 186251
$$ packed form
18359c70115A53327f9334F6906a45990L7056k88478c2091j6906j05940l5619B16229
18347A98688b70842c33k33051e3616B3351b00362a7814k03825A22209c18856D5910
18335b64357o1940a45458B16244a51164A85577K7061a25452e266j91331J9507
18325a77090h3089L045r6083a6810A31764c35585K8268M39N2273J18686a9479
18313B9623Q3319a21026p6239j35293a49099N8682j490K4930A07106d8713o151
18302e4864j77288e2260b0392o3321l56016C8591f026j34937l9404b6372k63631
18291b90003B9383b02192P7702A01450A7749f0165H5737a75967a5779j860k98382
18280c16021B75096d3509k34874E9466B8110b03398J8066j44332a52223A86251
$$ plain form
18269 -5989 19042 34368 -95455 -14455 213866 -26325 52729 33833 -299391 -355685 -70914
18257 -19406 118492 1512 -2461 -174933 164523 44007 -3076 339870 14165 198695 207258
18246 207258 -94953 199415 4750 -229535 -49383 -216349 -236186 -445527 212403 108757
18236 108757 -11414 -85752 20592 -337061 -96221 185974 333139 -42517 183406 -22180 -49350
18225 -49350 21797 73947 351743 -312946 188141 292134 -133739 -25879 -314049 -205099
18215 -205099 -70061 -204590 183767 24556 -180415 -96449 349498 -283106 -138478 171342
18204 -102234 -268656 55973 -47140 -104880 48234 -109815 130287 -101810 -132084 -416373
18194 -416373 337320 -71283 114735 -115031 -66014 44644 -348513 228201 28934 11502
$$ packed form
18269e989A9042J5326i5455a4455B13866b6325E2729j8896b99391n6294g0914
18257a9406A18492A512b461j72472A64523D4007c076C39870A4165J84530Q563
18246B07258i4953A99415D750b29535d9383j66966j9837k09341B12403j03646
18236A08757a1414p4338B0592c37061i6221A85974J47165d2517A83406b2180k7170
18225d9350B1797N2150K77796c12946A88141J03993a33739b5879k88170J08950
18215b05099g0061j34529A83767B4556a80415Q3966C49498b83106a38478A71342
18204a02234j66422E5973d7140n7740D8234a09815A30287a01810l0274k84289
18194d16373C37320g1283A14735a15031M9017D4644c48513B28201B8934A1502
$$ plain form
18183 -37554 43404 -211141 -276839 -210516 -33686 -106502 14361 -66059 -147095 -90090 -424983
18172 -424983 160603 -436017 -160345 -54714 -18726 -103267 -328361 819 124797 -51818 -207520
18161 -207520 -78878 -219351 -66192 -340916 59173 -147050 -75607 254849 -5493 -166494 105526
18149 -76499 -387483 -249762 -111690 27574 -32550 155826 49750 102092 68572 -92499 -213141
18138 -213141 146258 24894 -68712 239158 16595 234431 -112715 -290024 -208679 124652
18127 174122 94422 114357 66824 -28598 19774 31418 76390 -9995 -328718 -29043 -167266
18116 -167266 49865 15525 -178229 -14840 -210186 -91050 -81810 6176 -144255 160285 -341208
18104 6756 176230 3223 -248975 -24044 64446 -28487 133659 -135272 -135154 42916 -164248
$$ packed form
18183c7554D3404b11141o5698O6323c3686p2816A4361f6059q1036N7005l34893
18172d24983A60603d36017a60345e4714a8726q4541k25094H19J23978e1818j55702
18161b07520g8878j40473f6192k74724E9173a47050P1443B54849e493j61001A05526
18149g6499l10984J37721a11690B7574c2550A55826D9750N2342l3520i2499j20642
18138b13141A46258B4894f8712B39158A6595K17836a12715j77309Q1345A24652
18127A74122p9700J9935m7533b8598A9774J1644M4972i995l18723b9043j38223
18116a67266D9865A5525a78229a4840j95346i1050R240F176a44255A60285c41208
18104F756J69474C223b48975b4044F4446b8487A33659a35272J18D2916a64248
$$ plain form
18092 -216503 -185780 -100091 157883 145132 -11593 -101545 28518 -200902 181179 96047 125447
18081 125447 -162839 -27242 127681 -134476 -53544 -39840 -190900 28881 230304 -58900
18070 190427 -168325 -240802 -163619 -116690 102700 -84380 163257 -116822 -60910 -111229 90519
18058 -142607 -141469 109535 72808 301016 -69637 46008 -411221 100793 -53479 36219 183145
18047 183145 57405 196346 -284356 32203 -21870 -50611 69157 -23079 150924 -151078 31730
18035 28531 -124395 -314097 -103021 126580 -239568 33533 132551 -18395 -35934 -131407 -40770
18023 281009 -61307 -266460 -45538 135607 21795 265242 -222608 107335 -18140 -2652 -553329
18012 -553329 -109049 126571 -64863 -218318 -49802 -107924 190183 -161862 138085 226143
$$ packed form
18092b16503L0723Q5689A57883j2751a1593q9952B8518b00902A81179q5132K9400
18081A25447a62839b7242A27681a34476e3544J3704j51060B8881K01423e8900
18070A90427a68325p2477P7183M6929A02700h4380A63257a16822N5912n0319I0519
18058a42607J138A09535l6727K28208f9637D6008d11221A00793e3479C6219J46926
18047A83145E7405J38941b84356C2203b1870k8741F9157b3079A50924a51078C1730
18035B8531a24395j89702a03021A26580b39568C3533R9018a8395j7539r5473d0770
18023B81009f1307k05153d5538A35607B1795K43447b22608A07335a8140b652n50677
18012e53329a09049A26571f4863j53455d9802n8122A90183a61862A38085Q8058
$$ plain form
18002 226143 -194617 -265691 -419292 -516864 -234869 -117318 104399 -102116 -133983 -128039
17992 -128039 311376 327573 -187975 141391 -62311 -27512 -20297 182224 87578 -131211 -122441
17981 -122441 -82962 52573 -105057 -12802 -210881 -132113 10715 35615 75406 -116923 -18247
17969 64841 -92935 -154740 155829 321827 -43553 212742 70371 -3801 210436 145926 93507
17958 93507 -104593 106540 214162 -219518 38722 6458 -312758 98996 74335 176268 -109539
17946 -89620 150827 -130927 152142 -281673 -15982 -334092 -267061 370925 -94991 234299
17935 -310514 -318568 -83002 76731 -55985 -183423 -152615 -70114 345914 -12843 81240 -250974
17923 -88400 -150178 -192523 100607 223436 -83213 127656 -57029 234044 226310 165626 -111558
$$ packed form
18002B26143a94617p1074j53601r7572b34869a17318A04399a02116l1867N944
17992a28039C11376J6197a87975A41391f2311b7512P215A82224H7578a31211Q770
17981a22441L9479E2573a05057a2802j98079P8768A0715K4900L9791a16923a8247
17969F4841i2935o1805A55829J65998d3553B12742G0371c801B10436o4510n2419
17958I3507a04593A06540J07622b19518C8722F458c12758I8996k4661J01933a09539
17946h9620A50827a30927A52142b81673a5982l18110O7031C70925i4991B34299
17935c10514q054h3002G6731e5985j27438L0808g0114C45914a2843H1240b50974
17923h8400o1778m2345A00607J22829h3213A27656e7029B34044p734o0684a11558
$$ plain form
17911 284586 -29357 -130253 126246 229430 -16148 60979 -168211 -220732 -148755 9538 103227
17900 103227 -178619 102678 296183 -47431 -178741 212050 -6475 58789 283892 -140446
17889 40110 -331514 -273308 283720 66902 286155 -234470 -83969 138630 140533 -20786 148822
17877 32294 -194834 307772 100697 181781 145566 92009 6280 -189083 62812 -105865 64878
17865 167402 -172452 208498 117000 139166 -308337 -303943 -16407 23015 -1573 188262 170374
17854 170374 -1218 1003 173 17403 -270312 179759 -218907 -296768 228681 64948 -170615
17842 -238413 80648 -55862 65749 16078 -195370 -225532 -321579 197278 47762 -186186 -260619
17831 -260619 -142349 37297 -55857 -305606 -228100 -219062 6664 403659 117462 -267364 -148184
$$ packed form
17911B84586b9357j00896A26246J03184a6148F0979a68211n2521P1977I538R3689
17900A03227a78619A02678J93505d7431j31310B12050f475E8789K25103a40446
17889D0110c31514N8206B83720F6902K19253b34470h3969A38630J903b0786A48822
17877C2294a94834C07772A00697Q1084l6215n3557F280a89083F2812a05865F4878
17865A67402a72452B08498r1498K2166c08337M394a6407B3015a573A88262j7888
17854A70374a218A003A73J7230b70312A79759b18907p7861B28681F4948a70615
17842b38413H0648e5862F5749A6078a95370l0162r6047A97278D7762a86186p4433
17831b60619J18270C7297e5857k49749P7506R038F664L96995A17462b67364J19180
$$ plain form
17820 -148184 -74923 106175 199471 84681 141786 -93566 -145582 -36585 8273 41665 -108937
17808 130007 -14660 -232798 -20504 112254 269433 -41600 -302516 -314635 -107413 -114485 -69335
17797 -69335 -29290 229626 -271335 -147176 164931 -142046 274054 -29785 32805 -44087
17786 -190845 41085 -355975 -41691 -50475 -254288 -113332 -90988 214592 -296087 90568 -28366
17774 27776 -5433 -325461 55664 -41831 126496 34564 218313 -8905 -156254 92132 77545
17763 77545 141147 285447 -95980 -233566 -52424 -164133 92039 99903 101200 223527 -192392
17751 259030 212418 150923 82428 -172004 265901 -209740 124117 -52349 -9738 -180785 188996
17739 -56423 47715 79071 -260860 194625 2676 -189061 93833 -5804 124076 -33872 24456
$$ packed form
17820a48184P3261A06175R3296H4681N7105i3566n2016c6585H273L3392a08937
17808A30007a4660k18138b0504A12254J57179d1600k60916j2119a07413p072M5150
17797f9335b9290B29626b71335J24159A64931a42046B74054b9785C2805d4087
17786a90845D1085c55975d1691q784k03813a13332K2344B14592b96087I0568b8366
17774B7776e433l20028E5664d1831A26496C4564J83749h905j47349I2132j4587
17763G7545O3602J44300i5980j37586e2424j11709I2039P864J297J22327a92392
17751B59030m6612o1495o8495a72004B65901b09740A24117e2349i738j71047A88996
17739e6423D7715L1356b60860A94625B676a89061I3833e804A24076c3872B4456
$$ plain form
17727 46705 73678 -379958 208006 -181650 212271 261890 186220 224964 -88728 -254652 281663
17715 169570 424951 -102544 34905 40349 -81219 -35120 278736 324100 52766 62136 -194185
17703 137794 108588 82396 -115497 -136062 -46330 -135747 -228899 -17853 -132553 -172984 161759
17691 7775 210552 -307414 42398 97228 -199298 21677 -29606 63600 372154 37506 372648
17680 372648 139314 -25719 -172576 143663 50176 171595 174231 121910 173960 169548 103952
17669 103952 203047 -46683 -234201 -126565 124308 187904 -149669 -164016 245855 378078
17659 378078 3305 170481 189321 -232689 33104 85078 66888 -182619 87647 -86027 -80124
17648 -80124 118865 -277911 39004 180078 406335 -304938 43847 319170 93083 132849
$$ packed form
17727D6705K6973c79958B08006a81650B12271M9619p5670L8744h8728j65924B81663
17715A69570K55381a02544C4905N444h1219c5120B78736M5364E2766R370a94185
17703A37794k9206k6192a15497k0565d6330q9417r3152a7853j14700m0431A61759
17691G775K02777c07414D2398N4830a99298B1677b9606F3600L08554C7506L35142
17680C72648A39314b5719j46857A43663E0176J21419K636n2321N2050m412o5596
17669A03952R9095d6683j87518J07636A24308O3596a49669j4347B45855J32223
17659C78078C305J67176J8840b32689C3104N1974j8190a82619H7647h6027N903
17648h0124A18865b77911C9004J41074K26257c04938D3847K75323I3083L9766
$$ plain form
17638 132849 25580 -62354 -331072 -401111 178040 117921 7515 114237 205153 -239471 58955
17626 174570 16991 73286 214435 -82326 85933 -121059 69625 -67914 -45588 196499 302532
17615 302532 -277921 252695 80464 -323095 189067 82694 52922 -160135 -54872 -173086
17605 -173086 7418 -98053 -12930 16788 -270239 399274 68085 -389165 155365 -38758 -21910
17594 -21910 32853 -13167 -582544 -187087 -199514 132853 -22255 45731 197553 -97017 -208212
17583 -208212 -240685 -20891 85694 -165622 -50479 -273112 -123958 120099 36100 -50465 -97711
17572 -97711 -41729 -24726 -294335 373319 102323 -83467 -316561 -134592 -191269 -72214 -8408
17560 -29492 129964 -14800 -39839 21789 -78882 -119170 -139888 63587 54102 90053 191039
$$ packed form
17638A32849B5580f2354k68718p0039A78040o0119G515J06722R0916b39471E8955
17626A74570A6991N6295J41149h2326H5933a21059F9625f7914K2326A96499J06033
17615C02532b77921B52695H0464c23095A89067H2694k9772a60135e4872j18214
17605a73086G418i8053a2930A6788b70239C99274F8085c89165A55365c8758J6848
17594b1910C2853a3167n69377a87087j2427A32853b2255D5731J51822i7017j11195
17583b08212l2473b0891H5694a65622e0479k22633a23958A20099C6100e0465m7246
17572i7711d1729J7003k69609C73319A02323h3467k33094a34592n6677g2214h408
17560b9492A29964a4800k5039B1789g8882m0288k0718F3587r485L5951J00986
$$ plain form
17549 191039 235888 -63970 -71370 -331889 329910 43408 114789 105839 -10847 -132485 132336
17537 -9757 155819 48637 262022 -48680 217882 20740 195912 -262602 211172 106777
17527 106777 311011 14406 -3664 -14265 238109 108923 13478 231267 420101 -1767 45797
17515 299236 52715 119898 169711 32852 -149555 -127358 143189 139667 87019 312200 -156103
17503 -112434 -16695 309216 254628 5384 149196 26628 -25049 -32775 34178 36365 61333 190811
17491 190811 -152559 118087 219578 9337 106607 334702 -140483 335192 43733 -7198 -39947
17480 -39947 86045 64759 42191 -136939 76572 -88824 111680 207377 330113 107543 163568
17469 163568 36686 13241 -67357 101822 -48292 275185 163113 -122933 -321882 123974
$$ packed form
17549A91039M4849f3970p400k60519C29910D3408P1381q950a0847j21638A32336
17537i757A55819D8637K13385d8680B17882B0740J75172b62602B11172j04395
17527A06777K04234A4406c664j0601B38109A08923A3478K17789J88834a767D5797
17515B99236E2715O7183M9813C2852a49555K2197A43189l522n2648K25181a56103
17503a12434a6695C09216n4588E384J43812B6628b5049p726C4178K187K4968J29478
17491A90811a52559A18087J01491I337R7270K28095a40483C35192D3733g198l2749
17480c9947H6045k1286k2568a36939G6572h8824A11680R5697J22736A07543N6025
17469A63568C6686A3241f7357A01822d8292B75185j12072a22933j98949A23974
$$ plain form
17458 -8909 400466 238966 85066 227941 121090 142212 324279 206796 203999 643160 369719
17447 369719 670635 401935 269300 -64997 394661 355152 99518 378031 437408 277496
17437 277496 406826 490624 69334 452428 99000 210764 257757 273822 163230 -15651 439861
17425 458455 238100 84309 -60739 284038 -39008 259801 170131 -8961 156137 353319 333784
17414 333784 216631 246172 72632 -54820 135645 253961 174586 -191971 117624 454163
17404 454163 -274617 239982 70728 -142960 40061 153466 -55090 212515 -297261 -8925
17393 141847 94934 115928 400287 47924 -186161 371162 317938 -40779 115349 -130586
17382 68405 490117 413274 433178 -90098 183210 97469 329703 -129850 383070 221088
$$ packed form
17458h909D00466j61500H5066J42875j06851K1122J82067j17483k797M39161k73441
17447C69719L00916k68700j32635f4997C94661l9509I9518K78513N9377j59912
17437B77496J29330Q3798F9334L83094I9000J11764M6993J6065j10592a5651D39861
17425D58455k20355H4309f0739B84038c9008B59801q9670h961A56137J97182j9535
17414C33784j17153K9541G2632e4820A35645J18316p9375a91971A17624L36539
17404D54163b74617B39982G0728a42960D0061J13405e5090B12515b97261h925
17393A41847m6913K0994K84359D7924a86161C71162n3224d0779A15349a30586
17382F8405M21712p6843J9904i0098A83210q5741K32234a29850C83070j61982
$$ plain form
17372 221088 192983 284955 96067 76461 150175 140327 52364 -57120 14581 -109166 -213301
17361 -213301 -181019 -120775 266734 45692 176363 -104080 320506 39452 78639 11948 262861
17350 262861 -158237 646242 127669 286464 158923 -66712 219046 -144533 -29235 3525
17339 58894 191812 13557 346028 -29336 195675 -238069 70223 415756 269034 244655
17329 244655 239884 11885 79021 332413 73267 237588 326238 2407 -52658 167921 543978
17318 543978 209840 155227 -236831 183290 94238 -60365 -109876 171183 -134894 257928
17307 -6378 101326 147752 250652 248595 303433 9644 165407 80483 190007 121868 10485
17295 279576 -25008 -16980 -198628 -100078 126499 131551 160801 395851 75724 123860 495870
$$ packed form
17372B21088k8105R1972I6067j9606P3714r848E2364e7120A4581a09166j04135
17361b13301L2282O0244B66734D5692J30671a04080C20506C9452L9187A1948K50913
17350B62861a58237F46242A27669J58795j27541f6712B19046a44533b9235C525
17339E8894J32918A3557L32471b9336A95675b38069G0223L45533j46722k4379
17329B44655m771A1885O7136K53392G3267J64321Q8650B407e2658A67921L76057
17318E43978B09840n4613b36831A83290q9052f0365m9511A71183a34894B57928
17307f378A01326M6426J02900k057N4838I644J55763H0483J09524o8139A0485
17295B79576b5008Q028j81648R8550A26499N052K9250K35050G5724M8136L72010
$$ plain form
17284 495870 409022 11591 -20761 -3386 157514 67246 107869 36603 25085 443456 126467
17272 233134 145054 -94242 -219211 274904 -115498 -81021 126149 -112683 48933 316499
17262 316499 -63314 273111 79828 76989 -5487 114563 101169 -188684 28491 109762 -298544
17250 98107 19816 600247 223484 243169 141815 -63755 343045 382086 174593 279370
17240 279370 87493 229574 78896 425544 56341 404687 343132 -46872 3334 150744 -90805
17228 100018 14997 95502 75980 -8696 -54138 277631 120574 258937 2835 218971 299934
17217 299934 119518 65889 -49191 -103755 364397 248590 302103 419628 421869 479822 265565
17206 265565 355712 335715 114745 357526 -246778 -169807 159553 45078 291715 71177
$$ packed form
17284D95870q6848A1591b0761c386A57514F7246M0623C6603j1518M18371A26467
17272B33134q8080i4242j24969B74904a15498L4477A26149a12683D8933K67566
17262C16499f3314B73111G9828k839e487A14563j3394a88684B8491Q1271b98544
17250I8107A9816N80431B23484J9685j01354f3755C43045L9041A74593J04777
17240B79370H7493J42081G8896L46648E6341L48346o1555d6872C334J47410i0805
17228A00018A4997Q0505j9522h696m5442B77631A20574J38363B835K16136Q0963
17217B99934A19518n3629d9191n4564C64397j15807N3513J17525K241N7953k14257
17206B65565R0147j9997A14745K42781b46778P6971A59553D5078K46637G1177
$$ plain form
17195 104968 214528 337763 -111293 154515 276501 258142 157549 31157 381816 305044
17185 305044 267308 21898 225322 230607 382808 154965 19001 215384 370294 115827
17174 -61612 211639 231890 472273 467337 524951 72573 516026 288305 -90271 20337 41691
17163 41691 70103 388445 301234 314990 712019 369236 239899 170687 524293 193478
17152 27318 272471 264490 302432 307260 440602 576890 418810 311552 47683 157256 360326
17141 360326 322544 493140 41506 114229 290398 303319 313638 168269 111799 190605 306113
17130 306113 -25304 378682 484771 137073 17070 412551 337502 572558 299799 159853
17120 159853 154703 456383 6145 111692 405947 449635 312485 507750 595457 609246 125250
$$ packed form
17195A04968J09560J23235a11293A54515J21986j8359j00593C1157L50659p6772
17185C05044l7736B1898K03424N285J52201A54965A9001J96383J54910A15827
17174f1612B11639K0251K40383m936N7614G2573M43453k27721i0271B0337K1354
17163D1691K8412L18342q7211J3756L97029l42783j29337o9212L53606A93478
17152B7318K45153p981L7942M828J33342J36288j58080j07258D7683J09573K03070
17141C60326l7782J70596D1506P2723J76169J2921J0319j45369n6470P8806J15508
17130C06113b5304C78682J06089A37073A7070L95481p5049K35056k72759j39946
17120A59853n150L01680F145J05547K94255M3688j37150J95265Q7707J3789A25250
$$ plain form
17108 289023 214526 286129 326580 398293 310879 335891 241955 475652 340932 253678 477894
17097 477894 504458 358907 259663 84337 -38735 533096 179048 238130 427090 124631
17086 31391 296796 477670 396550 226533 333625 538595 60538 417913 400966 567260
17076 567260 485364 374157 582558 367150 630575 247707 51379 529885 389729 529172
17066 529172 379338 343186 482653 569508 750313 70721 406581 359076 560841 319041
17056 319041 561449 584613 519133 374597 429456 633873 428500 238447 391589 722392
17046 722392 336476 569710 566506 232525 612409 585948 300037 647561 368212 566981
17036 566981 411895 562561 732727 308620 577858 645636 545894 845284 514580 155489
$$ packed form
17108B89023p4497P1603M0451P1713q7414K5012r3936K33697j34720q7254K24216
17097D77894K6564j45551r9244H4337c8735E33096A79048N9082J88960A24631
17086C1391K65405J80874q1120j70017J07092K04970F0538L57375j6947J66294
17076E67260q1896j11207K08401k15408K63425B47707E1379M78506j40156J39443
17066E29172j49834l6152J39467Q6855J80805G0721L35860m7505K01765k41800
17056C19041K42408K3164o5480j44536N4859K04417k05373j90053J53142L30803
17046G22392C36476K33234l204B32525L79884k6461k85911L47524k79349J98769
17036E66981j55086J50666J70166C08620K69238O7778r9742K99390l30704A55489
$$ plain form
17025 684702 616283 467723 601212 450199 694048 504204 633605 223766 721057 604428
17015 604428 893863 759593 634393 609142 819409 639428 710119 930018 692896 821163
17005 821163 844937 359271 893995 757489 898489 576003 560791 551417 769068 884749
16995 884749 620448 436902 306932 817950 617405 658586 553414 807627 767130 990002
16985 990002 548791 886543 916172 876232 751837 775074 860475 852121 267878 692647 771040
16974 771040 965839 739824 764225 674385 716502 873278 975705 522607 820044 767723
16964 767723 609089 592416 888250 934905 1140731 1192330 657861 689460 1145812 817635
16954 817635 715097 1062909 941384 1154242 1048304 968150 942444 1102705 1086673 705112
$$ packed form
17025F84702o8419j48560J33489j51013K43849j89844J29401B23766M97291j16629
17015F04428K89435j34270j25200k5251K10267j79981P0691K19899k37122J28267
17005H21163K3774C59271N34724j36506J41000l22486j5212r374K17651J15681
16995H84749k64301j83546j29970N11018k00545M1181j05172K54213m0497K22872
16985I90002m41211L37752K9629l9940j24395K3237Q5401q354B67878M24769P8393
16974G71040J94799k26015K4401q9840M2117J56776J02427m53098K97437n2321
16964G67723j58634j6673K95834M6655K05826N1599n34469L1599M56352l28177
16954H17635j02538L47812j21525K12858j05938q0154k5706J60261j6032l81561
$$ plain form
16944 705112 1160518 1273469 890710 1170302 1086351 736201 1299174 959305 1311973 921032
16934 921032 1237511 1027644 1289146 1289680 1328837 937763 1366560 941996 1200484 1513580
16924 1513580 1323038 981845 1201376 1491455 1137535 1246356 1368623 1166636 1463926
16915 1463926 1133420 1274764 1369612 904837 1578159 1890261 1236163 1497371 1370122 1779532
16905 1779532 1501583 1742000 1265676 1513037 1740833 1829516 1485685 1670080 1603530 1562954
16895 1562954 1540796 1540190 1768552 1855103 1743344 1907990 1910417 1889902 1594051 1784645 1852988
16884 1852988 1588072 1830394 1909779 2105325 2224686 1960974 2002889 2102722 2128454 1978336
16874 1978336 1933120 2132912 2143591 2376233 2328116 2157093 2166066 2284578 2190831 2601244
$$ packed form
16944G05112M55406J12951l82759K79592q3951l50150N62973l39869L52668l90941
16934I21032L16479k09867K61502N34L9157l91074M28797m24564K58488L13096
16924A513580j90542l41193K19531K90079l53920J08821J22267k01987K97290
16915A463926l30506J41344R4848m64775O73322L12102o54098K61208j27249M09410
16905A779532k77949K40417m76324K47361K27796Q8683l43831J84395o6550m0576
16895A562954k2158o06K28362Q6551j11759J64646K427k0515k95851J90594O8343
16884A852988k64916K42322P9385J95546J19361k63712M1915R9833K5732j50118
16874A978336m5216J99792J0679K32642m8117j71023Q973J18512r3747M10413
$$ plain form
16864 2601244 2490388 2418147 2280615 2646897 2758380 2795372 2520070 2545309 2666103 2553123
16854 2553123 3107398 2848492 2760601 2952649 2859242 2808798 2864613 3019943 3127322 3141304
16844 3141304 3223782 3452872 3478872 3521224 3160214 3521526 3631389 3536619 3897649 3593057
16834 3593057 3788907 4099520 3790937 4049857 4072487 3970787 4287582 4095967 4434490 3959064
16824 3959064 5021423 4628771 4655579 4625417 4949736 5116964 5094390 5124527 5041069 5283546
16814 5283546 5167243 5520980 5551971 5711271 5555566 5998914 6332151 6012751 6387521 6565962
16804 6565962 6266794 6717784 6711243 6937300 7180732 7513616 7485556 7684916 7827475 8326135
16794 8326135 8512321 8612771 8750639 8919795 9241839 9731381 9658850 10256345 10309281 10369767
$$ packed form
16864B601244j10856p2241j37532L66282J11483L6992k75302K5239J20794j12980
16854B553123N54275k58906q7891J92048r3407n0444N5815J55330J07379J3982
16844C141304Q2478K29090K6000M2352l61010L61312J09863r4770L61030l04592
16834C593057J95850L10613l08583K58920K2630j01700L16795j91615L38523m75426
16824C959064J062359l92652K6808l0162L24319J67228k2574L0137q3458K42477
16814E283546j16303L53737L0991J59300j55705M43348L33237l19400L74770J78441
16804F565962k99168M50990o541K26057K43432L32884k8060J99360J42559M98660
16794H326135J86186J00450J37868J69156L22044M89542p2531N97495N2936O0486
$$ plain form
16784 10369767 10751142 10859566 11425451 11546507 12120911 12183339 12540106 12905675 13374923
16775 13374923 13898020 14607152 14705448 15433477 15848582 16402847 16817987 17273086 18051278
16766 18051278 18572900 19071535 19832571 20736859 21595252 22106836 23271061 24080315 25172445
16757 25172445 26138703 27312723 28400242 29588347 30827047 32418437 33701597 35375974
16749 35375974 37181687 39187696 40984052 42748525 45203428 47379272 49946658 52615076
16741 52615076 55071756 58732818 61825770 65348654 69448550 73556590 77783451 82554966
16733 82554966 87266976 92576876 98351877 104289511 110234878 116876634 123843729 130718573
16725 130718573 137451454 144444134 151875536 158171423 164928279 170398848 175801127 179767366
$$ packed form
16784A0369767L81375J08424N65885J21056N74404O2428L56767L65569M69248
16775A3374923N23097P09132R8296P28029M15105N54265M15140M55099P78192
16766A8051278N21622M98635P61036R04288Q58393N11584J164225Q09254J092130
16757B5172445R66258J174020J087519J188105J238700J591390J283160J674377
16749C5375974J805713K006009J796356J764473K454903K175844K567386K668418
16741E2615076K456680L661062L092952L522884M099896M108040M226861M771515
16733H2554966M712010N309900N775001N937634N945367O641756O967095O874844
16725A30718573O732881O992680P431402O295887O756856N470569N402279L966239
$$ plain form
16717 179767366 182816522 184626358 185344538 184682459 182529526 179441281 175329809 170437588
16709 170437588 164650749 158607082 151777572 144272769 137257214 130140693 122667761 116048635
16701 116048635 109536585 102995732 96558673 91046468 85897992 80738136 76122965 71504954
16693 71504954 67146122 63468229 59997270 57049872 53578987 50708251 47609023 45403073
16685 45403073 42674407 40946445 38917793 36755308 34944897 33599790 31905694 30422797
16677 30422797 29484146 27773304 26665692 25237663 24675522 23388712 22678951 21551417
16669 21551417 20681302 19816296 19093755 18409136 17907168 17083891 16310195 15898322 15167197
16660 15167197 14637591 14249556 13911950 13351938 12770315 12474683 12191948 11942449 11257293
$$ packed form
16717A79767366L049156J809836P18180o62079k152933l088245m111472m892221
16709A70437588n786839o043667o829510p504803p015555p116521p472932o619126
16701A16048635o512050o540853o437059n512205n148476n159856m615171m618011
16693G1504954m358832l677893l470959k947398l470885k870736l099228k205950
16685D5403073k728666j727962k028652k162485j810411j345107j694096j482897
16677C0422797r38651j710842j107612j428029n62141j286810p09761j127534
16669B1551417q70115q65006p22541o84619n01968q23277p73696m11873p31125
16660A5167197n29606l88035l37606n60012n81623k95632k82735k49499o85156
$$ plain form
16651 11257293 10991511 10962701 10485020 10199939 9614673 9618745 9384816 8917048 8763934 8482978
16641 8482978 8265762 8061442 7843498 7782948 7399990 7055347 7126511 7010537 6886936 6521907
16631 6521907 6536151 6146335 5956673 6164864 5774516 5766519 5126600 5632096 5413400 4744984
16621 4744984 4975175 5033357 4636568 4788865 5104485 4779333 4196870 4405433 4098018 4372996
16611 4372996 4283772 4298378 4230811 3976347 3991865 3825465 3759359 3494532 3461638 3548192 3378598
16600 3378598 3116054 3275643 2982136 3101019 3231406 3079773 3121036 2682782 2881670 2767542
16590 2767542 2946752 2893273 2976046 2531212 2580243 2648669 2701222 2503380 2343288 2695367
16580 2695367 2252409 2260606 2401789 2556515 2261508 1990359 2255207 2020126 2197387 2050778
$$ packed form
16651A1257293k65782k8810m77681k85081n85266M072k33929m67768j53114k80956
16641H482978k17216k04320k17944o0550l82958l44643P1164j15974j23601l65029
16631F521907J4244l89816j89662K08191l90348p997o39919N05496k18696o68416
16621D744984K30191N8182l96789J52297L15620l25152n82463K08563l07415K74978
16611D372996q9224J4606o7567k54464J5518j66400o6106k64827l2894Q6554j69594
16600C378598k62544J59589k93507J18883J30387j51633M1263m38254J98888j14128
16590B767542J79210n3479Q2773m44834M9031O8426N2553j97842j60092L52079
16580B695367m42958Q197J41183J54726k95007k71149K64848k35081J77261j46609
$$ plain form
16570 2050778 2218975 1992326 2246710 1914201 1949737 1818179 1986169 2198357 1913132 1981822
16560 1981822 1752742 1874361 2102716 1719823 1780601 1759031 1708323 1452982 1573179 1806924
16550 1806924 1446337 1536459 1707896 1428877 1839208 1667061 1224316 1241695 1325052 1343588
16540 1343588 1727686 1048706 1395806 1315183 1450825 1338604 1049231 1543937 1085857 1070285
16530 1070285 975889 1425898 1117140 1241490 1187584 1171522 1009863 1344886 1078645 1068964
16520 1068964 1072933 990191 1166935 1231081 1046724 1086816 942015 1080772 925954 902970
16510 902970 972943 977622 737204 776483 585195 715685 898463 767612 889583 606807
16500 606807 907240 1047787 687546 848434 739923 772362 877895 927345 553143 676768
$$ packed form
16570B050778J68197k26649K54384l32509L5536j31558J67990K12188k85225O8690
16560A981822k29080J21619K28355l82893O0778k1570n0708k55341J20197K33745
16550A806924l60587R0122J71437k79019M10331j72147m42745J7379Q3357J8536
16540A343588L84098o78980L47100q0623J35642j12221k89373M94706m58080j5572
16530A070285r4396M50009l08758J24350n3906j6062j61659L35023k66241r681
16520A068964L969q2742J76744O4146j84357M0092j44801J38757j54818k2984
16510I02970O9973M679k40418L9279j91288J30490J82778j30851J21971k82776
16500F06807L00433J40547l60241J60888j08511L2439J05533M9450l74202J23625
$$ plain form
16490 676768 778301 766067 620521 857297 609117 771802 650360 455420 422693 899949
16480 899949 657702 629606 720664 893583 709260 716957 650428 344121 637411 959098
16470 959098 607004 483460 479770 403584 446451 852599 306631 811982 869088 399864
16459 389292 258565 730414 534234 381067 621946 302541 479090 757022 274004 227749
16449 227749 677955 530580 190225 672109 294050 159763 477800 333857 630057 379458
16439 379458 435952 162502 473585 496881 256696 333367 305829 397174 370393 464533 654027
16428 654027 250705 368132 307280 211065 538133 248957 446270 380844 77548 329632
16418 329632 514559 466178 665216 320894 432209 202804 553974 412700 400375 457095
$$ packed form
16490F76768J01533j2234j45546K36776k48180J62685j21442j94940l2727M77256
16480H99949k42247k8096R1058J72919j84323P697o6529l06307K93290L21687
16470I59098l52094j23544l690p6186M2867M06148C06631N05351N7106C99864
16459C89292j30727M71849j96180j53167K40879C02541J76549K77932B74004m6255
16449B27749M50206j47375A90225M81884B94050j34287L18037j43943K96200k50599
16439C79458N6494A62502L11083K3296k40185P6671k7538R1345k6781R4140J89494
16428F54027B50705J17427o0852r6215L27068B48957J97313o5426G7548K52084
16418C29632J84927m8381J99038C20894J11315B02804L51170j41274j2325N6720
$$ plain form
16408 457095 415756 223045 280774 212923 437581 457687 658375 162443 269758 304543
16398 304543 549960 253264 542635 -39979 530452 356781 200583 523171 249674 127772
16388 127772 638395 -3033 247844 135516 347227 117827 -81474 266315 363356 -98186
16377 396238 601325 287634 432310 55411 446551 299932 47347 523555 209303 163436
16367 163436 220434 476598 -23589 183533 322541 357537 129856 25296 226874 121065
16357 121065 27768 235263 64727 306823 149721 93938 181455 427048 346716 518516
16347 518516 369573 419160 186990 -4778 112424 73277 282822 244937 480655 221751
16336 86152 82963 37704 518109 396765 487037 96640 357528 187149 313572 118518 156198
$$ packed form
16408D57095m1339j92711N7729o7851K24658K0106K00688A62443J07315L4785
16398C04543K45417B53264K89371c9979E30452j73671j56198L22588B49674j21902
16388A27772N10623c033B47844j12328K11711A17827h1474B66315R7041i8186
16377C96238K05087B87634J44676E5411L91140j46619D7347M76208B09303m5867
16367A63436N6998K56164b3589A83533J39008L4996A29856B5296K01578j05809
16357A21065B7768K07495F4727K42096A49721n5783Q7517K45593q0332J71800
16347E18516j48943M9587A86990d778A12424l9147K09545l7885K35718B21751
16336H6152l189C7704M80405j21344R0272I6640K60888j70379J26423A18518L7680
$$ plain form
16325 156198 -136918 101923 166574 85885 441154 68030 306212 44799 313535 -219317
16314 91342 -5378 260386 -37185 -174281 -7911 -2508 360615 951 99901 94765 27025 -63683
16301 126392 15045 59642 37700 -205218 42923 103560 186745 319038 110072 52729 62433
16290 62433 -10540 -135511 -175048 94175 -33620 11470 124954 303223 97711 75256 228115
16279 228115 181580 281008 55053 -126201 -90097 86757 149010 113173 206506 211183 98161
16267 110911 148430 43098 284059 309661 9907 246850 -76665 72499 187472 -66580 77571
16255 -77565 213424 196923 -322407 -64571 69230 265459 -15579 -70447 2783 293523 -89006
16243 95956 -186060 56630 -67703 51179 182390 297435 90186 -116735 259730 -99760 250875
$$ packed form
16325A56198a36918A01923O4651q0689L55269F8030K38182D4799K68736b19317
16314I1342e378B60386c7185j37096g911b508C60615I51R8950n136B7025f3683
16301A26392A5045M4597k1942b05218D2923O0637Q3185J32293A10072E2729R704
16290F2433a0540j24971l9537I4175c3620A1470J13484J78269I7711k2455J52859
16279B28115m6535R9428E5053a26201L6104H6757O2253l5837R3333M677I8161
16267A10911L7519D3098K40961K5602I907K36943g6665G2499J14973f6580G7571
16255g7565B13424j6501c22407f4571F9230J96229a5579n4868B783K90740h9006
16243I5956a86060E6630f7703E1179J31211J15045I0186a16735B59730i9760B50875
$$ plain form
16231 -73262 74110 -21124 -240739 -51922 176339 -38685 -7725 -167752 337160 -437064 29104
16219 318749 -107490 130706 114840 52052 -40775 219199 -493627 103182 163404 59906
16208 61364 138883 -246203 63868 78111 185383 269815 1529 -72680 163712 357892 157193
16196 203885 164776 337013 269181 195188 368664 51430 94607 178936 71902 68545 116940
16185 116940 -263105 -152980 -180724 -320497 -266393 119943 -27803 -66046 22805 81437 -202590
16173 50567 36297 136906 -117190 121366 -177019 103339 3442 -344697 38743 64458 -89184
16161 -20386 58062 -34018 31599 -24879 -101768 -322296 186899 15122 -188675 265135 53667
16149 -109808 -163685 397349 230655 1437 46064 -96256 26713 -282320 129766 -137808 -196789
$$ packed form
16231g3262G4110b1124k19615e1922A76339c8685g725j60027C37160d37064B9104
16219C18749a07490A30706j5866E2052d0775B19199d93627A03182O0222E9906
16208F1364P7519b46203F3868J4243J07272Q4432A529g2680A63712J94180A57193
16196B03885l9109J72237o7832p3993J73476E1430M3177Q4329G1902l357M8395
16185A16940b63105J10125k7744j39773N4104A19943b7803l8243B2805N8632b02590
16173E0567j4270J00609a17190A21366a77019A03339C442c44697C8743K5715h9184
16161b0386E8062c4018C1599b4879p6889k20528A86899A5122a88675B65135E3667
16149a09808n3877C97349j66694A437M4627i6256B6713b82320A29766a37808n8981
$$ plain form
16138 -196789 70296 -118539 184497 -185510 -234569 52397 -48015 1289 95811 182706 30864
16126 -108251 -99854 -165323 208893 4195 -193188 -252288 167427 -163980 -207914 51272 -89211
16114 -11362 -187450 -97525 -20959 30773 87461 -6262 -109085 355638 62429 97784 -40861
16102 64607 -19631 76418 179649 120293 -64520 135668 90952 112905 49513 62545 318531
16091 318531 10562 527666 14902 -163945 139641 -106334 62266 -29793 -196097 70535
16080 -215971 119369 205412 -29610 -193280 22430 -8971 74708 -14763 76196 182174 200471
16069 200471 144195 -65705 219834 245620 140842 -190278 -83582 123882 -9051 333213 91676
16057 153007 -106222 178410 35581 38773 -54332 -192056 42880 32497 -209866 86422 75668
$$ packed form
16138a96789G0296a18539A84497a85510m9059E2397d8015A289R4522Q6895C0864
16126a08251Q397o5469B08893D195a93188n9100A67427a63980m3934E1272h9211
16114a1362j76088Q9925b0959C0773N6688f262j02823C55638F2429L5355d0861
16102F4607a9631G6418J03231n9356f4520A35668m4716K1953D9513J3032K55986
16091C18531A0562N17104A4902a63945A39641a06334F2266b9793j66304G0535
16080b15971A19369Q6043b9610j63670B2430h971G4708a4763G6196J05978J8297
16069B00471n6276f5705B19834K5786j04778a90278h3582A23882i051C33213I1676
16057A53007a06222A78410C5581L192e4332j37724D2880j0383b09866H6422j0754
$$ plain form
16046 75668 176689 -7036 -194570 3073 -226488 -87228 -54607 -99611 157642 -233706 -69039
16034 -307967 114960 -333293 328968 -180867 -49685 -109632 -80296 142613 47238 -248840
16023 -295537 -31491 41695 -18506 -16943 -160474 -207201 -178862 1355 11576 -95619 -10502 88303
16010 -16617 -255796 7745 -260959 167736 -145028 3109 143740 -427919 8117 64626 -39231
15998 20871 -109645 -150212 148360 -409693 310805 -37698 194590 186315 35404 127281 147246
15987 147246 -87651 165544 107509 199907 471681 439003 442141 471987 322369 -4201 205749
15975 41281 -258936 -219199 79927 -168477 -231328 -146400 -119554 -132196 74765 152792 -248888
15963 -287003 159202 -20076 319768 123445 -2703 -23108 -187037 -20818 93522 9414 23026
$$ packed form
16046G5668J01021g036j87534C073b26488h7228L2621m5004A57642b33706f9039
16034c07967A14960c33293C28968a80867d9685n9947K9336A42613D7238b48840
16023b95537c1491D1695a8506J563j43531m6727K8339A355J0221i5619a0502H8303
16010a6617k39179G745b60959A67736a45028C109J40631d27919H117N6509c9231
15998B0871a09645m0567A48360d09693C10805c7698A94590q275C5404R1877J9965
15987A47246h7651A65544n8035R2398K71774l2678L138K9846j49618d201B05749
15975D1281b58936L9737G9927a68477o2851Q4928K6846j2642G4765P8027b48888
15963b87003A59202b0076C19768A23445b703k0405j63929b0818I3522I414J3612
$$ plain form
15952 23026 170805 -204951 7258 -176881 -436870 416681 50634 61177 -245946 -270774 100323
15940 -186907 -448954 -145639 -235543 41506 247073 -31121 -268115 -108351 125849 -310564
15929 -100624 213994 11509 -2824 45421 10523 -201901 -10007 19364 107910 -88749 76407
15917 -17208 -47859 67916 65525 -289022 -215040 148503 113251 71242 -339472 249951 -100520
15905 55214 187981 85271 97098 98803 -22532 -210142 98918 -372276 -246055 -232196 15733
15893 -318520 -111663 -175326 175412 -147770 14988 -25776 -5058 -242465 -27961 150195 134728
15882 134728 -371300 70470 -7107 -170136 -171322 -49601 -176097 -8837 266325 -124102 -138430
15871 -138430 -342991 302369 -88483 119442 -143825 -92545 -180548 -108265 -72037 175508
$$ packed form
15952B3026J47779b04951G258a76881k59989D16681E0634J0543b45946k4828A00323
15940a86907k62047a45639q9904D1506K05567c1121k36994a08351A25849c10564
15929a00624B13994A1509b824D5421A0523b01901a0007A9364Q8546h8749G6407
15917a7208l0651F7916k391b89022P3982A48503l5252m2009c39472B49951a00520
15905E5214J32767H5271J1827J705b2532j87610I8918c72276J26221J3859A5733
15893c18520a11663o3663A75412a47770A4988b5776e058k37407b7961A50195j5467
15882A34728c71300G0470g107j63029j186d9601j26496h837B66325a24102j4328
15871a38430k04561C02369h8483A19442a43825N1280q8003P2283L6228A75508
$$ plain form
15860 90794 -12928 -219912 45005 -48310 216711 270380 246031 7947 -161906 195849 -140954
15848 -115811 140522 -137357 171996 -15611 50906 222099 150291 -58590 167551 -99594
15837 100630 238186 89107 275316 -78771 -187065 -57788 -197635 -349745 -56133 -201860
15827 -201860 -250522 -59388 135646 -86420 230206 126812 123911 -216378 -423637 -108802
15816 -343691 157239 -359322 37656 -58011 107538 131133 -219456 66048 2157 -269948 210766
15804 152572 4792 -122353 -145380 -152535 102804 91130 280839 -57317 -244247 -118478 211312
15792 -192182 -136085 127946 -282293 388772 145894 259971 -351087 71918 -49976 35251
15781 -116155 41311 454880 171788 49376 -144742 -220796 64281 4012 34120 28516 -207825
$$ packed form
15860I0794a2928k06984D5005d8310B16711N3669k4349G947a61906A95849a40954
15848a15811A40522a37357A71996a5611E0906J71193p1808e8590A67551i9594
15837A00630J37556H9107J86209g8771j08294e7788j39847j52110e6133j45727
15827b01860m8662e9388A35646h6420B30206j03394k901b16378k07259a08802
15816c43691A57239c59322C7656e8011A07538K3595b19456F6048B157b69948B10766
15804A52572D792a22353k3027p155A02804j1674J89709e7317j86930a18478B11312
15792a92182N6097A27946b82293C88772A45894J14077c51087G1918d9976C5251
15781a16155D1311M13569A71788D9376a44742p6054F4281D012L0108n604b07825
$$ plain form
15769 -261405 -42380 209245 116550 -378151 -82757 -227044 -64504 118249 13686 305209
15759 305209 -123340 198744 65698 -35150 32178 -133523 10645 330103 -55161 -39891 136373
15747 299626 214914 -70223 153192 -37951 198853 1979 101565 -102296 235467 -583686 -11396
15735 253713 -362326 -26035 -198357 15896 -14806 131212 -165141 -71619 -448349 -32441
15724 168148 -147607 311410 4959 -26759 -169032 -1781 -230635 110073 -419157 -286748
15714 -286748 197837 -45968 -393164 28643 163824 -64916 77746 208426 -93201 -308857
15704 -308857 -201554 82525 -21330 52921 34163 162374 46861 -62083 33093 109503 211022
15693 211022 1180 258233 -14966 149894 -36888 -25103 -186603 -82148 153368 134541 -39764
$$ packed form
15769b61405d2380B09245r2695c78151h2757j44287f4504A18249A3686K91523
15759C05209a23340A98744F5698c5150C2178a33523A0645L19458e5161J5270A36373
15747B99626q4712g0223A53192c7951A98853A979R9586a02296B35467e83686a1396
15735B53713c62326b6035j72322A5896a4806A31212a65141g1619l76730c2441
15724A68148a47607C11410D959b6759j42273a781k28854A10073d19157J32409
15714b86748A97837d5968l47196B8643J35181f4916G7746J30680i3201k15656
15704c08857J07303H2525b1330E2921j8758J28211D6861f2083C3093P6410J01519
15693B11022A180K57053a4966A49894c6888J1785j61500h2148A53368j8827c9764
$$ plain form
15681 -47444 -451112 77874 185270 87601 -66710 30873 135424 167459 -129856 274340 -52607
15669 -218960 -181048 -146869 77894 13681 -221007 -79919 -247341 -57776 125353 -191204 126954
15657 -129404 -282957 -81025 -352716 -246816 67284 -5412 -165147 -177016 -137823 179054 -191209
15645 7637 244049 -83376 -30034 272566 -133903 160555 10305 -250371 -3071 -85715 -152716
15634 -152716 22914 -83696 160490 -103531 -209673 150048 -138034 26921 114804 210498
15624 210498 -69703 130934 -317711 34212 29627 -156214 -84714 560549 -16460 -71613 -335664
15613 -335664 232933 -136899 -132776 201886 -48359 -318728 -121311 10252 43941 90959 186702
15602 186702 11689 296362 126948 55275 -111495 -112926 155263 -22423 -24066 124241 -161250
$$ packed form
15681d7444m03668G7874J07396H7601f6710C0873J04551L2035a29856B74340e2607
15669b18960L7912L4179G7894A3681b21007g9919j67422e7776A25353a91204A26954
15657a29404j53553h1025k71691J05900F7284e412j59735j1869L9193A79054a91209
15645G637K36412h3376c0034B72566a33903A60555A0305b50371c071q2644o7001
15634a52716B2914h3696A60490a03531j06142A50048a38034B6921Q7883R5694
15624B10498f9703A30934c17711C4212m585a56214P1500E60549a6460n5153k64051
15613c35664B32933a36899M123B01886d8359k70369a21311A0252L3689M7018R5743
15602A86702A1689K84673A26948E5275a11495j431A55263b2423j643A24241a61250
$$ plain form
15590 -11477 93429 93979 -236088 -120880 73817 -92552 -31429 244823 101617 -54958 373102
15578 165762 223456 -62966 -96462 75519 -162474 178399 -85282 -91310 27360 78394 -187627
15566 333302 -258964 -237082 162229 -64438 17041 -60840 255051 139852 71406 186681
15556 186681 -88784 180447 -122453 -368311 131435 -71937 -113688 -91261 -470330 -9977 58696
15544 -310152 211713 -10647 19569 -161707 173314 -292914 -125327 205668 1951 -44932
15533 37720 -329069 168290 -198342 -73031 -11937 271113 128266 131520 -158089 111061
15522 301837 -196948 45863 272928 -437755 -24955 -174114 143844 -166278 331448 135768
15511 -51445 -284076 -147427 -246042 183791 146470 134889 -35936 50535 262211 52417 -315035
$$ packed form
15590a1477I3429N50b36088J15208G3817i2552c1429B44823A01617e4958C73102
15578A65762N7694f2966l3496G5519a62474A78399h5282o028B7360N1034a87627
15566C33302b58964K1882A62229f4438A7041f0840B55051j15199o8446J15275
15556A86681h8784A80447a22453k45858A31435g1937m1751K2427l79069i977E8696
15544c10152B11713a0647A9569a61707A73314b92914a25327B05668A951d4932
15533C7720c29069A68290a98342g3031a1937B71113A28266L254a58089A11061
15522C01837a96948D5863K27065d37755b4955j49159A43844a66278C31448A35768
15511e1445k32631J36649r8615A83791l7321j1581c5936E0535K11676E2417c15035
$$ plain form
15499 -105348 -243013 150245 -25074 343579 47466 -115305 247259 -13700 169795 -428256
15488 9793 324737 -14436 397676 254933 -115457 -214975 7243 115906 -40077 115091 -152815
15476 106653 -123346 20495 -9679 -34507 49071 60623 -146107 -44653 -113030 -39442 -83578
15465 -83578 -3639 -155205 -133680 -97133 325057 71422 421370 -288829 -205559 -48273 72078
15453 -145525 258021 28284 -87896 51693 -167736 486379 -5597 37257 -37575 -8129 -155847
15442 -155847 -196922 174504 439456 -307897 14529 -46351 204450 62384 -100585 36798
15431 -144217 93610 -294400 -118335 -77788 189380 -272596 117712 -167242 16676 92044
15421 92044 -336325 63121 55483 64324 -116626 -172905 -129290 -205595 18728 322707 57419
$$ packed form
15499a05348j37665A50245b5074C43579D7466a15305B47259a3700A69795d28256
15488I793L14944a4436C97676j42743a15457r9518G243J08663d0077A15091a52815
15476A06653a23346B0495i679k4828D9071J1552a46107d4653o8377c9442m4136
15465h3578c639j51566K1525L6547C25057G1422L49948b88829Q3270d8273G2078
15453a45525B58021B8284h7896E1693a67736D86379e597C7257c7575h129j47718
15442a55847m1075A74504K64952c07897A4529d6351B04450F2384a00585C6798
15431a44217I3610b94400a18335M0547A89380b72596A17712a67242A6676P5368
15421I2044c36325F3121p638Q841a16626n6279M3615p6305A8728L03979E7419
$$ plain form
15409 238633 -23093 -161823 -64205 81744 105520 -318225 141864 258919 -328397 83858
15398 -13307 233363 -235405 -200817 -39654 5820 -3075 133112 61389 -146737 -41511 -53662
15387 -53662 -87693 34265 165844 -27169 -421421 -507387 165958 -408561 128390 52046 124067
15376 124067 -273089 41829 -3674 -29098 -76595 -174238 -126997 230098 -126126 144137 253012
15365 253012 -133286 -176320 -21289 119798 183610 23672 94928 180235 150044 113716 30837
15353 30958 -183249 -260244 110752 -207307 -64653 -53102 -4103 24160 288831 93898 11689
15341 23229 -270930 292984 25986 183963 42046 152241 79354 96900 8131 -7472 -155842
15330 -155842 237209 -56660 184012 -181295 -232343 -119299 -5454 65896 -4184 72570 -143487
$$ packed form
15409B38633b3093j38730f4205H1744K3776c18225A41864J17055c28397H3858
15398a3307B33363b35405L4588c9654E820c075A33112F1389a46737d1511j2151
15387e3662l4031C4265J31579b7169l94252q5966A65958d08561A28390E2046P2021
15376A24067b73089D1829c674k5424m7497r7643M7241B30098a26126A44137J08875
15365B53012a33286m3034b1289A19798O3812B3672P1256Q5307l0191l6328C0837
15353C0958a83249p6995A10752b07307f4653J1551d103B4160K64671I3898A1689
15341B3229b70930B92984B5986J57977D2046J10195p2887J7546H131g472j48370
15330a55842B37209e6660A84012a81295n1048J13044e454F5896d184G2570a43487
$$ plain form
15318 3260 -102129 -332686 4212 -320469 -115997 43329 328031 -88997 91509 31368 121852
15307 121852 -259469 91544 -72377 -141328 85165 61150 64600 -63553 127031 262048 -226673
15295 121757 135032 58873 -12911 -43250 59776 -151758 395130 42177 -76963 -101170 -152117
15284 -152117 60631 -38807 70549 -131100 83577 -149643 156289 273914 148917 217700
15274 217700 200660 286859 170493 156657 -99535 117481 -91987 126540 -30346 -242657 306610
15262 -145829 -220547 -238978 404518 -136239 402191 103091 -54834 93083 160543 427268
15252 427268 -170315 132388 240042 375274 417252 680624 1788505 1239229 1453620 1659589
15242 1659589 304710 347509 132272 86248 175236 1587 450115 -123425 190638 -67978
$$ packed form
15318C260a02129k30557D212c20469a15997D3329K84702h8997I1509C1368R0484
15307A21852b59469I1544g2377o8951H5165k4015L450f3553A27031J35017b26673
15295A21757J3275E8873a2911l0339E9776a51758C95130D2177g6963k4207n0947
15284a52117F0631c8807G0549a31100H3577a49643A56289J17625j24997O8783
15274B17700j7040Q6199j16366j3836i9535A17481i1987A26540c0346k12311C06610
15262a45829p4718j8431D04518a36239D02191A03091e4834I3083O7460K66725
15252D27268a70315A32388J07654J35232M1978K63372J107881n49276K14391K05969
15242A659589C04710M2799A32272m6024Q8988A587M48528a23425A90638f7978
$$ plain form
15231 -297701 105729 213459 31035 124947 -97325 150440 -169784 -77696 -305670 117141
15220 187805 117701 -29474 77934 -31375 286753 123520 -128845 164403 44783 39793 137790
15209 137790 -159150 271980 -218728 207382 103008 113662 86243 175561 -67352 88675
15198 96649 -71083 -159468 267844 -42462 -49453 288649 -450134 167958 101106 285407 -213514
15186 231695 -138363 277269 -241095 -201130 83045 166318 52586 244295 69785 -164500
15175 59663 91523 254160 -40756 -267924 39800 -29354 105990 -135755 443823 -39295 -222225
15164 -222225 118269 107549 83142 -112441 -14438 302819 -88832 15438 34430 385679 -49706
15152 -117075 -93967 76324 88844 104890 64058 315396 274313 4827 -276784 -100035 225340
$$ packed form
15231b97701A05729J07730C1035R3912i7325A50440a69784g7696k27974A17141
15220A87805p0104b9474G7934c1375B86753A23520a28845A64403D4783m990R7997
15209A37790a59150B71980b18728B07382A03008J0654k7419Q9318f7352H8675
15198I6649g1083q8385B67844d2462o991B88649d50134A67958o6852J84301b13514
15186B31695a38363B77269b41095L9965H3045Q3273E2586J91709F9785a64500
15175E9663L1860J62637d0756k27168C9800b9354A05990a35755D43823c9295j82930
15164b22225A18269j0720k4407a12441a4438C02819h8832A5438J8992L51249d9706
15152a17075K3108G6324J2520J6046m0832K51338m1083D827b76784a00035B25340
$$ plain form
15140 26043 97346 255520 -36661 38283 78832 67173 239639 205825 21360 -207332 -38860
15128 73250 190672 -101091 30918 64323 378721 202533 311747 177402 334778 238336
15118 238336 107744 360785 82571 -104481 -129610 127352 492109 151665 251299 69190
15107 131433 205943 195498 151042 -27430 202829 -16343 122902 141807 145330 206289 247778
15096 247778 228891 172195 265650 167067 21107 37403 -108536 105490 -113234 247457 290591
15085 290591 319235 80021 12866 -51606 -121027 152434 -189471 410396 114651 252504
15075 252504 384392 11103 58195 424212 70603 127350 479873 136246 -119606 511547
15064 47189 170844 15851 49071 58658 -192820 -131753 93069 70612 -301867 -118198 -157044
$$ packed form
15140B6043P1303J58174c6661C8283M0549j1659J72466l3814B1360b07332c8860
15128G3250J17422a01091C0918L3405L14398j76188J09214j34345J57376r6442
15118B38336A07744K53041H2571a04481k5129A27352L64757A51665R9634F9190
15107A31433P4510j0445m4456b7430B02829a6343A22902J8905L523O0959M1489
15096B47778j8887n6696R3455r8583B1107J6296a08536A05490a13234B47457M3134
15085B90591K8644H0021A2866e1606o9421A52434a89471D10396A14651J37853
15075B52504J31888A1103M7092L66017G0603N6747L52523A36246a19606E11547
15064D7189J23655A5851L3220R587a92820O1067I3069k2457c01867a18198l8846
$$ plain form
15053 -157044 22356 211781 -35937 23150 -171179 53425 351611 557126 118131 3784 77841
15042 77841 24059 37028 45232 214492 237083 416430 39223 293709 -72040 292329 127927
15030 322721 246708 -3044 208015 331093 -181146 63737 281671 -8301 275056 239988 329332
15019 329332 240306 82230 -137182 4723 -64690 99394 15162 181807 195949 655740 116379
15007 289503 387418 117840 509285 535164 97431 39436 186677 -144103 87104 -34793 311733
14995 261927 -115228 335529 -76551 474267 451367 21146 23685 124488 467422 87177 244291
14984 244291 -71129 256531 338858 421048 -177769 72757 -66306 256654 303518 133527 242743
14973 242743 397701 292722 29846 103608 45127 313421 61578 543765 169455 228092
$$ packed form
15053a57044B2356J89425c5937B3150a71179E3425K98186K05515A18131C784P4057
15042G7841B4059J2969Q204J69260K2591J79347C9223K54486g2040B92329A27927
15030C22721p6013c044B08015J23078a81146F3737K17934h301B75056l5068Q9344
15019C29332q9026H2230a37182D723f4690I9394A5162J66645J4142M59791A16379
15007B89503R7915A17840L91445K5879I7431C9436J47241a44103H7104c4793C11733
14995B61927a15228C35529g6551D74267k2900B1146K539J00803L42934H7177J57114
14984B44291g1129B56531Q2327Q2190a77769G2757f6306B56654M6864A33527J09216
14973B42743J54958j04979B9846P3762D5127K68294F1578M82187A69455N8637
$$ plain form
14963 228092 307267 226442 98721 565072 30178 -78716 -85123 412396 347563 21364 218175
14952 218175 232305 171731 221455 387531 116478 -72164 109640 -64676 86793 124398 221961
14941 221961 113172 168568 132530 33179 199065 424024 150986 191674 307375 613660
14931 613660 288056 188236 435942 89082 487498 142826 181953 334204 100146 173888
14921 173888 148879 341583 298726 302315 247609 214147 630856 -72589 344206 235540 255093
14910 255093 114519 123341 257417 411273 429391 348256 512930 126372 565991 551528
14900 551528 232521 75324 222339 113251 123360 441997 213590 242357 104159 33547
14889 410380 375089 287041 442888 216776 669605 162964 341415 268751 379170 252955
$$ packed form
14963B28092P9175q0825I8721M66351C0178g8716o407D12396o4833B1364J96811
14952B18175J4130o0574M9724J66076A16478g2164A09640f4676H6793L7605R7563
14941B21961j08789N5396l6038C3179J65886K24959A50986M0688J15701L06285
14931F13660B88056r9820K47706H9082L98416A42826L9127J52251A00146P3742
14921A73888k5009J92704m2857L589n4706l3462M16709g2589C44206j08666J9553
14910B55093A14519Q822J34076J53856J8118q1135J64674A26372M39619j4463
14900E51528B32521G5324J47015j09088J0109L18637B13590K8767A04159C3547
14889D10380l5291q8048J55847B16776M52829A62964J78451p2664J10419j26215
$$ plain form
14879 252955 336634 235211 257289 223781 103716 284221 175081 435744 287180 130637
14868 236081 357311 32594 277832 157763 441857 421821 166535 138862 149732 325951
14858 325951 471975 201391 483749 440812 221940 302283 182458 193502 370440 544332
14848 544332 638685 606640 353719 577000 180348 448273 469158 296493 320452 607814
14838 607814 239920 356442 523996 291956 446816 134628 626490 522601 444764 318680
14828 318680 504572 594046 416707 258161 190963 186236 675451 538259 581861 291511
14818 291511 46961 416717 134511 591714 415715 572324 599756 464846 158618 216562
14808 216562 445834 364238 475068 280698 787904 207948 492311 564621 287005 430529
$$ packed form
14879B52955Q3679j01423K2078l3508A03716J80505j09140K60663j48564A30637
14868B36081J21230C2594K45238j20069K84094k0036A66535k7673J0870J76219
14858C25951J46024B01391K82358m2937k18872Q0343j19825J1044J76938J73892
14848E44332R4353l2045k52921K23281A80348K67925K0885j72665K3959K87362
14838F07814B39920J16522J67554k32040J54860A34628M91862j03889p7837j26084
14828C18680J85892Q9474j77339j58546o7198m727M89215j37192M3602k90350
14818B91511D6961L69756A34511M57203j75999J56609K7432j34910A58618N7944
14808B16562K29272q1596J10830j94370N07206B07948K84363P2310k77616J43524
$$ plain form
14798 430529 739682 483580 482881 476311 446376 344260 286242 576306 360371 583017 604341
14787 604341 316068 446246 205280 428188 652563 308024 546725 289077 530693 861239
14777 861239 460147 552911 584527 557564 636704 236118 207969 253602 696967 457069 48507
14765 795397 731833 316248 471418 516819 543833 439627 420940 489477 592455 391561
14755 391561 352577 424263 576577 587100 565218 614183 637528 542535 844783 606357 573771
14744 573771 476110 600371 764692 518723 475907 566673 612674 438669 716552 832803
14734 832803 812412 519238 629602 712073 718380 721071 373656 591693 392432 432375 794450
14723 794450 750332 718399 719601 632102 741081 933863 593714 725168 397628 925217
$$ packed form
14798D30529L09153k56102o99o570k9935j02116n8018K90064k15935K22646K1324
14787F04341k88273J30178B05280K22908K24375C08024K38701k57648K41616L30546
14777H61239m01092R2764L1616k6963P9140B36118k8149M5633M43365k39898D8507
14765G95397o3564C16248J55170M5401K7014j04206j8687O8537J02978k00894
14755C91561l8984P1686J52314J0523k1882M8965K3345r4993L02248k38426l2586
14744E73771r7661J24261J64321k45969m2816R0766M6001j74005K77883J16251
14734H32803k0391k93174J10364Q2471O307K691l47415K18037j99261L9943L62075
14723G94450m4118l1933J202q7499J08979J92782l40149J31454l27540N27589
$$ plain form
14713 925217 729885 738077 806669 828723 520474 388217 696182 775322 916800 779336
14703 779336 553386 830711 509430 737828 824959 810763 707478 612060 426654 706584
14693 706584 768517 697270 916639 847336 752547 911932 723545 931470 892942 605329
14683 605329 799191 586231 802388 678277 1037109 587352 772416 775570 674159 1143064
14673 1143064 711403 920584 989625 860861 983434 791980 899024 749797 696077 557310
14663 557310 738222 1036563 1081227 827509 742882 526701 866875 963113 1149398 885437
14653 885437 1128463 1031734 837905 1110500 917036 1198838 1160095 979960 808686 961194
14643 961194 1352061 1033000 741911 1517341 1319073 1289541 801787 1314184 1014268 1092789
$$ packed form
14713I25217j95332Q192O8592K2054l08249j32257L07965P9140J41478j37464
14703G79336k25950K77325l21281K28398Q7131j4196j03285r5418j85406K79930
14693G06584O1933p1247K19369o9303r4789J59385j88387K07925l8528k87613
14683F05329J93862k12960K16157j24111L58832m49757J85064L154j01411M68905
14673A143064m31661K09181O9041j28764J22573j91454J07044j49227n3720j38767
14663E57310J80912K98341M4664k53718q4627k16181L40174R6238J86285k63961
14653H85437K43026r6729j93829K72595j93464K81802l8743j80135j71274J52508
14643I61194L90867l19061k91089P75430j98268k9532m87754N12397k99916P8521
$$ plain form
14633 1092789 1158133 1146870 1023634 1219894 1351620 973347 1095040 1097642 1219610 1201782
14623 1201782 1388347 825386 1062801 1238548 1087196 1347312 1365064 1229770 1420342 1363049
14613 1363049 1137242 992029 1338700 1087772 1476195 1379116 1485727 1338973 1472636 1296145
14603 1296145 1153427 1133678 1872496 1486875 1602978 1502402 1668328 1692477 1188350 1941714
14593 1941714 1335796 1718451 1469132 1463984 1663727 1522413 1374737 1442372 1375432 1796486
14583 1796486 1508473 1974771 1762884 1860072 1686279 1647121 1807574 1705223 1940047 2050125
14573 2050125 1810168 1823940 1674830 1781390 1874472 1915566 1921973 2018851 2115737 2289922 1916040
14562 1916040 2043216 2231596 2612210 2532637 2943248 2437063 2683381 2863718 2805936 3045071
$$ packed form
14633A092789O5344j1263j23236J96260J31726l78273J21693K602J21968j7828
14623A201782J86565n62961K37415J75747j51352K60116J7752j35294J90572n7293
14613A363049k25807j45213L46671k50928L88423r7079J06611j46754J33663j76491
14603A296145j42718j9749P38818l85621J16103j00576J65926K4149n04127P53364
14593A941714o05918L82655k49319n148J99743j41314j47676O7635o6940M21054
14583A796486k88013M66298k11887R7188j73793l9158J60453j02351K34824J10078
14573B050125k39957J3772j49110J06560R3082M1094O407R6878R6886J74185l73882
14562A916040J27176J88380L80614p9573M10611n06185K46318J80337n7782K39135
$$ plain form
14552 3045071 3456224 3814276 4678434 6787460 10003831 18157059 35083338 43569560
14544 43569560 23014652 10781748 7140419 3786244 2306943 1882230 2042546 1981576
14536 1981576 1875114 1748760 1804540 1861164 1913940 1782332 1902382 1705866 1793636 2169617
14526 2169617 1738436 2067190 1896502 2356061 1905475 2033533 2200434 2269900 2226693 2185585
14516 2185585 2164873 2297812 1933554 2162718 2528183 2269496 2405056 2423885 2397414 2598974
14506 2598974 2341892 2653308 2774099 2867921 2463072 2913352 2517903 2904166 2846379 2610808
14496 2610808 2953461 2790256 3061348 3056895 3223071 2724343 3238972 3051885 3106071 3275154
14486 3275154 3361302 3159346 3305440 3390805 3479440 3321886 3243044 3404029 3361244 3255999
$$ packed form
14552C045071M11153L58052Q64158K109026L216371Q153228J6926279Q486222
14544D3569560k0554908A0781748l641329l354175j479301m24713J60316o0970
14536A981576j06462j26354N5780N6624N2776j31608J20050j96516Q7770L75981
14526B169617m31181L28754j70688M59559m50586J28058J66901O9466m3207m1108
14516B185585k0712J32939l64258K29164L65465k58687J35560J8829k6471K01560
14506B598974k57082L11416J20791R3822m04849M50280l95449L86263n7787k35571
14496B610808L42653j63205K71092m453J66176m98728N14629j87087N4186J69083
14486C275154Q6148k01956J46094Q5365Q8635j57554p8842J60985m2785j05245
$$ plain form
14476 3255999 3587244 3937429 3337653 3415987 3484468 3498031 3675949 3707193 3955915 3858898
14466 3858898 3896170 3814393 4038144 3869541 4290212 4256618 4126864 4136915 4416374 4628032
14456 4628032 4322440 4484765 4324814 4689778 4540553 4957012 4690822 4306237 4994278
14447 4994278 4929774 4695380 5023946 5060590 4864581 5069785 5126584 5215101 5179046 5426299
14437 5426299 5184428 5237874 5217016 5999683 5658114 5645920 5914118 5763300 6419811 6248559
14427 6248559 6449727 6319687 6367072 6422870 6582557 6735509 6824162 6825683 7012896 7242648
14417 7242648 7310510 7375849 7364935 7485122 7572085 7790283 7803025 8383932 7942285 8010407
14407 8010407 8492921 8585828 8532315 8774568 8832959 9124510 9239262 9247922 9545986 9707280
$$ packed form
14476C255999L31245L50185n99776P8334O8481J3563J77918L1244K48722r7017
14466C858898L7272q1777K23751j68603M20671l3594j29754J0051K79459K11658
14456D628032l05592J62325j59951L64964j49225M16459k66190l84585O88041
14447D994278o4504k34394L28566L6644j96009K05204N6799Q8517l6055K47253
14437E426299k41871N3446k0858P82667l41569j2194K68198j50818O56511j71252
14427F248559K01168j30040M7385N5798J59687J52952Q8653J521J87213K29752
14417G242648O7862O5339j0914J20187Q6963K18198J2742N80907m41647O8122
14407H010407M82514R2907n3513K42253N8391K91551J14752Q660K98064J61294
$$ plain form
14397 9707280 9905039 9811834 10247826 10405247 10045133 10567549 10554493 11043300 11350785 11494414
14387 11494414 11772610 11727218 12334907 11993940 12512225 12462664 12709290 13040505 13278491 13433997
14377 13433997 13841442 14086070 14290426 14771974 15245792 15353841 15432717 15760795 16263802
14368 16263802 16486444 16131131 17050508 17680804 17647712 18028288 18586709 18997848 19585591
14359 19585591 19782982 20171613 20717511 21615293 21662715 22346665 22641564 23495888 24253812
14350 24253812 24484743 25358292 25587498 26297509 27107117 27666474 28298749 29329145 30217699
14341 30217699 31127055 31735529 32520110 33505685 34681663 35289513 36471619 37911213 38846665
14332 38846665 39866420 41116733 42262560 43692348 45100510 46617375 48164871 49808906
$$ packed form
14397I707280J97759r3205M35992J57421l60114N22416j3056M88807L07485J43629
14387A1494414K78196m5392O07689l40967N18285m9561K46626L31215K37986J55506
14377A3433997M07445K44628K04356M81548M73818J08049P8876L28078N03007
14368A6263802K22642l55313R19377O30296l3092L80576N58421M11139N87743
14359A9585591J97391L88631N45898Q97782M7422O83950K94899Q54324P57924
14350B4253812K30931Q73549K29206P10011Q09608N59357O32275J030396Q88554
14341C0217699R09356O08474P84581R85575J175978O07850J182106J439594R35452
14332C8846665J019755J250313J145827J429788J408162J516865J547496J644035
$$ plain form
14324 49808906 51258875 53226623 55237071 56974434 59406106 61159681 63336934 66207709
14316 66207709 68648807 71011757 73976317 76917327 80383278 83972757 87222820 91028916
14308 91028916 95333903 99648228 103970323 108836468 114031659 119320213 125285612 131340869
14300 131340869 137842744 144970429 152183086 159783589 168228704 176934503 186378637 196506767
14292 196506767 206694310 218292541 229832544 242432283 255729796 269519852 284163184
14285 284163184 299322872 314891672 330883013 347227984 363504427 379725106 395915806
14278 395915806 411620932 426378420 439849788 451986953 460638007 463848646 464302921
14271 464302921 463970980 463330926 461546117 458682639 453091962 445690441 434768781 421668425
$$ packed form
14324D9808906J449969J967748K010448J737363K431672J753575K177253K870775
14316F6207709K441098K362950K964560K941010L465951L589479L250063L806096
14308I1028916M304987M314325M322095M866145N195191N288554N965399O055257
14300A31340869O501875P127685P212657P600503Q445115Q705799R444134J0128130
14292A96506767J0187543J1598231J1540003J2599739J3297513J3790056J4643332
14285B84163184J5159688J5568800J5991341J6344971J6276443J6220679J6190700
14278C95915806J5705126J4757488J3471368J2137165Q651054L210639M54275
14271D64302921l31941o40054j784809k863478n590677p401521j0921660j3100356
$$ plain form
14263 421668425 407366174 392021804 376677983 361170861 344130120 327416599 310920162
14256 310920162 294939780 279423303 264708196 251650589 238535195 225651705 213622523
14249 213622523 202189492 191826268 181684718 172226399 163601720 155834636 148115223
14242 148115223 140551289 133827784 127660314 121447013 116317007 111076827 106309488 101329877
14234 101329877 97149808 92784423 88964659 85673947 82355833 78693292 75511541 72818109
14226 72818109 70040441 67177159 64633443 62387489 60040197 58062392 55939946 54091071
14218 54091071 52280330 50427661 48908816 47112654 45855169 44704070 43059102 41494897
14210 41494897 40287098 39131182 38194361 37571090 36360963 35297566 33736798 32987166
$$ packed form
14263D21668425j4302251j5344370j5343821j5507122j7040741j6713521j6496437
14256C10920162j5980382j5516477j4715107j3057607j3115394j2883490j2029182
14249B13622523j1433031j0363224j0141550r458319q624679p767084p719413
14242A48115223p563934o723505o167470o213301n130006n240180m767339m979611
14234A01329877m180069m365385l819764l290712l318114l662541l181751k693432
14226G2818109k777668k863282k543716k245954k347292j977805k122446j848875
14218E4091071j810741j852669j518845j796162j257485j151099j644968j564205
14210D1494897j207799j155916r36821o23271j210127j063397j560768p49632
$$ plain form
14202 32987166 31973393 31180147 30702432 29851577 28581474 28238302 27260578 26683765 26058751
14193 26058751 25394793 24653591 24171013 23488711 22941506 22482070 22286643 21950861 21005212
14184 21005212 20698336 20132366 19910007 19330251 18857153 18586449 17899613 17578064 17419945
14175 17419945 16857274 16597264 16246949 16254746 15828077 15398813 15316007 14688377 14418257 14351789
14165 14351789 14045418 13923669 13717811 12884949 13049763 13119804 12144610 12386796 12366903 12168835
14155 12168835 11805949 11738959 11586932 11378031 11058364 10843325 10578747 10477156 10394493 10129562
14145 10129562 10078374 9772721 9491449 9612836 9453490 9487762 8878148 9164631 8844357 8689218
14135 8689218 8794848 8662466 8285206 8602374 8040142 8287243 7893094 7763806 7818782 7868782
$$ packed form
14202C2987166j013773p93246m77715q50855j270103l43172r77724n76813o25014
14193B6058751o63958p41202m82578o82302n47205m59436j95427l35782r45649
14184B1005212l06876n65970k22359n79756m73098k70704o86836l21549j58119
14175A7419945n62671k60010l50315P797m26669m29264q2806o27630k70120o6468
14165A4351789l06371j21749k05858q32862J64814P0041r75194K42186j9893j98068
14155A2168835l62886o6990j52027k08901l19667k15039k64578j01591q2663k64931
14145A0129562n1188l05653k81272J21387j59346L4272o09614K86483l20274j55139
14135H689218J05630j32382l77260L17168n62232K47101l94149j29288N4976N0000
$$ plain form
14125 7868782 7660023 7613290 7547689 7379450 7178645 7160345 6904694 6729589 6586645 6842762
14115 6842762 6520229 6631712 6454554 6216302 6082565 6251435 5998088 6091581 6089252 6282582
14105 6282582 6169510 5544978 5637655 5729462 5853987 5159570 5314543 5486350 5047794 5283942
14095 5283942 5096873 5400278 5038530 5010597 4854402 4981375 4783350 4756407 4617974 4447108
14085 4447108 4524323 4718944 4540216 4326286 4414718 4053893 4405955 4210588 4183009 4041499
14075 4041499 4078903 4167316 3687559 3991858 3610410 3896498 4137392 4046777 3720973 3629853
14065 3629853 3778926 3966100 3671871 3579105 3720668 3657874 3727510 3800690 3421743 3596320
14055 3596320 3357066 3336303 3484084 3322707 3224223 3230643 3153469 2931750 3028745 2903040
$$ packed form
14125G868782k08759m6733o5601j68239k00805j8300k55651j75105j42944K56117
14115F842762l22533J11483j77158k38252j33737J68870k53347R3493k329J93330
14105F282582j13072o24532R2677R1807J24525o94417J54973J71807m38556K36148
14095E283942j87069L03405l61748k7933j56195J26973j98025k6943j38433j70866
14085D447108P7215J94621j78728k13930Q8432l60825L52062j95367k7579j41510
14075D041499L7404Q8413m79757L04299l81448K86088K40894r0615l25804r1120
14065C629853J49073J87174k94229r2766J41563o2794O9636P3180l78947J74577
14055C596320k39254k0763J47781j61377r8484O420p7174k21719R6995j25705
$$ plain form
14045 2903040 3151137 2872844 3215498 3170107 3188778 3223354 2630345 2814312 2823315 2595865
14035 2595865 2956231 2596467 2871729 2895996 2831963 2726436 2647290 2880368 2856491 2687073
14025 2687073 2573819 2159646 2472238 2255977 2217037 2255393 2218398 2403303 2109943 2708640
14015 2708640 2184728 2282768 2144347 2246318 2172610 2000840 2131935 2143896 1828484 1709249
14005 1709249 2034218 2067732 1966225 1854074 1763824 1510152 1806128 1983697 1731169 1702880
13995 1702880 2033315 1770601 1516933 1889241 1559982 2348783 3099730 5221443 11320261
13986 11320261 27657882 44512705 28540680 13588209 8021779 5904850 4644039
13979 4644039 3606611 3435293 3082013 2956468 2681366 2634255 2406111 2250977 1787539
$$ packed form
14045B903040K48097k78293L42654m5391J8671L4576n93009J83967R003k27450
14035B595865L60366l59764K75262K4267o4033j05527p9146K33078k3877j69418
14025B687073j13254m14173L12592k16261l8940L8356l6995J84905k93360N98697
14015B708640n23912R8040j38421J01971p3708j71770J31095J1961l15412j19235
14005A709249L24969L3514j01507j12151r0250k53672K95976J77569k52528k8289
13995A702880L30435k62714k53668L72308l29259P88801P50947K121713O098818
13986A1320261J6337621J6854823j5972025A3588209n566430k116929j260811
13979D644039j037428j71318l53280j25545k75102m7111k28144j55134m63438
$$ plain form
13970 1787539 2276005 2213196 2340577 2045829 2407801 2166859 2006077 1964762 2255718 1986592
13960 1986592 1993176 2017572 1709905 2057000 2029335 1638232 1704161 1554995 1879720 1527027
13950 1527027 1717563 1571850 1561000 1646234 1623796 1660912 1566803 1792045 1574337 1721738
13940 1721738 1265716 1079932 1617919 1534498 1432909 1874858 1517707 1625849 1301150 1738976
13930 1738976 1639764 1810676 1512952 1268882 1472968 1348830 1486388 1305776 1381894 1260792
13920 1260792 1331249 1450414 1480102 1107760 1530230 1411249 1326018 1106672 1199856 1190603
13910 1190603 1534568 1429701 1425824 1283080 1477400 1265010 1085077 1373170 1108757 1502874
13900 1502874 1272624 1401040 1348929 1187017 1019916 1233961 1173557 1412917 934587 1176195
$$ packed form
13970A787539M88466o2809J27381k94748L61972k40942j60782m1315K90956k69126
13960A986592O584K4396l07667L47095k7665l91103O5929j49166L24725l52693
13950A527027J90536j45713j0850Q5234k2438L7116r4109K25242k17708J47401
13940A721738m56022j85784N37987q3421j01589M41949l57151J08142l24699M37826
13930A738976r9212J70912k97724k44070K04086j24138J37558j80612P6118j21102
13920A260792P0457J19165K9688l72342M22470j18981q5231k19346R3184r253
13910A190603L43965j04867l877j42744J94320k12390j79933K88093k64413L94117
13900A502874k30250J28416n2111j61912j67101K14045o0404K39360m78330K41608
$$ plain form
13890 1176195 1316088 1085586 1160027 1024153 1105393 870080 1203628 1447224 833881 1239653
13880 1239653 1031560 1120697 1108295 957769 1039580 1021050 764545 1142531 1003274 977214
13870 977214 1202741 1171873 1438107 1027712 1311014 1237968 673025 1047291 661412 1153243
13860 1153243 714201 1120815 1090573 776839 905510 1380208 622919 1112458 903333 1348557
13850 1348557 693817 732995 1116292 855725 798546 800893 1046658 761493 1019915 1280220
13840 1280220 1095339 897062 544081 815665 1031571 750540 869527 820410 1056805 703674
13830 703674 868515 537547 926099 809478 910668 1112080 952709 626052 641667 843262
13820 843262 862093 728743 730349 654108 568079 567823 743969 604204 796946 785559 762285
$$ packed form
13890A176195J39893k30502P4441j35874Q1240k35313L33548K43596o13343M05772
13880A239653k08093Q9137j2402j50526Q1811j8530k56505L77986j39257k6060
13870I77214K25527l0868K66234m10395K83302p3046n64943L74266l85879M91831
13860A153243m39042M06614l0242l13734J28671M74698F22919M89539k09125M45224
13850A348557o54740L9178L83297k60567n7179K347K45765k85165K58422K60305
13840A280220j84881j98277l52981K71584K15906k81031J18987m9117K36395l53131
13830G03674J64841l30968L88552j16621J01190K01412j59371l26657J5615K01595
13820H43262J8831j33350J606p6241q6029k56J76146j39765J92742j1387k3274
$$ plain form
13809 762285 695982 603966 843952 954869 669820 524528 860395 861442 830440 819311 801361
13798 801361 436078 923133 887232 485272 625213 952886 628553 533951 589851 733643
13788 733643 728638 726691 651550 442026 485508 554042 511634 485546 703941 809121 565177
13777 565177 750954 354544 826588 496284 744904 206008 477709 619529 461013 448080
13767 448080 620244 566192 633827 482140 517177 626682 980508 603487 652070 679749
13757 679749 700109 792078 143574 721147 511335 698007 739486 618799 702814 717887
13747 717887 861550 761684 592792 688587 778809 635232 493462 382212 577600 818488
13737 818488 301616 592275 434079 406189 615467 603674 743379 422179 645855 886386
$$ packed form
13809G62285o6303r2016K39986J10917k85049j45292L35867J047l1002j1129j7950
13798H01361l65283M87055l5901m01960J39941L27673l24333r4602N5900J43792
13788G33643n005j947p5141k09524M3482O8534m2408k6088K18395J05180k43944
13777E65177J85777C54544M72044l30304K48620B06008K71701J41820j58516j2933
13767D48080J72164n4052O7635j51687L5037J09505L53826l77021M8583K7679
13757F79749K0360R1969A43574N77573k09812J86672M1479j20687Q4015J5073
13747G17887J43663r9866j68892R5795R0222j43577j41770j11250J95388K40888
13737H18488C01616K90659j58196k7890K09278j1793J39705l21200K23676K40531
$$ plain form
13727 886386 553098 741940 565366 527505 440011 242168 309987 493522 307709 557381
13717 557381 305507 624118 578558 971812 499548 436250 320319 393350 477039 449732
13707 449732 129688 807046 821223 85061 702155 -19283 318188 457247 157543 317343
13697 317343 545532 475291 579364 629711 469189 374423 712247 314715 179545 621570
13687 621570 323649 231189 490020 344152 719942 468316 341300 583450 300833 708338
13677 708338 498602 632102 295464 707935 591835 746532 96916 411065 146480 325682
13667 325682 131463 413672 576789 539887 74814 19914 127877 208983 465673 249158
13657 249158 471054 628831 288179 602605 479553 450138 506501 497195 475245 338961
$$ packed form
13727H86386l33288J88842j76574l7861q7494j97843O7819J83535j85813K49672
13717E57381k51874L18611m5560L93254m72264o3298j15931P3031Q3689k7307
13707D49732A29688O77358J4177H5061O17094a9283C18188J39059A57543J59800
13697C17343K28189p0241J04073N0347j60522r4766L37824C14715j35170M42025
13687F21570k97921r2460K58831j45868L75790k51626j27016K42150k82617M07505
13677G08338k09736J33500B95464M12471j16100J54697I6916L14149A46480J79202
13667C25682A31463K82209J63117l6902G4814A9914J07963Q1106K56690k16515
13657B49158K21896J57777B88179L14426j23052k9415N6363r306k1950j36284
$$ plain form
13647 338961 241936 -120340 503356 383373 -12587 545596 364000 212419 535928 445447
13637 445447 203755 489357 388791 417095 6164 289200 563623 330205 144016 455036
13627 455036 73042 211133 350859 161977 701672 417413 445673 350948 467329 333412
13617 333412 313084 448242 301647 240212 276203 435411 477801 394465 160664 361209
13607 361209 546279 319793 109953 61199 49648 286424 311795 411920 530740 760601
13597 760601 410832 547184 309366 397727 111292 724860 614378 179072 575564 504607
13587 504607 43181 569874 328123 382327 486143 410059 480163 159752 267545 371713
13577 371713 96586 201165 550456 317618 130075 589393 509421 342310 357855 336444
$$ packed form
13647C38961r7025a20340E03356j19983a2587E45596j81596j51581L23509r0481
13637D45447B03755K85602j00566K8304F164K83036K74423k33418A44016L11020
13627D55036G3042J38091J39726A61977N39695k84259K8260r4725J16381j33917
13617C33412k0328J35158j46595o1435L5991J59208M2390q3336A60664K00545
13607C61209J85070k26486A09953m8754j1551K36776K5371J00125J18820K29861
13597G60601l49769J36352k37818Q8361A11292O13568j10482A79072L96492p0957
13587E04607D3181N26693k41751N4204J03816p6084P0104A59752J07793J04168
13577C71713I6586J04579L49291k32838A30075M59318p9972j67111J5545k1411
$$ plain form
13567 336444 212738 477239 248004 382566 536684 223235 105218 400360 8031 234139
13557 234139 344002 243504 253484 200446 645939 290935 530940 35662 -62390 274549
13546 64116 88638 199474 174576 34507 179085 213086 244930 369386 269954 702522 221885
13534 135734 178684 360361 301186 364191 174631 394022 258553 226722 95665 361973
13524 361973 295886 359710 22703 203709 396958 176417 172196 359895 395838 -79565 325329
13512 231719 442698 72869 159297 336285 267159 284371 104169 329611 82218 64770 -149471
13500 388059 363096 672151 322860 281703 253540 310234 298084 384014 80799 220582 411374
13489 411374 131177 182029 309542 639863 54175 220900 -156260 407115 103054 424249
$$ packed form
13567C36444j23706K64501k29235J34562J54118B23235A05218K95142H031K26108
13557B34139J09863j00498R980n3038M45493B90935K40005C5662f2390B74549
13546F4116K4522J10836k4898C4507J44578L4001L1844J24456r9432M32568B21885
13534A35734M2950J81677n9175O3005A74631K19391j35469l1831I5665K66308
13524C61973o6087O3824B2703J81006J93249A76417m221J87699L5943g9565C25329
13512B31719K10979G2869Q6428J76988o9126J7212A04169K25442H2218j7448a49471
13500C88059k4963L09055C22860m1157k8163N6694j2150Q5930H0799J39783J90792
13489D11374A31177N0852J27513L30321E4175J66725a56260D07115A03054L21195
$$ plain form
13479 424249 182004 -3561 421833 55149 249338 19170 282000 446206 98791 85306 330601
13468 330601 152890 -371615 254282 73736 456641 162608 -62264 231257 344422 -23944
13457 25638 402354 210415 227360 270884 137423 105074 414505 76358 253588 108127
13446 351010 338220 118837 113496 167326 276367 104720 249406 -170722 212365 196451
13436 196451 -81942 407192 247647 195112 -290616 171352 -64929 -28547 48270 139468 399580
13425 399580 308094 245910 183347 398043 -149042 -215912 546645 266174 110435 -284231
13414 559448 2668 90288 365384 550933 307153 234437 88360 -28575 73995 73617 275786
13403 275786 303564 165797 153097 188332 -35413 109341 -318995 447076 95559 113970 117441
$$ packed form
13479D24249A82004c561D21833E5149J94189A9170K62830J64206I8791j3485K45295
13468C30601A52890c71615B54282G3736L82905A62608f2264B31257J13165b3944
13457B5638L76716j91939J6945M3524j33461l2349L09431G6358J77230A08127
13446C51010j2790A18837n341N3830J09041A04720J44686a70722B12365j5914
13436A96451h1942D07192j59545n2535b90616A71352f4929b8547D8270R1198K60112
13425C99580r1486o2184o2563K14696a49042o6870E46645B66174A10435b84231
13414E59448B668Q7620K75096J85549k43780p2716H8360b8575G3995l78K02169
13403B75786K7778j37767j2700L5235c5413A09341c18995D47076I5559J8411L471
$$ plain form
13392 117441 164153 120944 -59181 90265 481157 329231 532294 491452 -721 181702 252003
13381 252003 -63791 394785 352152 303603 120546 -5945 447548 297225 467850 87821 341446
13370 341446 -93275 134585 260303 506482 362610 319258 32103 222743 -113059 23907
13359 -79683 622611 102103 151889 294192 291805 129586 457596 -13066 182853 -173897
13348 -179671 -112796 126747 72276 221769 -43004 162373 341042 329636 181861 367243
13338 367243 139795 -87475 349782 168372 -130533 420366 351290 289307 143150 365206
13328 365206 278524 354956 200706 420234 -6278 85646 102649 302728 19479 183488 66747
13316 263929 24488 30960 170154 324280 517972 221201 192904 254936 235834 450470 236443
$$ packed form
13392A17441M6712m3209e9181I0265L90892j51926K03063m0842g21A81702P0301
13381B52003f3791C94785m2633m8549A20546e945D47548j50323J70625H7821K53625
13370C41446i3275A34585J25718K46179j43872m3352C2103J90640a13059B3907
13359g9683F22611A02103M9786J42303k387A29586L28010a3066A82853a73897
13348a79671O6875A26747n4471J49493d3004A62373J78669j1406j47775J85382
13338C67243A39795h7475C49782A68372a30533D20366o9076o1983A43150K22056
13328C65206q6682P6432j54250K19528f278H5646J7003K00079A9479J64009F6747
13316B63929B4488O472J39194J54126J93692B21201k8297O2032j9102K14636k14027
$$ plain form
13305 236443 159861 255478 268679 180465 -109992 6043 27643 -93162 134444 221397 -3107
13293 78080 151252 -61074 235258 307006 208382 -130563 212675 -65188 -141877 -63223 75199
13281 481928 128002 -7374 132596 142929 -163989 31254 -22539 -7605 10503 174720 -50530
13269 310458 -125198 -41355 48714 -50062 194978 29987 199660 19041 8623 337031 32436
13257 275839 250338 140131 212383 -126412 53761 3879 144181 28642 259649 86598 -195337
13245 -4743 91645 43459 209229 -143340 -162680 185860 173398 53754 -71514 -54734 162717
13233 169421 102450 -146226 501371 155444 -45937 51661 89432 587530 -198567 139293
13222 102629 -122760 228602 145430 13832 209584 -202660 -74337 216691 82045 -11857
$$ packed form
13305B36443p6582R5617J3201q8214a09992F043K1600i3162A34444Q6953c107
13293G8080P3172f1074B35258P1748r8624a30563B12675f5188p6689f3223G5199
13281D81928A28002g374A32596J0333a63989C1254b2539g605A0503J64217e0530
13269C10458a25198d1355D8714e0062A94978B9987J69673A9041H623L28408C2436
13257B75839k5501j10207P2252a26412E3761C879J40302B8642K31007H6598a95337
13245d743I1645D3459J65770a43340j9340A85860j2462E3754g1514J6780A62717
13233A69421o6971a46226E01371A55444d5937E1661L7771M98098a98567A39293
13222A02629a22760B28602q3172A3832J95752b02660g4337B16691H2045a1857
$$ plain form
13211 169283 -129183 154999 76995 147741 32239 -262418 -71748 -136095 54329 -101192 214002
13199 323129 -118675 -115240 1223 -41993 142779 49864 147846 107977 340923 62183 309887
13188 309887 -304289 150247 -62634 96157 32039 -7761 384432 84617 184342 94964 93820
13177 93820 -86665 328066 155722 -310533 -48043 189436 62385 124653 6520 216585 -230457
13165 -293622 114559 186341 62819 27269 -381694 200044 136635 125168 -12650 276859 -173953
13153 -90112 23531 -145575 138884 62446 274063 16444 119177 166280 -256831 -53529 384719
13141 53775 123123 -89972 210772 -17547 287038 14038 249771 395397 -36376 -106107 41950
13129 207280 43527 83703 -254676 90689 288263 -57431 49561 192319 224418 13075 46637
$$ packed form
13211A69283a29183A54999G6995P0746C2239b62418g1748o4347E4329a01192B14002
13199C23129a18675L435A223d1993A42779D9864R7982l9869K32946F2183K47704
13188C09887c04289A50247f2634I6157C2039g761C84432H4617R9725q9378j144
13177I3820h6665C28066A55722c10533d8043A89436F2385O2268F520K10065b30457
13165b93622A14559P1782F2819B7269c81694B00044o3409j1467a2650B76859a73953
13153i0112B3531a45575A38884F2446K11617A6444J02733M7103b56831e3529C84719
13141E3775O9348h9972B10772a7547B87038A4038K35733J45626c6376o9731D1950
13129B07280D3527M0176b54676I0689J97574e7431D9561J42758L2099A3075L3562
$$ plain form
13118 46637 -110824 -79406 151577 -125479 58983 -22470 31845 115380 -33127 -56006 -4253
13106 -244494 -43929 176617 111252 277359 -79074 -42887 -5016 -205670 220453 38321 -332464
13094 -21811 -62306 257013 262710 -407065 -21310 -103004 -137512 -69420 -126860 12980 117072
13083 117072 -190564 3026 328176 255362 170633 213043 289962 299522 76468 -75309 312959
13071 142288 167260 83437 119630 -21399 31090 49403 276094 17192 52258 164958 39156
13059 215615 173381 -82788 63768 378450 36344 95039 58395 -142619 -9081 355081 161662
13047 60052 -60784 -11394 -209162 -47117 -52947 91584 55940 145804 -37371 101111 191130
13036 191130 -149 199924 182676 121977 -72952 -114128 -17962 -41056 210837 192959 229807
$$ packed form
13118D6637a10824L1418A51577a25479E8983b2470C1845Q3535c3127k2879d253
13106b44494d3929A76617o5365J66107g9074L6187e016k00654B20453C8321c32464
13094b1811m0495B57013N697d07065b1310q1694l4508O8092n7440A2980J04092
13083A17072a90564C026L25150p2814q4729M2410P6919R560G6468g5309C12959
13071A42288K4972H3437L6193b1399C1090J8313K26691A7192L5066J12700C9156
13059B15615m2234h2788F3768L14682C6344N8695l6644a42619i081C55081A61662
13047F0052f0784a1394j97768d7117n830I1584l5644Q9864c7371A01111R0019
13036A91130a49A99924j7248o0699g2952m1176a7962k3094B10837j7878L6848
$$ plain form
13025 229807 193071 31524 -74926 -25468 436290 -61882 -218602 236743 -110246 102453
13014 25652 218033 223400 -99905 133469 49693 155229 -50478 -20029 222597 254120 -90259
13002 31683 256272 218058 -199421 -111759 24471 126091 56224 305557 147418 135528 -219817
12990 -87683 -164813 -83521 -61544 173553 12417 255383 470785 -54794 221581 116419 -327141
12978 176860 197871 46840 -23690 52915 -32587 -8284 -18663 217658 285179 54034 319927
12967 319927 71246 -79616 -258711 30918 106529 160644 29493 23604 79475 457388 -84391
12955 66161 -71372 -63936 172247 124924 -496678 -26266 -357349 25311 52847 104084 -122468
12943 373308 16633 -222093 374219 164134 77550 52282 -113816 -158074 -178414 -55814 -203012
$$ packed form
13025B29807l6736C1524g4926b5468D36290f1882j56720B36743a10246A02453
13014B5652J92381N367i9905A33469D9693J05536e0478b0029B22597L1523i0259
13002C1683K24589l8214a99421Q7662B4471J01620E6224K49333A47418j1890b19817
12990h7683p7130Q1292K1977A73553A2417K42966K15402e4794B21581j05162c27141
12978A76860K1011D6840b3690E2915c2587h284j0379B17658O7521E4034K65893
12967C19927G1246g9616j79095C0918P5611N4115B9493n889N5871L77913h4391
12955F6161g1372P436A72247m7323d96678b6266l31083B5311K7536N1237a22468
12943C73308A6633b22093C74219A64134G7550k5268a13816m4258k0340e5814j47198
$$ plain form
12932 -203012 -20509 -231751 33377 122848 184418 16631 222926 169928 -96070 34726 214044
12921 214044 -129809 -3042 255309 -151162 260604 85549 -94302 44442 181162 60188 -98265
12909 91881 128522 -6993 127555 -199938 19671 3535 -25707 291662 4207 10717 253357 164411
12897 164411 -280424 -35977 -122207 -5571 -240642 -62862 -20470 27644 -63223 198806 163332
12886 163332 159820 203324 -86683 -61837 -70234 -220972 -85417 319372 177702 -302908 65527
12874 48030 -39501 -31901 332603 179398 215338 176341 477315 47498 -243999 -100516 -7656
12862 -66710 -39996 -207626 163362 153035 -40688 210551 12332 -61981 -252766 -122874 84618
12850 -20617 53320 -274380 -301555 -168460 220232 108720 185615 166632 -287138 291234
$$ packed form
12932b03012b0509k11242C3377Q9471O1570A6631K06295n2998i6070C4726J79318
12921B14044a29809c042B55309a51162B60604H5549i4302D4442J36720F0188i8265
12909I1881L6641f993A27555a99938A9671C535b5707B91662D207O510K42640q8946
12897A64411b80424c5977q6230e571k35071f2862b0470B7644f3223A98806l5474
12886A63332l512M3504h6683K4846q397j50738h5417C19372j41670c02908F5527
12874D8030c9501P600C32603j53205L5940l8997L00974D7498b43999a00516g656
12862f6710K6714j67630A63362j0327d0688B10551A2332f1981j90785a22874H4618
12850b0617E3320b74380k7175J33095B20232A08720P6895j8983b87138B91234
$$ plain form
12839 99884 -37074 -29281 193570 203804 61238 -97910 -148008 -172462 -50712 411379 350081
12828 350081 218740 176170 -55913 -413508 -104363 99240 -106639 72540 -299918 -219014
12818 -219014 -234019 14045 26065 183282 181997 -95434 -91424 26688 -75262 -85990 -61575 139869
12805 47935 268504 40297 194704 94896 -176981 -204825 45454 -72372 145005 -152316 188390
12793 -116461 -55536 10160 93219 -8347 151063 88246 325197 -17983 229439 76403 211593
12782 211593 194280 86193 -80239 289461 19717 84830 56984 494015 -308375 89309 189302
12771 189302 81983 14601 -19796 -10036 60331 -70116 -74715 -39051 -92031 -44322 -197521 70169
12758 -221889 -75582 -71557 142068 -155046 -230145 -69487 -30808 59908 -378299 99995 27001
$$ packed form
12839I9884c7074P793A93570J0234F1238i7910n0098k4454e0712D11379o1298
12828C50081j31341m2570e5913l57595a04363I9240a06639G2540b99918Q0904
12818b19014j5005A4045J2020J57217j285i5434M010B6688g5262j0728K4415A39869
12805D7935K20569D0297J54407I4896a76981k7844D5454g2372A45005a52316A88390
12793a16461e5536A0160Q3059h347A51063o2817K36951a7983B29439G6403J35190
12782B11593j7313H6193h0239B89461A9717O5113k7846M37031c08375H9309R9993
12771A89302H1983A4601a9796R760F0331g0116m599L5664n2980d4322j53199G0169
12758b21889g5582M025A42068a55046p5099f9487c0808E9908c78299I9995B7001
$$ plain form
12746 -11465 -24463 382259 -199419 -163425 348058 -246780 -136668 344860 18974 37426
12736 37426 255200 60065 245638 138627 187639 -46081 227767 432068 -1551 -185793 263299
12724 -104530 -142570 -47599 -149068 -172967 -150533 241498 210284 374817 169890 116722 67093
12713 67093 416165 7079 -44847 131739 -49293 306335 365280 609885 379978 200981 580678
12702 580678 412520 326854 217081 -143088 54769 -75471 117049 -175795 150831 66782
12691 149218 163025 237729 272903 -197823 136186 62654 -36050 255874 -27425 20908 47302
12680 47302 -279328 134322 -56625 336989 -198553 -101592 216668 43601 183269 114664
12670 114664 -129809 -55205 -9659 -229530 -344420 -100257 39930 57118 81564 191071 98232
$$ packed form
12746a1465j2998C82259a99419L5994C48058b46780J10112C44860A8974J8452
12736C7426K17774F0065J85573j07011M9012d6081B27767K04301a551j84242B63299
12724a04530l8040d7599j01469k3899K2434B41498l1214J64533A69890n3168m9629
12713F7093L49072G079d4847A31739d9293C06335N8945K44605k29907j78997L79697
12702E80678j68158q5666j09773a43088E4769g5471A17049a75795A50831F6782
12691A49218J3807P4704L5174a97823A36186F2654c6050B55874b7425B0908K6394
12680D7302b79328A34322e6625C36989a98553R6961B16668D3601J39668o8605
12670A14664a29809e5205i659k19871j14890a00257C9930J7188K4446J09507r2839
$$ plain form
12659 98232 -204691 191018 37687 11579 132698 171782 440342 280566 176179 227412
12649 227412 -103365 43608 222908 -54299 47632 -46800 91747 58405 -89670 179305 -65942
12637 180526 -260370 194788 -304781 423592 278150 107696 -23257 265565 109624 208792
12627 208792 54887 40338 -115990 -24770 43890 349768 41872 418979 18715 -86737 332364
12615 129670 9387 173027 -49121 257823 164354 -306152 101601 64329 56673 -12319 35665
12603 310007 23011 -85163 234189 532669 439383 24959 -121553 226065 208338 -3025 -154806
12592 -154806 -67880 -164 -173223 385758 -276049 21601 -187146 116391 -12619 204370 -63255
12580 9206 8479 -119964 -33931 235339 -127361 -91508 134003 7595 56977 24516 281744
$$ packed form
12659I8232b04691A91018C7687A1579J21119L9084K68560j59776j04387N1233
12649B27412a03365D3608J79300e4299D7632d6800I1747l3342h9670A79305f5942
12637A80526b60370A94788c04781D23592j45442A07696b3257B65565A09624R9168
12627B08792E4887j4549a15990b4770D3890L05878D1872L77107A8715h6737C32364
12615A29670I387J63640d9121B57823r3469c06152A01601l7272p656a2319C5665
12603C10007B3011h5163B34189K98480r3286B4959a21553B26065j7727c025j51781
12592a54806f7880a64j73059C85758b76049B1601a87146A16391a2619B04370f3255
12580I206p27a19964c3931B35339a27361L5853A34003G595M9382B4516K57228
$$ plain form
12569 281744 99028 356549 215239 129557 82493 -64807 -32504 218465 123110 88300 282674
12558 282674 110706 107303 267651 185931 79191 -372185 -72865 -258870 -105474 -80015 -67599
12547 -67599 104820 -98199 -44347 -84321 309913 -71987 49088 31867 -460315 282521 -131140
12535 -128938 -90214 -303131 257086 -284 310246 329235 125245 -8256 -104071 -140349 -145583
12524 -145583 98981 219796 -20340 212562 -295290 35410 277500 -49066 -77158 1136 72675
12513 72675 -16863 -405691 181739 -267801 90954 58925 174722 54739 277842 97786 233257
12502 233257 121733 -201282 7508 -177150 103102 159314 -62287 -45040 -160455 -88026 -273043
12491 -273043 66505 171754 213467 304312 -32904 145207 -17219 187908 -99721 261455 72530
$$ packed form
12569B81744I9028K57521j41310q5682m7064f4807L2303B18465r5355l4810J94374
12558B82674A10706l403J60348q1720G9191c72185g2865j86005a05474K5459J2416
12547f7599A04820i8199d4347l9974C09913g1987D9088j7221d60315B82521a31140
12535a28938L8724k12917B57086b84C10246J8989A25245h256r5815l6278n234
12524a45583I8981J20815b0340B12562b95290C5410K42090d9066k8092A136P1539
12513G2675a6863l88828A81739b67801I0954l2029J15797E4739K23103I7786J35471
12502B33257j11524b01282G508a77150A03102N6212f2287J7247j15415P2429j85017
12491b73043F6505J05249M1713R0845c2904A45207a7219A87908i9721B61455G2530
$$ plain form
12479 -293889 100955 201491 -277626 -150777 95627 -115188 83051 50448 -109804 -135594
12469 -135594 -127131 -17539 -87545 192424 -277286 -83464 166414 -29425 128607 -85093 -108636
12458 -108636 72057 -294910 -110591 -379045 360178 222400 134395 -128342 -374967 66455
12447 -47769 289531 4270 -11360 79274 -138564 -378371 -6162 96634 3368 64631 -54820 -92431
12435 -92431 13400 -147124 283686 67230 -4630 -144176 224090 -287 -135530 328255 8306
12423 89131 306536 25907 360917 38659 -125203 -181469 -42574 31348 99299 -246416 68207
12411 -158651 -262100 -97650 -13792 18136 -220156 -119050 318476 -249018 29161 228081
12401 228081 -274142 -12797 -15710 71613 262513 -192866 404940 -71675 -53767 -167024 -107459
$$ packed form
12479b93889A00955J00536b77626J26849I5627a15188H3051l2603a09804k5790
12469a35594Q463a7539p0006A92424b77286h3464A66414b9425A28607h5093k3543
12458a08636G2057b94910a10591k68454C60178j37778q8005a28342k46625F6455
12447d7769B89531D270a1360G9274a38564k39807f162I6634C368O1263e4820l7611
12435i2431A3400a47124B83686F7230d630j39546B24090b87j35243C28255H306
12423H9131K17405B5907L35010C8659a25203n6266d2574C1348O7951b46416F8207
12411a58651j03449i7650a3792A8136b20156J01106C18476b49018B9161J98920
12401B28081b74142a2797k913G1613J90900a92866D04940g1675J7908j13257N9565
$$ plain form
12390 -107459 73280 423363 13907 -200973 -105712 -27002 -122975 36140 295355 -4912 313872
12378 325802 324188 392425 153287 187505 -1164 147001 14968 -258264 -323537 -98574 243147
12366 -41240 -96133 -91744 245991 133942 38222 -65381 -51726 -580410 -357023 -400719 -247432
12355 -247432 -23283 -93388 -67198 -170120 -201817 250594 -127380 -246269 -87848 -168867 -201403
12344 -201403 -109969 195594 53430 342628 38683 106314 172516 120971 144831 -80029 159191
12332 40190 -34384 -214393 -257213 -105487 224583 1257 62167 -15977 13699 -156727 -45683
12320 -31758 239345 43073 288964 -173596 125033 -110098 80062 -291752 -13249 119544
12309 -21089 -138248 14849 150127 -124523 -45414 23287 105079 26885 72605 -57411 -190801
$$ packed form
12390a07459G3280L50083A3907b00973R5261b7002r5973C6140K59215d912C13872
12378C25802j614O8237A53287L4218a164A47001A4968b58264o5273i8574B43147
12366d1240n4893M389B45991j12049C8222f5381J3655n28684K23387m3696J53287
12355b47432b3283p0105K6190j02922l1697B50594a27380j18889h7848q1019l2536
12344b01403R1434A95594E3430K89198C8683O7631O6202n1545K3860h0029A59191
12332D0190c4384j80009m2820a05487B24583A257O0910a5977A3699a56727d5683
12320c1758B39345D3073K45891a73596A25033a10098H0062b91752a3249A19544
12309b1089j17159A4849J35278a24523d5414B3287Q1792B6885M5720e7411j33390
$$ plain form
12298 -190801 -64083 29568 214721 124796 259323 -12622 -231225 189508 -46434 -55069 221871
12286 199572 -106360 185812 348592 -132734 225388 68502 12794 153145 171167 124207
12276 124207 91895 577462 453909 442755 86148 155036 94953 284667 97082 76102 -39379
12264 102174 344745 35685 213668 135913 -124865 76909 -6200 331392 112952 -25402 -92264
12253 -92264 356979 -84868 105108 205182 131454 214619 -125876 257628 -111213 50669
12242 121379 319892 138999 -104782 198078 144551 -50007 -34029 46636 -133827 -57782
12231 330172 127463 418904 114843 -300958 64716 263327 378938 -9627 162485 139881
12221 139881 96811 346610 267253 248412 240596 89532 288413 165737 4864 140355 -260014
$$ packed form
12298a90801f4083B9568J85153q9925J34527a2622k18603A89508d6434q635B21871
12286A99572a06360A85812J62780a32734B25388F8502A2794J40351J8022m6960
12276A24207l2312M85567j23553j1154H6148O8888o0083J89714I7082k0980c9379
12264A02174K42571C5685J77983p7755a24865G6909f200C31392A12952b5402o6862
12253i2264C56979h4868A05108J00074p3728Q3165a25876B57628a11213E0669
12242A21379J98513A38999a04782A98078n3527e0007J5978D6636a33827e7782
12231C30172A27463K91441A14843c00958F4716J98611J15611i627A62485k2604
12221A39881m3070K49799p9357j8841p816H9532J98881j22676D864J35491b60014
$$ plain form
12209 31598 269201 2717 -54416 391921 41681 503464 157941 262233 355855 15828 -96400
12197 331939 113177 75173 264709 247875 83851 303966 275807 -86233 197786 -78923 201182
12185 2286 409090 141473 79248 81479 32338 193975 106959 22749 -238811 106761 382780
12174 382780 181169 -10101 310947 -73276 -37242 205539 282299 176329 158888 -144179
12163 -293354 -105658 -27334 220252 242484 223199 -19121 99556 127339 279783 -68061 197590
12151 258085 -180496 262720 23409 24513 -141758 -166234 92649 -1284 233735 -75456 136553
12139 -73466 151196 52598 206930 -351261 -74778 -40354 53390 68975 74309 133332 150499
12128 150499 -314072 -7931 136018 40713 -154145 -58469 -101366 426471 9316 -331223 191060
$$ packed form
12209C1598K37603B717e4416C91921D1681M61783A57941J04292R3622A5828i6400
12197C31939A13177l8004J89536j6834H3851K20115k8159h6233A97786g8923B01182
12185B286M06804A41473o2225K231C2338J61637q7016B2749b38811A06761K76019
12174C82780A81169a0101C10947g3276L6034B05539P6760j05970j7441a44179
12163b93354a05658b7334B20252K2232j9285a9121I9556K7783J52444f8061A97590
12151B58085a80496B62720B3409J104a41758k4476I2649a284B33735g5456A36553
12139g3466A51196E2598J54332c51261g4778L4424E3390J5585N334N9023J7167
12128A50499c14072g931A36018D0713a54145e8469m2897D26471I316c31223A91060
$$ plain form
12116 74590 173355 -158396 160654 141928 -187514 250535 -395445 -263085 -3683 99612 -70012
12104 341837 -143054 154599 209511 -8577 161313 207965 349417 -406642 136080 255787
12094 255787 8186 -23947 -62121 289078 -167326 150953 287973 -14700 -113102 -113371 -122842
12083 -122842 -62392 223307 -84779 -8980 -82827 -71125 354661 1051430 1877695 1026748 277256
12071 244675 -76709 23277 -96990 38033 520679 -84085 109838 -235779 12378 -5165 -50916
12060 -50916 11500 582567 71137 176664 -96162 -4828 52760 -320486 150443 96902 53546
12049 53546 -25516 141675 144767 158636 -365838 1905 115929 -231111 -338985 -25793 -49499
12038 -49499 -330358 -150725 315387 -401992 -256811 -174794 10297 -164263 -138714 -187715
$$ packed form
12116G4590R8765a58396A60654j8726a87514B50535c95445J32360c683I9612g0012
12104C41837a43054A54599N4912h577A61313M6652J41452d06642A36080J19707
12094B55787H186b3947l8174B89078a67326A50953J37020a4700r8402k69r471
12083a22842O0450B23307h4779h980p3847J1702C54661O96769Q26265q50947B77256
12071B44675g6709B3277i6990C8033M82646h4085A09838b35779A2378e165m5751
12060e0916A1500N71067G1137J05527i6162d828E2760c20486A50443n3541m3356
12049E3546b5516A41675L092J3869c65838A905J14024b31111j07874b5793k3706
12038d9499k80859a50725C15387d01992J45181Q2017A0297a64263K5549m9001
$$ plain form
12028 -187715 106137 -27119 -351496 -30366 -24341 -164145 186172 -265112 92315 204244
12018 204244 -32334 45468 -37350 -138 44032 269234 10881 31126 -168741 -16076 53651
12006 -230720 -217636 -278412 -137905 10168 -322987 -170321 88104 -277844 -357873 198610
11995 299689 -175946 59131 -109906 -68571 70633 -38115 229826 -137499 -516935 74989
11984 -204198 241234 -27907 -308491 149361 -132121 278404 -2771 -42185 24883 61871 -147532
11972 -181461 -33231 68781 -18323 88182 -116156 247325 195488 -102564 257914 -68453 -28471
11960 -100064 49515 -153301 168793 -41248 127270 34073 -221175 32829 -79171 -129691 -224240
11949 -224240 327 -138768 266632 143536 7506 -213962 98196 84819 160302 -75641 -209584
$$ packed form
12028a87715A06137b7119l24377c0366O025j39804A86172b65112I2315J11929
12018B04244c2334D5468c7350a38D4032K25202A0881K0245a68741a6076E3651
12006b30720J3084o0776a37905A0168c22987J52666H8104b77844q0029A98610
11995B99689a75946E9131a09906M1335G0633c8115B29826a37499l79436G4989
11984b04198B41234b7907k80584A49361a32121B78404b771l9414B4883L6988a47532
11972a81461c3231F8781a8323H8182a16156B47325n1837a02564B57914f8453b8471
11960a00064D9515a53301A68793d1248A27270C4073b21175C2829g9171n0520r4549
11949b24240C27a38768B66632j23096G506b13962I8196j3377P5483g5641j33943
$$ plain form
11938 -209584 -303031 223382 -136485 -51143 -136435 345402 177774 -114581 326574 -209845
11927 60188 95057 -13681 -281632 9953 143693 -71098 -81084 -310032 -32918 31756 50614
11916 50614 -74876 -125135 239746 -218434 -60330 39561 -36778 161763 85630 -243891 -170672
11905 -170672 -46972 10957 -17583 97978 260597 255203 -113203 34861 -74710 -213402 -98572
11893 -67284 301987 -154338 -388813 -226588 17721 -3493 -117935 -69084 77945 65499 81563
11882 81563 -104970 -156035 -191694 279955 -208606 33242 -89755 -120887 80472 -94793 -41088
11870 -167262 -218288 -18091 244801 -290597 -222353 -215861 -130028 68031 44512 -30844 129635
11858 295285 61213 -199405 -54330 165782 56212 -262615 -146624 -302063 -159969 -97701
$$ packed form
11938b09584r3447B23382a36485e1143q5292C45402j67628a14581C26574b09845
11927F0188L4869a3681k67951I953J33740g1098r986k28948c2918C1756J8858
11916E0614g4876n0259B39746b18434f0330C9561c6778A61763p6133b43891P3219
11905a70672d6972A0957a7583I7978J62619n394a13203C4861g4710j38692i8572
11893f7284C01987a54338k34475J62225A7721c493j14442M8851G7945j2446J6064
11882H1563a04970n1065l5659B79955b08606C3242h9755l1132H0472i4793d1088
11870a67262n1026a8091B44801b90597O8244O492Q5833F8031k3519c0844A29635
11858B95285F1213a99405e4330A65782E6212b62615J15991j55439J42094O2268
$$ plain form
11848 -97701 -289063 -7279 -350284 165834 -54601 -295331 226992 64998 157673 -159660 21196
11836 -283035 -22868 365225 219576 139621 10440 -112572 73640 88321 83290 -167943 -45844
11824 -22031 126691 -47115 119771 -85215 -64585 -94602 -69018 143881 -44838 222978 -6911
11812 -345578 103532 -156449 152005 -459279 -69695 135387 -83414 95958 -72758 235675
11801 -246968 -46112 259831 -91448 69867 -270690 -17256 328664 142811 -35269 -217292
11791 -217292 29065 -73127 108764 -450076 -103681 -179448 120306 170685 58180 259681
11781 259681 -175577 -22383 248056 4413 321696 186018 189627 88891 154406 67171 78092
11770 78092 173516 128439 -131508 -31544 -446086 -8795 156686 -53270 107302 237933 57473
$$ packed form
11848i7701j91362g279l43005A65834e4601k40730B26992F4998R2675a59660B1196
11836b83035b2868C65225j45649p9955A0440a12572G3640J4681n031a67943d5844
11824b2031A26691d7115A19771h5215K0630l0017K5584A43881d4838B22978f911
11812c45578A03532a56449A52005d59279f9695A35387h3414I5958g2758B35675
11801b46968d6112B59831i1448F9867b70690a7256C28664A42811c5269j82023
11791b17292B9065g3127A08764d50076a03681p5767A20306N0379E8180K01501
11781B59681a75577b2383B48056D413L17283j35678L609H8891O5515F7171J0921
11770G8092R5424m5077a31508c1544m14542h795A56686e3270A07302J30631E7473
$$ plain form
11758 -92523 -95668 -259450 37316 48670 442585 -73047 -99834 -280311 183597 185102 145894
11747 145894 218070 132796 -135533 69624 106908 -39063 248724 -13906 77171 148135 182087
11736 182087 -84090 -4868 -186561 -225691 229964 -23800 -153401 -5074 161670 23935 184733
11725 184733 148233 169782 -362336 21136 -138892 219951 -232187 118529 -142422 -49126
11714 -58299 -163094 -50575 132437 -121655 119242 -211177 -163576 311204 -175281 94590
11703 140829 275526 -70354 -158292 338127 402386 72904 141621 -126312 -96 -2984 342248
11691 -211373 296138 215463 208018 -67014 63323 -20117 145160 -50163 -49432 280835 241927
11680 241927 153260 -332589 18214 44799 -69823 22704 -248503 -71456 -32830 -145188 156426
$$ packed form
11758i2523l145j63782C7316J1354L93915g3047k6787j80477A83597J505l9208
11747A45894P2176q5274a35533F9624L7284c9063B48724a3906G7171P0964L3952
11736A82087h4090d868j81693l9130B29964b3800j29601e074A61670B3935J60798
11725A84733l6500K1549c62336B1136a38892B19951b32187A18529a42422d9126
11714e8299j04795e0575A32437a21655A19242b11177M7601C11204a75281I4590
11703A40829J34697g0354q7938C38127O4259G2904O8717a26312i6k888C42248
11691b11373B96138q0675p445f7014F3323b0117A45160e0163P31B80835l8908
11680B41927q8667c32589A8214K6585f9823B2704b48503g1456c2830j12358A56426
$$ plain form
11668 -206237 204401 267856 21150 150190 -25731 -327047 -377256 -18411 240777 229264 -25833
11656 -30371 -114319 160734 21621 -136740 353503 6993 94544 -76858 330197 489596 -91120
11644 8479 -121926 -250825 -90893 111705 -129007 88175 -78802 -272528 -278000 -47691 55412
11632 227776 -290458 -251471 55733 -190215 60510 281176 -72672 102321 234829 220103
11622 220103 653565 -61974 -55917 87125 -142828 -102412 -9291 109860 159964 -174616 13132
11610 20534 -99892 -225746 -2207 121032 64230 140428 204870 118673 -290893 104800 203958
11599 203958 167962 66346 -166899 211969 -106581 -46318 21883 60982 145735 172247 -143748
11587 16128 82468 -90951 7649 121707 51195 293614 259352 257368 -400914 -13021 -79787
$$ packed form
11668b06237B04401O3455B1150J29040b5731l01316n0209a8411B40777j1513b5833
11656c0371q3948A60734B1621a36740C53503F993Q7551g6858C30197J59399i1120
11644H479a21926j28899i0893A11705a29007H8175g8802j93726n472d7691E5412
11632B27776b90458L8987E5733a90215F0510K20666g2672A02321J32508j4726
11622B20103M33462f1974O057H7125a42828M0416i291A09860N0104a74616A3132
11610B0534i9892j25854b207A21032n6802P6198O4442q6197b90893A04800R9158
11599B03958l5996F6346a66899B11969a06581d6318B1883L9099Q4753K6512a43748
11587A6128O6340i0951G649J14058E1195K42419l4262j984d00914a3021o6766
$$ plain form
11576 -79787 187369 -56070 42692 307794 -181194 53205 385164 86563 35208 -85255 17267
11564 290047 5711 174614 181299 267007 74319 -142580 -131818 -20977 -103991 183207 115128
11553 115128 221317 182784 -447071 164487 144157 -189516 223070 -216489 126970 -134558
11542 -207545 -146040 258477 153875 273651 409238 -35608 172292 206591 179196 -142210
11531 154339 135618 46921 457207 101777 107924 135094 195113 -40669 -107380 -63663 329425
11519 290545 418256 248351 89315 -52417 -69235 339957 -173783 89568 -122012 306452
11508 218770 -48623 466353 26292 193457 252114 -128128 -40471 -79248 -2766 410207 77296
11496 40477 192793 -29891 -140279 168466 42615 29428 244712 -77632 412913 280403
$$ packed form
11576g9787A87369e6070D2692K65102a81194E3205L31959H6563C5208h5255A7267
11564B90047E711J68903O685Q5708G4319a42580J0762b0977q3014A83207o8079
11553A15128J06189l8533d47071A64487k0330a89516B23070b16489A26970a34558
11542b07545O1505B58477j04602J19776J35587c5608A72292L4299k7395a42210
11531A54339j8721D6921M10286A01777O147K7170O0019d0669o6711M3717C29425
11519B90545J27711j69905H9315e2417j6818C39957a73783H9568a22012C06452
11508B18770d8623D66353B6292J67165N8657a28128d0471l8777b766D10207G7296
11496D0477J52316b9891j10388A68466D2615j3187K15284g7632D12913j32510
$$ plain form
11486 280403 290426 -43296 22379 227131 390174 368804 -140058 139789 -51559 162344
11475 337977 158546 95885 71909 291891 102001 -70528 187955 304975 216518 28912
11464 80543 -101877 57886 -105783 1631 -159975 -155877 193495 417919 151393 8160 25568
11453 25568 -20565 99192 -42115 197861 -77814 287762 -117421 245099 381105 624679
11443 624679 31883 22867 -148800 208226 133584 -43015 75582 -91377 -150762 -40341 241744
11431 8550 521 106551 114661 -231102 -201555 223070 184385 -110219 3027 -46428 -233322 253598
11418 26166 414741 71479 220573 47526 -220205 63615 -10448 -12494 187853 -186338 -386077
11407 -386077 -330847 -246380 278159 -12968 357094 -44866 -390770 170072 -14727 96921 -82057
$$ packed form
11486B80403J0023d3296B2379K04752J63043k1370a40058A39789e1559A62344
11475C37977A58546o2661k3976K19982A02001g0528A87955J17020q8457B8912
11464H0543a01877E7886a05783A631a59975M098A93495K24424A51393H160J7408
11453B5568b0565I9192d2115A97861g7814B87762a17421B45099J36006K43574
11443F24679C1883r016a48800B08226p4642d3015G5582i1377n9385d0341B41744
11431H550E21J06030Q110b31102K9547B23070l8685a10219C027d6428j86894B53598
11418B6166L88575G1479J49094D7526b20205F3615a0448k046A87853a86338j99739
11407c86077N5230Q4467B78159a2968C57094d4866l45904A70072a4727I6921h2057
$$ plain form
11395 47611 -273913 -3301 -102890 47721 -174366 -66738 174826 -263774 52445 -139 249533
11383 171704 469688 164076 -123842 162444 -363437 146947 332491 246738 98117 -18594
11372 381600 212198 -231112 131852 143783 -534187 48723 -67325 -219301 -1492 -539120
11362 -539120 418483 -81077 70171 41234 -258024 45215 175744 -18497 -272772 -119044
11351 228477 21581 -296450 406494 -232253 -35900 193811 -74905 39321 -117975 228516
11340 -176787 107217 -87406 -461711 212883 118936 47498 -355206 -175334 -164350 -213695
11330 -213695 18592 -18342 -113303 -287511 -787 507205 201677 43032 24082 6703 12354 -44932
11317 -153965 79484 -151770 177608 176358 3655 285567 133636 239819 -42764 -290919 19852
$$ packed form
11395D7611b73913c301r9589D7721a74366f6738A74826b63774E2445a39B49533
11383A71704K97984A64076a23842A62444c63437A46947J85544q5753I8117a8594
11372C81600j69402b31112A31852J1931e34187D8723f7325j51976a492n37628
11362e39120D18483h1077G0171k8937b58024D5215J30529a8497k54275a19044
11351B28477B1581b96450D06494b32253c5900A93811g4905C9321a17975B28516
11340a76787A07217h7406l74305B12883r3947D7498c55206a75334J0984m9345
11330b13695A8592a8342r4961j74208g87E07205B01677D3032j8950F703N651d4932
11317a53965G9484a51770A77608j250C655K81912A33636J06183d2764k48155A9852
$$ plain form
11305 -164774 215138 -79150 61076 112800 -142135 -6072 121717 -284783 -168706 16408 391412
11294 391412 -21803 266199 60770 153744 21415 25963 177404 117113 237500 118739 27590
11282 52893 138960 -155838 300367 164733 29219 133926 -66334 -60848 40479 -22368 -174096
11271 -174096 176245 -201476 -11792 -118892 75008 548760 41463 -65515 -146916 -208106 288086
11259 13531 -214509 115786 136252 -260477 45908 79273 -78270 -25438 -25371 73874 -105777
11247 46673 -35898 15021 13052 -162096 -183551 206451 59930 100698 -126397 36351 -35537
11235 161165 36968 126746 62042 65137 50275 -204552 -25029 34336 -106999 106602 71686
11224 71686 -104713 -82654 23866 37218 -108412 -98557 -64872 11025 56102 117596 -79816
$$ packed form
11305a64774B15138g9150F1076N1724a42135f072A21717b84783J16077A6408L75004
11294C91412b1803B66199F0770R2974B1415M548J51441o0291J20387A18739B7590
11282E2893Q6067a55838C00367j35634B9219J04707f6334N486D0479b2368j51728
11271a74096A76245b01476a1792j07100G5008M73752D1463f5515q1401o1190B88086
11259A3531b14509A15786K0466b60477D5908L3365g8270b5438O7G3874a05777
11247D6673c5898A5021j969a62096k1455B06451E9930M0768a26397C6351c5537
11235A61165C6968Q9778F2042L095j4862b04552b5029C4336a06999A06602l4916
11224G1686a04713K2059B3866J3352a08412R855L3685A1025M5077O1494g9816
$$ plain form
11212 42672 274341 89682 -306821 -114111 -13584 -132000 266784 -81438 -111677 4054 -177272
11200 -95187 -314229 -377529 -178632 -208939 -89318 -194692 -81506 315893 105494 12362 149821
11189 149821 46972 -354600 15777 16523 -132615 -161160 22103 -211511 -188639 -92225 -218912
11178 -218912 -237351 -14189 14831 -276338 140311 136725 -138170 59133 163295 -228432 -53514
11166 165513 -87934 -2331 -112087 -128473 403611 -119499 -22009 -85555 273106 -346237 52925
11154 92803 68574 -239373 -53188 -37781 -66985 156760 67809 -107372 274146 -58758 -59395
11143 -59395 33359 -51500 8087 324369 -22806 35023 55336 370427 -45603 -30374 -81203
11132 -81203 202806 13331 126909 127925 307227 92285 223445 242222 69230 309988 75438
$$ packed form
11212D2672K31669H9682c06821a14111a3584j18416B66784h1438l0239D054a77272
11200i5187k19042o3300a78632l0307h9318j05374h1506C15893A05494A2362J37459
11189A49821D6972c54600A5777P46a32615k8545B2103b11511K2872i2225j26687
11178b18912j8439a4189A4831b76338A40311l586a38170E9133J04162b28432e3514
11166A65513h7934b331j09756j6386D03611a19499b2009o3546B73106c46237E2925
11154I2803k4229b39373e3188J5407k9204A56760F7809a07372B74146e8758o37
11143e9395C3359e1500H087L16282b2806C5023K0313L15091d5603J5229n0829
11132h1203B02806A3331J13578J016J79302I2285J31160J8777F9230K40758G5438
$$ plain form
11120 64337 80627 -240795 2897 -154535 -207288 156506 83213 -209430 168967 9199 243691
11109 243691 287333 105194 89375 -60782 75357 -143063 10142 -2928 -37317 240846 55302
11097 305131 -133014 182199 118668 208569 53146 226658 237996 319417 114849 932 322795
11086 322795 -31712 284584 204467 294505 148121 295166 82270 322283 312408 482954 130357
11074 346663 158817 184546 80186 134186 277467 312507 365278 251774 99415 239313 279506
11063 279506 569885 420873 646792 733128 661957 777208 618028 332959 790044 686128
11053 686128 749794 393804 746396 644084 655625 547577 826260 633847 765531 908244
11043 908244 690523 668339 628415 744930 1050550 671419 653447 755613 754085 517833
$$ packed form
11120F4337J6290b40795B897a54535n2753A56506p3293b09430A68967I199K34492
11109B43691M3642A05194j5819f0782G5357a43063A0142b928l4389B40846E5302
11097C05131a33014A82199o3531Q9901E3146J73512J1338Q1421A14849I32L21863
11086C22795c1712B84584q0117R0038j46384J47045H2270K40013r875J70546A30357
11074C46663A58817K5729H0186N4000J43281L5040N2771j13504I9415J39898M0193
11063B79506K90379j49012K25919Q6336p1171J15251j59180k85069M57085j03916
11053F86128O3666l55990L52592j02312J1541j08048K78683j92413J31684J42713
11043I08244k17721k2184l9924J16515L05620l79131j7972J02166j528k36252
$$ plain form
11033 517833 479355 659109 1063201 424934 676976 681395 534261 1043438 596044 950873
11023 950873 870098 650566 566054 469923 416153 423379 862627 454993 490694 508589 517602
11012 517602 1041804 882516 934934 580534 481823 649872 453910 487943 373828 427861
11002 427861 870289 525592 563055 373609 531805 622782 722215 484829 745190 623310
10992 623310 506048 659725 476813 258905 1029027 969028 963904 918039 1317992 1039011
10982 1039011 850555 1344554 1162221 1146977 1507655 1649679 1847491 1885494 2339821 2205412
10972 2205412 2560978 2880396 2632592 3048585 2710248 2506007 2501424 2064992 2141194 2209055
10962 2209055 1978589 1868690 2134736 1939915 2025621 2029899 2382860 2103983 2229958 2020838
$$ packed form
11033E17833l8478J79754M04092D24934K52042M419j47134N09177m47394L54829
11023I50873q0775k19532q4512r6131n3770P226M39248m07634L5701J7895R013
11012E17602N24202j59288N2418l54400r8711J68049j95962L4033j14115N4033
11002D27861M42428l44697L7463j89446J58196R0977R9433k37386K60361j21880
10992F23310j17262J53677j82912k17908P70122n9999n124m5865L99953k78981
10982A039011j88456M93999j82333j5244L60678J42024J97812L8003M54327j34409
10972B205412L55566L19418k47804M15993l38337k04241m583m36432P6202O7861
10962B209055k30466j09899K66046j94821Q5706M278L52961k78877J25975k09120
$$ plain form
10952 2020838 1424805 1089860 1129558 1143333 837841 623620 421526 741743 454891 376110
10942 376110 525283 345714 513340 -56300 151362 -42361 409332 483999 25379 -49537
10931 30043 78868 208941 314153 194314 142362 276040 450553 438169 -81847 91298 321780
10920 321780 168557 -144829 -64424 122801 62080 -46702 -172203 288928 191575 30413
10909 288524 -119663 -50621 -166282 -16331 -8810 229762 308846 -11940 -311983 150810 342454
10898 342454 -142969 393785 47982 20639 95153 416807 -74855 155814 116527 -131676
10887 -342742 -343646 152152 -71500 -31090 16616 230676 -76332 -120560 60006 -49237 10147
10875 -117588 77258 131053 25888 265807 -34512 -89652 46652 -99455 142654 -65334 -25939
$$ packed form
10952B020838n96033l34945L9698J3775l05492k14221k02094L20217k86852p8781
10942C76110J49173j79569J67626e6300A51362d2361D09332P4667B5379d9537
10931C0043M8825J30073J05212j19839n1952J33678J74513j2384h1847I1298K30482
10920C21780j53223a44829f4424A22801o0721d6702j25501B88928r7353C0413
10909B88524a19663e0621j15661a6331P521B29762P9084a1940l00043A50810J91644
10898C42454a42969C93785D7982B0639P4514L21654g4855A55814l9287a31676
10887c42742r04A52152g1500c1090A6616K14060g6332m4228F0006d9237A0147
10875a17588G7258N3795B5888K39919c4512n5140D6652i9455A42654f5334b5939
$$ plain form
10863 4462 268715 -61546 -76749 207135 119632 -201665 -47040 141823 217897 -382133 307356
10851 240720 18034 -104262 -244005 88559 183574 -106692 -413550 30360 -48011 166603
10840 198828 85843 68574 122801 -123118 44616 171850 -233625 -141942 48670 -67347 -219162
10829 -219162 -258963 -41619 -186077 -73776 130655 -242598 -94198 360129 26418 -24857 -80639
10818 -80639 -219329 141452 86986 -268632 72088 194280 -314 464006 -293863 125643 3599
10806 -211236 -70300 -187210 84030 9991 -248405 188053 -49647 186213 -37720 161663 24457
10794 -128472 30515 -199746 -322784 48994 24824 -240542 64455 -306572 -231850 -21169 2170
10782 -341677 -27038 -505913 324108 27520 148194 99444 19554 -148159 -374677 -399221
$$ packed form
10863D462K64253f1546j5203B07135q7503b01665d7040A41823P6074c82133C07356
10851B40720A8034a04262j39743H8559R5015a06692l06858C0360d8011A66603
10840A98828H5843j7269N4227a23118D4616J27234b33625R1683D8670f7347j51815
10829b19162l9801d1619j44458g3776A30655b42598i4198C60129B6418b4857n5782
10818h0639j38690A41452n4466b68632G2088J22192c14D64006b93863A25643C599
10806b11236g0300j16910H4030I991b48405A88053d9647A86213c7720A61663B4457
10794a28472C0515a99746j23038D8994k4170b40542F4455c06572P4722b1169B170
10782c41677b7038m78875C24108B7520J20674m8750A9554a48159k26518k4544
$$ plain form
10772 -399221 86416 -298444 -90093 93441 86003 -188567 15201 104130 179663 -231809 -151299
10761 -151299 -80806 -13007 121339 78456 54726 25015 115654 49329 -170568 -421496 92676
10749 96842 -211239 -110984 -50039 -107578 111935 18726 4941 -128312 -41192 122787 -115463
10737 -36498 -43114 58748 -81929 148327 171289 -28304 -285177 -407688 -192098 -21286 -37641
10726 -37641 -122849 -189090 300976 -35696 25407 84985 260161 281713 -74947 -609491 -98999
10714 499322 350268 -122826 -365883 -42527 -109183 -231988 -90961 -187600 41419 87514 6443
10702 -73484 -274275 -210911 130692 -78872 134607 -37312 -231981 -123649 -333993 126445
10691 157746 -337796 -41220 29131 -81788 -176863 -157826 79632 -31945 151084 116478 -203387
$$ packed form
10772c99221H6416b98444i0093I3441p438a88567A5201Q8929P5533b31809Q0510
10761a51299P0493a3007A21339m2883k3730B5015R0639D9329a70568k50928I2676
10749I6842b11239J00255e0039n7539A11935A8726D941a28312d1192A22787a15463
10737c6498o616E8748h1929A48327K2962b8304k56873j22511a92098b1286j6355
10726c7641q5208o6241C00976c5696B5407N9578J75176K1552g4947n34544i8999
10714D99322j49054a22826k43057d2527o6656j22805i0961r6639D1419M6095F443
10702g3484k00791O3364A30692g8872A34607c7312j94669J08332k10344A26445
10691A57746c37796d1220B9131h1788r5075J9037G9632c1945A51084l4606b03387
$$ plain form
10679 202153 36351 -100730 -258520 227642 29105 -287559 -155622 -224559 -72331 -153089
10669 -153089 -124724 -78458 -25924 47539 -212198 -198093 36082 -185989 143737 -280183 93878
10657 -42207 -341448 131803 -105326 -69304 20804 198266 7091 -69846 50225 -32967 139313
10645 -182048 93034 -256064 -111085 -123313 -69463 -202513 30597 -245407 -13667 -259049
10635 -259049 22591 -74563 28736 -163807 -55010 93298 -172234 -70809 130641 -61409 -111470
10624 -111470 118675 -71262 -381184 -151466 -154470 208981 157115 96915 32617 -33958 -138204
10613 -138204 146357 -10083 243934 230262 -361419 -196930 -74069 -113327 -6027 -85042 202371
10601 360230 -125177 6817 -77483 299204 285637 184635 160027 -266964 -385659 -230347
$$ packed form
10679B02153C6351a00730j57790B27642B9105b87559J31937o8937g2331q0758
10669a53089K8365M6266b5924D7539b12198J4105C6082a85989A43737b80183I3878
10657d2207k99241A31803a05326L6022B0804J77462G091f9846E0225c2967A39313
10645a82048I3034b56064a11085j2228N3850j33050C0597b45407a3667k45382
10635b59049B2591g4563B8736a63807e5010I3298a72234g0809A30641f1409n0061
10624a11470A18675g1262l09922a51466l004B08981n1866o0200C2617c3958j04246
10613a38204A46357a0083B43934j3672c61419J64489g4069l9258f027p9015B02371
10601C60230a25177F817g7483B99204j3567j01002k4608b66964j18695J55312
$$ plain form
10591 -230347 -314117 -104722 30528 202259 -28172 15299 103158 -131730 -29980 -351996 142962
10579 -460937 177490 -114166 150761 117215 -227557 -232408 -47036 -296269 -79986 -282488
10569 -282488 -266105 -70219 44976 -98636 180772 86188 -249292 -145488 89383 -347034 223324
10557 33143 -198431 327852 -167335 29595 -110706 -204936 -301803 289355 -241355 -172473
10547 -172473 -50362 -153048 40194 -314935 238017 -217497 68204 121375 152462 152821 -81580
10535 -152129 32402 -95661 -134795 -44321 -25970 -16649 74977 -434786 -164014 25684 109914
10524 109914 100189 170916 -90152 -133686 -89288 -216346 -128908 61406 79905 430956 -239493
10512 -187971 -44089 53800 158607 -190557 146766 223695 -1509 -150143 -71074 -32884 58076
$$ packed form
10591b30347q3770a04722C0528J71731b8172A5299Q7859a31730b9980l22016A42962
10579d60937A77490a14166A50761l3546b27557m851d7036k49233g9986k02502
10569b82488J6383g0219D4976i8636A80772H6188b49292J03804H9383c47034B23324
10557C3143a98431C27852a67335B9595a10706r4230r6867B89355b41355O8882
10547a72473e0362j02686D0194c14935B38017b17497F8204N3171L1087L59h1580
10535a52129C2402i5661l9134d4321J8351R321G4977d34786a64014B5684Q4230
10524A09914r725P0727i0152m3534M4398j27058Q7438F1406J8499L51051b39493
10512a87971d4089E3800J04807a90557A46766P6929a509j48634g1074c2884E8076
$$ plain form
10500 -165398 -205921 -238200 -6615 173470 157071 -36815 -59496 151574 -151911 -32786 -87515
10489 -87515 231258 57162 49556 -27614 20896 -53706 211689 141124 252892 579682 233629
10477 366580 88765 -44173 127955 152878 20164 59948 -63339 -185246 340507 193223 -95198
10465 140212 125135 182791 -91803 -92977 236601 121899 -330585 202610 277052 166385 11074
10453 -7466 -95966 277990 238122 -304102 165337 -23824 9216 -16258 205978 194928 124927
10442 124927 105901 194408 23694 -84339 100664 -348424 57209 -105269 -365560 -124819
10431 -171308 -242 183488 -420209 52407 -127035 -255865 265957 -21202 418108 -142281
10420 -122745 -303476 23477 -38251 33250 96198 -42414 -40386 302396 117228 -133834 -41713
$$ packed form
10500a65398m0523l2279f615A73470j6399c6815k2681A51574a51911c2786n4729
10489h7515B31258E7162p606b7614B0896e3706B11689p0565J11768L26790B33629
10477C66580H8765d4173A27955K4923B0164L9784f3339j21907C40507j47284i5198
10465A40212j5077N7656i1803j174B36601j14702c30585B02610P4442j10667A1074
10453g466q8500B77990l9868c04102A65337b3824I216a6258B05978j1050p0001
10442A24927j9026Q8507B3694h4339A00664c48424E7209a05269k60291a24819
10431a71308b42A83488d20209E2407a27035j28830B65957b1202D18108a42281
10420a22745j80731B3477c8251C3250O2948d2414K028C02396A17228a33834d1713
$$ plain form
10408 -15414 -390468 -368802 -206626 -85421 -203674 42534 3498 495531 182943 51422 300293
10397 300293 191097 -185540 20918 -160700 -44011 272394 297906 197244 82210 -166576
10386 -189808 98533 -58116 -134928 51479 335137 469999 -12250 -60062 -51543 90676 87365
10375 87365 136137 102972 298280 192514 153479 474153 311797 345166 660044 260552
10364 370399 454680 371758 308140 336138 70833 95558 -147673 49510 234260 181921 171853
10353 171853 187541 248965 665226 633356 670696 448364 185574 646808 -26694 203913
10342 816480 353053 89050 37991 339921 495680 219541 286661 77791 110577 349369
10332 349369 211560 269609 -117305 130805 -450131 258549 380181 126530 79803 398525
$$ packed form
10408a5414l75054K1666J62176h5421j18253D2534C498M92033A82943E1422K48871
10397C00293j09196a85540B0918a60700d4011B72394K5512j00662H2210a66576
10386a89808I8533e8116p6812E1479K83658J34862a2250m7812Q519I0676l311
10375H7365M8772l3165J95308j05766l9035L20674j62356L3369L14878B60552
10364C70399Q4281q2922o3618K7998G0833K4725a47673D9510J84750n2339j0068
10353A71853J5688O1424M16261l1870L7340k22332A85574M61234b6694B03913
10342H16480C53053H9050C7991L01930J55759B19541O7120G7791L2786K38792
10332C49369j37809N8049a17305A30805d50131B58549J21632A26530m6727L18722
$$ plain form
10322 398525 109233 -6908 256344 340771 32784 200425 -144997 591363 233362 120370
10312 120370 135583 -119684 158461 -66344 96443 -137772 78575 -158793 -276003 117773
10301 -250033 -411951 39827 -3728 -184054 92550 42083 -69455 -20157 107354 31637 -24116
10289 50940 87485 145226 135342 -90301 55007 41209 12256 -410447 223617 -230130 -233392
10278 -233392 129130 -441060 28610 -142524 13565 121863 -155576 -116884 58705 -64239
10267 249956 56684 -309084 117048 408279 96342 39394 -46017 262466 271811 506830 457596
10256 457596 439938 244438 341032 548373 213389 -713 369445 313055 210410 -5273 -99399
10245 -99399 215102 -135288 3000 139580 -125899 -295015 320425 -195203 41462 -126990
$$ packed form
10322C98525A09233f908B56344Q4427C2784J67641a44997E91363B33362j12992
10312A20370J5213a19684A58461f6344I6443a37772G8575a58793j17210A17773
10301b50033j61918C9827c728j80326I2550D2083f9455b0157A07354C1637b4116
10289E0940L6545N7741r884i0301E5007j3798A2256d10447B23617b30130l262
10278b33392A29130d41060B8610a42524A3565J08298a55576L8692E8705f4239
10267B49956E6684c09084A17048K91231I6342C9394d6017B62466R345K35019m9234
10256D57596j7658j95500R6594K07341B13389g13C69445n6390j02645e273r4126
10245i9399B15102a35288C000J36580a25899j69116C20425a95203D1462a26990
$$ plain form
10234 -428221 240552 -35486 34237 42402 -76640 290745 -291468 -1775 -136598 99758 -115516
10222 -200002 -184272 -80749 -330303 -388218 269055 44596 144641 190357 174315 113284 50183
10210 245401 133984 119149 -199281 -78614 -410731 -80437 -258148 -217415 -81167 -167717 102732
10198 264268 168005 -247498 -179443 -133823 -206721 -180529 -184606 -81438 78657 -91385 -38579
10186 -1049 127382 -2454 -121040 125188 91413 -152289 141560 -546617 -43374 259108 -129709
10174 -150120 -107068 -191211 43582 -260830 -147384 -275810 54085 219164 -391508 -9172 27304
10162 -254547 -157274 111188 -67264 104091 80773 -69126 -306933 -134829 82122 -346369
10151 -6161 -109426 17178 -396538 -235920 -53074 87384 -25991 58797 -380571 -379300 50968
$$ packed form
10234d28221B40552c5486C4237Q165g6640B90745b91468a775j34823I9758a15516
10222b00002J5730h0749k49554n7915B69055D4596J00045M5716j6042o1031E0183
10210B45401j11417j4835a99281g8614l32117h0437j77711M0733h1167q6550A02732
10198B64268r6263b47498O8055M5620p2898K6192m077h1438G8657i1385c8579
10186a049A27382b454j18586A25188l3775a52289A41560e46617d3374B59108a29709
10174a50120M3052q4143D3582b60830J13446j28426E4085J65079c91508i172B7304
10162b54547R7273A11188f7264A04091k3318f9126k37807a34829H2122c46369
10151f161j03265A7178c96538J60618e3074H7384b5991E8797c80571J271E0968
$$ plain form
10139 -134960 -114257 -71139 -298517 -217636 2614 272749 187457 -37943 -250922 -207008 -106346
10128 -106346 119897 -135261 -232043 -89928 200566 4545 188190 89061 429931 -126636
10117 -217696 18075 -189527 77406 -279050 98392 -9280 -186262 -194543 -44484 -157692 -223176
10106 -223176 -320740 -95686 -71827 176118 -403328 -265097 234292 -246944 -15884 96966
10095 152897 -355491 -243864 -407440 -188256 -188682 -47009 -62305 227433 -1115 -143568 40826
10083 -3559 12419 -231640 -159712 -181704 -57271 -72786 123896 74598 30668 -80339 -121867
10072 -121867 -49347 -140210 -133619 -171888 -90329 83883 -96433 -149413 143456 -103781 -233320
10061 -233320 -253495 16542 -237532 -161854 -156732 197997 -72096 -37221 -80275 -107451 -305562
$$ packed form
10139a34960K0703M3118k27378Q0881B614K70135q5292c7943k12979M3914J00662
10128a06346A19897a35261r6782h9928B00566D545J83645H9061L40870a26636
10117b17696A8075a89527G7406b79050I8392i280j76982q281d4484j13208o5484
10106b23176r7564i5686K3859A76118d03328J38231B34292b46944a5884I6966
10095A52897c55491J11627j63576a88256m26d7009j5296B27433a115j42453D0826
10083c559A2419b31640P1928k1992e7271j5515A23896m9298C0668h0339m1528
10072a21867d9347r0863O591l8269Q1559H3883i6433n2980A43456a03781j29539
10061b33320k0175A6542b37532P5678N122A97997g2096L4875m3054k7176j98111
$$ plain form
10050 -305562 36072 -111058 233328 35031 -51106 -317246 -87240 -459721 -181156 94316
10039 -138993 140437 119856 -85132 217877 36779 3625 91601 -137669 18581 135560 24300
10027 -37214 -161769 96293 -163634 -125779 -103832 74393 -152334 263710 -99247 274860 -240953
10015 -35793 18377 -141034 261775 -26892 -88581 23136 -38908 -119838 -303779 -197833 37976
10003 13048 -308909 -97383 -149534 276497 -17872 -394633 76076 241116 194399 -193722 -332826
9992 -332826 94946 -211765 137714 241503 285869 -94888 -301370 -172387 45991 140601 -41086
9980 21363 -285610 -66186 505514 4884 29254 75128 286956 -275222 38643 246949 -314587
9968 137819 -2672 -226056 67748 -225185 -192245 -44361 -125352 91932 -17848 -219870 -30904
$$ packed form
10050c05562C6072a11058B33328C5031e1106k66140h7240l72481a81156I4316
10039a38993A40437k0581h5132B17877C6779C625Q7976a37669A8581J16979B4300
10027c7214j24555I6293a63634L7855K1947G4393a52334B63710i9247B74860b40953
10015c5793A8377a41034B61775b6892o1689B3136c8908q0930j83941J05946C7976
10003A3048c08909i7383n2151B76497a7872l76761G6076J65040m6717a93722j39104
9992c32826I4946b11765A37714J03789M4366i4888k06482J28983D5991R4610d1086
9980B1363b85610f6186E05514D884K4370M5874K11828b75222C8643K08306c14587
9968A37819b672k23384F7748b25185L2940d4361q0991I1932a7848k02022c0904
$$ plain form
9956 159421 -225469 -200253 -121864 -126956 47923 38183 -150210 -10886 -22662 -96569 276354
9944 -64148 100492 -167141 -439547 -20345 -56969 4481 16196 127 -69456 -49173 -139326 318091
9931 52683 -353801 36173 -81977 -427251 5303 -109571 70000 -129466 -36090 -113529 -145795
9920 -145795 -152853 47167 -243731 -185897 -144116 -56343 266472 38362 38199 -119116 -72397 -181845
9908 -181845 -41148 -52861 93508 130931 -332321 -221474 -165219 -31035 -118018 96467 -156514
9896 24404 -241963 -52353 94527 -194190 -184592 -356101 -357460 156047 -74510 -85467 -186116
9885 -186116 -476498 15397 -192728 239936 -380080 6149 -80820 -116814 -400235 -13481 -226870
9874 -226870 73276 -197698 -35909 274812 114266 -257218 181922 -22673 -30134 -233103 234240
$$ packed form
9956A59421b25469K5216P8389n092D7923r740a50210a0886j1776p3907B76354
9944f4148A00492a67141k72406b0345l6624D481J1715A27f9456K0283r0153C18091
9931E2683c53801C6173h1977l45274E303a09571G0000a29466c6090p7439l2266
9920a45795p058D7167b43731N7834M1781e6343B66472C8362j63a19116M6719j09448
9908a81845d1148j1713I3508L7423c32321J10847N6255c1035q6983I6467a56514
9896B4404b41963e2353I4527a94190R598j71509j359A56047g4510j0957j00649
9885a86116k90382A5397a92728B39936c80080F149h0820l5994k83421a3481k13389
9874b26870G3276a97698c5909B74812A14266b57218A81922b2673p461k02969B34240
$$ plain form
9862 -79624 128647 -51048 -22091 -224592 -217859 -93475 -79040 -73082 -45323 -222495 -90380 -112749
9850 -112749 169995 218232 28495 -151172 51471 -82528 -295258 15015 -20108 -109323 -197364
9839 -197364 135306 -271088 -217643 -149011 -228475 -281817 -48939 -167854 -207252 -307425 -74034
9827 -60535 -390037 -126164 111081 252013 -55982 -118244 4638 -22142 -82456 -28739 -181835
9816 -181835 -136243 80546 -46496 -82271 -317948 -32917 -214687 43251 -376130 -19425 -388638
9805 -388638 -229640 85801 -16331 -19872 -364543 -95977 -208267 -195358 -103153 184673 177917
9794 177917 -69299 -88926 240351 -132122 56898 2885 -107816 172985 -31074 80461 -288172
9782 49297 86063 -6824 -83405 -202690 -88878 -105035 -37734 11998 10536 -210592 -39817 -6181
$$ packed form
9862g9624A28647e1048b2091k02501O733i3475J4435N958K7759j77172i0380k2369
9850a12749A69995M8237B8495a51172E1471h2528k12730A5015b0108q9215q8041
9839a97364A35306b71088N3445O8632p9464n3342d8939j18915l9398j00173g4034
9827f0535l29502a26164A11081J40932e5982o2262D638b2142o0314b8739j53096
9816a81835M5592H0546d6496l5775k35677c2917j81770D3251c76130a9425l69213
9805c88638J58998H5801a6331l541l44671i5977j12290J2909R2205A84673o756
9794A77917f9299j9627B40351a32122E6898B885a07816A72985c1074H0461b88172
9782D9297L6766f824p6581j19285h8878j6157c7734A1998j462b10592c9817f181
$$ plain form
9769 45045 -45380 -157924 155039 -113124 -49279 101331 -427731 -104689 71465 -112165
9758 -8959 -147717 107419 -11688 -78146 67983 -223063 197063 -210206 190511 -17189 -67022
9747 -67022 -235451 -67801 105954 -289792 -59698 59884 -293909 66926 232644 38564 97624
9736 97624 -31178 -174186 -112006 -346258 26718 -148998 167048 14374 55809 66329 -275275
9724 -103065 -163857 -88202 60162 -8497 -131543 -314513 -146247 201436 97991 -397752 -168791
9712 79878 -149788 -239126 -4785 -42319 -12955 -82555 -340192 -137647 -127790 -45240 -133668 -80018
9700 -80018 -65964 -171437 -85954 235803 -172945 148723 27101 -284510 -216530 -282924 -173217
9689 -173217 -89318 -32246 -53289 -86431 63039 -161975 45323 306237 -47721 -91553 -254207
$$ packed form
9769D5045d5380j12544A55039a13124d9279A01331d27731a04689G1465a12165
9758h959j38758A07419a1688o6458F7983b23063A97063b10206A90511a7189m9833
9747f7022j68429f7801A05954b89792e9698E9884b93909F6926J65718C8564N9060
9736I7624c1178j43008O2180k34252B6718a48998A67048A4374M1435J0520b75275
9724a03065o0792P5655F0162h497j23046j82970a46247B01436I7991c97752a68791
9712G9878a49788q9338d785l7534a2955o9600k57637a37647R857d5240q8428N3650
9700h0018J4054j05473Q5483B35803a72945A48723B7101b84510O7980o6394J09707
9689a73217Q3899c2246k1043l3142F3039a61975D5323K60914d7721m3832j62654
$$ plain form
9678 -254207 -125303 -119689 59481 151970 98887 -235428 -59033 -50853 225114 -252882 -189340
9667 -189340 423 -57601 215187 -26678 -297348 -212638 -135524 130432 -45873 -43876 -117896 -170451
9655 -170451 -271165 -191489 -131162 -130961 57359 -320462 66892 96999 -17083 -342954 206712
9643 -32101 -197095 -91808 -35026 -118063 -23120 -170112 25433 -140382 216608 -39065 -73799
9632 -73799 -89269 -269073 -2607 -372025 -34234 131885 -197972 -128857 67730 161584 -147271
9620 -134082 -299360 117355 10746 97212 -407011 -96290 309829 -100467 -113523 201760
9609 79091 198393 268748 2094 -31737 -63363 88200 -76815 38747 -106002 227205 -285230
9597 -77096 26065 -246558 -102667 166912 22420 42226 -217402 -329492 -304412 -30821 -99320
$$ packed form
9678b54207a25303N614E9481R2489n3083b35428e9033Q180B25114b52882O3542
9667a89340D23e7601B15187b6678k70670Q4710P7114A30432d5873J997p4020n2555
9655a70451j00714P9676O0327K01E7359c20462F6892L0107a7083l25871B06712
9643c2101j64994i1808c5026q3037b3120j46992B5433a40382B16608c9065l4734
9632g3799j5470j79804b607l69418c4234A31885a97972O9115F7730R3854a47271
9620a34082j65278A17355A0746Q6466d07011i6290C09829a00467j3056B01760
9609G9091J19302P0355B094c1737l1626H8200g6815C8747a06002B27205b85230
9597g7096B6065b46558a02667A66912B2420J9806b17402j12090K5080c0821o8499
$$ plain form
9586 -99320 -180156 -54651 -356249 -27788 -289932 61421 -340949 -252765 -29124 74003 144044
9575 144044 -156779 -35223 263203 132678 48549 91450 52681 -159050 -89519 192872 162737
9564 162737 -179004 -372506 113075 334174 -180863 -354116 26409 148209 33261 -43286
9553 -325156 -79828 -43684 187234 51861 12384 -106861 42999 -325940 -128958 170102 -65299
9541 -218704 32708 -58008 -227980 -226713 120864 -125327 -104618 -93017 -47858 -402511 -109131
9529 90339 -161651 -48448 -201447 -74723 195278 -368876 -265834 4435 75637 -173517 45609
9517 100701 -177749 188237 -235010 39502 -132886 -88326 -290067 51154 -257001 -16188
9506 -6354 -5706 32669 -77219 79857 -235061 76376 41748 180638 -18436 -35339 53402 325272
$$ packed form
9586i9320q0836e4651l01598b7788k62144F1421c40949Q8184b9124G4003P0041
9575A44044a56779c5223B63203j30525D8549M2901l8769a59050O9531A92872l0135
9564A62737a79004j93502A13075K21099a80863j73253B6409J21800C3261d3286
9553c25156g9828L6144A87234E1861A2384a06861D2999c25940a28958A70102f5299
9541b18704C2708e8008j69972J267A20864a25327K0709J1601M5159l54653a09131
9529I0339a61651d8448j52999g4723A95278c68876J03042D435P1202a73517D5609
9517A00701a77749A88237b35010C9502a32886M4560k01741E1154b57001a6188
9506f354O48C2669g7219G9857b35061G6376l4628J38890a8436j6903E3402K71870
$$ plain form
9494 325272 -211229 -74006 88721 -284008 12136 -64240 57967 178652 -244671 2888 137421
9483 137421 -94707 219833 -166929 95246 33967 -3623 29630 -344405 -42902 -232062 -85879
9471 26609 -85634 -422565 -151474 -107126 -221933 90224 -50690 -61975 -83374 266585 -10236
9459 131203 -164327 -257024 -90214 111830 -364221 24431 -40533 -164171 -105958 54866 26779
9447 158517 -166006 17487 196525 -117561 -160740 -103515 57571 20645 3442 -6519 84632
9435 -139146 -145226 -41680 52423 109181 -110957 -89102 -375446 206904 -134622 -78625 185137
9423 -155960 -463459 149204 40399 -21344 -47453 -280881 -170901 -194190 -128154 -80851 -324167
9412 -324167 -256282 -203802 -100410 349987 68750 -68999 -309885 -144227 -175731 -68817 -56961
$$ packed form
9494C25272b11229g4006H8721b84008A2136f4240E7967J20685b44671B888J34533
9483A37421i4707B19833a66929I5246C3967c623B9630c44405d2902j89160h5879
9471B6609h5634l36931a51474M4348j14807I0224e0690j1285k1399B66585a0236
9459A31203a64327r2697i0214A11830c64221B4431d0533j23638N8213E4866B6779
9447A58517a66006A7487J79038a17561m3179N7225E7571B0645C442f519H4632
9435a39146o080d1680E2423N6758a10957K1855k86344B06904a34622N5997A85137
9423a55960l07499A49204D0399b1344k6109k33428J09980k3289O6036M7303k43316
9412c24167O7885N2480a00410C49987F8750f8999k40886a44227l1504f8817J1856
$$ plain form
9401 -56961 27103 -205142 -37578 46638 -15861 -128259 -196785 48659 248409 -165243 -46158
9389 -140879 228494 215430 -140641 77882 -51317 -140145 -229897 -343746 -92128 -182442 102474
9377 325665 44990 136366 35271 -205658 -278570 -34351 -307765 -156302 -60056 -111393 -194267
9366 -194267 117359 -167118 78693 28280 787 28797 116246 -72523 -265841 98702 -136852
9354 -152982 5069 -113789 -5791 -389195 228279 105760 140520 -226552 -74427 -210251 -321293
9343 -321293 -188317 -116723 -250428 -126534 -182848 -183097 -118218 -22737 55946 -204166 -293556
9332 -293556 34937 -97715 -301253 -51057 -124621 -277750 -14576 -13442 347540 19409 -56458
9320 -155496 -385944 15415 -24807 366529 407572 -66901 -70989 -124085 36600 -183540 -123676
$$ packed form
9401e6961B7103b05142c7578D6638a5861j12398o8526D8659J99750a65243d6158
9389a40879B28494j3064a40641G7882e1317q8828q9752j13849i2128r0314A02474
9377C25665D4990R1376C5271b05658p2912c4351k73414J51463f0056n1337q2874
9366a94267A17359a67118G8693B8280G87K8010Q7449g2523j93318I8702a36852
9354a52982E069a13789e791l83404B28279A05760L4760b26552g4427j35824j11042
9343c21293J32976P1594j33705J23894n6314k49O4879b2737E5946b04166q9390
9332b93556C4937i7715k03538e1057p3564j53129a4576J134C47540A9409e6458
9320a55496k30448A5415b4807C66529M1043f6901m088n3096C6600a83540N9864
$$ plain form
9309 -123676 -24973 -365467 -206131 -537729 -134228 -218994 54232 -162276 127042 -51154
9298 -166092 -49442 -224801 64656 -63499 -91332 -140937 11087 186032 42230 -13325 -157773
9287 -157773 -351353 -127835 -263238 -212360 -20423 -140870 -78460 -241422 -96514 -293724
9277 -293724 -229038 201627 -84707 40530 -38830 -255161 40984 29317 58100 -423869 261718
9265 16024 -372209 -110781 136408 152179 -79508 200653 237978 24425 -153076 -140780 128497
9253 38229 -61818 -399947 4366 206717 -107135 -172325 -167327 -114784 -166174 -24411 232725
9241 65575 6215 -253325 -54185 -83561 30858 -277208 -49540 35848 -29813 203152 -148039
9229 -395279 -168127 -66617 92012 176331 -14614 329154 -23005 94878 -80620 32621 -99702
$$ packed form
9309a23676b4973l40494J59336l31598a34228q4766E4232a62276A27042e1154
9298a66092d9442j75359F4656f3499k7833m9605A1087J74945D2230a3325j44448
9287a57773j93580a27835j35403N0878b0423j20447O2410j62962i6514j97210
9277b93724O4686B01627h4707D0530c8830k16331D0984j1667K8783d23869B61718
9265A6024c72209a10781A36408J5771g9508B00653L7325B4425a53076J2296A28497
9253C8229f1818l38129D366K02351a07135o5190M998N2543n1390b4411B32725
9241F5575F215b53325e4185k9376C0858b77208d9540C5848b9813B03152a48039
9229c95279a68127f6617I2012Q4319a4614C29154b3005I4878h0620C2621i9702
$$ plain form
9217 142734 122296 -28837 -144650 193094 192064 -35007 -95711 28672 84387 91769 -258052
9205 -108321 -69942 -306886 -140416 -122603 -222717 163052 -738 -21196 -519496 -101000 -73991
9194 -73991 -247967 -176762 16286 2146 -61552 -192292 231373 -2463 -151340 -159602 -338348
9183 -338348 -64514 -528616 137310 -38978 -85990 -157251 -30477 169676 481759 38123 140253
9172 140253 -437568 1287 136801 13954 -302978 126192 -266802 -21769 30952 -265021 325789
9160 428446 -2587 -343172 -446222 -173050 129788 -53659 -89251 -80590 344912 -4440 81103
9148 -268938 -209224 170251 126179 11145 93252 41884 143651 -20276 -20083 -347041 361403
9136 68014 92999 31753 138825 -179552 -96075 -240014 33749 -235434 -276227 -24024 -20217
$$ packed form
9217A42734k0438b8837j15813A93094j030c5007o0704B8672N5715P382b58052
9205a08321L8379k36944a40416J7813j00114A63052g38k0458m98300a01000K7009
9194g3991j73976P1205A6286B146f1552j30740B31373b463j48877q262j78746
9183c38348f4514m64102A37310c8978m7012p1261c0477A69676L12083C8123J02130
9172A40253d37568A287J35514A3954c02978A26192b66802b1769C0952b65021C25789
9160D28446b587l40585j03050a73050A29788e3659l5592Q661C44912d440H1103
9148b68938N9714A70251m4072A1145Q2107D1884J01767b0276J93l26958C61403
9136F8014K4985C1753J07072a79552Q3477j43939C3749b35434m0793b4024L807
$$ plain form
9125 -20217 -61037 -37693 392876 65985 316363 -214283 -158629 2289 97925 -137052 -278177
9114 -278177 -29987 32349 -7452 -97554 71206 -159808 -200219 -199199 -297683 85535 -246160 -424317
9102 -424317 330 -32194 24659 -11910 -45559 -127930 -46235 333548 28710 -164889 35357 -16241
9089 -27862 -128954 48160 -129668 62217 -328005 -238187 -255682 -158004 -60121 20444 -334933
9077 -317862 -40479 298814 -26362 -253199 -269724 -6025 -1455 30476 160196 47706 -102963
9065 -213338 53001 -175341 125266 -458999 -60263 -57579 -98787 69126 -36746 80064 6841
9053 72209 -89371 -95563 145805 -98927 71429 -143518 86135 31890 -135020 16687 -125314
9041 -71448 -37782 -145564 135709 47691 -142925 -120204 -173609 42123 216434 -148627 52550
$$ packed form
9125b0217m0820K3344C92876F5985K50378b14283N5654B289R5636a37052j41125
9114b78177b9987C2349g452r0102G1206a59808m0411J020r8484H5535b46160j78157
9102d24317C30c2194B4659a1910l3649q2371d6235C33548B8710a64889C5357a6241
9089b7862j01092D8160a29668F2217c28005Q9818j7495R7678f0121B0444c34933
9077c17862d0479B98814b6362k26837j6525f025a455C0476J29720D7706a02963
9065b13338E3001a75341A25266d58999f0263K684m1208F9126c6746H0064F841
9053G2209h9371o192A45805i8927G1429a43518H6135C1890a35020A6687a25314
9041g1448L3666j07782A35709D7691a42925K2721n3405D2123J74311a48627E2550
$$ plain form
9029 82818 99237 -102576 -64954 116869 -93975 -91459 -124321 -239222 -197622 29823 -170961
9017 -279584 26370 -367185 -124234 -358544 219017 128737 131697 274550 -193956 47105 -411029
9005 -312242 157391 -47020 -300175 -243923 -55535 32395 -61325 97534 -67080 -139222 -131451
8994 -131451 19392 -20307 -286457 -238886 140136 -34287 -300994 -143548 -33862 -302823 -182326
8983 -182326 2562 -116151 94931 -16703 -429879 29793 46308 -179477 -82272 26677 -314597
8971 -197763 19946 49094 -350180 -122181 67666 -19453 -171598 -213463 -337560 -142109 -133992
8960 -133992 270839 145694 136024 -256212 -135087 235184 21122 -71774 30445 215797 -240919
8948 -265532 66155 -149157 -274122 15654 167572 418841 120617 -6546 2283 -198766 -285007
$$ packed form
9029H2818J6419a02576L7622A16869i3975K516l2862j14901M1600B9823a70961
9017b79584B6370c67185a24234k34310B19017r0280K960J42853a93956D7105d11029
9005c12242A57391d7020k53155N6252e5535C2395f1325I7534f7080p2142P771
8994a31451A9392b0307k66150M7571A40136c4287k66707a43548c3862k68961J20497
8983a82326B562a16151I4931a6703m13176B9793J6515a79477h2272B6677c14597
8971a97763A9946K9148c50180a22181F7666a9453j52145m1865j24097a42109Q117
8960a33992B70839j25145r670b56212J21125B35184B1122g1774C0445J85352b40919
8948b65532F6155a49157j24965A5654J51918K51269A20617f546B283a98766q6241
$$ plain form
8937 -285007 -47423 82397 223640 398901 -239499 33937 37244 20449 -276045 -210039 -109748
8926 -109748 -78437 469472 399179 1611919 4993671 11360116 4570318 1864567 904942
8916 786710 520915 -12580 44415 -9336 -247796 166085 -7424 313841 318763 -20097 31753
8904 -6343 154876 191549 61144 210575 343524 -196406 -195792 -110271 24711 -37347 186153
8892 45308 138886 -130859 -299607 7648 21584 -93531 86182 86429 265872 10306 -419465 -147865
8879 170886 -149079 -70294 -120247 287698 353868 -262778 -163429 49223 -481129 -378306 77315
8867 256834 24134 -293012 -88198 -106397 13672 153957 -251966 218241 -371867 146765
$$ packed form
8937b85007d7423H2397J41243J75261b39499C3937L307j6795b76045O6006J00291
8926a09748L1311D69472p0293J212740L381752O366445D570318A864567I04942
8916G86710k65795a2580D4415i336k38460A66085g424C13841M922b0097C1753
8904f343A54876L6673F1144J49431J32949a96406O14Q5521B4711c7347A86153
8892D5308R3578a30859j68748G648J3936i3531H6182K47J79443A0306d19465a47865
8879A70886a49079g0294m9953B87698O6170b62778R9349D9223d81129J02823G7315
8867B56834B4134b93012h8198j8199A3672J40285b51966B18241c71867A46765
$$ [...]
##END NTUPLES=NMR SPECTRUM
##END=
