##TITLE=AC1710_ROEFFECT0030_8638173_unTmHUejkH
##JCAMPDX= 6.0         $$ Bruker NMR JCAMP-DX V2.0
##DATA TYPE= NMR SPECTRUM
##DATA CLASS= NTUPLES
##ORIGIN= BRUKER
##OWNER= Administrator
$$ 1.72 TOPSPIN		Version 2.1
$$ 2014-05-22 20:46:24.296 -0700  Administrator@X
$$ Compression mode = diff/dup
##.OBSERVE FREQUENCY= 400.02188249412
##.OBSERVE NUCLEUS= ^1H
##.ACQUISITION MODE= SIMULTANEOUS (DQD)
##.ACQUISITION SCHEME= undefined
##.AVERAGES= 64
##.DIGITISER RES= 22
##SPECTROMETER/DATA SYSTEM= spect
##.PULSE SEQUENCE= noesygpps1d.comp
##.SOLVENT NAME= COFFEE_meoh
##.SHIFT REFERENCE= INTERNAL, COFFEE_meoh, 1, 14.96124
##AUDIT TRAIL= $$ (NUMBER, WHEN, WHO, WHERE, PROCESS, VERSION, WHAT)
$$ ##TITLE= Audit trail, TOPSPIN		Version 2.1
$$ ##JCAMPDX= 5.01
$$ ##ORIGIN= Bruker BioSpin GmbH
$$ ##OWNER= Administrator
$$ $$ E:\/data/COFFEE/nmr/AC1710_ROEFFECT0030_8638173_unTmHUejkH/12/pdata/1/auditp.txt
$$ ##AUDIT TRAIL=  $$ (NUMBER, WHEN, WHO, WHERE, PROCESS, VERSION, WHAT)
(   1,<2014-05-22 20:46:19.592 -0700>,<Administrator>,<X>,<go>,<TOPSPIN 2.1>,
      <created by zg
	started at 2014-05-22 20:34:50.264 -0700,
	POWCHK enabled, PULCHK disabled,
       configuration hash MD5:
       C8 4E 4E 5D D3 5C D8 9E 9F 52 82 E0 59 8A DE 15
       data hash MD5: 64K
       78 3C 65 79 21 00 81 02 5F A2 94 46 AE 0F 27 F2>)
(   2,<2014-05-22 20:46:22.483 -0700>,<Administrator>,<X>,<proc1d>,<TOPSPIN 2.1>,
      <Start of raw data processing
       efp LB = 0.3 FT_mod = 6 PKNL = 1 PHC0 = 0 PHC1 = 0 SI = 128K 
       data hash MD5: 128K
       D6 A4 83 3A DD D6 31 E4 2F 9A A6 04 41 7A 31 22>)
(   3,<2014-05-22 20:46:23.358 -0700>,<Administrator>,<X>,<proc1d>,<TOPSPIN 2.1>,
      <pk PHC0 = -85.79224 PHC1 = 0 
       data hash MD5: 128K
       76 8F 69 61 F0 3C B2 60 50 EA 56 52 2E 72 E7 DB>)
(   4,<2014-05-22 20:46:23.686 -0700>,<Administrator>,<X>,<proc1d>,<TOPSPIN 2.1>,
      <abs ABSG = 1 
       data hash MD5: 128K
       78 D3 D6 89 5F B9 72 51 CA A0 12 2F 30 F8 25 A4>)
(   5,<2014-05-22 20:46:23.796 -0700>,<Administrator>,<X>,<proc1d>,<TOPSPIN 2.1>,
      <abs ABSG = 2 
       data hash MD5: 128K
       2C F0 4E 4B 09 1F 63 22 37 5B D9 F5 EE 0E 07 A2>)
(   6,<2014-05-22 20:46:23.905 -0700>,<Administrator>,<X>,<proc1d>,<TOPSPIN 2.1>,
      <abs ABSG = 3 
       data hash MD5: 128K
       4F 23 FA 00 B9 AC 74 F5 23 F4 65 3B E5 09 E8 FE>)
(   7,<2014-05-22 20:46:23.999 -0700>,<Administrator>,<X>,<proc1d>,<TOPSPIN 2.1>,
      <abs ABSG = 4 
       data hash MD5: 128K
       56 1A C0 A1 EC 7D D0 C0 21 C4 CC 0E 2C 9D 51 1B>)
(   8,<2014-05-22 20:46:24.077 -0700>,<Administrator>,<X>,<proc1d>,<TOPSPIN 2.1>,
      <abs ABSG = 5 
       data hash MD5: 128K
       D5 C0 01 67 2C FF 41 82 18 2A F9 BE 71 98 AD C1>)
$$ ##END=
$$ 
$$ $$ hash MD5
$$ $$ 69 20 5C 00 9E EA 02 66 74 28 CD 1D 10 E1 55 63
##$RELAX= 
##$RELAX= 
##$RELAX= 
##$RELAX= 
##$RELAX= 
##$RELAX= 
##$RELAX= 
##$RELAX= 
$$ Bruker specific parameters
$$ --------------------------
##$DU= <E:\>
##$EXPNO= 12
$$ [...]
##$TP07= 0
##$TPNAME0= <>
##$TPNAME1= <>
##$TPNAME2= <>
##$TPNAME3= <>
##$TPNAME4= <>
##$TPNAME5= <>
##$TPNAME6= <>
##$TPNAME7= <>
##$TPOAL= (0..7)
0.5 0.5 0.5 0.5 0.5 0.5 0.5 0.5
##$TPOFFS= (0..7)
0 0 0 0 0 0 0 0
##$TUNHIN= 0
##$TUNHOUT= 0
##$TUNXOUT= 0
##$USERA1= <user>
##$USERA2= <user>
##$USERA3= <user>
##$USERA4= <user>
##$USERA5= <user>
##$V9= 5
##$VALIST= <valist>
##$VCLIST= <CCCCCCCCCCCCCCC>
##$VD= 0
##$VDLIST= <DDDDDDDDDDDDDDD>
##$VPLIST= <PPPPPPPPPPPPPPP>
##$VTLIST= <TTTTTTTTTTTTTTT>
##$WBST= 2048
##$WBSW= 25
##$XGAIN= (0..3)
0 0 0 0
##$XL= 0
##$YL= 0
##$YMAX_a= 6005503
##$YMIN_a= -12811021
##$ZGOPTNS= <>
##$ZL1= 120
##$ZL2= 120
##$ZL3= 120
##$ZL4= 120
##$ABSF1= 14.96124
##$ABSF2= -5.596942
##$ABSG= 5
##$ABSL= 3
##$ALPHA= 0
##$AQORDER= 0
##$ASSFAC= 0
##$ASSFACI= 0
##$ASSFACX= 0
##$ASSWID= 0
##$AUNMP= <proc_prof1d_extract.lims>
##$AXLEFT= 0
##$AXNAME= <>
##$AXNUC= <1H>
##$AXRIGHT= 0
##$AXTYPE= 0
##$AXUNIT= <>
##$AZFE= 0.1
##$AZFW= 0.1
##$BCFW= 0
##$BC_mod= 0
##$BYTORDP= 0
##$COROFFS= 0
##$CY= 15
##$DATMOD= 1
##$DC= 0
##$DFILT= <>
##$DTYPP= 0
##$F1P= 0
##$F2P= 0
##$FCOR= 0.5
##$FTSIZE= 131072
##$FT_mod= 6
##$GAMMA= 0
##$GB= 0
##$INTBC= 1
##$INTSCL= 1
##$ISEN= 128
##$LB= 0.3
##$LEV0= 0
##$LPBIN= 0
##$MAXI= 10000
##$MC2= 0
##$MEAN= 0
##$ME_mod= 0
##$MI= 0
##$NCOEF= 0
##$NC_proc= -2
##$NLEV= 6
##$NOISF1= 0
##$NOISF2= 0
##$NSP= 0
##$NTH_PI= 0
##$NZP= 0
##$OFFSET= 14.96124
##$PC= 1
##$PHC0= -85.79224
##$PHC1= 0
##$PH_mod= 1
##$PKNL= yes
##$PPARMOD= 0
##$PPDIAG= 0
##$PPIPTYP= 0
##$PPMPNUM= 2147483647
##$PPRESOL= 1
##$PSCAL= 4
##$PSIGN= 0
##$PYNMP= <proc.py>
##$REVERSE= no
##$SF= 400.020009542621
##$SI= 131072
##$SIGF1= 0
##$SIGF2= 0
##$SINO= 400
##$SIOLD= 131072
##$SPECTYP= <>
##$SREGLST= <1H.CDCl3>
##$SSB= 0
##$STSI= 131072
##$STSR= 0
##$SW_p= 8223.68421052631
##$SYMM= 0
##$S_DEV= 0
##$TDeff= 65536
##$TDoff= 0
##$TI= <>
##$TILT= no
##$TM1= 0
##$TM2= 0
##$TOPLEV= 0
##$USERP1= <user>
##$USERP2= <user>
##$USERP3= <user>
##$USERP4= <user>
##$USERP5= <user>
##$WDW= 1
##$XDIM= 131072
##$YMAX_p= 353410372
##$YMIN_p= -13122
##$CURPLOT= <Network HP LaserJet P1505>
##$CURPRIN= <$Network HP LaserJet P1505>
##$DFORMAT= <normdp>
##$LAYOUT= <+/1D_H.xwp>
##$LFORMAT= <normlp>
##$PFORMAT= <normpl>
##$SURQMSG= 1
$$ End of Bruker specific parameters
$$ ---------------------------------
##NTUPLES= NMR SPECTRUM
##VAR_NAME=  FREQUENCY,     SPECTRUM/REAL,   SPECTRUM/IMAG
##SYMBOL=    X,             R,               I
##VAR_TYPE=  INDEPENDENT,   DEPENDENT,       DEPENDENT
##VAR_FORM=  AFFN,          ASDF,            ASDF
##VAR_DIM=   131072,        131072,          131072
##UNITS=     HZ,            ARBITRARY UNITS, ARBITRARY UNITS
##FACTOR=    0.0627417313425164, 1,          1
##FIRST=     8223.62146879497, -1201,        -64778
##LAST=      0,             674,             -65642
##MIN=       0,             -13122,          0
##MAX=       8223.62146879497, 353410372,    0
$$ Real data points
##PAGE= N=1
##DATA TABLE= (X++(R..R)), XYDATA
$$ [...]
61644D69130K501J990J494O82n01j333j153k56N47R79J244J271P75l9n89o89n92
61627D75461l45J24L59l40j849l247m037m520m841m620l876l338l322l178k472
61612D35959j903k239l088l550l586l857m582n379n962o253o094n474m851m569
61598C74572m268l564k905l001l622l836l346k690k191j546o08J67L45K9m34q13
61582C42289r86r65r81j085q64n0P09M80o39j590j760j498j152n74J28L08j67
61565C31603m21K26J193J532J356J528K279K981L146K900K473J944J538J583J928
61550C57789J956J327L94l53p28o70l6R84J698J601J095R50J222J219O52K23P23
61533C70046J940K938L223L115K982K629J648J05j360k109k052j705j644j883
$$ y = [469130, 471631, 473621, 475115, 475797, 475296, 473963, 472810, 472554, 473101, 474080, 475324, 476595, 477370, 477331, 476742, 476053, 475461, 475116, 475240, 475599, 475259, 473410, 470163, 466126, 461606, 456765, 452145, 448269, 444931, 441609, 438431, 435959, 434056, 431817, 428729, 425179, 421593, 417736, 413154, 407775, 401813, 395560, 389466, 383992, 379141, 374572, 370304, 366740, 363835, 360834, 357212, 353376, 350030, 347340, 345149, 343603, 342995, 343162, 343507, 343536, 343102, 342289, 341303, 340338, 339357, 338272, 337408, 337358, 338067, 338547, 337908, 336318, 334558, 333060, 331908, 331334, 331462, 331770, 331603, 331182, 331408, 332601, 334133, 335489, 337017, 339296, 342277, 345423, 348323, 350796, 352740, 354278, 355861, 357789, 359745, 361072, 361466, 361113, 360385, 359715, 359679, 360663, 362361, 363962, 365057, 366007, 367229, 368448, 369100, 369323, 370046, 371986, 374924, 378147, 381262, 384244, 386873, 388521, 388626, 387266, 385157, 383105, 381400, 379756, 377873]
61519C77873j930j579j325j661k210k162j431p52n55m96k47l3J3K82R58J455J239
61502C67439P75Q98J551J933J701J343J320J547J733J821J949K271K789L135K726
61487C94931J483J57m04j21N54J277J817J837J358J050J404K005K268K453L010
61472D15079L435K905J734R99P92K56o37q86l19j74j114k099k096j678j806k126
61456D12265j723q78o17r81r61j41Q01J152Q84K87l19m31L36J621K519K561K092
61439D18467J722J764K203K709K846K529K190K107J889J114J59k63k06m25j196
61424D37609j942k128j899j602j205m92N15J542K220K229J582Q41O44R63J090
61409D39967N37l75r27p99l04jj74o40j033j303j715k248k325j497k26N15L58
$$ y = [377873, 375943, 374364, 373039, 371378, 369168, 367006, 365575, 364823, 364268, 363772, 363525, 363492, 363505, 363787, 364745, 366200, 367439, 368214, 369112, 370663, 372596, 374297, 375640, 376960, 378507, 380240, 382061, 384010, 386281, 389070, 392205, 394931, 396414, 396571, 396167, 396046, 396600, 397877, 399694, 401531, 402889, 403939, 405343, 407348, 409616, 412069, 415079, 418514, 421419, 423153, 424152, 424944, 425200, 424563, 423677, 423358, 423184, 422070, 419971, 417875, 416197, 414391, 412265, 410542, 409664, 409047, 408066, 407105, 406964, 407765, 408917, 409801, 410088, 409769, 409338, 409674, 411295, 413814, 416375, 418467, 420189, 421953, 424156, 426865, 429711, 432240, 434430, 436537, 438426, 439540, 439699, 439436, 439230, 438805, 437609, 435667, 433539, 431640, 430038, 428833, 428341, 428856, 430398, 432618, 434847, 436429, 437270, 437914, 438877, 439967, 440504, 440129, 439202, 438403, 438099, 438098, 437924, 437284, 436251, 434948, 433233, 430985, 428660, 427163, 426937, 427452, 427810]
61392D27810j26k34J41O62J061J281J421J620J903K118K141K080K093K080J829
61377D47880J407J194J550K581M004N115N184M280L410L383L782L619K767K004
61363D92160J812J873J861J903K085K145K010J959K084K151K330L283N030O422
61349E29108O387N268M236L797L584L359L306L366L079K236J204M11k2j16J7n6
61333E69164q69k351l687m156l810l229k894k966l284l353k673j391k96J03J87
61318E34495N57J121J455J793K955N081P163Q115P969P700Q193R582J1289J2457
61304F19925J2646J2305J2264J2493J1906R819P070M961L457J424j474m168n763
61291F96865o655p580q328q300p716p400p536p522p021o403o028n690n020m027
$$ y = [427810, 427684, 427450, 427591, 428253, 429314, 430595, 432016, 433636, 435539, 437657, 439798, 441878, 443971, 446051, 447880, 449287, 450481, 452031, 454612, 458616, 463731, 468915, 473195, 476605, 479988, 483770, 487389, 490156, 492160, 493972, 495845, 497706, 499609, 501694, 503839, 505849, 507808, 509892, 512043, 514373, 517656, 522686, 529108, 535495, 540763, 544999, 548796, 552380, 555739, 559045, 562411, 565490, 567726, 568930, 569341, 569319, 569203, 569220, 569164, 568295, 565944, 562257, 558101, 554291, 551062, 548168, 545202, 541918, 538565, 535892, 534501, 534205, 534308, 534495, 535052, 536173, 537628, 539421, 542376, 547457, 554620, 562735, 570704, 578404, 586597, 596179, 607468, 619925, 632571, 644876, 657140, 669633, 681539, 691358, 698428, 703389, 706846, 708270, 706796, 702628, 696865, 690210, 682630, 674302, 666002, 658286, 650886, 643350, 635828, 628807, 622404, 616376, 610686, 605666, 601639]
61277F01639k989k101j394p68oJ038K223L214L824M086M036L752L510L629M066
61262F27759M530M970N597O328O712O646O725P420Q159P771N879L382J379l2j546
61247G01679l416m941n341m747l976l525l297l216l495m049m219l599k760k540
61233F48558k874k869k029p72K97J054J601J951K298L073M352N498N848N580N442
61218F77008N702N825N244M150L338L387M132M876N028M542L738K894K141J705
61204G33710J917K777L727M185M339N073O955R448J1400J2255J2517J2886J3365
61191H34554J3528J3385J3300J3066J1764Q996N692L057J119r67l322n062n684
61178I03426n918o682p849q673r056r661j0888j2257j2974j2742j1989j1529j1938
$$ y = [601639, 598650, 596549, 595155, 594387, 594381, 595419, 597642, 600856, 604680, 608766, 612802, 616554, 620064, 623693, 627759, 632289, 637259, 642856, 649184, 655896, 662542, 669267, 676687, 684846, 692617, 698496, 701878, 703257, 703225, 701679, 698263, 693322, 687981, 683234, 679258, 675733, 672436, 669220, 665725, 661676, 657457, 653858, 651098, 648558, 645684, 642815, 640786, 640014, 640311, 641365, 642966, 644917, 647215, 650288, 654640, 660138, 665986, 671566, 677008, 682710, 688535, 693779, 697929, 701267, 704654, 708786, 713662, 718690, 723232, 726970, 729864, 732005, 733710, 735627, 738404, 742131, 746316, 750655, 755728, 762683, 772131, 783531, 795786, 808303, 821189, 834554, 848082, 861467, 874767, 887833, 899597, 908593, 914285, 917342, 918461, 917494, 914172, 909110, 903426, 897508, 890826, 882977, 874304, 865248, 855587, 844699, 832442, 819468, 806726, 794737, 783208, 771270]
61165G71270j3038j3971j4066j3521j2963j2512j1724j0476r296q594q066p231
61153F35812o164n178m077k377j89J742K941L527L558K739J163l64j323k267l830
61138F25713n367n528m109k393j491j224q85k23P88K396M618O820Q428R695J1223
61123F48461J3058J4740J5965J6716J7090J7466J8473K0208K1801K2415K2256
61112H48649K1996K1633K0813J9930J9728J9866J9029J6686J3751J1205R043O914
61100A049243M855K827K90l081o778j0106j2962j5526j7677j9235k0327k1070
61088I30453k1282k0963k0491j9905j8566j6191j3691j2220j1713j1084r689p819
61076G46839o004m471l229k088p05R25K235K917L613N006O612P421P573Q243R801
$$ y = [771270, 758232, 744261, 730195, 716674, 703711, 691199, 679475, 668999, 659703, 651109, 643043, 635812, 629648, 624470, 620393, 618016, 617827, 619569, 622510, 626037, 629595, 632334, 633497, 633133, 631810, 629543, 625713, 620346, 614818, 610709, 608316, 606825, 605601, 604716, 604493, 605281, 607677, 612295, 619115, 627543, 637238, 648461, 661519, 676259, 692224, 708940, 726030, 743496, 761969, 782177, 803978, 826393, 848649, 870645, 892278, 913091, 933021, 952749, 972615, 991644, 1008330, 1022081, 1033286, 1042329, 1049243, 1054098, 1056925, 1057215, 1054134, 1047356, 1037250, 1024288, 1008762, 991085, 971850, 951523, 930453, 909171, 888208, 867717, 847812, 829246, 813055, 799364, 787144, 775431, 764347, 754658, 746839, 740835, 736364, 733135, 731047, 730342, 731267, 733502, 736419, 740032, 745038, 751650, 759071, 766644, 774887, 784688]
61061G84688J1309J2195J3181J4882J6536J7165J7206J7836J9173K0382K1300
61050I65853K2659K4549K5962K6387K6772K8189L0311L2109L3335L4362L4974
61039A285462L4602L3614L3160L3420L3178L1663K9811K8957K9064K9113K8599
61028A630643K7700K6529K5286K4725K5285K5995K5580K4571K4870K7061K9661
61017A917906L1590L3779L7440M2167M7194N3503O3057P6531R3306J13386J37495
61006B647354J65245J94956K26238K61510L04028L55131M14184M80523N54251
60997E603420O35290P22835Q16270R15859J021759J133130J249845J374712J508688
60988A4981808J636346J713482J676822J479710J129027O90549K57219r1413l09409
$$ y = [784688, 795997, 808192, 821373, 836255, 852791, 869956, 887162, 904998, 924171, 944553, 965853, 988512, 1013061, 1039023, 1065410, 1092182, 1120371, 1150682, 1182791, 1216126, 1250488, 1285462, 1320064, 1353678, 1386838, 1420258, 1453436, 1485099, 1514910, 1543867, 1572931, 1602044, 1630643, 1658343, 1684872, 1710158, 1734883, 1760168, 1786163, 1811743, 1836314, 1861184, 1888245, 1917906, 1949496, 1983275, 2020715, 2062882, 2110076, 2163579, 2226636, 2303167, 2396473, 2509859, 2647354, 2812599, 3007555, 3233793, 3495303, 3799331, 4154462, 4568646, 5049169, 5603420, 6238710, 6961545, 7777815, 8693674, 9715433, 10848563, 12098408, 13473120, 14981808, 16618154, 18331636, 20008458, 21488168, 22617195, 23307744, 23564963, 23473550, 23164141]
60979B3164141l84686l39276k34720j63682k14007m23080p58116j137624j474135
60970A8034815j706807j811055j793178j680518j509878j315312j120444r38773
60962F158850p77843o41280n28488m35908l60047k98771k50116k11555j81119
60953B473723j57892j40665j27101j15012j03739r3453q3886p4636o6234n9683
60943A451422n5064n1380m7886m4868m2963m2254m2156m1824m0577l8289l5401
60932I68760l2415k9422k6359k3485k1168j9301j7438j5552j4081j3125j2111
60921G44303j0570q862p680p086o514n678n024n073n664o067n757m826l668k535
60907F59299j530q05n27o65j022j467k004k614l206l764m377n000n410n498n488
$$ y = [23164141, 22779455, 22440179, 22205459, 22041777, 21827770, 21404690, 20646574, 19508950, 18034815, 16328008, 14516953, 12723775, 11043257, 9533379, 8218067, 7097623, 6158850, 5381007, 4739727, 4211239, 3775331, 3415284, 3116513, 2866397, 2654842, 2473723, 2315831, 2175166, 2048065, 1933053, 1829314, 1735861, 1651975, 1577339, 1511105, 1451422, 1396358, 1344978, 1297092, 1252224, 1209261, 1167007, 1124851, 1083027, 1042450, 1004161, 968760, 936345, 906923, 880564, 857079, 835911, 816610, 799172, 783620, 769539, 756414, 744303, 733733, 724871, 717191, 710105, 703591, 697913, 692889, 687816, 682152, 676085, 670328, 665502, 661834, 659299, 657769, 656964, 656437, 655772, 654750, 653283, 651279, 648665, 645459, 641695, 637318, 632318, 626908, 621410, 615922]
60892F15922n734o336p056p517p426o735n722m881m598m836n204n326n093m694
60878E34764m404m341m405m437m443m577m900n178n035m290l193k262j775j404
60864D80120n46Q54K083K485K368K640L585M511M690M276L996M216M683M997M995
60849E29953M710M200L525K742J944J257P56L79O4k3K76N82O8j624l789n373o086
60832E33561o394o563o318n573m916m966n500n701n162m226l380k674k006j651
60818D68531k063l153m148m393m072l867m086m438m596m495m095l283k336k012
60804D17494k688l651l745k731j560j239j753k321k306j657p07J17M98M48L13
60789C94512M62R48J587K177K525K408J802J068O40N16L57J17J83P57J481J932
$$ y = [615922, 610188, 603852, 596796, 589279, 581853, 575118, 569396, 564515, 559917, 555081, 549877, 544551, 539458, 534764, 530360, 526019, 521614, 517177, 512734, 508157, 503257, 498079, 493044, 488754, 485561, 483299, 481524, 480120, 479574, 480428, 482511, 484996, 487364, 490004, 493589, 498100, 502790, 507066, 511062, 515278, 519961, 524958, 529953, 534663, 538863, 542388, 545130, 547074, 548331, 549087, 549466, 549530, 549507, 549783, 550365, 550433, 548809, 545020, 539647, 533561, 527167, 520604, 514286, 508713, 503797, 498831, 493331, 487630, 482468, 478242, 474862, 472188, 470182, 468531, 466468, 463315, 459167, 454774, 450702, 446835, 442749, 438311, 433715, 429220, 425125, 421842, 419506, 417494, 414806, 411155, 407410, 404679, 403119, 401880, 400127, 397806, 395500, 393843, 393136, 393253, 393751, 394199, 394512, 394974, 395922, 397509, 399686, 402211, 404619, 406421, 407489, 408129, 408645, 409002, 409119, 409302, 410059, 411540, 413472]
60773D13472K139K247J989J039j73o80j20P95J179Q64J75o51j376j556r67j10
60757D18266K93J50p7k17m96q76q88l71J63J55l85j099j691j826j142J92J247
60740D11398J167N7j355k683l959m926m990m091l016k530k514k328j760j160p97
60725C76513n03n9L84M93K01k35m95l48L17J374K320K525J839Q40L60P66J769
60708C88061K741L158K896K345K045K034J756Q67p0j85N33J202J191P54L31j21
60692D09538p56j302j369j019o11k98j12k22o48r06n37J95N96N19M53O77Q85P74
60674D05857M78L02L88P61J311J643J349O12M2j95n44j167j557j467j581k585
60658D03647l970m518l822k613j664j041m76J85J050K137L016L058K252J411J256
$$ y = [413472, 415611, 417858, 419847, 420886, 420713, 420033, 419913, 420708, 421887, 422751, 422926, 422275, 420899, 419343, 418376, 418266, 418559, 418709, 418632, 418415, 417919, 417043, 416155, 415784, 415947, 416102, 415717, 414618, 412927, 411101, 409959, 410151, 411398, 412565, 412622, 411267, 408584, 404625, 399699, 394709, 390618, 387602, 385072, 382558, 380230, 378470, 377310, 376513, 376010, 375951, 376335, 376828, 377029, 376794, 376299, 375951, 376268, 377642, 379962, 382487, 384326, 385166, 385526, 386292, 388061, 390802, 393960, 396856, 399201, 401246, 403280, 405036, 405903, 405833, 405648, 406181, 407383, 408574, 409328, 409659, 409538, 408782, 407480, 406111, 405092, 404481, 404183, 404071, 403849, 403201, 402295, 401758, 401953, 402549, 403068, 403521, 404198, 405083, 405857, 406335, 406637, 407025, 407786, 409097, 410740, 412089, 412701, 412743, 412548, 412004, 410837, 409280, 407813, 406232, 403647, 399677, 395159, 391337, 388724, 387060, 386019, 385543, 385728, 386778, 388915, 391931, 394989, 397241, 398652, 399908]
60643C99908J684K102K112J561L80j183k459k901k574j886j120n58o05j240j661
60628C91560j195l26j48p70j140n28N44J206J300J103O56km37l09Qm3l18k73J05
60609C90993L93N99J107J745J737R16J23M8L27L50L28P83J440J498R23N30P24
60592D04564R40O90M69J066K375L556M160M486M762M655L821K538J388N62p3m18
60576D39541j34P07J507J848K010K549L612M967O385P604Q171P826P072O799P307
60561E07771Q048Q465Q598Q687Q639Q227P422O211M340J749r60k983m142m814
60547E65258n096m521k788l68J909L555M634N517O605Q072R676J0982J1918J2923
60533F28276J4379J6112J7686J8946J9899K0256J9538J7611J4725J1051O626J839
$$ y = [399908, 401592, 403694, 405806, 407367, 407747, 406564, 404105, 401204, 398630, 396744, 395624, 395066, 394461, 393221, 391560, 390365, 390039, 389891, 389121, 387981, 387453, 387997, 389203, 390503, 391606, 392262, 392260, 391823, 391514, 391522, 391479, 391161, 390888, 390993, 391386, 391985, 393092, 394837, 396574, 397490, 397613, 397661, 397988, 398338, 398666, 399449, 400889, 402387, 403310, 403840, 404564, 405504, 406194, 406663, 407729, 410104, 413660, 417820, 422306, 427068, 431723, 435544, 438082, 439470, 440032, 439959, 439541, 439407, 440114, 441621, 443469, 445479, 448028, 451640, 456607, 462992, 470596, 478767, 486593, 493665, 500464, 507771, 515819, 524284, 532882, 541569, 550208, 558435, 565857, 572068, 576408, 578157, 577197, 574214, 570072, 565258, 560162, 555641, 552853, 552485, 554394, 557949, 562583, 568100, 574705, 582777, 592453, 603435, 615353, 628276, 642655, 658767, 676453, 695399, 715298, 735554, 755092, 772703, 787428, 798479, 805105, 806944]
60521H06944k530o073r089j1818j3764j4295j3702j2911j2297j1405r954q368
60509F80738o938n200k642L48K909M772O359P969R617J1665J4773J8908K2907
60496G66185K5629K7229K8864L1348L4486L7599M0177M1875M2326M1367L9241
60485A156326L6314L2590K7805K2080J6150J0775N979J110m421j0676j7392k4306
60473A252334l1199l7813m3827m8831n2355n4099n4151n2665m9570m4959l9801
60462G43064l5461l2268k9172k5336k1399j8496j6587j4695j2514j0715r638q708
60450E08075p454o229n494n080m619m134l716l125k236j470j235j326j380j562
60436D59015k111k527j928l23J157J458O15n25j257j436j309j162j112j115j147
$$ y = [806944, 804414, 798341, 789252, 777434, 763670, 749375, 735673, 722762, 710465, 699060, 689106, 680738, 673800, 668600, 665958, 666306, 669215, 673987, 680346, 688315, 697932, 709597, 724370, 743278, 766185, 791814, 819043, 847907, 879255, 913741, 951340, 991517, 1033392, 1075718, 1117085, 1156326, 1192640, 1225230, 1253035, 1275115, 1291265, 1302040, 1308019, 1309129, 1304708, 1294032, 1276640, 1252334, 1221135, 1183322, 1139495, 1090664, 1038309, 984210, 930059, 877394, 827824, 782865, 743064, 707603, 675335, 646163, 620827, 599428, 580932, 564345, 549650, 537136, 526421, 516783, 508075, 500621, 494392, 488898, 483818, 479199, 475065, 471349, 468224, 465988, 464518, 463283, 461957, 460577, 459015, 456904, 454377, 452449, 452126, 453283, 454741, 455356, 454831, 453574, 452138, 450829, 449667, 448555, 447440, 446293]
60421D46293j294j526j519r03K16J201J461J008M14K35N48J073J562J926J991
60406D52686J527P49L92R32J888K436K488K609K944L039K826K944L701M425M385
60391D89971L786L282K994K698K481K503K424J892J412J827L009L898L987L934
60377E30098M365M808M367L044J771J318J607K096K460K690K713K271J365O33
60363E65606Q47J897K717K517J762J493J941K425K465K387K697L398M163M769
60349F01084N103M989M395L699L478L960M731N022M345K863J118n50k138l588
60335F38511m629n167n478n823o128o304o505o711o531n767m911m559m607m571
60321E60820m338m026l407k296j213q12o85L07K398M520N796O515P316Q238R120
$$ y = [446293, 444999, 443473, 441954, 441051, 441267, 442468, 443929, 444937, 445351, 445586, 446134, 447207, 448769, 450695, 452686, 454213, 454962, 455354, 456286, 458174, 460610, 463098, 465707, 468651, 471690, 474516, 477460, 481161, 485586, 489971, 493757, 497039, 500033, 502731, 505212, 507715, 510139, 512031, 513443, 515270, 518279, 522177, 526164, 530098, 534463, 539271, 543638, 546682, 548453, 549771, 551378, 553474, 555934, 558624, 561337, 563608, 564973, 565606, 566453, 568350, 571067, 573584, 575346, 576839, 578780, 581205, 583670, 586057, 588754, 592152, 596315, 601084, 606187, 611176, 615571, 619270, 622748, 626708, 631439, 636461, 640806, 643669, 644787, 644237, 642099, 638511, 633882, 628715, 623237, 617414, 611286, 604982, 598477, 591766, 585235, 579468, 574557, 569998, 565391, 560820, 556482, 552456, 549049, 546753, 545540, 544728, 544043, 544350, 546748, 551268, 557064, 563579, 570895, 579133, 588253]
60306E88253J0189J1599J2869J3486J3644J3806J3909J3628J3149J2947J2823
60295G30302J1800R105M911L2m753r057j2805j5916j8053j8792j8148j6720j5116
60282F26790j3418j1440r359p730o931o780o733o329n504m646m296m644n281n561
60268E28138n164m359l744l632l638l047j755o49n78j154j200l51M82M78Rq4K71
60251E00023N14M61M39N69N91M18L49N21O21L28j93n09m61k72j77q7K87J060J987
60232E06469K689K999K982K819K785L195M114N125N684N713N579N549N616N832
60218E67150O343O961P169O842O565O947P850Q589Q719Q432Q293Q713R498R906
60204F77977R425Q413P574O921N883M479L536L489L728L603L262K922K104M70
$$ y = [588253, 598442, 610041, 622910, 636396, 650040, 663846, 677755, 691383, 704532, 717479, 730302, 742102, 751207, 756118, 756150, 751397, 742340, 729535, 713619, 695566, 676774, 658626, 641906, 626790, 613372, 601932, 592573, 584843, 577912, 571132, 564399, 558070, 552566, 547920, 543624, 538980, 533699, 528138, 522974, 518615, 514871, 511239, 507601, 504554, 502799, 502150, 501572, 500418, 499218, 498867, 499349, 499827, 499836, 499752, 500023, 500537, 500998, 501437, 502006, 502597, 503015, 503364, 503885, 504506, 504834, 504641, 504132, 503671, 503399, 503222, 503135, 503422, 504482, 506469, 509158, 512157, 515139, 517958, 520743, 523938, 528052, 533177, 538861, 544574, 550153, 555702, 561318, 567150, 573493, 580454, 587623, 594465, 601030, 607977, 615827, 624416, 633135, 641567, 649860, 658573, 668071, 677977, 687402, 695815, 703389, 710310, 716193, 720672, 724208, 727697, 731425, 735028, 738290, 741212, 743316, 743786]
60190G43786j162j755j616k008l370m961o167p093p721p524o386n075m339m083
60176F80526l899l756l770l706l274k574j897j316q50p02r64j373j679k014k436
60161F46316k444j550k60J63p92k084k245j082J94N53L65P35J935L070L336L024
60145F49234K955L277L387K904K197J896K206K843L417L754L999M465N221N871
60131F97626N959N572N284N444N780N759N162M176L134K269J693J453J584K023
60117G52918K538K890L133L504L861L654K735J833J714K090K000J087j80j468
60103G82309k903m294m941m670m358m751n361n176m075k797j786r31k87k16p09
60088G35054j240j543j931k573l055l052k905l054l241k957k386k251k723l172
$$ y = [743786, 742624, 740869, 739253, 737245, 733875, 728914, 722747, 715654, 707933, 700409, 694023, 688948, 684609, 680526, 676627, 672871, 669101, 665395, 662121, 659547, 657650, 656334, 655484, 654782, 653818, 652445, 650766, 648752, 646316, 643872, 642322, 642062, 642225, 641433, 639349, 637104, 636022, 636216, 636769, 637134, 637869, 639804, 642874, 646210, 649234, 652189, 655466, 658853, 661757, 663954, 665850, 668056, 670899, 674316, 678070, 682069, 686534, 691755, 697626, 703585, 709157, 714441, 719885, 725665, 731424, 736586, 740762, 743896, 746165, 747858, 749311, 750895, 752918, 755456, 758346, 761479, 764983, 768844, 772498, 775233, 777066, 778780, 780870, 782870, 783957, 783777, 782309, 779406, 775112, 770171, 765501, 761143, 756392, 751031, 745855, 741780, 738983, 737197, 736266, 735979, 735763, 735054, 733814, 732271, 730340, 727767, 724712, 721660, 718755, 715701, 712460, 709503, 707117, 704866, 702143, 698971]
60074F98971l226l469m649o507p977q452q357q379q488q055o854n578n168n699
60060F08113o198n713m385l171k616k316j723r99o76p48o04J38J167J958K389
60045E84616K810L623M839N891O059N265M296L941M097M158M011L937L635K330
60031F43508Q6j874k681k962l771n032n815n831n756o118o711p118p287p381p525
60016E67732p715p734p185o020m889m505m670m459l410k071j281j300j802k285
60002E08406k373j951j218n09j6K37L26N43J311K622L789M170M017M060M474M791
59986E32679M761M559M171L356K325J707J585J274L72o27j223j693k406k940k661
59971E45239j830j366j629k128k362k365k276j951j232l05N05J127J754K465K999
$$ y = [698971, 695745, 692276, 687627, 681120, 673143, 664691, 656334, 647955, 639467, 631412, 624558, 618980, 613812, 608113, 601915, 596202, 591817, 588646, 586030, 583714, 581991, 580992, 580316, 579568, 578964, 579102, 580269, 582227, 584616, 587426, 591049, 595888, 601779, 607838, 613103, 617399, 621340, 625437, 629595, 633606, 637543, 641178, 643508, 643594, 641720, 639039, 636077, 632306, 627274, 621459, 615628, 609872, 603754, 597043, 589925, 582638, 575257, 567732, 560017, 552283, 545098, 539078, 534189, 529684, 525014, 520555, 517145, 515074, 513793, 512493, 510691, 508406, 506033, 504082, 502864, 502355, 502339, 502576, 502902, 503445, 504756, 507378, 511167, 515337, 519354, 523414, 527888, 532679, 537440, 541999, 546170, 549526, 551851, 553558, 555143, 556417, 556789, 556162, 554939, 553246, 550840, 547900, 545239, 543409, 542043, 540414, 538286, 535924, 533559, 531283, 529332, 528100, 527795, 528300, 529427, 531181, 533646, 536645]
59956E36645L017K604K343K650L077K672J187m55j179r41n61n81p51o24k10J07
59940E49000N4l25q51j393j873k128j902j091L2J008J674K308L182M150M850N221
59924E61916N549O008O401O451O203N945N750N365M647L906L515L298K706J696
59910F29356R68J077J679K039J990J888J868J705J343R74N86l8p33r26l82M80
59894F43874J195J707K068K207K325K966M260N478N883N755O003O911P840Q180
59880G06652Q045P928Q016Q107P924P341O392N266M223L358K479J300j75j635
59866G75221k842l948n206o481p327p548p341o838n954m951m576n134n805n552
59852F95718m461l498l049k537j495k36Q22J800K960M122M928N377N834O748Q278
$$ y = [536645, 539662, 542266, 544609, 547259, 550336, 553008, 554195, 553740, 552561, 551620, 551059, 550478, 549727, 549103, 548893, 549000, 549054, 548729, 547878, 546485, 544612, 542484, 540582, 539491, 539523, 540531, 542205, 544513, 547695, 551845, 556695, 561916, 567465, 573473, 579874, 586325, 592528, 598473, 604223, 609588, 614235, 618141, 621656, 624954, 627660, 629356, 630324, 631401, 633080, 635119, 637109, 638997, 640865, 642570, 643913, 644887, 645473, 645435, 644702, 643776, 643394, 643874, 645069, 646776, 648844, 651051, 653376, 656342, 660602, 666080, 671963, 677718, 683721, 690632, 698472, 706652, 714697, 722625, 730641, 738748, 746672, 754013, 760405, 765671, 769894, 773252, 775731, 777031, 776856, 775221, 772379, 768431, 763225, 756744, 749417, 741869, 734528, 727690, 721736, 716785, 712209, 707075, 701270, 695718, 691257, 687759, 684710, 682173, 680678, 680442, 681264, 683064, 686024, 690146, 695074, 700451, 706285, 713033, 721311]
59837G21311R927J0537R301O802M495L108K236J591J659K725M075M732M295K641
59823G89435m07m322p503q669q259p731p785q074q257q390q387p948p112o297
59809F90294n717n260m899m744m737m650m417m058l506k786k204j981j976k018
59795F37341k189k381k167j536j231j625j925j285k35P7l71n90k66j21n53j057
59779F19886j142q59k42P89J789J997J513J352J968K719L090L512M322M901M535
59764F50130L563K932L064L761M715N624O230O700P562Q785R512R196Q459Q221
59750G38454Q440Q430P990P479P048O534O007N682N378M645L479K439J930J771
59736H15706J486Q15l2n40m34j78n39j462j919j268k95k37j166k009k047j624
$$ y = [721311, 731238, 741775, 751076, 757878, 762373, 765481, 767717, 769308, 770967, 773692, 777767, 782499, 786794, 789435, 789028, 784706, 777203, 768534, 760275, 752544, 744759, 736685, 728428, 720038, 711651, 703703, 696591, 690294, 684577, 679317, 674418, 669674, 664937, 660287, 655870, 651812, 648306, 645520, 643316, 641335, 639359, 637341, 635152, 632771, 630604, 629068, 627837, 626212, 624287, 623002, 622767, 622844, 622473, 621883, 621617, 621496, 620943, 619886, 618744, 617885, 617643, 618432, 620221, 622218, 623731, 625083, 627051, 629770, 632860, 636372, 640694, 645595, 650130, 653693, 656625, 659689, 663450, 668165, 673789, 680019, 686719, 694281, 703066, 712578, 721774, 730233, 738454, 746894, 755324, 763314, 770793, 777841, 784375, 790382, 796064, 801442, 806087, 809566, 812005, 813935, 815706, 817192, 818007, 817975, 817435, 817001, 816823, 816284, 814822, 812903, 811635, 811340, 811103, 809937, 807928, 805881, 804257]
59720H04257j366j424j673k101k655l047k959k369j565q91m37J10J119K368L092
59705G90459L000K854L534M806N677N796N726N861N903N658N585O028O526O427
59691H63840N812N215M723L900K559R98n09j985l466m782n795o547p063p228p032
59676H42640o724o581o653o894p306p790q004p630o724n562m243k730j221j12
59662G64466N00R75J675K577L544M556N483N955N825N494N392N252M434K881J229
59647H20238o6j216k563m043n427o799q426j0261j1763j2291j1691j0644j0193
59634G24855j0667j1206j0766r428q136p275o291m941l965m034m718n187n439
59621F32802o026o904p421p298o883o360n452m121k965k581k850l135k920k059
$$ y = [804257, 802891, 801467, 799794, 797693, 795038, 791991, 789032, 786663, 785098, 784207, 783770, 783880, 784999, 787367, 790459, 793459, 796313, 799847, 804653, 810330, 816126, 821852, 827713, 833616, 839274, 844859, 850887, 857413, 863840, 869652, 874867, 879590, 883490, 886049, 887047, 886538, 884553, 881087, 876305, 870510, 863963, 856900, 849672, 842640, 835916, 829335, 822682, 815788, 808482, 800692, 792688, 785058, 778334, 772772, 768529, 765799, 764578, 764466, 764966, 765941, 767616, 770193, 773737, 778293, 783776, 789731, 795556, 801050, 806442, 811694, 816128, 819009, 820238, 820172, 818956, 816393, 812350, 806923, 800124, 791698, 781437, 769674, 757383, 745692, 735048, 724855, 714188, 702982, 692216, 682788, 674652, 667377, 661086, 656145, 652180, 648146, 643428, 638241, 632802, 626776, 619872, 612451, 605153, 598270, 591910, 586458, 582337, 579372, 576791, 573941, 570806, 567886, 565827]
59607E65827p12O83J580J720J433J354J813K448K535J761O20j16k82l61o21o18
59591E79064J22J308K167K358K104J670J079L73l58j126j918k426k394k145k362
59576E77516l170l922m020l546k949k466k130k058k376k905l154k689j618p03
59562E39810p51j634k168j445m5O12R2o01m72L27J142J834K600L246L397L211
59546E49155L289L947M963N949O628O904P073P745R114J0536J1320J1796J2906
59533F51325J4784J6330J6340J4436J0819N958R06k784m287m340m248m295l807
59520G07137k634j695j798k605l263l664m457n924p445q263q402q493q840r030
59506F30624q562p583o730o325o045n420m398l318k473j962j779j783j578p38
$$ y = [565827, 565115, 565798, 567378, 569098, 570531, 571885, 573698, 576146, 578681, 580442, 581062, 580946, 580664, 580303, 579682, 579064, 579186, 580494, 582661, 585019, 587123, 588793, 589872, 590245, 589887, 588761, 586843, 584417, 582023, 579878, 577516, 574346, 570424, 566404, 562858, 559909, 557443, 555313, 553255, 550879, 547974, 544820, 542131, 540513, 539810, 539059, 537425, 535257, 533812, 533767, 534379, 534471, 533870, 533398, 533725, 534867, 536701, 539301, 542547, 545944, 549155, 552444, 556391, 561354, 567303, 573931, 580835, 587908, 595653, 604767, 615303, 626623, 638419, 651325, 666109, 682439, 698779, 713215, 724034, 729992, 730898, 728114, 723827, 719487, 715239, 710944, 707137, 704503, 702808, 701010, 698405, 695142, 691478, 687021, 681097, 673652, 665389, 656987, 648494, 639654, 630624, 622062, 614479, 607749, 601424, 595379, 589959, 585561, 582243, 579770, 577808, 576029, 574246, 572668, 571930]
59492E71930P30K276L277L469L033K374J952K054K597L198L497L420L096K751
59478F09654K628K822L105L148K954K834K954L174L415L750L931L373J991O81
59464F50414L89R70J556J803K089K621L097L366L738M364M952N344N775O311O527
59449G03316O136N437M727L813K529J248L75l12j260k486l840n456p211q170p496
59434F91350n714m212l500k891j942j119o74O5J575L103L619L430L943N947Q813
59419G01793J1382J3048J3867J4214J4565J5241J6060J6409J5954J5186J4980
59408H62699J5573J6043J4916J1368N872j71n324q648r770q850o521l548l32L088
59394H86395O350Q266P355L101l225r230j3010j4323j4161j3346j1843r505o895
$$ y = [571930, 572660, 574936, 578213, 581682, 584715, 587089, 589041, 591095, 593692, 596890, 600387, 603807, 606903, 609654, 612282, 615104, 618209, 621357, 624311, 627145, 630099, 633273, 636688, 640438, 644369, 647742, 649733, 650414, 650803, 651773, 653329, 655132, 657221, 659842, 662939, 666305, 670043, 674407, 679359, 684703, 690478, 696789, 703316, 709452, 714889, 719616, 723429, 725958, 727206, 727581, 727269, 726009, 723523, 719683, 714227, 707016, 698846, 691350, 685636, 681424, 677924, 675033, 673091, 671972, 671298, 671363, 672938, 676041, 679660, 683090, 687033, 692980, 701793, 713175, 726223, 740090, 754304, 768869, 784110, 800170, 816579, 832533, 847719, 862699, 878272, 894315, 909231, 920599, 926471, 926300, 920976, 912328, 902558, 893708, 887187, 883639, 883307, 886395, 892745, 901011, 908366, 911467, 908242, 899012, 886002, 871679, 857518, 844172, 832329, 822824, 815929]
59381H15929m882l655k743j927j498j508j436q58k8N76Q22P90M40j77p65j095
59365G97985j189r29j5J314K179K283K612M107O138P379P886Q963J0988J2758
59351H62459J3430J3811J4908J6294J6954J6970J7110J7255J6546J4983J3623
59340A034343J2930J2008R998P324M943K913N25k489n562q128j0263j2324j4300
59327A031918j5766j6396j6346j6136j6166j6423j6628j6572j6146j5225j3818
59316H56296j2340j1400j1160j1124j0776j0194r831r810r768r381q787q337q069
59303G25319p560o349m466k450q32L03J199K026K845L818N112O561P816Q897J0216
59288G52455J1630J1918R725N123k16m467p025q328q744q073o084l135M7L050
$$ y = [815929, 811047, 807392, 804649, 802722, 801224, 799716, 798280, 797422, 797394, 797970, 798792, 799582, 800022, 799845, 799080, 797985, 796796, 795867, 795852, 797166, 799345, 801628, 804240, 808347, 814485, 821864, 829750, 838713, 849701, 862459, 875889, 889700, 904608, 920902, 937856, 954826, 971936, 989191, 1005737, 1020720, 1034343, 1047273, 1059281, 1069279, 1076603, 1081546, 1084459, 1084984, 1082495, 1076933, 1068805, 1058542, 1046218, 1031918, 1016152, 999756, 983410, 967274, 951108, 934685, 918057, 901485, 885339, 870114, 856296, 843956, 832556, 821396, 810272, 799496, 789302, 779471, 769661, 759893, 750512, 741725, 733388, 725319, 717759, 711410, 706944, 704494, 703662, 703965, 705164, 707190, 710035, 713853, 718965, 725526, 733342, 742239, 752455, 764085, 776003, 785728, 790851, 790635, 786168, 779143, 770815, 762071, 753998, 747914, 744779, 744826, 747876]
59274G47876N882Q470J0393J1413J1849J2108J2111J1566J0667R877R091P661
59262H68964N350K681J50k242m379n652n757n326n212n533n929o265o402n823
59248H18625m227k296j020m40J67J094K031K895L863M607M498L770L537M279N194
59233H46577N254M180K154n26l157m844n484n859o409o826p130q113r938j1451
59219G88428j1684j1183j0870j0484r340p868p026o691n991m893m118l685k899
59206F91696j755r73n81J67J283J805J452J213J826K827L691M701N943O637O369
59191G26301N985O290O777O738O795P950R609J0066Q782O926N596M696L817L074
59177H19402K550J796M54j143k473l428m061m200l764l126k771k714k690k635
$$ y = [747876, 753758, 762228, 772621, 784034, 795883, 807991, 820102, 831668, 842335, 852212, 861303, 868964, 874314, 876995, 877145, 874903, 870524, 864872, 859115, 853789, 848577, 843044, 837115, 830850, 824448, 818625, 814398, 812102, 811082, 810642, 810809, 811903, 813934, 816829, 820692, 825299, 829797, 833567, 837104, 841383, 846577, 851831, 856011, 858165, 857639, 854482, 849638, 844154, 838295, 831886, 825060, 817930, 809817, 799879, 788428, 776744, 765561, 754691, 744207, 734867, 726999, 719973, 713282, 707291, 702398, 698280, 694595, 691696, 689941, 688968, 688387, 688554, 689837, 691642, 693094, 694307, 696133, 698960, 702651, 707352, 713295, 719932, 726301, 732286, 738576, 745353, 752091, 758886, 766836, 776445, 786511, 795293, 802219, 807815, 812511, 816328, 819402, 821952, 823748, 824202, 823059, 820586, 817158, 813097, 808897, 805133, 802007, 799236, 796522, 793832, 791197]
59163G91197k657k683k571k509k968m102n474o497p034p398p877q393q679q652
59149G13703q513q513q666q791q716q377p761o898n939n140m718m676m829m968
59135F17198m933m507l432j723M1J088J234J087J263J771K390L364N023O936Q098
59120F34898Q170P899Q119Q898R896J0907J1630J1558J0724J0081J0405J1149
59108G54334J1117J0028Q571P182N685M217L362L113K607J386J67k41j74n12j393
59093H09449k290k989l610l910l427k389j699j789k168k300k322k599l124l783
59079G71050m778o243p653q199p677o794o459o960p772q035p304o005n026m790
59065F77355m925m922m790m840n121n430n636n616n079l935k719k138k250k527
$$ y = [791197, 788540, 785857, 783286, 780777, 777809, 773707, 768233, 761736, 754702, 747304, 739427, 731034, 722355, 713703, 705190, 696677, 688011, 679220, 670504, 662127, 654366, 647468, 641529, 636389, 631671, 626995, 622166, 617198, 612265, 607758, 604326, 602603, 602644, 603732, 604966, 606053, 607316, 609087, 611477, 614841, 619864, 626800, 634898, 643068, 650967, 659086, 667984, 677880, 688787, 700417, 711975, 722699, 732780, 743185, 754334, 765451, 775479, 784050, 791232, 796917, 801134, 804496, 807609, 810216, 811602, 811769, 811528, 811354, 810842, 809449, 807159, 804170, 800560, 796650, 793223, 790834, 789135, 787346, 785178, 782878, 780556, 777957, 774833, 771050, 766272, 760029, 752376, 744177, 736500, 729706, 723247, 716287, 708515, 700480, 693176, 687171, 682145, 677355, 672430, 667508, 662718, 657878, 652757, 647327, 641691, 636075, 630996, 627061, 624342, 622204, 619954, 617427]
59051F17427k648k635k349j550o16l80r53j387r66j56K83N05J086J801J908J481
59035F10851J475K400L738M860N764O580P119P319P588Q227Q974R580J0369J1641
59021G06485J2907J3363J2990J2478J2093J1226R267O451L565J146p73k350l615
59008G95233m446m669m263l455k538j534k21J363K656L115K960L045L804M534
58994G95584M087K211o2j475j726j465j417j806k504l351m218m937n258m785l117
58979G65761m05K361M063M593M920N813O973P726Q153R003J0550J2089J2611J1783
58965H65994J0187Q768Q093P911P497O438M971L412J565r27l895o755r188j1236
58951H92835j2735j3343j3289j3494j4470j5527j5552j4294j2479j0833r516q404
$$ y = [617427, 614779, 612144, 609795, 608245, 607629, 607249, 606296, 604909, 603943, 603787, 604070, 604575, 605661, 607462, 609370, 610851, 612326, 614726, 618464, 623324, 629088, 635668, 642787, 650106, 657694, 665921, 674895, 684475, 694844, 706485, 719392, 732755, 745745, 758223, 770316, 781542, 790809, 797260, 800825, 801971, 801198, 798848, 795233, 790787, 786118, 781855, 778400, 775862, 774328, 774107, 775470, 778126, 781241, 784201, 787246, 791050, 795584, 799671, 801882, 801820, 800345, 798619, 797154, 795737, 793931, 791427, 788076, 783858, 778921, 773663, 768878, 765761, 765356, 767717, 771780, 776373, 781293, 787106, 794079, 801805, 809958, 818961, 829511, 841600, 854211, 865994, 876181, 884949, 893042, 900953, 908450, 914888, 919859, 923271, 924836, 923909, 920014, 913259, 904071, 892835, 880100, 866757, 853468, 839974, 825504, 809977, 794425, 780131, 767652, 756819, 747303, 738899]
58939G38899p372o217m736l011j406k34L77L79q7m96l76K8r6j064k206k678k389
58922G07315j921j772j975k167j888j008r7P5l83l56Q49K490L341L282L180L557
58906G12522M237N153O515Q142R478J0545J1921J3592J4728J5063J5487J6606
58894H43989J7576J7281J6067J5273J5359J5555J5257J4809J4776J5178J5611
58883A016731J5611J4767J2982J0732Q586O436L733M90k448m363n454o467p882
58870A063454r579j0996j1621j1552j1498j1898j2202j1590j0241r300r399r971
58858I33607j0233j0222j0456j1048j1625j1824j1476j0626r598q870q572q325
58846H10732p811p272p220p889r064j0258j0906j0753j0177r832r788r439q476
$$ y = [738899, 731527, 725310, 720574, 717563, 716157, 715923, 716300, 716679, 716592, 716096, 715720, 715748, 715652, 714588, 712382, 709704, 707315, 705394, 703622, 701647, 699480, 697592, 696584, 696487, 696562, 696179, 695823, 696672, 699162, 702503, 705785, 708965, 712522, 716759, 721912, 728427, 736569, 746047, 756592, 768513, 782105, 796833, 811896, 827383, 843989, 861565, 878846, 894913, 910186, 925545, 941100, 956357, 971166, 985942, 1001120, 1016731, 1032342, 1047109, 1060091, 1070823, 1079409, 1085845, 1089578, 1090068, 1087620, 1083257, 1077803, 1071336, 1063454, 1053875, 1042879, 1031258, 1019706, 1008208, 996310, 984108, 972518, 962277, 952977, 943578, 933607, 923374, 913152, 902696, 891648, 880023, 868199, 856723, 846097, 836499, 827629, 819057, 810732, 802921, 795649, 788429, 780540, 771476, 761218, 750312, 739559, 729382, 719550, 709762, 700323, 691847]
58833F91847p494p126o982o061m116k068r25o50l39O23J861K521K384K152K516
58818F68143L250L619L460L277L284L098K504J950J815J756J249M34q3r7l0m46
58802F97183j597l237m592m870m129l411l576m295m616m252l678l210k626j792
58788F47302r40j26J000K548L950M574M537M504M810N241N578N910O200O004M991
58773G06083L579K533J991J280k03k325m580o633q187q859q701q427q493q308
58759F50750p049n078l642l139k719j716o01p8m8o3j05l13m01K6Q66J756K594
58742F31040L420M079M488M930N685O528P018O950O311N187M054L655M036M211
58728G01592L389K210J957K830L747L797L175K558K249K140K111K178K454L005
$$ y = [691847, 684353, 677227, 670245, 664184, 660068, 658000, 657075, 656425, 656086, 656709, 658570, 661091, 663475, 665627, 668143, 671393, 675012, 678472, 681749, 685033, 688131, 690635, 692585, 694400, 696156, 697405, 697839, 697756, 697659, 697629, 697183, 695586, 692349, 687757, 682887, 678758, 675347, 671771, 667476, 662860, 658608, 654930, 651720, 649094, 647302, 646362, 646236, 647236, 649784, 653734, 658308, 662845, 667349, 672159, 677400, 682978, 688888, 695088, 701092, 706083, 709662, 712195, 714186, 715466, 715263, 712938, 708358, 701725, 693538, 684679, 675978, 667551, 659058, 650750, 643701, 638623, 634981, 631842, 629123, 627407, 626806, 626728, 626680, 626617, 626512, 626199, 625798, 625824, 626690, 628446, 631040, 634460, 638539, 643027, 647957, 653642, 660170, 667188, 674138, 680449, 685636, 689690, 693345, 697381, 701592, 704981, 707191, 709148, 711978, 715725, 719522, 722697, 725255, 727504, 729644, 731755, 733933, 736387, 739392]
58714G39392L672M025L707K775J556L43p13j639k710m185n886p444q979j1018
58700G12896j3418j5126j5440j4933j4532j4261j3628j2735j2077j1566j0570
58689E64610q946p243n973n219m903m814m580m045l556l335k931j958j007q90
58675E05210j280j059J2R85J252J377K081L204M108M554M769N037N521O215O896
58660E48882P347P521P236N891L120m07l435n344o473p247p702p812p679p262
58646E26636o494n643n004m290l032j509n97n83q12o32k4P56J487J802J408O47
58630E04116K48L77N75O33P76R26O08k11q88r96p35k66N89J725K566K850K938
58613E15831L110L295L617M366N133M965L793K793K771L103K917K427K271K270
$$ y = [739392, 743064, 747089, 750796, 753571, 755127, 755470, 754757, 753118, 750408, 746223, 740337, 732893, 723914, 712896, 699478, 684352, 668912, 653979, 639447, 625186, 611558, 598823, 586746, 575180, 564610, 555664, 548421, 542448, 537229, 532326, 527512, 522932, 518887, 515331, 511996, 509065, 507107, 506100, 505210, 503930, 502871, 502883, 503868, 505120, 506497, 508578, 511782, 515890, 520444, 525213, 530250, 535771, 541986, 548882, 556229, 563750, 570986, 576877, 579997, 579590, 576155, 570811, 564338, 557091, 549389, 541577, 533898, 526636, 520142, 514499, 509495, 505205, 502173, 500664, 500067, 499484, 498672, 498040, 498016, 498772, 500259, 502061, 503469, 504116, 504364, 504741, 505316, 505949, 506725, 507651, 508259, 508048, 507160, 506164, 505429, 505163, 505752, 507477, 510043, 512893, 515831, 518941, 522236, 525853, 530219, 535352, 540317, 544110, 546903, 549674, 552777, 555694, 558121, 560392, 562662]
58599E62662J850J168Q84J074J214J053Q84J022J571K461L360L832M037M885O929
58584E98886R454J1241J1954J2186J2375J2287J1605J0508R515R023Q945Q801
58572G26780Q291P864Q353R923J1834J3370J4576J5820J7188J8666K0407K2327
58560H95399K3810K4290K3813K2636K0614J7411J3091Q186L359q10l995o392q368
58547A033044r806j0208r638q927q712q927r540j1049j3669j6676j9212k1187
58535H85493k2802k3709k3419k2180k0681j9162j7431j5487j3544j1600r606p809
58523F78063o464n372m268l378l134l462l824l788l230k225j150n69o61j036j365
58508F34137j731k029j665m53O97P80M0m35j84K52L34K12L53R32J643J971J828
$$ y = [562662, 564512, 565680, 566564, 567638, 568852, 569905, 570789, 571811, 573382, 575843, 579203, 583035, 587072, 591957, 598886, 608340, 619581, 631535, 643721, 656096, 668383, 679988, 690496, 700011, 709034, 717979, 726780, 735071, 742935, 751288, 761211, 773045, 786415, 800991, 816811, 833999, 852665, 873072, 895399, 919209, 943499, 967312, 989948, 1010562, 1027973, 1041064, 1049250, 1052609, 1051799, 1047804, 1041412, 1033044, 1023238, 1013030, 1003392, 994465, 985753, 976826, 967286, 956237, 942568, 925892, 906680, 885493, 862691, 838982, 815563, 793383, 772702, 753540, 736109, 720622, 707078, 695478, 685872, 678063, 671599, 666227, 661959, 658581, 655447, 651985, 648161, 644373, 641143, 638918, 637768, 637199, 636538, 635502, 634137, 632406, 630377, 628712, 628259, 628956, 629736, 629776, 629341, 629157, 629409, 629743, 629955, 630308, 631240, 632883, 634854, 636682]
58491F36682J941L146N116O521O784O935Q113R983J1441J2246J3025J4060J5057
58478G51050J5850J6478J6635J5879J4322J2447J0373P821M673J024l021p093
58466H56438j0347j2131j2547j1874r942o764l246m19J742L866N978P602Q768
58453H17124R879J0749J0741R799Q408O592L843P7m099q069j1424j3613j4204
58440H25803j3558j2528j1465j0119q358o297l912j366N85J397J761K787M351
58427G69081N396N801O583Q039R036Q676P550O638N864M462K125r16m365p742
58413H26228j0203j1146j0888j0329j0040r990r878r451q635p514o194m647k876
58400G14437j125L03J401K337L142L708L998M009L658L030K527K413K483K391
$$ y = [636682, 638623, 641769, 646885, 653406, 660190, 667125, 675238, 685221, 696662, 708908, 721933, 735993, 751050, 766900, 783378, 800013, 815892, 830214, 842661, 853034, 860855, 865528, 866552, 863531, 856438, 846091, 833960, 821413, 809539, 799597, 792833, 789587, 789168, 790910, 794776, 800754, 808356, 817124, 827003, 837752, 848493, 858292, 866700, 873292, 877135, 877212, 873113, 865044, 853620, 840007, 825803, 812245, 799717, 788252, 778133, 769775, 763478, 759566, 758200, 758785, 760182, 761943, 764730, 769081, 774477, 780278, 786861, 794900, 803936, 812612, 820162, 826800, 832664, 837126, 839251, 838335, 833970, 826228, 816025, 804879, 793991, 783662, 773622, 763632, 753754, 744303, 735668, 728154, 721960, 717313, 714437, 713312, 713615, 715016, 717353, 720495, 724203, 728201, 732210, 735868, 738898, 741425, 743838, 746321, 748712]
58386G48712K111J782J450J262J436J728J557J066J377L083N187O379O706P102
58372G90938P765Q162Q211Q340Q579Q624Q637R058R785J0504J1482J2965J4109
58359I17159J3760J2133J0578R703Q907P698O309M873L191J470K94k34m24p8J239
58344I96578L042M227M642N251O585Q178R620J0998J2029J2052J1289J0983J1785
58331A107259J2985J3719J3953J3821J2910J0947Q456O270M690L427K019K85j179
58318A209562j230N14K828M169M404M503M966N659O742Q455J0197J1141J1608
58305A283518J2514J3682J4140J3970J4311J5432J6281J6130J5326J4335J3454
58294A443093J3393J4696J6452J7124J6713J6608J7304J7954J8271J9025K0422
$$ y = [748712, 750823, 752605, 754055, 755317, 756753, 758481, 760038, 761104, 762481, 765564, 770751, 777130, 783836, 790938, 798703, 806865, 815076, 823416, 831995, 840619, 849256, 858314, 868099, 878603, 890085, 903050, 917159, 930919, 943052, 953630, 963333, 972240, 979938, 986247, 991120, 994311, 995781, 996075, 995841, 995417, 995339, 996578, 999620, 1003847, 1008489, 1013740, 1020325, 1028503, 1038123, 1049121, 1061150, 1073202, 1084491, 1095474, 1107259, 1120244, 1133963, 1147916, 1161737, 1174647, 1185594, 1194050, 1200320, 1205010, 1208437, 1210456, 1210741, 1209562, 1208332, 1208846, 1211674, 1215843, 1220247, 1224750, 1229716, 1235375, 1242117, 1250572, 1260769, 1271910, 1283518, 1296032, 1309714, 1323854, 1337824, 1352135, 1367567, 1383848, 1399978, 1415304, 1429639, 1443093, 1456486, 1471182, 1487634, 1504758, 1521471, 1538079, 1555383, 1573337, 1591608, 1610633, 1631055]
58283A631055K1714K2756K4262K6195K7563K8200K9053L0482L1933L3491L5827
58272A942531L8407L9777M0050M1011M3273M5427M6629M7867M9908N1919N3087
58261B439886N3802N4610N5569N7028N9138O0433N9180N6432N5313N6828N9033
58250C067252O0777O3275O7100P0773P3698P7534Q3193Q9188R4417R9966J06592
58239C953765J13172J19195J26113J34619J43234J51304J60603J72202J84514
58230E258721J96270K08676K22744K37378K52143K69085K89773L13313L39092
58221G587195L68519M02111M38282M77149N22168N75676O36580P04921P85006
58212A2497607Q81422R96016J132218J298637J505053J758504K066098K436692
$$ y = [1631055, 1652769, 1675525, 1699787, 1725982, 1753545, 1781745, 1810798, 1841280, 1873213, 1906704, 1942531, 1980938, 2020715, 2060765, 2101776, 2145049, 2190476, 2237105, 2284972, 2334880, 2386799, 2439886, 2493688, 2548298, 2603867, 2660895, 2720033, 2780466, 2839646, 2896078, 2951391, 3008219, 3067252, 3128029, 3191304, 3258404, 3329177, 3402875, 3480409, 3563602, 3652790, 3747207, 3847173, 3953765, 4066937, 4186132, 4312245, 4446864, 4590098, 4741402, 4902005, 5074207, 5258721, 5454991, 5663667, 5886411, 6123789, 6375932, 6645017, 6934790, 7248103, 7587195, 7955714, 8357825, 8796107, 9273256, 9795424, 10371100, 11007680, 11712601, 12497607, 13379029, 14375045, 15507263, 16805900, 18310953, 20069457, 22135555, 24572247]
58204B4572247K875000L377806L941810M574486N294503O121795P065240Q113680
58196F5936567R238313J0412152J1631794J2915876J4280089J5715607J7186818
58189A57317216J8646184K0068993K1482853K2893271K4041081K4165880K2133946
58182C10749424J7054198Q978090r22930j0870350j9245736k5071724k8066351
58175B52604621k8478132k6894837k4062982k0720518j7477989j4753707j2733529
58168A07482927j1366130j0436587r698353q975508q186037p320424o418292n541221
58160C9540375m737798m026622l409598k887904k458263k106075j813885j571673
58152A6528557j372756j206864j064978r45513q48587p68415o97501o34138n79782
$$ y = [24572247, 27447247, 30825053, 34766863, 39341349, 44635852, 50757647, 57822887, 65936567, 75174880, 85587032, 97218826, 110134702, 124414791, 140130398, 157317216, 175963400, 196032393, 217515246, 240408517, 264449598, 288615478, 310749424, 327803622, 336781712, 335858782, 324988432, 305742696, 280670972, 252604621, 224126489, 197231652, 173168670, 152448152, 134970163, 120216456, 107482927, 96116797, 85680210, 75981857, 67006349, 58820312, 51499888, 45081596, 39540375, 34802577, 30775955, 27366357, 24478453, 22020190, 19914115, 18100230, 16528557, 15155801, 13948937, 12883959, 11938446, 11089859, 10321444, 9623943, 8989805, 8410023]
58143H410023n32467m88424m47345m10863l78066l46884l17730k91853k68194
58134D928197k45305k24168k05994j89618j74119j61467j53311j47514j41074
58125C285627j34275j28744j23593j16922j09374j02861r7100r0536q3498p7593
58115B221131p2975o8681o4726o1592n8635n5170n2046n0234m8930m6846m4283
58104A597013m2206m0540l9047l8403l8655l8168l5965l3552l2469l1591k9073
58093A197344k5567k3125k2123k1523k1128k1252k1002j9272j6833j5355j4954
58082I75210j4575j4191j4572j5408j5698j5597j6065j6968j7272j6786j6079
58071H01999j5038j3191j1184j0301j0612j1015j0945j0682j0264r393q340p626
$$ y = [8410023, 7877556, 7389132, 6941787, 6530924, 6152858, 5805974, 5488244, 5196391, 4928197, 4682892, 4458724, 4252730, 4063112, 3888993, 3727526, 3574215, 3426701, 3285627, 3151352, 3022608, 2899015, 2782093, 2672719, 2569858, 2472758, 2382222, 2298724, 2221131, 2148156, 2079475, 2014749, 1953157, 1894522, 1839352, 1787306, 1737072, 1688142, 1641296, 1597013, 1554807, 1514267, 1475220, 1436817, 1398162, 1359994, 1324029, 1290477, 1258008, 1226417, 1197344, 1171777, 1148652, 1126529, 1105006, 1083878, 1062626, 1041624, 1022352, 1005519, 990164, 975210, 960635, 946444, 931872, 916464, 900766, 885169, 869104, 852136, 834864, 818078, 801999, 786961, 773770, 762586, 752285, 741673, 730658, 719713, 709031, 698767, 689374, 681034, 673408]
58059F73408p087o357n878o277p074p254o855o785p346q044q607r071r117q379
58045E69277p203o190n366m596m284m619m832m282l695m123n200n765n653n509
58031D97960n345m798m491n482p392q610q464p869p668p627p267o638n883n050
58017D05376m503m650n097m924l959k956k411k005j367o80k22N4L19O68J148J575
58001C76366J507P99rl13k26k15l34m07n84j023j353j155p06n79p88j017j303
57984C68660j742j873j288n55o23j451k104k072j742j540j378r98l06N95J351
57969C52934J550J327J343J706J556L28j226k092k397k802l100k661j809j501
57955C43156j891k312k608l191l941m172l725l101k451j472k97N91J337K529M012
$$ y = [673408, 666321, 659964, 654086, 647809, 640735, 633481, 626626, 619841, 612495, 604451, 595844, 586773, 577656, 569277, 562074, 555884, 550518, 545922, 541638, 537019, 532187, 527905, 524210, 520087, 514887, 509122, 503469, 497960, 492615, 487817, 483326, 477844, 470452, 461842, 453378, 445509, 437841, 430214, 422947, 416309, 410426, 405376, 400873, 396223, 391126, 386202, 382243, 379287, 376876, 374871, 373504, 372824, 372602, 372656, 372975, 373643, 374791, 376366, 377873, 378672, 378663, 378350, 378124, 377909, 377575, 377168, 376584, 375561, 374208, 373053, 372347, 371768, 370980, 369963, 368660, 366918, 365045, 363757, 363202, 362579, 361128, 359024, 356952, 355210, 353670, 352292, 351294, 350988, 351583, 352934, 354484, 355811, 357154, 358860, 360416, 360744, 359518, 357426, 355029, 352227, 349127, 346466, 344657, 343156, 341265, 338953, 336345, 333154, 329213, 325041, 321316, 318215, 315764, 314292, 313995, 314586, 315923, 318452, 322464]
57940C22464M908M985M967N256N437N315N473O295P265P659P303O426N340M429
57926D03522L769K706N48k180m057m589m866o048p909r318r557q722p360o124
57912C39815n452n244n040m556l755k544r17O66J582J806J831J889J775J427J057
57897C24340P41M51M10P94J211J182J019J450K401L109L456M152N365O125N593
57882C61799M152K766J793R54k9j131k142k802l036l121l323l495l367l038k691
57867C43289k109j114k25q4l92l02K75O72P26J002J688K330K781L421M221M618
57851C60797M616M930N658N873N042L821K896K055J065N12Q35J290Q81j49p06
57836C99416m12jk70j237k271k662k193j440j282j899k562k575k063j636j658
$$ y = [322464, 327372, 332357, 337324, 342580, 348017, 353332, 358805, 365100, 372365, 380024, 387327, 393753, 399093, 403522, 407291, 409997, 410545, 408365, 404308, 399719, 394853, 388805, 380896, 371578, 362021, 353299, 345939, 339815, 334363, 329119, 324079, 319523, 315768, 313224, 312307, 312973, 314555, 316361, 318192, 320081, 321856, 323283, 324340, 325081, 325532, 325942, 326736, 327947, 329129, 330148, 331598, 333999, 337108, 340564, 344716, 350081, 356206, 361799, 365951, 368717, 370510, 371464, 371435, 370304, 368162, 365360, 362324, 359203, 355880, 352385, 349018, 345980, 343289, 341180, 340066, 339841, 339757, 339365, 339063, 339338, 340010, 340736, 341738, 343426, 345756, 348537, 351958, 356179, 360797, 365413, 370343, 376001, 381874, 386916, 390737, 393633, 395688, 396753, 397265, 398100, 399390, 400271, 400122, 399416, 399004, 399003, 398733, 397496, 395225, 392563, 390370, 388930, 387648, 385749, 383187, 380612, 378549, 376913, 375255]
57821C75255k082k621k910k863k869l260l662l518l193l612m782n622n519n065
57807C23677m864m636m119l873m422n280n608n315m827m356l921l613l272k473
57793B63098j297m70k79p7N81J131J092J114J970L249L972M040M037M118M073
57778B90352M068M411M835N019N394O415P425P342O259N166M285K925J076j81
57764C54791k77ql58j227j944k314k566k741k679k365j892j303o41mN88J141J462
57747C37663J266O36P0JM51J131J624J555Q59K7k92NK95r9j152k053j919o31R82
57728C40419J965K149J956J587R58M72Q78K086K933K732K211K234K313J516K29
57713C66638k49L57R87R61Q17J116J472J267O18N7k63n25p93r37q70n84j74J26
$$ y = [375255, 373173, 370552, 367642, 364779, 361910, 358650, 354988, 351470, 348277, 344665, 339883, 334261, 328742, 323677, 318813, 314177, 310058, 306185, 301763, 296483, 290875, 285560, 280733, 276377, 272456, 268843, 265571, 263098, 261801, 261331, 261052, 260975, 261556, 262687, 263779, 264893, 266863, 270112, 274084, 278124, 282161, 286279, 290352, 294420, 298831, 303666, 308685, 314079, 320494, 327919, 335261, 341520, 346686, 350971, 353896, 354972, 354791, 354514, 354506, 354148, 352921, 350977, 348663, 346097, 343356, 340677, 338312, 336420, 335117, 334476, 334472, 335060, 336201, 337663, 338929, 339565, 339635, 339636, 340087, 341218, 342842, 344397, 345256, 345283, 344991, 344996, 345291, 345192, 344040, 341987, 340068, 339437, 340419, 342384, 344533, 346489, 348076, 349034, 349506, 350384, 352470, 355403, 358135, 360346, 362580, 364893, 366409, 366638, 366389, 366746, 367733, 368694, 369511, 370627, 372099, 373366, 373984, 374041, 373778, 373253, 372460, 371523, 370653, 370069, 369895, 370021]
57695C70021J57R0J81K34k99j638l413n099o421p294p721p698p028n370k833k74
57679C15595J543K912M810P587J0705J3637J6390J9095K1743K4512K7673L1048
57667D97250L4171L7100M0358M3673M5299M2928L5091K1641L814j5742l3532m6620
57655G05431n3726n5131n2134m6651m0637l5125l0033k5081k0559j6879j3887
57644C15588j1110q427o089m270k983k207j845j655j513j550j783j804j167J1
57630B69196J050J240L74j085k266k622k474k504k753k633k017j589j739j817
57616B48361j166l10l41j330k231k302j899j754k057k482k618k173j135M2P09
57601B27314O19Q0m59p49o36j57K21j60j377k711l431l505l357l221l056k852
$$ y = [370021, 370178, 370268, 370449, 370683, 370384, 368746, 365333, 360234, 353813, 346519, 338798, 331100, 324072, 318702, 315869, 315595, 317138, 320050, 324860, 332447, 343152, 356789, 373179, 392274, 414017, 438529, 466202, 497250, 531421, 568521, 608879, 652552, 697851, 740779, 775870, 797511, 801325, 785583, 752051, 705431, 651705, 596574, 544440, 497789, 457152, 422027, 391994, 366913, 346354, 329475, 315588, 304478, 296051, 289962, 285692, 282709, 280502, 278657, 277002, 275489, 273939, 272156, 270352, 269185, 269196, 270246, 271486, 271860, 270775, 268509, 265887, 263413, 260909, 258156, 255523, 253506, 251917, 250178, 248361, 247195, 246885, 246544, 245214, 242983, 240681, 238782, 237028, 234971, 232489, 229871, 227698, 226563, 226605, 227314, 227933, 228013, 227554, 226805, 226169, 226012, 226233, 226073, 224696, 221985, 218554, 215049, 211692, 208471, 205415, 202563]
57585B02563k562j962r77j13n9q01j502j470r15n78q33j506k320l148l807l968
57569A76042l458k539j730j409j543j790j801j546j322j384j613j664j410j017
57555A51816o27j43N17J185J586J668J619J600J632J694J845K104K271J963R66
57540A71696m90j858k709k888k329j065M05J188Q73J11j12L17O39L49k47n62m06
57523A62912L1L78K12n18j142q80J61J135J650K054K392K078J047L18O69J516
57507A74013J836J607J452J431J191Q70Q60Q53K44o80r78m81p6m29j254j969k279
57490A76211k060j393q72j083j689j769j171p29r58j422j615j656j659j367q07
57475A55961o40j289k246k735k595k116j562j162j116j204r54m78m81j102j460
$$ y = [202563, 200001, 198039, 197062, 196949, 196890, 196089, 194587, 193117, 192202, 191624, 190791, 189285, 186965, 183817, 180010, 176042, 172584, 170045, 168315, 166906, 165363, 163573, 161772, 160226, 158904, 157520, 155907, 154243, 152833, 151816, 151189, 151046, 151563, 152748, 154334, 156002, 157621, 159221, 160853, 162547, 164392, 166496, 168767, 170730, 171696, 171206, 169348, 166639, 163751, 161422, 160357, 160762, 161950, 162823, 162934, 162822, 163139, 163778, 164127, 163880, 163318, 162912, 162943, 163321, 163533, 163015, 161873, 160993, 161154, 162289, 163939, 165993, 168385, 170463, 171510, 171828, 172497, 174013, 175849, 177456, 178908, 180339, 181530, 182400, 183260, 184113, 184357, 183677, 182699, 182218, 182142, 181713, 180459, 178490, 176211, 174151, 172758, 171886, 170803, 169114, 167345, 166174, 165445, 164487, 163065, 161450, 159794, 158135, 156768, 155961, 155321, 154032, 151786, 149051, 146456, 144340, 142778, 141616, 140500, 139296, 138342, 137864, 137383, 136281, 134821]
57460A34821q59J85O80M08j78o57p39j34R28J554J184L76k3j3r5k09J38Q75J328
57441A39570J097M36j72l45R2Q40J205R73P70J078J328P55k94q02n89l50l15N6
57423A45333Q88J426J108K82m72j064j501j493r02j68K04K49K94M87P78J068J135
57406A47652P71K09L0L70O04J48p79j499j700j539j151n07K67Q12Q43M80K34N81
57388A45826J464K229K338K060K103K579K885K712K600L055L593L283J986M83
57374A79196n23j092j620k252k779k896k436j601r96j122j782k219j907r95M5
57359A55021Q51J104N50o07j554j602q89p1N09R47J233J192R99J165J770K226
57343A62844K045J410O91o7p80r53l42M10M94R6R1O51J002O33%k47r2J02J79K22
$$ y = [134821, 133962, 134147, 134827, 135235, 135057, 134400, 133661, 133527, 134455, 136009, 137193, 137569, 137546, 137533, 137438, 137229, 137367, 138242, 139570, 140667, 141103, 140931, 140586, 140678, 141518, 142723, 143696, 144466, 145544, 146872, 147627, 147333, 146531, 145942, 145592, 145277, 145333, 146221, 147647, 148755, 149037, 148565, 147501, 146000, 144507, 143605, 143437, 143641, 143890, 144184, 144671, 145449, 146517, 147652, 148423, 148632, 148662, 149032, 149636, 149784, 149005, 147506, 145806, 144267, 143116, 142609, 142876, 143688, 144531, 145011, 145245, 145826, 147290, 149519, 151857, 153917, 156020, 158599, 161484, 164196, 166796, 169851, 173444, 176727, 178713, 179196, 178673, 177581, 175961, 173709, 170930, 168034, 165598, 163997, 163001, 161879, 160097, 157878, 155971, 154976, 155021, 155872, 156976, 157526, 156919, 155365, 153763, 152874, 152803, 153312, 154259, 155492, 156684, 157683, 158848, 160618, 162844, 164889, 166299, 166990, 166923, 166143, 165190, 164848, 165258, 165752, 165848, 165939, 166590, 167592, 168225, 168225, 167978, 167886, 167988, 168167, 168389]
57323A68389K89M00M41J03o84j279r21J43Q32P34N36P01N88l97j623j974j320
57306A64958m54Q0L22M44O02J017J539J528P70J61O04J605J874J148M74O45J328
57289A78645J866K095K098J835J303O26j16p52p86L4J035J265Q64R35J834K562
57273A95343K258J529J602K726M020M672M655M476M617N131N593N546N062M626
57259B51856M396M001L267K661K718L321L907M157M205M332M666N106N378N304
57245C09275N051M967N178N565O119O952P961Q770R130R126R052R298J0271J1976
57231D18691J3717J4721J5059J5496J6404J7391J8072J8594J9235K0007K0822
57220F08209K1616K2131K2204K2389K3653K6153K8841L0672L1643L2359L3091
$$ y = [168389, 168678, 169078, 169519, 169622, 168938, 167659, 166738, 166881, 167713, 168447, 168983, 169684, 170272, 169875, 168252, 166278, 164958, 164504, 164584, 164906, 165350, 165952, 166969, 168508, 170036, 170806, 170967, 171571, 173176, 175050, 176198, 176672, 177317, 178645, 180511, 182606, 184704, 186539, 187842, 188468, 188352, 187600, 186814, 186848, 187883, 189148, 190012, 190947, 192781, 195343, 197601, 199130, 200732, 203458, 207478, 212150, 216805, 221281, 225898, 231029, 236622, 242168, 247230, 251856, 256252, 260253, 263520, 266181, 268899, 272220, 276127, 280284, 284489, 288821, 293487, 298593, 303971, 309275, 314326, 319293, 324471, 330036, 336155, 343107, 351068, 359838, 368968, 378094, 387146, 396444, 406715, 418691, 432408, 447129, 462188, 477684, 494088, 511479, 529551, 548145, 567380, 587387, 608209, 629825, 651956, 674160, 696549, 720202, 746355, 775196, 805868, 837511, 869870, 902961]
57209I02961L3775L4435L5111L5587L5642L5386L5131L5103L5368L5650L5217
57198A289366L3470L0848K8549K7192K6376K5864K6305K8167L0629L2201L2139
57187A611106L0656K8179K5104K1951J9180J6971J5479J4928J5054J4992J4266
57176A827866J3446J3259J3597J4019J4680J5913J7232J7719J7193J6227J5168
57165A996319J4074J3394J3738J4884J5874J6315J6729J7460J8037J8065J7945
57154B172834J8155J8295J7611J6247J5268J5289J5641J5307J4362J3907J4444
57143B347360J5010J4378J2670J0990R803Q707P668P341P777Q015P602P484Q580
57130B473385J0349J1784J2960J4543J6488J8398K0707K4289K9315L5833M5036
$$ y = [902961, 936736, 971171, 1006282, 1041869, 1077511, 1112897, 1148028, 1183131, 1218499, 1254149, 1289366, 1322836, 1353684, 1382233, 1409425, 1435801, 1461665, 1487970, 1516137, 1546766, 1578967, 1611106, 1641762, 1669941, 1695045, 1716996, 1736176, 1753147, 1768626, 1783554, 1798608, 1813600, 1827866, 1841312, 1854571, 1868168, 1882187, 1896867, 1912780, 1930012, 1947731, 1964924, 1981151, 1996319, 2010393, 2023787, 2037525, 2052409, 2068283, 2084598, 2101327, 2118787, 2136824, 2154889, 2172834, 2190989, 2209284, 2226895, 2243142, 2258410, 2273699, 2289340, 2304647, 2319009, 2332916, 2347360, 2362370, 2376748, 2389418, 2400408, 2410211, 2418918, 2426586, 2433927, 2441704, 2449719, 2457321, 2464805, 2473385, 2483734, 2495518, 2508478, 2523021, 2539509, 2557907, 2578614, 2602903, 2632218, 2668051, 2713087]
57119B713087N8239P4275Q9286R9753J05188J07799J10504J15587J24397J37585
57109C735700J55693J79550K10032K48020K95120L53919M26980N16191O23681
57100F744886P52410R04579J080237J278698J500535J746485K014831K301241
57092A8323902K600506K906797L213228L513569L804213M082533M343392M576982
57084D7365122M765009M873832M856379M673405M317717L810521L170360K396109
57076H0228454J491898N03903m82628j389596k186539k887476l517721m086443
57068F7673852m579355m964219n202806n267683n156289m892475m516354m072293
57060B9022378l601056l135083k696226k297094j944430j640756j384281j169976
$$ y = [2713087, 2771326, 2845601, 2934887, 3034640, 3139828, 3247627, 3358131, 3473718, 3598115, 3735700, 3891393, 4070943, 4280975, 4528995, 4824115, 5178034, 5605014, 6121205, 6744886, 7497296, 8401875, 9482112, 10760810, 12261345, 14007830, 16022661, 18323902, 20924408, 23831205, 27044433, 30558002, 34362215, 38444748, 42788140, 47365122, 52130131, 57003963, 61860342, 66533747, 70851464, 74661985, 77832345, 80228454, 81720352, 82224255, 81741627, 80352031, 78165492, 75278016, 71760295, 67673852, 63094497, 58130278, 52927472, 47659789, 42503500, 37611025, 33094671, 29022378, 25421322, 22286239, 19590013, 17292919, 15348489, 13707733, 12323452, 11153476]
57052A1153476r92115q45571p25428o27067n47011m82759m31503l89997l55892
57043E756133l28417l07339k91653k79313k67747k54682k39108k21523k02934
57034C363417j83826j64478j45771j28762j13545r9413q6099p3976o2987n2326
57024B252234m1538l1113k1604j2699l497O860J8804L1376M0687M0266K4757n683
57012B298850m4557q2621j12445j30645j37398j34919j26179j14018j00618q7310
57002A228140p4805o3574n4036m6324m0158l5081l0901k7629k5060k2666k0101
56991G87805j7555j5425j3800j2468j1280j0169q874o997m498j875J83J056Q4
56978F86187l288q814j5000j9922k2572k3154k2242k0188j7454j4760j2404r834
$$ y = [11153476, 10161361, 9315790, 8590362, 7963295, 7416284, 6933525, 6502022, 6112025, 5756133, 5427716, 5120377, 4828724, 4549411, 4281664, 4026982, 3787874, 3566351, 3363417, 3179591, 3015113, 2869342, 2740580, 2627035, 2527622, 2441523, 2367547, 2304560, 2252234, 2210696, 2179583, 2157979, 2145280, 2141783, 2148643, 2167447, 2198823, 2239510, 2279776, 2304533, 2298850, 2254293, 2171672, 2059227, 1928582, 1791184, 1656265, 1530086, 1416068, 1315450, 1228140, 1153335, 1089761, 1035725, 989401, 949243, 914162, 883261, 855632, 830572, 807906, 787805, 770250, 754825, 741025, 728557, 717277, 707108, 698234, 691237, 686739, 684864, 685047, 686103, 686187, 682899, 674085, 659085, 639163, 616591, 593437, 571195, 551007, 533553, 518793, 506389, 496555]
56966D96555o482k806J58K183M143O764R589J1580J2427J2933J4124J6041J7296
56953E94505J5857J0650K511o505j4662k1097k5234k6508k5105k2250j9147j5926
56941D47089j2065p534l012R25M277P376J0500J3688J6565J8521J9411J9954K0879
56928E56574K1660K0512J5744P066m176j5510k4371k9449l1375l1679l1062k9172
56916D24762k6000k2579j9855j7570j4968j2143r958q783q070p207o191n292m516
56903B61630l664k651j603p09p3M57J245K410L497L910L752L887N010O942R005
56888B93045J0710J1881J2444J2549J2677J3067J3023J1328P530K573k073n540
56876C93214p709q656q457p348n676l593r98K202N927R884J3569J6514J8827K1238
$$ y = [496555, 490073, 487267, 487425, 489608, 493751, 500515, 510104, 521684, 534111, 547044, 561168, 577209, 594505, 610362, 621012, 623523, 617018, 602356, 581259, 556025, 529517, 504412, 482162, 463015, 447089, 435024, 427490, 424478, 425403, 429680, 437056, 447556, 461244, 477809, 496330, 515741, 535695, 556574, 578234, 598746, 614490, 621556, 617380, 601870, 577499, 548050, 516675, 484996, 453934, 424762, 398762, 376183, 356328, 338758, 323790, 311647, 301689, 292906, 284836, 277629, 271438, 266146, 261630, 257966, 255315, 253712, 253003, 252930, 253387, 254632, 257042, 260539, 264449, 268201, 272088, 277098, 284040, 293045, 303755, 315636, 328080, 340629, 353306, 366373, 379396, 390724, 398254, 400827, 398754, 393214, 385505, 376849, 368392, 361044, 355368, 351775, 350777, 352979, 358906, 368790, 382359, 398873, 417700, 438938]
56862D38938K4182K7032K8898L0037L1534L3285L3116K8555J9187O859n845j6741
56850F79037k4310k8004k8442k6661k3114j7818j1294m562J877Q317J4967K1425
56838E61418K7252L2423L6966M0760M4078M7676N1690N4672N4033M7408L3783
56827A032159J4138q436k9827m6789n7834o2606o1305n5209m6732l7925k9265
56816F10369k0564j2422n719j17N640J1975J8130K3572K8603L3239L6627L7941
56804G67274L6840L2546K3528R256q222k5301l9174m8707n3585n3741m9750m3064
56792E47900l5425k8132k1724j6036j0677n539q23L420P331J0673J2856J3998
56780D77822J5246J7257J8688J7172J1772L713n241j4116k2253k8548l2079l3037
$$ y = [438938, 463120, 490152, 519050, 549087, 580621, 613906, 647022, 675577, 694764, 701623, 695778, 679037, 654727, 626723, 598281, 571620, 548506, 530688, 519394, 514832, 516709, 525026, 539993, 561418, 588670, 621093, 658059, 698819, 742897, 790573, 842263, 896935, 950968, 998376, 1032159, 1046297, 1037861, 1008034, 961245, 903411, 840805, 779500, 724291, 677559, 639634, 610369, 589805, 577383, 571664, 571547, 577187, 589162, 607292, 630864, 659467, 692706, 729333, 767274, 804114, 836660, 860188, 869444, 861222, 835921, 796747, 748040, 694455, 640714, 590964, 547900, 512475, 484343, 462619, 446583, 435906, 430367, 429544, 432964, 440295, 450968, 463824, 477822, 493068, 510325, 529013, 546185, 557957, 561670, 556429, 542313, 520060, 491512, 459433, 426396]
56768D26396l2332l0438k7260k3062j8865j5668j3570j1960j0356q827p613o676
56756B19769n793m971m471m358m263l789l023k398k079j757j119l65p3n37j362
56741A79411j774j386n72l3k0k25l41m12n24n20k89m1M6J63M96P34M73NQ0Q07
56721A76078J379J213Q01J027J954K792K922K449J744R32J02l65o6P75J324J021
56705A96082K83O5P14J550J722J197O27M32M15K90J57K56M58L64j74q01j027p23
56687B01887j21N41J219J839K151J996J630J417J298R70N40N51J161J789J909
56672B20777J671J344O40p57k284k910k370j369n96j57K3k5j8M14J087J362J104
56655B17936Q70R43Q57K46m58o74m68k09O2L59L45j58o30m90lJ09k69o26p09p14
$$ y = [426396, 394064, 363626, 336366, 313304, 294439, 278771, 265201, 253241, 242885, 234058, 226445, 219769, 213976, 209005, 204534, 200176, 195913, 192124, 189101, 186703, 184624, 182867, 181748, 181383, 181310, 180773, 179411, 177637, 176251, 175679, 175646, 175626, 175401, 175060, 174648, 174124, 173604, 173315, 173274, 173320, 173483, 173979, 174713, 175186, 175191, 175271, 176078, 177457, 178670, 179471, 180498, 182452, 185244, 188166, 190615, 192359, 193291, 193393, 193028, 192962, 193737, 195061, 196082, 196365, 196430, 197144, 198694, 200416, 201613, 202240, 202672, 203087, 203377, 203534, 203790, 204248, 204612, 204438, 203637, 202610, 201887, 201766, 202307, 203526, 205365, 207516, 209512, 211142, 212559, 213857, 214827, 215367, 215918, 217079, 218868, 220777, 222448, 223792, 224432, 223675, 221391, 218481, 216111, 214742, 214146, 213989, 214012, 213987, 213969, 214383, 215470, 216832, 217936, 218806, 219749, 220606, 220852, 220394, 219720, 219252, 219043, 219105, 219464, 219809, 219651, 219021, 218531, 218528, 218637, 218368, 217742, 217033, 216319]
56635B16319o83m56k14l84r50j386j405j257j172j094j033j129j267j173j006
56620B01710j243j785j907j375q72q64q40l21Q4m69j555j891j142l03j57k99p7
56603A86694L05K33k57n64m39k45k77l00J08R60J781K047J674J082P20O71P45
56586A94938R10J224J371P34o85j837j609j30J362J938J835J850K347L041L475
56571B10764L443L107K857L012L572M357N248O132O734O952P218Q081R350J0249
56557B91076J0545J0812J1228J0859Q761N334J826j092l504n273n972n763n452
56544C23385n373n040m189l449l441l797l662k873k074j813j974k071j829j442
56530B80358j329j606j820j551j117j273k096k765k667k222k162k496k687k572
$$ y = [216319, 215636, 215180, 214966, 214582, 213632, 212246, 210841, 209584, 208412, 207318, 206285, 205156, 203889, 202716, 201710, 200467, 198682, 196775, 195400, 194528, 193664, 192824, 192503, 192587, 192118, 190563, 188672, 187530, 187227, 187070, 186771, 186694, 186999, 187232, 186975, 186411, 185972, 185727, 185450, 185150, 185258, 186218, 187999, 190046, 191720, 192802, 193522, 194193, 194938, 195848, 197072, 198443, 199177, 198492, 196655, 195046, 194916, 196278, 198216, 200051, 201901, 204248, 207289, 210764, 214207, 217314, 220171, 223183, 226755, 231112, 236360, 242492, 249226, 256178, 263396, 271477, 280827, 291076, 301621, 312433, 323661, 334520, 343281, 348615, 350441, 349349, 345845, 340572, 334600, 328837, 323385, 318012, 312972, 308783, 305334, 301893, 298096, 294434, 291561, 289487, 287674, 285700, 283629, 281800, 280358, 279029, 277423, 275603, 274052, 272935, 271662, 269566, 266801, 264134, 261912, 259750, 257254, 254567, 251995]
56516B51995k459k471k351j956j527j366j528j800j868j559j114j023j419j842
56502B27712j850j567j337j111o39q1J17j41n45r16j243j238m72Q19J673J491
56486B20672P89M35M87K87m10j027r43l12K29K98K7l04m39r7P96J697J755P95
56468B24735l35p88o48m51j13Q16J991K332J462L37k7K44M08L16M39Q93J186R19
56450B33716L22j7K39Q33J189J055Q55J120J720K073K020J848J503N64p90j683
56434B46567j771j734k023k054j311m36k92o07n72k25j52l17k18J02K63M82J122
56417B36824J577Q71o94j672j387n48J17P03J333J627J410J008O14J11k19J81
56401B41856J031J332Q62N66R62J246O20n03j231j305q13K64J553K104J587R22
$$ y = [251995, 249536, 247065, 244714, 242758, 241231, 239865, 238337, 236537, 234669, 233110, 231996, 230973, 229554, 227712, 225862, 224295, 222958, 221847, 221208, 221127, 221244, 221103, 220558, 219642, 218399, 217161, 216689, 217508, 219181, 220672, 221461, 221896, 222383, 222670, 222260, 221233, 220290, 219978, 220207, 220505, 220532, 220228, 219789, 219692, 220488, 222185, 223940, 224735, 224400, 223612, 222964, 222513, 222400, 223216, 225207, 227539, 229001, 229338, 229311, 229555, 229963, 230279, 230718, 231611, 232797, 233716, 234038, 234021, 234260, 235093, 236282, 237337, 238192, 239312, 241032, 243105, 245125, 246973, 248476, 249040, 248250, 246567, 244796, 243062, 241039, 238985, 237674, 237238, 236946, 236339, 235767, 235542, 235390, 235073, 234855, 234957, 235220, 235702, 236824, 238401, 239272, 238578, 236906, 235519, 234971, 235088, 235791, 237124, 238751, 240161, 241169, 241783, 241894, 241675, 241856, 242887, 244219, 245081, 245647, 246609, 247855, 248475, 247972, 246741, 245436, 244623, 244887, 246440, 248544, 250131, 251053]
56385B51053R59J246R39K43m7J40L09M39R07J593J980J940J652J023K5o95l95
56368B63311N91J169Q82L19J27L52P66J170J297J042P97J057J632J836J458J062
56352B78868J161J608J852J526P17p3k76J50O21O58M65M80P26J059J681K728L609
56335B97560L509K533J721J852K789L925M669M533L424K083J631K393L506L854
56321C39982L115J892J066J068J510J593J052M36J64j83r94j528o75J313K867
56306C52678L056K570K464K852L327L851M565N282N853O593P655Q337P706N879
56292D22668M008K986K735K792L071L713M553N151N306N288N529O213P254Q456
56278D89723R518J0012R684Q872Q378Q776R972J1527J3057J4274J5009J5577J6782
$$ y = [251053, 252012, 253258, 254197, 254440, 254393, 254533, 254842, 255281, 256188, 257781, 259761, 261701, 263353, 264376, 264401, 263706, 263311, 263902, 265071, 265953, 266272, 266399, 266751, 267517, 268687, 269984, 271026, 271823, 272880, 274512, 276348, 277806, 278868, 280029, 281637, 283489, 285015, 285732, 285659, 285383, 285533, 286154, 286812, 287277, 287757, 288483, 289542, 291223, 293951, 297560, 301069, 303602, 305323, 307175, 309964, 313889, 318558, 323091, 326515, 328598, 330229, 332622, 336128, 339982, 343097, 344989, 346055, 347123, 348633, 350226, 351278, 351714, 351878, 351695, 350701, 349173, 348498, 349811, 352678, 355734, 358304, 360768, 363620, 366947, 370798, 375363, 380645, 386498, 393091, 400746, 409083, 416789, 422668, 426676, 429662, 432397, 435189, 438260, 441973, 446526, 451677, 456983, 462271, 467800, 474013, 481267, 489723, 499241, 509253, 518937, 527809, 536187, 544963, 554935, 566462, 579519, 593793, 608802, 624379, 641161]
56265F41161J9088K1961K4439K6245K7992L0425L3916L8484M3783M9110N3981
56254A010585N8793O4420P1137P8426Q5849R3474J01307J08910J15867J22122
56244A910890J27488J31290J32983J32748J31009J27588J21823J13293J01988
56235C031100Q7843P0801N1374L0676R627j1466l2317n2031o9492q4191r6266
56224B935658j05834j12785j17301j19934j20888j19702j16202j11401j06814
56215A904797j02922r8937r4095q8542q2842p7236p1768o6596o1740n6911n2006
56204A051202m7472m3826m0972l8302l5240l1589k7678k4366k2368k1211j9431
56193F98747j6263j2734j0461r715r385q567p472o734o496o348n782m602l127
$$ y = [641161, 660249, 682210, 706649, 732894, 760886, 791311, 825227, 863711, 907494, 956604, 1010585, 1069378, 1133798, 1204935, 1283361, 1369210, 1462684, 1563991, 1672901, 1788768, 1910890, 2038378, 2169668, 2302651, 2435399, 2566408, 2693996, 2815819, 2929112, 3031100, 3118943, 3189744, 3241118, 3271794, 3281421, 3269955, 3237638, 3185607, 3116115, 3031924, 2935658, 2829824, 2717039, 2599738, 2479804, 2358916, 2239214, 2123012, 2011611, 1904797, 1801875, 1702938, 1608843, 1520301, 1437459, 1360223, 1288455, 1221859, 1160119, 1103208, 1051202, 1003730, 959904, 918932, 880630, 845390, 813801, 786123, 761757, 739389, 718178, 698747, 682484, 669750, 659289, 649574, 640189, 631622, 624150, 617416, 610920, 604572, 598790, 594188, 591061]
56180E91061j942j308r87p66q20j169j288p02K78J020J486K111K987L747M173
56165E97881M400M582M811N262O077P161Q432R904J1345J2313J2983J4329J6839
56152G16319J9632K1734K3657K6655L0781L4843L8249M1697M5946N0976N6652
56141A107141O3232P0768P8676Q6318R3524J00262J06140J10323J11643J09024
56131B037051J02291R2539Q1139O8855N6473M5711L8169L3441K9364K4171J7429
56120B626633R060j181j2892k4822l5963m6028n4821o2374o9880p9093r0104j00695
56108B057840j08513j12775j13371j09758j01948r1639q0994p0749o0526n0514
56098A157053m1696l4588k8827k3932j9704j5855j2031q377n527l827k843j844
$$ y = [591061, 589119, 587811, 586824, 586058, 585238, 584069, 582781, 582079, 582357, 583377, 584863, 586974, 589961, 593708, 597881, 602281, 606863, 611674, 616936, 623013, 630174, 638606, 648510, 659855, 672168, 685151, 699480, 716319, 735951, 757685, 781342, 807997, 838778, 873621, 911870, 953567, 999513, 1050489, 1107141, 1170373, 1241141, 1319817, 1406135, 1499659, 1599921, 1706061, 1816384, 1928027, 2037051, 2139342, 2231881, 2313020, 2381875, 2438348, 2484059, 2522228, 2555669, 2585033, 2609204, 2626633, 2635693, 2634512, 2621620, 2596798, 2560835, 2514807, 2459986, 2397612, 2327732, 2248639, 2158535, 2057840, 1949327, 1836552, 1723181, 1613423, 1511475, 1419836, 1338842, 1268093, 1207567, 1157053, 1115357, 1080769, 1051942, 1028010, 1008306, 992451, 980420, 972043, 966516, 962689, 959846, 958002]
56086I58002n12R25K171L239M308N328O025O442O978P746Q314Q476Q795R769J0929
56071A046935J1521J1639J1870J2169J2137J2095J2773J3996J4843J5078J5322
56060A190378J5731J5688J4978J4147J3488J2770J2162J2320J3197J3846J3764
56049A342469J3495J3625J4153J5099J6625J8381J9701K0762K2431K4776K6871
56038A548388K8207K9114K9645K9567K9645L1287L4323L6731L7280L7110L7869
56027A909166L9640M1510M2929M3736M3921M4064M5023M6613M7761M8366M9614
56016B402343N2043N4838N7452O0385O3636O6200O8005P0623P5060Q0251Q4781
56005C135617Q8749R2951R7556J02397J07410J12279J16936J22581J30466J39581
$$ y = [958002, 957490, 958415, 960586, 963825, 968133, 973461, 979486, 985928, 992906, 1000652, 1008966, 1017442, 1026237, 1036006, 1046935, 1058456, 1070095, 1081965, 1094134, 1106271, 1118366, 1131139, 1145135, 1159978, 1175056, 1190378, 1206109, 1221797, 1236775, 1250922, 1264410, 1277180, 1289342, 1301662, 1314859, 1328705, 1342469, 1355964, 1369589, 1383742, 1398841, 1415466, 1433847, 1453548, 1474310, 1496741, 1521517, 1548388, 1576595, 1605709, 1635354, 1664921, 1694566, 1725853, 1760176, 1796907, 1834187, 1871297, 1909166, 1948806, 1990316, 2033245, 2076981, 2120902, 2164966, 2209989, 2256602, 2304363, 2352729, 2402343, 2454386, 2509224, 2566676, 2627061, 2690697, 2756897, 2824902, 2895525, 2970585, 3050836, 3135617, 3224366, 3317317, 3414873, 3517270, 3624680, 3736959, 3853895, 3976476, 4106942, 4246523]
55995D246523J47681J54852J63454J74170J85118J95653K07801K22597K38291
55986E936140K53837K71133K91854L15065L40005L68293M01112M37127M75621
55977I090187N19036N70174O29593O98040P78528Q73872R85512J117523J278833
55968A6541298J479212J726344K028905K397428K837778L347185L921578M566151
55960C8845879N297560O137404P100568Q181134R348132J0565242J1820917J3134274
55952A10431110J4529496J6009908J7552875J9119050K0678457K2247864K3852224
55945B44420984K5305325K5918618K4507206J9937102J1919883J401254r800372
55938C43610000j9789136k7232134l1569795l2922011l1882039k9263024k5840708
$$ y = [4246523, 4394204, 4549056, 4712510, 4886680, 5071798, 5267451, 5475252, 5697849, 5936140, 6189977, 6461110, 6752964, 7068029, 7408034, 7776327, 8177439, 8614566, 9090187, 9609223, 10179397, 10808990, 11507030, 12285558, 13159430, 14144942, 15262465, 16541298, 18020510, 19746854, 21775759, 24173187, 27010965, 30358150, 34279728, 38845879, 44143439, 50280843, 57381411, 65562545, 74910677, 85475919, 97296836, 110431110, 124960606, 140970514, 158523389, 177642439, 198320896, 220568760, 244420984, 269726309, 295644927, 320152133, 340089235, 352009118, 353410372, 343610000, 323820864, 296588730, 265018935, 232096924, 200214885, 170951861, 145111153]
55931A45111153k2192965j8685249j5528765j2821571j0570267q727030p231403
55924D9353903o025907n053504m262831l617376l091274k659526k299796j999077
55916B0344612j749818j541731j363768j210792j081549r72280q77880p96681
55908A0750113p28406o69306o14457n62969n16445m74091m33723l95824l62214
55899E992678l32238l04082k78414k56936k38696k21400k05021j90776j77877
55890C787238j64716j52061j41751j33254j24668j16068j08795j02347r5107q7373
55880B561098q0749p5210o9497o3733n8897n4396m9046m4021m2020m3558m6635
55869A933336m9879n3541n7350n9756n9857n8264n5751n2546m8995m5616m2453
$$ y = [145111153, 122918188, 104232939, 88704174, 75882603, 65312336, 56585306, 49353903, 43327996, 38274492, 34011661, 30394285, 27303011, 24643485, 22343689, 20344612, 18594794, 17053063, 15689295, 14478503, 13396954, 12424674, 11546794, 10750113, 10021707, 9352401, 8737944, 8174975, 7658530, 7184439, 6750716, 6354892, 5992678, 5660440, 5356358, 5077944, 4821008, 4582312, 4360912, 4155891, 3965115, 3787238, 3622522, 3470461, 3328710, 3195456, 3070788, 2954720, 2845925, 2743578, 2648471, 2561098, 2480349, 2405139, 2335642, 2271909, 2213012, 2158616, 2109570, 2065549, 2023529, 1979971, 1933336, 1883457, 1829916, 1772566, 1712810, 1652953, 1594689, 1538938, 1486392, 1437397, 1391781, 1349328]
55858A349328l9435l7057l5566l4071l1694k8959k6825k5114k3270k1778k1261
55847A024298k0999k0029j8998j9106j9915k0057j9533j9348j9327j8331j6458
55836H12197j5074j4644j4280j3504j2724j1901j0424q551p505p778q561r042
55824F78209r124q783p889o843o364o518o760o850o921o836o447o150o249o113
55810E80362m991l341k214j730j182k69Q47K225L732M469L909L023K955L152K332
55795E93279O35r04k536n339q845j1240j2055j2610j3490j3630j2415j0774r416
55782D80660p752n466l619l155l574m067m741n815o647o626o178n934n660m806
55768D06620l527k356j486j005j213k071k903l302l776m919o373p281p285o628
$$ y = [1349328, 1309893, 1272836, 1237270, 1203199, 1171505, 1142546, 1115721, 1090607, 1067337, 1045559, 1024298, 1003299, 983270, 964272, 945166, 925251, 905194, 885661, 866313, 846986, 828655, 812197, 797123, 782479, 768199, 754695, 741971, 730070, 719646, 711095, 703590, 695812, 687251, 678209, 669085, 660302, 652413, 645570, 639206, 632688, 625928, 619078, 612157, 605321, 598874, 592724, 586475, 580362, 575371, 572030, 569816, 568086, 566904, 566635, 567482, 569707, 573439, 577908, 581817, 584840, 587795, 590947, 593279, 593914, 593010, 590474, 585135, 576290, 565050, 552995, 540385, 526895, 513265, 500850, 490076, 480660, 472908, 467442, 463823, 460668, 457094, 453027, 448286, 442471, 435824, 429198, 423020, 417086, 411426, 406620, 403093, 400737, 399251, 398246, 397033, 394962, 392059, 388757, 384981, 380062, 373689, 366408, 359123, 352495]
55754C52495n640m576l614k696j732j154j705l344m919n418n067m784m950n186
55740B97710n077m670m340m343m436m046l045k143k014k262j995j215p90j007
55726B56327j135p34m10q02j539j873j730j556j508j386j192j204j539j921j932
55711B35866j455r27r28j332j280l12Q18J177J004J166J591J380M06m47q01j263
55695B34663k058k348j571l99L16O97J175J473J154O33P37J571K540L192L471
55680B45246L382L061K874L016L178L035K773K677K523J841O46n40j276j531j557
55665B69348j650j878j942j480n57M44J305J970K159J650R11P13R08M68r80k532
55649B68857l284l425l518l513l257l260m069n275o048o294o510o660o069m449
$$ y = [352495, 346855, 342279, 338665, 335969, 334237, 333083, 331378, 328034, 323115, 317697, 312630, 307846, 302896, 297710, 292633, 287963, 283623, 279280, 274844, 270798, 267753, 265610, 263596, 261334, 259339, 258124, 257334, 256327, 255192, 254458, 254048, 253246, 251707, 249834, 248104, 246548, 245040, 243654, 242462, 241258, 239719, 237798, 235866, 234411, 233484, 232556, 231224, 229944, 229632, 230450, 231627, 232631, 233797, 235388, 236768, 237174, 236727, 235926, 234663, 232605, 230257, 228686, 228287, 228603, 229300, 230475, 231948, 233102, 233735, 234472, 236043, 238583, 241775, 245246, 248628, 251689, 254563, 257579, 260757, 263792, 266565, 269242, 271765, 273606, 274252, 273712, 272436, 270905, 269348, 267698, 265820, 263878, 262398, 261841, 262285, 263590, 265560, 267719, 269369, 270280, 270993, 271901, 272369, 271389, 268857, 265573, 262148, 258630, 255117, 251860, 248600, 244531, 239256, 233208, 226914, 220404, 213744, 207675, 203226]
55635B03226k469j133q67j205j279p35k07m61j168j230m80m3n67j153q51k87o05
55618A88486j530j776j108n74p75j168j286j467j972k318j999j227n99m91r92
55603A69204j839k285j672l86L88J28m10l94q3j95p23j013p98m74m15m94l62P1
55585A58248N64Q47R54J234J947K894L652M192M883N845O700P140P442Q050R002
55570B23594R985J0810J1362J1336J0525R299Q351P754O775M783K060o13k910
55557C13111n056p199r141j0684j1831j2431j2094j0735q916p355o256n393m669
55544B01351m195l909l503k813j954j068k67K14J48k97o63p42p14p23o90p11j210
55527A78254k324l543m199m221m040l953l867l595l155k740k542k555k460j932
$$ y = [203226, 200757, 199624, 198757, 197552, 196273, 195538, 195331, 194870, 193702, 192472, 191992, 191949, 191382, 190229, 189378, 189091, 188486, 186956, 185180, 184072, 183498, 182723, 181555, 180269, 178802, 176830, 174512, 172513, 171286, 170687, 170196, 169204, 167365, 165080, 163408, 163022, 163410, 163538, 163128, 162734, 162651, 162456, 161733, 160720, 159922, 159448, 159033, 158539, 158177, 158248, 158812, 159659, 160613, 161847, 163794, 166688, 170340, 174532, 179415, 185260, 191960, 199100, 206542, 214592, 223594, 233579, 244389, 255751, 267087, 277612, 286911, 295262, 303016, 309791, 314574, 316634, 316021, 313111, 308055, 300856, 291715, 281031, 269200, 256769, 244675, 233940, 225024, 217669, 211413, 206020, 201351, 197156, 193247, 189744, 186931, 184977, 183909, 183642, 183856, 184004, 183707, 183044, 182302, 181588, 180865, 180175, 179464, 178254, 175930, 172387, 168188, 163967, 159927, 155974, 152107, 148512, 145357, 142617, 140075, 137520, 135060, 133128]
55513A33128j078m48m71j012j582j797j573j077o63o29r20j177j203j090r16n48
55497A16944J0M04L15j38n38n06J04J039J554R91k96j057n36O56J403J368R23
55480A22640L39k38l21M83J615J943J161J24m30p69j420k227k664k694k630k401
55464A12511j602l10P96J241J256J229J047M31l65o61k98O9j99q79j230r62m43
55447A11631o2J87L77L41l8m49l72L04J038J081K02r84j494q98K43R99R73M33
55429A13512k54r06j293j079j57J140K251K623J905L61j009j222l80M91P20O29
55413A17332P52J038J095P97K37m91j091j089m05L41N14J78j84l63m74o07p56
55396A16824r30j040r24o76o42q51q50l66K94Q12J263J644J551R03L99O30J130
$$ y = [133128, 132050, 131602, 131131, 130119, 128537, 126740, 125167, 124090, 123427, 122798, 121878, 120701, 119498, 118408, 117492, 116944, 116954, 117358, 117673, 117535, 116997, 116491, 116595, 117634, 119188, 120179, 119883, 118826, 118290, 118946, 120349, 121717, 122640, 122979, 122741, 122420, 122903, 124518, 126461, 127622, 127746, 127316, 126547, 125127, 122900, 120236, 117542, 114912, 112511, 110909, 110599, 111395, 112636, 113892, 115121, 116168, 116599, 116234, 115573, 115275, 115344, 115145, 114266, 113036, 112074, 111631, 111569, 111756, 112133, 112474, 112436, 111987, 111615, 111919, 112957, 114038, 114240, 113256, 111762, 110864, 111107, 112106, 113079, 113512, 113258, 112352, 111059, 109980, 109823, 110963, 113214, 115837, 117742, 118103, 117094, 115872, 115492, 115983, 116703, 117332, 118084, 119122, 120217, 121014, 121251, 120760, 119669, 118580, 118175, 118516, 119030, 119208, 119024, 118661, 118187, 117580, 116824, 115894, 114854, 113930, 113254, 112612, 111761, 110911, 110545, 110839, 111651, 112914, 114558, 116109, 117012, 117411, 118041, 119171]
55379A19171J013J89p47j447j922j972j399o18k99m71o15n06k45K67J055J376
55363A12830L61j542k725k243p80M66J046J122Q72M93K98K94J36k36l58L9N62
55346A10635P51P23Q45J109J164Q07J42n14p77m64J14M15K32j95o47j013j050
55329A12277n31J81L42j92p05n75p0J13k60q20j030o22J45N54J59n60p01j07N21
55310A08119O48M30J02l10n62j83O44J040O36J52K36N19M24J34L2j36o71j060
55292A10194o78N2K43qJ84R73J493J193N56K44K47K11L7j55k60k09j1R8q8m22
55272A13894o57q93j326j684j452o79L0K87K28M5j54r3M09Q86O46j80p14o14m42
55253A07537m82j33R88K148K401J774Q83o4j045j509q93L03R32O59K12P8j47q80
$$ y = [119171, 120184, 120373, 119626, 118179, 116257, 114285, 112886, 112268, 111969, 111498, 110883, 110377, 110132, 110399, 111454, 112830, 113191, 111649, 108924, 106681, 105901, 106367, 107413, 108535, 109407, 109900, 110198, 110492, 110628, 110392, 110034, 110073, 110635, 111386, 112109, 112954, 114063, 115227, 116034, 116176, 115662, 114885, 114421, 114535, 114950, 115182, 114987, 114340, 113327, 112277, 111746, 111927, 112269, 112077, 111372, 110797, 110727, 110840, 110580, 109760, 108730, 108108, 108253, 108807, 108966, 108406, 107705, 107598, 108119, 108767, 109197, 109299, 108989, 108427, 108244, 108888, 109928, 110564, 110716, 110952, 111471, 111895, 112029, 112061, 111925, 111254, 110194, 109516, 109568, 109811, 109803, 109987, 110960, 112453, 113646, 114202, 114446, 114693, 114904, 114941, 114786, 114526, 114317, 114306, 114404, 114316, 113894, 113237, 112344, 111018, 109334, 107882, 107203, 107233, 107520, 107748, 107793, 107639, 107546, 107955, 108841, 109487, 109307, 108593, 107979, 107537, 107055, 106922, 107910, 110058, 112459, 114233, 115116, 115052, 114007, 112498, 111605, 111908, 112840, 113499, 113711, 113789, 113642, 112762]
55235A12762j729j966j386l29P09J260J030J99o62j148j200p61K66J472J978J453
55219A11948O79N54R43J038N83O9j64k96m51l64J52Q16J153Q80j1j174j906j655
55201A12794p01R1K84K28K93L04J3l64m99l91j12N03J352J707R38n20j518j482
55183A12920p98n4N56J009J208J168J094J067R15M80j63q05j244j316r72m02J38
55166A14801N43Q07Q95Q71R26J006P26J0n06k88J48j04r13j181m61M35P20P06
55148A19141R68J234Q30j01p04n25M6M45N22L70M7l41n74n65n60q66j356j436
55130A16575p20K87O42J96j12L63Q27J27j385k074j232P2O57P00R06J148Q45J54
55112A17976k44j95j12j11J10O35J163J475J453R12Km72J24J182J444O65r9r9
$$ y = [112762, 111033, 109067, 107681, 107352, 108061, 109321, 110351, 110550, 109888, 108740, 107540, 106779, 107045, 108517, 110495, 111948, 112627, 113181, 114124, 115162, 115745, 115814, 115650, 115354, 114903, 114539, 114691, 115507, 116660, 117540, 117529, 116355, 114449, 112794, 112093, 112184, 112468, 112696, 112989, 113293, 113306, 112942, 112443, 112052, 111940, 112443, 113795, 115502, 116440, 115920, 114402, 112920, 112122, 112068, 112624, 113633, 114841, 116009, 117103, 118170, 119085, 119565, 119402, 118597, 117353, 116037, 115065, 114663, 114801, 115344, 116151, 117046, 117917, 118843, 119849, 120575, 120585, 120079, 119791, 119939, 119835, 118922, 117741, 117280, 117715, 118435, 119141, 120109, 121343, 122173, 122072, 121368, 120843, 120889, 121334, 121856, 122226, 122273, 121932, 121358, 120793, 120233, 119367, 118011, 116575, 115855, 116142, 116784, 116980, 116868, 117231, 118058, 118185, 116800, 114726, 113494, 113566, 114223, 114923, 115829, 116977, 117822, 117976, 117732, 117537, 117425, 117314, 117424, 118059, 119222, 120697, 122150, 123062, 123064, 122592, 122716, 123898, 125342, 126007, 125908, 125809]
55094A25809J07l46j270j727j226j50Q92J569J776J522J023O37N52N30K02m41
55078A29459r24q82n65m64n04m8J125K338K758K228J162L5o11l11O11R05k44k017
55060A34051k909k568j866j360p63lL24m8n01n51n66r27j146n88M34J041J029
55043A23083R66J204J410J151M57k69o54o20m32m83q40j163j104o77q3M89Q21
55026A23256P47M91N48R64J169Q68N71P31Q38J52r68j384q28k91m99q89n77L05
55008A25204Q78P55L47R7M7J34M03P65R57R21Q88R70R32N96K34K25M37L57k08
54989A34939q56j102q47k80L81Q38P21l6r21j312j112o77k03M09J132J637J743
54972A34454J596J331R11N16N80J110J333O17m80p30J85J199J176K08p18r58o74
$$ y = [125809, 125916, 125570, 124300, 122573, 121347, 121197, 122089, 123658, 125434, 126956, 127979, 128616, 129168, 129698, 129900, 129459, 128535, 127653, 127088, 126624, 126120, 126072, 127197, 129535, 132293, 134521, 135683, 135718, 135107, 134796, 135407, 136312, 136068, 134051, 131142, 128574, 126708, 125348, 124585, 124582, 124906, 124858, 124357, 123806, 123240, 122313, 121167, 120579, 121013, 122054, 123083, 124049, 125253, 126663, 127814, 128271, 128002, 127348, 126728, 126296, 125813, 124973, 123810, 122706, 122029, 121946, 122435, 123256, 124003, 124494, 125042, 126006, 127175, 128043, 128614, 129345, 130183, 130335, 129367, 127983, 127155, 126864, 126365, 125476, 124899, 125204, 126082, 126837, 127184, 127281, 127328, 127462, 127865, 128630, 129587, 130508, 131396, 132366, 133298, 133894, 134128, 134353, 134790, 135147, 134939, 134083, 132981, 132134, 131854, 132235, 133073, 133794, 133758, 132837, 131525, 130413, 129736, 129533, 129942, 131074, 132711, 134454, 136050, 137381, 138292, 138808, 139388, 140498, 141831, 142448, 141968, 141238, 141423, 142622, 143798, 144006, 143288, 142330, 141656]
54955A41656k84K7J56r2p20j251j071j71P15Q39L00n3L57J108J262M59o69j258
54937A41310j058m58J48O84J223J713K009K045J912J832K053K629L327L856M163
54922A67388M376M503M469M447M783N376N473M440K569P47n95j771l092m326n041
54907A93746n154m902m529m222m160m358m517m214l267j925p67l25n67q01l72
54892A49666N19J042Q51N23P18J356J985K447K827L003K892K888L467M412M986
54877A83582M878M529M423M502M394L876K940J689K82j196k826m630o217o966
54863A93260o606n485m224l336k999k961k710k072j510j553j970k040j549j068
54849A53177j093j414j537j305r07o46q26j549k399k675k179j469j164j250j301
$$ y = [141656, 141372, 141399, 141555, 141463, 140743, 139492, 138421, 138250, 138965, 139804, 140104, 140051, 140408, 141516, 142778, 143237, 142568, 141310, 140252, 139794, 139942, 140626, 141849, 143562, 145571, 147616, 149528, 151360, 153413, 156042, 159369, 163225, 167388, 171764, 176267, 180736, 185183, 189966, 195342, 200815, 205255, 207824, 208571, 207976, 206205, 203113, 198787, 193746, 188592, 183690, 179161, 174939, 170779, 166421, 161904, 157690, 154423, 152498, 151731, 151406, 150839, 150038, 149666, 150185, 151227, 152078, 152601, 153319, 154675, 156660, 159107, 161934, 164937, 167829, 170717, 174184, 178596, 183582, 188460, 192989, 197412, 201914, 206308, 210184, 213124, 214813, 215095, 213899, 211073, 206443, 200226, 193260, 186654, 181169, 176945, 173609, 170610, 167649, 164939, 162867, 161357, 159804, 157834, 155794, 154245, 153177, 152084, 150670, 149133, 147828, 146921, 146275, 145449, 143900, 141501, 138826, 136647, 135178, 134014, 132764, 131463]
54834A31463j033m57K35P33P73M70K15J54Q5k8J09N23P16L63j74m22m78o16o24
54815A32007j84L45K91k44m11J26O46L94l63p61m84PK76M67Q64J279J280R04P68
54796A37207J226J791J771J193O17J71n02j252j178J76J971K947K760J936R82
54781A51816J86p6L71J038J293J275J605K358L066L648M419N114M926L905L290
54766A88234L903M927N139M649M530N070N392M758L395J866L43j261k913m486
54752B23546n769o394o115n360n018n402n823n489m516l660l272l004k429j518
54738A59777m82N07J251J555J423J148J037J137J238J087O73L86Q05K042L408
54723A76992M072M080M279N057N643N044L316J460J92o41j519k632l863m962n589
$$ y = [131463, 130430, 129973, 130208, 130941, 131714, 132184, 132399, 132553, 132638, 132610, 132719, 133242, 133958, 134321, 134147, 133725, 133247, 132631, 132007, 131823, 132168, 132459, 132215, 131804, 131930, 132576, 132970, 132607, 131846, 131362, 131369, 131645, 132112, 132976, 134255, 135535, 136439, 137207, 138433, 140224, 141995, 143188, 143805, 143976, 143474, 142222, 141044, 141220, 143191, 146138, 148898, 150834, 151816, 152002, 151926, 152297, 153335, 154628, 155903, 157508, 159866, 162932, 166580, 170999, 176113, 181039, 184944, 188234, 192137, 197064, 202203, 206852, 211382, 216452, 221844, 226602, 229997, 231863, 232206, 230945, 228032, 223546, 217777, 211383, 205268, 199908, 194890, 189488, 183665, 178176, 173660, 170000, 166728, 163724, 161295, 159777, 159295, 159802, 161053, 162608, 164031, 165179, 166216, 167353, 168591, 169678, 170351, 170737, 171542, 173584, 176992, 181064, 185144, 189423, 194480, 200123, 205167, 208483, 209943, 210135, 209494, 207975, 205343, 201480, 196518, 190929]
54708A90929n528m998m490m203l883l362k869k671k639k445j921j137k90K26L8
54693A50757o89j212j006m43k87p10j153j154q60o77p11p84p35n58k57J82O43
54676A40346Q12M19l92j061j090n92j63k21n52o23k08L64N60K23k51l59j21j0
54658A37081j92k15K54O92L83m37p96m12p3m20j052j305j221j157r98m60K51P27
54640A30650J068J577K031J989J631J556J754J605R75N36O57O74k16j735k736
54625A42016k462j313l26j72o13q91n73P9N51O70N86M40L43M49P10P39K78l37
54607A40174n61l59q7J61N69J038J175Q74M58J46j35m53p52j009j051m34R33K145
54589A42832K075P90n42j113j079o76J51J005R86K7p30n82l35q70j512j023L55
$$ y = [190929, 185401, 180403, 175913, 171710, 167827, 164465, 161596, 158925, 156286, 153841, 151920, 150783, 150493, 150719, 150757, 150068, 148856, 147850, 147407, 147120, 146410, 145257, 144103, 143243, 142566, 141855, 141071, 140336, 139778, 139521, 139703, 140346, 141158, 141577, 141185, 140124, 139034, 138442, 138279, 138058, 137506, 136883, 136675, 137039, 137599, 137822, 137571, 137212, 137091, 137081, 136889, 136674, 136928, 137620, 138003, 137566, 136770, 136358, 136285, 135865, 134813, 133508, 132287, 131130, 130132, 129672, 129923, 130650, 131718, 133295, 135326, 137315, 138946, 140502, 142256, 143861, 144836, 145372, 146029, 146703, 146487, 144752, 142016, 139554, 138241, 137915, 137743, 137130, 136239, 135666, 135745, 136296, 136966, 137552, 137992, 138335, 138784, 139494, 140233, 140511, 140174, 139613, 139254, 139167, 139328, 139897, 140935, 142110, 142984, 143442, 143588, 143453, 143000, 142248, 141239, 140188, 139754, 140687, 142832, 144907, 145697, 145155, 144042, 142963, 142287, 142438, 143443, 144429, 144456, 143726, 143144, 142809, 141939, 140427, 139404, 139759]
54572A39759J152P63L7j84kL09Q99J724K100J503L39n43p46m23J49P39J091J086
54554A49752Q26M87J73N5K88O94P90L82o1O3P74J508J765J473Q14l3p90r98l65
54535A57597P61J514J337N48p6k03j36k19m36o41q25r39q59p42r94j568j749j061
54517A51309m8L95K19J03L08L72qm84o44n42l49j0M83Q51Q78P49P19P31O23M77
54497A56132M46M44L25J72J18M6k35n79o35l63j45l13p53j056q81k20O56J405
54479A54564J773J662J072K03m99n97j32L98O26P29R88J296J330J152J154J461
54463A67180J745J742J554J348J064P13N75P71Q32J43j155k148k134j337n02o3
54447A70328N6N2m0k55n85r29j077q19k26K50J98k83p40r38j023j129j132r12
$$ y = [139759, 140911, 141674, 141711, 141527, 141525, 141834, 142733, 144457, 146557, 148060, 148399, 147856, 147110, 146687, 146836, 147575, 148666, 149752, 150578, 151065, 151238, 151293, 151581, 152275, 153065, 153447, 153386, 153449, 154223, 155731, 157496, 158969, 159783, 159750, 158960, 157962, 157597, 158358, 159872, 161209, 161757, 161681, 161478, 161342, 161123, 160687, 160046, 159221, 158282, 157423, 156681, 155687, 154119, 152370, 151309, 151261, 151656, 151875, 151978, 152286, 152658, 152650, 152166, 151522, 150980, 150631, 150621, 151104, 151955, 152833, 153582, 154301, 155032, 155655, 156132, 156578, 157022, 157347, 157519, 157637, 157683, 157448, 156869, 156234, 155871, 155726, 155413, 154660, 153604, 152723, 152503, 153159, 154564, 156337, 157999, 159071, 159274, 158775, 158178, 158046, 158444, 159070, 159799, 160787, 162083, 163413, 164565, 165719, 167180, 168925, 170667, 172221, 173569, 174633, 175346, 175921, 176692, 177524, 177667, 176512, 174364, 172230, 170893, 170391, 170328, 170384, 170436, 170396, 170141, 169556, 168627, 167550, 166731, 166505, 166755, 166953, 166670, 165930, 164992, 163969, 162840, 161708, 160796]
54429A60796n79k56J68Q39J619K104K032J487P71J24l55n90l74M30J490K042J662
54412A73410Q82N98Q86R19J61q74j383j259q98m17K60Q01O62o9n79k57P04J689
54394A75236K253K130J198k04j177r19L80J567J535K50j231j790j268m25P2K95
54378A77902N58P22M37o3j37L29O94N35K40L35O74Q48J001J595K490K932K632
54361A93724K257K514L096L081K168J017L21k2n41j322j924k087k028k028k097
54346A96129k201k429k645k333j267j40O0p81j742j998j595j038n28J9N26P33
54330A78770M95p7p36j160j085n58KK36K47L77P00R37Q54M97oo06j201j523j355
54311A74808q62m62l81m09k26J47L90K96p5o12j264j730j437k23J181J710J078
$$ y = [160796, 160217, 159961, 160129, 160968, 162587, 164691, 166723, 168210, 168981, 169105, 168750, 168160, 167786, 168216, 169706, 171748, 173410, 174292, 174890, 175776, 176695, 176856, 175982, 174599, 173340, 172442, 172025, 172285, 173086, 173748, 173679, 173100, 172843, 173547, 175236, 177489, 179619, 180817, 180613, 179436, 178517, 178897, 180464, 181999, 182249, 181018, 179228, 177960, 177535, 177607, 177902, 178460, 179182, 179619, 179556, 179419, 179748, 180442, 180977, 181217, 181552, 182226, 183074, 184075, 185670, 188160, 191092, 193724, 195981, 198495, 201591, 204672, 206840, 207857, 208178, 208156, 207615, 206293, 204369, 202282, 200254, 198226, 196129, 193928, 191499, 188854, 186521, 185254, 185114, 185174, 184393, 182651, 180653, 179058, 178020, 177492, 177511, 178037, 178770, 179265, 179188, 178452, 177292, 176207, 175649, 175651, 175887, 176134, 176511, 177211, 178148, 179002, 179499, 179493, 178887, 177686, 176163, 174808, 173946, 173484, 173103, 172694, 172468, 172615, 173005, 173301, 173226, 172614, 171350, 169620, 168183, 167960, 169141, 170851, 171929]
54294A71929k1p58r03o58k17K70N93O18M28K02P4J66N15R07R91O98L27J19k1k09
54274A75050l17k66k60l95k91M73J620K315K096J355P95O89P66O65L90L06P07
54257A85698J408J827J643J171R56J046J021O83L67L97M91J15p62j484j493r75
54241A92109o09p42j134j436j598j680j584j266r55q30o47j53L23J82n13r37n31
54224A77999L60J089J438J522J353J008Q23J010J262J180Q33N64L53q3p71j429
54208A88511j855j909j370k69O92P12o4o34m24P6J85l0jM76J062J313R82J38p57
54189A86834j054n97j0Lm60o68k93K32M08L38L98N55M48J9l05k14J03L26M75P06
54169A87244Q55O00Rn21q48j189j516j423p69q3N6l32q89j383j572j044J61J135
$$ y = [171929, 171908, 171150, 170247, 169589, 169372, 169642, 170235, 170853, 171281, 171483, 171557, 171723, 172238, 173145, 174136, 174834, 175161, 175280, 175259, 175050, 174733, 174467, 174207, 173812, 173521, 173994, 175614, 177929, 180025, 181380, 182175, 182864, 183630, 184295, 184685, 184991, 185698, 187106, 188933, 190576, 191747, 192703, 193749, 194770, 195453, 195820, 196217, 196708, 196823, 196061, 194577, 193084, 192109, 191500, 190758, 189624, 188188, 186590, 184910, 183326, 182060, 181105, 180275, 179628, 179475, 179798, 179980, 179467, 178530, 177999, 178359, 179448, 180886, 182408, 183761, 184769, 185592, 186602, 187864, 189044, 189877, 190441, 190794, 190711, 189940, 188511, 186656, 184747, 183377, 183108, 183800, 184512, 184448, 183814, 183390, 183466, 183651, 183621, 183620, 184096, 185158, 186471, 187453, 187591, 186834, 185780, 185183, 185173, 185176, 184716, 184048, 183755, 183987, 184395, 184733, 185131, 185686, 186134, 186153, 185848, 185634, 185737, 186063, 186538, 187244, 188099, 188699, 188708, 188187, 187339, 186150, 184634, 183211, 182442, 182359, 182415, 182083, 181194, 179811, 178239, 177195, 177356, 178491]
54151A78491R95O9n21l60j00k67n01l38qj4k70j78N80J674K431K352J460K96n22
54132A85269p87o89m75l51n52j034j203m69R07J990K237J880J274N27n0J02R58
54115A89534J709J777J517J495J658J749J888K164K118J429O73O07R94R98N87
54100B10897N40J160J834K108K308K754L001K379Q58r81k548l449l446k670j726
54085B13019j245j297j375r99j57P72J446J821J970J919J750J704J837J725J002
54070B23892J31j0N35O92n3q62r06o80r69j291o50O16J111M93j35p4R3j65l45
54051B21423M1N85Q50J244K183L190L637L780M158M533M311L691L537M294N604
54036B67061O801P262O689N617N232O004O970P042O508O328O422N893M669L715
$$ y = [178491, 179486, 179555, 179034, 178674, 178574, 178307, 177806, 177468, 177460, 177446, 177176, 176998, 177578, 179252, 181683, 184035, 185495, 185791, 185269, 184482, 183793, 183318, 182967, 182415, 181381, 180178, 179709, 180616, 182606, 184843, 186723, 187997, 188524, 188474, 188576, 189534, 191243, 193020, 194537, 196032, 197690, 199439, 201327, 203491, 205609, 207038, 207711, 208318, 209312, 210310, 210897, 211437, 212597, 214431, 216539, 218847, 221601, 224602, 226981, 227839, 226858, 224310, 220861, 217415, 214745, 213019, 211774, 210477, 209102, 208103, 207946, 208718, 210164, 211985, 213955, 215874, 217624, 219328, 221165, 222890, 223892, 224023, 224013, 224548, 225240, 225187, 224325, 223419, 222739, 221770, 220479, 219829, 220445, 221556, 222049, 221914, 221840, 221933, 221768, 221423, 221464, 222049, 222899, 224143, 226326, 229516, 233153, 236933, 241091, 245624, 249935, 253626, 257163, 261457, 267061, 273862, 281124, 287813, 293430, 298662, 304666, 311636, 318678, 325186, 331514, 337936, 343829, 348498, 352213]
54022C52213L470L314K811K393K365K216J529P44L50k5j012k416l526m152m717
54007C55557n405n900n970n852n845n899n783n505n343n419n409m867l895l176
53993B81289l178l497l383k676j839j197o78k73k23n97j171j773k334k582k200
53978B53688j426q66n84m7P90J047J65j069j355m78O04J023Q48P41J248K345L428
53961B60102L886L854M059M758N325N303N303O129P344P528N911L160N25j203
53947C21984j966k194k387k581k233r28R22K518L495L897L633K768K077K416L483
53932C34904M065L668L010K733K537K087J813K202K909L353L680M458N725O999
53918C84143P967Q599Q773Q413P828P440P288P234P403P896Q307Q118P459O869
$$ y = [352213, 355683, 358997, 361808, 364201, 366566, 368782, 370311, 371055, 371405, 371380, 370368, 367952, 364426, 360274, 355557, 350152, 344252, 338282, 332430, 326585, 320686, 314903, 309398, 304055, 298636, 293227, 288360, 284465, 281289, 278111, 274614, 271231, 268555, 266716, 265519, 264841, 264568, 264345, 263748, 262577, 260804, 258470, 255888, 253688, 252262, 251396, 250812, 250765, 251555, 252602, 252767, 251698, 250343, 249865, 250469, 251492, 252340, 253081, 254329, 256674, 260102, 263988, 267842, 271901, 276659, 281984, 287287, 292590, 298719, 306063, 313591, 319502, 322662, 323187, 321984, 320018, 317824, 315437, 312856, 310623, 309695, 310617, 313135, 316630, 320527, 324160, 326928, 329005, 331421, 334904, 338969, 342637, 345647, 348380, 350917, 353004, 354817, 357019, 359928, 363281, 366961, 371419, 377144, 384143, 392110, 400709, 409482, 417895, 425723, 433163, 440451, 447685, 455088, 462984, 471291, 479409, 486868, 493737]
53904D93737O429N744M733L750K834J513l94k401l963n019n651n807n645n665
53890D84195o029o211n875n687o588q359r660r663q999q771r080r034q078o783
53876C75378o122o344o804o775o087n000l837k933k705l319m371n125n153m619
53862C06184l956l484l365l600l974m062l562k581j637j312j842k821l468l301
53848B63219k551j777j230q59p12q71j061q54l63k06o06j069j192j195j257j017
53832B46399k95K15j90r67r09J25J018J047P91R75J323J192P32O20R59J182R91
53815B55208P31P58R60J117J310J765K460L113L480L611L855M531N510O202O184
53800C00795N736N550N904O440O762O914P072P060O468N255L949L171L046L159
$$ y = [493737, 500166, 505910, 510643, 514393, 517227, 518740, 518346, 515945, 511982, 506963, 501312, 495505, 489860, 484195, 478166, 471955, 466080, 460393, 453805, 445446, 435786, 426123, 417124, 408353, 399273, 390239, 382161, 375378, 369256, 362912, 356108, 349333, 343246, 338246, 334409, 331476, 328771, 325452, 321081, 315956, 310803, 306184, 302228, 298744, 295379, 291779, 287805, 283743, 280181, 277600, 275963, 274651, 272809, 269988, 266520, 263219, 260668, 258891, 257661, 256802, 256090, 255219, 254158, 253304, 252941, 252735, 252129, 251060, 249868, 248673, 247416, 246399, 246104, 246319, 246129, 245162, 244253, 244378, 245396, 246443, 247234, 248209, 249532, 250724, 251456, 252076, 253035, 254217, 255208, 255939, 256697, 257657, 258774, 260084, 261849, 264309, 267422, 270902, 274513, 278368, 282899, 288409, 294611, 300795, 306531, 312081, 317985, 324425, 331187, 338101, 345173, 352233, 358701, 363956, 367905, 371076, 374122, 377281]
53786C77281L027K530J874J277P24N4q09j753k545l047l394l939m804n596n778
53771C55102n367n043n328n932o207n989n673n426m874l781k690k465l213m015
53757B89099l940l101k426k476k860k997k947l066l111k480j369q69j502k326
53743B53629k127j077m39q17j507j598j067n31m52p93j096q18J37J095J326J016
53727B44881J013J547J841J356O60N84R79J005M07q0L34J599K848L137K277J097
53711B65485P01J304K062K231K072K281K970L632L865L592K848J876J250J390
53697B97559K045K713L316L959M283L812K881K425K723K982K455J320K49m42q39
53682C31441j064j146j103r06o26n53q44j152j016o27n73p95n58L55J114R76K27
$$ y = [377281, 380308, 382838, 384712, 385989, 386713, 386767, 385958, 384205, 381660, 378613, 375219, 371280, 366476, 360880, 355102, 349735, 344692, 339364, 333432, 327225, 321236, 315563, 310137, 305263, 301482, 298792, 296327, 293114, 289099, 285159, 282058, 279632, 277156, 274296, 271299, 268352, 265286, 262175, 259695, 258326, 257457, 255955, 253629, 251502, 250425, 249986, 249169, 247662, 246064, 244997, 244466, 244014, 243221, 242125, 241307, 241444, 242539, 243865, 244881, 245894, 247441, 249282, 250638, 251298, 251882, 252861, 253866, 254273, 254193, 254527, 256126, 258974, 262111, 264388, 265485, 266186, 267490, 269552, 271783, 273855, 276136, 279106, 282738, 286603, 290195, 293043, 294919, 296169, 297559, 299604, 302317, 305633, 309592, 313875, 317687, 320568, 322993, 325716, 328698, 331153, 332473, 332722, 332280, 331441, 330377, 329231, 328128, 327222, 326596, 326043, 325199, 324047, 323031, 322404, 321831, 321036, 320478, 320833, 321947, 322923, 323150]
53665C23150m29q14r97p01J93R45O66m27j229j165p01l87j59K09O20Q41Q30N66
53647C21011j7p11r50m09O05J499J994K162K118J928J716J596J481J195Q06P15
53631C36739J271K347L343L715L424K765J953J120P01J268K724L993M050L175
53617C72588K620L107M052M477M147L546L091K877K989L534M266M608M323L839
53603D24064L604L365K576J432Q73J372K234K536K318K215K209J640M04o38q60
53588D49344o92p69r08o03j26l19j343k375k680k461k392k729l133l165k739k193
53572D20717j947k074k233k060j527q77l65k22n63j138j383j068o42o28q79q21
53556D02290k81L12M67N7o43r70k85J196K235J916R28P89J859L001L269L045L095
$$ y = [323150, 322721, 321907, 320910, 320209, 320402, 321347, 322013, 321586, 320357, 319192, 318491, 318104, 317945, 318154, 318774, 319615, 320445, 321011, 320994, 320283, 319333, 318924, 319529, 321028, 323022, 325184, 327302, 329230, 330946, 332542, 334023, 335218, 336024, 336739, 338010, 340357, 343700, 347415, 350839, 353604, 355557, 356677, 357378, 358646, 361370, 365363, 369413, 372588, 375208, 378315, 382367, 386844, 390991, 394537, 397628, 400505, 403494, 407028, 411294, 415902, 420225, 424064, 427668, 431033, 433609, 435041, 435914, 437286, 439520, 442056, 444374, 446589, 448798, 450438, 450842, 450204, 449344, 448652, 447883, 446975, 446372, 446246, 445927, 444584, 442209, 439529, 437068, 434676, 431947, 428814, 425649, 422910, 420717, 418770, 416696, 414463, 412403, 410876, 409999, 409634, 409412, 408849, 407711, 406328, 405260, 404618, 403990, 403111, 402290, 402009, 402321, 402788, 402845, 402202, 401232, 400947, 402143, 404378, 406294, 407222, 408011, 409870, 412871, 416140, 419185, 422280]
53539D22280L419L528L354L223L339L737M456N283N661N400N158N805P360Q996
53525D90999R990J0276J0276J0483J1187J2227J3113J3595J3989J4711J5652J6374
53513F42872J6803J7355J8455K0093K1853K3156K3703K3781K4013K4602K5123
53502H81809K5224K5111K5021K4644K3704K2703K2379K2548K2355K1609K1031
53491A138138K0908K0458J9080J7555J7142J7849J8467J8273J7871J8090J8760
53480A342591J9053J8637J7895J7189J6450J5617J4942J4550J3970J2544J0212
53469A513650P583N184K956N90j885m107n883p401q935j0417j1561j2330j3144
53456A454300j4353j5621j6133j5610j4798j4767j5822j7411j8810j9625j9808
$$ y = [422280, 425699, 429227, 432581, 435804, 439143, 442880, 447336, 452619, 458280, 463680, 468838, 474643, 482003, 490999, 500989, 511265, 521541, 532024, 543211, 555438, 568551, 582146, 596135, 610846, 626498, 642872, 659675, 677030, 695485, 715578, 737431, 760587, 784290, 808071, 832084, 856686, 881809, 907033, 932144, 957165, 981809, 1005513, 1028216, 1050595, 1073143, 1095498, 1117107, 1138138, 1159046, 1179504, 1198584, 1216139, 1233281, 1251130, 1269597, 1287870, 1305741, 1323831, 1342591, 1361644, 1380281, 1398176, 1415365, 1431815, 1447432, 1462374, 1476924, 1490894, 1503438, 1513650, 1521233, 1526417, 1529373, 1529963, 1528078, 1523971, 1518088, 1510687, 1501752, 1491335, 1479774, 1467444, 1454300, 1439947, 1424326, 1408193, 1392583, 1377785, 1363018, 1347196, 1329785, 1310975, 1291350, 1271542]
53445A271542j9606j9426j9351j8911j7737j6274j5318j4897j4289j3127j1751
53434A090855j0273q215n524l177k115k029j874j167j66R52K328L974N702P476
53420A076747R345J1100J2447J3493J4593J5830J7015J8173J9526K1149K2916
53409A252334K4811K6804K8598K9904L0949L2207L3688L4951L5864L6878L8447
53398A605435M0523M2723M4766M6754M9040N1651N3771N4334N3539N3100N4268
53387B149904N6058N6451N5068N3506N2993N2958N2265N0746M8883M6744M4073
53376B719649M0870L7290L3294K8893K4404K0047J5609J0940O368K160k062o852
53364B930610j2124j7267k2002k6684l1865l7708m3675m8570n1300n1871n1446
$$ y = [1271542, 1251936, 1232510, 1213159, 1194248, 1176511, 1160237, 1144919, 1130022, 1115733, 1102606, 1090855, 1080582, 1072367, 1066843, 1063666, 1061551, 1059522, 1057648, 1056481, 1056315, 1057267, 1059595, 1063569, 1069271, 1076747, 1086092, 1097192, 1109639, 1123132, 1137725, 1153555, 1170570, 1188743, 1208269, 1229418, 1252334, 1277145, 1303949, 1332547, 1362451, 1393400, 1425607, 1459295, 1494246, 1530110, 1566988, 1605435, 1645958, 1688681, 1733447, 1780201, 1829241, 1880892, 1934663, 1988997, 2042536, 2095636, 2149904, 2205962, 2262413, 2317481, 2370987, 2423980, 2476938, 2529203, 2579949, 2628832, 2675576, 2719649, 2760519, 2797809, 2831103, 2859996, 2884400, 2904447, 2920056, 2930996, 2937364, 2939524, 2937462, 2930610, 2918486, 2901219, 2879217, 2852533, 2820668, 2782960, 2739285, 2690715, 2639415, 2587544, 2536098]
53353B536098n1138n1037n0593m9531m8032m6396m4942m3938m3230m2301m1033
53342B023927m0056l9863l9985l9618l8772l8065l7631l6872l5390l3475l1599
53331A612601k9890k8283k6697k4929k2701k0083j7615j5883j5073j5001j5418
53320A381028j6191j7215j8137j8279j7187j5248j3435j2260j1305j0007q431
53309A223333o923n531m203l175k493j520M08K997N338P039Q383R550J0499J1564
53295A255266J3286J5489J7252J8083J8492J9169K0225K1486K2909K4352K5399
53284A471408K5820K5756K5201K3853K1814J9812J8229J6379J3443R770O541M327
53272A682353K604O84j549l986o754r950j3152j5638j7152j8306j9988k2372k4624
$$ y = [2536098, 2484960, 2433923, 2383330, 2333799, 2285767, 2239371, 2194429, 2150491, 2107261, 2064960, 2023927, 1983871, 1944008, 1904023, 1864405, 1825633, 1787568, 1749937, 1713065, 1677675, 1644200, 1612601, 1582711, 1554428, 1527731, 1502802, 1480101, 1460018, 1442403, 1426520, 1411447, 1396446, 1381028, 1364837, 1347622, 1329485, 1311206, 1294019, 1278771, 1265336, 1253076, 1241771, 1231764, 1223333, 1216410, 1210879, 1206676, 1203501, 1201008, 1199488, 1199896, 1202893, 1208231, 1215270, 1223653, 1233203, 1243702, 1255266, 1268552, 1284041, 1301293, 1319376, 1337868, 1357037, 1377262, 1398748, 1421657, 1446009, 1471408, 1497228, 1522984, 1548185, 1572038, 1593852, 1613664, 1631893, 1648272, 1661715, 1671485, 1678026, 1682353, 1684957, 1685641, 1684092, 1680106, 1673352, 1663402, 1650250, 1634612, 1617460, 1599154, 1579166, 1556794, 1532170]
53259A532170k5819k5994k6033k6541k7202k7446k7278k7142k7208k7201k6899
53248A237407k6451k6160k6079k5945k5432k4523k3602k3104k3077k3208k3262
53237I66564k3218k3021k2481k1622k0796k0243j9738j8870j7491j5767j3990
53226G49327j2469j1390j0579r672q744q410r054j0238j1310j2215j3223j4121
53214F17902j4370j4060j3999j4609j5292j5226j4406j3435j2648j1818j0709
53203D67330r456q330p467o933o875p313p873p982p472o871o876p526q105p962
53189C60289p243o593o259n834m947l903l340l447l752l765l458l054k612k076
53175C00006j633j601j965k272k103j433n40K46N49J74n33q81o89n48q70j134
$$ y = [1532170, 1506351, 1480357, 1454324, 1427783, 1400581, 1373135, 1345857, 1318715, 1291507, 1264306, 1237407, 1210956, 1184796, 1158717, 1132772, 1107340, 1082817, 1059215, 1036111, 1013034, 989826, 966564, 943346, 920325, 897844, 876222, 855426, 835183, 815445, 796575, 779084, 763317, 749327, 736858, 725468, 714889, 705217, 696473, 688063, 679009, 668771, 657461, 645246, 632023, 617902, 603532, 589472, 575473, 560864, 545572, 530346, 515940, 502505, 489857, 478039, 467330, 457874, 449544, 442077, 435144, 428269, 420956, 413083, 405101, 397629, 390758, 383882, 376356, 368251, 360289, 353046, 346453, 340194, 334360, 329413, 325510, 322170, 318723, 314971, 311206, 307748, 304694, 302082, 300006, 298373, 296772, 294807, 292535, 290432, 288999, 288459, 288705, 289254, 289428, 288895, 288014, 287325, 286777, 285907, 284773]
53159B84773p55k28n17j453j834j238o49q42j188q00k8J65k49n08m24n40r97j232
53141B71456r49m86l5O58J499J734R87ol35j03n2k70m7R48J992K131J331M81L78
53122B81312R79J691K127K335K404K247J930J850K215K600K396J687J167J155
53108C08095J173O43l94j444k086k127j624j104j394k715m146m462l491k231j547
53093B81146j268p41N3M38pq43j331j342j334j524j487q37N3L97m0p24j042q45
53075B68722k75M17P81L75o17j329j159n12j54j53L7N25O90Q4q55j340j146o88
53057B63403l25j5M03Q37J041R13N29L5l71l51L20J309J791J263K02m84n57o07
53039B69336j041j413j095k42L44J92m10q29p07j89K17J01l24l27M80J577K161
$$ y = [284773, 284018, 283790, 283273, 281820, 279986, 278748, 278099, 277257, 276069, 275269, 275241, 275406, 275157, 274649, 274225, 273685, 272688, 271456, 270507, 270021, 269986, 270644, 272143, 273877, 274864, 274858, 274523, 274420, 274368, 274098, 274051, 274999, 276991, 279122, 280453, 280934, 281312, 282291, 283982, 286109, 288444, 290848, 293095, 295025, 296875, 299090, 301690, 304086, 305773, 306940, 308095, 309268, 309911, 309517, 308073, 305987, 303860, 302236, 301132, 299738, 297023, 292877, 288415, 284924, 282693, 281146, 279878, 279137, 279190, 279628, 279621, 278778, 277447, 276105, 274771, 273247, 271760, 270923, 270976, 271373, 271333, 270609, 269567, 268722, 268447, 268864, 269645, 270020, 269403, 268074, 266915, 266403, 266249, 266096, 266133, 266658, 267348, 267432, 266577, 265237, 264091, 263403, 263078, 263063, 263466, 264303, 265344, 266257, 266786, 266821, 266450, 266099, 266419, 267728, 269519, 270782, 270984, 270500, 269943, 269336, 268295, 266882, 265787, 265545, 265889, 266081, 265671, 264842, 264135, 263946, 264163, 264264, 263940, 263613, 264093, 265670, 267831]
53022B67831K094J789J417Q67L51L07N61L89l22p22k67L01J2q76j265q02k13k3
53004B71429J11O08J172J271R10N20L56L80N55Q32J025R99R70J297J949K424K269
52987B89077J554P69L59L98O78J017J370J710J937J967J763J206K55o62p73J00
52971C02725J030R69J11m28k29nk54l92J97J055J391J356J597J951J567K66j162
52954C11745k058k470k524k116j489j258j491j483q63k90m84j176j585j428r87
52939B90043n16k12l52q58j100o97j46o5k17l9K12k09j125j430o66K90M34j59
52921B83188p35q82p14m67l47m37m70l6P25J012L77n19o27K07J104J238O49jk08
52902B83057m7Q1j5j05L5J60j46p88j130p74l7N10O20L73n7m07l93l5L24M66N00
$$ y = [267831, 269925, 271714, 273131, 273998, 274349, 274656, 275217, 275606, 275284, 274562, 274295, 274596, 274608, 273732, 272467, 271665, 271452, 271429, 271540, 272148, 273320, 274591, 275501, 276021, 276377, 276757, 277312, 278144, 279169, 280168, 281138, 282435, 284384, 286808, 289077, 290631, 291400, 291759, 292157, 292835, 293852, 295222, 296932, 298869, 300836, 302599, 303805, 304060, 303398, 302625, 302725, 303755, 304724, 304835, 304407, 304178, 304173, 303919, 303527, 303724, 304779, 306170, 307526, 309123, 311074, 312641, 312907, 311745, 309687, 307217, 304693, 302577, 301088, 299830, 298339, 296856, 295993, 295703, 295219, 294043, 292458, 291030, 290043, 289527, 289315, 288963, 288105, 287005, 286308, 286162, 286097, 285880, 285841, 286053, 285844, 284719, 283289, 282623, 282913, 283347, 283188, 282453, 281571, 280857, 280390, 280043, 279606, 279136, 279100, 279825, 280837, 281214, 280695, 280068, 280275, 281379, 282617, 283266, 283265, 283057, 283010, 283091, 283076, 282971, 283006, 283166, 283020, 282232, 281102, 280328, 280291, 280801, 281421, 281794, 281737, 281330, 280937, 280902, 281226, 281692, 282192]
52881B82192M93L32J55M27J180J675J370Q32R96J811K296J920J206Q90J087J468
52865C00330J721J644J205P69Q80J548K033J590K60j287k476l169l518l757m053
52850B93720m354m409m029l328k666k350k435k653k600k105j436j029j006j125
52836B58195j180j271j526j735j392k61J171J869J278J03k39P77K084K288J285
52821B61446J04n77r96j376j327n98K75O28O39J025J969K782K672J523O7o17N2
52804B67691J449K098J128p65k154k472k290k152j864j131l09m1l91p74p43m37
52788B56843k34k41k67j92j36k54m78o10n98n32l83K4O39J004O94r2o28l99M51
52769B54611J366J908J960J596R25P7p21j120q85k33J98j1n13n73jN75M88j64
$$ y = [282192, 282685, 283017, 283172, 283599, 284779, 286454, 287824, 288656, 289652, 291463, 293759, 295679, 296885, 297775, 298862, 300330, 302051, 303695, 304900, 305669, 306549, 308097, 310130, 311720, 311980, 310693, 308217, 305048, 301530, 297773, 293720, 289366, 284957, 280928, 277600, 274934, 272584, 270149, 267496, 264896, 262791, 261355, 260326, 259320, 258195, 257015, 255744, 254218, 252483, 251091, 250830, 252001, 253870, 255148, 255251, 255012, 255789, 257873, 260161, 261446, 261550, 260973, 259977, 258601, 257274, 256676, 256951, 257579, 258218, 259243, 261212, 263994, 266666, 268189, 268256, 267639, 267691, 269140, 271238, 272366, 271601, 269447, 266975, 264685, 262533, 260669, 259538, 259229, 259188, 258797, 258023, 257280, 256843, 256609, 256368, 256101, 255909, 255773, 255519, 255041, 254431, 253833, 253301, 252918, 252942, 253581, 254585, 255279, 255187, 254559, 254160, 254611, 255977, 257885, 259845, 261441, 262366, 262443, 261722, 260602, 259717, 259484, 259682, 259671, 259158, 258585, 258584, 259159, 259647, 259483]
52751B59483o75m87L84J495K341K630K436K135K025K062J985J671J279J152J513
52736B81429K165K491K013J020L48L80O34O04N70J039J693J683Q67L9k15k09m65
52719B96086r74j493j975k254j932j037l57m39p19m07J67jj012j850j822j288
52703B78693p53j40O94J435J762J763J512Q10k78j095j133o55j82K26O54Q00L61
52686B84474l73q52r80r67p90l99j84n51j181j339q37j62K72M12K26l39r92j283
52668B74155j120o88jR08J570J523J109J048J266J031L25Q3P23J437J405R72R93
52651B86739J637K468L142L454L120K198J273P04Q4r73j978k206j847j682j803
52636B94330j519n59M33P58M24j56p58j265j423j041l63M9j68p24q73k51O24Q93
$$ y = [259483, 258808, 258321, 258705, 260200, 262541, 265171, 267607, 269742, 271767, 273829, 275814, 277485, 278764, 279916, 281429, 283594, 286085, 288098, 289118, 289466, 289846, 290480, 291084, 291654, 292693, 294386, 296069, 296936, 296975, 296760, 296551, 296086, 295112, 293619, 291644, 289390, 287458, 286421, 286064, 285625, 284906, 284499, 284666, 284665, 283653, 281803, 279981, 278693, 277940, 277800, 278494, 279929, 281691, 283454, 284966, 285776, 285498, 284403, 283270, 282615, 282433, 282659, 283313, 284113, 284474, 284101, 283249, 282269, 281302, 280512, 280113, 279929, 279378, 278197, 276858, 276021, 275859, 276131, 276543, 276769, 276430, 275438, 274155, 273035, 272347, 272346, 273254, 274824, 276347, 277456, 278504, 279770, 280801, 281126, 281209, 281932, 283369, 284774, 285746, 286739, 288376, 290844, 293986, 297440, 300560, 302758, 304031, 304735, 304819, 303846, 301868, 299662, 297815, 296133, 294330, 292811, 292252, 292685, 293443, 293867, 293711, 292953, 291688, 290265, 289224, 288861, 288910, 288742, 288018, 287145, 286894, 287518, 288411]
52618B88411M33j25m75j057k033k632k134j019l10j45J29P06J097J133J235J484
52602B84698J286L16q24j296r22j28N43P14L42j14o4N21J113J345J290J030N53
52585B90403J53K96P96Q85L87J47P72J617J714J156P86Q54Q29M50J39K40N09N34
52567C02667K53j94p06j149j278j039p35p51j087j328j100n32j90l81p13n97j43
52550B90997o9n86r37m35M62Q25O24P21J458K038J613M31n38p65n05j36L27R27
52532B96452J352J114J81p57q29J20J245J480O18m71p53l6R68J520J548J419J248
52515C06419Q64L54K35P67J490J833J944K364K988L079K378J524J073O96j64j309
52499C26535k061k235k290k611l175l731l954l463k232q97k39l17n42m86k44M
$$ y = [288411, 288844, 288719, 288244, 287187, 285154, 282522, 280388, 279369, 279059, 278914, 279043, 279749, 280846, 281979, 283214, 284698, 285984, 286300, 285476, 284180, 283258, 283130, 283673, 284387, 284729, 284615, 284551, 285072, 286185, 287530, 288820, 289850, 290403, 290556, 290852, 291648, 292533, 292920, 293067, 293839, 295456, 297170, 298326, 299112, 299966, 300795, 301245, 301384, 301624, 302133, 302667, 302920, 302726, 302020, 300871, 299593, 298554, 297819, 297068, 295981, 294653, 293553, 293021, 292831, 292450, 291737, 291140, 290997, 290928, 290342, 289405, 288970, 289432, 290257, 290881, 291602, 293060, 295098, 296711, 297142, 296604, 295839, 295334, 295198, 295525, 296452, 297804, 298918, 299099, 298342, 297513, 297633, 298878, 300358, 300976, 300505, 299752, 299716, 300684, 302204, 303752, 305171, 306419, 307283, 307637, 307872, 308639, 310129, 311962, 313906, 316270, 319258, 322337, 324715, 326239, 327312, 328008, 327844, 326535, 324474, 322239, 319949, 317338, 314163, 310432, 306478, 303015, 300783, 299886, 299647, 299330, 298788, 298302, 298058, 298062]
52483B98062K52M01K19k23m52j47M81R70J074Q82P19R80J786K716L166K976K493
52466C16355K037J753J875K538L243L093J932O86K16L10K30k24p50j329k204l209
52450C26552l769l650l232k877k484j834j036m61l43n87q68r39q75r71j274j455
52434B99897j285j050j136j407j402j021n29RP93J717K277K271K082K024J850
52419C05090J277O49N77J140J831K217K289K166J887J527J272J295J652K376L443
52404C30688M632N591O079O155O081O114O259O178N419L848J761m91k734m701
52390C80879n831n736m811l965l663l539l001j967q53r3K40L87O42J033J324J398
52374C52444J563K227L312M298M856N085N067M609L650K593J867J351N66o82k132
$$ y = [298062, 298314, 298715, 298934, 298711, 298259, 298112, 298593, 299563, 300637, 301519, 302238, 303218, 305004, 307720, 310886, 313862, 316355, 318392, 320145, 322020, 324558, 327801, 330894, 332826, 333512, 333728, 334038, 334268, 334044, 333294, 331965, 329761, 326552, 322783, 319133, 315901, 313024, 310540, 308706, 307670, 307209, 306866, 306279, 305411, 304472, 303597, 302626, 301352, 299897, 298612, 297562, 296426, 295019, 293617, 292596, 292067, 292076, 292869, 294586, 296863, 299134, 301216, 303240, 305090, 306367, 307016, 307593, 308733, 310564, 312781, 315070, 317236, 319123, 320650, 321922, 323217, 324869, 327245, 330688, 335320, 340911, 346990, 353145, 359226, 365340, 371599, 377777, 383196, 387044, 388805, 388314, 385580, 380879, 375048, 369312, 364501, 360536, 356873, 353334, 350333, 348366, 347513, 347420, 347660, 348047, 348689, 349722, 351046, 352444, 354007, 356234, 359546, 363844, 368700, 373785, 378852, 383461, 387111, 389704, 391571, 392922, 393488, 392806, 390674]
52359C90674l318l776l177j680j67L92p2n95k45Q48J734J779J313J163J729K647
52343C89249L272L247K630J754J168J430K514L655M189M499N468P097Q348Q676
52329D47196Q838R668J0781J1284J1225J1433J2194J3029J3687J4383J5068J5374
52317E94160J5436J5860J6674J7146J7026J7045J7700J8420J8592J8760J9855
52306G86674K1678K3032K3231K2732K2305K2173K2054K1584K0652J9477J8411
52295A024003J7433J6070J3999J1489R008O695M562K775J377K7j521k959l876
52282A099082m343m577m471m026l862m431n105m858l693k491j588n16Q39J913
52268A057873K559L450M939O379P155P616Q390R411J0255J1005J2056J3422J4761
$$ y = [390674, 387356, 383580, 380403, 378723, 378556, 378948, 378876, 378281, 378036, 378884, 380618, 382397, 383710, 384873, 386602, 389249, 392521, 395768, 398398, 400152, 401320, 402750, 405264, 408919, 413108, 417607, 423075, 430172, 438520, 447196, 456034, 465702, 476483, 487767, 498992, 510425, 522619, 535648, 549335, 563718, 578786, 594160, 609596, 625456, 642130, 659276, 676302, 693347, 711047, 729467, 748059, 766819, 786674, 808352, 831384, 854615, 877347, 899652, 921825, 943879, 965463, 986115, 1005592, 1024003, 1041436, 1057506, 1071505, 1082994, 1092002, 1098697, 1103259, 1106034, 1107411, 1107438, 1105917, 1102958, 1099082, 1094739, 1090162, 1085691, 1081665, 1077803, 1073372, 1068267, 1063409, 1059716, 1057225, 1055637, 1055121, 1055960, 1057873, 1060432, 1063882, 1068821, 1075200, 1082355, 1089971, 1098361, 1107772, 1118027, 1129032, 1141088, 1154510, 1169271]
52255A169271J5890J6824J7515J8001J8452J8798J8560J7428J5635J3517J1114
52244A351005Q592O525N222M178K763J085m03j705l060m313n275o307p739q953
52230A341615r073q435q257q858r306r011q593q613q610q030p259o860o459n382
52216A228869l930k996k682k232j305l81J80O28J181J695K265L454N359P021P386
52201A244512O612N804N629N776N772N714O001O632P214P455P527P824Q431Q805
52187A339708Q113O071L420J282K1j016k523m339n772o577p194q015q786q947
52173A305446q325p351o632o421o484o381n860m956l801k477j105M2P18R42R29
52158A248284Q29O96O22O58O72M77J37j62n01j155k023k506k148j182j73N86J116
$$ y = [1169271, 1185161, 1201985, 1219500, 1237501, 1255953, 1274751, 1293311, 1310739, 1326374, 1339891, 1351005, 1359597, 1366122, 1371344, 1375522, 1378285, 1379370, 1378967, 1377262, 1374202, 1369889, 1364614, 1358307, 1350568, 1341615, 1332542, 1324107, 1315850, 1306992, 1297686, 1288675, 1280082, 1271469, 1262859, 1254829, 1247570, 1240710, 1234251, 1228869, 1224939, 1221943, 1219261, 1217029, 1215724, 1215343, 1215523, 1216151, 1217332, 1219027, 1221292, 1224746, 1230105, 1237126, 1244512, 1251124, 1256928, 1262557, 1268333, 1274105, 1279819, 1285820, 1292452, 1299666, 1307121, 1314648, 1322472, 1330903, 1339708, 1347821, 1353892, 1357312, 1358594, 1358615, 1357599, 1355076, 1350737, 1344965, 1338388, 1331194, 1323179, 1314393, 1305446, 1297121, 1289770, 1283138, 1276717, 1270233, 1263852, 1257992, 1253036, 1249235, 1246758, 1245653, 1245695, 1246413, 1247355, 1248284, 1249113, 1249809, 1250431, 1251089, 1251761, 1252238, 1252375, 1252213, 1251712, 1250557, 1248534, 1246028, 1243880, 1242698, 1242525, 1243111, 1244227]
52141A244227J355J181P81O27R71J529J783J510R67O40Q81J753L126M858O831
52126A273020Q938J1108J3266J5177J6472J7069J7495J8386J9711K0873K1581
52115A453096K2098K2497K2262K1088J9625J8808J8766J8851J8580J7928J6912
52104A670511J5604J4609J4783J6126J7446J7505J6230J4520J3049J1585R404
52093A831372O132K201j504m437o781q981j1060j2667j3656j4313j4956j5598
52081A735752j6032j5957j5056j3389j1677j0707j0328r527p690n327l250j594
52069A615218m9J355K425L479N174P523R671J0917J1569J2515J4153J5922J6921
52056A726793J6771J5902J5073J4610J4163J3182J1498R378P127M797K267n25
$$ y = [1244227, 1245582, 1246763, 1247544, 1248171, 1249142, 1250671, 1252454, 1253964, 1254931, 1255571, 1256452, 1258205, 1261331, 1266189, 1273020, 1281958, 1293066, 1306332, 1321509, 1337981, 1355050, 1372545, 1390931, 1410642, 1431515, 1453096, 1475194, 1497691, 1519953, 1541041, 1560666, 1579474, 1598240, 1617091, 1635671, 1653599, 1670511, 1686115, 1700724, 1715507, 1731633, 1749079, 1766584, 1782814, 1797334, 1810383, 1821968, 1831372, 1837504, 1839705, 1838201, 1833764, 1826983, 1818002, 1806942, 1794275, 1780619, 1766306, 1751350, 1735752, 1719720, 1703763, 1688707, 1675318, 1663641, 1652934, 1642606, 1633079, 1625389, 1620062, 1616812, 1615218, 1615169, 1616524, 1618949, 1622428, 1627602, 1635125, 1644796, 1655713, 1667282, 1679797, 1693950, 1709872, 1726793, 1743564, 1759466, 1774539, 1789149, 1803312, 1816494, 1827992, 1837370, 1844497, 1849294, 1851561, 1851036]
52044A851036l443o146q293r821j0978j2092j3364j4851j6387j7478j7593j6825
52032A703765j6031j6007j6662j7271j7381j7093j6579j5877j5194j4954j5208
52021A525508j5395j4991j4144j3379j2893j2544j2337j2376j2385j1848j0839
52010A382377j0283j0856j2044j2813j3043j3650j5207j7103j8448j9244k0113
51999A219573k1232k2184k2725k3047k3164k2719k1680k0649k0114j9763j9052
51988I83244j8176j7942j8698j9894k0737k0991k0910k0699k0267j9493j8460
51977G66977j7390j6399j5406j4342j3292j2351j1384j0139q588o854m864k401
51965F33567L44K629L886M295M366M192L570K613J728R32k26j954l778n055n528
$$ y = [1851036, 1847593, 1841447, 1833154, 1823333, 1812355, 1800263, 1786899, 1772048, 1755661, 1738183, 1720590, 1703765, 1687734, 1671727, 1655065, 1637794, 1620413, 1603320, 1586741, 1570864, 1555670, 1540716, 1525508, 1510113, 1495122, 1480978, 1467599, 1454706, 1442162, 1429825, 1417449, 1405064, 1393216, 1382377, 1372094, 1361238, 1349194, 1336381, 1323338, 1309688, 1294481, 1277378, 1258930, 1239686, 1219573, 1198341, 1176157, 1153432, 1130385, 1107221, 1084502, 1062822, 1042173, 1022059, 1002296, 983244, 965068, 947126, 928428, 908534, 887797, 866806, 845896, 825197, 804930, 785437, 766977, 749587, 733188, 717782, 703440, 690148, 677797, 666413, 656274, 647686, 640832, 635968, 633567, 633911, 636540, 640426, 644721, 649087, 653279, 656849, 659462, 661190, 662122, 661896, 659942, 656164, 651109, 645581]
51950F45581n215m091k266k64J381K729M358O548Q895J0816J2186J3210J3910
51937G07778J4139J4106J4387J5208J5963J5831J4727J3180J1435R150O055K386
51925H54345j615o126j1283j6624k1354k5044k7608k8821k8408k6515k3754k0689
51913F16504j7658j4969j2834j1044r127o949m865l205j938q80P6J044K057K737
51899E38949K462J056q03k159k675k874l641n430p779r646j0442j0526j0400r710
51885D66382p744m834k347j036j97J141K952M651O035P068P378O880O481P104
51871D99914Q232Q441P319N852M765L513J461q69k352k631k341k161k205k150
51857E24788j679q55j87j54o17j028j252j675k362k782k764l085m418o150p014
$$ y = [645581, 640366, 636275, 634009, 633745, 635126, 637855, 642213, 648761, 657656, 668472, 680658, 693868, 707778, 721917, 736023, 750410, 765618, 781581, 797412, 812139, 825319, 836754, 845904, 851959, 854345, 852730, 846604, 835321, 818697, 797343, 772299, 744691, 715870, 687462, 660947, 637193, 616504, 598846, 583877, 571043, 559999, 550872, 543923, 539058, 535853, 533915, 533035, 533111, 534155, 536212, 538949, 541411, 542467, 541664, 539505, 536830, 533956, 530315, 524885, 517106, 507460, 497018, 486492, 476092, 466382, 458638, 453804, 451457, 450421, 450224, 451365, 454317, 458968, 465003, 472071, 479449, 486329, 492810, 499914, 508146, 516587, 523906, 529758, 534523, 538036, 539497, 538628, 536276, 533645, 531304, 529143, 526938, 524788, 523109, 522254, 522067, 521913, 521296, 520268, 519016, 517341, 514979, 512197, 509433, 506348, 501930, 495780, 488766]
51842D88766o712o097n769n404m643l921l791l941l495k160n86M57Q29R05R31
51827D45369Q31M85N4j62q4kk66q37j261j147o65m38q01j285j024K17J642K215
51809D42841J766R84N05L33K02M7q0k33m37n24l94k05p8J60O24R37O71J26J24
51790D47369Q98J574J118m41j992k455j737o18P5J35o1n3K92P80J119J132R12
51773D48047Q84J507K822M381N745O795P487P585P009O129N364M640L618K243
51759E14256O28j340l723n933p093p039o425n825n340n138n464n999n945n168
51745D44452m433m072l319j672m4M72L39Q66K158L082L232L565M735N943O109
51730D61413N370M714M605M604M098K883J302R1q3P26J735K236K117J538N48p07
$$ y = [488766, 482054, 475957, 470188, 464784, 460141, 456220, 452429, 448488, 444993, 442833, 442247, 442704, 443533, 444438, 445369, 446200, 446685, 446739, 446577, 446493, 446491, 446225, 445388, 444127, 442980, 442315, 441877, 441076, 439791, 438767, 438984, 440626, 442841, 444607, 445591, 446096, 446429, 446631, 446678, 446598, 446365, 445928, 445404, 445010, 444805, 444727, 444887, 445511, 446448, 447119, 447245, 447369, 448267, 449841, 450959, 450518, 448526, 446071, 444334, 443716, 443791, 443926, 443865, 443812, 444104, 444884, 446003, 447135, 448047, 448931, 450438, 453260, 457641, 463386, 470181, 477668, 485253, 492262, 498391, 503755, 508395, 512013, 514256, 514884, 513544, 509821, 503888, 496795, 489756, 483331, 477506, 472166, 467028, 461564, 455565, 449620, 444452, 440019, 435947, 432628, 430956, 430912, 431384, 431723, 432589, 434747, 437829, 441061, 444626, 449361, 455304, 461413, 466783, 471497, 476102, 480706, 484804, 487687, 488989, 489080, 488997, 489723, 491458, 493694, 495811, 497349, 497897, 497190]
51714D97190j861k707l399l948m020l491k821k414k072j574j313j736k436k542
51700D60856j854r49k83J47K85m6o21r21r90j526k719l606l113j414J59M69n01
51683D43373j944l056l574l674l485k811j508J3R82J096Q70J043J853L003M044
51668D36225M649M806M863N252N980O669P156P680Q281Q411P504N658L357Q16
51654E17307j935m463n998o240n677n021m529l906k712q92R26J712R71o63k093
51639D76787k961l791m935n918o064n371m394l563k933k470k178j926j512r21
51625D27850l82j37k33n84j063j562k064k662l440m246m657m275l187k095j775
51610C95488k266k735k391j396o20m94n91l24L40J133J984K937L861M604N216
$$ y = [497190, 495329, 492622, 489223, 485275, 481255, 477764, 474943, 472529, 470457, 468883, 467570, 465834, 463398, 460856, 459002, 458053, 457770, 457917, 458202, 458156, 457535, 456614, 455624, 454098, 451379, 447773, 444660, 443246, 443405, 443874, 443373, 441429, 438373, 434799, 431125, 427640, 424829, 423321, 423334, 424316, 425412, 426282, 427325, 429178, 432181, 436225, 440874, 445680, 450543, 455795, 461775, 468444, 475600, 483280, 491561, 499972, 507476, 513134, 516491, 517307, 515372, 510909, 504911, 498671, 492994, 487973, 483444, 479538, 476826, 475934, 476860, 478572, 479543, 478880, 476787, 473826, 470035, 465100, 459182, 453118, 447747, 443353, 439790, 436857, 434387, 432209, 430283, 428771, 427850, 427468, 427331, 427098, 426514, 425451, 423889, 421825, 419163, 415723, 411477, 406820, 402545, 399358, 397263, 395488, 393222, 390487, 388096, 386700, 386080, 385586, 384995, 384671, 385011, 386144, 388128, 391065, 394926, 399530, 404746]
51595D04746N659N560M848M340N043O842Q460Q829P931O159L628O11j988l286
51581D67382l381l025k513j425N27K922N071O698Q069R706J1926J4415J6297J6916
51567E49585J6670J6630J7345J8486J9664K0953K2234K2706K1803K0326J9813
51556G66215K0726K1915K2035K0841J8728J5666J1262N643m52o434j2188j7546
51544H66411k1999k5217k7423k8927k9569k8989k7207k4599k1490j8177j5175
51533E97639j2903j1137r264p137n291m220l900m190n129o402p099o573n388m824
51519E04182n431o546p208p091o510n888n470n227m895m254l488l049l134l417
51505D32574l472l172k698k274k032j976j993j934j714j270n57K23O14M13R9L36
$$ y = [404746, 410405, 415965, 420813, 425153, 430196, 437038, 445498, 454327, 462258, 468417, 472045, 472656, 470668, 467382, 464001, 460976, 458463, 457038, 457565, 460487, 465558, 472256, 480325, 490031, 501957, 516372, 532669, 549585, 566255, 582885, 600230, 618716, 638380, 659333, 681567, 704273, 726076, 746402, 766215, 786941, 808856, 830891, 851732, 870460, 886126, 897388, 903031, 902579, 896145, 883957, 866411, 844412, 819195, 791772, 762845, 733276, 704287, 677080, 652481, 630991, 612814, 597639, 584736, 573599, 564335, 557198, 551907, 547687, 543787, 539597, 534468, 528066, 520967, 514394, 509006, 504182, 498751, 492205, 484997, 477906, 471396, 465508, 460038, 454811, 449916, 445662, 442174, 439125, 435991, 432574, 429102, 425930, 423232, 420958, 418926, 416950, 414957, 413023, 411309, 410039, 409482, 409705, 410319, 410732, 410831, 411167]
51489D11167J041J473J252P82N19L63J52J97Q19J608J752R60k93j376j911j796
51473D16709j241q35j095j904k621k864k816k786k752k529k121j778j783k234
51459C87350k840l016k425j475j005j337j831j568l15J297K472L051L558M535
51445C86451N897O960P179O678O063N867O301P307Q529R315R079P750N729L585
51431D82690J869J057J164J410P69j034l316n284o706p626p863p257o191n390
51417D38292n153n093m699l945l215k737k297j570n87K16N01M25M09O31Q70R00
51401D12948Q43J064J739K621L266L567L951M836N983O730O998P596R228J1494
51387D82864J3453J4861J6283J8033J9793K1398K3322K5974K9019L1755L3891
$$ y = [411167, 412208, 413681, 414933, 415715, 416234, 416597, 416749, 416946, 417765, 419373, 421125, 422085, 421792, 420416, 418505, 416709, 415468, 414633, 413538, 411634, 409013, 406149, 403333, 400547, 397795, 395266, 393145, 391367, 389584, 387350, 384510, 381494, 379069, 377594, 376589, 375252, 373421, 371853, 371538, 372835, 375307, 378358, 381916, 386451, 392348, 399308, 406487, 413165, 419228, 425095, 431396, 438703, 447232, 456547, 465626, 473376, 479105, 482690, 484559, 485616, 486780, 488190, 488959, 487925, 484609, 479325, 472619, 464993, 457130, 449873, 443682, 438292, 433139, 428046, 423347, 419402, 416187, 413450, 411153, 409583, 408996, 409212, 409713, 410138, 410547, 411178, 412048, 412948, 413791, 414855, 416594, 419215, 422481, 426048, 429999, 434835, 440818, 447548, 454546, 462142, 471370, 482864, 496317, 511178, 527461, 545494, 565287, 586685, 610007, 635981, 665000, 696755, 730646]
51376G30646L5537L6691L7169L6857L5662L3393K9870K5107J9067J1471K160q373
51364A025257j9070k8841l6853m2452m5297m5683m4469m2545m0371l7973l5174
51353F06529l1850k8058k4087k0355j7285j5077j3474j1787r544p132n508n093
51341D17279n235m979m142l318l017l092l014k458j628j003p56m42N00J950L119
51326C89764L405K838J614j26j797k387j648p67r99j998k317j454l68K0j23k78
51310C83379m48p43p72j27Q78J520J481R52K24m77r69j282j717k360k805k691
51294C74043k266k018j983j807j359q40l41K47Q74J322J614K095K979M062M938
51279C81560N316N103M533M146M363M954N173M559L317J906O31k29l14L81J249
$$ y = [730646, 766183, 802874, 840043, 876900, 912562, 945955, 975825, 1000932, 1019999, 1031470, 1033630, 1025257, 1006187, 977346, 940493, 898041, 852744, 807061, 762592, 720047, 679676, 641703, 606529, 574679, 546621, 522534, 502179, 484894, 469817, 456343, 444556, 435012, 427880, 422372, 417279, 412044, 407065, 402923, 399605, 396588, 393496, 390482, 388024, 386396, 385393, 384637, 384195, 384695, 386645, 389764, 393169, 396007, 397621, 397495, 395698, 393311, 391663, 390896, 389897, 387899, 385582, 384128, 383760, 383780, 383657, 383379, 382931, 382188, 381416, 381289, 382167, 383687, 385168, 386120, 386344, 385867, 384898, 383616, 381899, 379539, 376734, 374043, 371777, 369759, 367776, 365969, 364610, 363770, 363429, 363676, 364550, 365872, 367486, 369581, 372560, 376622, 381560, 386876, 391979, 396512, 400658, 405021, 409975, 415148, 419707, 423024, 424930, 425561, 425332, 425018, 425399, 426648]
51264D26648J620J481J315J322J172N70l16j107j676k192k824l497l885l712l102
51249D11817k561k413k440k291k134k450l210l704l456k800k237j696q63j8J83
51234C79727l20p62m71M13J258J637J532J168Q77R06J217J585J872K045J914J238
51218C95836K09n76q08p92r10j051q64l06L82J010J459J552J299J083J257J662
51202D00442J919K085K583L480M242M305L636K648J777J257J023Q22N08K63L00
51187D31290M14R9q28j933k556k384j605o99j62k84r44j657j905j500o38K94J000
51170D16002J351J289Q24J70k65k87j26lK86R73J613J464N93p2k6K15J17l9J07
51151D24186J57l81j140j462j475j669j812j356o87p90j641k130j739j204j157
$$ y = [426648, 428268, 429749, 431064, 432386, 433558, 434128, 433812, 432705, 431029, 428837, 426013, 422516, 418631, 414919, 411817, 409256, 406843, 404403, 402112, 399978, 397528, 394318, 390614, 387158, 384358, 382121, 380425, 379562, 379544, 379727, 379407, 378645, 378174, 378587, 379845, 381482, 383014, 384182, 385059, 385965, 387182, 388767, 390639, 392684, 394598, 395836, 396045, 395469, 394661, 393869, 392959, 391908, 391044, 390738, 391120, 392130, 393589, 395141, 396440, 397523, 398780, 400442, 402361, 404446, 407029, 410509, 414751, 419056, 422692, 425340, 427117, 428374, 429397, 430219, 430727, 430990, 431290, 431704, 431803, 430975, 429042, 426486, 424102, 422497, 421798, 421636, 421352, 420408, 418751, 416846, 415346, 414708, 415002, 416002, 417353, 418642, 419466, 419636, 419371, 419084, 418958, 418955, 419241, 420214, 421827, 423291, 423884, 423812, 423786, 424001, 424118, 424079, 424186, 424343, 423962, 422822, 421360, 419885, 418216, 416404, 415048, 414361, 413571, 411930, 409800, 408061, 406857, 405700]
51136D05700j177p21r9J69K67O85J431K140K603K784K727K733L087L391K882J727
51120D30329J129J638K173J507nj022r57k22P45J736K322K107J360P19M58N95
51104D44612J302K372K808J938P02P00J966K943K687J938J619J471Q28j43p63
51089D66980q63p37m94j0O49J274J766J984J613N92n13r46n73N8L89L67K88L67
51071D72191N06N32N92J129K342L821M993N802O619P589Q522R372J0385J1574
51057E45969J2548J3080J3609J4760J6425J7509J6801J4155J0778Q122O563N510
51045F95829M671M452M764M426K618K73j078j490k409m408o418p373p374o836
51031F79647n732m351l815m827o621p927q458q711q801q345p224n718m089k491
$$ y = [405700, 404523, 403802, 403703, 403872, 404139, 404824, 406255, 408395, 410998, 413782, 416509, 419242, 422329, 425720, 428602, 430329, 431458, 433096, 435269, 436776, 436771, 435749, 434792, 434570, 435315, 437051, 439373, 441480, 442840, 443559, 444017, 444612, 445914, 448286, 451094, 453032, 453734, 454434, 456400, 459343, 462030, 463968, 465587, 467058, 467886, 467743, 466980, 466117, 465380, 464886, 464876, 465525, 466799, 468565, 470549, 472162, 472754, 472241, 471295, 470722, 470780, 471169, 471536, 471824, 472191, 472697, 473229, 473821, 474950, 477292, 481113, 486106, 491908, 498527, 506116, 514638, 524010, 534395, 545969, 558517, 571597, 585206, 599966, 616391, 633900, 650701, 664856, 675634, 683756, 690319, 695829, 700500, 704952, 709716, 714142, 716760, 717033, 715955, 714465, 712056, 707648, 701230, 693857, 686483, 679647, 673915, 669564, 665749, 660922, 654301, 646374, 637916, 629205, 620404, 612059, 604835, 599117, 595028, 592537]
51017E92537j087K71K121M629P034Q382Q548Q140P755P771Q402R389R922R454
51003F83268Q301P037N746M420L487L136K630J232n28j500j541j496j765j941
50989G10486j852j742j343J26K715N474P756R824J1909J3641J5017J6905J9815
50976H08731K2940K5186K6596K7909K9255L0171L0705L1558L3178L5347L7768
50965A139344M0504M3768M7585N1734N5806N9371O2386O5217O8028P0203P0702
50954A774648O9027O5664O1664N7896N4463N0704M5895M0131L4271K8995K4221
50943B307579J9667J5512J2163R731Q179P637P945Q121O985M326J006k235n587
50930B401029r682j4698k0151k5404l0171l4678l9401m4602n0086n5367n9908
$$ y = [592537, 591450, 591721, 593842, 598471, 605505, 613887, 622435, 630575, 638330, 646101, 654503, 663892, 673814, 683268, 691569, 698606, 704352, 708772, 712259, 715395, 718025, 719257, 718729, 717229, 715688, 714192, 712427, 710486, 708634, 706892, 705549, 705675, 708390, 713864, 721620, 731444, 743353, 756994, 772011, 788916, 808731, 831671, 856857, 883453, 911362, 940617, 970788, 1001493, 1033051, 1066229, 1101576, 1139344, 1179848, 1223616, 1271201, 1322935, 1378741, 1438112, 1500498, 1565715, 1633743, 1703946, 1774648, 1843675, 1909339, 1971003, 2028899, 2083362, 2134066, 2179961, 2220092, 2254363, 2283358, 2307579, 2327246, 2342758, 2354921, 2364652, 2372831, 2380468, 2388413, 2396534, 2403519, 2407845, 2408851, 2406616, 2401029, 2391347, 2376649, 2356498, 2331094, 2300923, 2266245, 2226844, 2182242, 2132156, 2076789, 2016881]
50919B016881o3243o5163o6083o6837o7743o8028o6565o3090n8352n3255m8289
50908A330233m3719l9740l6303l3146l0161k7495k5247k3272k1324j9181j6737
50897A013908j4252j2312j1142j0068q267n980m288l572k955j639p8P76Q74R81
50883I41986J485K062K473K970L755M573N145N664O508P722R032J0300J1641J3083
50869A028399J4382J5342J6194J7426J9157K0987K2592K4249K6542K9727L3679
50858A268676L8305M3431M8486N2971N7465O3349P1162P9730Q7529R4417J01380
50847B006901J08941J16694J24154J31203J37599J42831J46675J49360J50906
50838C215264J50866J48889J44914J38603J29253J16715J01940Q6095O9661N2914
$$ y = [2016881, 1953638, 1888475, 1822392, 1755555, 1687812, 1619784, 1553219, 1490129, 1431777, 1378522, 1330233, 1286514, 1246774, 1210471, 1177325, 1147164, 1119669, 1094422, 1071150, 1049826, 1030645, 1013908, 999656, 987344, 976202, 966134, 957867, 951887, 947599, 944027, 941072, 939433, 939355, 940131, 941005, 941986, 943471, 945533, 948006, 950976, 954731, 959304, 964449, 970113, 976621, 984343, 993375, 1003675, 1015316, 1028399, 1042781, 1058123, 1074317, 1091743, 1110900, 1131887, 1154479, 1178728, 1205270, 1234997, 1268676, 1306981, 1350412, 1398898, 1451869, 1509334, 1572683, 1643845, 1723575, 1811104, 1905521, 2006901, 2115842, 2232536, 2356690, 2487893, 2625492, 2768323, 2914998, 3064358, 3215264, 3366130, 3515019, 3659933, 3798536, 3927789, 4044504, 4146444, 4232539, 4302200, 4355114]
50828D355114L6826K2715J1109J647n898j1129j3581j3320j0834o868k488J119
50816D364412L180L468J694k958j1449k4036l9900n7485p5301r2542j09025j24529
50804C835529j38341j49617j57970j63371j65617j64417j59943j52850j43669
50795B439734j32632j20283j07695r5720q4363p3216o2254n1896m2507l4240k7193
50784A607735k1406j6728j2919r772p074m691k926k424l304m703n619o023o637
50771A503509p754q937r900j0976j2475j4124j5503j6621j7649j8445j8724j8581
50759A333820j8386j8228j7818j6900j5534j3914j2156j0311q412o398m117j485
50747A190161J423M473P618J0936J4574J8723K3497K8700L3689L7789M0987M4102
$$ y = [4355114, 4391940, 4414655, 4425764, 4427411, 4421513, 4410384, 4396803, 4383483, 4372649, 4365781, 4363293, 4364412, 4367592, 4371060, 4372754, 4369796, 4358347, 4334311, 4294411, 4236926, 4161625, 4069083, 3960058, 3835529, 3697188, 3547571, 3389601, 3226230, 3060613, 2896196, 2736253, 2583403, 2439734, 2307102, 2186819, 2079124, 1983404, 1899041, 1825825, 1763571, 1711675, 1669168, 1634928, 1607735, 1586329, 1569601, 1556682, 1546910, 1539836, 1535145, 1532219, 1529795, 1526491, 1521788, 1516169, 1510146, 1503509, 1495755, 1486818, 1476918, 1465942, 1453467, 1439343, 1423840, 1407219, 1389570, 1371125, 1352401, 1333820, 1315434, 1297206, 1279388, 1262488, 1246954, 1233040, 1220884, 1210573, 1202161, 1195763, 1191646, 1190161, 1191584, 1196057, 1203675, 1214611, 1229185, 1247908, 1271405, 1300105, 1333794, 1371583, 1412570, 1456672]
50735A456672M8023N2740N7470O1627O5350O8915P2127P4628P6485P7948P8864
50724B190849P8781P7474P4999P1351O6651O1530N6608N1480M4920L6343K6441
50713B837427J6146N705m694j4039k1003k5146k6947k6854k4897k1190j6281j0920
50701B667307n804j496J731L846M633L433l12o539j4930k5452l7898n1087o3268
50688B474164p3418q1520q7630r1388r2550r1258q7574q1455p3459o4785n6213
50677A592914m7573l8673l0044k2219j4919p730j062M406Q894J3231J7465K0722
50665A495412K2470K3154K3333K2976K1935K0526J9207J8049J6884J5700J4582
50654A714228J3597J2991J3222J4438J6125J7506J8199J8335J8337J8829K0426
$$ y = [1456672, 1504695, 1557435, 1614905, 1676532, 1741882, 1810797, 1882924, 1957552, 2034037, 2111985, 2190849, 2269630, 2347104, 2422103, 2493454, 2560105, 2621635, 2678243, 2729723, 2774643, 2810986, 2837427, 2853573, 2859278, 2854584, 2840545, 2819542, 2794396, 2767449, 2740595, 2715698, 2694508, 2678227, 2667307, 2661503, 2660007, 2661738, 2665584, 2670217, 2673650, 2673338, 2666799, 2651869, 2626417, 2588519, 2537432, 2474164, 2400746, 2319226, 2231596, 2140208, 2047658, 1956400, 1868826, 1787371, 1713912, 1649127, 1592914, 1545341, 1506668, 1476624, 1454405, 1439486, 1431756, 1430694, 1435100, 1443994, 1457225, 1474690, 1495412, 1517882, 1541036, 1564369, 1587345, 1609280, 1629806, 1649013, 1667062, 1683946, 1699646, 1714228, 1727825, 1740816, 1754038, 1768476, 1784601, 1802107, 1820306, 1838641, 1856978, 1875807, 1896233]
50643A896233K3234K6625K9787L2354L4386L5993L7323L8708M0351M1942M2938
50632B279874M3094M2391M0586L7512L3800L0588K8216K5900K3084K0442J8776
50621B624263J7288J3881P328j597j1194k0257k8002l3394l5443l4138l0473k5558
50609B442704k0133j4958j0928q478p271o871p517r876j4172j9933k6518l3502
50597B262547m0538m7261n3489n9191o4016o7179o8182o7488o6034o4142o1374
50586A603653n7551n3453n0112m7685m5365m2321l8379l3920k9469k5450k1973
50575A157975j8760j5492j2265r372o657l559j2L185N334O784Q449J0648J2961
50562A139219J5071J7020J8700J9763K0350K1283K3163K5576K7577K8624K8856
$$ y = [1896233, 1919467, 1946092, 1975879, 2008233, 2042619, 2078612, 2115935, 2154643, 2194994, 2236936, 2279874, 2322968, 2365359, 2405945, 2443457, 2477257, 2507845, 2536061, 2561961, 2585045, 2605487, 2624263, 2641551, 2655432, 2662760, 2661163, 2649969, 2629712, 2601710, 2568316, 2532873, 2498735, 2468262, 2442704, 2422571, 2407613, 2396685, 2388207, 2380936, 2374065, 2366548, 2356672, 2342500, 2322567, 2296049, 2262547, 2222009, 2174748, 2121259, 2062068, 1998052, 1930873, 1862691, 1795203, 1729169, 1665027, 1603653, 1546102, 1492649, 1442537, 1394852, 1349487, 1307166, 1268787, 1234867, 1205398, 1179948, 1157975, 1139215, 1123723, 1111458, 1102086, 1095429, 1091870, 1091858, 1095043, 1100377, 1107161, 1115610, 1126258, 1139219, 1154290, 1171310, 1190010, 1209773, 1230123, 1251406, 1274569, 1300145, 1327722, 1356346, 1385202]
50551A385202K8723K8704K9132K9917L0566L0773L0776L0977L1459L2165L3246
50540A721640L4806L6627L8580M1097M4640M8908N3186N7427O2223O7684P3035
50529B279853P7556Q1281Q4463Q7089Q9451R2485R6740J01381J04952J06978J07975
50518C310204J07940J05767J00522R2537Q2791P1663N8896M4499K8994J2927l393
50507D013347j9522l4831m8935o1821p3252q2386q8345r0965r0643q7532q1366
50496C253749p2119o0467m7442l3891k0438p696L696J3184K0255K4379K5093K1980
50484C120283J4605K830j2608l0152m8355o6448q3711r8702j09793j16477j19575
50473B451897j20055j18154j13728j07031r8900r0421q2479p5368o8746o2213
$$ y = [1385202, 1413925, 1442629, 1471761, 1501678, 1532244, 1563017, 1593793, 1624770, 1656229, 1688394, 1721640, 1756446, 1793073, 1831653, 1872750, 1917390, 1966298, 2019484, 2076911, 2139134, 2206818, 2279853, 2357409, 2438690, 2523153, 2610242, 2699693, 2792178, 2888918, 2990299, 3095251, 3202229, 3310204, 3418144, 3523911, 3624433, 3716970, 3799761, 3871424, 3930320, 3974819, 4003813, 4016740, 4013347, 3993825, 3958994, 3910059, 3848238, 3774986, 3692600, 3604255, 3513290, 3422647, 3335115, 3253749, 3181630, 3121163, 3073721, 3039830, 3019392, 3011696, 3015392, 3028576, 3048831, 3073210, 3098303, 3120283, 3134888, 3137718, 3125110, 3094958, 3046603, 2980155, 2896444, 2797742, 2687949, 2571472, 2451897, 2331842, 2213688, 2099960, 1992929, 1894029, 1803608, 1721129, 1645761, 1577015, 1514802]
50463A514802n5914n0161m4678l8942l3302k8892k5970k3151j8995j3747q806
50452A172244m872j537J562M281O747R605J3030J6154J8068J8937J9671K0779
50440A294669K2121K3557K5171K6654K7025K5395K1883J7412J2692P844L154l86
50428A507191j894j732j090m41Q73L265N946P972R546J1525J4036J6529J9012
50415A590738K2192K6352L0933L5496M0110M4565M8069N0365N2367N4877N7237
50404B053301N8130N7358N5888N4186N1501M7047M1168L4864K8615K2075J4658
50393B518791O072l526j3619k3666l3505m3220n2370n9656o3938o5435o5387o4341
50381B036200o1465n5941m8466m0671l3327k5932j8108j0505l991J306N631Q785
$$ y = [1514802, 1458888, 1408727, 1364049, 1325107, 1291805, 1262913, 1236943, 1213792, 1194797, 1181050, 1172244, 1167372, 1165835, 1167397, 1171678, 1178425, 1188030, 1201060, 1217214, 1235282, 1254219, 1273890, 1294669, 1316790, 1340347, 1365518, 1392172, 1419197, 1444592, 1466475, 1483887, 1496579, 1504423, 1507577, 1507191, 1505297, 1503565, 1502475, 1502034, 1502907, 1506172, 1512118, 1520090, 1529636, 1541161, 1555197, 1571726, 1590738, 1612930, 1639282, 1670215, 1705711, 1745821, 1790386, 1838455, 1888820, 1941187, 1996064, 2053301, 2111431, 2168789, 2224677, 2278863, 2330364, 2377411, 2418579, 2453443, 2482058, 2504133, 2518791, 2524863, 2521337, 2507718, 2484052, 2450547, 2407327, 2354957, 2295301, 2231363, 2165928, 2100541, 2036200, 1974735, 1918794, 1870328, 1829657, 1796330, 1770398, 1752290, 1741785, 1737794, 1739100, 1744731, 1753516]
50369A753516J0316J0037P730K749n091j4433k3103l0092l6004m1473m5959m8563
50357A539630m9179m8292m6243m3259l9850l6473l3069k9440k5868k2902k0678
50346A144377j8932j7593j6904j7050j7890j9051j9963k0022j8972j7086j4789
50335I46125j2318r856p671n784l862j791OJ245K314L542M443M455M240N190P540
50320I37818R940J1097J1169J1065J1169J1232J1125J0999J0934J0902J0963J1184
50308A069597J1474J1760J2163J2785J3538J4364J5487J7110J9069K1038K2950
50297A241335K4940K6983K8870L0468L1801L2965L4186L5869L7973L9125L6661
50286A601176K8207J3617m542k2479l7129m6929n1380n0698m6033l9343l2356
$$ y = [1753516, 1763832, 1773869, 1781599, 1784348, 1779257, 1764824, 1741721, 1711629, 1675625, 1634152, 1588193, 1539630, 1490451, 1442159, 1395916, 1352657, 1312807, 1276334, 1243265, 1213825, 1187957, 1165055, 1144377, 1125445, 1107852, 1090948, 1073898, 1056008, 1036957, 1016994, 996972, 978000, 960914, 946125, 933807, 923951, 916280, 910496, 906634, 904843, 904849, 906094, 908408, 911950, 916393, 920848, 925088, 930278, 937818, 947758, 958855, 970024, 981089, 992258, 1003490, 1014615, 1025614, 1036548, 1047450, 1058413, 1069597, 1081071, 1092831, 1104994, 1117779, 1131317, 1145681, 1161168, 1178278, 1197347, 1218385, 1241335, 1266275, 1293258, 1322128, 1352596, 1384397, 1417362, 1451548, 1487417, 1525390, 1564515, 1601176, 1629383, 1643000, 1638458, 1615979, 1578850, 1531921, 1480541, 1429843, 1383810, 1344467, 1312111]
50275A312111k5685j9253j3269q192l918J36L968O763Q172R208J1133J3827J5965
50262A310966J6724J6639J6702J7271J8180J9389K1058K3088K5080K6700K7800
50251A539597K8067K6958K4240K0496J6828J3963J1842J0016Q167O103L578M40
50239A710295l122o756j0405j4333j8682k3138k7024k9550l0074k8478k5429k2053
50227A471251j9210j7131j5754j5189j5795j7803k0949k4362k6961k8200k8375
50216A241522k8046k7317k5969k4132k2356k0944j9731j8552j7507j6568j5442
50205A004958j4121j3082j2579j2158j1312j0284r654r400q974q258p738p688
50193H79710p677p159o124m914l789k953k754l378m360m769m105k785j624j002
$$ y = [1312111, 1286426, 1267173, 1253904, 1245712, 1241794, 1241930, 1245898, 1252661, 1260833, 1270041, 1281174, 1295001, 1310966, 1327690, 1344329, 1361031, 1378302, 1396482, 1415871, 1436929, 1460017, 1485097, 1511797, 1539597, 1567664, 1594622, 1618862, 1639358, 1656186, 1670149, 1681991, 1692007, 1700174, 1706277, 1709855, 1710295, 1707173, 1700417, 1690012, 1675679, 1656997, 1633859, 1606835, 1577285, 1547211, 1518733, 1493304, 1471251, 1452041, 1434910, 1419156, 1403967, 1388172, 1370369, 1349420, 1325058, 1298097, 1269897, 1241522, 1213476, 1186159, 1160190, 1136058, 1113702, 1092758, 1073027, 1054475, 1036968, 1020400, 1004958, 990837, 977755, 965176, 953018, 941706, 931422, 921768, 912368, 903394, 895136, 887398, 879710, 872033, 864874, 858750, 853836, 850047, 847094, 844340, 840962, 836602, 831833, 827728, 824943, 823319, 822317]
50179H22317p34o66r53j659k362k539k180j765j612j543j174l28Q17J826K252
50164H09697K055J719J728K051K409K881L781N069O362P529Q744R937J0892J1966
50150H86820J4005J7150K0537K3504K6413K9686L2844L5288L7507M0498M4320
50139A208572M8048N1073N3594N5766N7203N7457N6468N4437N1706M8788M6046
50128A789158M3329M0320L7033L3424K8694K1753J2398J421j0388k2515l4007
50117A940620m3531n0528n5633n9470o1752o2016o0604n8251n5101n0835m5571
50106A337328m0114l5219l1050k7372k4065k1421j9858j9309j8966j8023j6546
50095A065385j5270j4600j4225j3733j2965j1778j0128q484p469o853n651l583
$$ y = [822317, 821583, 820917, 819964, 818305, 815943, 813404, 811224, 809459, 807847, 806304, 805130, 804802, 805619, 807445, 809697, 811752, 813471, 815199, 817250, 819659, 822540, 826321, 831390, 837752, 845281, 854025, 863962, 874854, 886820, 900825, 917975, 938512, 962016, 988429, 1018115, 1050959, 1086247, 1123754, 1164252, 1208572, 1256620, 1307693, 1361287, 1417053, 1474256, 1531713, 1588181, 1642618, 1694324, 1743112, 1789158, 1832487, 1872807, 1909840, 1943264, 1971958, 1993711, 2006109, 2007530, 1997142, 1974627, 1940620, 1897089, 1846561, 1790928, 1731458, 1669706, 1607690, 1547086, 1488835, 1433734, 1382899, 1337328, 1297214, 1261995, 1230945, 1203573, 1179508, 1158087, 1138229, 1118920, 1099954, 1081931, 1065385, 1050115, 1035515, 1021290, 1007557, 994592, 982814, 972686, 964202, 956733, 949880, 944229, 940646]
50083I40646j593n05N3P84J615K276L221M899O654P511P760Q571J0121J1288J1423
50068A014724J1187J1212J1011R920Q349P219O586N651M040K300J026O9j113k595
50054A089586l871m558m854n133n310m975m104l213k676k290j709q74K58J969
50040A048246M323O770Q720J0250J1753J3206J4442J5840J7936K0413K2379K3634
50028A217912K4883K6471K7863K8673K9413L0637L2052L3079L3744L4341L4630
50017A553698L4119L2912L1524K9985K7650K3944J8863J2913O910J781j961m612
50005A767726o863r141j1734j5297k0497k7048l3639l9173m3581m7219m9862n0821
49993A412851m9855m7499m4442m0984l7190l3285k9668k6650k4346k2778k1871
$$ y = [940646, 939053, 938548, 938601, 939385, 941000, 943276, 946497, 951396, 958050, 965561, 973321, 981892, 992013, 1003301, 1014724, 1025911, 1037123, 1048134, 1058054, 1066403, 1073622, 1080208, 1085859, 1089899, 1092199, 1093225, 1093294, 1092181, 1089586, 1085715, 1081157, 1076303, 1071170, 1065860, 1060885, 1056781, 1053568, 1050892, 1048602, 1046893, 1046019, 1046277, 1048246, 1052569, 1059339, 1068059, 1078309, 1090062, 1103268, 1117710, 1133550, 1151486, 1171899, 1194278, 1217912, 1242795, 1269266, 1297129, 1325802, 1355215, 1385852, 1417904, 1450983, 1484727, 1519068, 1553698, 1587817, 1620729, 1652253, 1682238, 1709888, 1733832, 1752695, 1765608, 1772518, 1774299, 1772338, 1767726, 1760863, 1751722, 1739988, 1724691, 1704194, 1677146, 1643507, 1604334, 1560753, 1513534, 1463672, 1412851, 1362996, 1315497, 1271055, 1230071, 1192881, 1159596, 1129928, 1103278, 1078932, 1056154, 1034283]
49982A034283k1334k0802k0172j9606j9047j8016j6183j3946j2088j0911j0117
49971H52061r443q855q111o805n126m038m229n276o211o497o059m880l260k052
49957G71219j794j781q85Q07K105K531K950M053N208N491N044M542L953K793J213
49942H07449j42j203k389l508l746l087k767l816n771p443q356q830r095r094
49928G38202r008r186r529r493q812p733o470m986l478k479k162j913j049K99
49914F62203J462K184K834L723M657N263N434N360N372N823O840Q044Q776Q751
49900G36726Q314P939P678P300O714N979N060L867K502J183r0j580l451n567p674
$$ y = [1034283, 1012949, 992147, 971975, 952369, 933322, 915306, 899123, 885177, 873089, 862178, 852061, 842618, 833763, 825652, 818847, 813721, 809683, 805454, 800178, 793967, 787470, 781411, 776531, 773271, 771219, 769425, 767644, 766759, 767566, 769671, 772202, 775152, 779205, 784413, 789904, 794948, 799490, 803443, 806236, 807449, 807307, 806104, 803715, 800207, 796461, 793374, 790607, 786791, 781020, 773577, 765221, 756391, 747296, 738202, 729194, 720008, 710479, 700986, 692174, 684441, 677971, 672985, 669507, 667028, 664866, 662953, 661904, 662203, 663665, 665849, 668683, 672406, 677063, 682326, 687760, 693120, 698492, 704315, 711155, 719199, 727975, 736726, 745040, 752979, 760657, 767957, 774671, 780650, 785710, 789577, 792079, 793262, 793172, 791592, 788141, 782574, 774900]
$$ [...]
##END NTUPLES=NMR SPECTRUM
##END=
