##TITLE=AC1711_ROEFFECT0030_8638305_pRosKhz5V2
##JCAMPDX= 6.0         $$ Bruker NMR JCAMP-DX V2.0
##DATA TYPE= NMR SPECTRUM
##DATA CLASS= NTUPLES
##ORIGIN= BRUKER
##OWNER= Administrator
$$ 1.72 TOPSPIN		Version 2.1
$$ 2014-05-23 00:12:36.953 -0700  Administrator@X
$$ Compression mode = diff/dup
##.OBSERVE FREQUENCY= 400.02188249412
##.OBSERVE NUCLEUS= ^1H
##.ACQUISITION MODE= SIMULTANEOUS (DQD)
##.ACQUISITION SCHEME= undefined
##.AVERAGES= 8
##.DIGITISER RES= 22
##SPECTROMETER/DATA SYSTEM= spect
##.PULSE SEQUENCE= zg30
##.SOLVENT NAME= COFFEE_meoh
##.SHIFT REFERENCE= INTERNAL, COFFEE_meoh, 1, 14.98509
##AUDIT TRAIL= $$ (NUMBER, WHEN, WHO, WHERE, PROCESS, VERSION, WHAT)
$$ ##TITLE= Audit trail, TOPSPIN		Version 2.1
$$ ##JCAMPDX= 5.01
$$ ##ORIGIN= Bruker BioSpin GmbH
$$ ##OWNER= Administrator
$$ $$ E:\/data/COFFEE/nmr/AC1711_ROEFFECT0030_8638305_pRosKhz5V2/10/pdata/1/auditp.txt
$$ ##AUDIT TRAIL=  $$ (NUMBER, WHEN, WHO, WHERE, PROCESS, VERSION, WHAT)
(   1,<2014-05-23 00:12:30.344 -0700>,<Administrator>,<X>,<go>,<TOPSPIN 2.1>,
      <created by zg
	started at 2014-05-23 00:11:24.282 -0700,
	POWCHK enabled, PULCHK disabled,
       configuration hash MD5:
       C8 4E 4E 5D D3 5C D8 9E 9F 52 82 E0 59 8A DE 15
       data hash MD5: 64K
       EE EA 0A F2 B5 75 1A 92 A2 6D A2 FF 58 B0 61 5D>)
(   2,<2014-05-23 00:12:33.360 -0700>,<Administrator>,<X>,<proc1d>,<TOPSPIN 2.1>,
      <Start of raw data processing
       efp LB = 0 FT_mod = 6 PKNL = 1 PHC0 = 0 PHC1 = 0 SI = 32K 
       data hash MD5: 32K
       D7 42 FC 8E AF D8 5C 30 08 DB C4 8B 28 78 7F 47>)
(   3,<2014-05-23 00:12:33.657 -0700>,<Administrator>,<X>,<proc1d>,<TOPSPIN 2.1>,
      <pk PHC0 = 92.94983 PHC1 = 0 
       data hash MD5: 32K
       62 35 56 C8 7D BD 0E 09 9A 16 D6 E2 EA 7A 97 52>)
(   4,<2014-05-23 00:12:33.766 -0700>,<Administrator>,<X>,<proc1d>,<TOPSPIN 2.1>,
      <abs ABSG = 1 
       data hash MD5: 32K
       FB 9A DB 36 72 01 B5 EC 36 18 2C 87 7D 23 A4 68>)
(   5,<2014-05-23 00:12:33.813 -0700>,<Administrator>,<X>,<proc1d>,<TOPSPIN 2.1>,
      <abs ABSG = 2 
       data hash MD5: 32K
       15 AB F2 76 B4 6E 59 F6 5E CB 47 A8 98 6A 18 5F>)
(   6,<2014-05-23 00:12:33.875 -0700>,<Administrator>,<X>,<proc1d>,<TOPSPIN 2.1>,
      <abs ABSG = 3 
       data hash MD5: 32K
       68 5A DC 7C 01 DE E1 20 45 30 61 D0 7A 59 99 7D>)
(   7,<2014-05-23 00:12:33.938 -0700>,<Administrator>,<X>,<proc1d>,<TOPSPIN 2.1>,
      <abs ABSG = 4 
       data hash MD5: 32K
       BD AD 67 7F 44 91 D7 57 94 31 1A EA 68 CB 87 13>)
(   8,<2014-05-23 00:12:33.985 -0700>,<Administrator>,<X>,<proc1d>,<TOPSPIN 2.1>,
      <abs ABSG = 5 
       data hash MD5: 32K
       3D C2 21 C9 7B EC E0 64 37 89 92 89 8B 3F 38 B1>)
$$ ##END=
$$ 
$$ $$ hash MD5
$$ $$ 91 EF D3 73 D4 90 12 A8 AA 6C FD 49 A6 F2 92 8B
##$RELAX= 
##$RELAX= 
##$RELAX= 
##$RELAX= 
##$RELAX= 
##$RELAX= 
##$RELAX= 
$$ Bruker specific parameters
$$ --------------------------
##$DU= <E:\>
##$EXPNO= 10
$$ [...]
##$TP= (0..7)
150 150 150 150 150 150 150 150
##$TP07= 0
##$TPNAME0= <>
##$TPNAME1= <>
##$TPNAME2= <>
##$TPNAME3= <>
##$TPNAME4= <>
##$TPNAME5= <>
##$TPNAME6= <>
##$TPNAME7= <>
##$TPOAL= (0..7)
0.5 0.5 0.5 0.5 0.5 0.5 0.5 0.5
##$TPOFFS= (0..7)
0 0 0 0 0 0 0 0
##$TUNHIN= 0
##$TUNHOUT= 0
##$TUNXOUT= 0
##$USERA1= <user>
##$USERA2= <user>
##$USERA3= <user>
##$USERA4= <user>
##$USERA5= <user>
##$V9= 5
##$VALIST= <valist>
##$VCLIST= <CCCCCCCCCCCCCCC>
##$VD= 0
##$VDLIST= <DDDDDDDDDDDDDDD>
##$VPLIST= <PPPPPPPPPPPPPPP>
##$VTLIST= <TTTTTTTTTTTTTTT>
##$WBST= 2048
##$WBSW= 25
##$XGAIN= (0..3)
0 0 0 0
##$XL= 0
##$YL= 0
##$YMAX_a= 654747
##$YMIN_a= -554088
##$ZGOPTNS= <>
##$ZL1= 120
##$ZL2= 120
##$ZL3= 120
##$ZL4= 120
##$ABSF1= 14.98509
##$ABSF2= -5.573092
##$ABSG= 5
##$ABSL= 3
##$ALPHA= 0
##$AQORDER= 0
##$ASSFAC= 0
##$ASSFACI= 0
##$ASSFACX= 0
##$ASSWID= 0
##$AUNMP= <proc_prof1d_extract_pilot.lims>
##$AXLEFT= 0
##$AXNAME= <>
##$AXNUC= <1H>
##$AXRIGHT= 0
##$AXTYPE= 0
##$AXUNIT= <>
##$AZFE= 0.1
##$AZFW= 0.1
##$BCFW= 0
##$BC_mod= 0
##$BYTORDP= 0
##$COROFFS= 0
##$CY= 15
##$DATMOD= 1
##$DC= 0
##$DFILT= <>
##$DTYPP= 0
##$F1P= 0
##$F2P= 0
##$FCOR= 0.5
##$FTSIZE= 32768
##$FT_mod= 6
##$GAMMA= 0
##$GB= 0
##$INTBC= 1
##$INTSCL= 1
##$ISEN= 128
##$LB= 0
##$LEV0= 0
##$LPBIN= 0
##$MAXI= 10000
##$MC2= 0
##$MEAN= 0
##$ME_mod= 0
##$MI= 0
##$NCOEF= 0
##$NC_proc= -8
##$NLEV= 6
##$NOISF1= 0
##$NOISF2= 0
##$NSP= 0
##$NTH_PI= 0
##$NZP= 0
##$OFFSET= 14.98509
##$PC= 1
##$PHC0= 92.94983
##$PHC1= 0
##$PH_mod= 1
##$PKNL= yes
##$PPARMOD= 0
##$PPDIAG= 0
##$PPIPTYP= 0
##$PPMPNUM= 2147483647
##$PPRESOL= 1
##$PSCAL= 4
##$PSIGN= 0
##$PYNMP= <proc.py>
##$REVERSE= no
##$SF= 400.02
##$SI= 32768
##$SIGF1= 0
##$SIGF2= 0
##$SINO= 400
##$SIOLD= 32768
##$SPECTYP= <>
##$SREGLST= <1H.CDCl3>
##$SSB= 0
##$STSI= 32768
##$STSR= 0
##$SW_p= 8223.68421052631
##$SYMM= 0
##$S_DEV= 0
##$TDeff= 65536
##$TDoff= 0
##$TI= <>
##$TILT= no
##$TM1= 0
##$TM2= 0
##$TOPLEV= 0
##$USERP1= <user>
##$USERP2= <user>
##$USERP3= <user>
##$USERP4= <user>
##$USERP5= <user>
##$WDW= 1
##$XDIM= 32768
##$YMAX_p= 465821355
##$YMIN_p= -723761
##$CURPLOT= <Network HP LaserJet P1505>
##$CURPRIN= <$Network HP LaserJet P1505>
##$DFORMAT= <normdp>
##$LAYOUT= <+/1D_H.xwp>
##$LFORMAT= <normlp>
##$PFORMAT= <normpl>
##$SURQMSG= 1
$$ End of Bruker specific parameters
$$ ---------------------------------
##NTUPLES= NMR SPECTRUM
##VAR_NAME=  FREQUENCY,     SPECTRUM/REAL,   SPECTRUM/IMAG
##SYMBOL=    X,             R,               I
##VAR_TYPE=  INDEPENDENT,   DEPENDENT,       DEPENDENT
##VAR_FORM=  AFFN,          ASDF,            ASDF
##VAR_DIM=   32768,         32768,           32768
##UNITS=     HZ,            ARBITRARY UNITS, ARBITRARY UNITS
##FACTOR=    0.250966925370066, 1,           1
##FIRST=     8223.43324360094, -16190,       -89144
##LAST=      0,             -180598,         41971
##MIN=       0,             -723761,         0
##MAX=       8223.43324360094, 465821355,    0
$$ Real data points
##PAGE= N=1
##DATA TABLE= (X++(R..R)), XYDATA
$$ [...]
19543A48336f5806L1566k68821i0154c5711j41425C0100d4930Q809l07652E7328
19531b28372A49652b35894A0467b19819A15614a38030a4009B65367c6570j50291
19521a86861o2000h7849A80421d5009k36389J03959E3565b30947Q7238A15803
19510A42797a36958A37765c2481k02998Q8280b0772G5269j3378a74742C1111J32889
19499A64000a3367o7383O855c3749r358l5794C48876B0374J37465a88386C24136
19487A78530a7250k33783k9838J11893k00054A56507d37811A5323J76758c2551
19476a21610e1519C3813a9213l11507A96173B4089J40428Q5993C554K80064c38275
19464b94949A67116k0840b47594b2466K548j90953A44152f6186C5015J62383a06393
$$ y = [148336, -65806, -34240, -303061, -90154, -35711, -177136, 30100, -44930, -36121, -343773, 57328, -228372, 149652, -235894, 10467, -219819, 115614, -138030, -14009, 265367, -36570, -186861, -248861, -87849, 180421, -45009, -281398, -177439, 53565, -230947, -143709, 115803, 142797, -136958, 137765, -32481, -235479, -147199, -20772, 75269, 61891, -174742, 31111, 164000, -13367, -80750, -73895, -33749, -43107, -78901, 348876, 20374, 157839, -188386, 324136, 178530, -17250, -251033, -280871, -168978, -369032, 156507, -437811, 15323, 192081, -32551, -121610, -51519, 33813, -19213, -330720, 196173, 24089, 164517, 250510, 3554, 283618, -338275, -294949, 167116, 146276, -247594, -22466, -19918, -210871, 144152, -66186, 35015, 197398, -106393]
19452b8209A8986J92217k8312a72212j44999n0125e3858B22371A5736h5560r0926
19441a76486O2169G0912b10037h0616p6405B35415b05997e7197A21162b46729
19430a21184l8485A20451c22694m1366A31028i5890k39590e1477j38947r043J1365
19419a88102j0517A34731a03267j9186k53031R2346B48160b17916k6360A94709
19408B9248R8277b1530l34164L7001P9564B0044J40685E8975J24300b54839a2080
19396d37884K04337D1997a67135c6758r5059b9303k21906l3408A40281b88235
19385B1784a78491b4847k37983B3269M7789M2494i6912K4379C4030d3672k1761
19374f5433H3751c77750Q9001B28229a24539J7091l9281c8239j18904A86273b23632
$$ y = [-28209, 18986, 211203, 182891, -172212, -317211, -367336, -53858, 222371, 15736, -85560, -176486, -114317, 70912, -210037, -80616, -157021, 235415, -205997, -57197, 121162, -246729, -121184, -159669, 120451, -322694, -364060, 131028, -95890, -335480, -51477, -190424, -199467, -188102, -198619, 134731, -103267, -122453, -375484, -283138, 248160, -217916, -244276, 194709, 29248, 127525, -21530, -355694, -318693, -239129, 20044, 160729, 58975, 183275, -254839, -12080, -437884, -233547, 41997, -167135, -36758, -131817, -29303, -251209, -284617, 140281, -288235, 21784, -178491, -24847, -262830, 23269, 71058, 113552, -96912, -72533, 34030, -43672, -65433, 83751, -377750, -288749, 228229, -124539, -107448, -146729, -38239, -157143, 186273, -223632]
19362d4789A92220e6225i018n21243J40530A06924b22514J10278o058J7546F5380
19350A23649C9650b713C02047p2443G8858N9611b29237o6940h0167n9330B767
19338a25278k82478f2006H6459b91664L3459B54858G1288J44926a63769j56261
19328c20030H0862g8099q9151E9597E266a57393A82149a48450A63081c54309L1257
19317c23052a1669j03719k7902c2361C8091J01690a29563D4148n296a72135g0444
19305F8607a37909E354g1437j44906l30274A41134b29621N9559A01568M759N7917
19294A64244a82560P5968m7800G985O5091J6481a36211A71891a82153B14985a19612
19282c18958D6726f7347j27989d189j91252c6785o34762a21081I6535g725j31669
$$ y = [-44789, 192220, -56225, -9018, -530261, -389731, 106924, -222514, -112236, -118294, -100748, 65380, 123649, 39650, -2713, 302047, 229604, 78858, 138469, -229237, -296177, -80167, -139497, 2767, -125278, -407756, -62006, 86459, -291664, -258205, 254858, 71288, 216214, -163769, -320030, 80862, -78099, -167250, 59597, 5266, -157393, 182149, -148450, 163081, -354309, -323052, -11669, -115388, -143290, -32361, 38091, 139781, -129563, 44148, 38852, -172135, -70444, 68607, -137909, 5354, -71437, -216343, -546617, 141134, -229621, -170062, 101568, 106327, 164244, -182560, -106592, -154392, 7985, 73076, 89557, -136211, 171891, -182153, 214985, -119612, -318958, 46726, -67347, -195336, -4189, -195441, -36785, -671547, -121081, 96535, -7725, -139394]
19271a39394l26123a55595g0569A89960a84870N6380O1731j54056C37233a19361
19260A24118J4373b4980m6736l17563B20748h8773C9623J68184e5001A58023b58270
19248c36199P5960A26690F2223b1046o3073B3000b08680g2319A93342a44245L7153
19237a07092j92317C15503g3566l62534h0702j23639H1863i2445C0965f8248A1971
19225c4625j54417b9736j46707A81719b26898l19285A43283c77653e4855j63847
19215b18702H7893L8775d01383B50714H6041R3323f5583J6248E747b16643B88458
19203A03780b34346b3799A52295o7457k2057a17614m8016A3718K7746a56217c2092
19191a71758H5037P930B278a40526j17602a08824D3662j7430d3953B27776C5821
$$ y = [-139394, -465517, -155595, -70569, 189960, -184870, -128490, -66759, -220815, 337233, -119361, 124118, 138491, -24980, -71716, -389279, 220748, -88773, 39623, 207807, -55001, 158023, -258270, -336199, -260239, 126690, 62223, -21046, -84119, 23000, -208680, -72319, 193342, -144245, -107092, -299409, 315503, -73566, -436100, -80702, -204341, 81863, -92445, 30965, -68248, 11971, -34625, -189042, -29736, -176443, 181719, -226898, -546183, 143283, -377653, -54855, -218702, 87893, 126668, -401383, 250714, 86041, 179364, -65583, -49335, 5747, -216643, 288458, 103780, -234346, -23799, 152295, 84838, 62781, -117614, -165630, 13718, 41464, -156217, -32092, -171758, 85037, 92967, 2278, -140526, -258128, -108824, 43662, 26232, -43953, 227776, 35821]
19179a50475N6373A42267C8898i2183J8083h902j46031e0346A95527d00573J95615
19168b04958A69205a63153G0916a01062A05562N6172m0204a86175k65164a54476
19157a95787e6879q7957K5061C50409p4387B3617J51536D5038a57204q6836K0451
19146b23589P4796k10512H2267P0801J44786a23121k5854A05590h1243c6484j29386
19135a65870B88858b37187h7040B63356I9036L0263a53923l3224j64975B188g0208
19123D0808j764c82169D9859J9697k7960L9346L3594E1948J25866f3026n4077
19112a17103b9876p1995j55172h4554k46349a27931c7625l03903d4553n8070L7216
19101f5407j34985N3281q8079C85919b42745c6473A77735o4122b2403n8282f480
$$ y = [-150475, -94102, 142267, 38898, -92183, -74100, -8902, -154933, -50346, 195527, -400573, -204958, 169205, -163153, 70916, -101062, 105562, 161734, 121530, -186175, -451339, -154476, -195787, -56879, -144836, -119775, 350409, 276022, 23617, 175153, 45038, -157204, -244040, -223589, -148793, -359305, 82267, 153068, 297854, -123121, -148975, 105590, -81243, -36484, -165870, 288858, -237187, -87040, 263356, 99036, 129299, -153923, -187147, -352122, 2188, -70208, 40808, 39044, -382169, 49859, 69556, 41596, 80942, 114536, 51948, 177814, -63026, -117103, -29876, -101871, -257043, -84554, -330903, -127931, -37625, -341528, -44553, -102623, -65407, -200392, -147111, -235190, 385919, -242745, -36473, 177735, 113613, -22403, -80685, -6480]
19089c52609G319h8704k8910B00412c69541Q3135F532c5051j93613q8965C17316
19077h1352k45100A00218a6849B3118l773a60398g0484o2996J7435L4627G1026
19065d81213a51224B16051g8270k09241Q8331A67139M2105q9570B9241b41537
19054a65166r678M6322C212J82796P6519h0982a8083j49259J6346o3481G9273
19042b06852B40913a13046a8617A91451b3640k21187a08027H829J46602A502a9888
19030B37117b3908j20792A39929O0946p9122h4895A9810a03215A91040a54001
19019I8338O8601A580J23136A7774Q4202a50361O9873m4568A07713a76318B4050
19007c3404k93513c3000r8546j54429J29482a6528F1181k3543i4415c999k33175
$$ y = [-352609, 7319, -88704, -117614, 200412, -369541, -286406, 6532, -35051, -228664, -317629, 317316, -81352, -326452, 100218, -16849, 23118, 19345, -160398, -70484, -133480, -116045, -81418, 71026, -481213, -151224, 216051, -78270, -287511, -199180, 167139, 209244, 119674, 29241, -241537, -165166, -174844, -128522, 3212, 186008, 262527, -80982, -18083, -167342, -150996, -214477, 79273, -206852, 240913, -113046, -18617, 191451, -23640, -244827, -108027, 8829, 155431, 1502, -19888, 237117, -23908, -144700, 139929, 200875, 121753, -84895, 19810, -103215, 191040, -154001, 98338, 166939, 1580, 124716, 17774, 101976, -150361, -80488, -125056, 107713, -176318, 24050, -33404, -326917, -33000, -131546, -285975, -156493, -16528, 61181, 37638, -94415, -3999, -237174]
18996b37174B9250K2782A8508a62884j00691G405a21526j7726A91317G0662a59474
18984g19j12262j19847a09098B9439a43292l8366l3230m8566j37312B275i0038
18972b67398f9277b4529I1449b14008P3403A38667b55742b2891F9484L98A3902
18960h8672j10182c8585C34213A35754r87N6046e9896j97248g8901A77607A9739
18948A9065J82586K4872a16241I3004b25844O2895e1552o9051B61419d8445k10929
18937b59374A60356a70249A6247a8632j99141h5273k53213c4972q5938c5667B99708
18925A00019b29785E0022b808A25325R1632a93050g9913K684o1783k69131f1785
18913A21740d5172B89974H6318a08869D6380J62676h3839j09631B78367i5670
$$ y = [-237174, 29250, 52032, 18508, -162884, -263575, 7405, -121526, -139252, 191317, 70662, -159474, -719, -112981, -232828, -109098, 29439, -143292, -181658, -214888, -263454, -400766, 2275, -90038, -267398, -69277, -24529, 91449, -214008, -140605, 138667, -255742, -22891, 69484, 69882, 13902, -88672, -198854, -38585, 334213, 135754, 134767, 190813, -59896, -257144, -78901, 177607, 19739, 19065, 201651, 226523, -116241, 93004, -225844, -162949, -51552, -120603, 261419, -48445, -259374, 160356, -170249, 16247, -18632, -217773, -85273, -338486, -34972, -120910, -35667, 299708, 100019, -229785, 50022, -2808, 125325, 216957, -193050, -79913, -77229, -139012, -408143, -61785, 121740, -45172, 289974, 86318, -108869, 46380, 209056, -83839, -193470, 278367, -95670]
18902D8201a30724f503A6714i0694q0647k63851C4261c0091j31616C48855E2076
18890b11058Q8297C10261d2799C55401G1415a55643b2180k5538B19033b10134
18879a16933H377a17589i845o5877p5677A07639c62135H75b96627B96815a9132
18867B9575b80006B23287a37834c9582r3209p2943L8582k18160A87619a66755
18856c64526A6425b03750B61035b00270R569C72980P3051e4484H4064K44893b02397
18844A44543b4566A8986a38072O7841j13824a6105j59490q8098F8995d9739I5778
18832a57343A32465j1334m8632Q0023b02390c6804r1127k211j5609o8102C0996
18820B01674b85470I0218J77459a23056l434j04273d1431p7719A77900a25366
$$ y = [48201, -130724, -6503, 16714, -90694, -171341, -435192, 34261, -30091, -161707, 348855, 52076, -211058, -122761, 310261, -42799, 355401, 71415, -155643, -22180, -47718, 219033, -210134, -116933, 8377, -117589, -9845, -75722, -151399, 107639, -362135, 875, -296627, 296815, -19132, 29575, -280006, 223287, -137834, -39582, -132791, -205734, -167152, -385312, 187619, -166755, -364526, 16425, -203750, 261035, -200270, -190701, 372980, 446031, -54484, 84064, 328957, -202397, 144543, -24566, 18986, -138072, -70231, -184055, -16105, -175595, -263693, 68995, -49739, 95778, -157343, 132465, 121131, 72499, 152522, -202390, -36804, -127931, -130142, -145751, -213853, 30996, 201674, -285470, 90218, 267677, -123056, -126490, -230763, -41431, -119150, 177900, -125366]
18809C64116b35320i0949r5698B47726C8838L37711d5424r7342M30j0710O5519
18798h7527F6059A6992h3417E7572a50111M8664F1233a27554l42686D13104a33775
18786D0807a11611p813e3203A75422j3973a0167m677A1410J84b14437A42189d83062
18773a41275j82185A01374g2238j36081f8781q9979c5694j77177K3624e5752B30453
18761a39050O5647k5126m700c7429k30401A04958A1487b9667j29611f3638r5798
18750a59436e4971C04494b53180G0246g3539j86806H705c09696I4330C6458c07506
18738b68974A55927d52357a20198b2064A68559q0789e6316j7091J4401H4416b38825
18726b85854d176p5911R597q0458B65639b85164A9768J08194B0946a17357p4624
$$ y = [364116, -235320, -90949, -186647, 247726, 38838, 376549, -45424, -142766, -142336, -153046, -87527, 66059, 16992, -83417, 57572, -150111, -101447, 61233, -127554, -470240, 413104, -133775, 40807, -111611, -119424, -53203, 175422, 161449, -10167, -14844, 11410, 11594, -214437, 142189, -483062, -141275, -323460, 101374, -72238, -208319, -68781, -158760, -35694, -212871, -189247, -55752, 230453, -139050, -73403, -98529, -103229, -37429, -267830, 104958, 11487, -29667, -159278, -63638, -159436, -54971, 304494, -253180, 70246, -73539, -260345, 8705, -309696, 94330, 36458, -307506, -268974, 155927, -452357, -120198, -22064, 168559, 87770, -56316, -73407, -59006, 84416, -238825, -285854, -4176, -80087, -70490, -150948, 265639, -285164, 19768, 127962, 20946, -117357, -191981]
18715a91981A06596a79144Q4636B04216a64460p008G7184K5961K2170a94034d9624
18703B28607b5491A39629b51577c0403G6587R9375b01777D10669a28391a9977
18692d2114k35286c5462d05q1443j38531A72137d28808H3198M0415J02923c5096
18680A12557b23662A09087O9814a66482m194M1791B44571a17770j39963C1819
18669A00699L07401a78127j22939f5453j37290d1280A14960a77473P3038G4726
18658g3773k30081g2705B5562c80359N256f630k8808D5465a68425e3984b3658
18646c76020A35086i786C3304M1183k1197f834j74255A4099a26397j4025C9706
18634d00932i4837j30008l3645g1915a6976O777c815j28670G1682J00428F8481
$$ y = [-191981, 106596, -179144, -94508, 204216, -164460, -171468, 77184, 103145, 125315, -194034, -49624, 228607, -25491, 139629, -251577, -30403, 76587, 175962, -201777, 410669, -128391, -19977, -42114, -277400, -35462, -405, -81848, -220379, 172137, -428808, 83198, 123613, 226536, -35096, 112557, -223662, 109087, 178901, -166482, -170676, -128885, 244571, -117770, -257733, 31819, 100699, 408100, -178127, -301066, -65453, -202743, -41280, 114960, -177473, -104435, 74726, -73773, -303854, -72705, 25562, -380359, -375103, -6630, -35438, 45465, -168425, -53984, -23658, -376020, 135086, -9786, 33304, 74487, 53290, -6834, -181089, 14099, -126397, -140422, 39706, -400932, -94837, -224845, -258490, -71915, -16976, -10199, -3815, -132485, 71682, 172110, 68481]
18622h8195n888k88466a29236A63712b03450j3080A24742a89087q6199A01387
18611h6102E1428f6930j11028F455O4696J72970d3854H079a31971j09589b0838
18599a86586B84038a54004k9360A51374c40203J28634m1986B01965C9908a440
18588D7937l17f4515j86088A26269a38855B16751a01777c2369k14656D8450J16124
18577A64574N6491R0245b45746e4101F3679c30284L0667J36112k07813E0153K2889
18566G3042K48513I744k915b31456g0287k28012J6182q2905a60872j21466h2141
18554G3932f8450E91182f6298m0500n0011k07260g1492q266j28892e2526C4487
18542A49935f317j51954g1085l96330a28413A32115f1676j72553e0838H5736L6711
$$ y = [-88195, -94083, -382549, -129236, 163712, -203450, -216530, 124742, -189087, -275286, 101387, -86102, 51428, -66930, -177958, 6455, 71151, 244121, -43854, 8079, -131971, -241560, -20838, -186586, 284038, -154004, -183364, 151374, -340203, -211569, -253555, 201965, 39908, -1440, 47937, 47620, -64515, -250603, 126269, -138855, 216751, -101777, -32369, -247025, 48450, 164574, 221065, 311310, -245746, -54101, 63679, -330284, -299617, -163505, -371318, 50153, 73042, 321555, 9744, 6829, -231456, -70287, -298299, -282117, -365022, -160872, -282338, -82141, 73932, -68450, 591182, -66298, -106798, -156809, -364069, -71492, -79758, -208650, -52526, 34487, 149935, -6317, -158271, -71085, -467415, -128413, 132115, -61676, -234229, -50838, 85736, 122447]
18531A22447g2069k79100e9489J9043r1468C4923c4639E100a83678j290j30588
18520c15556J7636B62888p5357d89188D1239K2530d1179j86078C7728E05c22878
18508G8587a4519o0714n8754k73499A53809a76669q5662Q4696B02673a35303I2740
18496B33266p8711h7539j1750k29008A32628h1191G0164a52929L7393M1232j56187
18485b30491K5824A55515a29430B28658a26268o403r5043C9781a25684A04793
18474f3032k1461L4880A3201c95925A77217j9694F0215h4999A75573b38561a00318
18462c85579C1268b08626A31374d038r5455A31069d3573a1208B06468a34370O4640
18451f9730A4500d7091G9933h7412M1221p1535B41350i7041A30813C6108b14469
$$ y = [122447, -72069, -351169, -59489, -40446, -131914, 34923, -34639, 5100, -183678, -184968, -315556, -297920, 262888, 187531, -489188, 41239, 63769, -41179, -227257, 37728, 505, -322878, 78587, -14519, -75233, -133987, -407486, 153809, -176669, -262331, -177635, 202673, -135303, 92740, 233266, 154555, -87539, -99289, -328297, 132628, -81191, 70164, -152929, -115536, -74304, -230491, -204667, 155515, -129430, 228658, -126268, -132671, -227714, 39781, -125684, 104793, -63032, -84493, -49613, 13201, -395925, 177217, 157523, 60215, -84999, 175573, -238561, -100318, -385579, 31268, -208626, 131374, -4038, -99493, 131069, -43573, -11208, 206468, -134370, -69730, 14500, -47091, 79933, -87412, -46191, -117726, 241350, -97041, 130813, 36108, -214469]
18439F8357C2775b23912a4640q9555o1605j13554J23452A6068M15543b8722A3355
18427A36766J00786N0991a04379l5259M8527C23015b56805A14960E3567J27176
18417A80743a58512M2408M69k56287I7528B4640i2357C7513N9151B7692J36699
18406A64391b50394I0809K53265B3358J84052a87224j05469J45336N3789E4316
18395h8059K7475q1838j31532a12868F382J2786J88335p0116F2454a90691j47114
18384c37805j29587B56259p5962O8965a68643C2283a30926A28180a10600q959
18374a19559A64143a10351C4887K69317e0191o6151M8935I5030a85619B61970
18363h2488j81971A94387a23251D1824J78336b20289L2098C4121J88976a71347
$$ y = [68357, 32775, -223912, -14640, -104195, -165800, -279354, -155902, 16068, 431611, -28722, 13355, 136766, 237552, 288543, -104379, -139638, -91111, 323015, -256805, 114960, 53567, 180743, -158512, -116104, -115635, -371922, 97528, 24640, -92357, 37513, 96664, 27692, 164391, -250394, 90809, 344074, 23358, 207410, -187224, -292693, -147357, -93568, 54316, -88059, -60584, -142422, -273954, -112868, 6382, 19168, 207503, 137387, 62454, -190691, -337805, -467392, 256259, 180297, 249262, -168643, 32283, -130926, 128180, -110600, -119559, 164143, -110351, 34887, 304204, -50191, -116342, -67407, 95030, -185619, 261970, -82488, -264459, 194387, -123251, 41824, 220160, -220289, -188191, 34121, 223097, -171347]
18352A31968k3990i5987R569B3023M67732a16940A27964H505a95411G8518b37137
18340f0551A22654a62232B01173a23915M4911A2887a31078L4020H2402I042a08018
18328A20650a05965b0059l13793a5747j10573j58283b669r3904A87758q6251c08028
18316A64338a70153c3784A2601J90012H2143P8558a46511b0414j01151B97047
18305h3592l8029K4935k93925J04907o2080B12702N069a78871f5834j278j1488
18294g8600B10835N558c8265P866E5815a73544C01127L54195c0226A64686f3542
18282H7286c24727c1797B22651q708o6184m6241b29222q1704D7850a80256k0784
18271b01040c9547C0400J26161C1478b6017A94533q3307a58125C3933i2103o2545
$$ y = [131968, 107978, -95987, -86418, 23023, 490755, -116940, 127964, 8505, -195411, 78518, -237137, -60551, 122654, -162232, 201173, -123915, -79004, 12887, -131078, -97058, 82402, 9042, -108018, 120650, -105965, -20059, -333852, -15747, -126320, -284603, -2669, -96573, 187758, 101507, -308028, 164338, -170153, -33784, 12601, 202613, 82143, 160701, -146511, -20414, -121565, 297047, -83592, -121621, -96686, -390611, -285704, -347784, 212702, 217771, -178871, -65834, -67112, -78600, 210835, 216393, -38265, -30399, 55815, -173544, 301127, 655322, -30226, 164686, -63542, 87286, -324727, -31797, 222651, 213943, 147759, 101518, -229222, -310926, 47850, -180256, -201040, -39547, 30400, 156561, 31478, -26017, 194533, 111226, -158125, 33933, -92103, -154648]
18260a54648A45336b39080M8625j29006A73468b30373d8980o7031A69621c33870
18249a6941H8482J6670i4166D1093a48045H2491I133c42189d7668G1773a53592
18237a372B21977a62906A48189a12092d2463j66850B4059b73968R6031p8215j2886
18226b69038N1260i3203r4550d8076j24078e7074m957A49231Q1549j13280J36874
18215B54374d1978B1963g8552A91333a68924f1562j27694A77119j6009f8684K9777
18204c8907k42788G4956j0964b33887K826f991B8463a65797J1923B20396a11292
18192B279b37235i7459D4208h0931A08743a94973r3042D480a96266A79235E5281
18180b14858O7584H1306b06850f7965l518i139A66032o8740l7378d36290a39729
$$ y = [-154648, 145336, -239080, -190455, -319461, 173468, -230373, -48980, -116011, 169621, -333870, -16941, 88482, 105152, -94166, 41093, -148045, 82491, 9133, -342189, -47668, 71773, -153592, -1372, 221977, -162906, 148189, -112092, -42463, -209313, 24059, -273968, -177937, -256152, -269038, -217778, -93203, -187753, -48076, -172154, -57074, -62031, 149231, 230780, 117500, 254374, -41978, 21963, -78552, 191333, -168924, -61562, -189256, 177119, 161110, -68684, -38907, -281695, 74956, 63992, -233887, -231061, -6991, 28463, -165797, -153874, 220396, -111292, 2279, -237235, -97459, 44208, -80931, 108743, -194973, -288015, 4480, -196266, 179235, 55281, -214858, -147274, 81306, -206850, -67965, -71483, -9139, 166032, 97292, 59914, -436290, -139729]
18168A77943c18904c9750B01967c97383J81868D10111b34032J439G4797l4605
18158D0192J35660p2387a07995j32674Q0456A3626g790H2247G335b2526B57223
18146c5273H5219g962k70784a29407C7374L79287A09391h0988A3485g0680I9078
18134B5540e83307D928L84602B1677a35035A00827b94343a33531A88022a89140
18123a33965j02992e718A45773g9924k25366B13805c00639e0988B2171b3436k16745
18112b40181A00817C9575f3075r9898J2859o3800a4504A39705b58597J3933i9780
18100a14771k46558g3618e933j60216j3627B14838F611K795M3105M2498b19577
18088a76924Q5040K8401k03975a07895m3474M9820G9903b28336B91768a05071
$$ y = [177943, -318904, -39750, 201967, -397383, -215515, 410111, -234032, -232593, 74797, 40192, 175852, 103465, -107995, -240669, -160213, 13626, -7790, 82247, 7335, -22526, 257223, -35273, 85219, -7962, -278746, -129407, 37374, 416661, 109391, -80988, 13485, -70680, 99078, 25540, -583307, 4928, 389530, 21677, -135035, 100827, -294343, -133531, 188022, -189140, -133965, -236957, -5718, 145773, -79924, -305290, 213805, -300639, -50988, 22171, -23436, -240181, 100817, 39575, -63075, -162973, -150114, -213914, -14504, 139705, -258597, -244664, -99780, -114771, -361329, -73618, -5933, -166149, -179776, 214838, 6611, 9406, 52511, 95009, -219577, -176924, -91884, -63483, -267458, -107895, -151369, -101549, 79903, -228336, 291768, -105071]
18077B4915a1511C99763h5888B3461a68622n4588C6024a85246j7919A50150O1412
18066B11562m0567L1852j0623E2373L6584b02714j53118A29252K2991R1084h5207
18054d6957B33744b42451B90782F834b21615F736b26509H4737f9155B66120a432
18042C4880a68341l1061E6188b16151h7805C0210c22882B23406F0847a61691k10403
18031c72094J15215g0371A28306K10010D374R2391L7171D5279j9915a59919A08788
18019b34151n1272i0035A47818a19402A55215a0082j35497a4262E8609c9579A66260
18007g9039q7462l709L0634a0579A2685c14075A53695b48056i9324r952f126j16343
17995a22469K5526B46340c02573i1566D800b16710C456P9456l5479J93989L574
$$ y = [24915, -11511, 399763, -85888, 23461, -168622, -223210, 36024, -185246, -203165, 150150, 211562, 170995, 202847, 192224, 52373, 88957, -202714, -355832, 129252, 152243, 243327, -85207, -46957, 233744, -242451, 290782, 6834, -221615, 6736, -226509, 84737, -69155, 266120, -1432, 34880, -168341, -199402, 56188, -216151, -87805, 30210, -322882, 223406, 60847, -161691, -372094, -256879, -70371, 128306, 338316, 4374, 96765, 133936, 45279, 25364, -159919, 108788, -234151, -285423, -90035, 147818, -119402, 155215, -10082, -145579, -14262, 58609, -39579, 166260, -79039, -166501, -170210, -139576, -10579, 12685, -314075, 153695, -248056, -99324, -109276, -6126, -122469, -96943, 246340, -302573, -91566, 4800, -216710, 3456, 82912, 47433, 241422, 244996]
17984B44996a22615D2755L42926A62092b43663I0029b246F2393c4988p9942B6071
17972A08811J12718D8125a88800A26612e3010j8936a4831A64895a71386I3403
17961A3709J53531J9291D025J31419g9331I560a43975H2957C7949a47841C84395
17949A67057a48485B26886A0756a67478B74372C5878J17601b1308I5443B4797
17938i2501A69053a75762A34647d8456A51984J30876Q379b3798r6524A5609L56228
17927C71837a31258j99894J21386r3395a1449j26763F9192a4619m22401d2276
17916c66619I9203f4918k582j71618f915A66258a92498B75337c4050H0719a57128
17904A26768a01266A4631c7149B26701a61243A03800a14796j8697j31088d7344
$$ y = [244996, -122615, 42755, 385681, 162092, -243663, 90029, -2246, 62393, -34988, -114930, 26071, 108811, 221529, 48125, -188800, 126612, -53010, -71946, -14831, 164895, -171386, 93403, 13709, 167240, 186531, 4025, 135444, -79331, 9560, -143975, 82957, 37949, -147841, 384395, 167057, -148485, 226886, 10756, -167478, 274372, 35878, 153479, -21308, 95443, 24797, -92501, 169053, -175762, 134647, -48456, 151984, 282860, 291239, -23798, -120322, 15609, 371837, -131258, -331152, -209766, -303161, -11449, -138212, 69192, -14619, -437020, -42276, -366619, 99203, -64918, -67500, -239118, -6915, 166258, -192498, 275337, -34050, 80719, -157128, 126768, -101266, 14631, -37149, 226701, -161243, 103800, -114796, -133493, -264581, -47344]
17893a85828A83475b26662I4693K382a63085A82468c94954J11129B58181a00546
17882g4370c748A19857J5822A2194L358O388R257b0369k51472B59924b61834h9426
17869B8949a96427R0233B43993e50540i107A92476a17775A60802a8770d364D0741
17857a12412A02233e7913L824b6935j73033R7858d0079D7759b05197B77788c6162
17845e9157B1265J34456r02j7585a96133Q0054j73964A29527B7832O8550J75515
17834B71897i2686j70073B122a20799k5438K5347H9088A8211b84763C56945d767
17822A57813O2412a83370B5310J52431J25977b87038C46074G9565b29270C18049
17811b08890C91026A73567b32374c3723B09493J68964d33159i5722m0980A12819
$$ y = [-185828, 183475, -226662, 94693, 97075, -163085, 182468, -394954, -283825, 258181, -100546, -74370, -3748, 119857, 135679, 12194, 15552, 21940, 31197, -20369, -271841, 259924, -261834, -89426, 28949, -196427, -106194, 243993, -550540, -9107, 192476, -117775, 160802, -18770, -4364, 40741, -112412, 102233, -57913, -54089, -26935, -199968, -102110, -40079, 47759, -205197, 277788, -36162, -59157, 21265, 155721, 154819, 137234, -196133, -116079, -290043, 129527, 27832, 96382, 271897, -92686, -262759, 2122, -120799, -146237, -120890, 89088, 18211, -284763, 356945, -4767, 157813, 220225, -183370, 25310, 177741, 303718, -287038, 346074, 79565, -229270, 318049, -208890, 391026, 173567, -232374, -33723, 209493, 378457, -433159, -95722, -136702, 112819]
17800i0604A76053h2691A24705d08131A35013A5908g2776I1213m970g4674b7706
17788b22844a08568A38438a8646k2903A1890a160l8993r834J7047p9139D55401
17776c8246B60117D7337c032j42279D2730i735A29871g6124j00036A11895k7592
17765H4303b0023C26494j34253a33936A12093e5099C487J7178a45830e40j14698
17754a15238j3617M4020B24579g2699p9209D07634b9592C4129K31200b72335A18568
17742b72425A93734a24198m9116j02491o5278N2232a44245H4834b19300M4686
17732a74614I1656A2122a69441a5426j34953f2556q2090N480j93132I1834b99532
17720B48589R2360G3306O5059a75388A91681o1065L4430L5500n8112i3175h741
$$ y = [-90604, 176053, -82691, 124705, -408131, 135013, 15908, -72776, 91213, 86243, -74674, -27706, -222844, -108568, 138438, -18646, -41549, 11890, -1160, -40153, -49987, -32940, -112079, 455401, -38246, 260117, 47337, -3032, -145311, 42730, -9735, 129871, -76124, -176160, 111895, 84303, -20023, 326494, 192241, -133936, 112093, -55099, 3487, 20665, -145830, -540, -115238, -128855, -84835, 224579, -72699, -151908, 407634, -29592, 34129, 265329, -272335, 118568, -272425, 193734, -124198, -173314, -275805, -341083, -288851, -144245, 84834, -219300, -174614, 91656, 12122, -169441, -15426, -150379, -62556, -144646, -139166, -332298, 91834, -299532, 248589, 340949, 73306, 138365, -175388, 191681, 130616, 165046, 200546, 142434, -93175, -8741]
17708E946a52032h993B96665a04712j43528C52178b78602g451B91747J38109B0198
17696c80052C87415A77601b34760b0340m1901F1187M45558e9476A50514f0697
17685A52992e2924B10158D7812i0767F5403L5080L421G548J51555C3628K40455
17674B74083g9729b1461k8511A1001J22191a25583A36776j86M6518K0750H334
17662B86013b3428G1181G178J71088n3190E1566M2924K5979a06030H0525L59230
17651D39755C6030h284B06581B7976h3598L7030n0488l0271A5550b24009P4474
17640a49535e0797Q105C78063d29677K01064a11069m6314A9709N2584n316K91239
17629C58216B4658L7443J34694k0232b59942G5783e3070B7692R247a60474l57755
$$ y = [5946, -152032, -8993, 296665, -104712, -248240, 352178, -278602, -7451, 291747, 429856, 20198, -380052, 387415, 177601, -234760, -20340, -62241, 61187, 506745, -59476, 150514, -60697, 152992, -52924, 210158, 47812, -90767, 65403, 100483, 103904, 7548, 159103, 33628, 274083, -79729, -21461, -49972, 11001, 133192, -125583, 136776, 136590, 183108, 203858, 8334, 286013, -23428, 71181, 7178, 178266, 125076, 51566, 94490, 120469, -106030, 80525, 439755, 36030, -8284, 206581, 27976, -83598, -46568, -97056, -127327, 15550, -224009, -149535, -50797, -42692, 378063, -429677, -228613, -111069, -157383, 19709, 72293, 66977, 358216, 24658, 62101, 196795, 176563, -259942, 75783, -53070, 27692, 36939, -160474, -518229]
17618e18229c0440D14640A73721a98538h836C05036d8569F9310f3790B06845G0209
17606A1981K42627a27396n5960h3921G2414b15853D0369a66641B5237L36837j41943
17595B20131f3786A15418e0807B29319a90124e7029m7743k5364D5168f247r5466
17584a01713D1013J0783c09281F9335J924J57000a76410p7764I2672b0139A86062
17572b34181k25552a07053A10499J1621a04749C4228K18271E4193k6016M6418
17562G4595K63943B9949n632J99101J1034E539K2222M21882I7314K27298r8835
17551B25777n4069J02997J29170g8311g133A50535A4611a07918g557A03867m0005
17540F3862b52112C11294I036Q6372A3494L9044a02572B26104a10107C11410o7494
$$ y = [-518229, -30440, 414640, 173721, -198538, -8836, 305036, -48569, 69310, -63790, 206845, 70209, 11981, 254608, -127396, -183356, -83921, 72414, -215853, 40369, -166641, 25237, 362074, 220131, -63786, 115418, -50807, 229319, -190124, -57029, -104772, -130136, 45168, -6247, -101713, 41013, 51796, -309281, 69335, 71259, 228259, -176410, -254174, 92672, -20139, 186062, -234181, -459733, -107053, 110499, 122120, -104749, 34228, 252499, 54193, 28177, 74595, 338538, 29949, 24317, 223418, 234452, 5539, 27761, 449643, 97314, 324612, 225777, 171708, 274705, 403875, -78311, -7133, 150535, 14611, -107918, -7557, 103867, 63862, -252112, 311294, 9036, 95408, 13494, 52538, -102572, 226104, -110107, 311410, 243916]
17529B43916k9863b15056F59302c16624B53774Q3493B2066c75445E98202c130
17518C54010L7356a24346c1040C34787A01170a15133A61953F5531J00531d3835
17507A29204n5135a42898D01038A27692k0491b4754j02509A41336j2478D9092
17496a58852F5753f6688a6332B85571a31547B21511M045a4093A92053G9735J50133
17485B29868O890K48486h8604F6450a25524B1R4017c4285A11902K23201J42488
17474D77591a41578C25065a40831B19323F3258d6882A61297d2351B46492k8038
17464B18454A08588C7738L35545b7483I2108C5529A4767K6104J66410L9706o3850
17453A83137K42551a06532M6528E27171A13048R8654J63054j47160J56984I7326
$$ y = [243916, 214053, -215056, 659302, -316624, 253774, 337267, 22066, -375445, 598202, -3130, 354010, 391366, -124346, -31040, 334787, 101170, -115133, 161953, 65531, 166062, -43835, 129204, 74069, -142898, 401038, 127692, 107201, -24754, -127263, 141336, 128858, 49092, -158852, 65753, -66688, -16332, 285571, -131547, 221511, 225556, -14093, 192053, 79735, 229868, 236758, 485244, -88604, 66450, -125524, 21, 94038, -34285, 111902, 335103, 477591, -141578, 325065, -140831, 219323, 63258, -46882, 161297, -42351, 246492, 218454, 108588, 37738, 373283, -27483, 92108, 35529, 14767, 40871, 207281, 246987, 183137, 425688, -106532, -60004, 527171, 113048, 211702, 374756, 227596, 384580, 97326]
17442B61044m46N2630d6233C71498A28168M05626B64505k0290R3722I0122D2699
17430C20595M2829J2886F2424O3989J27647F1334J49916L2214o9451E5558K6767
17419H2325J67005A02759L11681A33783K07826N2300A86749H1770K80614j28954
17409B33430r503a10208A68542J26399a55400j28250a21464C07314m1773m4792
17399B20749R8849A7110c5373C58505D9668g5419I1542O8696J61949A3984J04883
17388A18867N4434M18891k16199G3099K81845c6005j60872B52290j17061J00627
17378B35856O8682m4505j19795A0795K46592j18891g7469A69552j7009d7350D8276
17366B47017A16869F115K82157J4587F4344L85832a54409D85288A1408K21571
$$ y = [261044, 260598, 313228, -46233, 371498, 128168, 533794, 264505, 244215, 337937, 90122, 42699, 320595, 363424, 376310, 62424, 126413, 254060, 61334, 211250, 243464, 174013, 55558, 82325, 249330, 102759, 414440, 133783, 341609, 393909, 186749, 81770, 362384, 233430, 223927, -110208, 168542, 294941, -155400, -283650, -121464, 307314, 265541, 220749, 319598, 17110, -35373, 358505, 49668, -75419, 91542, 160238, 322187, 13984, 118867, 173301, 592192, 375993, 73099, 354944, -36005, -196877, 252290, 135229, 235856, 304538, 260033, 140238, 10795, 257387, 138496, -77469, 169552, 152543, -47350, 48276, 247017, 116869, 6115, 288272, 302859, 64344, 450176, -154409, 485288, 11408, 232979]
17356B32979c36D5190K07394f4715C01399k3272A03165J3579J95186j54229k1796
17345A35905a19661A68311Q3206j22667j6225J22709J86107h3991m2680I6840
17334c3027E27495k43351d7430B52468f7494C5033J2946O5758O8875J80719j3704
17323C49627I2294b34j08395E90437B90308i807A5964L4970R5450a49452E8170
17311B79004n6198b974D9668o382K14186H3789F519J75324L24852F4948K9048
17300I3996L29628j60468E47L09554n0522r7340K85249G2729L45089j07246A22385
17288A76678P8598O4185A53196a8708B93017r5294a58416H0204M2787B3550N01023
17277E24573e2808A48944b7136C57953A70879J6638B9036K02207q9726J84289
$$ y = [232979, -336, 45190, 252584, -64715, 301399, 278127, 103165, 116744, 311930, 157701, 135905, -119661, 168311, 251517, 128850, 112625, 235334, 421441, -83991, -126671, 96840, -33027, 527495, 284144, -47430, 252468, -67494, 35033, 47979, 113737, 182612, 363331, 349627, 92294, -234, -108629, 590437, 290308, -9807, 15964, 50934, 146384, -149452, 58170, 279004, 222806, -2974, 49668, 43286, 257472, 83789, 6519, 181843, 506695, 64948, 93996, 423624, 263156, 547, 310101, 259579, 162239, 447488, 72729, 417818, 310572, 122385, 176678, 255276, 319461, 153196, -18708, 293017, 197723, -158416, 80204, 122991, 23550, 524573, -52808, 148944, -27136, 357953, 170879, 187517, 29036, 231243, 141517, 325806]
17267C25806G0201e512B44658a08447A85586L6343L748j8978j9739J76673J9652
17256C83285H9979M8183R1789A505L2964K53945K02745A81527o1727n3231J47020
17245B13589o5406M53946B0357L67497A23752K6113K90036p4136m2276r8754K37630
17234D62365j66108E2417Q7659a22774B25190a89272b1763I4429J58997P2907
17224C26333j5044A32905k4956B9136f461D36048q0897M8389j36269p6958J29357
17213C19670m4731J83577q4001J47545B34497G5066a08287D44314D3411K40785
17203B84196J72016k954n0353A79032M7682J97889r174j49708K2574J03125r8815
17192B92605P0904A03611K06414j36564R6445J52132K07471k7964p5900A68665
$$ y = [325806, 70201, -5512, 244658, -108447, 185586, 221929, 225677, 206699, 186960, 363633, 383285, 89979, 138162, 229951, 1505, 34469, 288414, 491159, 181527, 119800, 66569, 213589, 148183, 602129, 20357, 387854, 123752, 149865, 439901, 365765, 323489, 224735, 462365, 296257, 52417, 140076, -122774, 225190, -189272, -21763, 94429, 253426, 326333, 311289, 132905, 107949, 29136, -6461, 436048, 355151, 403540, 267271, 190313, 319670, 274939, 458516, 374515, 522060, 234497, 75066, -108287, 444314, 43411, 284196, 456212, 453258, 402905, 179032, 226714, 424603, 415429, 265721, 288295, 391420, 292605, 363509, 103611, 310025, 173461, 269906, 422038, 629509, 601545, 525645, 168665]
17181F01280k72150p7328A4416J15805d7989E21440j49097P9708j45477L26695
17171F33269b8975A57725J40870L19677a42994D36393j10297P3905J53911B62299
17160C88790k4244L2250o3342m7676q8439o0862J37095D0968K13283d2684C05603
17148C91365J52722A90881J3457J08777K03770B20380P0549J22163K6702P5554
17138E15348o1367q6553L7206j85802J14415O0904A49301O1626j4205M62515k04898
17127D54339A54966J40813K75184j33190J46957A82210J62672j69318N19581k29989
17117D65156A64570O7124J47322J41750G9684J23565K06489Q4429r6717K32718
17107F30168k98311m701l6480K73138j29126K00232k54482K63033k27909p4458
$$ y = [601280, 329130, 251802, 14416, 130221, -47989, 521440, 372343, 452051, 306574, 633269, -28975, 157725, 298595, 618272, -142994, 436393, 326096, 400001, 553912, 262299, 388790, 364546, 396796, 333454, 285778, 197339, 136477, 273572, 40968, 254251, -42684, 305603, 391365, 544087, 190881, 204338, 313115, 516885, 220380, 290929, 413092, 439794, 515348, 453981, 367428, 404634, 218832, 333247, 394151, 149301, 210927, 196722, 659237, 454339, 154966, 295779, 570963, 437773, 584730, 182210, 344882, 175564, 695145, 465156, 164570, 231694, 379016, 520766, 79684, 203249, 409738, 494167, 397450, 630168, 331857, 327156, 290676, 563814, 434688, 634920, 380438, 643471, 415562, 341104]
17097C41104O922J67358j45809K65838j04353p0721j03143N9419K84945B91606
17086F96848C04232J86494j52621J58285k2061P9606K97372k20743o6919J911
17076E65556J70389l11456J39292q1822q8254J66832j12732j70966K26775m5958
17066D57656J82755E4352M63920J27674j43066j25560M89519l02555n8142r4593
17056D11549J81345j11916J25618k00281K25528J28125N9824q5273k62453J93131
17046F65197B78202J92685J6503J09869K55507J9150k75813J45463O2029L5676
17036H39271k66462L13957k96050p5489J55222M2609k28928L27456Q5737D27457
17025G42631p5202N5127J51428P8455m28357K8527N93324n21020J46597J8564
$$ y = [341104, 348026, 515384, 369575, 635413, 531060, 460339, 357196, 416615, 701560, 291606, 696848, 304232, 490726, 338105, 496390, 474329, 553935, 851307, 630564, 563645, 565556, 735945, 424489, 563781, 481959, 393705, 560537, 447805, 276839, 503614, 457656, 640411, 54352, 518272, 645946, 502880, 377320, 866839, 564284, 506142, 411549, 592894, 480978, 606596, 406315, 631843, 759968, 819792, 734519, 472066, 665197, 278202, 470887, 487390, 597259, 852766, 871916, 596103, 741566, 803595, 839271, 572809, 886766, 590716, 515227, 670449, 713058, 484130, 811586, 897323, 427457, 742631, 667429, 722556, 873984, 952439, 524082, 552609, 1145933, 624913, 771510, 790074]
17015G90074q8207p8673p8449L51271n7356k03582j6406J39653K4951J44070l22190
17004F05156O0926L53290m26518L28836k64965M50767m28882j6622j6238K55408
16994I01158k80840K89964k33504K12838p0657j61341L87003j62963o0696L1820
16984H52782j25348O87442E40671K58260R857O9576j13415j50930O3009M71818
16974A148846l87469M5564M5194m5615J77715J28055l76136L65548j79680J29713
16964A051735j4103Q6975J21089n63289L86705J8819n827n1110j13595M46376
16954A363775l69840K23O3979J81144j93736k1681K39919M4883m1887l26757K15790
16943A155812m25101R16969m77842L1550N5973K06293n33516L87836K81740n26829
$$ y = [790074, 701867, 623194, 544745, 896016, 838660, 635078, 618672, 758325, 783276, 927346, 605156, 666082, 1019372, 592854, 921690, 656725, 1107492, 678610, 661988, 645750, 901158, 620318, 910282, 676778, 889616, 818959, 657618, 1044621, 881658, 820962, 852782, 727434, 1414876, 540671, 798931, 808788, 878364, 764949, 614019, 677028, 1148846, 761377, 806941, 852135, 806520, 984235, 1112290, 736154, 1101702, 922022, 1051735, 1037632, 1124607, 1245696, 682407, 1069112, 1087931, 1082104, 1030994, 917399, 1363775, 993935, 994158, 1058137, 1239281, 1045545, 1023864, 1263783, 1308666, 1266779, 940022, 1155812, 730711, 1647680, 1169838, 1201388, 1257361, 1463654, 930138, 1317974, 1599714, 1072885]
16933A072885K1954J67807J96266J90711j94374k91047J90439K7581J61471L5023
16923A578716k37581j09629K62855J15996q5900j28037j23507L57722M7732o3309
16913A615058L31059l40952K39170q5763j14340K24307r0596l1276K276k49874
16903A499069M03681J08260o3533m43415L86881N6743K3357L20838o32149N31175
16893B190907J5689k7322j4130k66859M5671L8589L82982k58343K0361K42858
16883B370403Q8133r2956k84258L16073M05984n24597O2739q8325K95959K75800
16873B824955l96102N17175r7897q9410J75448k90964j29851K94238J48387j55472
16863B800507N30986k60033J00844J09296j48768R7249k95071L84315q6934P6801
$$ y = [1072885, 1094839, 1262646, 1458912, 1649623, 1455249, 1164202, 1354641, 1382222, 1543693, 1578716, 1341135, 1231506, 1494361, 1610357, 1524457, 1396420, 1272913, 1630635, 1678367, 1615058, 1946117, 1605165, 1844335, 1758572, 1644232, 1868539, 1777943, 1746667, 1748943, 1499069, 1902750, 2011010, 1947477, 1504062, 1890943, 1947686, 1971043, 2291881, 1659732, 2190907, 2206596, 2179274, 2165144, 1898285, 1943956, 1982545, 2365527, 2107184, 2127545, 2370403, 2458536, 2365580, 2081322, 2397395, 2803379, 2278782, 2341521, 2253196, 2549155, 2824955, 2428853, 2946028, 2848131, 2758721, 2934169, 2643205, 2513354, 2807592, 2955979, 2800507, 3331493, 3071460, 3172304, 3281600, 3132832, 3230081, 2935010, 3319325, 3232391, 3309192]
16853C309192l5741K5536K87076k72424K19567j37347M33169o9397J21796L0416
16843C911843l6527K59467L8547p6211j66303N81940r6815J36005k25477J98441
16833D524910M42552k73526j86793L19334R7767K58179K342j11905o3715K94463
16823E303608J51590M81513l61388K60280j12990M59706l50051J74772J76183
16814F183223K27555L38413K4383r5402L35498L17611q9341K95168k4917L33563
16804G845754k3248J75483K93545J51147Q5579j28004R17170k61414M55915l0561
16794I481366N47501M55249J52104K80073J54577j32272N03269K91719M81084
16785A2214670k3667L49187N62063M37910K70683L87676M69828K99241N96781
$$ y = [3309192, 3273451, 3298987, 3586063, 3313639, 3533206, 3395859, 3829028, 3759631, 3881427, 3911843, 3875316, 4134783, 4173330, 4097119, 3930816, 4512756, 4415941, 4551946, 4326469, 4524910, 4967462, 4693936, 4507143, 4826477, 4924244, 5182423, 5184765, 5072860, 5009145, 5303608, 5455198, 5936711, 5575323, 5835603, 5722613, 6182319, 5832268, 6007040, 6183223, 6410778, 6749191, 6773574, 6678172, 7013670, 7331281, 7241940, 7537108, 7512191, 7845754, 7822506, 7997989, 8291534, 8442681, 8528260, 8400256, 9317426, 9056012, 9511927, 9481366, 10028867, 10484116, 10636220, 10916293, 11070870, 10938598, 11441867, 11733586, 12214670, 12191003, 12540190, 13102253, 13540163, 13810846, 14198522, 14668350, 14967591, 15564372]
16776A5564372L18611N41803N24218P04688O07495L99811M58770Q20415J26179
16767B0066362J315981N82838R67799N42893R87335P48469J329233M40852J394327
16758B8376089Q69182J223465J485806Q70633J571642J450563J914940J781556
16750C9543876J380327K075736K234749J978998K159398K278383K759387K866240
16742E7277094L143161L038531L221749L560783L876575L645527M533579M396625
16734H6693624N104643N372864N355162N702272O270409O186867O723980O518719
16726A33928540O815293O914600O461773O844825O349302O060655N367696M461983
16718A83204667L529685K518030J599609N83088r65599k536018l301431m268519
$$ y = [15564372, 15882983, 16424786, 16949004, 17653692, 18261187, 18660998, 19119768, 19940183, 20066362, 21382343, 21965181, 22932980, 23475873, 24463208, 25211677, 26540910, 26981762, 28376089, 29245271, 30468736, 31954542, 32825175, 34396817, 35847380, 37762320, 39543876, 40924203, 42999939, 45234688, 47213686, 49373084, 51651467, 54410854, 57277094, 60420255, 63458786, 66680535, 70241318, 74117893, 77763420, 82296999, 86693624, 91798267, 97171131, 102526293, 108228565, 114498974, 120685841, 127409821, 133928540, 140743833, 147658433, 154120206, 160965031, 167314333, 173374988, 178742684, 183204667, 186734352, 189252382, 190851991, 191435079, 190469480, 187933462, 184632031, 180363512]
16710A80363512n088153n988464o505789o679363p040883p202618p287460o879316
16702A27691466p163725o347088o649910o054467n732194n515523n311090m530164
16694H0387305m718949m421370l613174l832920l585706l274516k580720k838171
16686E1521779k681073k711048j973276k380760k084838j946260j835880j348508
16678C4560136j284785j911197j265564j219894j407628p47361j729968o76644
16670B4317095r40390j022536q95860o60287p92493j000919n23584o71218o52043
16661A7157765M8797j014492o65018k71331q84014K92247r48559l52860n79414
16652A2783121j79341r78875K56901m88415k08629l90176k17817o75398J47630
$$ y = [180363512, 175275359, 169286895, 162781106, 156101743, 149060860, 141858242, 134570782, 127691466, 120527741, 114180653, 107530743, 101476276, 95744082, 90228559, 84917469, 80387305, 75668356, 71246986, 67633812, 63800892, 60215186, 56940670, 54359950, 51521779, 48840706, 46129658, 44156382, 41775622, 39690784, 37744524, 35908644, 34560136, 33275351, 31364154, 30098590, 28878696, 27471068, 26723707, 24993739, 24317095, 23376705, 22354169, 21458309, 20798022, 20005529, 19004610, 18481026, 17809808, 17157765, 17206562, 16192070, 15527052, 15255721, 14371707, 14663954, 13715395, 13362535, 12783121, 12603780, 11624905, 11881806, 11393391, 11184762, 10794586, 10576769, 9901371, 10049001]
16643A0049001j59485o55383j39868k58088J23148n57170m77371R9450j30301
16634G893933k89861k74m53483k74582K38238j87444m67776k68207J78524j36923
16624F232145m34345J51915l50263j06058M4402k46903J03216l03961l0635n63829
16614D495684L77392k26657R2389k13171l63504L58366l57205k06784L98533l1450
16604D323593k95173k69163J9281j44452L4019k41852L25896j38165k86724J70570
16594C497830K05440o07078n6723K32417j36964J79524k0656k77607M7232l69716
16584B693699R4697L29701m57964J78086m85637P1207M8836j22541K36025K2782
16574B608891L7523n29529K71169p1102K6526j58574L13437m91671L63736l00213
$$ y = [10049001, 9889516, 9234133, 9094265, 8836177, 8959325, 8402155, 7924784, 8024234, 7893933, 7604072, 7603798, 7150315, 6875733, 7113971, 6926527, 6458751, 6190544, 6369068, 6232145, 5797800, 5949715, 5599452, 5493394, 5537796, 5290893, 5394109, 5090148, 5059513, 4495684, 4873076, 4646419, 4738808, 4525637, 4162133, 4520499, 4163294, 3956510, 4355043, 4323593, 4028420, 3759257, 3778538, 3634086, 3668105, 3426253, 3752149, 3613984, 3327260, 3497830, 3703270, 3096192, 3039469, 3271886, 3134922, 3314446, 3293790, 3016183, 3063415, 2693699, 2788396, 3118097, 2660133, 2838219, 2352582, 2423789, 2472625, 2350084, 2586109, 2608891, 2646414, 2116885, 2388054, 2316952, 2343478, 2184904, 2498341, 2006670, 2370406, 2070193]
16564B070193l71494L52068J0762j45358j56576J72280j34490j05604K50474k27719
16554A714536j4474Q4611L2351k23725r2526L42727o01570L71882m0737k94563
16544A278512K18868o3013q317k566j25779M51388k21923k61838k4625J71379
16534A412086j41538L1962J48420r5597j32975R3842L06985m05884j70589L44975
16524A391687p0590k21149j48052K50122J46001k55955N5296N9056k1126j59319
16514A025971m5297J59511k79995L70147m2350m9479j62940j8721N4077J75102
16504A186026k27004j92681N9674J01222j74327L79513k63724J37299k11396K46797
16494A041399k12926k45153L32552j79327Q8988j06638J89360k60369N57945D51988
$$ y = [2070193, 1698699, 2050767, 2061529, 1916171, 1759595, 1931875, 1797385, 1691781, 1942255, 1714536, 1700062, 1784673, 1817024, 1593299, 1500773, 1843500, 1241930, 1613812, 1573075, 1278512, 1497380, 1434367, 1426050, 1423484, 1297705, 1749093, 1527170, 1265332, 1240707, 1412086, 1270548, 1302510, 1450930, 1355333, 1222358, 1316200, 1623185, 1217301, 1046712, 1391687, 1321097, 1099948, 951896, 1202018, 1348019, 1092064, 1147360, 1206416, 1185290, 1025971, 980674, 1140185, 860190, 1230337, 1187987, 1138508, 975568, 956847, 1010924, 1186026, 959022, 766341, 826015, 927237, 752910, 1132423, 868699, 1005998, 794602, 1041399, 828473, 583320, 915872, 736545, 825533, 718895, 908255, 647886, 1205831, 451988]
16483E00407K19286L00776k30775q3003Q4303j8676K825m0616j6169j15569P1128
16472F73917J11658k19876J87537K9001j06197p228n7803M3787r0905j43187J66009
16461E86713j10319K11074j90475K72004l80837L34122p1358n7269P8946A93349
16450F25451j92971M13753l82556L31076m2789q8382C29672J0328p7360M29923
16440F92563B81865N07137J96388m71024J40306j84663L23078B74221L36006M0237
16430F50464o7350A8748J46435O11292C48617L95797k62355Q6109k2376J3956
16420E59748L663A74203J64451R7818r2702G6019K63137K80324P0523A37161K89744
16409D26905q804C7541M11857j48369J34008q8433g1103E18549B41229P6230o2862
$$ y = [500407, 719693, 1020469, 789694, 706691, 790994, 772318, 775143, 734527, 718358, 602789, 673917, 785575, 565699, 753236, 782237, 676040, 668812, 611009, 654796, 563891, 420704, 586713, 476394, 687468, 496993, 768997, 388160, 722282, 650924, 593655, 672601, 193349, 625451, 432480, 846233, 463677, 794753, 751964, 663582, 329672, 340000, 262640, 692563, 281865, 789002, 985390, 514366, 654672, 470009, 793087, 274221, 610227, 650464, 583114, 18748, 165183, 776475, 348617, 744414, 482059, 568168, 545792, 559748, 563411, 174203, 338654, 436472, 343770, 76019, 339156, 619480, 690003, 137161, 426905, 418101, 37541, 449398, 301029, 435037, 346604, -71103, 518549, 241229, 317459, 254597]
16398B54597n4428L6856J08444l0552N2617a10294C50771G1871P7356M42671A82569
16386C25835j8550l4467d9151A43293F785M19221A90804J39939O7930N7916j92423
16375B64166F4349J91791j05959L5832J16821J00708A61780o4056J50430Q204
16365B56358K11609k25448J26099g3160B85863A42492a0195A69629P1670L46048
16355E87347B16834N9410l5193K33875b6924e87C85708a80991A35108J36036I0902
16343C2200j4716M66431A48177D8822R1815F9681K94117k6517L29055B47146K56414
16332E03560A81371Q4551H404L59484j48725L1566c9151A74837N6768a0458C78985
16320C39943A7982J37090J61139A47643K18182M1860l1490j40370a59640A47643
$$ y = [254597, 200169, 237025, 345469, 314917, 367534, -110294, 350771, 71871, 149227, 591898, 182569, 325835, 307285, 272818, -49151, 143293, 6785, 426006, 190804, 330743, 398673, 456589, 264166, 64349, 256140, 150181, 186013, 302834, 403542, 161780, 97724, 248154, 256358, 467967, 242519, 368618, -73160, 285863, 142492, -10195, 169629, 241299, 587347, 216834, 276244, 241051, 474926, -26924, -587, 385708, -180991, 135108, 271144, 90902, 32200, 17484, 483915, 148177, 48822, 140637, 69681, 363798, 337281, 666336, 247146, 503560, 181371, 265922, 8404, 367888, 219163, 250729, -39151, 174837, 231605, -10458, 378985, 339943, 17982, 155072, 316211, 147643, 365825, 407685, 376195, 235825, -159640, 147643]
16309B16279o5081b64042A23109J12993M5644a63674A57896L84554D151P9074
16299H3225M6269K3681J18159L4407A09729a48414C0423K91127J05999g9642A70914
16287A26200h9520l8465B78428n6608K16311A008P4774K26848C5629a24701B57744
16275B20244J10502m5032F1975Q2054J42495p7326F5813O9372e4133a9636F7542
16263C729b40376C32357B8402h8596A05533e5918o4530C39841r8917a3502n3975
16252f7477B89485a60304f2509D6464K38707q6082D838c33551a04164i609B99265
16240a70A63422J6509C0547K09555H590L52283a75611A88298F8464J3497J97581
16229B79542r6649B500c36079C00654a3471j44565B18002f1022A30552J80024
$$ y = [216279, 151198, -264042, 123109, 236102, 281746, -163674, 157896, 542450, 4151, 83225, 129494, 153175, 271334, 305741, 109729, -148414, 30423, 321550, 427549, -79642, 170914, 126200, -89520, -127985, 278428, 221820, 438131, 1008, 75782, 302630, 35629, -124701, 257744, 220244, 330746, 285714, 61975, 144029, 286524, 209198, 65813, 135185, -54133, -19636, 67542, 3729, -240376, 332357, 28402, -88596, 105533, -55918, -120448, 339841, 240924, -13502, -67477, 289485, -160304, -62509, 46464, 285171, 199089, 4838, -333551, -104164, -9609, 299265, -170, 163422, 179931, 30547, 240102, 8590, 360873, -175611, 188298, 68464, 81961, 279542, 182893, 2500, -336079, 300654, -13471, -158036, 218002, -61022, 130552, 310576]
16219C10576p2198l0554M9913r4107o2632a57869b7927C00615A05036M246l3212
16208G6070b87326C9642P2641L34634D464R6339L1163b74569I2130a29168B04301
16196D27463a15926A72497L370a18007A41510J8740E5583g4872o5591B99788d4373
16184A21257Q0238k2364K51283C3991d2912A31442R675J45991J5133A1835h9917
16172b71614A62898O2673K49026B21169e2164C85318A4305K09524A09376C8431
16161a5366A34693j5373C532L9269J23606J2143j2844i2985k8799l4507A18717
16149b72436A44041a49059C32135b9882l2379F7951j1240A527P4424J01387a9570
16137E771J46086p2250M335j8376d6251A7249a1798d276J361k7892I8357b72689
$$ y = [310576, 238378, 207824, 257737, 163630, 100998, -157869, -27927, 300615, 105036, 109282, 76070, -287326, 39642, 112283, 446917, 4464, 100803, 131966, -274569, 92130, -129168, 204301, 427463, -115926, 172497, 175867, -118007, 141510, 160250, 55583, -74872, -140463, 299788, -44373, 121257, 201495, 179131, 430414, 33991, -42912, 131442, 141117, 287108, 302241, 11835, -89917, -271614, 162898, 225571, 474597, 221169, -52164, 385318, 14305, 223829, 109376, 38431, -15366, 134693, 119320, 3532, 42801, 166407, 178550, 165706, -92985, -121784, -156291, 118717, -272436, 144041, -149059, 332135, -29882, -62261, 67951, 56711, 1527, 75951, 177338, -19570, 5771, 151857, 79607, 83942, 65566, -46251, 17249, -11798, -4276, -2915, -30807, 98357, -272689]
16124I9210B0837R6864n3625c2482b291G5844b94713b5951j56211k66105B5212
16112D6310k2531b44009j14501J47661P3063e8630j29024o9538B49737F1555K7686
16101H9241a13077I2911K83341B6359e2369l00730C03876E1610b67056R3119C79564
16089c7386k43262k51226a40602C5912a79739j41084A21867b90875A51046l1037
16079A20009i292k18079B52431b6556j30678B0890a87211d4697l06260B57035
16068B78685e5007A2254b76660A69723B1591a39646J6703C7991M0625d48935b4159
16056D05826F2466d007n5414k09425c0891c732j79832A43756l8624a20194k92724
16045d12918K05371A76459c747B9639a86650N1232A65713J06710C1762g9335j60866
$$ y = [99210, 20837, 117701, 64076, -32482, -2291, 75844, -294713, -25951, -182162, -448267, 25212, 46310, 23779, -244009, -358510, -210849, -137786, -58630, -187654, -257192, 249737, 61555, 89241, -113077, 92911, 376252, 26359, -52369, -353099, 303876, 51610, -267056, -173937, 379564, -37386, -280648, -531874, -140602, 35912, -179739, -320823, 121867, -290875, 151046, 120009, -9292, -227371, 252431, -26556, -157234, 20890, -187211, -44697, -350957, 257035, 278685, -55007, 12254, -276660, 169723, 21591, -139646, -122943, 37991, 78616, -448935, -24159, 405826, 62466, -4007, -59421, -268846, -30891, -3732, -183564, 143756, 105132, -120194, -412918, -207547, 176459, -3747, 29639, -186650, -135418, 165713, 272423, 31762, -79335, -240201]
16034b40201O6050e9678j25385B10a41135A25063j6228l063L1706o6343a21231
16022a33289d9095j15573f997l1187B6861K49192b95339F2982f9313j01531D24010
16010E603a1029A4265e5263A33325b93355a11552b9782B21413a68613M7588C0210
15998a27073m7409J7899c278l43791j2487B61754b76592B06998n1942o1064J1059
15987A05051L6376A1104J22334f4583J883C86689K31520k56430A11937K53949
15977C65886j68904d9969B4972a2209p6760l31647R2539i4727a8606k10062a07590
15965a93137B74441f0789R839B88272A03878g290j88308j07644F4412e5327k71218
15954c26545A30560a29006A21676l8471J59304G9148L47169a27578I6033g9927
$$ y = [-240201, -174151, -59678, -185063, 210, -141135, 125063, 108835, 105772, 137478, 71135, -121231, -133289, -49095, -164668, -6997, -38184, 26861, 276053, -295339, 62982, -69313, -170844, 424010, 5603, -11029, 14265, -55263, 133325, -293355, -111552, -29782, 221413, -168613, -121025, 30210, -127073, -174482, -156583, -3278, -347069, -359556, 261754, -276592, 206998, 155056, 93992, 105051, 141427, 11104, 133438, -64583, -62700, 386689, 618209, 361779, 111937, 365886, 196982, -49969, 24972, -12209, -88969, -420616, -328077, -94727, -18606, -228668, -107590, -193137, 274441, -60789, -50950, 288272, 103878, -7290, -195598, -303242, 64412, -55327, -326545, 130560, -129006, 121676, 83205, 242509, 79148, 426317, -127578, 96033, -79927]
15943B4850J51860e58423A27272b492l26878C60396a17598c0771m33968F4374
15932a768D3466c20104g9703J6729j03098P0814k42471a4276k78152D1903b43242
15920I4989b30223C18852k3780c01332a0416A65652P3201j064b61537j62319H979
15908G0791a10009j39130a3027k92763J35446l10567A33536o858e7282B26753
15897B87213a34672C74512B6618e9287j07585A1792O8966j5069J55757a97535
15886a89664j31095B00300B1911M5857a48894A04448d98810A29391J43498B1867
15875A48401c40337e1043l9623j2290G4255a46504j18418C5150G793f3283B4828
15863b05249c7601H7998Q478a99248l0534J06666a822k01943b4507j76118O9350
$$ y = [24850, 176710, -558423, 127272, -2492, -329370, 360396, -117598, -30771, -464739, 64374, -1768, 43466, -320104, -79703, -62974, -166072, -95258, -337729, -14276, -292428, 41903, -243242, 94989, -230223, 318852, 295072, -301332, -10416, 165652, 238853, 237789, -261537, -423856, 8979, 70791, -110009, -249139, -13027, -305790, -170344, -480911, 133536, 126678, -57282, 226753, 287213, -134672, 374512, 26618, -59287, -166872, 11792, 80758, 65689, 221446, -197535, -189664, -320759, 200300, 21911, 67768, -148894, 104448, -498810, 129391, 272889, 21867, 148401, -340337, -51043, -90666, -102956, 74255, -146504, -264922, 35150, 7793, -63283, 24828, -205249, -37601, 87998, 96476, -199248, -229782, -123116, -1822, -203765, -24507, -200625, -131275]
15852a31275B24426j01894m8912K3903d99280b33748J02638q7812E6042a37948
15841I7199b47195B3527b3231J0791m03560C17941a78521B69016B8057B219e0647
15829b0273n5131K2685J5239a2498j4225C27300b21658A85358a23568k32654J13879
15818b42343L6982f9034j14400B11101b75940E8449a60038M9362L7800o1812L686
15807a31002B02069g9612B0010d2007A75721p9184b23699e0693B03269c00394
15796g2268C3985a77335I1444a1130j82017Q6015o3082B09924F7469A4364L2462
15785D6826L30400c4874A35944b30067A75734j0312H1290O8486i2634j1213F0201
15773a75423I5633r444A5877k588J39488a64036D5330b43532g5736A66274F2431
$$ y = [-131275, 224426, 122532, 73620, 97523, -499280, -233748, -131110, -218922, 56042, -137948, 97199, -247195, 23527, -23231, -12440, -416000, 317941, -178521, 269016, 28057, 2219, -50647, -20273, -75404, -52719, -37480, -12498, -26723, 327300, -221658, 185358, -123568, -356222, -242343, -205361, -69034, -183434, 211101, -275940, 58449, -160038, -110676, -72876, -134688, -131002, 202069, -79612, 20010, -42007, 175721, 96537, -223699, -50693, 203269, -300394, -72268, 33985, -177335, 91444, -11130, -193147, -107132, -170214, 209924, 67469, 14364, 46826, 377226, -34874, 135944, -230067, 175734, 165422, 81290, 149776, -92634, -103847, 60201, -175423, 95633, 86189, 15877, 13289, 152777, -164036, 45330, -243532, -75736, 166274, 62431]
15761a06907D5306b08190K9199N5462A42565b24066A30337a56064j79344D6007
15750a50597A04667k8165K40724A42365K52462h8279C22470A4253J08938A6169
15739A4033J2006a41108k58523A21507b82337b653j92725B68631b04643k08219
15729d12862J01257B71384p2537e1554B17992G7588a91481A76231E7140l093a32176
15717b68071G3267c14264c0700A6482a22453J4785j47667h5010l1769C80044A40180
15705e9327g853q9625m0976M5023q3384C2444c24101A12365a74221A46448b54093
15693a25155l0250j6328G6033c25099F113g3098j10783C23035c9251k15112A51262
15681a00463H5981k8696N2822O0528b9763k14937i5468C3335a06953E8754J05633
$$ y = [-106907, 45306, -208190, -178991, -123529, 142565, -224066, 130337, -156064, -335408, 46007, -150597, 104667, 76502, 317226, 142365, 394827, -88279, 322470, 14253, 123191, 16169, 14033, 26039, -141108, -399631, 121507, -282337, -2653, -195378, 268631, -204643, -412862, -311605, 271384, 198847, -51554, 217992, 77588, -191481, 176231, 57140, 54047, -132176, -268071, 73267, -314264, -30700, 16482, -122453, -107668, -255335, -85010, -116779, 380044, 140180, -59327, -7853, -97478, -138454, -93431, -176815, 32444, -324101, 112365, -174221, 146448, -254093, -125155, -155405, -171733, 76033, -325099, 6113, -73098, -183881, 323035, -39251, -254363, 151262, -100463, 85981, 57285, 110107, 170635, -29763, -244700, -95468, 33335, -106953, 58754, 164387]
15670A64387c1653A83151B5742Q026h0587B59158a88713O9668j20161b4341C02390
15658B19566B2743i7455b936l81961F4853b97244a13898f149p1188j43974c6397
15646a26887A62837c00388d4001j68378G9220C3616J55461d7933k90408a20777
15635i6454c8282j41367B05718D0225P2640a38532h415n4806n0479B47106j3561
15624B33545F5923O2640a45924J3617b7625B16912r2077Q9288D5062Q4770a96032
15612i9305F8311M9439a57030L9658C5490a04077o672k13862A99845l9151o3967
15601I6727h9576K6463D6320h2604a3424E1315L7134J40321b09556A33745a01964
15589a8048k02417M1256f0932A41939b83951B65422f0290j86490O3385N843P6406
$$ y = [164387, -31653, 183151, 25742, 33768, -80587, 259158, -188713, -119045, -239206, -24341, 302390, 219566, 22743, -97455, -2936, -384897, 64853, -297244, -113898, -6149, -77337, -221311, -36397, -126887, 162837, -300388, -44001, -212379, 79220, 33616, 189077, -47933, -338341, -120777, -96454, -38282, -179649, 205718, 40225, 112865, -138532, -8415, -63221, -113700, 247106, 233545, 65923, 128563, -145924, -132307, -27625, 216912, 124835, 214123, 45062, 129832, -196032, -99305, 68311, 117750, -157030, -117372, 35490, -104077, -110749, -324611, 199845, 160694, 96727, -89576, -63113, 46320, -82604, -13424, 51315, 88449, 228770, -209556, 133745, -101964, -18048, -220465, -179209, -60932, 141939, -283951, 265422, -60290, -246780, -183395, -177552, -101146]
15578a01146q1373A07609Q1749b32757q0212I9571M754J85545a61815A11715L11894
15567D23609h9774E1487R6594a29350d0903p4810A10402A687P9277f4263l28J0635
15555e3956l923l9568B7376K72439a16442j4565A77815a46699A65755k7253a47216
15543A99742i5757B78228Q7795e942r5703j14230A19691R2631a45837A25722A1596
15531f5528B22983R015E9060k4234L84341o3789e7296a3480j76483O3047F6311
15519b26125H911a9015A36844O1501C5729a30685N5705j43353J01844K1703B12506
15507A45241D3811J15624L3982c80417B6547J68048d0468A62925d4307C2469J43769
15496A76238a37635I6326f4087A4230a8216l19240D575Q6673b17457A45109a49952
$$ y = [-101146, -182519, 107609, 189358, -232757, -312969, 99571, 104325, 289870, -161815, 111715, 423609, -89774, 51487, 148081, -129350, -40903, -115713, 110402, 1687, 80964, -64263, -64591, -53956, -57879, -97447, 27376, 299815, -116442, -131007, 177815, -146699, 165755, 138502, -147216, 199742, -95757, 278228, 366023, -5942, -101645, -215875, 119691, 212322, -145837, 125722, 11596, -65528, 222983, 231998, 59060, 34826, 419167, 355378, -57296, -13480, -189963, -126916, 66311, -226125, 8911, -19015, 136844, 198345, 35729, -130685, -74980, -218333, -116489, -94786, 212506, 145241, 43811, 159435, 193417, -380417, 26547, 194595, -40468, 162925, -44307, 32469, 176238, -137635, 96326, -64087, 14230, -18216, -337456, 4575, 91248, -217457, 145109, -149952]
15484A22215c46149J65902P3587K6564G8274K2457K9800c8211j58407B24400n7190
15473A67210c28980R1914p1760b766A69251a39169e5236k76370B653b73321d9040
15461A6088a26142d2035J7316G180b14311b7061q1088A02650a99921c173I0520
15449a02384A07749e1413E2374h8436H6462A0649b67282I2005C7525P6435a31677
15437C2420Q8941L182a64930A67419b4247b722G3628H983J53464n1594a45039
15425B16233h0923m8811j4701j07652D1564R5527h3677k36153C1637b96545N9448
15414b37097H8380L5022f8817o4153A32490b8998j36338n7847F3498K62189A36048
15402A29834Q0159B168J63125a59341I3433a11454A64370c3173D01186h9749A86566
$$ y = [122215, -346149, -180247, -106660, -80096, 78274, 100731, 130531, -38211, -196618, 224400, 167210, -328980, -237066, -308826, -2766, 169251, -139169, -55236, -331606, 2653, -273321, -49040, 16088, -126142, -42035, -24719, 7180, -214311, -27061, -108149, 102650, -199921, -3173, 90520, -102384, 107749, -51413, 52374, -88436, 86462, 10649, -267282, 92005, 37525, 113960, -131677, 32420, 121361, 124543, -164930, 167419, -24247, -2722, 73628, 8983, 162447, 110853, -145039, 216233, -80923, -129734, -144435, -252087, 41564, 137091, -83677, -319830, 31637, -296545, -237097, 88380, 123402, -68817, -132970, 132490, -28998, -165336, -223183, 63498, 325687, 136048, 129834, 209993, 2168, 165293, -159341, 93433, -111454, 164370, -33173, 401186, -89749, 186566]
15390D3791J08646G318P4837C9209a04206j28706A10295J3592J8365g1421B0145
15378a70408B52914b93696a07276a2059k65327j19837a64165j71688c013A92917
15367a7406j73926F893L38023b45951I665d6171m8986A65372i4048A98346P324
15356B05670F375b25582A29061a7147C05443D9162a5351j29769C30056j28446
15346B01610D6158J17076K56877D4368c75031i9809B59278b33185a11202j49837
15336b61039f8611j556B49484A3179f1166r839k41174B92887a04245B40934g3819
15324F6713p793B0735o434K37101b17760B01600a8210k06214A47938b70769c5477
15312G5075h662C81083F8779J33617a09716C1457L3037k0647k49J77415a05636
$$ y = [43791, 152437, 7318, 82155, 39209, -104206, -232912, 110295, 123887, 142252, -71421, 20145, -170408, 252914, -293696, -107276, -12059, -277386, -397223, -164165, -335853, -3013, 192917, -17406, -191332, 6893, 344916, -245951, 9665, -46171, -95157, 165372, -94048, 198346, 205670, 6375, -225582, 129061, -17147, 305443, 49162, -15351, -145120, 330056, 201610, 46158, 163234, 420111, 44368, -375031, -99809, 259278, -233185, -111202, -261039, -68611, -70167, 249484, 13179, -61166, -71005, -312179, 292887, -104245, 240934, -73819, 66713, 58920, 20735, 14301, 251402, -217760, 201600, -18210, -224424, 147938, -270769, -35477, 75075, -8662, 381083, 68779, 202396, -109716, 31457, 64494, 43847, 43598, 221013, -105636]
15300C4201b47326A13831b01498B12078a94504B59899a94932B49631D0831L2788
15290G3619c6357J0042H3179J9497a43887C9841d5891j11105A1679b98619a15666
15278F0481j8559a70806A67236a76873d5188B69419a78194N3420E0815a78384
15267A77387N0521P267a29230I1416a19525A90842J14496E8859K3267f4028p1444
15256a35472A70459D2806L05145L376r9089I2425k3850M76337B41604M20099R18903
15245A580606J19950p38416M69875m78880B6192J50912B574R0455B5500a63697
15234i2600L9686E6173J98995C2480A1477b61028B78000I6603g932l62864A99369
15222c9986q1019A59332L4666n849C1735f1791C23322a4232A56734K5543p9281
$$ y = [34201, -247326, 113831, -201498, 212078, -194504, 259899, -194932, 249631, 40831, 73619, -36357, -26315, 83179, 102676, -143887, 39841, -45891, -156996, 11679, -298619, -115666, 60481, 41922, -170806, 167236, -176873, -45188, 269419, -178194, -124774, 50815, -178384, 177387, 227908, 235175, -129230, 91416, -119525, 190842, 305338, 58859, 82126, -64028, -135472, 170459, 42806, 347951, 351327, 252238, 92425, 68575, 544912, 241604, 661703, 1580606, 1700556, 962140, 1432015, 953135, 26192, 177104, 2574, 93029, 25500, -163697, -92600, -52914, 56173, 255168, 32480, 11477, -261028, 278000, 96603, -7932, -370796, 199369, -39986, -121005, 159332, 193998, 188149, 31735, -61791, 323322, -14232, 156734, 182277, 102996]
15211A02996a37321A4400K70150A5032J5111d3551A646J73173A4084J96736a1000
15199A25862O978N2043F8716D132a78074P0431q6911A69998L7768A4518h093j68916
15187a77009B76695A22124O2851b9595D3006R2551h0519j4195B43568c6734J4981
15176b1753B24451B8139J04501I129O5553O2016J0855J7756A915M8547a5615D611
15163E8209a02440B02782a04926K5908L7688B74513C1140K56356c1883D23075
15152B41164o6030M9113J27531a05544C19438A32709N6197J9852g0048B45924
15141A44256l422J60924I8585c8913D4627R9638F8542J43061R3219J97534j65084
15130C37272l887n2764j28235j630m5620C5636i655B79703n9001L5025o0261K20866
$$ y = [102996, -137321, 14400, 284550, 15032, 30143, -43551, 1646, 174819, 14084, 210820, -11000, 125862, 132840, 184883, 68716, 4132, -178074, -107643, -194554, 169998, 207766, 14518, -8093, -177009, 276695, 122124, 184975, -29595, 43006, 135557, -80519, -94714, 243568, -36734, -21753, 224451, 28139, 132640, 9129, 74682, 136698, 147553, 165309, 1915, 50462, -15615, 4611, 58209, -102440, 202782, -104926, -79018, -41330, 274513, 31140, 287496, -31883, 423075, 241164, 175134, 224247, 351778, -105544, 319438, 132709, 188906, 208758, -70048, 245924, 144256, 140834, 301758, 98585, -38913, 44627, 144265, 68542, 211603, 304822, 502356, 337272, 333385, 280621, 152386, 150756, 105136, 35636, -9655, 279703, 220702, 255727, 195466, 416332]
15118D16332j34574G4060c197o5599B02340H731K22686F239B147K47379N6658
15107C06184b12818A11196a19640e0063D18564H7140a02874G7506K60300H1936
15096A82764q7307b19534A52438K6821J21213E2827K5618j1698L31316j38974
15086B59089a55879B16819M6801I6834N0858o259e045A41844g6037C12536J7794
15075C30330L17949A43497L0515l9919J22446b70992A37787J42059L17442j45480
15065D51808A02596a04089A86750K59445A65888b8376B65963J4030j33407j3818
15055A32768a92285D74484B00343K24087j92761K95033j63848j14614C8217K21675
15045B59892b34834A6609K13872A2752P0445N45735B46269f1157B30308a14462
$$ y = [416332, 281758, 74060, -3197, -68796, 202340, 8731, 231417, 6239, 2147, 249526, 306184, -212818, 111196, -119640, -50063, 418564, 87140, -102874, 77506, 337806, 81936, 182764, 95457, -219534, 152438, 179259, 300472, 52827, 78445, 66747, 398063, 259089, -155879, 216819, 263620, 96834, 147692, 141433, -5045, 141844, -76037, 312536, 330330, 648279, 143497, 174012, 134093, 256539, -270992, 137787, 279846, 597288, 451808, 102596, -104089, 186750, 446195, 165888, -28376, 265963, 279993, 146586, 132768, -192285, 474484, 200343, 424430, 231669, 526702, 362854, 248240, 38217, 259892, -234834, 16609, 230481, 12752, 83197, 628932, 246269, -61157, 230308, -114462]
15034B34114J26533p396r9999L6672j11068K22584a17599C58698a13514j39172
15024b52686C14142B3189K99791r5006J4960j19411P2568a20680B42725Q6254
15014C28979j48031L0664F0368K3172J02966l0871l9217L9560F8739k459b8032
15002C67584O9803A98713p9793L00126A57788a27581D52386J93696j69385A45849
14991A02561h7436B65522N7609P9494J02451F6711J02948i2522a46G602L39627
14980C47229l0364i8003B16322q4559L25430B26847k4928A6893M3699A5281K28107
14969B43388E1011M12659E2252K74581O2573k3779j0781N4049j32297m819J31090
14958D02869N2502N9592k31237l9093K44243A52797P8715O4570j42504J53668
$$ y = [234114, 360647, 353251, 253252, 289924, 178856, 401440, -117599, 358698, -113514, -252686, 314142, 23189, 322980, 227974, 242934, 123523, 196091, -120680, 242725, 328979, 180948, 211612, 60368, 83540, 186506, 155635, 116418, 155978, 68739, 66280, -28032, 367584, 437387, 198713, 118920, 419046, 157788, -127581, 452386, 646082, 476697, 145849, 102561, -87436, 265522, 323131, 402625, 505076, 66711, 169659, -92522, -146, 7602, 347229, 316865, -98003, 216322, 131763, 457193, 226847, 201919, 16893, 60592, 15281, 243388, 51011, 463670, 52252, 326833, 389406, 365627, 354846, 408895, 276598, 271779, 402869, 455371, 514963, 283726, 244633, 488876, 152797, 231512, 296082, 153578, 307246]
14948C07246o7857q7247J56553j48583J79769J3889C4939M02188n7833q8228J64988
14937D56054j70086K00175k39444J05660J25123A47107Q3720q2231G440K72518
14927B79958B0259J07130B9848M34154m2468N7711L45711B09423K23165D6748
14916A84999M54324B81959M8422M37881A27267J36398L14953k82459K91974B52344
14905A30173M02858j63547A12258K27647d2536A55496P8496Q7364O343m0763L3397
14894C20333O6871j73096L66106j20052P9181l4637K75677B92671K42432B03403
14883D66275j19074K30370j54116j01204J12011l7858r0741j15238q3246L40779
14873D47958A17763L39475R9264k8094B16877K54645j77452H6081O31184k17076
$$ y = [307246, 239389, 152142, 308695, 160112, 339881, 353770, 34939, 437127, 379294, 291066, 456054, 285968, 486143, 246699, 352359, 477482, 147107, 230827, 148596, 7440, 279958, 20259, 127389, 29848, 464002, 421534, 479245, 824956, 209423, 432588, 46748, 184999, 639323, 281959, 330381, 768262, 127267, 263665, 578618, 296159, 588133, 252344, 130173, 533031, 369484, 112258, 339905, -42536, 155496, 233992, 321356, 327699, 286936, 320333, 387204, 214108, 580214, 460162, 539343, 504706, 780383, 292671, 535103, 203403, 466275, 347201, 577571, 423455, 322251, 434262, 396404, 305663, 190425, 107179, 447958, 117763, 457238, 556502, 528408, 216877, 471522, 294070, 86081, 717265, 500189]
14863E00189L2865o9389p0372J79910d9912D40241A42307M54682k78920a11857
14852C45789j40329J42884A58129M6085R7402N06358o1401j73642k27482P3121
14842D18570A76497K83835r6082J79537Q1825j47384P9135J00983j10802R9279
14832F46823O9419B05069N42723k74065K37072k21590j39322k7681O6129m4977
14822C43358K7325k1764L22066q7332k7804B76247j14149L49650L47459B72538
14811E61159A77208K78989j13718J37439J60866l01836M08001j27481j3112n6159
14801E50197k01070J64649n129m4682r952q0062A42836K32864j6755K68942J55281
14790G83168k9689m8679j21013j22698P211m5446L44418B90516J3040L14985C04468
$$ y = [500189, 533054, 463665, 393293, 573203, -49912, 440241, 142307, 596989, 318069, -111857, 345789, 205460, 348344, 158129, 204214, 301616, 807974, 746573, 572931, 345449, 418570, 176497, 460332, 364250, 543787, 625612, 478228, 557363, 658346, 547544, 646823, 716242, 205069, 747792, 473727, 710799, 489209, 349887, 322206, 388335, 343358, 370683, 348919, 670985, 583653, 555849, 276247, 162098, 511748, 859207, 272538, 561159, 177208, 456197, 342479, 479918, 640784, 338948, 746949, 619468, 606356, 550197, 349127, 513776, 508647, 463965, 454013, 373951, 142836, 375700, 358945, 627887, 783168, 753479, 704800, 583787, 461089, 468300, 422854, 767272, 290516, 303556, 618541, 304468]
14778E39765J25853J50632j98746J20772Q373K5415B49876J86140K99725J38532
14768H74273q4945M300j22013J2784k07216L14636C69495K29492L0250l109K4620
14757F50748k1787J31107k47001k7283L79261m12515J29341J20411k77861J90649
14747F15070n558L08362C05200O57949k47957k09665j52395M50029C68738O16410
14737I85148J77808k79370q1761j41768O6962J68627j28673l13729M69768k43846
14727F79166J0334n483L3478J39409j25052j96587M56208o2859j00566L5176L168
14716H66392k17456j9156K10285j3461q4600J09953J50462j08123L8048L7427
14706I69771j49857J68435J22273l23771J71993j41106K43956l22397M8870J65631
$$ y = [539765, 665618, 816250, 617504, 738276, 746649, 772064, 249876, 436016, 735741, 874273, 789328, 793628, 671615, 684399, 477183, 791819, 369495, 598987, 629237, 626128, 650748, 628961, 760068, 513067, 485784, 865045, 452530, 581871, 702282, 424421, 615070, 609512, 917874, 305200, 963149, 715192, 505527, 353132, 803161, 368738, 985148, 1162956, 883586, 801825, 660057, 727019, 895646, 766973, 453244, 923012, 679166, 689500, 684017, 717495, 856904, 731852, 535265, 991473, 928614, 828048, 863224, 866392, 648936, 629780, 840065, 826604, 742004, 851957, 1002419, 894296, 932344, 969771, 819914, 988349, 1110622, 786851, 958844, 817738, 1061694, 739297, 788167, 953798]
14696I53798n6231k3753j28507J61136R2468j41172K04830D85646O02961L2310
14686A120917P9062k01132K59849n08965K95608j13448r3578m5267J77634J44583
14676A115263j69693J15657J41948j5148j01143K3990L5968J21076j03267O547
14666A171198k34657J03415J00926P3746k8622J4044k57395J74124M08280k43522
14656A281537k24367K53836j44169j43006K93616K4549J2217k58002J9372M05137
14646A520720k75044J7709n7887K98091k95592L05336j62664M3810p4740o6831
14636A252908p8088M6423k27982J68251K96615J88244l10083k3805J28266l793
14626A436956N1991Q8327j54281j62564J35184J77659K36358k42482K6510j95945
$$ y = [953798, 897567, 873814, 745307, 906443, 998911, 857739, 1062569, 485646, 1088607, 1120917, 1199979, 998847, 1258696, 749731, 1045339, 931891, 838313, 793046, 970680, 1115263, 945570, 1061227, 1203175, 1188027, 1086884, 1110874, 1146842, 1267918, 1164651, 1171198, 936541, 1039956, 1140882, 1214628, 1186006, 1200050, 942655, 1116779, 1525059, 1281537, 1057170, 1311006, 1166837, 1023831, 1317447, 1341996, 1354213, 1096211, 1115583, 1520720, 1245676, 1263385, 1205498, 1503589, 1207997, 1513333, 1350669, 1394479, 1319739, 1252908, 1174820, 1221243, 993261, 1161512, 1458127, 1646371, 1336288, 1312483, 1440749, 1436956, 1488947, 1577274, 1422993, 1260429, 1395613, 1573272, 1809630, 1567148, 1593658, 1397713]
14616A397713j73776K01635K79039j630k16417j01204K55990Q5269k93468J01311
14606A534462r1455K00313K17192J3122N2640k21060j73726J12625P9577q4286
14596A639404K95444l67113K59476R6942J38157l13510j09713N63542k31948p2816
14586A897865k1124J61486J53629J04093k32280r68J23448k22082J77433m5379
14576B096121K18565J15945j90463p5690J89934j16126o8391L20940l8703j97144
14566B254988M35488k43289K32978j83407O84781q33471R30788q1587j08038p852
14556C081379M37192n2824M53896K59919p1620R09008O05656J915043M284690
14547A1822339P738620J8717340J0379606B0073044I015840j994789k217415j977281
$$ y = [1397713, 1223937, 1425572, 1704611, 1702981, 1486564, 1385360, 1641350, 1726619, 1433151, 1534462, 1443007, 1643320, 1860512, 1873634, 1926274, 1705214, 1531488, 1644113, 1723690, 1639404, 1934848, 1567735, 1827211, 1924153, 2062310, 1748800, 1639087, 2202629, 1970681, 1897865, 1876741, 2038227, 2191856, 2295949, 2063669, 2062701, 2186149, 1964067, 2141500, 2096121, 2314686, 2430631, 2240168, 2164478, 2354412, 2238286, 2169895, 2490835, 2452132, 2254988, 2690476, 2447187, 2680165, 2496758, 3181539, 2348068, 3278856, 3197269, 3089231, 3081379, 3518571, 3465747, 3919643, 4179562, 4107942, 5016950, 5622606, 7537649, 11822339, 19560959, 38278299, 48657905, 20073044, 9015840, 7021051, 4803636, 2826355]
14539B826355m77713j02613J15078m96431K68089J34517l9400J80046j65671q001
14529B234256l52865K05936L8122K17835J45057o5953O0371J38264q0759K5955
14519B566219K97539m15424N92561k06736k44045K68691K6307j22405K54538L0552
14509C047797M3505n9144K33960m1779k42434J15549m7387j25808K95317r4881
14499C124695J04573K70703j74220j26956K65861K8055j26515J84893J26649J44679
14489C822417k00462j08964L85350R5928K31034m14492K73323j03422j81604L67890
14479D166998j50345J94814n4570L42866k18267j02891K81125M2860o3696J02503
14469D541397j17633L0385N00620l23372K80244m07868L21188J55436j46751M05471
$$ y = [2826355, 2348642, 2246029, 2361107, 1864676, 2132765, 2267282, 2227882, 2407928, 2242257, 2234256, 1881391, 2087327, 2125449, 2343284, 2488341, 2422388, 2482759, 2621023, 2540264, 2566219, 2863758, 2448334, 3040895, 2834159, 2590114, 2858805, 2885112, 2762707, 3017245, 3047797, 3091302, 3032158, 3266118, 3224339, 2981905, 3097454, 3050067, 2924259, 3219576, 3124695, 3229268, 3499971, 3325751, 3198795, 3464656, 3492711, 3366196, 3551089, 3677738, 3822417, 3621955, 3512991, 3898341, 3994269, 4225303, 3810811, 4084134, 3980712, 3799108, 4166998, 4016653, 4211467, 4156897, 4499763, 4281496, 4178605, 4459730, 4502590, 4438894, 4541397, 4423764, 4454149, 4954769, 4631397, 4911641, 4503773, 4824961, 4980397, 4833646, 5239117]
14459E239117m9479L7017K94904n40913M65603N3969l31024P53108j31744n78497
14449E212061L79299J99767L63332q2275N1771J83916l58875K06807L04582m7125
14439F413260J01844K73523J30445k43305L50988q4904j1058J67960M84427m63160
14429G120020O36278j46310K29747j618Q54N2877K14578k27097L76760J83432
14419H439521J10412o7624L54695J65533M9593N4657l741K05293M26693k55114
14409I479918M17895k7747K61420k04993K71192K09064K69226J59165J34833L84085
14399A1354058J32489p0696L29578J53771L62640M55038j29822M35327j42054
14390A2880329M83813j20052N08428L0016L12645L88251J74524j83746J053240
$$ y = [5239117, 5189638, 5226655, 5521559, 4980646, 5446249, 5500218, 5169194, 5922302, 5790558, 5212061, 5591360, 5791127, 6154459, 6072184, 6123955, 6307871, 5948996, 6155803, 6460385, 6413260, 6515104, 6788627, 6919072, 6675767, 7026755, 6941851, 6930793, 7098753, 7583180, 7120020, 7756298, 7609988, 7839735, 7838117, 7838971, 7891848, 8106426, 7879329, 8256089, 8439521, 8549933, 8482309, 8837004, 9002537, 9052130, 9106787, 9103046, 9308339, 9735032, 9479918, 9897813, 9870066, 10131486, 9926493, 10197685, 10406749, 10675975, 10835140, 10969973, 11354058, 11486547, 11415851, 11745429, 11899200, 12261840, 12716878, 12587056, 13022383, 12880329, 13364142, 13244090, 13752518, 13782534, 14095179, 14483430, 14657954, 14474208, 15527448]
14381A5527448k43316P37736K4605J91008K04033M51432M66743M83161J39052
14372A7981902L09725Q01808P1801L81441K60082M37185M08015L95220O32074
14363B1679253L93505N08843M04785N13922M09868N06004N03678Q13538N29393
14354B6262789M44100J079751L00761P30835P97801N97549R82438L93065Q23344
14345C2412433Q77181R24317J056832N98282J510540Q22009Q76880R76319J241328
14336D1296121J267162J251651J020051J268765J825351J148679J443695J831833
14328E2353308J532161J708419J947640J758300K372368J944941J825881K576239
14320F8019257J959294K604291K619308L043622K940116K987683K946995L173759
$$ y = [15527448, 15284132, 16021868, 16046473, 16237481, 16441514, 16892946, 17359689, 17842850, 17981902, 18291627, 19093435, 19165236, 19546677, 19806759, 20243944, 20651959, 21047179, 21679253, 22072758, 22581601, 22986386, 23500308, 23910176, 24416180, 24919858, 25733396, 26262789, 26706889, 27786640, 28087401, 28818236, 29616037, 30213586, 31196024, 31589089, 32412433, 33289614, 34213931, 35270763, 35869045, 37379585, 38201594, 39078474, 40054793, 41296121, 42563283, 43814934, 44834985, 46103750, 47929101, 49077780, 50521475, 52353308, 53885469, 55593888, 57541528, 59299828, 61672196, 63617137, 65443018, 68019257, 69978551, 72582842, 75202150, 78245772, 81185888, 84173571, 87120566, 90294325]
14312I0294325L726341M028854L943273M334932M314483M759389M762723N008248
14304A25172568N620959O037575O322706O053537O880332P111518P686581P848800
14296A78734576Q474895Q785696R186215R582972J0626628J0727785J1433775
14289B47552542J1743253J2560264J2971721J3049429J3993508J4082264J4442546
14282C40395527J4399229J4708255J4188623J3951529J4349050J3033601J2097439
14275D37123253J1278327R289230O301097J046487n0835Q33796q31412k337071
14267D62652872m554026o342594r732522j1395537j3303322j4441077j4950408
14260C87933386j5487283j5883826j5750030j5478925j4974214j5431233j4304700
$$ y = [90294325, 94020666, 98049520, 101992793, 106327725, 110642208, 115401597, 120164320, 125172568, 130793527, 136831102, 143153808, 149207345, 156087677, 163199195, 170885776, 178734576, 187209471, 195995167, 205181382, 214764354, 225390982, 236118767, 247552542, 259295795, 271856059, 284827780, 297877209, 311870717, 325952981, 340395527, 354794756, 369503011, 383691634, 397643163, 411992213, 425025814, 437123253, 448401580, 457690810, 463991907, 465038394, 464987559, 465821355, 464989943, 462652872, 458098846, 451756252, 442023730, 430628193, 417324871, 402883794, 387933386, 372446103, 356562277, 340812247, 325333322, 310359108, 294927875, 280623175]
14253B80623175j3256863j2217337j2843090j1838411j1546379j1045949j0068482
14246A97806664r620469q808297q300158q210554p521800p321360o653874o626785
14238A34743367n645284n438352n466521n186738m664679m679278l774365l807225
14230I6080925l589975m314806k921890l401917l358351k440172l104958k519847
14222G0429009k691943k441932j483162k494838j730390k016409k117667j457020
14214E3995648j762013j280538j858739j580721j417016j338893j467028n50092
14206D2740608j049764j647370q61836j327662n99405j115464n73226j256826
14198C4309055r57024r01945p07559j267992k39630q80699q98674n50172p13563
$$ y = [280623175, 267366312, 255148975, 242305885, 230467474, 218921095, 207875146, 197806664, 188186195, 179377898, 171077740, 162867186, 155345386, 148024026, 141370152, 134743367, 129098083, 123659731, 118193210, 113006472, 108341793, 103662515, 99888150, 96080925, 92490950, 88176144, 85254254, 81852337, 78493986, 76053814, 72948856, 70429009, 67737066, 65295134, 63811972, 61317134, 59586744, 57570335, 55452668, 53995648, 52233635, 50953097, 49094358, 47513637, 46096621, 44757728, 43290700, 42740608, 41690844, 40043474, 39181638, 37853976, 37254571, 36139107, 35565881, 34309055, 33352031, 32450086, 31742527, 30474535, 30234905, 29354206, 28455532, 27905360, 27191797]
14189B7191797k97269r99468m53491l61686m31559p53067o58396l75756k75577
14180B2585528n61407n64573n78638m13692l87270l45858k10248o40499l89759
14171A8493584k98228l96791k07364n65010p3631m27999l8088n33491k86889j70602
14161A5495491l68851k36634j77371l79185J08261m17713m42271l46413q2249
14152A3153065j39164j82068l75745k37384j14380p0139j15092m96764j73510
14143A1248819J14921j0094k24557l29157q1238j03553k63473o9520k89568k44894
14133I747686K49734k18737j96705n23619m1174J52279j10107m49903J29699j33374
14123H605779k35635j13397j34485l1360k56155m7629N4785k6894k42183j17068
$$ y = [27191797, 26894528, 25895060, 25441569, 25079883, 24648324, 23895257, 23236861, 22861105, 22585528, 22024121, 21459548, 20880910, 20467218, 20079948, 19734090, 19523842, 18883343, 18493584, 18195356, 17798565, 17591201, 17026191, 16952560, 16524561, 16486473, 15952982, 15666093, 15495491, 15126640, 14890006, 14712635, 14333450, 14441711, 14023998, 13581727, 13235314, 13153065, 13013901, 12831833, 12456088, 12218704, 12104324, 12034185, 11919093, 11422329, 11248819, 11363740, 11353646, 11129089, 10799932, 10718694, 10615141, 10351668, 10282148, 9992580, 9747686, 9997420, 9778683, 9581978, 9058359, 9017185, 9169464, 9059357, 8609454, 8739153, 8605779, 8370144, 8256747, 8122262, 8090902, 7834747, 7787118, 7841903, 7815009, 7572826, 7455758]
14113G455758J25205o89261N11891o57195K98429m8778n96178L76205N9784l17254
14103F518606J62401k77868J39843q9128k77459J47718l94201K53218k61983p7418
14093E843729K11128o07851L33702m38311M66250k32713l67647O4887L3202o7285
14083E239091k25248R6287Q1738L5835l58432J22776l8413O8445k60117k88521
14073D473441L44153j80476Q3816l97957K66244m86844N87347l58410Q5407l30235
14063D086486M97328k69700k9594l69496M30951j81757J06384l79749p5249K90304
14053D105908j59833k72787K24699j12094J22315m63508J29346K16886J06038
14044C896970m62699J41080k35762j2430J39027q7556o7442j17515n38450P55123
$$ y = [7455758, 7580963, 6891702, 7403593, 6746398, 7044827, 6996049, 6399871, 6776076, 6835860, 6518606, 6681007, 6403139, 6542982, 6453854, 6176395, 6324113, 5929912, 6183130, 5921147, 5843729, 6054857, 5447006, 5780708, 5342397, 5808647, 5575934, 5208287, 5273174, 5306376, 5239091, 5013843, 5110130, 5191868, 5227703, 4869271, 4992047, 4953634, 5022079, 4761962, 4473441, 4817594, 4637118, 4720934, 4322977, 4589221, 4102377, 4689724, 4331314, 4416721, 4086486, 4583814, 4314114, 4284520, 3915024, 4345975, 4164218, 4270602, 3890853, 3815604, 4105908, 3946075, 3673288, 3897987, 3785893, 3908208, 3444700, 3574046, 3790932, 3896970, 3434271, 3575351, 3339589, 3327159, 3466186, 3378630, 3311188, 3193673, 2655223, 3410346]
14034C410346j58195j55253l1403M47699j85337k68640J70543l47964M37338l31627
14024B987507l98968Q7230K03173L5042k17789J02414k44894J52396k20198r7324
14014B388589r8399L86078l9312n3186k07200L18801k65077N4479O2960m46723
14004B101010j64662M15877K11495j30461j54157k29870K66621k45055L04547
13995B375345J03509k16310m4753K65104K1683N72082P09935L136453N967073
13986A2890121J6529481K1147674k3302258j3507182n753078j925508j389555
13979D689695m11377p34713J02404m99139j64776J34527J02804m12406k51646
13970B555373K84058l4578l27174J94304k15418N8826l7182k17045q4562p2482
$$ y = [3410346, 3252151, 3096898, 3065495, 3513194, 3327857, 3059217, 3229760, 2881796, 3319134, 2987507, 2588539, 2675769, 2878942, 2913984, 2696195, 2798609, 2553715, 2706111, 2485913, 2388589, 2290190, 2676268, 2636956, 2583770, 2376570, 2695371, 2430294, 2484773, 2547733, 2101010, 1936348, 2352225, 2563720, 2433259, 2279102, 2049232, 2315853, 2070798, 2375345, 2478854, 2262544, 2217791, 2482895, 2504578, 3076660, 3786595, 6923048, 12890121, 29419602, 50567276, 27265018, 13757836, 8004758, 6079250, 4689695, 4278318, 3543605, 3646009, 3146870, 2982094, 3116621, 3219425, 2807019, 2555373, 2839431, 2804853, 2477679, 2671983, 2456565, 2515391, 2478209, 2261164, 2176602, 2104120]
13960B104120k19549M21675P5237j79177l30758j72944N64678n03993K63174j50481
13950A871982J09649K11686j1851l6062j3847m0385R2908j9340m1422k98089P4909
13939A900138j37281K6591L46041j41167k6578K2121l41456L07606j96064k39122
13929A520829K14133J68152k67612J71412J41229j25769j4266j96634k37799M01728
13919A775403r4333J32301j87677p6962k43983M39739j02832j95911j03761J85708
13909A527692K66063j40585j03564l51619K63564O6420k10585K20275k63675K47667
13899A521653j13794k21884J1009J71605K07695l41025j7456L54902j05510j86098
13889A281097K03224j59386k17853J55410P3428K45803l01364M33693O9715k90316
$$ y = [2104120, 1884571, 2306246, 2381483, 2202306, 1871548, 1698604, 2263282, 1759289, 2022463, 1871982, 1981631, 2193317, 2181466, 2145404, 2131557, 2091172, 2184080, 2164740, 2123318, 1825229, 1900138, 1762857, 1789448, 2135489, 1994322, 1967744, 1989865, 1648409, 1956015, 1759951, 1520829, 1734962, 1903114, 1635502, 1806914, 1948143, 1822374, 1808108, 1611474, 1373675, 1775403, 1681070, 1813371, 1625694, 1548732, 1304749, 1744488, 1641656, 1445745, 1341984, 1527692, 1793755, 1653170, 1549606, 1197987, 1461551, 1527971, 1317386, 1537661, 1273986, 1521653, 1407859, 1185975, 1196984, 1368589, 1576284, 1235259, 1217803, 1572705, 1467195, 1281097, 1484321, 1324935, 1107082, 1262492, 1335920, 1581723, 1280359, 1714052, 1783767, 1493451]
13879A493451r1367q9191k55201L48878O9126k88268K63432k06081r7j81327J09689
13868A173044r4876J26498J54113o6425J9053J65806m19815N70164n50971L27561
13858A404152m17757N1492r5231P7150j74145K71254L6494k12192K23769R9585
13848A264571J14198k38441l67080J82406j3339j0874k70242O92467l78734R4323
13838A069255p7111M2020l2833j19123j84421L24864L7604m7007K59103k57337
13828A015014O9733j55968j36485K07405n1353o6142o0237J70022J19010R002
13818A120001j73333j96172M54192l83732N8304l5508J67344m3147O2914k66424
13808G64439R6747J54107l03134j92387J84045K10126P4456n117j99997J72186
$$ y = [1493451, 1402084, 1312893, 1057692, 1406570, 1475696, 1187428, 1450860, 1244779, 1244682, 1063355, 1173044, 1078168, 1204666, 1358779, 1292354, 1311407, 1477213, 1057398, 1627562, 1076591, 1404152, 986395, 1037887, 942656, 1019806, 845661, 1116915, 1153409, 941217, 1164986, 1264571, 1378769, 1140328, 773248, 955654, 942315, 931441, 661199, 1353666, 974932, 1069255, 992144, 1034164, 1001331, 882208, 697787, 1022651, 1060255, 1013248, 1272351, 1015014, 1084747, 928779, 792294, 999699, 948346, 882204, 821967, 991989, 1110999, 1120001, 946668, 750496, 1204688, 820956, 879260, 843752, 1011096, 967949, 1030863, 764439, 861186, 1015293, 712159, 519772, 703817, 913943, 988399, 983282, 783285, 955471]
13798I55471n50j06931q9358m0612j64732K95792L3339o5636O9862j00958q6485
13787F99202n1115J46676j05628P4026P1386r2613N7852M7312k30424M16363m43021
13776E90016K34597L40289m47780B69898L50097j97625N14223j12066J71274k52322
13766G43479J11361K96660k97314k45465M7436K0285N5253j05633L40933k07005
13756G59990R8925m1560B56688N00866M1284K7203l94088M11554k28074r4544
13746E20889M98921D06162J60579j16838j4060P5397J19872K14576n8523k21238
13736E65927j5781L75666l88923K03233l51628j66319K72872j32499K94460j28427
13726E28581K63476k21329N595J38116j58755M14790C22918Q4301L19048M5026
$$ y = [955471, 954921, 847990, 758632, 718020, 553288, 849080, 882419, 816783, 886645, 785687, 699202, 648087, 794763, 689135, 763161, 834547, 741934, 799786, 847098, 616674, 1033037, 590016, 824613, 1164902, 717122, 269898, 619995, 422370, 936593, 824527, 995801, 743479, 854840, 1151500, 854186, 608721, 656157, 676442, 731695, 626062, 966995, 759990, 858915, 817355, 256688, 757554, 798838, 826041, 431953, 843507, 615433, 520889, 1019810, 406162, 566741, 449903, 435843, 511240, 631112, 845688, 787165, 565927, 550146, 925812, 536889, 740122, 388494, 222175, 495047, 362548, 657008, 528581, 792057, 570728, 576323, 714439, 555684, 970474, 322918, 407219, 726267, 771293]
13716G71293K32488l87221j37057J00628j59170k9916N16228l92377m7066K88043
13706G55873B40045K85601J50175j23178k09108J52721q4261K30456M1219N2783
13696G36453C38600J4720K97317n9571k59371J19971J8820j1885J40866j69697
13686D29770K1999j44405J87684j02117l5665M15726k54397l4513O2623J46903
13676F93608l8316C20302J88552j47689L17915j6639J11386C05378O59025A17228
13665E90547B64708M26063p0561G8454N79852o9485r4059j40014L06811m7237
13655F14322j21174J40686N4456B71133P4694J01614j22045K53911j79385j86447
13645B13475L41080O0158B59499N8784J29583k2027C1093K50896F9094A3773O48409
$$ y = [771293, 1003781, 616560, 479503, 580131, 420961, 391045, 907273, 514896, 467830, 755873, 240045, 525646, 675821, 552643, 343535, 496256, 411995, 642451, 683670, 736453, 338600, 353320, 650637, 591066, 331695, 451666, 470486, 458601, 599467, 429770, 451769, 307364, 495048, 392931, 357266, 772992, 518595, 484082, 546705, 693608, 655292, 320302, 508854, 361165, 679080, 662441, 773827, 305378, 964403, 117228, 590547, 264708, 690771, 620210, 78454, 658306, 588821, 494762, 354748, 661559, 614322, 493148, 633834, 688290, 271133, 345827, 447441, 325396, 579307, 399922, 213475, 554555, 614713, 259499, 318283, 447866, 425839, 31093, 281989, 69094, 13773, 662182]
13634F62182l14635j3815L21972B93314J04857F9421M68179B11173K68081j30324
13624C48930B0657M51558J44886j54037j83907K57964R3599j20625j87B18371
13613F04377k83386P603L8307J03221o9420J69234j78851j4422A51868J62565
13603C14433K4639J90398B56328K3220K0287J33904A40683K71394j58275O2344
13593C16146p7412J82592r0874K47304N4236j16481L3558k32642o0197I1913L74041
13582D65954K2770A32609J14817j12035M10689A23453Q7088J72260n6215j04828
13572B21758J44469M6118l2939l5391J93675B61087J74165A76662K19903A75521
13561F04977j63560j62413J49237O5512K29946A56802N12057N1681l09259J86683
$$ y = [662182, 347547, 333732, 655704, 293314, 398171, 69421, 537600, 211173, 479254, 348930, 20657, 472215, 617101, 463064, 279157, 537121, 630720, 510095, 509908, 218371, 604377, 320991, 328594, 366901, 470122, 400702, 569936, 391085, 376663, 151868, 314433, 339072, 529470, 256328, 279548, 299835, 433739, 140683, 412077, 253802, 316146, 238734, 421326, 330452, 577756, 631992, 515511, 549069, 316427, 256230, 91913, 465954, 488724, 132609, 247426, 135391, 546080, 123453, 210541, 382801, 326586, 221758, 366227, 412345, 379406, 344015, 537690, 261087, 435252, 176662, 396565, 175521, 604977, 441417, 279004, 428241, 493753, 723699, 156802, 668859, 720540, 411281, 597964]
13551E97964j95522R692J63975A40819J49350p7074K65203K3017k26271j12275
13541A62769K03400P6247A7576f951C05120P9160l5903j25949J5863R0651r5409
13530B33533J92433A6830Q8342L2646J24569J06386A63713N75013C45016o7810
13520B77206K10873A59789J1091J14166q0788p210J88279j47423L0236J39831
13510D07971Q3079O1630k37488j34037a50972C58631A29059L94226k61228J4025
13500B76082J22599j40137m1412J72205J17434j52601J36626A73516M0684K5709
13490B39909A03352O7205R9369L40303A53246j5739D4344J0074J34968M51004
13480F40390G1107j6210K54463m330n3786p9056J57595H0542Q9627O6449L83077
$$ y = [597964, 402442, 412134, 576109, 140819, 290169, 213095, 478298, 501315, 275044, 162769, 366169, 442416, 17576, -6951, 305120, 384280, 348377, 222428, 238291, 328942, 233533, 425966, 16830, 105172, 137818, 262387, 368773, 163713, 738726, 345016, 277206, 488079, 159789, 170880, 285046, 204258, 197048, 385327, 237904, 268140, 407971, 491050, 552680, 315192, 181155, -150972, 358631, 129059, 523285, 262057, 276082, 398681, 258544, 217132, 389337, 506771, 354170, 490796, 173516, 214200, 239909, 103352, 170557, 269926, 610229, 153246, 137507, 44344, 54418, 189386, 640390, 71107, 54897, 309360, 305030, 251244, 172188, 329783, 80542, 170169, 236618, 619695]
13469F19695j71232o2078b50306B04419M5499J01468q8338j6289J71061I5460
13458C21240J9674K9785j66789O0031j16063J62147A3577P9390B2761d1839B20946
13446B51010L24905J87321b1423E27712a46835A56990M5284K05407A07576A8436
13435B06837J35284D5455K33027K7245j39289l5070J2034N4112C0161O5332a59795
13423B77082A16490K07188r0137K44419B21430m0605F5228d3653G4631Q4279G1694
13411B38333j0747a18320g36C94614j77354C93b6371D23167j29944q2497J7298
13400B28024a20276A73622K04075j77698a00042B20663Q5950k2887I5503J36081
13390B31584M8895q8765D4833M67773f0805l4058o5927A48934L12550j27550k3858
$$ y = [619695, 448463, 386385, -250306, 204419, 249918, 351386, 263048, 246759, 417820, 95460, 321240, 340914, 370699, 203910, 263941, 147878, 310025, 13577, 92967, 22761, -41839, 220946, 251010, 575915, 763236, -21423, 527712, -146835, 156990, 202274, 407681, 107576, 18436, 206837, 342121, 45455, 278482, 305727, 166438, 131368, 143402, 197514, 30161, 95493, -159795, 277082, 116490, 323678, 233541, 477960, 221430, 180825, 65228, -43653, 74631, 158910, 71694, 238333, 227586, -118320, -736, 394614, 217260, 393, -26371, 423167, 293223, 210726, 228024, -120276, 173622, 377697, 199999, -100042, 220663, 306613, 283726, 95503, 231584, 280479, 191714, 44833, 512606, -60805, -94863, -160790, 148934, 461484, 333934, 310076]
13379C10076p8144J36418J42246B08307F9617K02513L92701B19091K04586c3163
13368E99678C3674N84M3663M54224B36242o0921J51832l3759j40994C2003J54540
13357A86543J66187f9556B958i5362C41229O5526a8725E30617B28641c9667E12473
13345I8931J53519M0630K32101j86168j5170A36791N7729M8867J53294A82812
13334E30782a71032C72694A52451L13597A12666R2238J02174O4638D6653L49136
13324C95789j45196j0786J14067R5201j50257J6713l9185b7568A83406E6952F552
13312A34214L29484j78395h591A52894M2864G8243K77937A12801J69407Q9864
13302C72072Q6310E7175J29725J27582a01157C1630a85678B0381i6424A10391
$$ y = [310076, 231932, 368350, 510596, 208307, 69617, 272130, 664831, 219091, 423677, -33163, 599678, 33674, 34258, 77921, 532145, 236242, 175321, 327153, 293394, 152400, 32003, 186543, 352730, -69556, 2958, -95362, 341229, 406755, -18725, 530617, 228641, -39667, 512473, 98931, 252450, 293080, 525181, 339013, 323843, 136791, 194520, 243387, 396681, 182812, 530782, -171032, 372694, 152451, 466048, 112666, 204904, 307078, 371716, 46653, 395789, 250593, 239807, 353874, 449075, 298818, 315531, 276346, -27568, 183406, 56952, 6552, 134214, 463698, 285303, -8591, 152894, 195758, 78243, 356180, 112801, 282208, 372072, 458382, 57175, 186900, 314482, -101157, 31630, -185678, 20381, -96424, 110391]
13291G2068J0838a33652c1330A20617L31592N8140k40562J49645I5722a89934
13280A99428J22021b6274I7524K70966L6053i6916h383p4768A49062J80621A26694
13268A13322m6231J7243K29105A5456K33703r4876J87454e4586H2509M3023E5137
13256a66423I6775L76579q3269e6884C01112b66830a08825n0314A23720K96562
13246D20282j23024a2290A41761n945d15A61341l3034A6180K87203a6241C57331
13234C86561G2558J55372C0736g2032A07115l2772N994A4757R5947a87394E54
13222A0690R5622i977q0024L8000C08105j7150C3446a96009B39022p1054a97095
13210b2599D3575Q7636a09209L0566m4153M0681A82859J22032a48814B20731O9690
$$ y = [72068, 82906, -133652, -31330, 120617, 452209, 510349, 269787, 419432, 95722, -189934, 199428, 321449, -26274, 97524, 368490, 404543, -96916, -8383, -83151, 149062, 329683, 126694, 113322, 67091, 84334, 313439, 15456, 249159, 154283, 341737, -54586, 82509, 125532, 55137, -166423, 96775, 473354, 390085, -56884, 301112, -266830, -108825, -159139, 123720, 420282, 297258, -12290, 141761, 135816, -415, 161341, 128307, 16180, 303383, -16241, 357331, 386561, 72558, 227930, 30736, -72032, 107115, 74343, 80337, 14757, 110704, -187394, 554, 10690, 106312, -9977, -90001, -52001, 308105, 290955, 33446, -196009, 239022, 167968, -197095, -22599, 43575, 131211, -109209, -78643, -122796, -82115, 182859, 304891, -148814, 220731, 290421]
13199B90421a69321C58956K8816b02108A65186k1321B9951L52438g7757C45697
13188D3753a9602e004A54348b2834h360A95944J86770b59109G2216a2692E47084
13176B38263f8050p718A12645b81230D40838j51651G9525h8302D27893A60176
13165B99512e9475B48052j16409a06195A85907A9431L1528J70895d5223A03479
13154a17702C88860a21074F22737B69627a85853A49613D2174J53918J22007a05802
13143A28363R410a3588B6934c2324A77894M0068E291N9445b21287B66575b55422
13131f287n3743D96760A34039k4793m5723j1234g8451c4722H0516L8609E4309
13119h6225B56753a882A91410M436l8577g7507A39850k8155a73026A24170K04820
$$ y = [290421, -169321, 358956, 387772, -202108, 165186, 143865, 29951, 382389, -77757, 345697, 43753, -19602, -5004, 154348, -22834, -8360, 195944, 382714, -259109, 72216, -12692, 547084, 238263, -68050, -75768, 112645, -281230, 440838, 289187, 79525, -88302, 427893, 160176, 299512, -59475, 248052, 131643, -106195, 185907, 19431, 50959, 221854, -45223, 103479, -117702, 388860, -121074, 622737, 269627, -185853, 149613, 42174, 196092, 318099, -105802, 128363, 137773, -13588, 26934, -32324, 177894, 217962, 5291, 64736, -221287, 266575, -255422, -6287, -60030, 496760, 134039, 109246, 63523, 52289, -78451, -34722, 80516, 119125, 54309, -86225, 256753, -1882, 191410, 195846, 157269, -77507, 139850, 111695, -173026, 124170, 328990]
13108C28990E7700K09443H1521q301M4408b9374B8307d9091i164L471D94071F5137
13095h3186C7474j1614a97603A50916J07537A13833f9698I6611a2223H2307i734
13083b24426A50103L87201H1061L39405j29607a0872A48384c46550A17988P8589
13073A96577m9137G0586O5069J18658a94203A54739G0720l3685a13709A67919
13062D67710E752J71523R9048C7641P4541M6738E7325L60481j24109C1471g0084
13050B13768b89837A04397J91989a8298A2995R6760d9362C1596M132J77361L28277
13039E41366k49778m0759q5153J56219M7326j47246J05213G4154B7451b1139n7933
13028g9072B1695c26863H3092c3082C13408M1635b1439E9855R1918L3888J8546
$$ y = [328990, 57700, 267143, 81521, 73220, 117628, -29374, 28307, -49091, -9164, -5693, 494071, 65137, -83186, 37474, 25860, -197603, 150916, 258453, 113833, -69698, 96611, -12223, 82307, -9734, -224426, 150103, 537304, 81061, 420466, 290859, -10872, 148384, -346550, 117988, 196577, 147440, 70586, 135655, 254313, -194203, 154739, 70720, 37035, -113709, 167919, 467710, 5752, 177275, 276323, 37641, 112182, 158920, 57325, 417806, 293697, 31471, -70084, 213768, -289837, 104397, 296386, -18298, 12995, 109755, -49362, 31596, 35728, 213089, 541366, 291588, 250829, 165676, 321895, 369221, 221975, 327188, 74154, 27451, -21139, -79072, 21695, -326863, 83092, -33082, 313408, 355043, -21439, 59855, 151773, 185661, 204207]
13017B04207p230G5633h2711B0132b26241E191J15458a69126A71562d94665F9216
13005A94260J05438g3665j61124B76259j18157j5733K23405G9719R3375m6577
12995A26517b6169E2087J04913Q0112b371A98845r8928K6836q528d1455C21351
12983a55721e8914p165B04832p0240n1625Q5911K00054b0716A65005k7127g6516
12971i1029B03986K0222a39827A99760q9870a13767B48417c3877D71297e3084
12960d4327r096p8970A6522K68423c6325j46265O8270F1566J43793e9838B638
12948g4810r0185A23993N8935G5208c60966J12223I8661L13242c3192B21550a049
12936A19280i7202H7181D3493a37303B05277F3024J23799J38604A41932f2805
$$ y = [204207, 196977, 75633, -82711, 20132, -226241, 5191, 120649, -169126, 171562, -494665, 69216, 194260, 299698, -73665, -234789, 276259, 158102, 142369, 365774, 79719, 173094, 126517, -26169, 52087, 157000, 237112, -2371, 198845, 99917, 126753, 118225, -41455, 321351, -155721, -58914, -66079, 204832, 134592, 82967, 168878, 368932, -20716, 165005, 137878, -76516, -91029, 203986, 224208, -139827, 199760, 109890, -113767, 248417, -33877, 471297, -53084, -44327, -53423, -132393, 16522, 284945, -36325, -182590, -114320, 61566, 205359, -59838, 2638, -74810, -164995, 123993, 182928, 75208, -360966, -248743, 98661, 411903, -33192, 221550, -1049, 119280, -97202, 87181, 43493, -137303, 205277, 63024, 186823, 325427, 141932, -62805]
12925A24566d9361e071A10011d4329A30809J52685B2953b22476D923M53395a31529
12913h5305B7701b70062H982d5102q4223A51403d7964o3319D9480L13196a78426
12901b8068j348k13005f2737r8198B49359b07571P071L1722f0874C3874K64486
12890B98360F8649O3579e6503A74723k0700c48487A50079J73940A8045L22873
12880C40918Q9595c81575a42385A68085p6017e7177B46281c7980B28907c61064
12869A17047C7597a16837k9985o4756k4256C3360h8255F1817e8633A20046a0689
12857a29001d9729B81158A8965J37148P5775d126j40760a1532A28769h064j64293
12846a72357M3330N9722o2421A51345g889B34386D3362f3160a9163j4205k42088
$$ y = [124566, -49361, -5071, 110011, -44329, 130809, 283494, 22953, -222476, 4923, 458318, -131529, -85305, 27701, -270062, 8982, -45102, -129325, 151403, -47964, -111283, 49480, 362676, -178426, -28068, -29416, -242421, -62737, -160935, 249359, -207571, -200500, -168778, -60874, 33874, 298360, 68649, 132228, -56503, 174723, 154023, -348487, 150079, 324019, 18045, 340918, 430513, -381575, -142385, 168085, 92068, -57177, 246281, -37980, 228907, -361064, 117047, 37597, -116837, -146822, -211578, -235834, 33360, -88255, 61817, -58633, 120046, -10689, -129001, -49729, 281158, 18965, 156113, 231888, -4126, -144886, -11532, 128769, -8064, -172357, -129027, -69305, -131726, 151345, -7889, 234386, 43362, -63160, -19163, -33368, -275456]
12835b75456b625j90477E2843L33630b24849L0303A45137h28j45058K9563B00528
12823G4630a27140e9884E0650a31580f1352C02440G0796f5567A5949K15191a20808
12811b44873H8689L28C6830a13783D5808J93302b72900C76402A64123I419M5360
12800E4779J56464G2654f9243R947A70065C9560c21224J44580d1993j78602J420
12789b19175E3811k02K32971b09245g2322j3216B09530D1029L3951O5506N8833
12778A99319d9597K1308C21264a30307J0000d7129B9087c37707D14746A98047
12767h2909B2731K4071K3746K77398b4017A63181N1719b24350A5375c8908k2831
12756f1739B74362h1859B71142A00789J00764c6241M233A27533j543a7177q7583
$$ y = [-275456, -2625, -193102, 52843, 386473, -224849, -194546, 145137, -828, -145886, -116323, 200528, 74630, -127140, -59884, 50650, -131580, -61352, 302440, 70796, -65567, 15949, 231140, -120808, -244873, 88689, 89017, 36830, -113783, 45808, 239110, -272900, 376402, 164123, 9419, 54779, 211243, 72654, -69243, -59296, 170065, 39560, -321224, -176644, -41993, -220595, -219175, 53811, 53609, 286580, -209245, -72322, -85538, 209530, 41029, 74980, 140486, 199319, -49597, -28289, 321264, -130307, -120307, -47129, 29087, -337707, 414746, 198047, -82909, 22731, 46802, 70548, 347946, -24017, 163181, 214900, -224350, 15375, -38908, -61739, 274362, -81859, 271142, 100789, 201553, -36241, -32008, 127533, 125990, -17177, -104760]
12745a04760B55789A25191b10248A32872b49895j64076D4654a29880B72127e6695
12734G2882J27912N8673k3407A13732B0145a3133C03899a15253B11797D0875K13923
12723B54798e9976B58234j17586b18402n6977a8004A77061c240l09838G4539J43085
12712B17624b18912C22876j08060K12648j48850O8962b25290C42288k0803Q9142
12702D10627A3928a7759D97840j98099j45752a14801M3738B85815j3385A14568
12691E7513i7827j79567A8142K94883o9745D7075a71070A12399J7908a17226A41327
12679a13260k22067A59634D530J85344b77855a15079I238J73045a08419A3596
12668c01718A10826b3127A59979c7914r0084C95981j61889j06343K1358J72165
$$ y = [-104760, 255789, 125191, -210248, 132872, -249895, -413971, 44654, -129880, 272127, -56695, 72882, 200794, 259467, 236060, 113732, 20145, -13133, 303899, -115253, 211797, 40875, 254798, -59976, 258234, 140648, -218402, -275379, -18004, 177061, -3240, -313078, 74539, 217624, -218912, 322876, 214816, 427464, 278614, 347576, -225290, 342288, 321485, 410627, 13928, -17759, 497840, 299741, 153989, -114801, -71063, 285815, 272430, 114568, 57513, -97827, -277394, 18142, 313025, 243280, 47075, -171070, 112399, 130307, -117226, 141327, -113260, -335327, 159634, 4530, 189874, -277855, -115079, 9238, 182283, -108419, 13596, -301718, 110826, -23127, 159979, -37914, -127998, 395981, 234092, 127749, 149107, 321272]
12658C21272d5762A70601a39430B70027j16963K12260p7018H6928K4186b74152
12647D8929g9854G5228d045A86551o2118a11080L4665B01139H661J33773e7520
12635I4332J93660e1035j18598A95438l7700F4677N671N51106B65863E0901J20194
12624A71095J09855g7136A56752c05224C16575i2658E7224K31098l985a1207C39033
12612C7163a28306b6315r168G4211L16042A83307J77929j56982Q6312a1574P5
12601a1499j66898F7965p164P0328g1520C68640I3215i592A53598a22794b2212
12589A75968i327j44094D7082a724G5408h0110n7341A65707b47800f1602B78380
12577a10704B71291J30280a90814G7580i1263A86768J00053a24483B38155g1380
$$ y = [321272, -45762, 170601, -139430, 270027, 153064, 365324, 288306, 86928, 111114, -274152, 48929, -79854, 75228, -4045, 186551, 124433, -111080, -76415, 201139, 8661, 142434, -57520, 94332, 287992, -51035, -169633, 195438, 157738, 64677, 70348, 621454, 265863, 50901, 171095, 280950, -77136, 156752, -305224, 316575, -92658, 57224, 288322, 284337, -11207, 339033, 37163, -128306, -26315, -35483, 74211, 390253, 183307, 361236, 204254, 290566, -11574, -11499, -178397, 67965, 60801, 131129, -71520, 368640, 93215, -9592, 153598, -122794, -22212, 175968, -9327, -153421, 47082, -1724, 75408, -80110, -137451, 165707, -247800, -61602, 278380, -110704, 271291, 401571, -190814, 77580, -91263, 186768, 286821, -124483, 238155, -71380]
12566B15993j5163F6518h8819j91791h6133j0332o7091k5338A614K3850J85137
12555B10601c0302A02546j5683a03198H2628j9224A0844P7905J69652a86997A7223
12543h4327B1559J96199r1426L9756a82824a5079A82657a05157K5810B32935M6353
12532B79288b18632B09295N868n8050a01791j04644R4453h301j54854L0370C62117
12520c5622H9365R3835f2105C04358i0224K3070l017C5918a07521C12001a6088
12508b0377k82297B45273J31082a68573O2540H439a9767A70252b701D85177b8616
12496b4988B53870a18929N7169C265K96793d1601A86610C0831i1600j84553a020
12484b10627f3557B36989b3268r9562A37307F4930I209J32760J36222J7307g6710
$$ y = [215993, 200830, 66518, -88819, -280610, -86133, -96465, -163556, -188894, 1614, 25464, 210601, -30302, 102546, 86863, -103198, 82628, 63404, 10844, 88749, 258401, -186997, 17223, -84327, 21559, 217758, 126332, 166088, -182824, -15079, 182657, -105157, -79347, 232935, 279288, -218632, 209295, 215163, 157113, -101791, -206435, -111982, -8301, -163155, -132785, 362117, -35622, 89365, 183200, -62105, 304358, -90224, -67154, -70171, 35918, -107521, 312001, -16088, -20377, -302674, 245273, 376355, -168573, -106033, 8439, -19767, 170252, -2701, 485177, -28616, -24988, 253870, -118929, -61760, 3265, 300058, -41601, 186610, 30831, -91600, -276153, -1020, -210627, -63557, 236989, -23268, -122830, 137307, 64930, 9209, 141969, 278191, 295498, -76710]
12472f7169A65899e965C34196a11246j44956P3758e0057P662I3269c59123g5821
12460c53694B06238M6105E7156i1608j52031Q7052A15163E1060Q7298J86562a22400
12448c08497A78604a06998A21996h6194j73991P0440e0744B4302R7296g5089p9019
12437a54108A28029j5661b78966g1807j3965j6132A51297l3168l8990J96535b23048
12425a70217A2155a76494k9847E8204P3881M0999A7199f1616o4856O1773A7639
12413c75263A51429a10663J8411k0969k15277e025D42208B05465G5203O7324C1304
12401A35805i0570k9863r631e6823G3853b45711d6868b2517k2227j3017A75544
12389B49560b06447A6549i611B52193o1978b12985A64834p2931a38771c8545l5886
$$ y = [-67169, 165899, -5965, 334196, -111246, -256202, -182444, -50057, -42395, 93269, -359123, -75821, -353694, 206238, 252343, 57156, -91608, -243639, -156587, 115163, 51060, 138358, 324920, -122400, -308497, 178604, -106998, 121996, -86194, -260185, -189745, -50744, 24302, 121598, -75089, -154108, 128029, 112368, -278966, -71807, -85772, -101904, 151297, 118129, 79139, 275674, -223048, -170217, 12155, -176494, -206341, 58204, 132085, 173084, 17199, -61616, -126472, -64699, 17639, -375263, 151429, -110663, -92252, -113221, -328498, -5025, 442208, 205465, 75203, 142527, 31304, 135805, -90570, -120433, -130064, -56823, 73853, -245711, -46868, -22517, -44744, -57761, 175544, 249560, -206447, 16549, -9611, 252193, 190215, -212985, 164834, 91903, -138771, -38545, -74431]
12378g4431j95438B7815J37418d0022A60860c95350a85046A28720O6448a89902
12367d7017D4416J24434k6101C6713K52195a35901F5562J19594P4066c7301D05726
12355e9627j05355A16433A7396b56798c6928A77126E5866n152a97206b0825A82237
12343h7619l2191A36270f3646G0060q279B1520L98797A33585a55559d3791J7831
12332b5960E9771J27288K3605e2659B81959B1533P9956N9150d4138B63862e7107
12320A23909J39704b4331k03579J02105E4728b22632C0434a68646C05957e286
12309a32700j46166A97940n8153l9419a26161I6464E041a52621K8642E2982d4433
12297h9016n083A57859j7026L40984c2342F7706J41542c9248B40210j04265J49469
$$ y = [-74431, -269869, 27815, 165233, -40022, 160860, -395350, -185046, 128720, 195168, -189902, -47017, 44416, 168850, 142749, 36713, 288908, -135901, 65562, 185156, 259222, -37301, 405726, -59627, -164982, 116433, 17396, -256798, -36928, 177126, 55866, 50714, -197206, -20825, 182237, -87619, -119810, 136270, -63646, 70060, 61781, 21520, 420317, 133585, -155559, -43791, -25960, 59771, 187059, 210664, -52659, 281959, 21533, 101489, 160639, -44138, 263862, -57107, 123909, 263613, -24331, -227910, -125805, 54728, -222632, 30434, -168646, 305957, -5286, -132700, -278866, 197940, 139787, 100368, -126161, 96464, 5041, -152621, -123979, 52982, -44433, -89016, -94099, 157859, 140833, 481817, -32342, 67706, 209248, -39248, 240210, 135945, 285414]
12286B85414a12621L8202C34492h9962A45235c60340E10035f0289B25894K0549
12276B46443A14246J13337G7839L79237A45028J08115e7081F43J54750a10649
12265i7777d0094k44321A95209a13671C19665A0115K45250j13040N43536c04906
12254B46819o4736J81823M5000A09821J7779h9316C38371c2396G8963a88352C30363
12242H5566l1734J74243a41823I8903b63140B45027O9333K4048j54856q6233O510
12231A03829g5738A64977B6136K89390j23527N1649J01432j26484o2503J57107
12221C13200j07017K5921J97134A44708J44735j34747b29156A91459m3092k9905
12211A18462k0164h271l956F0444a31386A83002c4801C22075g6534B1563R9919
$$ y = [285414, -112621, -74419, 334492, -89962, 145235, -360340, 510035, -60289, 225894, 246443, 114246, 227583, 77839, 457076, 145028, 253143, -57081, 643, 155393, -110649, -97777, -40094, -284415, 195209, -113671, 319665, 10115, 255365, 142325, 685861, -304906, 246819, 182083, 363906, 408906, 109821, 127600, -89316, 338371, -32396, 78963, -188352, 330363, 85566, 53832, 228075, -141823, 98903, -263140, 245027, 314360, 338408, 183552, 97319, 103829, -75738, 164977, 26136, 315526, 191999, 243648, 345080, 218596, 156093, 313200, 206183, 232104, 429238, 144708, 289443, 154696, -229156, 191459, 148367, 118462, 98298, -8271, -12227, 60444, -131386, 183002, -34801, 322075, -76534, 21563, 121482]
12200A21482Q3362K54662A12229N1228J98468L67809j89524k07424n3016a74787
12189D2544a57485j5665E0551b00071D48729B11283A6895D917h4714C42545E4980
12177d3886A92511I4036N0004K8263L4241N4314p4447C9851c5483C47994m8269
12166B99725a74314B59410a0193C06118a55637C38649b0851C34337j17037b7456
12155A89954C4579M7147b3316A32483Q2478b32385A08566D594J07336a33414J9401
12144a14013C6812A8017a39696A2456a64280G4918i2837A29129a46612C01879
12133B9965J41241b21275B96356r9036H6301f6102j8813B3858J12738D8635d5868
12121d9089C20038F835f2588J3635A20615l2998a62015B04728K9167H4367N4823
$$ y = [121482, 204844, 459506, 112229, 163457, 361925, 729734, 540210, 332786, 279770, -174787, 42544, -157485, -173150, 50551, -200071, 448729, 211283, 16895, 4917, -84714, 342545, 54980, -43886, 192511, 94036, 144040, 172303, 206544, 260858, 186411, 39851, -35483, 347994, 299725, -174314, 259410, -10193, 306118, -155637, 338649, -20851, 334337, 217300, -27456, 189954, 34579, 81726, -23316, 132483, 214961, -232385, 108566, 4594, 111930, -133414, -114013, 36812, 18017, -139696, 12456, -164280, 74918, -92837, 129129, -146612, 301879, 29965, 171206, -221275, 296356, 197320, 86301, -66102, -84915, 23858, 136596, 48635, -45868, -49089, 320038, 6835, -62588, -48953, 120615, 87617, -162015, 204728, 233895, 84367, 139190]
12110A39190A725J87932A0250g0209B7456a4796E3021i1997c0221A002g2836A17848
12097C11780G818J13186a51874A22657J58606b15508A83881a99819p0160A80990
12086f5409B25944J701B3867a89530j79615J82660A79173C7494N87918O59810
12076A285222N94822F05725a73806b563A0535g1286C48395r5556d8910q4108N7149
12065g5869j2996C0728J54880M4311b54035B31420a88842p1884J17482q7878A03252
12053f4641B22084b99524A4954J77437b744I2512c17952B425a84427M3690I4896
12041A31892a85758A4520N8271b28915K8139A93543b38967c8570J6423B24130
12030b79884J35406G6370a35915C28013a32824A70847J21842A36757b26406A22793
$$ y = [139190, 1725, 189657, 10250, -70209, 27456, -14796, 53021, -91997, -30221, 1002, -72836, 117848, 311780, 7818, 121004, -151874, 122657, 281263, -215508, 183881, -199819, -269979, 180990, -65409, 225944, 227645, 23867, -189530, -369145, -186485, 179173, 37494, 625412, 1285222, 1880044, 605725, -173806, -2563, 10535, -71286, 348395, 252839, -48910, -133018, -75869, -88865, 30728, 185608, 229919, -254035, 231420, -188842, -260726, -143244, -231122, 103252, -64641, 222084, -299524, 14954, 192391, -2744, 92512, -317952, 2425, -184427, -140737, 94896, 131892, -185758, 14520, 72791, -228915, -200776, 193543, -238967, -38570, -22147, 224130, -279884, -144478, 76370, -135915, 328013, -132824, 170847, 292689, 136757, -226406, 122793]
12019C9872K23107H2632d2253j89557f4601A69025h3865C53375a96831a1631A67815
12007b02558B5361i2214A2186a08605m8484e9075A2469e4313H5983f94644b50611
11995a51463A99084k226G9346b82399G5319a70882A39095c04169d5186q0362p2978
11984a98526b7297B05336b52406D29491a65525A38322b84134d7574B4319b3184
11973b11584F2962g9630A01720f5075j11695I3756G631i5183p4714F9806K32776
11962C02582E5466j4666a00369C5322K63848F982a14732C7L63396A46905K616
11951A49521B1392d1525B69135a33076d7506A34963f9527C16513a88691N8712
11941a29979k25501d7031p8261e1598n4287A34306e06109A62026J89538a7331
$$ y = [39872, 262979, 82632, -42253, -231810, -64601, 169025, -83865, 353375, -196831, -11631, 167815, -202558, 25361, -92214, 12186, -108605, -157089, -59075, 12469, -54313, 85983, -694644, -250611, -151463, 199084, 196858, 79346, -282399, 75319, -170882, 139095, -304169, -45186, -125548, -198526, -27297, 205336, -252406, 429491, -165525, 138322, -284134, -47574, 24319, -23184, -211584, 62962, -79630, 101720, -65075, -176770, 93756, 7631, -95183, -169897, 69806, 302582, 55466, 40800, -100369, 35322, 299170, 6982, -114732, 37, 363433, 146905, 149521, 21392, -41525, 269135, -133076, -47506, 134963, -69527, 316513, -188691, -129979, -355480, -47031, -125292, -51598, -105885, 134306, -506109, 162026, 351564, -17331]
11930i0015q8812A3218b36368B8475j462b40391C1455N528L626L03616i723F5991
11917a72795O3462L2946b0852j77961E7231i5939A39410n3077a5306D0678O5549
11906A06227N5123a64593A08932b01387J5156j98367a51684A82565L6318a02482
11895i3078p1964A01180a8480E1998a9173j09960D4332i9099B6154a45168P2154
11884g3014j25501B63078g7588I6436f7649J8496H322a70910A13519b79288e4426
11872B44964o7243n9016a13070B1148A884b24360L8328O4394a4970j37434G302
11860a74786f2597n6451c8044r7303l59052A16653n3317e5123E9800h3344D45998
11848G4698K68696c67442J28811d4523k81440a21094l5914A09241c9627k70552
$$ y = [-90015, -178827, 13218, -236368, 28475, 27013, -240391, 31455, 36983, 40609, 344225, -9723, 65991, -172795, -109333, -76387, -20852, -198813, 57231, -95939, 139410, 86333, -15306, 40678, 106227, 161350, -164593, 108932, -201387, -186231, -384598, -151684, 182565, 218883, -102482, -93078, -165042, 101180, -18480, 51998, -19173, -129133, 44332, -99099, 26154, -145168, -73014, -198515, 263078, -77588, 96436, -67649, -49153, 8322, -170910, 113519, -279288, -54426, 244964, 177721, 118705, -113070, 21148, 1884, -224360, -186032, -121638, -14970, -152404, 7302, -174786, -62597, -119048, -38044, -135347, -494399, 116653, 63336, -55123, 59800, -83344, 445998, 74698, 343394, -367442, -238631, -44523, -325963, -121094, -157008, 109241, -39627, -310179]
11838c10179M5457k06022a5783D0995b44558e1858n941B99672r8717l3270f4856
11826A33487a12328n0732N6023n3496j44266A0818L5360O7175m5934c8481k75713
11815c14194A69389d6126F5904J83602C9324a2313m50572a4940k83110G6410h5562
11803H4703K90972c03628C0556Q4345m1623A2552b16750L4731d1800j53656B20030
11791a61873A22478J068B3380b0128k48256H6690J95916I736P4179P7642L7362
11780A98919a70809n2082e5824D88120a50499N1342j32332F3441e373C18446F3331
11768b29110L1051B5628K4661g3658j45839C73800I8291m926j7627c1643j26246
11757a57889B14064h6077G7083J6843c33318A15453J02950g59A66729M7830b89250
$$ y = [-310179, -264722, -470744, -15783, 40995, -244558, -51858, -57799, 299672, 200955, 167685, -64856, 133487, -112328, -163060, -107037, -160533, -304799, 10818, 46178, 113353, 67419, -38481, -314194, 169389, -46126, 65904, 249506, 39324, -12313, -462885, -14940, -298050, 76410, -85562, 84703, 375675, -303628, 30556, 114901, 73278, 12552, -216750, -182019, -41800, -195456, 220030, -161873, 122478, 123546, 23380, -20128, -268384, 86690, 282606, 9736, 83915, 161557, 198919, -170809, -222891, -55824, 488120, -150499, -99157, -231489, 63441, -5373, 318446, 63331, -229110, -198059, 25628, 50289, -73658, -219497, 373800, 98291, 93365, 75738, -31643, -157889, 214064, -86077, 77083, 93926, -333318, 115453, 218403, -759, 166729, 214559, -289250]
11745H2634g8498C3608J84985A0374a59228B33610J0163I388L3078h2393A0042
11733c5345B6382J2502J99951J30803A66944J89505C8005h0248G4174g7510k85240
11722c62750i0624I1412j2936b16903i3247A48528c78041H1550C2974K4298a00652
11710b913j11017B99970j16089q9590a49258H9443i0942B05183a65063a3191F848
11698B25966A8975a22115A43556A871J5529a4134j7382k36167A18181a08997f118
11686A44377J23124a23498o7089m9587H3422f1543a8044j47943B62372I2444K10296
11675C02740A47902K85317D2438c20002h8723l3297A60785n0690A0188Q612D949
11663h1724A26155c259I9122J89450h0008H9387e027j54729e6211A44417k9859
$$ y = [82634, -78498, 33608, 218593, 10374, -159228, 233610, 243773, 9388, 42466, -82393, 10042, -35345, 26382, 38884, 238835, 369638, 166944, 356449, 38005, -80248, 74174, -77510, -362750, -90624, 91412, 78476, -216903, -93247, 148528, -378041, 81550, 32974, 57272, -100652, -2913, -113930, 299970, 183881, 94291, -149258, 89443, -90942, 205183, -165063, -13191, 6848, 225966, 18975, -122115, 143556, 1871, 17400, -14134, -31516, -267683, 118181, -108997, -6118, 144377, 267501, -123498, -190587, -240174, 83422, -61543, -18044, -165987, 262372, 92444, 302740, 147902, 433219, 42438, -320002, -88723, -122020, 160785, 110095, 10188, 18800, 4949, -81724, 126155, -3259, 99122, 288572, -80008, 89387, -5027, -159756, -56211, 144417, 114558]
11652A14558L8397E4039a00363j09413e70j35539C57987A17906J04765a76636
11641A46576a08517H4030R1042a84211F036P3591b29743A73547P4460b35671J10970
11630a24701K2083E8483K67467A05877c69510A65820q531d0689E57079k47948
11620C09131r2045I9858M0312c1000F4084Q3156N3787a30257I4908J09065l0584
11609A73389a70173A45027a75491R406j28780B72481a23334E0818d9287B05600
11598G0808K68882j22520b00542b6171B58923H3324l809a11115A39292K67416
11588D06708j57203A08528G53J10372N8635J38919j35680l3842a6345A78632L7789
11577B16421Rn2336n3047P917K00685e0066A73802m6734a8143Q798A7512O0690
$$ y = [114558, 152955, 54039, -100363, -209776, -570, -136109, 357987, 117906, 222671, -176636, 146576, -108517, 84030, 175072, -184211, 6036, 79627, -229743, 173547, 248007, -235671, -124701, -102618, 58483, 325950, 105877, -369510, 165820, 157289, -40689, 557079, 309131, 217086, 99858, 140170, -31000, 64084, 147240, 201027, -130257, 94908, 203973, 173389, -170173, 145027, -175491, -166085, -294865, 272481, -123334, 50818, -49287, 205600, 70808, 339690, 217170, -200542, -26171, 258923, 83324, 79515, -111115, 139292, 406708, 249505, 108528, 753, 111125, 169760, 308679, 172999, 139157, -16345, 178632, 216421, 216430, 164094, 111047, 118964, 319649, -50066, 173802, 127068, -18143, -9345, 17512, 78202]
11565G8202K95781a61332B34375A05968Q5807K52873A95618i2878A9439J25382
11555A44821a79353A67686b58953A83075g2249A52254k1500e0157H1006d0215
11544D14754j74634d1728b807D3561f370B96406A6719Q1193C1886R9651L4854
11533A66391J06c24720A70230f7350n9961H4746N4465N5456H5717a95884B61607
11521a44228B35284A00359P293J09905a22519p9212G7145C5665a56869G2693a9209
11509f218H6821L68100E6001h4772J8226C18388f4681C70346A13260K96322j67873
11498B41709n7347D7954c3432C43579I8735a08850d8966q2186D6017J74099l6703
11487A83413c5257A48327j0099o543b17616B11846p9435L83398B33459a33925
$$ y = [78202, 373983, -161332, 234375, 105968, 191775, 444648, 195618, -92878, 19439, 144821, -179353, 167686, -258953, 183075, -72249, 152254, 130754, -50157, 81006, -40215, 414754, 240120, -41728, -2807, 43561, -6370, 296406, 16719, 97912, 31886, 131537, 166391, 166497, -324720, 170230, -67350, -127311, 84746, 139211, 194667, 85717, -195884, 261607, -144228, 235284, 100359, 107652, 217557, -122519, -201731, 77145, 35665, -156869, 72693, -19209, -6218, 86821, 454921, 56001, -84772, -66546, 318388, -64681, 370346, 113260, 409582, 241709, 184362, 47954, -33432, 343579, 98735, -108850, -48966, -131152, 46017, 220116, 183413, -35257, 148327, 138228, 131685, -217616, 211846, 132411, 515809, 233459, -133925]
11476H4719J51200q6420R0568A11904K48927A43320J59219j32280L0374K00275
11466D00908a28571A01574L300J00259K1308r0239m602a90142A635a35386k225
11455a37611C04550o3093b29172f5812A24438P6133m2534K30606F0584B4663P9806
11444A04469a84577O5978A98275a36601e020A01353C1222K24984g2958e900B86363
11432B49969E8001J34265o4900l2557a29835A2554J72807d8875n4558A3515a3360
11420B8223J22258a84321A82220R768J07933a31633B48220c00346A60174a5128
11409a64828A40569K8822h84F4662h3109B42359j13033C7587b0028B56787p0265
11398A86522G4435k5355K40315D6145K36205A29136b31048I852a79544l4032G2160
$$ y = [84719, 235919, 149499, 240067, 111904, 360831, 143320, 302539, 170259, 200633, 400908, -128571, 101574, 104874, 205133, 226441, 136202, 131600, -190142, 1635, -135386, -137611, 304550, 241457, -229172, -65812, 124438, 200571, 158037, 388643, 60584, 24663, 104469, -184577, -118599, 198275, -136601, -5020, 101353, 31222, 256206, -72958, -5900, 286363, 249969, 58001, 192266, 127366, 94809, -129835, 12554, 185361, -48875, -103433, 13515, -13360, 28223, 150481, -184321, 182220, 191988, 299921, -131633, 248220, -300346, 160174, -15128, -164828, 140569, 169391, -884, 64662, -83109, 242359, 129326, 37587, -20028, 256787, 186522, 74435, 49080, 289395, 46145, 282350, 129136, -231048, 9852, -179544, -213576, 72160]
11386b2794j80422B63898b05366A50417a01242A94608a6596B67631B0692e9522
11375A67266b3299A48171O9432J85053A70126I023J17040a74663E575d0983F6994
11363B17091f006K891l9687r9133N7626j21029D8861m116F343J20849e1394k02881
11351b54275N4890A39602g2161E03556A37936K14754b56636d6567G3856h0951
11340D7460f1255j56547A3296O6999J39823P7117d290j733B83018c14582n2300
11329c66882h8419A89968n1887n222a26936d6301j71215A4717K2818Q5070L8853
11318A61458m8960b20029A73878a34742B42794a73593O281B40374d20838D1559
11307B9776O954J08458g1985K6896k64286i8813l0150f3775j92696L9082e3738
$$ y = [-22794, -203216, 263898, -205366, 150417, -101242, 194608, -16596, 267631, 20692, -59522, 167266, -23299, 148171, 217603, 402656, 170126, 9023, 126063, -174663, 5575, -40983, 66994, 217091, -6006, -3115, -42802, -141935, -84309, -205338, 48861, 44745, 6343, 127192, -51394, -254275, -199385, 139602, -72161, 503556, 137936, 352690, -256636, -46567, 73856, -80951, 47460, -61255, -217802, 13296, 80295, 220118, 297235, -4290, -6023, 283018, -314582, -366882, -88419, 189968, 138081, 132859, -126936, -46301, -217516, 14717, 37535, 122605, 161458, 112498, -220029, 173878, -134742, 242794, -173593, -167312, 240374, -420838, 41559, 29776, 36730, 145188, -71985, -45089, -309375, -98813, -128963, -63775, -256471, -217389, -53738]
11295I3562L95310I333K70870a48903F3257a59329C8113a51744k74879a56150
11284d7890B26039f8689A20085M7353K3083a65975k7648f8996C11326j05669c3262
11272a33054c1728B62773a06859c5023J2265A33955J567A7923b1967A39711a24613
11260b0935B21346a09723m3988j49047J30557q1989d1584m2349k51752A8659K05033
11249B23692I3673b01691j39060N8538A25164g7708A83128a46187r409C08489
11238E7413k0848O8819R8480e0956j25975A17616b41776A06652J04487a01734
11227b06088D7564Q3262m37E8141E394b35495c9480m04444d2379k15281b9188
11215b6032J1233C24480A13426a17257B9857b06188c7993j32543g522p7004j01319
$$ y = [93562, 488872, 9333, 280203, -148903, 63257, -159329, 38113, -151744, -426623, -156150, -47890, 226039, -68689, 120085, 167438, 190521, -165975, -193623, -68996, 311326, 205657, -33262, -133054, -31728, 262773, -106859, -35023, -22758, 133955, 135522, 17923, -21967, 139711, -124613, -20935, 221346, -109723, -153711, -302758, -172201, -254190, -41584, -83933, -335685, 18659, 223692, 93673, -201691, -340751, -282213, 125164, -77708, 183128, -146187, -155596, 308489, 57413, 36565, 105384, 203864, -50956, -176931, 117616, -241776, 106652, 211139, -101734, -206088, 47564, 130826, 130389, 58141, 5394, -235495, -39480, -443924, -42379, -257660, -29188, -26032, -14799, 324480, 113426, -117257, 29857, -206188, -37993, -170536, -7522, -84526, -185845]
11204a85845a3284A58279f2114m0975E1832d06086B58211a04209j089J6824F6498
11192D4825a16783m8308j06396B8877c39680O7514A90012c7557A23785P0858c64823
11180B7006a87767B10637B3199d2001A89815e3396q3051A47529a7141A05600c1481
11168A32794b8210G9490a90992q5308A05454l1407a73134B2908b11773C86703
11157d60435A96457H5353J01966a41761G8720f4718E8642c4032q4041B86799a13446
11145C73896E4831J55015d26734C23103A58229g1854A43462B9892a53203k2791
11135a75994A58829a23509A55949o0647N6132a43941H9317L83721B21465k2489
11125A98976B8530J90595J16154i9937q1350A9385i9033B54656E9999K95081F9586
$$ y = [-185845, -13284, 158279, -62114, -103089, 51832, -406086, 258211, -104209, -105298, -88474, 66498, 44825, -116783, -165091, -271487, 28877, -339680, -272166, 190012, -37557, 123785, 194643, -364823, 27006, -187767, 210637, 23199, -42001, 189815, -53396, -136447, 147529, -17141, 105600, -31481, 132794, -28210, 79490, -190992, -276300, 105454, 74047, -173134, 22908, -211773, 386703, -460435, 196457, 85353, 187319, -141761, 78720, -64718, 58642, -34032, -118073, 286799, -113446, 373896, 54831, 209846, -426734, 323103, 158229, -71854, 143462, 29892, -153203, -175994, 158829, -123509, 155949, 95302, 151434, -143941, 89317, 473038, 221465, 198976, 28530, 219125, 335279, -99937, -181287, 19385, -99033, 254656, 59999, 355080, 69586]
11113B49591J35103F2723Q0335a81633A5587a39197D09632d0717A66319K38255
11103D04574j59117b7900D0848b3082j52122A78643M5648p1224J04180j03158
11093A54089F2406K76216A42172J23739a54750A65774J35578j35568o8833K52112
11083C49063a54782B32133F4339O9316K82858A26067C8896N60998B78426n6027
11073B22399L74918k03476l8898A70547J63175o7345J42467A60547J26014L23733
11063F10294A30943K84702K47240j78137p97k1704r6239K48183q7925K37475k08440
11052E55301M50536k60826k13906J37804R9044K2791Q9356L0744o8667k62012
11042E80165L49534j63324j34023L10266l53032J41327K81565l04190J86678O1480
$$ y = [249591, 384694, 62723, 143058, -181633, 15587, -139197, 409632, -40717, 166319, 404574, 245457, -27900, 40848, -23082, -175204, 178643, 224291, 153067, 257247, 154089, 62406, 338622, 142172, 265911, -154750, 165774, 301352, 165784, 96951, 349063, -154782, 232133, 64339, 133655, 416513, 126067, 38896, 599894, 278426, 222399, 597317, 393841, 354943, 170547, 333722, 266377, 408844, 160547, 286561, 610294, 130943, 415645, 662885, 484748, 483951, 462247, 366008, 614191, 526266, 763741, 555301, 1005837, 745011, 531105, 668909, 767953, 790744, 880100, 910844, 842177, 580165, 929699, 766375, 632352, 942618, 589586, 730913, 1012478, 708288, 894966, 956446]
11032I56446j13630C97345O55370E15643K65124n4470K15028j24624k69773K50049
11022G96977k8792J75816B49976N62365n9814l39192L18660l03622J42634j54345
11012D16662j67895K16197K17731K98787k06891k34609J46114J70370C20057K75651
11002E95708l797K65430J38773l72127L92637j55197p9496j84288M62430k66743
10992G93330J32920m08511L09388m6311J13105N6331k55211N5686K18231L69637
10982A338595l23731J87311N9394K23934j6675j55124L68965L56217l9944L66133
10972B365075O4150N40059P0551m74438J20231L56791k39026j66435p44789M34368
10962B326537n86243L89701j57249N3589J57517L14300J20040l85956o2042o5984
$$ y = [956446, 842816, 397345, 1052715, 515643, 780767, 726297, 941325, 816701, 546928, 796977, 768185, 944001, 249976, 812341, 752527, 413335, 731995, 428373, 571007, 416662, 248767, 464964, 682695, 981482, 774591, 539982, 686096, 856466, 320057, 595708, 591911, 857341, 996114, 623987, 1016624, 861427, 781931, 597643, 1060073, 793330, 926250, 517739, 827127, 780816, 893921, 950252, 695041, 750727, 968958, 1338595, 1014864, 1202175, 1261569, 1485503, 1468828, 1313704, 1682669, 2038886, 1998942, 2365075, 2429225, 2969284, 3039835, 2565397, 2685628, 3042419, 2803393, 2636958, 1892169, 2326537, 1740294, 2129995, 1972746, 2026335, 2183852, 2498152, 2618192, 2232236, 2170194, 2104210]
10952B104210l62217k99497l88782J22712K8216E54818j24953J72137j02189B21473
10941C76500i988D93797f583A12738g2968n4319B27862J89071j62182j16228M2724
10930A81247a59262b923j33669A55058c8697C0240i4929A53565f4146k3480B38978
10918H0832a03279B57398k5810K4839a66588B87811g6553m8119k2457C4008a06703
10906d7492j96858o2168a06991B00604C9176J22863L2425K71735D8560a55230
10895A308a97965r989D1511K11310e6760E0515f8221c388A22509J6068a26588
10883e9812l0663k3945j83237e2978B43318d6469C12095a8027r2245A61509a90554
10871b78962C00294a95993k6945A39395a49092b8322A98051B9072I606c9695A0843
$$ y = [2104210, 1741993, 1442496, 1053714, 1176426, 1204642, 554818, 429865, 602002, 499813, 221473, 376500, -9988, 493797, -6583, 112738, -72968, -127287, 227862, 416933, 254751, 138523, 181247, -159262, -2923, -136592, 155058, -38697, 30240, -94929, 153565, -64146, -87626, 238978, 80832, -103279, 257398, 231588, 256427, -166588, 287811, -76553, -124672, -147129, 34008, -106703, -47492, -244350, -306518, -106991, 200604, 39176, 162039, 194464, 466199, 48560, -155230, 1308, -197965, -207954, 41511, 252821, -56760, 50515, -68221, -3388, 122509, 138577, -126588, -59812, -90475, -114420, -297657, -52978, 243318, -46469, 312095, -18027, -110272, 161509, -190554, -278962, 300294, -195993, -222938, 139395, -149092, -28322, 198051, 29072, 9606, -39695, 10843]
10859I1478l4008N6476J22800j18176d4038B1994J43737p418E7153b5808l7825
10848f3633E9787K1817H927K2148a66455j53652I7706J9181a35031G1391J3070
10837H4461M2226i9116o009a6291j65708A05872f8971l8166G8018g4485j19744
10826a94229C19477h3957A09682A2097b60569B51641o1948N4968B8524a32591
10815A65737J39766c20130b1342k38302h4933C55045c05045d5197j30184E3303
10804A07681K10857h8253k91442G4343k9150b40860f146B4511K52101g7254k81747
10793c59001L8630d5198B92232a29461D5671f1673A31417D6655k2394c19715J58689
10782a61026A91028a34088j23699R284e4769j10469A71019c2183F9974B965a73746
$$ y = [91478, 57470, 113946, 236746, 118570, -44038, 21994, 165731, 158313, 57153, -25808, -63633, 59787, 81604, 8927, 31075, -166455, -320107, 97706, 116887, -135031, 71391, 84461, 126687, -99116, -105125, -16291, -181999, 105872, -68971, -107137, 78018, -74485, -194229, 319477, -83957, 109682, 12097, -260569, 251641, 189693, 244661, 28524, -132591, 165737, 305503, -320130, -21342, -259644, -84933, 355045, -305045, -45197, -175381, 53303, 107681, 318538, -88253, -379695, 74343, 45193, -240860, -6146, 24511, 276612, -77254, -359001, -320371, -45198, 292232, -129461, 45671, -61673, 131417, 46655, 24261, -319715, -161026, 191028, -134088, -257787, -248503, -54769, -165238, 171019, -32183, 69974, 2965, -173746]
10770A01348N1258A106L5992K3976c18909d513A36940h0322F7033e1663j46063
10759a97726o9681P697C75298C5439Q367J90441b42876a17881e05j14323l0975
10748a45803j62844i9275j66282l846A1366a20945o3175g3251k06645C09154a41848
10736f6135B3713b405l48683a22817E6874a33438j1601D9243K59386j30387J31545
10725C09787b02991d4938k03984A08635I339A354g9101A1459J92875E7739P1259
10714A28998i9423q1629A45859a38479m8114J4075J0337Q0734j86204D7188J02161
10703A49349b85465M2640A95871e5694C83445a72307A87199F635a08361j04038
10693b12399f1006k52717O1572a0549I9379c38810b8409m1122G8012b0712D9697
$$ y = [101348, 152606, 1106, 37098, 61074, -318909, -4513, 136940, -80322, 67033, -51663, -197726, -267407, -259710, 375298, 35439, 43806, 234247, -242876, -117881, -505, -114828, -145803, -308647, -99275, -265557, -269403, 11366, -120945, -184120, -73251, -279896, 309154, -141848, -66135, 23713, -2405, -351088, -122817, 56874, -133438, -145039, 49243, 308629, 178242, 309787, -202991, -44938, -248922, 108635, 9339, 1354, -79101, 11459, 204334, 57739, 128998, -99423, -181052, 145859, -138479, -186593, -172518, -162181, -81447, -267651, 47188, 149349, -285465, -242825, 195871, -55694, 383445, -172307, 187199, 6635, -108361, -212399, -61006, -313723, -252151, -10549, 99379, -338810, -28409, -69531, 78012, -20712, 49697]
10681d8991F0620i9149k4359c5377j61628G8907K74012b60072A33874c715l9048
10670d2763A9833c91301a37855L955A18079b6110H7455a09950A2986Q0874b77899
10658a90190e7233j21581A9679c5389k54963A28247a3773q4467A15621b20354
10647B12275a0001j56083n9845A79522a1227B7226J03780a74481D5349f3180p575
10636g0755l08205f35B49550F5926a9966n7305j36883L6195R407A24912g9419
10624C13522d77876f9237A04939a39801j26467h3110B5671L23488b98728B23478
10613b26688d2129j73478J4327E0045J53770E8825k5099K6715a6850A5731a50963
10601C02354g8948j09608l8363b4718l87739e7728j99929r9234a61399o3089M991
$$ y = [-48991, 60620, -99149, -123508, -35377, -197005, 78907, 352919, -260072, 133874, -3715, -42763, 19833, -391301, -137855, -133900, 118079, -26110, 87455, -109950, 12986, 93860, -277899, -190190, -57233, -178814, 19679, -35389, -290352, 128247, -13773, -98240, 115621, -220354, 212275, -10001, -166084, -225929, 179522, -11227, 27226, 131006, -174481, 45349, -63180, -70755, -378960, -635, 249550, 65926, -19966, -77271, -214154, -177959, -168552, 124912, -79419, 313522, -477876, -69237, 104939, -139801, -266268, -83110, 25671, 349159, -298728, 223478, -226688, -42129, -215607, -201280, 50045, 203815, 58825, 33726, 60441, -16850, 15731, -150963, 302354, -78948, -188556, -226919, -24718, -412457, -57728, -257657, -356891, -161399, -224488, -219497]
10590b19497A90653c34565D7273M8686c878l1074o5517A94888j5386a38272D9184
10578D42300a97289C41548i7016c1066m8476j93925G3150j9338K3089d7399A58639
10566e2578m6561J6517G7724a68086o2337J00206a6648A60236m5907d6341B06944
10554B1518b39206F8655h9437L0428h20q0255B13090d15359n5931J76580Q5854
10543b08856c8158j29641A66230c4461j63597D8046j7807b03994h0184l20278
10533d00462A5160K80671K25444A40150B9647c1104j55326G4344R1617b1563l14675
10522c36238B9043K07366d4923j92413A73871b7159A98723O9739D0584J3064b9417
10510b48118A74036b9702A92625r5195c17992B28848G0473a58901b3560A3059
$$ y = [-219497, 190653, -334565, 47273, 95959, -3878, -34952, -100469, 194888, 179502, -138272, 49184, 442300, -197289, 341548, -97016, -31066, -79542, -273467, 73150, 53812, 76901, -47399, 158639, -52578, -99139, -82622, 77724, -168086, -230423, -130217, -16648, 160236, 114329, -46341, 206944, 21518, -239206, 68655, -89437, -59009, -820, -81075, 213090, -415359, -471290, -294710, -208856, -38158, -167799, 166230, -34461, -198058, 48046, 30239, -203994, -80184, -400462, 15160, 295831, 521275, 140150, 29647, -31104, -186430, 74344, 165961, -21563, -336238, 29043, 236409, -44923, -237336, 173871, -27159, 198723, 268462, 40584, 53648, -29417, -248118, 174036, -29702, 192625, 97430, -317992, 228848, 70473, -158901, -23560, 13059]
10499a31295I864M10257a89517H7329a68526j1953A28118F3100J69364g2777A18954
10487a79268K5552B84020E3227M40480A22421A6725N89539j62750m8693j55059
10477B39762L67287B09506D8024r858P1517O70814A01756K7560C386f7126p6891
10466a44017l0327j39720O1362g2449B62861p4259a86386G0881i7667q1302C5645
10454c1366l6611k28457J44826I1428G598c81444a15236b709n0126k60529E0113
10442f4193B8665k864b9607D3506P5922a15057H8303a12128A11999l9225A0580
10430a35280C0661J62266e4700l0244r3340J3070e1354P472G2264a26513A44180
10418C37244h2589A42162c05524A27585d4861k20511f5648c0412D4326j8337a78988
$$ y = [-131295, 9864, 420121, -189517, 87329, -168526, -180479, 128118, 63100, 232464, -72777, 118954, -179268, -153716, 284020, 53227, 493707, 122421, 16725, 606264, 443514, 394821, 239762, 607049, 209506, 48024, 38166, 109683, 780497, 101756, 129316, 3386, -67126, -144017, -174344, -314064, -252702, -72449, 262861, 188602, -186386, 70881, -97667, -178969, 35645, -31366, -67977, -296434, -151608, 91428, 7598, -381444, -115236, -2709, -52835, -313364, 50113, -64193, 28665, 25801, -29607, 43506, 119428, -115057, 88303, -112128, 111999, 72774, 10580, -135280, 30661, 192927, -54700, -84944, -178284, -165214, -51354, -43882, 72264, -126513, 144180, 337244, -82589, 142162, -305524, 127585, -44861, -265372, -65648, -30412, 44326, 25989, -178988]
10406d3928F3605j1067d77793K09103a5169G337P6023a6077k92851B51522A03908
10394A71876E214Q943a39846f8828a1789E9807a22230E6159J63671P2839k2961
10383B69708L9419a86655A02404D8003J52016E9697K03122i97A19370K73242b6706
10371B73758F0648L12017j39420G0406J90161M26076B74070J46317N4461j79145
10361B95703H0943M15018m2485j16626M2079a7596B83312j35172K90231j70495
10351B67876J34851R537K82714C32846J51797j59062q8081L85273j23045l8661
10341D61067j45379K3038J2817a28503A48426k0985J20231K65675d9715A74046
10330A88012O2134B7639J7797L32177j38049G0352B7188a49527D81162k07162
$$ y = [-43928, 63605, 52538, -477793, -268690, -15169, 7337, 83360, -16077, -308928, 251522, 103908, 171876, 5214, 14157, -139846, -68828, -11789, 59807, -122230, 56159, 219830, 292669, 269708, 309127, -186655, 102404, 48003, 200019, 59697, 262819, -997, 119370, 392612, -26706, 273758, 60648, 372665, 233245, 70406, 260567, 686643, 274070, 420387, 474848, 295703, 80943, 495961, 453476, 336850, 378929, -17596, 283312, 148140, 438371, 267876, 402727, 412264, 694978, 332846, 484643, 325581, 237500, 622773, 499728, 461067, 315688, 338726, 351543, -128503, 148426, 127441, 247672, 513347, -49715, 174046, 188012, 250146, 27639, 45436, 377613, 239564, 70352, 27188, -149527, 481162, 274000]
10320B74000J17499A39151J93622A64083P4704A04543K8119J98774A56497g0802
10309c91961a86574D2868K1292b08231C2280J06350C3126b3042j35580O9638B14903
10297B2201a07289E4511f0282j33766A28353n1640b2284A10930A2841b76718b7013
10285B4811K38264c31273a45296G5959J95717a79719k89804h9012L4765K2604
10275c1643I4287f3263A07604N6479a02243A05373R3038N281r5446a49123C4999
10263b39370O7291j07807e1178A76101N26339B64126C1551P15896I2113K34015
10253C26128c6245B35113F9677b3522m4348F509f8574o6867M7958D941N4496M2258
10241A01695a38929e6778j27467e3259R104j65567A67311e59867A38926O3682
$$ y = [274000, 391499, 139151, 332773, 164083, 238787, 104543, 132662, 331436, 156497, -70802, -391961, -186574, 42868, 64160, -208231, 32280, 138630, 33126, -23042, -158622, -88984, 214903, 22201, -107289, 54511, -60282, -194048, 128353, 76713, -22284, 110930, 12841, -276718, -27013, 24811, 263075, -331273, -145296, 75959, 271676, -179719, -469523, -89012, -54247, -31643, 94287, -63263, 107604, 164083, -102243, 105373, 198411, 203692, 108246, -149123, 34999, -239370, -172079, -279886, -51178, 176101, 702440, 264126, 31551, 747447, 92113, 326128, -36245, 235113, 69677, -23522, -67870, 6509, -68574, -135441, -87483, 4941, 59437, 101695, -138929, -56778, -184245, -53259, -44155, -209722, 167311, -559867, 138926, 202608]
10231B02608b63967a7303l42935A9339P5620a83977n9131g3911H3310l2643J78663
10220B29330d0052k0035a8152k34054B29539b85618B7408j3212J03818a22499
10209h7568j28392P7559f6597l2628E585a17428p5219A23402a28002A7094i3505
10197a65421P6141K8099j65286h6225j2261j36623K4493A58288a70809B30805
10186a65074D111a68640d7899a6311j21851H8694J0840d74318B25736b63260J21105
10175a42155h666m97392D7278b72900f4419C89281a4453A4212Q0727D0810i7651
10163a64243B55580r4435b08193G478b70455e0804q3086r7858A51774a890j69577
10152a71467F968P3930O6103a01278J4698c3503l2863k5296J3042j06284k47374
$$ y = [202608, -263967, -17303, -360238, 19339, 94959, -183977, -243108, -73911, 83310, 50667, 229330, -40052, -60087, -18152, -252206, 229539, -285618, 27408, 14196, 118014, -122499, -87568, -215960, -138401, -66597, -99225, 5585, -117428, -192647, 123402, -128002, 17094, -93505, -165421, -89280, -61181, -226467, -86225, -98486, -235109, -210616, 158288, -170809, 230805, -165074, 4111, -168640, -47899, -16311, -138162, 88694, 99534, -474318, 225736, -263260, -142155, -8666, -506058, 47278, -272900, -64419, 389281, -14453, 14212, 94939, 40810, -97651, -164243, 255580, 161145, -208193, 7478, -270455, -50804, -133890, -231748, 151774, -1890, -171467, 6968, 80898, 147001, -101278, -86580, -33503, -66366, -91662, -78620, -184904, -432278]
10141d32278d2241q2746N4566j37709A65376a85279B71482c16847A2086c6472
10130a38477n730A50792b835k84673a07532j76663a13779e76l15952D4348a90665
10118a78473c3841I9405a833A25900a6586k67443A04216c43614D7430O6441b71270
10106a49916b5043k29205A65621e7971k53359A33819B2757b28835N410B26336
10095c65339a07323A23724k4546b72412P2134D13897D3930J44090h3403m5777
10085a29180b9858M593j99738C2174L0164a02781E6218N6343e608j32178H2008
10073G6880a39504A71558B3245L1674M793M8504b40945I2011a622j18572a8742
10061G7174a70371H0896e8961A63426c17026d8356F1997J49661b66578a23655
$$ y = [-432278, -42241, -124987, -70421, -208130, 165376, -185279, 271482, -316847, 12086, -36472, -138477, -144207, 150792, -2835, -287508, -107532, -284195, -113779, -576, -316528, 44348, -190665, -178473, -33841, 99405, -1833, 125900, -16586, -284029, 104216, -343614, 47430, 113871, -271270, -149916, -25043, -254248, 165621, -57971, -311330, 133819, 22757, -228835, -223425, 226336, -365339, -107323, 123724, 99178, -272412, -200278, 413897, 43930, 188020, -83403, -129180, -29858, -25265, -225003, 32174, 62338, -102781, 56218, 112561, -5608, -137786, 82008, 76880, -139504, 171558, 23245, 54919, 59712, 108216, -240945, 92011, -1622, -120194, -18742, 77174, -170371, 80896, -58961, 163426, -317026, -48356, 61997, 211658, -266578, -123655]
10050c3954k59280b7992j21540J9862C7623a11125M3494a7845k21352j99387a15210
10038A1372e2022k26884g6583J7595k65192a21016m978e6735j34696J1680f5181
10026a19686d2424D01825A24337b05198C03708c68787J58415J01775j12566g6710
10015b0157B59222i3726n9051j00561e6233l49233c5135l61973a28799R774j8086
10004a37111l8535L3530B89678c17456m3824F4697k372h1864k36796A22634E6381
9992c763k12343E1217b19353A86067G9470b88803J36012j91120C54494a42868
9981C2947P5462a97778B09153E3613b73530q5392a8043k10885F15g0629m168n856
9969h0653d476j86052d0633C748K56529c1572l04552A00877k2408a06027A55111
$$ y = [-33954, -293234, -27992, -149532, -129670, 37623, -111125, -67631, -17845, -239197, -438584, -115210, 11372, -52022, -278906, -76583, -58988, -324180, -121016, -125994, -56735, -191431, -179751, -65181, -119686, -42424, 401825, 124337, -205198, 303708, -368787, -210372, -108597, -221163, -76710, -20157, 259222, -93726, -152777, -253338, -56233, -405466, -35135, -397108, -128799, -119025, -137111, -175646, -142116, 289678, -317456, -361280, 64697, 62325, -81864, -318660, 122634, 56381, -3763, -216106, 51217, -219353, 186067, 79470, -288803, -152791, -343911, 354494, -142868, 32947, 108409, -197778, 209153, 53613, -273530, -358922, -18043, -228928, 615, -70629, -74797, -80653, -4476, -190528, -40633, 3748, 260277, -31572, -336124, 100877, 78469, -106027, 155111]
9957C1181L27918A71796a2811B7282M4202R7323b18816b8462j61024j05506a4572
9945h1776a2017k82024a05590B37856n7442c78263i4687A19303C2468i9230I872
9933b23570E49034a05105l27677f2424D7291h1957l2449J0534A85464a9108A31461
9921d6099o7902j49154J8981R4618p2940d3438j15047j11566B62569d3787B73708
9909a05681j03535A87376b66726P8095j2716B3817a964l2538l10038D0263c11298
9897a86331A18983d1049b0191k6658j39356A1644J12035a55820B423N8652P7058
9886A38133b23367g5204r6995j983k94289D89216A01438e7557G4L2940h8615A7877
9873b44294k0843E8284b22640e2147n2831D5656a79809K5113L5859e5690o9542
$$ y = [31181, 359099, 171796, -12811, 27282, 71484, 168807, -218816, -28462, -189486, -294992, -14572, -81776, -12017, -294041, -105590, 237856, 180414, -378263, -94687, 119303, 32468, -99230, 9872, -223570, 549034, -105105, -432782, -62424, 47291, -81957, -114406, -103872, 185464, -19108, 131461, -46099, -114001, -263155, -244174, -149556, -222496, -43438, -158485, -270051, 262569, -43787, 273708, -105681, -209216, 187376, -266726, -188631, -201347, 23817, -1964, -34502, -344540, 40263, -311298, -186331, 118983, -41049, -20191, -46849, -186205, 11644, 123679, -155820, 2423, 61075, 138133, -223367, -75204, -172199, -174182, -468471, 489216, 101438, -57557, 74, 33014, -88615, 17877, -244294, -265137, 58284, -222640, -52147, -104978, 45656, -179809, -154696, -118837, -55690, -125232]
9862a25232A24755L167i0869j38756Q565j4630a17737B33777F4094h0827j3235
9851i4062m1093j66996B38157d3974K020A08070l797O2836B814J02822k0141a49014
9838a9438o5874j26923d1439B34551a18666q3224q3227Q4777A99137E784a78601
9826b03962B86743j11825f5206j64561b1477k22752f0667d995j46991b3097j73188
9815a96285A5006O7727d4375l07564a8226C01143G4301a97564B3780b68025J03500
9804a64525j2381J6671j03616d212A40303a95665A67270b16495i6942f524j0401
9793a6925G1910e4580k22174B83006j20605c5538j75958j07364n4327a47496r8046
9782b45542G5936c1716C44711h4302B88623D3839P9661j3405c39510a20224A44883
$$ y = [-125232, 124755, 127922, -90869, -229625, -221060, -235690, -117737, 233777, 64094, -80827, -94062, -135155, -302151, 238157, -43974, -41954, 108070, 104273, 167109, 2814, 105636, 85495, -149014, -19438, -85312, -212235, -41439, 234551, -118666, -201890, -285117, -200340, 199137, 5784, -178601, -203962, 286743, 174918, -65206, -229767, -21477, -244229, -60667, -4995, -151986, -23097, -196285, 15006, 82733, -44375, -351939, -18226, 301143, 74301, -197564, 23780, -268025, -164525, -176906, -160235, -263851, -4212, 140303, -195665, 167270, -216495, -96942, -6524, -16925, 71910, -54580, -276754, 283006, 162401, -35538, -211496, -318860, -373187, -147496, -245542, 75936, -31716, 344711, -84302, 288623, 43839, 123500, 110095, -339510, -120224, 144883]
9770A214J83387c78220P1872m1413c5207j22556M167L644o5104m8104K7943j57206
9758c92423B36685O1558A6815e8087J4540j41873a1784q5283j56824g0223L1308
9747c8915k96034b2350A09525l904g2014A01095K12077D748b2291k87120k74681
9736e84092I1160Q8820b61427O0156Q5868J7503k34903M2970C4311b05949Q4936
9725a21013l25908L7969C80231b95342d0241l7348F0087J56551a80884G2332B0310
9713H9925a39093I5993i2335H6080C5056A3253R5720b53372G8289a41513j6262
9702a57775B0605a74790G9918L80846A72525a17212l35658G2963d7240A0197M1603
9691E1800j4117J45721M0386A2132J98898b2337E643J11666O5457b51954A02698
$$ y = [1214, 184601, -378220, -306348, -347761, -35207, -157763, -153596, -149952, -215056, -263160, -235217, -392423, 236685, 298243, 16815, -58087, -43547, -185420, -11784, -97067, -253891, -70223, -38915, -334949, -22350, 109525, 105621, -72014, 101095, 313172, 4748, -22291, -309411, -584092, 91160, 179980, -261427, -201271, -115403, -97900, -332803, -289833, 34311, -205949, -121013, -446921, -408952, 380231, -295342, -40241, -77589, 60087, 216638, -180884, 72332, 20310, 89925, -139093, 95993, -92335, 86080, 35056, 13253, 108973, -253372, 78289, -141513, -157775, 20605, -174790, 79918, 460764, 172525, -117212, -452870, 72963, -47240, 10197, 51800, 37683, 183404, 223790, 12132, 211030, -22337, 5643, 117309, 182766, -251954, 102698]
9679b79973B12817a29443g039j43149k2315K0011c0437a5109G2632K9692i23r9897
9667a00820k39923A95653a40987G8851a88985H5232c13209a01994E297b97788
9656c94099a43924m6193g811j76527j12847L0078B80597A18882a66340A27659
9645c30218k4176a49191F5625a06729A01903d31566B57707F0958a75616a5891
9634i1034m4868f0613k1503j37091A26584J31565C4298i0620r2883j85102I0667
9622C21432b14239L3047l13749A70833a68150K5972A20998c1961F6552a55202
9611f9559a210H4353a2365I4480N3230a78976j43590C33402h9769L1155A17860
9599C7041A5721N3194c97442A53849G5359r062k3117a71653J5190J8537B14780
$$ y = [-279973, 212817, -129443, -7039, -150188, -172503, -152492, -30437, -15109, 72632, 102324, -923, -100820, -340743, 195653, -140987, 78851, -188985, 85232, -313209, -101994, 5297, -297788, -394099, -143924, -190117, -7811, -184338, -297185, -267107, 280597, 118882, -166340, 127659, -330218, -354394, -149191, 65625, -106729, 101903, -431566, 257707, 60958, -175616, -15891, -91034, -135902, -60613, -82116, -219207, 126584, 258149, 34298, -90620, -183503, -368605, 90667, 321432, -214239, -181192, -494941, 170833, -168150, -142178, 120998, -31961, 66552, -155202, -69559, -1210, 84353, -12365, 94480, 147710, -178976, -322566, 333402, -89769, -58614, 117860, 37041, 15721, 68915, -397442, 153849, 75359, 66297, 43180, -171653, -156463, -137926, 214780]
9587e9893A83137F9429c30181A39422C7760R2633g9464k0889A46676n3736a52172
9575b35223i5039I3462a48098B61622b9076k74224e5734C54796c9631j05558e1821
9563A38663e5866A08039c04861O5972A05053b90116h231k46899D3945b66624F8188
9551d55525G9670a93430a6858A370a3089j79722A96925i2916j68522p201P5773
9540a92866d9117l84196A49145b48778B46652e6011H7263m801J44692a28642A99504
9528c4870n7244o8971c3372r2960l71953A33691c37028J55586F0726c7746n387
9517d3133p9615O0694B77656a00067B5414e1882k7571k51020C5998a51398C31806
9505c7710A05567f6196B5059a7669A86168D9037P0260b23301p6010a39875H1231
$$ y = [-59893, 183137, 69429, -330181, 139422, 37760, 130393, -79464, -100353, 146676, 92940, -152172, -235223, -95039, 93462, -148098, 261622, -29076, -303300, -55734, 354796, -39631, -145189, -51821, 138663, -55866, 108039, -304861, -238889, 105053, -290116, -8231, -255130, 43945, -266624, 68188, -455525, 79670, -193430, -16858, 1370, -13089, -192811, 196925, -92916, -261438, -268639, -192866, -49117, -433313, 149145, -248778, 246652, -56011, 87263, 82462, 227154, -128642, 199504, -34870, -92114, -161085, -33372, -126332, -498285, 133691, -337028, -181442, 60726, -37746, -43133, -122748, -62054, 277656, -100067, 25414, -51882, -79453, -330473, 35998, -151398, 331806, -37710, 105567, -66196, 25059, -17669, 186168, 49037, 119297, -223301, -299311, -139875, 81231]
9493A32358J0438f7376j82749E9589m610I27b7020A28133a37393K3280p3461e2063
9480c44950d7563k5426A92487a36679b9318j77282f5154K2204G4631g9379g875
9468B79315C3868A6793h9474L6705k2858m14035a1968j13744c0769G1419c36034
9456g4873j85298C03930c48810g447G5683P2544A1338a1665j80843A19024d5064
9444c22244a46152P0945j94927f1730l7457J8128A6257e3244j4929B47226e1092
9432A43494m6184e0480j12188C6354j1605K28587b30977A11204D034a75902b3982
9420a84132C9751b24793f9242A4919J75229a35045A29802b40510A63444m021b86932
9408a8000C2106d5725r2779k8142B30J47550F3030b80625J32613m7043A75042
$$ y = [132358, 142796, -67376, -250125, 59589, 54979, 927, -27020, 128133, -137393, -114113, -187574, -52063, -344950, -47563, -72989, 192487, -136679, -29318, -206600, -65154, -42950, 74631, -79379, -7875, 279315, 33868, 16793, -89474, -52769, -75627, -489662, -11968, -125712, -30769, 71419, -336034, -74873, -260171, 303930, -348810, -7447, 75683, 148227, 11338, -11665, -192508, 119024, -45064, -322244, -146152, -75207, -270134, -61730, -99187, -81059, 16257, -53244, -68173, 247226, -51092, 143494, 97310, -50480, -162668, 36354, 24749, 253336, -230977, 111204, 4034, -175902, -23982, -184132, 39751, -224793, -69242, 14919, 190148, -135045, 129802, -240510, 163444, 159423, -286932, -18000, 32106, -45725, -138504, -166646, 230, 147780, 63030, -280625, -148012, -195055, 175042]
9396G5425a74158j84812j96300C28e0479m6928j73622B5306b5326j63030D3488
9384A44101a15198A44346c7425j19134A5404m583b83764J25015D7759K78644a52011
9372C3551a85599A30762i6120A9996J22312d9601B7478M9169A0120g0384A6434
9360E8080K3908h5368D11189c28302H2193a75687A03831c11910p1291A19541B6896
9348B37059d8507H6745a25410A07073L8761J21860j23129j4643a17553B90669
9337e07431A12938A9259a89441Q9060M2674b1776A20987g7387j21619H095N9042
9326F7137a23964C0796J23459b70888a32348j61531J12426l205g5678k52571i2223
9314D0664a34224J4714I9367c6604m92379b01116A70981m5748b57312o731r633
$$ y = [75425, -174158, -358970, -555270, 328, -50479, -97407, -271029, 25306, -25326, -188356, 43488, 144101, -115198, 144346, -37425, -156559, 15404, 10821, -283764, -158749, 47759, 326403, -152011, 33551, -185599, 130762, -96120, 19996, 142308, -49601, 27478, 76647, 10120, -70384, 16434, 58080, 81988, -85368, 411189, -328302, 82193, -175687, 103831, -311910, -383201, 119541, 26896, 237059, -48507, 86745, -125410, 107073, 145834, 267694, 144565, 129922, -117553, 290669, -507431, 112938, 19259, -189441, -100381, -57707, -21776, 120987, -77387, -199006, 8095, 67137, -123964, 30796, 154255, -270888, -132348, -293879, -181453, -184658, -75678, -328249, -92223, 40664, -134224, -119510, 99367, -36604, -528983, -201116, 170981, 125233, -257312, -264043, -273676]
9303b73676A75438a45682A40410a03747p6328e3763k61616g167k13081o2808F0933
9291b8836l6535r4320J0817G707e3750I3584b30328g8419l68845A85698b054k90435
9279b92489G6078J5853N9677a38085j23009F6237b3596j0181A92560J7626c21341
9267A68197G329a29021j42847A81947C3248J63368q1952l8933d4471q3221D2908
9255a02753A16965j7338b27991j58300A35762a17286b0910H7991a45327E4522
9244I1867h1573n920F5608J45720G0368k6056b09914B1740J17914b2738A16393
9232g7005j72480c8664k14235c487H1373d5589E38c09584J32949j75355K1885
9221c30105J33375E6257J94222c3106D0031O2520A6084P4216a49134p2557R0511
$$ y = [-273676, 175438, -145682, 140410, -103747, -180075, -53763, -315379, -7167, -220248, -283056, 60933, -28836, -65371, -159691, -148874, 7707, -53750, 93584, -230328, -78419, -447264, 185698, -2054, -292489, 76078, 91931, 151608, -138085, -261094, 66237, -23596, -33777, 192560, 210186, -321341, 168197, 7329, -129021, -271868, 181947, 33248, 196616, 114664, 75731, -44471, -127692, 42908, -102753, 116965, 99627, -227991, -386291, 135762, -117286, -20910, 87991, -145327, 54522, 91867, -81573, -87493, 65608, 211328, 70368, 44312, -209914, 21740, 139654, -22738, 116393, -77005, -249485, -38664, -252899, -3487, 81373, -45589, 538, -309584, -176635, -351990, -330105, -196730, 56257, 250479, -33106, 40031, 102551, 16084, 90300, -149134, -221691, -131180]
9210a31180b8179G4997J17996b13423i9103k14299A12066e7512k4894j96680a7646
9198A33599a71439m649A96666j5020a5562k42021D27755a24654b4817C4304D715
9186H6884K55332G337c66987J17691r328D2309j9052P4365b535k33620P1569E084
9173A00236L8770J50583i7316D0791b99184j45021f4178j52853A95317a33452
9162a80359n428F3287a35111k59465J95763j47239J58886O6128k957c6510A88894
9150C83L108d6223l9043j75559a24941a2920E4370c46968G078e2211A69499E1151
9137d28773J75018i1353r5902B34777C1369K16323K13514j32473f0540J1767A6238
9125g4262I2298C211g2033m7610J4703A2644a9704A36371b77520a8282j05557
$$ y = [-131180, -28179, 74997, 192993, -213423, -99103, -313402, 112066, -57512, -82406, -279086, -17646, 133599, -171439, -176088, 196666, 181646, -15562, -257583, 427755, -124654, -24817, 34304, 4715, 86884, 342216, 7337, -366987, -249296, -258624, 42309, 23257, 97622, -2535, -236155, -164586, 5084, 100236, 139006, 289589, -97316, 40791, -299184, -444205, -64178, -217031, 195317, -133452, -180359, -185787, 63287, -135111, -394576, -198813, -346052, -187166, -121038, -123995, -36510, 188894, 383, 3491, -46223, -85266, -260825, -124941, -12920, 54370, -346968, 7078, -52211, 169499, 51151, -428773, -253755, -91353, -187255, 234777, 31369, 247692, 461206, 328733, -60540, -48773, 16238, -74262, 92298, 3211, -72033, -119643, -104940, 12644, -19704, 136371, -277520, -18282, -123839]
9114a23839c1964j39272O7944k16153a29846P819r1753L3997J7207A95090a06667
9102g0467A15571n5799N60a07721r2529k0148C4005a9006j40469i683l9154N800
9090d3037j23923l6949A65506b48796d1375I7993H533b51508b6961A51932c31344
9078f97j53467j66394P5439Q1842c7779o0159o6894j91025a27878k5765A93652
9066b30368A05167a22505B07a5433k00925p4102A07396b56313g2453j16359k09226
9055c98038g220j33578d622j02925L3630C63b76225d6381A06068a47618d6983
9043a51288o0052f535A44272o1992c5410j40392g6978I7516a48489A20323P0283
9032A90606a32492A02344j771a82168B23659b9030A12723a78529r5581A43834
$$ y = [-123839, -31964, -171236, -103292, -319445, -129846, -122027, -213780, -179783, -162576, 195090, -106667, -70467, 115571, 59772, 60332, -107721, -200250, -220398, 34005, -19006, -159475, -9683, -48837, -43037, -166960, -203909, 165506, -248796, -41375, 97993, 8533, -251508, -26961, 151932, -331344, -697, -154164, -320558, -245119, -163277, -37779, -97938, -164832, -355857, -127878, -153643, 193652, -230368, 105167, -122505, 207, -15433, -216358, -290460, 107396, -256313, -72453, -188812, -398038, -7220, -140798, -4622, -107547, -73917, 363, -276225, -46381, 106068, -147618, -46983, -151288, -211340, -6535, 144272, 82280, -35410, -175802, -76978, 97516, -148489, 120323, 190606, -132492, 102344, 100573, -182168, 223659, -29030, 112723, -178529, -274110, 143834]
9021a85157K2923P20c2874j33215B00204C1842L7438J37542a61175c9354H163
9009a01614D7622K1988C2567M3504a06783k08194D644a03690B16450i2596A21726
8997b60961a14452a8338I3578K54031j68774c40752F5980B939b79153A63177c28308
8985a24013J1252D0926K3580a63995h260j74761q4546c3381A19298b52136k97029
8974e49165K48926C81413b25013C27638c6647H0150a56864o0266d3129G189P3411
8963H0600a5690B55346Q3161A68059a91458E5955F379R8277k3714a25808a4183
8951e2949n3774L6587A01456b15051D7010g5562C01695a90993n0753J03413n8481
8940a96814B77387a20000N5852j03770B03632b80673E65159B29465e27211h3751
$$ y = [-185157, -162234, -161514, -32874, -166089, 200204, 31842, 69280, 206822, -161175, -39354, 8163, -101614, 47622, 69610, 32567, 76071, -106783, -314977, 4644, -103690, 216450, -92596, 121726, -260961, -114452, -18338, 93578, 347609, 178835, -340752, 65980, 2939, -279153, 163177, -328308, -124013, -112761, 40926, 64506, -163995, -8260, -183021, -267567, -33381, 119298, -252136, -549165, -300239, 381413, -225013, 327638, -36647, 80150, -156864, -217130, -43129, 7189, 80600, -15690, 255346, 338507, 168059, -191458, 55955, 6379, 104656, 80942, -125808, -14183, -52949, -106723, -70136, 101456, -215051, 47010, -75562, 301695, -190993, -241746, -138333, -196814, 277387, -120000, -64148, -167918, 203632, -280673, 565159, 229465, -527211, -83751]
8929C36312g0440k1545I8216K68474K16699K64907K36693J983242P507942m726619
8919E849554A544831D12093J74477A31798j2625L16076a34402m2244M7032k23204
8909c52818C81996A78408J61651b59321E0669G291J45287c635j29998r81k07346
8898c41960J9345B45139b19125Q6743k9145B66002b2995k04635K2793M9294c9445
8886a17078e0599A66196o1508c39814b8734I4341N2157A6534c27654H885c74933
8874a08741m9275N200f3557A69916a28979B31082a95225E2101a4898r9763c7043
$$ y = [336312, -70440, -91985, 98216, 366690, 583389, 848296, 1084989, 3068231, 10576173, 5849554, 1544831, 412093, 586570, 131798, 119173, 435249, -134402, -176646, -129614, -352818, 381996, 178408, 340059, -259321, 50669, 7291, 152578, -3635, -133633, -134614, -341960, -322615, 245139, -219125, -132382, -161527, 266002, -22995, -227630, -204837, -155543, -39445, -117078, -50599, 166196, 104688, -339814, -28734, 94341, 146498, 16534, -327654, 8885, -374933, -108741, -158016, -152816, -63557, 169916, -128979, 231082, -195225, 52101, -14898, -114661, -37043]
$$ [...]
##END NTUPLES=NMR SPECTRUM
##END=
