##TITLE=AC1711_ROEFFECT0030_8638305_pRosKhz5V2
##JCAMPDX= 6.0         $$ Bruker NMR JCAMP-DX V2.0
##DATA TYPE= NMR SPECTRUM
##DATA CLASS= NTUPLES
##ORIGIN= BRUKER
##OWNER= Administrator
$$ 1.72 TOPSPIN		Version 2.1
$$ 2014-05-23 00:25:35.690 -0700  Administrator@X
$$ Compression mode = diff/dup
##.OBSERVE FREQUENCY= 400.02188249412
##.OBSERVE NUCLEUS= ^1H
##.ACQUISITION MODE= SIMULTANEOUS (DQD)
##.ACQUISITION SCHEME= undefined
##.AVERAGES= 64
##.DIGITISER RES= 22
##SPECTROMETER/DATA SYSTEM= spect
##.PULSE SEQUENCE= noesygpps1d.comp
##.SOLVENT NAME= COFFEE_meoh
##.SHIFT REFERENCE= INTERNAL, COFFEE_meoh, 1, 14.96134
##AUDIT TRAIL= $$ (NUMBER, WHEN, WHO, WHERE, PROCESS, VERSION, WHAT)
$$ ##TITLE= Audit trail, TOPSPIN		Version 2.1
$$ ##JCAMPDX= 5.01
$$ ##ORIGIN= Bruker BioSpin GmbH
$$ ##OWNER= Administrator
$$ $$ E:\/data/COFFEE/nmr/AC1711_ROEFFECT0030_8638305_pRosKhz5V2/12/pdata/1/auditp.txt
$$ ##AUDIT TRAIL=  $$ (NUMBER, WHEN, WHO, WHERE, PROCESS, VERSION, WHAT)
(   1,<2014-05-23 00:25:30.830 -0700>,<Administrator>,<X>,<go>,<TOPSPIN 2.1>,
      <created by zg
	started at 2014-05-23 00:14:01.453 -0700,
	POWCHK enabled, PULCHK disabled,
       configuration hash MD5:
       C8 4E 4E 5D D3 5C D8 9E 9F 52 82 E0 59 8A DE 15
       data hash MD5: 64K
       91 51 5E 75 04 EB 9B 39 F0 E9 91 2D 57 40 9F 12>)
(   2,<2014-05-23 00:25:33.736 -0700>,<Administrator>,<X>,<proc1d>,<TOPSPIN 2.1>,
      <Start of raw data processing
       efp LB = 0.3 FT_mod = 6 PKNL = 1 PHC0 = 0 PHC1 = 0 SI = 128K 
       data hash MD5: 128K
       4E 2D D7 98 27 C0 40 B0 CB EB 38 4B 24 25 4F B5>)
(   3,<2014-05-23 00:25:34.643 -0700>,<Administrator>,<X>,<proc1d>,<TOPSPIN 2.1>,
      <pk PHC0 = -84.09485 PHC1 = 0 
       data hash MD5: 128K
       32 87 96 B1 2C 95 4D 57 4B 6F 6B 30 D1 E5 16 22>)
(   4,<2014-05-23 00:25:35.080 -0700>,<Administrator>,<X>,<proc1d>,<TOPSPIN 2.1>,
      <abs ABSG = 1 
       data hash MD5: 128K
       D3 BA C4 50 DA 6D C6 7F EC F4 94 3C 8D 1D CF 31>)
(   5,<2014-05-23 00:25:35.190 -0700>,<Administrator>,<X>,<proc1d>,<TOPSPIN 2.1>,
      <abs ABSG = 2 
       data hash MD5: 128K
       59 10 BC E9 C5 D1 A8 28 F2 86 F5 A1 5A A3 2A C2>)
(   6,<2014-05-23 00:25:35.299 -0700>,<Administrator>,<X>,<proc1d>,<TOPSPIN 2.1>,
      <abs ABSG = 3 
       data hash MD5: 128K
       B6 7B 4E 73 40 AD 52 D3 97 EE BA AF E9 D0 97 78>)
(   7,<2014-05-23 00:25:35.393 -0700>,<Administrator>,<X>,<proc1d>,<TOPSPIN 2.1>,
      <abs ABSG = 4 
       data hash MD5: 128K
       8E DB 0E AB 6B CD 4C 6F 69 04 7A 56 DD BD 4D 0A>)
(   8,<2014-05-23 00:25:35.486 -0700>,<Administrator>,<X>,<proc1d>,<TOPSPIN 2.1>,
      <abs ABSG = 5 
       data hash MD5: 128K
       0E 6A 49 B0 4B EB D1 55 2E DD CC 0B 1F 5F C1 50>)
$$ ##END=
$$ 
$$ $$ hash MD5
$$ $$ 22 40 24 4C 48 2B 11 60 5C B2 F3 2A AA 63 75 97
##$RELAX= 
##$RELAX= 
##$RELAX= 
##$RELAX= 
##$RELAX= 
##$RELAX= 
##$RELAX= 
##$RELAX= 
$$ Bruker specific parameters
$$ --------------------------
##$DU= <E:\>
##$EXPNO= 12
$$ [...]
##$TP07= 0
##$TPNAME0= <>
##$TPNAME1= <>
##$TPNAME2= <>
##$TPNAME3= <>
##$TPNAME4= <>
##$TPNAME5= <>
##$TPNAME6= <>
##$TPNAME7= <>
##$TPOAL= (0..7)
0.5 0.5 0.5 0.5 0.5 0.5 0.5 0.5
##$TPOFFS= (0..7)
0 0 0 0 0 0 0 0
##$TUNHIN= 0
##$TUNHOUT= 0
##$TUNXOUT= 0
##$USERA1= <user>
##$USERA2= <user>
##$USERA3= <user>
##$USERA4= <user>
##$USERA5= <user>
##$V9= 5
##$VALIST= <valist>
##$VCLIST= <CCCCCCCCCCCCCCC>
##$VD= 0
##$VDLIST= <DDDDDDDDDDDDDDD>
##$VPLIST= <PPPPPPPPPPPPPPP>
##$VTLIST= <TTTTTTTTTTTTTTT>
##$WBST= 2048
##$WBSW= 25
##$XGAIN= (0..3)
0 0 0 0
##$XL= 0
##$YL= 0
##$YMAX_a= 6914644
##$YMIN_a= -14637384
##$ZGOPTNS= <>
##$ZL1= 120
##$ZL2= 120
##$ZL3= 120
##$ZL4= 120
##$ABSF1= 14.96134
##$ABSF2= -5.596842
##$ABSG= 5
##$ABSL= 3
##$ALPHA= 0
##$AQORDER= 0
##$ASSFAC= 0
##$ASSFACI= 0
##$ASSFACX= 0
##$ASSWID= 0
##$AUNMP= <proc_prof1d_extract.lims>
##$AXLEFT= 0
##$AXNAME= <>
##$AXNUC= <1H>
##$AXRIGHT= 0
##$AXTYPE= 0
##$AXUNIT= <>
##$AZFE= 0.1
##$AZFW= 0.1
##$BCFW= 0
##$BC_mod= 0
##$BYTORDP= 0
##$COROFFS= 0
##$CY= 15
##$DATMOD= 1
##$DC= 0
##$DFILT= <>
##$DTYPP= 0
##$F1P= 0
##$F2P= 0
##$FCOR= 0.5
##$FTSIZE= 131072
##$FT_mod= 6
##$GAMMA= 0
##$GB= 0
##$INTBC= 1
##$INTSCL= 1
##$ISEN= 128
##$LB= 0.3
##$LEV0= 0
##$LPBIN= 0
##$MAXI= 10000
##$MC2= 0
##$MEAN= 0
##$ME_mod= 0
##$MI= 0
##$NCOEF= 0
##$NC_proc= -2
##$NLEV= 6
##$NOISF1= 0
##$NOISF2= 0
##$NSP= 0
##$NTH_PI= 0
##$NZP= 0
##$OFFSET= 14.96134
##$PC= 1
##$PHC0= -84.09485
##$PHC1= 0
##$PH_mod= 1
##$PKNL= yes
##$PPARMOD= 0
##$PPDIAG= 0
##$PPIPTYP= 0
##$PPMPNUM= 2147483647
##$PPRESOL= 1
##$PSCAL= 4
##$PSIGN= 0
##$PYNMP= <proc.py>
##$REVERSE= no
##$SF= 400.020009498996
##$SI= 131072
##$SIGF1= 0
##$SIGF2= 0
##$SINO= 400
##$SIOLD= 131072
##$SPECTYP= <>
##$SREGLST= <1H.CDCl3>
##$SSB= 0
##$STSI= 131072
##$STSR= 0
##$SW_p= 8223.68421052631
##$SYMM= 0
##$S_DEV= 0
##$TDeff= 65536
##$TDoff= 0
##$TI= <>
##$TILT= no
##$TM1= 0
##$TM2= 0
##$TOPLEV= 0
##$USERP1= <user>
##$USERP2= <user>
##$USERP3= <user>
##$USERP4= <user>
##$USERP5= <user>
##$WDW= 1
##$XDIM= 131072
##$YMAX_p= 446687051
##$YMIN_p= -56052
##$CURPLOT= <Network HP LaserJet P1505>
##$CURPRIN= <$Network HP LaserJet P1505>
##$DFORMAT= <normdp>
##$LAYOUT= <+/1D_H.xwp>
##$LFORMAT= <normlp>
##$PFORMAT= <normpl>
##$SURQMSG= 1
$$ End of Bruker specific parameters
$$ ---------------------------------
##NTUPLES= NMR SPECTRUM
##VAR_NAME=  FREQUENCY,     SPECTRUM/REAL,   SPECTRUM/IMAG
##SYMBOL=    X,             R,               I
##VAR_TYPE=  INDEPENDENT,   DEPENDENT,       DEPENDENT
##VAR_FORM=  AFFN,          ASDF,            ASDF
##VAR_DIM=   131072,        131072,          131072
##UNITS=     HZ,            ARBITRARY UNITS, ARBITRARY UNITS
##FACTOR=    0.0627417313425164, 1,          1
##FIRST=     8223.62146879497, 5081,         -66759
##LAST=      0,             6242,            -65716
##MIN=       0,             -56052,          0
##MAX=       8223.62146879497, 446687051,    0
$$ Real data points
##PAGE= N=1
##DATA TABLE= (X++(R..R)), XYDATA
$$ [...]
$$ plain form
63839 844866 828048 809289 788947 767265 744416 720484 695526 669816 643913 618344 593356
63828 593356 569144 546197 525133 506189 488999 473006 458043 444434 432432 421629 411199
63817 411199 400925 391694 384574 379538 375542 371769 368196 364844 361237 357090 352987 349791 347617 345926
63803 345926 344456 343473 343134 343071 342694 341565 339485 336492 332869 328941 324848 320634 316434 312374 308401
63788 308401 304443 300606 296988 293482 289978 286629 283627 280938 278550 276780 275910 275650 275422 275086 274963
63773 274963 275187 275483 275597 275547 275395 275156 274926 274747 274294 273143 271414 269805 268877 268585 268547 268399 267846 266739
63755 266739 265286 263921 262839 261937 261220 260960 261332 262200 263386 264904 266782 268864 270903 272737 274392
63740 274392 276190 278638 281896 285459 288691 291636 294860 298529 302108 305089 307507 309599 311411 313012
$$ packed form
63839H44866j6818j8759k0342k1682k2849k3932k4958k5710k5903k5569k4988
63828E93356k4212k2947k1064j8944j7190j5993j4963j3609j2002j0803j0430
63817D11199j0274r231p120n036l996l773l573l352l607m147m103l196k174j691
63803C45926j470r83l39o3l77j129k080k993l623l928m093m214m200m060l973
63788C08401l958l837l618l506l504l349l002k689k388j770q70k60k28l36j23
63773B74963K24K96J14n0j52k39k30j79m53j151j729j609r28k92l8j48n53j107
63755B66739j453j365j082r02p17k60L72Q68J186J518J878K082K039J834J655
63740B74392J798K448L258L563L232K945L224L669L579K981K418K092J812J601
$$ plain form
63726 313012 314720 316799 319203 321859 324964 328750 333148 337898 342860 348116 353816 359964 366135 371441
63712 371441 375114 377127 378000 377987 376866 374601 371743 368966 366517 364289 362111 359820 357398 355249 354026
63697 354026 354043 355152 357283 360633 365074 369843 374180 377952 381366 384374 386730 388358 389289 389466 388941
63682 388941 388052 387030 385625 383532 381033 378844 377342 376254 375119 373805 372556 371747 371601 372052 372866
63667 372866 373929 375247 376677 377932 378949 380015 381291 382401 382707 381887 380137 377948 375738 373481 370633
63652 370633 366764 362348 358547 355957 353916 351320 347830 343970 340321 337068 334156 331510 329115 327176
63638 327176 326128 326331 327762 330144 333152 336418 339601 342725 346229 350433 355123 359886 364653 369741
63624 369741 375556 382386 390205 398466 406458 414103 422063 430873 440482 451025 463360 478121 494680
$$ packed form
63726C13012J708K079K404K656L105L786M398M750M962N256N700O148O171N306
63712C71441L673K013Q73j3j121k265k858k777k449k228k178k291k422k149j223
63697C54026J7J109K131L350M441M769M337L772L414L008K356J628R31J77n25
63682C88941q89j022j405k093k499k189j502j088j135j314j249q09j46M51Q14
63667C72866J063J318J430J255J017J066J276J110L06q20j750k189k210k257k848
63652C70633l869m416l801k590k041k596l490l860l649l253k912k646k395j939
63638C27176j048K03J431K382L008L266L183L124L504M204M690M763M767N088
63624C69741N815O830P819Q261P992P645P960Q810R609J0543J2335J4761J6559
$$ plain form
63611 494680 511937 529945 549829 572155 596248 621387 647837 676284 706760 738458 770053
63600 770053 799766 825563 845911 860276 868683 871140 867971 860540 851084 841617 833089 825448 818096
63587 818096 810207 800973 789878 776739 761434 743717 723565 701684 679387 657765 637079 617177
63575 617177 598427 581900 568530 558330 550637 544878 540862 538480 537526 537936 539896 543492 548267 553312
63561 553312 557914 562090 566407 571250 576388 581391 586392 592212 599735 609330 620935 634459 649950
63548 649950 667462 686939 708331 731919 758512 789076 823921 862209 902146 941199 975813
63537 975813 1001710 1015726 1017896 1011323 999870 986330 972587 960265 950365 942742 936641 931436 926306
63524 926306 919613 909406 894514 874710 850072 820932 788449 754541 720985 688881 658963 631840
$$ packed form
63611D94680J7257J8008J9884K2326K4093K5139K6450K8447L0476L1698L1595
63600G70053K9713K5797K0348J4365Q407K457l169p431r456r467q528p641p352
63587H18096p889r234j1095j3139j5305j7717k0152k1881k2297k1622k0686j9902
63575F17177j8750j6527j3370j0200p693n759m016k382r54M10J960L596M775N045
63561E53312M602M176M317M843N138N003N001N820P523R595J1605J3524J5491
63548F49950J7512J9477K1392K3588K6593L0564L4845L8288L9937L9053L4614
63537I75813K5897J4016K170o573j1453j3540j3743j2322r900p623o101n205n130
63524I26306o693j0207j4892j9804k4638k9140l2483l3908l3556l2104k9918k7123
$$ plain form
63512 631840 607727 586274 566926 549325 533329 518924 506144 494869 484692 475270 466814 459887
63500 459887 454543 449959 445180 440108 435560 432356 430477 429163 427752 426297 425290 424919 424745 424076 422493
63485 422493 420126 417683 416148 416111 417268 418847 420509 422500 425008 427898 431169 435050 439439 443859 448182
63470 448182 452715 457141 460162 460850 459752 457863 455086 450652 444711 438443 432699 427533 423085 419908
63456 419908 418143 417185 416518 416239 416434 416680 416604 416541 417290 419441 423110 427952 433259 438453 443692 449745 457115
63439 457115 465531 474349 483147 491971 501369 512173 524876 539310 555534 574861 599015 627750
63427 627750 657909 685375 707736 724998 738507 749852 760384 771001 782249 794806 809650
63416 809650 827512 848487 872590 900351 932240 967525 1004088 1039349 1071018 1097068 1115644
$$ packed form
63512F31840k4113k1453j9348j7601j5996j4405j2780j1275j0177r422q456o927
63500D59887n344m584m779n072m548l204j879j314j411j455j007l71j74o69j583
63485D22493k367k443j535l7J157J579J662J991K508K890L271L881M389M420M323
63470D48182M533M426L021O88j098j889k777m434n941o268n744n166m448l177
63456D19908j765r58o67k79J95K46p6o3P49K151L669M842N307N194N239O053P370
63439D57115Q416Q818Q798Q824R398J0804J2703J4434J6224J9327K4154K8735
63427F27750L0159K7466K2361J7262J3509J1345J0532J0617J1248J2557J4844
63416H09650J7862K0975K4103K7761L1889L5285L6563L5261L1669K6050J8576
$$ plain form
63405 1115644 1125572 1126975 1121292 1110649 1097185 1082763 1068939 1056776 1046386 1036751 1026231 1013357
63393 1013357 997163 977048 952703 924296 892554 858648 824075 790416 758787 729484 702434
63382 702434 677960 656760 639161 624844 613395 604711 598702 594988 593168 593113 594793 598108 603140
63369 603140 610344 620165 632470 646423 660765 674243 686115 696484 706098 715854 726672 739613
63357 739613 755496 774273 795324 818611 845025 875200 908393 942925 977253 1010004 1039285
63346 1039285 1062843 1079139 1087901 1089620 1085069 1075539 1063037 1049637 1036519 1023806 1011296 999016
63334 999016 986839 973791 958189 938729 915354 888977 860695 831463 802263 774005 747240
63323 747240 722302 699720 680033 663124 648252 635109 624543 617859 615342 615397 614934 610745 601164
$$ packed form
63405A115644R928J403n683j0643j3464j4422j3824j2163j0390r635j0520j2874
63393A013357j6194k0115k4345k8407l1742l3906l4573l3659l1629k9303k7050
63382G02434k4474k1200j7599j4317j1449q684o009l714j820n5J680L315N032
63369F03140P204R821J2305J3953J4342J3478J1872J0369R614R756J0818J2941
63357G39613J5883J8777K1051K3287K6414L0175L3193L4532L4328L2751K9281
63346A039285K3558J6296Q762J719m551r530j2502j3400j3118j2713j2510j2280
63334I99016j2177j3048j5602j9460k3375k6377k8282k9232k9200k8258k6765
63323G47240k4938k2582j9687j6909j4872j3143j0566o684k517N5m63m189r581
$$ plain form
63310 601164 586941 570448 553880 538220 523672 510501 499168 490089 483583 479748 478106 477644 477612
63297 477612 478056 479304 481165 482970 484174 484504 483679 481411 477660 472560 466192 458777 451045 443911 437668
63282 437668 431775 425630 419354 413695 409257 405953 403181 400432 397693 395269 393288 391616 390313 389889
63268 389889 390795 392711 394663 395940 396669 397380 398216 398940 399691 401261 404260 408198 411944 415165 418787 423738
63252 423738 429692 435550 440838 446005 451493 457208 463000 469022 475392 482029 489101 497165 506494 516673
63238 516673 527216 538390 551085 566073 583560 603167 624116 645728 668069 691898 717681
63227 717681 744881 772552 800321 828382 856694 884745 912157 939055 965675 991968 1017881
63216 1017881 1043862 1070676 1098589 1126953 1154876 1182247 1209695 1237314 1263743 1286832 1305062
$$ packed form
63310F01164j4223j6493j6568j5660j4548j3171j1333r079o506l835j642m62l2
63297D77612M44J248J861J805J204L30q25k268l751n100o368p415p732p134o243
63282D37668n893o145o276n659m438l304k772k749k739k424j981j672j303m24
63268C89889R06J916J952J277P29P11Q36P24P51J570K999L938L746L221L622M951
63252D23738N954N858N288N167N488N715N792O022O370O637P072Q064R329J0179
63238E16673J0543J1174J2695J4988J7487J9607K0949K1612K2341K3829K5783
63227G17681K7200K7671K7769K8061K8312K8051K7412K6898K6620K6293K5913
63216A017881K5981K6814K7913K8364K7923K7371K7448K7619K6429K3089J8230
$$ plain form
63205 1305062 1317970 1325512 1327562 1323958 1314400 1298301 1275394 1246676 1214257 1180187 1145991 1113363
63193 1113363 1084269 1059747 1039238 1021685 1006813 994781 985254 977771 972777 971425 974300 980969
63181 980969 990750 1003353 1018759 1037001 1058177 1082227 1108593 1136373 1164870 1193718 1222532 1250761
63169 1250761 1277934 1303786 1328205 1351281 1373300 1394326 1413751 1430407 1443052 1450657 1452466 1448084
63157 1448084 1437343 1419896 1395275 1363682 1326391 1284979 1240416 1193457 1145576 1098747 1054292
63146 1054292 1012537 973659 938178 906445 878190 852919 830354 810258 792192 775795 761176
63135 761176 748773 738929 731661 726704 723610 721846 720891 720343 720183 720996 723670 728543 735023 742348 750515
63120 750515 760058 771009 782534 793560 803305 811185 816736 819878 820956 820362 818329 815137 811146 806478
$$ packed form
63205A305062J2908P542K050l604r558j6099k2907k8718l2419l4070l4196l2628
63193A113363k9094k4522k0509j7553j4872j2032r527p483m994j352K875O669
63181I80969R781J2603J5406J8242K1176K4050K6366K7780K8497K8848K8814K8229
63169A250761K7173K5852K4419K3076K2019K1026J9425J6656J2645P605J809m382
63157A448084j0741j7447k4621l1593l7291m1412m4563m6959m7881m6829m4455
63146A054292m1755l8878l5481l1733k8255k5271k2565k0096j8066j6397j4619
63135G61176j2403r844p268m957l094j764r55n48j60Q13K674M873O480P325Q167
63120G50515R543J0951J1525J1026R745P880N551L142J078n94k033l192l991m668
$$ plain form
63106 806478 801028 795022 789292 784638 780975 777420 773268 768696 764424 760811 757535 754237 751202 749059
63092 749059 747847 746799 745190 743123 741315 740391 740585 741725 743238 744497 745499 746992 749645 753404 757856
63077 757856 762799 767990 772852 777065 781173 786007 791750 798203 805616 814435 824373 834675 845391 857486
63063 857486 871481 886745 902474 918772 936477 956489 979538 1006003 1035537 1067316 1101019
63052 1101019 1137275 1176858 1219869 1265969 1315025 1367185 1422550 1480965 1541850 1604131 1666750
63041 1666750 1729458 1792732 1856711 1920638 1983483 2044667 2104044 2161763 2218502 2275212 2332092
63030 2332092 2388224 2442616 2495066 2545372 2591953 2631960 2662697 2682489 2690351 2685437 2667005 2634731
63018 2634731 2589126 2531842 2465388 2392273 2314540 2234224 2153791 2075694 2001699 1933075 1871138
$$ packed form
63106H06478n450o006n730m654l663l555m152m572m272l613l276l298l035k143
63092G49059j212j048j609k067j808r24J94J140J513J259J002J493K653L759M452
63077G57856M943N191M862M213M108M834N743O453P413Q819R938J0302J0716J2095
63063H57486J3995J5264J5729J6298J7705K0012K3049K6465K9534L1779L3703
63052A101019L6256L9583M3011M6100M9056N2160N5365N8415O0885O2281O2619
63041A666750O2708O3274O3979O3927O2845O1184N9377N7719N6739N6710N6880
63030B332092N6132N4392N2450N0306M6581M0007L0737J9792P862m914j8432l2274
63018B634731m5605n7284o6454p3115p7733q0316q0433p8097p3995o8624o1937
$$ plain form
63007 1871138 1817120 1771656 1734957 1707403 1689431 1680868 1680910 1688854 1704470 1727534 1757325 1792687
62995 1792687 1832342 1875146 1920396 1967925 2017586 2068647 2120014 2171046 2221774 2272214 2321901
62984 2321901 2370183 2416482 2459991 2499449 2533573 2561425 2581990 2593663 2594650 2583899 2561270 2526798
62972 2526798 2480239 2421672 2352297 2274364 2190323 2102193 2011652 1920368 1829985 1741901 1657237
62961 1657237 1577019 1502131 1432936 1369071 1309842 1254889 1204355 1158327 1116209 1076874 1039536
62950 1039536 1004314 971778 941982 914205 887717 862509 839024 817351 797030 777687 759520
62939 759520 742982 728129 714532 701830 690180 680016 671388 663773 656692 650380 645523 642264 639839
62926 639839 637339 634523 631612 628730 626006 623940 622895 622196 620445 616990 612605 608419 604631 600629
$$ packed form
63007A871138n4018m5464l6699k7554j7972q563M2P944J5616K3064K9791L5362
62995A792687L9655M2804M5250M7529M9661N1061N1367N1032N0728N0440M9687
62984B321901M8282M6299M3509L9458L4124K7852K0565J1673R87j0751k2629l4472
62972B526798m6559n8567o9375p7933q4041q8130r0541r1284r0383q8084q4664
62961A657237q0218p4888o9195o3865n9229n4953n0534m6028m2118l9335l7338
62950A039536l5222l2536k9796k7777k6488k5208k3485k1673k0321j9343j8167
62939G59520j6538j4853j3597j2702j1650j0164q628p615p081o312m857l259k425
62926F39839k500k816k911k882k724k066j045o99j751l455m385m186l788m002
$$ plain form
62912 600629 595959 590702 585139 579553 574337 569863 566135 562778 559402 555891 552421 549345 546927 545031
62898 545031 543166 541009 538761 536822 535271 533905 532626 531525 530626 529849 529249 529028 529294 529928 530680 531247
62882 531247 531330 530867 530159 529534 528969 528347 528041 528764 530662 532905 534408 534741 534124 532912 531522 530588 530580 531150
62864 531150 531391 530902 530185 529789 529529 529011 528512 528736 529858 531427 533165 535177 537239 538645 539208 539843 541602
62847 541602 544420 547387 549917 552086 553995 555457 556297 556414 555576 553749 551670 550473 550523 551066 551202 550746
62831 550746 550017 549336 549045 549465 550439 551319 551841 552645 554504 557394 560813 564640 569016 573529 577284 579923
62815 579923 582066 584539 587584 591015 594712 598693 602892 607195 611597 616104 620484 624330 627514 630569
62801 630569 634496 640005 646888 654327 661877 669948 679189 689672 701000 712962 725687 739301 754023
$$ packed form
62912F00629m670n257n563n586n216m474l728l357l376l511l470l076k418j896
62898E45031j865k157k248j939j551j366j279j101q99p77o00k21K66O34P52N67
62882E31247Q3m63p08o25n65o22l06P23J898K243J503L33o17j212j390r34qN70
62864E31150K41m89p17l96k60n18m99K24J122J569J738K012K062J406N63O35J759
62847E41602K818K967K530K169J909J462Q40J17q38j827k079j197N0N43J36m56
62831E50746p29o81k91M20R74Q80N22Q04J859K890L419L827M376M513L755K639
62815E79923K143K473L045L431L697L981M199M303M402M507M380L846L184L055
62801F30569L927N509O883P439P550Q071R241J0483J1328J1962J2725J3614J4722
$$ plain form
62788 754023 770680 790518 814128 840969 870408 902972 940099 982764 1030861 1083977 1142177
62777 1142177 1205691 1274265 1347366 1424978 1507689 1595849 1688902 1785642 1884709 1984393 2082092
62766 2082092 2174568 2259076 2334074 2398502 2450425 2486800 2504846 2503606 2484053 2447901 2396660
62755 2396660 2331812 2255374 2169827 2077604 1980935 1882102 1783389 1686684 1593295 1504173 1419997
62744 1419997 1341000 1267051 1198110 1134432 1076231 1023455 975957 933575 895861 862113 831961
62733 831961 805615 783178 763973 746919 731402 717487 705499 695756 688465 683404 679833 677105
62721 677105 675274 674754 675566 677423 680350 684657 690345 697122 705066 714753 726628 740697 756901 775343
62707 775343 796081 819181 845037 874246 907099 943708 984621 1030672 1082035 1138008 1198048
$$ packed form
62788G54023J6657J9838K3610K6841K9439L2564L7127M2665M8097N3116N8200
62777A142177O3514O8574P3101P7612Q2711Q8160R3053R6740R9067R9684R7699
62766B082092R2476Q4508P4998O4428N1923L6375J8046j240j9553l6152n1241
62755B396660o4848p6438q5547r2223r6669r8833r8713r6705r3389q9122q4176
62744A419997p8997p3949o8941o3678n8201n2776m7498m2382l7714l3748l0152
62733H31961k6346k2437j9205j7054j5517j3915j1988r743p291n061l571k728
62721F77105j831n20Q12J857K927M307N688O777P944R687J1875J4069J6204J8442
62707G75343K0738K3100K5856K9209L2853L6609M0913M6051N1363N5973O0040
$$ plain form
62696 1198048 1262534 1332308 1407977 1489871 1578061 1671919 1770034 1870908 1973379 2076115 2177052
62685 2177052 2273598 2362861 2441416 2505511 2552141 2579697 2587290 2574192 2540648 2488772 2421748
62674 2421748 2342273 2252338 2154220 2050736 1944453 1837331 1731264 1628359 1530409 1438458
62664 1438458 1352948 1273917 1201040 1133987 1072878 1017956 968726 923909 882542 844719 810947
62653 810947 781148 754707 731272 710935 693601 678527 664667 651238 637809 624192 610670
62642 610670 598234 588043 580398 574555 569736 565883 563095 560854 558592 556801 556602 558031 559551 559644
62628 559644 558203 555903 552922 549080 544826 541209 538835 537373 536105 534581 532809 531290 530955 532623
62614 532623 536299 541126 546129 551015 556310 562716 570238 578005 585213 592119 599645 608047 616682 625346
$$ packed form
62696A198048O4486O9774P5669Q1894Q8190R3858R8115J00874J02471J02736J00937
62685B177052R6546Q9263P8555O4095M6630K7556P593j3098l3544n1876o7024
62674B421748p9475q9935r8118j03484j06283j07122j06067j02905r7950r1951
62664A438458q5510p9031p2877o7053o1109n4922m9230m4817m1367l7823l3772
62653H10947k9799k6441k3435k0337j7334j5074j3860j3429j3429j3617j3522
62642F10670j2436j0191p645n843m819l853k788k241k262j791j99J429J520R3
62628E59644j441k300k981l842m254l617k374j462j268j524j772j519l35J668
62614E32623L676M827N003M886N295O406P522P767P208O906P526Q402Q635Q664
$$ plain form
62600 625346 635101 647217 661839 678362 696717 717576 741549 768865 799689 834071 871625 911846
62588 911846 954675 1000205 1047867 1096425 1144743 1192022 1237225 1278811 1315146 1344837 1366680
62577 1366680 1379736 1383613 1378417 1364494 1342450 1313257 1277962 1237413 1192648 1145329 1097239 1049518
62565 1049518 1002843 958105 916194 877240 840886 807359 777487 751468 728399 707409 688674
62554 688674 672879 660144 649830 641078 633180 625688 618519 611939 606347 602095 599295 597464 595562
62541 595562 592871 589806 587377 585970 585239 585141 586230 588751 592137 595707 599234 602590 605494 608034 610954
62526 610954 615088 620953 629018 639580 652011 664936 677867 692047 709082 729361 752534 778885
62514 778885 809173 843479 881302 922703 968290 1018042 1071112 1127069 1186380 1249256 1314730
$$ packed form
62600F25346R755J2116J4622J6523J8355K0859K3973K7316L0824L4382L7554M0221
62588I11846M2829M5530M7662M8558M8318M7279M5203M1586L6335K9691K1843
62577A366680J3056L877n196j3923k2044k9193l5295m0549m4765m7319m8090m7721
62565A049518m6675m4738m1911l8954l6354l3527k9872k6019k3069k0990j8735
62554F88674j5795j2735j0314q752p898p492p169o580n592m252k800j831j902
62541E95562k691l065k429j407p31r8J089K521L386L570L527L356K904K540K920
62526F10954M134N865Q065J0562J2431J2925J2931J4180J7035K0279K3173K6351
62514G78885L0288L4306L7823M1401M5587M9752N3070N5957N9311O2876O5474
$$ plain form
62503 1314730 1381354 1448084 1513711 1575829 1631186 1677201 1712822 1738140 1753766 1760720 1760487 1754849
62491 1754849 1745725 1735172 1725291 1717889 1714278 1715435 1722207 1735159 1754305 1779260 1809895 1846793
62479 1846793 1890719 1941062 1994278 2043800 2082268 2105066 2112576 2109018 2098559 2081842 2055622 2015302
62467 2015302 1958073 1884673 1799227 1707531 1614627 1523083 1433158 1344544 1258047 1175828 1100369
62456 1100369 1033320 975102 925303 883279 848369 819680 795993 776149 759465 745627 734215
62445 734215 724587 716300 709505 704816 702787 703466 706331 710654 715905 721769 727872 733784 739427 745140
62431 745140 751104 756857 761571 764601 765532 764068 760345 755164 749278 742459 733807 723122 711476 700256
62417 700256 690020 680534 671461 662649 653955 645268 636681 628418 620534 612880 605418 598512 592747 588334
$$ packed form
62503A314730O6624O6730O5627O2118N5357M6015L5621K5318J5626O954k33n638
62491A754849r124j0553r881p402l611J157O772J2952J9146K4955L0635L6898
62479A846793M3926N0343N3216M9522L8468K2798P510l558j0459j6717k6220m0320
62467B015302n7229p3400q5446r1696r2904r1544q9925q8614q6497q2219p5459
62456A100369o7049n8218m9799m2024l4910k8689k3687j9844j6684j3838j1412
62445G34215r628q287o795m689k029O79K865M323N251N864O103N912N643N713
62431G45140N964N753M714L030R31j464l723n181n886o819q652j0685j1646j1220
62417G00256j0236r486r073q812q694q687q587q263p884p654p462o906n765m413
$$ plain form
62403 588334 584744 581212 577679 574945 573586 573040 572237 571000 570290 571050 573274 576336 579751 583318 586875
62388 586875 590300 593681 597256 601154 605274 609374 613344 617451 622198 627773 633772 639690 645534 651672
62374 651672 658263 665262 672886 681519 691080 700965 710790 720829 731565 743169 755636 769116 783922
62361 783922 800447 819268 841128 866622 895984 929177 966038 1006360 1050102 1097463 1148499
62350 1148499 1202627 1258659 1315015 1369523 1419293 1461536 1494692 1518383 1532519 1537280 1533987 1525012
62338 1525012 1512209 1495828 1475230 1450045 1420310 1386231 1348534 1308748 1268531 1228868 1190295
62327 1190295 1153537 1119390 1088149 1059612 1033519 1009639 987555 966751 946860 927569 908461
62316 908461 889227 869961 851049 832916 816020 800848 787662 776401 766986 759471 753749 749393
$$ packed form
62403E88334l590l532l533k734j359n46q03j237p10P60K224L062L415L567L557
62388E86875L425L381L575L898M120M100L970M107M747N575N999N918N844O138
62374F51672O591O999P624Q633R561R885R825J0039J0736J1604J2467J3480J4806
62361G83922J6525J8821K1860K5494K9362L3193L6861M0322M3742M7361N1036
62350A148499N4128N6032N6356N4508M9770M2243L3156K3691J4136M761l293q975
62338A525012j2803j6381k0598k5185k9735l4079l7697l9786m0217l9663l8573
62327A190295l6758l4147l1241k8537k6093k3880k2084k0804j9891j9291j9108
62316I08461j9234j9266j8912j8133j6896j5172j3186j1261r415p515n722m356
$$ plain form
62304 749393 746007 743471 741643 740148 738695 737312 736013 734600 732987 731360 729687 727473 724433 721086
62290 721086 718272 716342 715192 714747 714911 715247 715276 715060 715137 715942 717555 719855 722652 725822 729579 734357
62274 734357 740181 746494 752965 760053 768304 777427 786661 795797 805165 814761 824154 833412 843545 855792
62260 855792 870750 888351 908399 931098 957239 987876 1023612 1064318 1109667 1159652 1214165
62249 1214165 1272251 1332173 1391956 1449411 1501865 1546632 1582016 1607557 1623448 1630179 1628592 1619545
62237 1619545 1603234 1579302 1547820 1509766 1466353 1418354 1366454 1312039 1257250 1204244 1154408
62226 1154408 1108147 1065306 1025906 990498 959697 933397 910658 890378 871995 855585 841499
62215 841499 829907 820521 812758 806228 800937 796906 793806 791264 789374 788558 788986 790468 792909 796568
$$ packed form
62304G49393l386k536j828j495j453j383j299j413j613j627j673k214l040l347
62290G21086k814j930j150m45J64L36K9k16P7Q05J613K300K797L170L757M778
62274G34357N824O313O471P088Q251R123R234R136R368R596R393R258J0133J2247
62260H55792J4958J7601K0048K2699K6141L0637L5736M0706M5349M9985N4513
62249A214165N8086N9922N9783N7455N2454M4767L5384K5541J5891O731j587r047
62237A619545j6311k3932l1482l8054m3413m7999n1900n4415n4789n3006m9836
62226A154408m6261m2841l9400l5408l0801k6300k2739k0280j8383j6410j4086
62215H41499j1592r386p763o530n291m031l100k542j890q16M28J482K441L659
$$ plain form
62201 796568 801814 808783 817259 826681 836318 845637 854491 862882 870739 878089 885218 892356 899403 906267
62187 906267 913245 920708 928582 936593 944888 953987 964175 975364 987322 999529 1010887 1020258 1027414
62174 1027414 1032935 1037101 1039547 1040267 1040405 1041600 1044871 1050528 1058903 1070702 1086604 1106810 1131065
62161 1131065 1159101 1190967 1226726 1265630 1305777 1344838 1381002 1412917 1439040 1457840 1468810
62150 1468810 1472752 1470823 1463695 1451778 1435581 1415410 1391129 1362738 1330920 1296601 1260350 1222782
62138 1222782 1185380 1150160 1118393 1090121 1064967 1042897 1023946 1007823 994209 983091 974229
62127 974229 966532 958601 949907 940899 931890 922532 912716 903397 895832 890251 885897 882191 879207 877051
62113 877051 875548 874804 875426 877804 881639 886574 892793 900414 908385 914542 916865 914717 909122 902106 895652
$$ packed form
62201G96568N246O969Q476R422R637R319Q854Q391P857P350P129P138P047O864
62187I06267O978P463P874Q011Q295R099J0188J1189J1958J2207J1358R371P156
62174A027414N521M166K446P20J38J195L271N657Q375J1799J5902K0206K4255
62161A131065K8036L1866L5759L8904M0147L9061L6164L1915K6123J8800J0970
62150A468810L942j929p128j1917j6197k0171k4281k8391l1818l4319l6251l7568
62138A222782l7402l5220l1767k8272k5154k2070j8951j6123j3614j1118q862
62127I74229p697p931q694r008r009r358r816r319p565n581m354l706k984k156
62113H77051j503p44O22K378L835M935O219P621P971O157K323k148n595p016o454
$$ plain form
62098 895652 891029 888960 889962 893804 898570 901196 899673 894482 887582 880477 873720 867660 862692 858904
62084 858904 856194 854807 855195 857381 860924 865491 871042 877591 885310 894768 906547 920572 936196 952837
62070 952837 970084 987385 1004226 1020633 1036903 1052866 1068018 1082466 1097132 1112886 1130098
62059 1130098 1149226 1171168 1196361 1223631 1250253 1273274 1290933 1303127 1310688 1314213 1313663 1308978
62047 1308978 1300480 1288276 1271779 1250456 1224772 1195702 1163566 1128124 1089775 1049856 1009703
62036 1009703 970157 932009 896062 862507 830902 801041 773232 747634 724087 702816 684459
62025 684459 669001 655431 642937 631740 622211 613828 605759 597989 591114 585252 579782 574065 567922
62012 567922 561552 555399 550024 545771 542626 540529 539499 539250 539109 538754 538749 539942 542564 546316 551063 556896
$$ packed form
62098H95652m623k069J002L842M766K626j523n191o900p105o757o060m968l788
62084H58904k710j387L88K186L543M567N551O549P719R458J1779J4025J5624J6641
62070I52837J7247J7301J6841J6407J6270J5963J5152J4448J4666J5754J7212
62059A130098J9128K1942K5193K7270K6622K3021J7659J2194P561L525n50m685
62047A308978q498j2204j6497k1323k5684k9070l2136l5442l8349l9919m0153
62036A009703l9546l8148l5947l3555l1605k9861k7809k5598k3547k1271j8357
62025F84459j5458j3570j2494j1197r529q383q069p770o875n862n470n717o143
62012E67922o370o153n375m253l145k097j030k49j41l55nJ193K622L752M747N833
$$ plain form
61996 556896 563608 570503 576783 581901 585648 588182 589884 590987 591354 590623 588340 583908 576841 567367 556500
61981 556500 545301 534270 523611 513649 504588 496242 488435 481395 475388 470193 465396 460993 457334
61968 457334 454655 453053 452667 453391 454604 455687 456701 458034 459498 460451 460826 461410 462855 464980 467307
61953 467307 469780 472470 474955 476599 477472 478502 480552 483638 487250 491222 496012 502176 509860 518894
61939 518894 529076 540120 551518 562820 574146 586147 599291 613267 627132 639966 651384
61928 651384 661636 671302 680757 689792 697800 704328 709356 712972 714940 714761 712213 707773 702411 696878
61914 696878 691320 685790 681064 678507 678893 681743 686157 691953 699581 709238 720624 733388 747136 760939
61900 760939 773542 784302 793485 801433 807840 812058 813787 813294 811264 808600 806142 804348 803275 802712
$$ packed form
61996E56896O712O895O280N118L747K534J702J103L67p31k283m432p067r474j0867
61981E56500j1199j1031j0659r962r061q346p807p040o007n195m797m403l659
61968D57334k679j602l86P24J213J083J014J333J464R53L75N84J445K125K327
61953D67307K473K690K485J644Q73J030K050L086L612L972M790O164P684R034
61939E18894J0182J1044J1398J1302J1326J2001J3144J3976J3865J2834J1418
61928F51384J0252R666R455R035Q008O528N028L616J968j79k548m440n362n533
61914F96878n558n530m726k557L86K850M414N796P628R657J1386J2764J3748J3803
61900G60939J2603J0760R183P948O407M218J729m93k030k664k458j794j073n63
$$ plain form
61886 802712 802156 800974 799148 797676 797511 798024 797070 792752 784593 773022 758546 741829 723930 705953
61872 705953 688739 672978 659056 646559 634637 623273 613605 606554 601702 598081 595518 594570 595559
61859 595559 598408 603162 609940 618420 627943 638180 649326 661731 675672 691376 708901 728009
61847 728009 748376 769748 791706 813649 835343 857198 879487 901428 921412 937994 950385
61836 950385 958239 961616 961166 957881 952458 945112 936128 926420 917459 910620 906609 905454 907017 911272
61822 911272 917991 926472 935977 946218 956844 966650 973992 978018 978784 976164 969643 959500 947195
61809 947195 933998 920067 905551 891777 880296 871176 863124 854956 846070 835756 823081 807756
61797 807756 790618 773142 756681 741876 728351 715199 702174 690082 679606 670321 661559 653721
$$ packed form
61886H02712n56j182j826j472j65N13r54m318q159j1571j4476j6717j7899j7977
61872G05953j7214j5761j3922j2497j1922j1364r668p051m852l621k563r48R89
61859E95559K849M754O778Q480R523J0237J1146J2405J3941J5704J7525J9108
61847G28009K0367K1372K1958K1943K1694K1855K2289K1941J9984J6582J2391
61836I50385P854L377m50l285n423p346q984r708q961o839m011j155J563M255
61822I11272O719Q481R505J0241J0626R806P342M026P66k620o521j0143j2305
61809I47195j3197j3931j4516j3774j1481r120q052q168q886j0314j2675j5325
61797H07756j7138j7476j6461j4805j3525j3152j3025j2092j0476r285q762p838
$$ plain form
61785 653721 647763 643620 640154 636613 633218 630256 627586 625315 624086 624175 624947 625749 626858 628948 631889
61770 631889 634697 636748 638623 641539 646110 652006 658771 666579 675841 686420 697840 710147 723788
61757 723788 738528 753308 767524 781635 795902 809248 820069 827545 831399 830981 825716 816206 803882
61744 803882 789617 773537 756081 738356 721278 705109 689941 675997 663358 651963 641929
61733 641929 633351 625852 618978 612977 608552 605804 604051 602701 601634 600753 599880 599287 599655 601225 603383
61718 603383 605253 606261 606220 605404 604639 604743 605676 606602 606804 606183 605006 603619 602212 600308 596754 591003
61702 591003 584214 578149 573072 567696 561269 554580 548644 543451 538578 534126 530360 527044 523705 520084
61688 520084 515913 510859 505202 500071 496492 494515 493578 493111 492451 490811 488029 484894 482166 479643 476798
$$ packed form
61785F53721n958m143l466l541l395k962k670k271j229Q9P72Q02J109K090K941
61770F31889K808K051J875K916M571N896O765P808R262J0579J1420J2307J3641
61757G23788J4740J4780J4216J4111J4267J3346J0821P476L854m18n265r510j2324
61744H03882j4265j6080j7456j7725j7078j6169j5168j3944j2639j1395j0034
61733F41929q578p499o874o001m425k748j753j350j067q81q73n93L68J570K158
61718F03383J870J008m1q16p65J04R33R26K02o21j177j387j407j904l554n751
61702E91003o789o065n077n376o427o689n936n193m873m452l766l316l339l621
61688E20084m171n054n657n131l579j977r37m67o60j640k782l135k728k523k845
$$ plain form
61673 476798 473910 471817 470695 469853 468798 467923 467919 468797 469795 470225 470312 471070 473212 476311 479304 481690 483916
61656 483916 486627 490090 494443 499918 506500 513698 520876 527537 533183 537306 539724 540582 539883 537493 533866
61641 533866 530309 528099 527536 528057 528969 529876 530731 531782 533262 535085 537150 539945 544254 550003 555860
61626 555860 560328 562817 563358 561778 557747 551417 543543 535001 526437 518262 510793 504456 499809 497002
61612 497002 495209 493085 490071 486791 483907 480997 476984 471354 464606 457719 451520 446332 441880 437592
61598 437592 433180 428833 424846 421368 418521 416344 414482 412357 409850 407438 405541 404157 403254 402902 402753
61583 402753 402012 400392 398636 397646 397534 397895 398470 399026 399024 398117 396751 395693 395199 395098 395407 396277 397504 398670
61565 398670 399698 400840 402200 403731 405598 408038 410898 413709 416192 418407 420451 422346 424065 425399
$$ packed form
61673D76798k888k093j122q42j055q75mQ78R98M30Q7P58K142L099K993K386K226
61656D83916K711L463M353N475O582P198P178O661N646M123K418Q58o99k390l627
61641E33866l557k210n63N21R12R07Q55J051J480J823K065K795M309N749N857
61626E55860M468K489N41j580m031o330p874q542q564q175p469o337m647k807
61612D97002j793k124l014l280k884k910m013n630o748o887o199n188m452m288
61598D37592m412m347l987l478k847k177j862k125k507k412j897j384r03l52j49
61583D02753p41j620j756r90j12L61N75N56kr07j366j058m94j01L09Q70J227J166
61565C98670J028J142J360J531J867K440K860K811K483K215K044J895J719J334
$$ plain form
61551 425399 425991 425915 425999 427015 428633 429729 429782 429403 429353 429523 429272 428444 427681 427707 428558 429645 430507 431352 432785
61532 432785 435122 438171 441585 445172 448833 452429 455731 458260 459221 458075 455360 452483 450423 448873
61518 448873 446852 443821 439965 435853 432275 430109 429754 430705 431979 432977 433694 434312 434966 435886 437400 439677
61502 439677 442619 446128 450361 455569 461568 467420 472019 475264 478414 482887 488866 495519 502272 509096
61488 509096 515571 520657 523839 525805 527517 529194 530658 532112 533917 536023 538214 540677 543752 547320
61474 547320 550929 554316 557369 559746 560993 560954 559753 557512 554382 550636 546391 541490 535916 530052 524232
61459 524232 518363 512332 506435 501057 496298 492369 489906 489263 489771 490388 490938 492142 494417 497187 499472
61444 499472 500822 501671 503040 505765 509743 514007 517740 520958 524031 526986 529709 532424 535373 538237
$$ packed form
61551D25399N92p6Q4J016J618J096N3l79n0J70k51q28p63K6Q51J087Q62Q45J433
61532D32785K337L049L414L587L661L596L302K529R61j146k715k877k060j550
61518D48873k021l031l856m112l578k166l55R51J274R98P17O18O54R20J514K277
61502D39677K942L509M233N208N999N852M599L245L150M473N979O653O753O824
61488E09096O475N086L182J966J712J677J464J454J805K106K191K463L075L568
61474E47320L609L387L053K377J247l9j201k241l130l746m245m901n574n864n820
61459E24232n869o031n897n378m759l929k463o43N08O17N50J204K275K770K285
61444D99472J350Q49J369K725L978M264L733L218L073K955K723K715K949K864
$$ plain form
61430 538237 540427 541826 542756 543325 543403 543189 543271 543984 545057 545975 546539 547109 548434 551079 554845 558933 562767
61413 562767 566316 569443 571524 572072 571294 569598 567056 563870 560865 558740 557161 555328 553175 551285 549793
61398 549793 548212 546279 544266 542415 540786 539728 539800 540965 542384 543321 543942 545046 547259 550584 554519
61383 554519 558492 562244 565783 569111 572366 576163 581172 587153 593087 598611 604569 611578 618828 625006
61369 625006 629709 633084 634811 634611 633208 631533 629280 625578 620847 616543 613093 609546 605530 602032
61355 602032 599740 597957 595961 594406 594467 596347 599411 603201 607591 612438 617673 623274 628594 632259 633440
61340 633440 632876 632023 631434 630620 629287 628022 627717 628648 630206 631342 631360 630418 629220 628239 627478 626911 626758
61323 626758 627177 628098 629579 631952 635379 639531 643954 648530 653374 658507 663829 669351 675331 682230 690434
$$ packed form
61430E38237K190J399R30N69P8k14Q2P13J073R18N64N70J325K645L766M088L834
61413E62767L549L127K081N48p78j696k542l186l005k125j579j833k153j890j492
61398E49793j581j933k013j851j629j058P2J165J419R37O21J104K213L325L935
61383E54519L973L752L539L328L255L797N009N981N934N524N958P009P250O178
61369F25006M703L375J727k00j403j675k253l702m731m304l450l547m016l498
61355F02032k292j783j996j555O1J880L064L790M390M847N235N601N320L665J181
61340F33440n64q53n89q14j333j265l05R31J558J136J8r42j198r81p61n67j53
61323F26758M19R21J481K373L427M152M423M576M844N133N322N522N980O899Q204
$$ plain form
61308 690434 699894 710192 721236 733623 747932 763759 779919 795441 809861 822588 832620 839028
61296 839028 841363 839650 834501 827145 818740 809572 799380 788402 777472 767140 757335 747976 739169
61283 739169 730772 722489 714528 707455 701324 695783 691181 688553 688100 688604 688973 689560 691323 694314 697696
61268 697696 700762 703185 704746 705529 706147 707223 708831 710872 713649 717584 722745 729132 736997 746170 755352
61253 755352 762816 767853 770967 772713 772992 771605 768982 765982 763241 760961 759208 758132 757760 757693 757217
61238 757217 755807 753446 750498 747545 745353 744445 744309 743517 741256 738483 736958 737468 739694 743441 748907
61223 748907 755725 762890 769892 777050 784471 791595 798081 804255 810253 815681 820588 825832 831821 837711
61209 837711 842566 846563 850280 853507 855651 856870 857936 859362 861315 864026 867599 871782 876646 883059
$$ packed form
61308F90434R460J0298J1044J2387J4309J5827J6160J5522J4420J2727J0032O408
61296H39028K335j713n149p356q405r168j0192j0978j0930j0332r805r359q807
61283G39169q397q283p961p073o131n541m602k628m53N04L69N87J763K991L382
61268F97696L066K423J561P83O18J076J608K041K777L935N161O387P865R173R182
61253G55352P464N037L114J746K79j387k623l000k741k280j753j076l72o7m76
61238G57217j410k361k948k953k192r08j36p92k261k773j525N10K226L747N466
61223G48907O818P165P002P158P421P124O486O174N998N428M907N244N989N890
61209H37711M855L997L717L227K144J219J066J426J953K711L573M183M864O413
$$ plain form
61195 883059 891782 902416 913997 926342 940005 955051 970442 984527 995563 1002165 1004013 1002117
61183 1002117 997900 992153 985232 977774 970485 963423 956216 948746 941024 932645 923130 912671 901807
61170 901807 890475 878140 864875 851575 838978 827078 815600 804453 793496 782398 771036
61159 771036 759721 748893 738815 729682 721825 715713 711874 710636 711744 714287 717322 720596 724583
61146 724583 729856 736389 743160 748423 750761 750039 747096 742595 736757 730200 724104 719192 715297 712368
61132 712368 711067 711774 713873 716842 721342 728313 737585 748358 760500 774313 789425 805124 821590
61119 821590 839735 859829 881307 903854 927699 952770 978471 1004444 1030749 1057200 1083258
61108 1083258 1108704 1133703 1158107 1181331 1203015 1223202 1241855 1258731 1273617 1286029 1294869
$$ packed form
61195H83059Q723J0634J1581J2345J3663J5046J5391J4085J1036O602J848j896
61183A002117m217n747o921p458p289p062p207p470p722q379r515j0459j0864
61170I01807j1332j2335j3265j3300j2597j1900j1478j1147j0957j1098j1362
61159G71036j1315j0828j0078r133p857o112l839j238J108K543L035L274L987
61146G24583N273O533O771N263K338p22k943m501n838o557o096m912l895k929
61132G12368j301P07K099K969M500O971R272J0773J2142J3813J5112J5699J6466
61119H21590J8145K0094K1478K2547K3845K5071K5701K5973K6305K6451K6058
61108A083258K5446K4999K4404K3224K1684K0187J8653J6876J4886J2412Q840
$$ plain form
61097 1294869 1299203 1299362 1296570 1291552 1284332 1275244 1265209 1254899 1244490 1234368 1225260 1217567 1211243
61084 1211243 1206372 1203041 1200710 1198634 1197069 1197098 1199061 1202053 1205244 1208812 1213204 1218260 1223443 1228368
61070 1228368 1232815 1236792 1240711 1244879 1248874 1252058 1254576 1256853 1258240 1257413 1254326 1250527 1247109 1243548
61056 1243548 1239094 1234133 1229460 1225182 1221220 1218096 1216411 1216102 1216838 1218585 1221242 1224362 1227842 1232352
61042 1232352 1238538 1246238 1254843 1263898 1273128 1282556 1292870 1304916 1318569 1332853 1347352 1362488
61030 1362488 1378196 1393612 1408589 1424294 1441741 1460842 1481478 1504198 1529175 1555901 1584790
61019 1584790 1617691 1655731 1697946 1742979 1790662 1840777 1892091 1944435 2000525 2064137 2137763
61008 2137763 2223586 2324820 2443616 2578964 2729378 2897050 3087495 3306929 3563080 3867058
$$ packed form
61097A294869M334J59k792n018p220r088j0035j0310j0409j0122r108p693o324
61084A211243m871l331k331k076j565K9J963K992L191L568M392N056N183M925
61070A228368M447L977L919M168L995L184K518K277J387q27l087l799l418l561
61056A243548m454m961m673m278l962l124j685l09P36J747K657L120L480M510
61042A232352O186P700Q605R055R230R428J0314J2046J3653J4284J4499J5136
61030A362488J5708J5416J4977J5705J7447J9101K0636K2720K4977K6726K8889
61019A584790L2901L8040M2215M5033M7683N0115N1314N2344N6090O3612P3626
61008B137763Q5823J01234J18796J35348J50414J67672J90445K19434K56151L03978
$$ plain form
60998 3867058 4230422 4660701 5163048 5745423 6418699 7194320 8089392 9135353 10376768
60989 10376768 11863606 13651775 15796494 18294976 20984728 23500117 25391791 26365529
60981 26365529 26450866 25956240 25273377 24718327 24498035 24715576 25312329 25999011 26319442
60972 26319442 25872973 24533400 22484405 20067337 17595540 15267278 13177785 11358397
60964 11358397 9802078 8481532 7366579 6431937 5653892 5007844 4472050 4029800 3665911
60955 3665911 3364110 3109565 2891537 2702165 2534909 2385417 2251834 2132592 2025069
60946 2025069 1927188 1838617 1759350 1688499 1625377 1570036 1521361 1475917 1430103 1382713 1334500
60935 1334500 1286357 1239131 1194210 1152803 1115013 1080499 1049371 1021468 995534 970483 947068
$$ packed form
60998C867058L63364M30279N02347N82375O73276P75621Q95072J045961J241415
60989A0376768J486838J788169K144719K498482K689752K515389J891674R73738
60981B6365529Q5337m94626o82863n55050k20292K17541N96753O86682L20431
60972B6319442m46469j339573k048995k417068k471797k328262k089493j819388
60964A1358397j556319j320546j114953r34642p78045o46048n35794m42250l63889
60955C665911l01801k54545k18028j89372j67256j49492j33583j19242j07523
60946B025069r7881q8571p9267p0851o3122n5341m8675m5444m5814m7390m8213
60935A334500m8143m7226m4921m1407l7790l4514l1128k7903k5934k5051k3415
$$ plain form
60924 947068 927068 910926 897181 884116 871062 858209 846077 835299 826131 817959 809713 800857
60912 800857 791717 783019 775499 769750 765885 763328 761249 759117 756619 753322 748791 742924 735886 727994
60898 727994 719870 712308 705606 699323 692962 686520 680028 673053 665177 656638 648094 640079 633053 627442
60884 627442 623151 619475 616025 613222 611367 609838 607951 606003 604471 602691 599478 594883 590268 586653
60870 586653 583995 582101 581169 581115 581265 581138 580956 581149 581946 583585 586254 589583 592808 595712 598872 602728
60854 602728 606929 610864 614391 617807 621418 625227 628674 630700 630587 628847 626838 625496 624912 624997 625726
60839 625726 626529 626184 623738 619116 612711 604917 596203 587040 577502 567512 557645 549002 542044 536172 530773
60824 530773 525955 521849 517898 513487 508862 504853 501989 500180 498952 497676 495963 494098 492625 491336
$$ packed form
60924I47068k0000j6142j3745j3065j3054j2853j2132j0778r168q172q246q856
60912H00857r140q698p520n749l865k557k079k132k498l297m531n867p038p892
60898G27994q124p562o702o283o361o442o492o975p876q539q544q015p026n611
60884F27442m291l676l450k803j855j529j887j948j532j780l213m595m615l615
60870E86653k658j894r32n4J50j27j82J93P97J639K669L329L225K904L160L856
60854F02728M201L935L527L416L611L809L447K026j13j740k009j342n84Q5P29
60839F25726Q03l45k446m622o405p794q714r163r538r990r867q643o958n872n399
60824E30773m818m106l951m411m625m009k864j809j228j276j713j865j473j289
$$ plain form
60810 491336 489257 485975 482280 479054 476239 473492 471114 469552 468440 467059 465439 464201 463543 463193 463272
60795 463272 464335 466394 468540 469759 469825 469342 469209 469962 471322 472441 472911 473409 474988 477798 480859 482987
60779 482987 483595 482678 480514 477556 474447 471935 470610 470413 470386 469341 467065 464566 462917 462210 461911 461779
60763 461779 461939 462398 463048 464012 465429 466996 468068 468240 467622 466690 466116 466478 467808 469526 471039 472118
60747 472118 472613 472276 471260 470310 470002 470159 470399 470730 470986 470242 467685 463894 460381 457901 455961 453946
60731 453946 451943 450272 448873 447529 446300 445511 445558 446743 449022 451884 454753 457441 459930 461883 462834
60716 462834 462845 462582 462692 463375 464539 466020 467589 468881 469402 468730 467113 465802 466080 467623 468495 467312
60700 467312 464781 462449 460632 458530 455896 453385 451395 449649 448047 446958 446452 446042 445445 444883 444476
$$ packed form
60810D91336k079l282l695l226k815k747k378j562j112j381j620j238o58l50P9
60795D63272J063K059K146J219O6m83j33P53J360J119M70M98J579K810L061K128
60779D82987O08r17k164k958l109k512j325j97k7j045k276k499j649p07k99j32
60763D61779J60M59O50R64J417J567J072J72o18r32n74L62J330J718J513J079
60747D72118M95l37j016r50l08J57K40L31K56p44k557l791l513k480j940k015
60731D53946k003j671j399j344j229p89M7J185K279K862K869K688K489J953R51
60716D62834J1k63J10O83J164J481J569J292N21o72j617j311K78J543Q72j183
60700D67312k531k332j817k102k634k511j990j746j602j089n06m10n97n62m07
$$ plain form
60685 444476 443972 443347 443054 443442 444398 445690 447267 449086 451099 453429 456133 458839 461082 462924 464794
60670 464794 466902 469340 472389 475965 478966 480165 479603 478214 476248 473206 469324 465773 463120 460774
60656 460774 458352 456389 455214 454331 453570 453711 455141 456963 458345 459794 462058 464681 466836 468846 471467
60641 471467 474133 475381 474866 473635 472343 470446 467479 464008 460840 458091 455600 453627 452545 452256 452398
60626 452398 452871 453717 454681 455364 455774 456407 457604 458994 459715 459231 457883 456593 456092 456489 457520 458964 460758
60609 460758 462825 464853 466268 466557 465845 465016 464929 465533 466049 465986 465573 465250 465209 465581 466563 468111 469871 471680
60591 471680 473769 476280 478967 481658 484629 488191 492221 496397 500595 504728 508511 511726 514458 516707
60577 516707 518078 518255 517607 516913 516670 517067 518440 521215 525389 530509 536307 542990 550740 559213 567785
$$ packed form
60685D44476n04o25k93L88R56J292J577J819K013K330K704K706K243J842J870
60670D64794K108K438L049L576L001J199n62j389j966l042l882l551k653k346
60656D60774k422j963j175q83p61J41J430J822J382J449K264K623K155K010K621
60641D71467K666J248n15j231j292j897k967l471l168k749k491j973j082k89J42
60626D52398M73Q46R64O83M10O33J197J390P21m84j348j290n01L97J031J444J794
60609D60758K067K028J415K89p12q29q7O04N16o3m13l23m1L72R82J548J760J809
60591D71680K089K511K687K691K971L562M030M176M198M133L783L215K732K249
60577E16707J371J77o48o94k43L97J373K775M174N120N798O683P750Q473Q572
$$ plain form
60562 567785 576230 584990 594722 605652 617372 629174 640378 650381 658628 664717 668323 668956 666225
60549 666225 660768 654534 649484 645997 643084 640127 637767 637082 638553 642073 647337 653836 661005 668841
60535 668841 678126 689696 703749 720154 739130 761274 787010 816115 847558 879667 910603 938734
60523 938734 962441 979925 989853 992255 988219 978702 964173 945441 923982 901228 878193 856034
60511 856034 836155 819301 805243 793721 784961 778825 774371 771031 769591 771172 775812 782900 792547
60498 792547 805532 822118 841879 864700 891233 922351 958656 1000314 1046683 1096114 1146728
60487 1146728 1197305 1246855 1293542 1334843 1368990 1395863 1416621 1433118 1447609 1462115 1477532
60476 1477532 1493456 1508706 1521337 1528142 1525108 1509143 1479301 1436346 1381756 1317743 1247801 1176277
$$ packed form
60562E67785Q445Q760R732J0930J1720J1802J1204J0003Q247O089L606O33k731
60549F66225n457o234n050l487k913k957k360o85J471L520N264O499P169P836
60535F68841R285J1570J4053J6405J8976K2144K5736K9105L1443L2109L0936K8131
60523I38734K3707J7484R928K402m036r517j4529j8732k1459k2754k3035k2159
60511H56034j9879j6854j4058j1522q760o136m454l340j440J581M640P088R647
60498G92547J2985J6586J9761K2821K6533L1118L6305M1658M6369M9431N0614
60487A146728N0577M9550M6687M1301L4147K6873K0758J6497J4491J4506J5417
60476A477532J5924J5250J2631O805l034j5965k9842m2955n4590o4013o9942p1524
$$ plain form
60464 1176277 1106936 1042010 982491 928856 881217 839135 801876 768978 740240 715086 692440
60453 692440 671600 652864 636786 623081 610814 599508 589420 580783 573495 567594 563335 560541
60441 560541 558537 556943 555902 555320 554569 553358 552220 551676 551440 550919 549903 548265 545575 541654 537159
60426 537159 533096 530077 528374 528119 528845 529416 529134 528658 529181 530952 533085 534507 534680 533821 532947 533269 534985
60409 534985 537107 538879 540722 543157 545622 547292 548419 549789 551345 552563 553823 556117 559519 563173
60395 563173 566798 570979 575764 580154 583399 585874 588309 590954 593844 597110 600653 604225 608099 612920
60381 612920 618535 623720 627537 630388 633262 636450 639478 641914 643753 645262 646736 648288 649744 650979
60367 650979 652288 653987 655716 656796 657348 658365 660386 662772 664677 666168 667899 670208 673079 676587
$$ packed form
60464A176277o9341o4926n9519n3635m7639m2082l7259l2898k8738k5154k2646
60453F92440k0840j8736j6078j3705j2267j1306j0088q637p288n901m259k794
60441E60541k004j594j041n82p51j211j138n44k36n21j016j638k690l921m495
60426E37159m063l019j703k55P26N71k82m76N23J771K133J422J73q59q74L22J716
60409E34985K122J772J843K435K465J670J127J370J556J218J260K294L402L654
60395E63173L625M181M785M390L245K475K435K645K890L266L543L572L874M821
60381F12920N615N185L817K851K874L188L028K436J839J509J474J552J456J235
60367F50979J309J699J729J080N52J017K021K386J905J491J731K309K871L508
$$ plain form
60353 676587 680738 685036 688821 692111 695721 700550 707001 715020 724265 733985 742949 749888 754206 756200
60339 756200 756438 754943 751255 745339 738098 730728 723758 716942 709935 702765 695788 689450 683972 679075
60325 679075 674135 668829 663437 658341 653530 648850 644437 640527 637119 634205 632071 630999 630983 632083 634694
60310 634694 639005 644596 651134 659020 668722 679852 691675 704182 717709 731686 744817 756647
60298 756647 768157 780578 794202 808307 821513 832127 838875 841458 839861 833274 820678 802677
60286 802677 781844 760880 741124 723118 707586 695065 685082 676460 668359 660675 653604 647123 640800
60273 640800 634063 626864 620041 614584 610535 607029 603419 599844 596608 593612 590635 587676 584760 581801
60259 581801 578876 576336 574470 573374 573121 573602 574168 574010 573094 572265 572319 573402 575383 578199 581570 584875
$$ packed form
60353F76587M151M298L785L290L610M829O451Q019R245R720Q964O939M318J994
60339G56200K38j495l688n916p241p370o970o816p007p170o977o338n478m897
60325F79075m940n306n392n096m811m680m413l910l408k914k134j072j6J100K611
60310F34694M311N591O538P886R702J1130J1823J2507J3527J3977J3131J1830
60298G56647J1510J2421J3624J4105J3206J0614O748K583j597o587j2596j8001
60286H02677k0833k0964j9756j8006j5532j2521r983q622q101p684p071o481o323
60273F40800o737p199o823n457m049l506l610l575l236k996k977k959k916k959
60259E81801k925k540j866j096k53M81N66j58r16q29N4J083J981K816L371L305
$$ plain form
60243 584875 587608 589684 591184 592169 592823 593351 593678 593665 593697 594508 596316 598593 600765 602699 604436 606091
60227 606091 608207 611636 616814 623527 631415 640218 649423 658287 666435 674025 681280 688314 695451 703085
60213 703085 711227 719783 729264 740380 752833 765299 776852 787668 798168 808336 818215 828190
60201 828190 838264 847771 856256 864022 871365 877947 883290 887264 889710 890416 889925 889499 889574 888964 886382
60186 886382 882137 877486 872858 867638 861497 854944 848589 842525 836570 830659 824971 819904 815833 812698
60172 812698 810076 807795 806149 805255 804674 803958 803163 802425 801396 799458 796232 791640 785964 780150 775531
60157 775531 772727 771089 769572 767803 766013 764467 763411 763132 763587 764376 765461 767431 770566 774093 777004
60142 777004 779242 781445 783849 786107 788067 790056 792416 795237 798571 802596 807469 813202 819626 826420
$$ packed form
60243E84875K733K076J500R85O54N28L27j3L2Q11J808K277K172J934J737J655
60227F06091K116L429N178O713P888Q803R205Q864Q148P590P255P034P137P634
60213G03085Q142Q556R481J1116J2453J2466J1553J0816J0500J0168R879R975
60201H28190J0074R507Q485P766P343O582N343L974K446P06m91m26P5o10k582
60186H86382m245m651m628n220o141o553o355o064n955n911n688n067m071l135
60172H12698k622k281j646q94n81p16p95p38j029j938l226m592n676n814m619
60157G75531k804j638j517j769j790j546j056k79M55P89J085J970L135L527K911
60142G77004K238K203K404K258J960J989K360K821L334M025M873N733O424O794
$$ plain form
60128 826420 833332 840382 847505 853989 858811 861666 863253 864391 865439 866739 868873 872015 875628 879282
60114 879282 883299 888108 893461 898847 904266 910042 916170 922305 928142 933452 938082 942165 945924 949074
60100 949074 951020 951915 952766 953958 954435 953079 950287 947326 944639 941711 938293 934757 931238 927185 921930
60085 921930 915319 907770 900011 892623 885610 878644 871834 865717 860201 854215 846981 839040 831325 823720
60071 823720 815355 806058 796700 788141 780432 772949 764952 756196 747374 739672 733474 727912 722059 716085
60057 716085 710735 706205 702258 698982 696633 694980 693564 692433 691994 692332 693278 694971 697723 701457 705756
60042 705756 710329 715066 719926 725184 731322 738138 744347 748650 750893 751672 751322 749922 747792 745217 742064
60027 742064 738376 734925 732304 729851 726268 721057 714614 707266 699173 690885 683024 675481 667718 659781
$$ packed form
60128H26420O912P050P123O484M822K855J587J138J048J300K134L142L613L654
60114H79282M017M809N353N386N419N776O128O135N837N310M630M083L759L150
60100I49074J946Q95Q51J192M77j356k792k961k687k928l418l536l519m053n255
60085I21930o611p549p759p388p013o966o810o117n516n986p234p941p715p605
60071H23720q365r297r358q559p709p483p997q756q822p702o198n562n853n974
60057G16085n350m530l947l276k349j653j416j131m39L38R46J693K752L734M299
60042G05756M573M737M860N258O138O816O209M303K243P79l50j400k130k575l153
60027G42064l688l451k621k453l583n211o443p348q093q288p861p543p763p937
$$ plain form
60013 659781 652273 645485 639336 633964 629592 625933 622467 619221 616568 614501 612837 611825 611677 611769 611362
59998 611362 610899 611531 613413 615492 617024 618284 619672 621152 622820 625162 628482 632763 638179 644936 652468
59983 652468 659575 665573 670675 675212 679218 682758 685762 687412 686654 683632 679812 676432 673503 670563
59969 670563 667542 664499 661280 657897 654740 652020 649503 647149 645583 645693 648045 652723 659191 666191
59955 666191 672365 677225 681099 684089 685632 685294 683460 681007 678648 676728 675285 674223 673621 673714 674214
59940 674214 674012 672206 669253 666482 664716 664036 664590 666624 669753 673187 676877 681611 687850 695216 703230
59925 703230 711701 720244 728281 735737 742900 749346 753798 755498 755159 754321 754344 756087 759822 765139 771428
59910 771428 778542 786397 794083 800261 804546 807567 809551 809938 808660 806631 804331 800875 795273 787979
$$ packed form
60013F59781p508o788o149n372m372l659l466l246k653k067j664j012j48R2m07
59998F11362m63O32J882K079J532J260J388J480J668K342L320M281N416O757P532
59983F52468P107N998N102M537M006L540L004J650p58l022l820l380k929k940
59969F70563l021l043l219l383l157k720k517k354j566J10K352M678O468P000
59955F66191O174M860L874K990J543l38j834k453k359j920j443j062o02R3N00
59940F74214k02j806k953k771j766o80N54K034L129L434L690M734O239P366Q014
59925G03230Q471Q543Q037P456P163O446M452J700l39q38K3J743L735N317O289
59910G71428P114P855P686O178M285L021J984L87j278k029k300l456n602p294
$$ plain form
59896 787979 780532 774173 769304 765760 763032 760708 759165 759450 762097 766481 771660 777316 783518 790070
59882 790070 796640 803244 810268 818214 827513 838204 849619 860826 871431 881597 891368 900552 909069
59869 909069 916647 922286 925033 925404 924988 924412 922837 919750 916068 912779 909570 905628 900989 896266 891736
59854 891736 887485 883875 881014 878189 874523 869859 864494 858549 852173 845936 840469 836117 833401 833170
59840 833170 835702 840224 846014 853467 863229 874587 885431 893683 898392 899901 899724 900063 902743 908444
59826 908444 916975 927669 938996 948286 952819 951500 945381 936727 927678 919355 911808 904944 899516 896705
59812 896705 896626 897845 898665 898274 896487 893229 888882 884412 880458 876734 872786 868736 864706 860219 854899
59797 854899 849140 843347 837129 830103 822936 816561 810806 804826 798594 792859 787746 782501 776729 770853
$$ packed form
59896G87979p447o359m869l544k728k324j543K85K647M384N179N656O202O552
59882G90070O570O604P024P946R299J0691J1415J1207J0605J0166R771R184Q517
59869I09069P578N639K747L71m16n76j575l087l682l289l209l942m639m723m530
59854H91736m251l610k861k825l666m664n365n945o376o237n467m352k716k31
59840H33170K532M522N790P453R762J1358J0844Q252M709J509j77L39K680N701
59826I08444Q531J0694J1327R290M533j319o119q654r049q323p547o864n428k811
59812H96705p9J219Q20l91j787l258m347m470l954l724l948m050m030m487n320
59797H54899n759n793o218p026p167o375n755n980o232n735n113n245n772n876
$$ plain form
59783 770853 765212 759593 754000 749060 745259 742389 740127 738682 738435 739357 741250 744301 748944 755217 762550
59768 762550 770225 777843 785336 792735 800160 808042 817016 827321 838412 849474 860293 871267 882646
59755 882646 894257 906144 918945 933200 948507 963621 977328 989153 999422 1008722 1017108 1023818
59743 1023818 1028049 1029958 1030503 1030338 1029354 1027324 1024367 1020601 1015955 1010664 1005433 1000735 996359 991974 987785
59728 987785 984329 981976 980827 980693 980953 980848 980248 979824 980227 981483 983320 985631 988361 991383 994652 998063
59712 998063 1001085 1003176 1004819 1007508 1012297 1018858 1026238 1033995 1042276 1051357 1061547 1073117 1085879
59699 1085879 1099184 1112483 1125527 1137935 1149277 1159757 1170121 1180680 1191149 1201586 1212407
59688 1212407 1222923 1230916 1234438 1233412 1228922 1221856 1213087 1204008 1195620 1187368 1177869 1166619 1154286
$$ packed form
59783G70853n641n619n593m940l801k870k262j445k47R22J893L051M643O273P333
59768G62550P675P618P493P399P425P882Q974J0305J1091J1062J0819J0974J1379
59755H82646J1611J1887J2801J4255J5307J5114J3707J1825J0269R300Q386O710
59743A023818M231J909N45j65r84k030k957l766m646n291n231m698m376m385m189
59728I87785l456k353j149j34K60j05o00m24M03J256J837K311K730L022L269L411
59712I98063L022K091J643K689M789O561P380P757Q281R081J0190J1570J2762
59699A085879J3305J3299J3044J2408J1342J0480J0364J0559J0469J0437J0821
59688A212407J0516P993L522j026m490p066q769r079q388q252r499j1250j2333
$$ plain form
59675 1154286 1141615 1128805 1115779 1102414 1088657 1074936 1062382 1052180 1044807 1039974 1036918 1034629
59663 1034629 1032510 1031226 1032268 1036281 1042503 1050117 1059203 1069820 1081170 1092513 1104000 1115625 1126275
59650 1126275 1135021 1142631 1150417 1157859 1162596 1162637 1157592 1147913 1134070 1116573 1095965 1072734 1047819
59637 1047819 1022987 999923 979020 959694 941742 925715 912081 900703 891067 882495 874305 866187
59625 866187 858204 850010 840544 829047 815938 802188 788411 775120 763180 753070 744251 736115
59613 736115 729010 723437 718832 714279 709912 706487 703930 701589 699627 698911 699558 700765 702054 703578 705154
59598 705154 706101 706284 706408 707055 708166 709500 710926 712285 713609 715317 717440 719027 719235 718761 719024 720063
59582 720063 720403 719046 716403 713130 709288 705015 700935 697312 693566 689109 684076 678909 673849 669077
$$ packed form
59675A154286j2671j2810j3026j3365j3757j3721j2554j0202p373m833l056k289
59663A034629k119j284J042M013O222P614R086J0617J1350J1343J1487J1625J0650
59650A126275Q746P610P786P442M737M1n045r679j3843j7497k0608k3231k4915
59637A047819k4832k3064k0903j9326j7952j6027j3634j1378r636q572q190q118
59625H66187p983q194r466j1497j3109j3750j3777j3291j1940j0110q819q136
59613G36115p105n573m605m553m367l425k557k341j962p16O47J207J289J524J576
59598G05154R47J83J24O47J111J334J426J359J324J708K123J587K08m74K63J039
59582G20063L40j357k643l273l842m273m080l623l746m457n033n167n060m772
$$ plain form
59568 669077 664844 661193 658009 655390 653482 652022 650643 649575 649336 649758 650087 650080 650259 650991 652066 653266
59552 653266 654626 656035 657329 658948 661803 666255 671759 677592 683394 689020 694535 700419 707207 714901
59538 714901 723295 732792 744283 758512 776353 799279 827873 859191 886660 903799 908416 903470
59526 903470 894412 885666 878796 873293 868719 865644 864375 863673 861687 857804 852667 846742 839886 832129
59512 832129 823690 814215 803196 791269 780067 770452 761757 753036 744227 735885 728508 722338 717164
59499 717164 712301 707481 703664 702093 702615 703954 705600 708237 712145 716447 720422 724492 729398 735251
59485 735251 741922 749464 757557 765226 771669 776930 781430 785392 788951 792242 795179 797741 800519 804229
59471 804229 808632 812740 816141 819129 821445 822043 820514 817700 814495 811050 807630 805192 804362 804686 805615
$$ packed form
59568F69077m233l651l184k619j908j460j379j068k39M22L29pJ79P32J075J200
59552F53266J360J409J294J619K855M452N504N833N802N626N515N884O788P694
59538G14901Q394R497J1491J4229J7841K2926K8594L1318K7469J7139M617m946
59526I03470r058q746o870n503m574l075j269p02j986l883n137n925o856p757
59512H32129q439r475j1019j1927j1202r615q695q721q809q342p377o170n174
59499G17164m863m820l817j571N22J339J646K637L908M302L975M070M906N853
59485G35251O671P542Q093P669O443N261M500L962L559L291K937K562K778L710
59471H04229M403M108L401K988K316N98j529k814l205l445l420k438q30L24R29
$$ plain form
59456 805615 807618 811640 817994 826271 835703 845160 853450 860251 866339 872449 878421 883733 888159 891392
59442 891392 892717 891622 888376 883551 877463 870428 863053 855853 849043 842984 838366 835602 834416 834151
59428 834151 834040 833221 831387 829619 829820 832986 838635 845999 854873 865119 876448 889137 903942 920736
59414 920736 938248 955750 974037 994078 1015925 1040018 1068247 1101624 1136736 1166006 1182320
59403 1182320 1183423 1172432 1155275 1137779 1123924 1115455 1112798 1116596 1128289 1148430 1173660 1195727
59391 1195727 1205131 1197252 1175142 1146157 1116405 1088725 1064307 1043853 1026930 1012033 998282 986247
59379 986247 976710 969537 964158 960286 957656 955892 955045 955471 956797 957899 958344 959028 960837 963444 965945
59364 965945 968014 969947 972243 975588 980588 987112 994522 1002783 1012525 1023715 1035335 1046942 1059607
$$ packed form
59456H05615K003M022O354Q277R432R457Q290O801O088O110N972N312M426L233
59442H91392J325j095l246m825o088p035p375p200o810o059m618k764j186k65
59428H34151j11q19j834j768K01L166N649P364Q874J0246J1329J2689J4805J6794
59414I20736J7512J7502J8287K0041K1847K4093K8229L3377L5112K9270J6314
59403A182320J103j0991j7157j7496j3855q469k657L798J1693K0141K5230K2067
59391A195727R404p879k2110k8985k9752k7680k4418k0454j6923j4897j3751j2035
59379I86247r537p173n379l872k630j764q47M26J326J102M45O84J809K607K501
59364I65945K069J933K296L345N000O524P410Q261R742J1190J1620J1607J2665
$$ plain form
59351 1059607 1074588 1091830 1110469 1130122 1150867 1172480 1194435 1216372 1238059 1259210 1279630
59340 1279630 1299021 1316422 1330395 1340084 1345530 1346869 1344054 1337567 1328426 1317026 1302787 1285429
59328 1285429 1265766 1244865 1223274 1201508 1180339 1160000 1139928 1119830 1100190 1081208 1062172
59317 1062172 1042545 1022910 1004219 986862 970977 956799 944030 931699 919314 907447 896670
59306 896670 886761 877513 869344 862449 856279 850598 846090 843160 841088 839307 838613 840117 843739 848692
59292 848692 854881 862982 873797 888301 907399 930357 953735 972805 983991 985995 979717 968037
59280 968037 954876 943267 934374 928511 926206 927761 932832 941222 953115 967788 983183 997844 1012292
59267 1012292 1027431 1042596 1056406 1068678 1080072 1090391 1098579 1103999 1106644 1106496 1103764 1099399 1094444
$$ packed form
59351A059607J4981J7242J8639J9653K0745K1613K1955K1937K1687K1151K0420
59340A279630J9391J7401J3973R689N446J339k815o487r141j1400j4239j7358
59328A285429j9663k0901k1591k1766k1169k0339k0072k0098j9640j8982j9036
59317A062172j9627j9635j8691j7357j5885j4178j2769j2331j2385j1867j0777
59306H96670r909r248q169o895o170n681m508k930k072j781o94J504L622M953
59292H48692O189Q101J0815J4504J9098K2958K3378J9070J1186K004o278j1680
59280I68037j3161j1609q893n863k305J555N071Q390J1893J4673J5395J4661J4448
59267A012292J5139J5165J3810J2272J1394J0319Q188N420K645j48k732m365m955
$$ plain form
59254 1094444 1089262 1084048 1079353 1075187 1070494 1064672 1058867 1054541 1051417 1048168 1044547 1041515 1039634 1038659
59240 1038659 1038435 1038927 1039572 1039619 1038879 1037211 1033775 1027969 1020677 1013397 1006391 998827 990398 981605 972608
59225 972608 962964 952469 941303 929474 917055 904766 893479 883413 874586 867598 862927 859810
59213 859810 856878 853753 851081 849305 848332 848142 848763 849822 850974 852485 854737 857605 861106 865983 872613
59198 872613 879982 886827 893276 900192 907457 914272 920727 927683 935231 942601 949538 956598 964004 971109
59184 971109 977021 981076 983013 983430 983567 983784 982755 978994 972578 964447 954941 944300 933764 924560
59170 924560 916291 907927 899956 893934 890117 887138 883928 880516 877060 873589 870614 868568 866650 863563
59156 863563 859316 854876 850239 844411 837386 830579 825014 820424 816297 812448 808318 803025 796459 789330
$$ packed form
59254A094444n182n214m695m166m693n822n805m326l124l249l621l032j881r75
59240A038659k24M92O45M7p40j668l436n806p292p280p006p564q429q793q997
59225I72608r644j0495j1166j1829j2419j2289j1287j0066q827o988m671l117
59213H59810k932l125k672j776r73j90O21J059J152J511K252K868L501M877O630
59198H72613P369O845O449O916P265O815O455O956P548P370O937P060P406P105
59184I71109N912M055J937M17J37K17j029l761o416q131r506j0641j0536r204
59170I24560q269q364p971o022l817k979l210l412l456l471k975k046j918l087
59156H63563m247m440m637n828p025o807n565m590m127l849m130n293o566p129
$$ plain form
59142 789330 781969 774181 766286 759037 752430 745782 739136 733355 728662 724372 720335 717432 716253 716345 717152
59127 717152 718855 721958 726726 733113 740602 748275 755797 764048 773871 784624 795079 805320 816404
59114 816404 828425 840421 852100 864160 876850 889546 901861 913815 924858 934071 941483 947930
59102 947930 953559 957742 960479 962469 963639 962976 960116 955862 950957 945553 940035 935071 930656 926319
59088 926319 922427 919997 919040 918329 917064 915559 914086 912145 909080 904473 898013 890042 881947 874758 867692
59073 867692 859503 850865 843666 838236 833210 827995 823237 818710 813081 806283 800028 795130 790251 784123
59059 784123 777294 770750 764447 758181 752504 747824 743812 740420 738182 736891 735318 732973 730824 729645
59045 729645 729006 728562 728921 730427 732349 734012 735572 737114 738277 739335 741248 744053 746674 748986 752496
$$ packed form
59142G89330p361p788p895p249o607o648o646n781m693m290m037k903j179R2Q07
59127G17152J703L103M768O387P489P673P522Q251R823J0753J0455J0241J1084
59114H16404J2021J1996J1679J2060J2690J2696J2315J1954J1043R213P412O447
59102I47930N629M183K737J990J170o63k860m254m905n404n518m964m415m337
59088I26319l892k430r57p11j265j505j473j941l065m607o460p971q095p189p066
59073H67692q189q638p199n430n026n215m758m527n629o798o255m898m879o128
59059G84123o829o544o303o266n677m680m012l392k238j291j573k345k149j179
59045G29645o39m44L59J506J922J663J560J542J163J058J913K805K621K312L510
$$ plain form
59030 752496 758103 764695 770978 777375 785101 794540 805528 818116 832109 846900 862465 879374 897039
59017 897039 913193 925971 935385 941991 945477 945534 942918 938566 932660 925475 918181 911880 906728 902683
59003 902683 900169 899302 899530 900674 903223 906991 910704 913595 916211 918919 920918 921490 920910 919347 916236
58988 916236 911640 906863 902695 898339 893094 887831 883739 880830 878834 878450 880505 884809 890825 898529
58974 898529 907750 917745 928345 940441 954393 969052 983208 996859 1010256 1022981 1034886 1046565
58962 1046565 1057899 1067502 1074667 1080355 1085093 1087470 1086171 1082018 1076344 1068619 1057544 1043474 1027956
58949 1027956 1011605 994210 976338 959192 943189 928058 913985 901482 890486 880629 872012 864846
58937 864846 858928 854282 851627 851368 852799 855025 857776 860555 862080 861611 859944 858230 856718 855377 854546
$$ packed form
59030G52496N607O592O283O397P726R439J0988J2588J3993J4791J5565J6909J7665
59017H97039J6154J2778R414O606L486N7k616m352n906p185p294o301n152m045
59003I02683k514q67K28J144K549L768L713K891K616K708J999N72n80j563l111
58988I16236m596m777m168m356n245n263m092k909j996l84K055M304O016P704
58974H98529R221R995J0600J2096J3952J4659J4156J3651J3397J2725J1905J1679
58962A046565J1334R603P165N688M738K377j299m153n674p725j1075j4070j5518
58949A027956j6351j7395j7872j7146j6003j5131j4073j2503j0996r857q617p166
58937H64846n918m646k655k59J431K226K751K779J525m69j667j714j512j341q31
$$ plain form
58922 854546 853988 852583 850008 847491 845899 844437 842436 840912 840906 841715 842425 843864 847227 851840 856261 860764
58906 860764 866907 875221 884963 895560 906755 918003 929268 941868 957029 974157 991865 1009997
58894 1009997 1029096 1048572 1066946 1083500 1098369 1111686 1124036 1137152 1152662 1170507 1189633
58883 1189633 1209462 1229411 1247865 1263262 1275635 1285792 1293714 1299110 1302677 1305214 1306208 1304795 1301399
58870 1301399 1296878 1290868 1282713 1273269 1263954 1254558 1243867 1231956 1220023 1208260 1195761 1182374
58858 1182374 1168897 1155405 1141034 1125500 1109566 1093933 1078866 1064722 1051753 1039584 1027879
58847 1027879 1017075 1007374 997558 986023 972560 958011 942832 927248 912125 898248 885205 872278
58835 872278 859886 848910 839253 830390 822679 816705 811996 807788 804353 802164 800585 798917 797937 798702
$$ packed form
58922H54546n58j405k575k517j592j462k001j524oQ09P10J439L363M613M421M503
58906H60764O143Q314R742J0597J1195J1248J1265J2600J5161J7128J7708J8132
58894A009997J9099J9476J8374J6554J4869J3317J2350J3116J5510J7845J9126
58883A189633J9829J9949J8454J5397J2373J0157P922N396L567K537R94j413l396
58870A301399m521o010q155r444r315r396j0691j1911j1933j1763j2499j3387
58858A182374j3477j3492j4371j5534j5934j5633j5067j4144j2969j2169j1705
58847A027879j0804r701r816j1535j3463j4549j5179j5584j5123j3877j3043j2927
58835H72278j2392j0976r657q863p711n974m709m208l435k189j579j668r80P65
$$ plain form
58821 798702 800593 802318 804159 807372 811949 816781 821545 826536 831204 834770 837954 842151 847104 851198
58807 851198 853822 855731 857298 858153 858319 858032 856676 853518 849192 844924 840673 835704 830477 826142 822532
58792 822532 818519 814087 810214 807101 804432 803123 804781 809457 815753 822991 831533 841143 851032 861421
58778 861421 873200 885989 898342 909814 921021 931680 940380 946308 949504 949486 945421 937678 927550
58765 927550 915500 901372 886174 871767 858771 846497 834853 824549 815542 807175 799858 794753
58753 794753 791648 788910 785613 782153 778804 775372 772235 770055 768567 767221 766712 768124 770986 774140
58739 774140 778087 784256 792134 799465 805334 810905 817019 823221 829299 835642 841862 847024 851375 855889
58725 855889 860132 862701 863713 864607 865537 865403 864641 865392 868452 872462 876631 881849 888423 895043 900844
$$ packed form
58821G98702J891J725J841L213M577M832M764M991M668L566L184M197M953M094
58807H51198K624J909J567Q55J66k87j356l158m326m268m251m969n227m335l610
58792H22532m013m432l873l113k669j309J658M676O296P238Q542R610R889J0389
58778H61421J1779J2789J2353J1472J1207J0659Q700N928L196j8m065p743j0128
58765I27550j2050j4128j5198j4407j2996j2274j1644j0304r007q367p317n105
58753G94753l105k738l297l460l349l432l137k180j488j346n09J412K862L154
58739G74140L947O169P878P331N869N571O114O202O078O343O220N162M351M514
58725H55889M243K569J012Q94R30j34p62P51L060M010M169N218O574O620N801
$$ plain form
58710 900844 906436 912015 916345 918341 917945 914851 908237 898303 886335 872700 856554 837935 818350
58697 818350 798909 779682 761124 744175 728656 713616 699559 688160 679461 671624 663985 657903
58685 657903 653849 650000 644817 638996 633815 629315 625099 621305 617998 614969 612705 612079 612777 613617 614590
58670 614590 616741 619964 622980 625744 629738 635542 642273 649760 658960 669716 680252 689303 696572 700850
58656 700850 700283 695149 687978 680289 671585 661984 653103 645430 637495 628715 620674 614518 609440 604765
58642 604765 601225 599031 596931 594245 591811 590096 588536 587473 588342 591042 593551 595035 596842 599536
58628 599536 601574 601984 601778 601550 600347 598173 596949 597572 598480 598526 598788 600186 601842 603295 605799 609883
58612 609883 614126 617926 622962 630192 637809 643936 649061 654114 658481 661695 664870 668662 671952 674135
$$ packed form
58710I00844N592N579M330J996l96l094o614r934j1968j3635j6146j8619j9585
58697H18350j9441j9227j8558j6949j5519j5040j4057j1399q699p837p639o082
58685F57903m054l849n183n821n181m500m216l794l307l029k264o26O98Q40R73
58670F14590K151L223L016K764L994N804O731P487R200J0756J0536R051P269M278
58656G00850n67n134p171p689q704r601q881p673p935q780q041o156n078m675
58642F04765l540k194k100k686k434j715j560j063Q69K700K509J484J807K694
58628E99536K038M10k06k28j203k174j224O23R08M6K62J398J656J453K504M084
58612F09883M243L800N036P230P617O127N125N053M367L214L175L792L290K183
$$ plain form
58598 674135 676443 679431 681567 682045 682492 684070 685466 685789 686960 690887 696529 702124 708264 716426 726332
58583 726332 737061 748986 762434 776131 789064 802169 816184 829591 840743 850300 859551 868072
58571 868072 875099 881636 889220 898082 908303 921144 937519 956756 978358 1003213 1031521 1061517
58559 1061517 1091731 1122316 1152504 1179134 1199587 1213971 1222671 1224461 1219277 1210378 1201119 1191640
58547 1191640 1181073 1170747 1162481 1155598 1148276 1140224 1131614 1121036 1106831 1089004 1067928 1043074
58535 1043074 1015021 986594 959855 933985 908228 884551 864997 848675 833961 821460 812127
58524 812127 804557 796942 789742 783816 777936 770964 764467 760323 757619 754685 752312 751962 752627 752382 751453
58509 751453 750977 750473 749307 748868 750415 752489 753285 753795 755784 758495 760364 762178 765385 768886 770628
$$ packed form
58598F74135K308K988K136M78M47J578J396L23J171L927N642N595O140Q162R906
58583G26332J0729J1925J3448J3697J2933J3105J4015J3407J1152R557R251Q521
58571H68072P027O537P584Q862J0221J2841J6375J9237K1602K4855K8308K9996
58559A061517L0214L0585L0188K6630K0453J4384Q700J790n184q899r259r479
58547A191640j0567j0326q266o883p322q052q610j0578j4205j7827k1076k4854
58535A043074k8053k8427k6739k5870k5757k3677j9554j6322j4714j2501r333
58524H12127p570p615p200n926n880o972o497m144k704k934k373l50O65k45r29
58509G51453m76n04j166m39J547K074P96N10J989K711J869J814L207L501J742
$$ plain form
58494 770628 770975 771701 773160 775163 778894 785113 792193 798737 806290 816622 828382 839534 851070 865099
58480 865099 881198 897937 916093 936902 958886 979716 999349 1017984 1032911 1041090 1043157 1041398
58468 1041398 1035682 1025140 1011929 999328 987562 975367 964160 956715 953050 951367 951728 955167 960729
58455 960729 967192 976255 990127 1007331 1024545 1040933 1056733 1069388 1075435 1074922 1069920 1060150 1044418
58442 1044418 1024942 1005804 988167 971104 955798 944424 936147 928667 922662 920342 920783 921272 922206
58429 922206 926062 932544 939373 946939 957451 970206 982413 993991 1006896 1020259 1030694 1036894
58417 1036894 1039630 1038155 1031268 1021198 1011737 1003058 992831 981536 971913 963929 955217 945971 938594
58404 938594 933071 927485 922451 920191 919896 918998 918400 921329 927526 933692 939196 946161 954360 961333 967223
$$ packed form
58494G70628L47P26J459K003L731O219P080O544P553J0332J1760J1152J1536J4029
58480H65099J6099J6739J8156K0809K1984K0830J9633J8635J4927Q179K067j759
58468A041398n716j0542j3211j2601j1766j2195j1207p445l665j683L61L439N562
58455I60729O463R063J3872J7204J7214J6388J5800J2655O047n13n002r770j5732
58442A044418j9476j9138j7637j7063j5306j1374q277p480o005k320M41M89R34
58429I22206L856O482O829P566J0512J2755J2207J1578J2905J3363J0435O200
58417A036894K736j475o887j0070r461q679j0227j1295r623p984q712r246p377
58404I38594n523n586n034k260k95q98n98K929O197O166N504O965Q199O973N890
$$ plain form
58389 967223 974246 981647 986493 989126 992577 996908 999652 1001469 1005687 1012315 1018175 1022931 1029248 1036947
58375 1036947 1042868 1046856 1052153 1059466 1066227 1072163 1079985 1090116 1100197 1110242 1122822 1137819 1152457
58362 1152457 1166699 1183029 1200799 1216552 1230136 1244601 1259841 1272364 1281657 1290599 1299199 1304166
58350 1304166 1305334 1306396 1308684 1310249 1311473 1315278 1321286 1326116 1330057 1337083 1347809 1358943 1370146
58337 1370146 1384592 1402201 1419356 1436096 1456487 1480852 1504651 1526009 1547318 1568476 1585897
58326 1585897 1599401 1612715 1625919 1634793 1638948 1643106 1648988 1653497 1656332 1661597 1670218 1678477 1685773
58313 1685773 1696106 1710222 1724166 1737327 1753885 1774475 1794580 1813014 1833834 1857923 1881082
58302 1881082 1902436 1926210 1953074 1978341 2000799 2024594 2050331 2073459 2093690 2116665 2143873
$$ packed form
58389I67223P023P401M846K633L451M331K744J817M218O628N860M756O317P699
58375A036947N921L988N297P313O761N936P822J0131J0081J0045J2580J4997J4638
58362A152457J4242J6330J7770J5753J3584J4465J5240J2523R293Q942Q600M967
58350A304166J168J062K288J565J224L805O008M830L941P026J0726J1134J1203
58337A370146J4446J7609J7155J6740K0391K4365K3799K1358K1309K1158J7421
58326A585897J3504J3314J3204Q874M155M158N882M509K835N265Q621Q259P296
58313A685773J0333J4116J3944J3161J6558K0590K0105J8434K0820K4089K3159
58302A881082K1354K3774K6864K5267K2458K3795K5737K3128K0231K2975K7208
$$ plain form
58291 2143873 2170381 2194961 2222647 2254576 2285446 2314051 2346077 2383211 2419845 2454053 2491300
58280 2491300 2533527 2575207 2614290 2656384 2703871 2751471 2796867 2845079 2898098 2951120 3003286
58269 3003286 3060880 3125408 3190060 3252504 3319414 3393597 3468925 3542997 3622161 3708528 3794770
58258 3794770 3877513 3962925 4053233 4141055 4223298 4307192 4396288 4484470 4570294 4662654 4765193
58247 4765193 4870006 4974108 5086826 5213085 5345147 5479135 5623567 5782844 5948800
58238 5948800 6117714 6298734 6496043 6700320 6907734 7129128 7370044 7620674 7876737
58229 7876737 8150648 8450248 8766741 9096022 9450797 9838507 10249157 10678811 11142330
58220 11142330 11648621 12187533 12756560 13374985 14055271 14787713 15571133 16430328 17384383
$$ packed form
58291B143873K6508K4580K7686L1929L0870K8605L2026L7134L6634L4208L7247
58280B491300M2227M1680L9083M2094M7487M7600M5396M8212N3019N3022N2166
58269C003286N7594O4528O4652O2444O6910P4183P5328P4072P9164Q6367Q6242
58258C794770Q2743Q5412R0308Q7822Q2243Q3894Q9096Q8182Q5824R2360J02539
58247D765193J04813J04102J12718J26259J32062J33988J44432J59277J65956
58238E948800J68914J81020J97309K04277K07414K21394K40916K50630K56063
58229G876737K73911K99600L16493L29281L54775L87710M10650M29654M63519
58220A1142330N06291N38912N69027O18425O80286P32442P83420Q59195R54055
$$ plain form
58211 17384383 18428546 19568340 20839552 22272819 23874012 25664851 27706913 30061579
58203 30061579 32770516 35908622 39614488 44036507 49293531 55515528 62859332 71442161
58195 71442161 81328762 92641434 105626520 120585793 137862061 157979863 181704816
58188 181704816 209892812 243362706 282713727 327362803 373726631 414342199 440044566
58181 440044566 444555537 427864316 395563893 355190383 312957559 272769432 236714666
58174 236714666 205666159 179708541 158596586 141990277 129217368 119004679 109774178
58167 109774178 100355875 90424956 80336810 70664111 61847291 54080438 47358321 41585751
58159 41585751 36658162 32471280 28908919 25863440 23258772 21033146 19116796 17448548
$$ packed form
58211A7384383J044163J139794J271212J433267J601193J790839K042062K354666
58203C0061579K708937L138106L705866M422019N257024O221997P343804Q582829
58195G1442161R886601J1312672J2985086J4959273J7276268K0117802K3724953
58188A81704816K8187996L3469894L9351021M4649076M6363828M0615568K5702367
58181D40044566M510971j6691221l2300423m0373510m2232824m0188127l6054766
58174B36714666l1048507k5957618k1111955j6606309j2772909j0212689r230501
58167A09774178r418303r930919j0088146r672699q816820p766853o722117n772570
58159D1585751m927589m186882l562361l045479k604668k225626j916350j668248
$$ plain form
58151 17448548 15996577 14739809 13643737 12673725 11814498 11055492 10372539 9743542 9166558
58142 9166558 8643103 8158583 7697940 7265735 6871687 6509789 6169744 5855692 5575211
58133 5575211 5321581 5084437 4866870 4675167 4501896 4334978 4173702 4021091 3870848
58124 3870848 3716931 3566483 3428738 3300062 3173383 3052716 2944479 2843688 2742837
58115 2742837 2646001 2560537 2482884 2405877 2332269 2267799 2208272 2146656 2086159 2033572 1986036
58104 1986036 1936637 1886947 1842090 1799299 1753129 1706545 1665594 1628321 1589681 1552035 1520157
58093 1520157 1491117 1459572 1428047 1401887 1379124 1355264 1332873 1316376 1302372 1285075 1266488
58082 1266488 1251355 1236933 1217760 1195956 1176830 1158672 1136807 1113578 1094335 1077368 1057584
$$ packed form
58151A7448548j451971j256768j096072r70012q59227p59006o82953o28997n76984
58142I166558n23455m84520m60643m32205l94048l61898l40045l14052k80481
58133E575211k53630k37144k17567j91703j73271j66918j61276j52611j50243
58124C870848j53917j50448j37745j28676j26679j20667j08237j00791j00851
58115B742837r6836q5464p7653p7007p3608o4470n9527o1616o0497n2587m7536
58104A986036m9399m9690m4857m2791m6170m6584m0951l7273l8640l7646l1878
58093A520157k9040l1545l1525k6160k2763k3860k2391j6497j4004j7297j8587
58082A266488j5133j4422j9173k1804j9126j8158k1865k3229j9243j6967j9784
$$ plain form
58071 1057584 1036555 1019244 1004233 986886 969027 955875 946111 934375 921084 910709 902684 893038
58059 893038 882919 876677 873192 867401 858769 850424 841794 829950 816439 805176 795324 783538 771243
58046 771243 762342 755772 747743 739258 733960 730535 724787 717464 712504 709199 703557 696036 690514 686782
58032 686782 681206 673705 667129 660858 651896 641206 632294 624642 615235 605357 599029 595617 590780 583998
58018 583998 578633 575202 571061 566207 563143 561493 558675 555252 553793 553312 550718 546825 544983 544763 543102
58003 543102 540669 540760 542690 542727 541084 541565 544539 546520 546637 547424 549168 549413 548286 548482 549795 549246 546825
57986 546825 545621 546050 545354 543035 541465 540915 539181 536405 535198 535766 535750 534937 535305 536620 537003 537529 541048
57969 541048 546637 550577 552697 556270 561544 565028 565550 565514 565532 563234 558185 552904 548196 542365 535677
$$ packed form
58071A057584k1029j7311j5011j7347j7859j3152r764j1736j3291j0375q025r646
58059H93038j0119o242l485n791q632q345q630j1844j3511j1263r852j1786j2295
58046G71243q901o570q029q485n298l425n748p323m960l305n642p521n522l732
58032F86782n576p501o576o271q962j0690q912p652r407r878o328l412m837o782
58018E83998n365l431m141m854l064j650k818l423j459m81k594l893j842k20j661
58003E43102k433R1J930L7j643M81K974J981J17P87J744K45j127J96J313n49k421
57986E46825j204M29o96k319j570n50j734k776j207N68j6q13L68J315L83N26L519
57969E41048N589L940K120L573N274L484N22l6J8k298n049n281m708n831o688
$$ plain form
57954 535677 530634 527115 522226 515703 510569 507632 504332 499948 497078 496820 497194 497393 499032 502090 504221
57939 504221 505287 508140 513668 519385 524122 529894 537843 546464 555028 564779 575557 585020 592313 598801
57925 598801 604412 607086 606536 604673 601674 595718 587237 579188 572342 564557 555430 547290 540726 533673
57911 533673 526002 520452 517725 515180 511797 510011 511024 512554 512917 513172 513539 511909 507827 504016 502037
57896 502037 500149 497151 494552 493160 491439 489106 488646 491255 494879 498105 502310 508110 513438 517322
57882 517322 521930 528612 535315 540107 543974 547993 551029 552510 554244 557176 559412 559720 559954 561734 563730
57867 563730 564632 565846 568771 572108 574392 576655 580101 583475 585144 585731 586514 587298 587827 589206 592026
57852 592026 595135 597948 601817 607417 613053 617271 620870 624688 627733 629205 630024 630648 629744 626839 623912
$$ packed form
57954E35677n043l519m889o523n134k937l300m384k870k58L74J99J639L058K131
57939E04221J066K853N528N717M737N772P949Q621Q564R751J0778R463P293O488
57925E98801N611K674n50j863k999n956q481q049o846p785r127q140o564p053
57911E33673p671n550k727k545l383j786J013J530L63K55L67j630m082l811j979
57896E02037j888k998k599j392j721k333m60K609L624L226M205N800N328L884
57882E17322M608O682O703M792L867M019L036J481J734K932K236L08K34J780J996
57867E63730R02J214K925L337K284K263L446L374J669N87P83P84N29J379K820
57852E92026L109K813L869N600N636M218L599L818L045J472Q19O24r04k905k927
$$ plain form
57837 623912 622544 621676 619954 618076 617076 616523 616167 617221 620205 623609 626222 628753 631707 634083 635712
57822 635712 638399 642965 647471 650091 651442 652398 652123 650130 647862 646199 643673 639163 634170 630382 627069
57807 627069 622894 618360 614480 610866 606828 602520 597500 590313 581092 572388 565861 560384 554891 550540
57793 550540 548326 547178 546339 547034 549753 552474 553757 555035 557555 559737 560043 559979 561570 564197 566688
57778 566688 570264 576427 583916 590711 597304 605121 613392 620426 626459 632443 637507 640378 641942 643632
57764 643632 644616 643340 640587 638247 636187 633071 629333 626661 625291 624238 623405 623237 623161 622625 622874 625567
57748 625567 630423 636143 642562 649966 657473 664214 670950 678362 684935 688874 691048 693727 697312 700547
57734 700547 703003 705072 706295 706030 705229 705505 706949 708613 710360 712539 714710 716423 718330 720932 723326
$$ packed form
57837F23912j368q68j722j878j000n53l56J054K984L404K613K531K954K376J629
57822F35712K687M566M506K620J351R56k75j993k268j663k526m510m993l788l313
57807F27069m175m534l880l614m038m308n020p187r221q704o527n477n493m351
57793E50540k214j148q39O95K719K721J283J278K520K182L06o4J591K627K491
57778E66688L576O163P489O795O593P817Q271P034O033N984N064K871J564J690
57764F43632R84j276k753k340k060l116l738k672j370j053q33j68p6n36K49K693
57748F25567M856N720O419P404P507O741O736P412O573L939K174K679L585L235
57734G00547K456K069J223k65q01K76J444J664J747K179K171J713J907K602K394
$$ plain form
57719 723326 724762 726150 728301 730164 730768 731372 733506 736306 738109 739289 741125 743125 744054 744551 746151
57704 746151 748575 750468 751935 753955 756212 757964 760227 764498 770057 774999 779319 784501 790645 796403
57690 796403 801239 805332 807724 807005 803541 798927 793698 787629 781642 777208 774375 772547 772540 775617 781147
57675 781147 787644 795537 806608 821257 838798 859991 886786 919824 958652 1004290 1059369 1125638
57663 1125638 1202461 1286014 1366951 1430014 1460366 1452320 1411181 1347754 1273368 1198527 1131187
57652 1131187 1074005 1025124 982566 946443 917121 893835 875850 862960 854214 847832 842820 839188
57640 839188 836517 833998 831891 831154 831569 831915 831913 832281 833072 833824 835101 837851 841372 843962 845516 847349
57624 847349 849510 850574 850235 849906 850392 851057 851617 852729 854383 855589 856165 857104 858818 860624 862214 864017
$$ packed form
57719G23326J436J388K151J863O04O04K134K800J803J180J836K000R29M97J600
57704G46151K424J893J467K020K257J752K263M271N559M942M320N182O144N758
57690G96403M836M093K392p19l464m614n229o069n987m434k833j828pL077N530
57675G81147O497P893J1071J4649J7541K1193K6795L3038L8828M5638N5079O6269
57663A125638P6823Q3553Q0937O3063L0352q046m1139o3427p4386p4841o7340
57652A131187n7182m8881m2558l6123k9322k3286j7985j2890q746o382n012l632
57640H39188k671k519k107p37M15L46kL68P91P52J277K750L521K590J554J833
57624H47349K161J064l39l29M86O65N60J112J654J206N76R39J714J806J590J803
$$ plain form
57608 864017 865992 867704 869602 872489 875712 877754 878728 880394 883588 887500 891570 896057 900536 903841
57594 903841 905929 908081 910922 913944 917049 920674 924281 926729 928423 931112 935188 939167 942183 945011
57580 945011 948137 950825 952748 954727 957119 959141 960459 961914 964062 966373 968333 969954 970963 970930 970449
57565 970449 970743 971959 973309 974785 976961 979238 980380 980921 982925 986987 991546 995626 1000123 1005744 1011710
57550 1011710 1017331 1023118 1029546 1036398 1043965 1053261 1064348 1075844 1086602 1096405 1104801 1111057 1115778
57537 1115778 1120816 1127038 1133744 1140576 1148119 1156129 1163148 1168526 1173144 1177660 1181869 1186248 1192141 1199707
57523 1199707 1207545 1215044 1223217 1232548 1241979 1250771 1259455 1268165 1276021 1283107 1291116 1300972 1311593 1321924
57509 1321924 1332337 1343016 1352952 1361783 1370875 1381210 1391782 1401364 1410332 1419482 1428429 1436531 1444177
$$ packed form
57608H64017J975J712J898K887L223K042R74J666L194L912M070M487M479L305
57594I03841K088K152K841L022L105L625L607K448J694K689M076L979L016K828
57580I45011L126K688J923J979K392K022J318J455K148K311J960J621J009l3m81
57565I70449K94J216J350J476K176K277J142N41K004M062M559M080M497N621N966
57550A011710N621N787O428O852P567R296J1087J1496J0758R803Q396O256M721
57537A115778N038O222O706O832P543Q010P019N378M618M516M209M379N893P566
57523A199707P838P499Q173R331R431Q792Q684Q710P856P086Q009R856J0621J0331
57509A321924J0413J0679R936Q831R092J0335J0572R582Q968R150Q947Q102P646
$$ plain form
57496 1444177 1451999 1459881 1467626 1475444 1483058 1489689 1495726 1502890 1511898 1521472 1530491 1539434 1548709 1557335
57482 1557335 1564557 1571301 1578708 1586555 1594300 1602351 1611122 1620158 1629357 1639712 1651564 1663349 1673377
57469 1673377 1681883 1690257 1699261 1708962 1719318 1729881 1739980 1749982 1761171 1773743 1786328 1798236
57457 1798236 1810580 1824172 1838019 1851063 1863860 1877237 1890744 1903787 1916973 1931002 1945414
57446 1945414 1959685 1974355 1989870 2005549 2020853 2036374 2052368 2067787 2082136 2096938 2113833
57435 2113833 2132392 2151219 2169993 2188903 2207281 2224471 2241220 2258637 2276516 2294045 2311348
57424 2311348 2329039 2347005 2364838 2382744 2400893 2418739 2436052 2453707 2472374 2491380 2509953
57413 2509953 2528533 2547776 2567341 2586828 2606828 2627835 2649286 2670847 2693476 2717820 2742614
$$ packed form
57496A444177P822P882P745P818P614O631O037P164R008R574R019Q943R275Q626
57482A557335P222O744P407P847P745Q051Q771R036R199J0355J1852J1785J0028
57469A673377Q506Q374R004R701J0356J0563J0099J0002J1189J2572J2585J1908
57457A798236J2344J3592J3847J3044J2797J3377J3507J3043J3186J4029J4412
57446A945414J4271J4670J5515J5679J5304J5521J5994J5419J4349J4802J6895
57435B113833J8559J8827J8774J8910J8378J7190J6749J7417J7879J7529J7303
57424B311348J7691J7966J7833J7906J8149J7846J7313J7655J8667J9006J8573
57413B509953J8580J9243J9565J9487K0000K1007K1451K1561K2629K4344K4794
$$ plain form
57402 2742614 2766119 2788146 2809424 2830049 2849996 2870074 2890854 2911596 2931675 2952137 2974348
57391 2974348 2998030 3022114 3046660 3072314 3098633 3124530 3149810 3174895 3199774 3224638 3250822
57380 3250822 3279535 3310055 3340476 3369845 3398432 3426475 3453880 3480749 3507236 3533330 3559382
57369 3559382 3586091 3613328 3640052 3666071 3692617 3720337 3748182 3775350 3802791 3831518 3860932
57358 3860932 3890276 3920268 3951718 3983878 4015824 4048121 4081499 4115218 4148503 4182202 4217146
57347 4217146 4252246 4286254 4320147 4355535 4391872 4427545 4462721 4498729 4535433 4571639 4607424
57336 4607424 4643713 4680115 4715559 4750663 4787168 4825285 4863773 4902304 4941541 4981168 5020127
57325 5020127 5058743 5098489 5139604 5180913 5221908 5263008 5303934 5343856 5383261 5423644 5465229
$$ packed form
57402B742614K3505K2027K1278K0625J9947K0078K0780K0742K0079K0462K2211
57391B974348K3682K4084K4546K5654K6319K5897K5280K5085K4879K4864K6184
57380C250822K8713L0520L0421K9369K8587K8043K7405K6869K6487K6094K6052
57369C559382K6709K7237K6724K6019K6546K7720K7845K7168K7441K8727K9414
57358C860932K9344K9992L1450L2160L1946L2297L3378L3719L3285L3699L4944
57347D217146L5100L4008L3893L5388L6337L5673L5176L6008L6704L6206L5785
57336D607424L6289L6402L5444L5104L6505L8117L8488L8531L9237L9627L8959
57325E020127L8616L9746M1115M1309M0995M1100M0926L9922L9405M0383M1585
$$ plain form
57314 5465229 5506822 5548018 5589678 5632120 5674615 5716876 5759337 5801853 5843809 5885580 5928148
57303 5928148 5971185 6013265 6054209 6095510 6138124 6181412 6224615 6267890 6311520 6355386 6399550
57292 6399550 6444306 6489492 6534735 6580157 6625859 6671104 6715331 6759499 6804901 6851077 6896476
57281 6896476 6940883 6985515 7031012 7077048 7123742 7171661 7220478 7269273 7318083 7367558 7417356
57270 7417356 7466699 7516241 7567441 7620095 7672431 7723731 7774941 7826613 7878197 7929584 7981366
57259 7981366 8033238 8083982 8133435 8182697 8231945 8279818 8325454 8369526 8412743 8454834 8495559
57248 8495559 8535367 8574630 8613485 8652612 8692765 8733458 8773598 8813534 8854853 8898015 8941932
57237 8941932 8986141 9031641 9079131 9128100 9178136 9229555 9282212 9335209 9388312 9442247 9497095
$$ packed form
57314E465229M1593M1196M1660M2442M2495M2261M2461M2516M1956M1771M2568
57303E928148M3037M2080M0944M1301M2614M3288M3203M3275M3630M3866M4164
57292F399550M4756M5186M5243M5422M5702M5245M4227M4168M5402M6176M5399
57281F896476M4407M4632M5497M6036M6694M7919M8817M8795M8810M9475M9798
57270G417356M9343M9542N1200N2654N2336N1300N1210N1672N1584N1387N1782
57259G981366N1872N0744M9453M9262M9248M7873M5636M4072M3217M2091M0725
57248H495559L9808L9263L8855L9127M0153M0693M0140L9936M1319M3162M3917
57237H941932M4209M5500M7490M8969N0036N1419N2657N2997N3103N3935N4848
$$ plain form
57226 9497095 9551765 9605545 9658828 9711843 9763933 9814525 9863653 9911267 9957173 10001835 10045956
57215 10045956 10089169 10130468 10170045 10209416 10249747 10291386 10334708 10379592 10423997 10464980 10501476
57204 10501476 10534638 10565470 10594079 10621360 10649081 10677526 10704810 10729254 10750976 10770639 10788299
57193 10788299 10804114 10818716 10832326 10844759 10856650 10869168 10882184 10894095 10903620 10910341 10913599 10912835
57181 10912835 10909297 10905549 10902914 10901080 10900235 10901447 10904580 10908081 10911448 10915869 10921821 10928214 10934630 10942273
57167 10942273 10951779 10962053 10972137 10982296 10992344 11000774 11006496 11009616 11009709 11005251 10995680 10982031 10964414
57154 10964414 10940741 10909146 10870000 10824471 10772805 10715115 10652211 10584490 10511461 10433413 10352144
57143 10352144 10269283 10185552 10102418 10022607 9947938 9878249 9813334 9754150 9701131 9652990 9608199
$$ packed form
57226I497095N4670N3780N3283N3015N2090N0592M9128M7614M5906M4662M4121
57215A0045956M3213M1299L9577L9371M0331M1639M3322M4884M4405M0983L6496
57204A0501476L3162L0832K8609K7281K7721K8445K7284K4444K1722J9663J7660
57193A0788299J5815J4602J3610J2433J1891J2518J3016J1911R525O721L258p64
57181A0912835l538l748k635j834q45J212L133L501L367M421N952O393O416P643
57167A0942273R506J0274J0084J0159J0048Q430N722L120R3m458r571j3649j7617
57154A0964414k3673l1595l9146m5529n1666n7690o2904o7721p3029p8048q1269
57143A0352144q2861q3731q3134p9811p4669o9689o4915n9184n3019m8141m4791
$$ plain form
57132 9608199 9565977 9524978 9482670 9437076 9387774 9334714 9277744 9217728 9156426 9095238 9036051
57121 9036051 8982556 8936960 8895136 8849367 8797772 8747515 8706937 8678198 8659915 8653137 8661285 8687145
57109 8687145 8733796 8806820 8912454 9055053 9239003 9471757 9762990 10123220 10566556 11113776
57099 11113776 11790968 12627123 13654684 14908516 16419444 18208815 20290313 22673472
57091 22673472 25362333 28354283 31643809 35220754 39052705 43064251 47137474 51136321
57083 51136321 54931813 58408212 61452165 63939085 65730866 66695189 66744509 65872335 64159135
57074 64159135 61743969 58784919 55430693 51806540 48009214 44110929 40171873 36252906
57066 36252906 32419730 28738954 25271657 22067370 19159454 16563694 14280435 12297694
$$ packed form
57132I608199m2222m0999m2308m5594m9302n3060n6970o0016o1302o1188n9187
57121I036051n3495m5596m1824m5769n1595n0257m0578k8739j8283o778Q148K5860
57109H687145M6651P3024J05634J42599J83950K32754K91233L60230M43336N47220
57099A1113776O77192Q36155J027561J253832J510928J789371K081498K383159
57091B2673472K688861K991950L289526L576945L831951M011546M073223L998847
57083E1136321L795492L476399L043953K486920J791781R64323M9320q72174j713200
57074F4159135k415166k959050l354226l624153l797326l898285l939056l918967
57066C6252906l833176l680776l467297l204287k907916k595760k283259j982741
$$ plain form
57058 12297694 10593881 9141285 7910039 6870240 5992403 5248941 4616589 4076777 3613901
57049 3613901 3214637 2868738 2568574 2307275 2078416 1877274 1700611 1544899 1406196
57040 1406196 1281788 1170353 1070397 980119 898825 826645 762581 704485 651214 603162 560480
57029 560480 522521 489292 461698 440003 423698 413064 409058 411614 420232 436729 465292 509499
57017 509499 571588 654346 758464 873786 975248 1032896 1029241 968152 868947 753729 638612
57006 638612 532136 437668 355970 286434 227572 177770 135988 101562 73559 50811 32479
56995 32479 18050 6923 -1413 -7068 -10212 -11683 -12334 -12041 -10105 -6276 -465 8256 21111 38015
56981 38015 57184 75944 91041 98886 97248 87069 71612 53905 35901 19464 6260 -3551
$$ packed form
57058A2297694j703813j452596j231246j039799q77837p43462o32352n39812m62876
57049C613901l99264l45899l00164k61299k28859k01142j76663j55712j38703
57040A406196j24408j11435r9956r0278q1294p2180o4064n8096n3271m8052m2682
57029E60480l7959l3229k7594k1695j6305j0634m006K556Q618J6497K8563M4207
57017E09499O2089Q2758J04118J15322J01462N7648l655o1089r9205j15218j15117
57006F38612j06476r4468q1698o9536n8862m9802m1782l4426k8003k2748j8332
56995C2479j4429F923a413n655l144j471o51K93J936L829d65H256J2855J6904
56981C8015J9169J8760J5097P845j638j0179j5457j7707j8004j6437F260c551
$$ plain form
56968 -11054 -16588 -19311 -18917 -16374 -12465 -6791 1304 11937 25286 42093 63019 88253 117747
56955 117747 150555 183260 209986 224988 225445 212202 188821 160071 130328 102537 78391 58921
56943 58921 44327 33779 26377 22217 21826 24984 31021 39891 51982 67293 85932 109111 138423
56930 138423 174065 214241 255307 291254 314211 318174 303050 274164 237964 199261 161655 127923
56918 127923 99061 74368 53042 34778 18836 4067 -9756 -21811 -31624 -39560 -45839 -50268 -53090
56905 -53090 -54956 -56003 -56052 -55587 -55289 -54776 -53208 -50954 -49079 -47263 -43902 -38443 -31951 -25090 -17185 -7646
56888 3196 15099 28435 43473 60345 79713 101711 123788 141209 150395 150878 144176 132537 119001
56875 119001 106632 96651 88467 81959 78303 78156 80641 84998 91901 102393 116590 134159 155237
$$ packed form
56968a1054n534k723L94K543L909N674A304J0633J3349J6807K0926K5234K9494
56955A17747L2808L2705K6726J5002M57j3243k3381k8750k9743k7791k4146j9470
56943E8921j4594j0548p402m160l91L158O037Q870J2091J5311J8639K3179K9312
56930A38423L5642M0176M1066L5947K2957L963j5124k8886l6200l8703l7606l3732
56918A27923k8862k4693k1326j8264j5942D067i756j2055r813p936o279m429k822
56905e3090j866j047m9M65K98N13J568K254J875J816L361N459O492O861P905g646
56888C196J1903J3336J5038J6872J9368K1998K2077J7421R186M83o702j1639j3536
56875A19001j2369r981q184o508l656j47K485M357O903J0492J4197J7569K1078
$$ plain form
56862 155237 180428 210753 247754 292573 344288 399314 451774 493711 516658 516038 494733 460824
56850 460824 421749 381882 344515 312806 288009 269259 256138 249573 249804 255761 267213 285324
56838 285324 310315 340962 377526 423007 480274 549839 630878 720774 810840 884774 925473
56827 925473 924745 886631 823098 747747 671330 599742 534928 477812 429805 391533 361896 339647
56815 339647 324854 317942 318485 325982 340731 362987 392374 429154 474927 530644 593931 658137
56803 658137 712847 745942 748528 720404 670195 609192 545579 484042 427709 378324 335961 300464
56791 300464 272402 251715 236832 226387 220553 219650 222969 230224 242625 261064 284678 312512
56779 312512 344655 379406 410486 429501 431269 415962 387417 351104 312648 275931 242197 211665
$$ packed form
56862A55237K5191L0325L7001M4819N1715N5026N2460M1937K2947o20k1305l3909
56850D60824l9075l9867l7367l1709k4797j8750j3121o565K31N957J1452J8111
56838B85324K4991L0647L6564M5481N7267O9565Q1039Q9896R0066P3934M0699
56827I25473p28l8114o3533p5351p6417p1588o4814n7116m8007l8272k9637k2249
56815C39647j4793o912N43P497J4749K2256K9387L6780M5773N5717O3287O4206
56803F58137N4710L3095K586k8124n0209o1003o3613o1537n6333m9385m2363l5497
56791C00464k8062k0687j4883j0445n834r03L319P255J2401J8439K3614K7834
56779C12512L2143L4751L1080J9015J768j5307k8545l6313l8456l6717l3734l0532
$$ plain form
56767 211665 185201 163410 145201 128819 113775 100570 89232 79318 70700 63228 56357 50077
56755 50077 45352 42518 40185 36886 32921 29457 26756 24523 23082 22849 23312 23665 23735 23336 21775 19088
56739 19088 16738 15865 15801 15538 15524 16639 18336 19333 19406 19236 19210 19596 21081 23837 26749 28708 29969 31294
56721 31294 32720 34183 36256 39093 41771 43776 46002 49028 51737 53077 53951 55802 58468 60984 63403
56706 63403 66110 68409 69469 69864 70526 71108 70938 70632 71083 71737 71570 70939 70816 71039 70936 70793 71071 71153
56688 71153 70592 70622 72514 75381 77524 79044 81042 83082 83836 83746 84773 87669 91447 95354 99471 103479
56672 103479 106581 108544 109394 108535 105797 102837 101665 102080 102226 101305 100044 98878 97563 96380 95937 95888
56656 95888 95368 94491 93950 93570 92851 92518 93741 96115 98120 99334 100509 101682 102019 101503 101132 101393 101923
$$ packed form
56767B11665k6464k1791j8209j6382j5044j3205j1338r914q618p472o871o280
56755E0077m725k834k333l299l965l464k701k233j441k33M63L53P0l99j561k687
56739A9088k350q73o4k63j4J115J697R97P3j70k6L86J485K756K912J959J261J325
56721C1294J426J463K073K837K678K005K226L026K709J340Q74J851K666K516K419
56706F3403K707K299J060L95O62N82j70l06M51O54j67o31j23K23j03j43K78Q2
56688G1153n61L0J892K867K143J520J998K040P54r0J027K896L778L907M117M008
56672A03479L102J963Q50q59k738k960j172M15J46r21j261j166j315j183m43m9
56656I5888n20q77n41l80p19l33J223K374K005J214J175J173L37n16l71K61N30
$$ plain form
56639 101923 102591 103590 104611 105216 105804 106992 108419 109334 109788 109950 108988 106167 102440 99334 96859 94184
56623 94184 91709 90648 90931 91273 91015 90386 89399 88087 87247 87364 87352 85993 83938 82664 82260 81999 82170
56606 82170 83285 84278 83766 82498 82302 83178 83680 83652 84159 85150 85678 86170 87937 90540 92106 92381 93079 95063
56588 95063 97423 99502 101600 103520 104574 105243 106715 108619 109322 108591 107849 107667 107236 106594 107152 109517
56572 109517 112729 116011 119420 122576 124767 126620 129751 134443 139468 144358 149910 156315 162822 169607
56558 169607 178112 189172 202432 217504 233686 248460 258415 262153 260743 255575 247787 239586 233558
56545 233558 230170 227862 225733 224122 222674 220315 217374 215353 214247 212388 209280 206250 203917 201389
56531 201389 198376 195726 193370 190185 186438 183884 182708 180847 177233 173428 171056 169767 168753 168215
$$ packed form
56639A01923O68R99J021O05N88J188J427R15M54J62r62k821l727l106k475k675
56623I4184k475j061K83L42k58o29r87j312q40J17j2j359k055j274m04k61J71
56606H2170J115R93n12j268j96Q76N02k8N07R91N28M92J767K603J566K75O98J984
56588I5063K360K079K098J920J054O69J472J904P03p31p42j82m31o42N58K365
56572A09517L212L282L409L156K191J853L131M692N025M890N552O405O507O785
56558A69607Q505J1060J3260J5072J6182J4774R955L738j410n168p788q201o028
56545B33558l388k308k129j611j448k359k941k021j106j859l108l030k333k528
56531B01389l013k650k356l185l747k554j176j861l614l805k372j289j014n38
$$ plain form
56517 168215 168235 168014 167200 166322 165259 163024 159725 156882 155124 153293 150500 147339 144517 141969 139805
56502 139805 138461 137559 136311 135152 135118 135617 135031 133587 133248 134537 135929 136718 137855 139491 140379 140421 141166
56485 141166 142941 144040 143645 143124 143470 143887 143873 144333 145570 146445 146554 147039 148220 148619 147381 145653 144695
56468 144695 144559 145320 147365 149834 150985 150839 151175 152424 153007 152315 151658 151589 151068 150063 150137 151580 152839
56451 152839 153657 155680 158927 160984 161058 161568 164082 166899 168547 170544 174430 178770 181372 182133 181726 179892
56435 179892 176987 174908 174465 174043 172655 171908 173042 174486 174465 173738 173616 173423 172141 170598 169954 169836 169791
56418 169791 170633 172535 173845 173666 173643 175355 177880 179667 180785 181619 181468 180240 179534 180261 181182 181324 181638
56401 181638 182748 183476 183266 183581 185206 186668 187108 188011 190206 191922 191993 192158 193837 195380 195036 194066 194246
$$ packed form
56517A68215K0k21q14q78j063k235l299k843j758j831k793l161k822k548k164
56502A39805j344r02j248j159l4M99n86j444l39J289J392P89J137J636Q88M2P45
56485A41166J775J099l95n21L46M17j4M60J237Q75J09M85J181L99j238j728r58
56468A44695j36P61K045K469J151j46L36J249N83o92o57o9n21j005P4J443J259
56451A52839Q18K023L247K057P4N10K514K817J648J997L886M340K602P61m07j834
56435A79892k905k079m43m22j388p47J134J444k1p27j22j93j282j543o44j18m5
56418A69791Q42J902J310j79k3J712K525J787J118Q34j51j228p06P27R21J42L14
56401A81638J110P28k10L15J625J462M40R03K195J716P1J65J679J543l44r70J80
$$ plain form
56384 194246 194800 194513 194522 196181 198316 199307 199849 201027 201820 201146 200336 200936 202104 202710 203845 206570 209354
56367 209354 210501 211079 212758 214824 216046 217388 220037 222794 224218 225347 227536 229638 230161 230104 230886
56352 230886 231661 231611 232602 236352 241069 244093 245826 247853 249304 248593 246877 246280 246379 245818 245665 247708 250973
56335 250973 253405 255462 258801 262893 266302 269752 274609 279811 283627 286952 291512 296340 299426 301381
56321 301381 304141 307468 310071 312612 316204 319406 320217 319638 319878 320569 320178 319548 320380 321772 322017 322390
56305 322390 325347 330281 334891 339475 346044 354355 362661 371330 381908 393530 403845 412459 420088
56292 420088 425669 428080 429399 432598 437142 440639 443539 448309 455098 462226 469789 478846 488207 496080
56278 496080 503779 513717 524827 534110 541697 550193 560042 569804 580048 592578 606601 619937 633289
$$ packed form
56384A94246N54k87RJ659K135R91N42J178P93o74q10O00J168O06J135K725K784
56367B09354J147N78J679K066J222J342K649K757J424J129K189K102N23n7P82
56352B30886P75n0R91L750M717L024J733K027J451p11j716n97R9n61j53K043L265
56335B50973K432K057L339M092L409L450M857N202L816L325M560M828L086J955
56321C01381K760L327K603K541L592L202Q11n79K40O91l91o30Q32J392K45L73
56305C22390K957M934M610M584O569Q311Q306Q669J0578J1622J0315Q614P629
56292D20088N581K411J319L199M544L497K900M770O789P128P563R057R361P873
56278D96080P699R938J1110R283P587Q496R849R762J0244J2530J4023J3336J3352
$$ plain form
56265 633289 649106 667208 685848 706154 730911 759660 789592 820743 855867 895766 939345
56254 939345 987693 1043423 1106329 1174340 1248511 1332505 1427280 1530675 1642048 1762913 1893199
56243 1893199 2031189 2176861 2330879 2490494 2650692 2808946 2964545 3113843 3250830
56234 3250830 3371988 3475943 3558864 3615203 3643116 3644700 3621267 3572991 3502782 3415544 3313690
56223 3313690 3197943 3072009 2941439 2808282 2671904 2534651 2401288 2273093 2148015
56214 2148015 2026673 1912655 1806758 1706478 1611542 1524414 1444846 1369441 1297244 1230556
56204 1230556 1169717 1112412 1058607 1010826 968956 930073 893886 862931 836853 812018 787479
56193 787479 765892 747936 731356 716070 704500 696114 687349 677778 670657 666598 662532 657647 654338
$$ packed form
56265F33289J5817J8102J8640K0306K4757K8749K9932L1151L5124L9899M3579
56254I39345M8348N5730O2906O8011P4171Q3994R4775J03395J11373J20865J30286
56243A893199J37990J45672J54018J59615J60198J58254J55599J49298J36987
56234C250830J21158J03955Q2921N6339K7913J584k3433m8276p0209q7238j01854
56223C313690j15747j25934j30570j33157j36378j37253j33363j28195j25078
56214B148015j21342j14018j05897j00280r4936q7128p9568p5405p2197o6688
56204A230556o0839n7305n3805m7781m1870l8883l6187l0955k6078k4835k4539
56193G87479k1587j7956j6580j5286j1570q386q765r571p121m059m066m885l309
$$ plain form
56180 654338 652412 648639 643212 640347 641014 641258 639317 638175 639326 640227 640009 641755 646852 652645 657675
56165 657675 663796 671332 677777 683087 690655 701232 711554 720704 732030 746829 761951 775687 790480
56152 790480 807883 826386 846017 869501 897151 926224 956726 991955 1032104 1073738 1117129
56141 1117129 1167485 1227132 1293144 1364586 1445313 1537555 1639509 1751135 1874835 2007543
56131 2007543 2138916 2260152 2368366 2460972 2534111 2590058 2638653 2687392 2735876 2781800 2824419
56120 2824419 2859025 2876400 2872614 2853308 2825166 2789987 2749661 2708318 2664686 2609461 2534970
56109 2534970 2441719 2332780 2209674 2077699 1947454 1826138 1713700 1610863 1523061 1452285
56099 1452285 1393002 1340951 1298615 1267555 1243138 1221813 1206076 1197280 1191003 1184549 1181506 1183825
$$ packed form
56180F54338j926l773n427k865O67K44j941j142J151R01k18J746N097N793N030
56165F57675O121P536O445N310P568J0577J0322R150J1326J4799J5122J3736J4793
56152G90480J7403J8503J9631K3484K7650K9073L0502L5229M0149M1634M3391
56141A117129N0356N9647O6012P1442Q0727R2242J01954J11626J23700J32708
56131B007543J31373J21236J08214R2606P3139N5947M8595M8739M8484M5924M2619
56120B824419L4606J7375l786j9306k8142l5179m0326m1343m3632n5225p4491
56109B534970r3251j08939j23106j31975j30245j21316j12438j02837q7802p0776
56099A452285n9283n2051m2336l1060k4417k1325j5737q796o277o454l043K319
$$ plain form
56087 1183825 1186860 1187405 1189121 1194846 1201069 1205288 1211193 1221225 1231561 1239769 1249768 1263892 1277897
56074 1277897 1289230 1302306 1320089 1338486 1354567 1372116 1393492 1414500 1433001 1453913 1479834
56063 1479834 1505579 1527953 1551669 1579352 1605224 1625424 1645057 1668101 1690022 1707564 1725925
56052 1725925 1748586 1770038 1786558 1804334 1828684 1855111 1879314 1905839 1938174 1970599 1998999
56041 1998999 2029537 2067292 2106641 2142374 2179819 2223951 2269056 2309545 2350601 2397646 2445838
56030 2445838 2490750 2538739 2595619 2655750 2713558 2774849 2845029 2917145 2983590 3048764 3118222
56019 3118222 3186865 3250421 3317002 3394296 3476746 3558080 3644200 3740351 3838468 3931568 4027891
56008 4027891 4136213 4250163 4362090 4478873 4608293 4743557 4877638 5018876 5175549
$$ packed form
56087A183825L035N45J716N725O223M219N905J0032J0336Q208R999J4124J4005
56074A277897J1333J3076J7783J8397J6081J7549K1376K1008J8501K0912K5921
56063A479834K5745K2374K3716K7683K5872K0200J9633K3044K1921J7542J8361
56052A725925K2661K1452J6520J7776K4350K6427K4203K6525L2335L2425K8400
56041A998999L0538L7755L9349L5733L7445M4132M5105M0489M1056M7045M8192
56030B445838M4912M7989N6880O0131N7808O1291P0180P2116O6445O5174O9458
56019C118222O8643O3556O6581P7294Q2450Q1334Q6120R6151R8117R3100R6323
56008D027891J08322J13950J11927J16783J29420J35264J34081J41238J56673
$$ plain form
55999 5175549 5339556 5502875 5675097 5866364 6068443 6271771 6485184 6718806 6964071
55990 6964071 7211851 7473351 7761049 8066464 8379856 8713550 9081423 9474331 9881682
55981 9881682 10317701 10799231 11317959 11863264 12451190 13100511 13802859 14549307 15363098
55972 15363098 16271529 17270468 18354226 19554751 20911724 22432404 24125381 26045947
55964 26045947 28263337 30817877 33765539 37234139 41380642 46327033 52192266 59137079
55956 59137079 67303976 76763113 87604414 100043144 114369161 130891045 150067638
55949 150067638 172633670 199479659 231489690 269450145 313355377 360623643 404610192
55942 404610192 435900220 446687051 435011140 405268623 364978833 321029627 278004335
$$ packed form
55999E175549J64007J63319J72222J91267K02079K03328K13413K33622K45265
55990F964071K47780K61500K87698L05415L13392L33694L67873L92908M07351
55981I881682M36019M81530N18728N45305N87926O49321P02348P46448Q13791
55972A5363098R08431R98939J083758J200525J356973J520680J692977J920566
55964B6045947K217390K554540K947662L468600M146503M946391N865233O944813
55956E9137079Q166897R459137J0841301J2438730J4326017J6521884J9176593
55949A50067638K2566032K6845989L2010031L7960455M3905232M7268266M3986549
55942D04610192L1290028J0786831j1675911k9742517m0289790m3949206m3025292
$$ plain form
55935 278004335 238410039 203350041 173000077 147048733 125078531 106667755 91324262
55928 91324262 78530391 67865010 58998885 51608675 45390267 40132387 35694419 31927968
55920 31927968 28684745 25876306 23457018 21361506 19513533 17877478 16445049 15183953
55912 15183953 14047786 13021864 12112164 11300849 10555545 9870536 9257547 8706217 8192051
55903 8192051 7713222 7282635 6892808 6523531 6175516 5862762 5579554 5307226 5046306
55894 5046306 4810980 4598292 4392621 4194632 4017120 3857346 3700945 3548465 3411735
55885 3411735 3288375 3165341 3043799 2936020 2841103 2747225 2654589 2573490 2502810 2432488
55875 2432488 2364544 2310238 2268738 2228729 2188240 2152595 2115489 2062861 1994585 1923559 1854745
$$ packed form
55935B78004335l9594296l5059998l0349964k5951344k1970202j8410776j5343493
55928I1324262j2793871j0665381q866125p390210o218408n257880m437968l766451
55920C1927968l243223k808439k419288k095512j847973j636055j432429j261096
55912A5183953j136167j025922r09700q11315p45304o85009o12989n51330n14166
55903H192051m78829m30587l89827l69277l48015l12754k83208k72328k60920
55894E046306k35326k12688k05671j97989j77512j59774j56401j52480j36730
55885C411735j23360j23034j21542j07779r4917r3878r2636q1099p0680p0322
55875B432488o7944n4306m1500m0009m0489l5645l7106n2628o8276p1026o8814
$$ plain form
55864 1854745 1783334 1711699 1649181 1595423 1541433 1486953 1440366 1402085 1364188 1325832 1293259
55853 1293259 1265279 1234331 1201408 1174695 1153813 1130152 1102442 1077464 1055707 1030749 1002871
55842 1002871 979205 960112 938806 914650 893778 876492 856958 835488 818451 805789 791033
55831 791033 773807 760146 750282 738293 724112 713901 708175 701256 692778 687911 685646 678662 665854
55818 665854 653879 645323 636202 625956 618951 614945 608650 600016 594847 594140 592749 589548 589001 591742
55804 591742 593443 593991 598040 605510 611155 614429 620072 627877 631575 629184 625003 620084 610269 595235
55790 595235 580220 566955 551799 534486 519857 509155 498197 486045 477138 473087 470426 467884
55778 467884 467659 468096 463565 453372 442819 434068 424202 413581 407285 406222 405272 402467 401758 404356
$$ packed form
55864A854745p1411p1635o2518n3758n3990n4480m6587l8281l7897l8356l2573
55853A293259k7980l0948l2923k6713k0882k3661k7710k4978k1757k4958k7878
55842A002871k3666j9093k1306k4156k0872j7286j9534k1470j7037j2662j4756
55831G91033j7226j3661r864j1989j4181j0211n726o919q478m867k265o984j2808
55818F65854j1975q556r121j0246p005m006o295q634n169p07j391l201n47K741
55804E91742J701N48M049P470N645L274N643P805L698k391m181m919r815j5034
55790E95235j5015j3265j5156j7313j4629j0702j0958j2152q907m051k661k542
55778D67884k25M37m531j0193j0553q751r866j0621o296j063r50k805p09K598
$$ plain form
55764 404356 405594 403085 400099 398044 393264 384322 375234 368482 361639 353648 347620 344529 340682 334279
55750 334279 328356 324689 320872 315775 311749 309171 304882 298240 292739 289563 285598 279760 275085 272561
55736 272561 269138 263960 260296 259125 257012 252649 249346 248661 247622 244689 242495 242189 240869 237071 233166
55721 233166 230160 225868 220332 217028 216470 214667 210322 207380 207825 208170 206028 204192 205010 206433 206812
55706 206812 208119 211162 212953 212130 211807 213825 215182 213439 210785 209488 208038 205002 202212 201078 200091
55691 200091 198753 199549 203263 206827 208416 210143 213249 215536 216260 218559 224002 229623 233413 237900 244971
55676 244971 251880 255890 258414 261109 262218 260353 257727 256151 253784 249317 245386 244388 244671 244236 244427
55661 244427 246563 248650 248931 249211 251365 253872 254922 255488 256262 255239 251599 248400 247945 247778 244644 239291
$$ packed form
55764D04356J238k509k986k055m780q942r088o752o843p991o028l091l847o403
55750C34279n923l667l817n097m026k578m289o642n501l176l965n838m675k524
55736B72561l423n178l664j171k113m363l303o85j039k933k194l06j320l798l905
55721B33166l006m292n536l304n58j803m345k942M45L45k142j836Q18J423L79
55706B06812J307L043J791q23l23K018J357j743k654j297j450l036k790j134r87
55691B00091j338P96L714L564J589J727L106K287P24K299N443N621L790M487P071
55676B44971O909M010K524K695J109j865k626j576k367m467l931r98K83m35J91
55661B44427K136K087K81K80K154K507J050N66P74j023l640l199m55j67l134n353
$$ plain form
55645 239291 234041 228739 222372 215849 210016 203629 196080 189269 184253 179195 173139 168390 166375 164687
55631 164687 161217 157823 156774 156939 156599 156765 158460 159916 159703 159565 160961 161926 160559 158489 157629 156660
55615 156660 154153 152026 152278 153183 152345 150780 150359 149892 147438 144122 142076 140842 139222 138363 139585 141359
55599 141359 141748 141699 142687 143378 141944 139509 138017 136762 134291 131657 130576 130358 129718 129526 130685 131498
55583 131498 130410 129243 130407 132896 134363 135245 137480 140811 143711 146453 150235 154765 159516 165735
55569 165735 174416 184020 192915 202224 213538 225743 236857 246941 256303 262983 265162 264137 261909
55556 261909 257809 250530 241417 232487 223221 212623 202438 194832 188650 181527 174073 168510 164746 161290
55542 161290 158566 157757 157774 156878 156079 157339 159572 159970 158363 156897 156254 155426 154355 153612 152219 148885
$$ packed form
55645B39291n250n302o367o523n833o387p549o811n016n058o056m749k015j688
55631A64687l470l394j049J65l40J66J695J456k13j38J396R65j367k070q60r69
55615A56660k507k127K52R05q38j565m21m67k454l316k046j234j620q59J222J774
55599A41359L89m9R88O91j434k435j492j255k471k634j081k18o40j92J159Q13
55583A31498j088j167J164K489J467Q82K235L331K900K742L782M530M751O219
55569A65735Q681R604Q895R309J1314J2205J1114J0084R362O680K179j025k228
55556B61909m100p279r113q930r266j0598j0185p606o182p123p454n563l764l456
55542A61290k724q09J7q96p99J260K233L98j607j466o43q28j071p43j393l334
$$ plain form
55526 148885 144589 141035 137543 132488 126777 122728 120306 117640 114498 112151 110411 107860 104587 101938
55512 101938 100054 98258 97151 97618 98426 97510 95072 92920 91490 89966 88530 87936 87683 87068 87056 88572
55496 88572 90041 89423 87724 87639 89506 91408 92475 93236 93405 92244 90703 90532 91641 92671 93528 95002
55480 95002 96652 97485 97974 99015 99832 99257 98072 97635 97349 96140 95103 95810 97094 96672 94881 93640
55464 93640 92680 90278 87128 85898 87045 88309 88357 87970 87657 86965 86279 86590 87392 87224 86254 85981 86524 86544
55446 86544 85622 84522 83476 82377 82053 83020 83688 82295 79948 79139 79997 80667 80672 80977 81350 80679 79607 79879
55428 79879 81331 82319 82817 84238 86404 87616 87558 87378 87068 85624 83617 82757 82982 82788 82257 82840 84253
55411 84253 84644 83948 84092 85650 87144 87873 88602 89182 88364 86355 84838 84084 82719 80736 79936 80885 82001
$$ packed form
55526A48885m296l554l492n055n711m049k422k666l142k347j740k551l273k649
55512A01938j884j796j107M67Q08r16k438k152j430j524j436n94k53o15j2J516
55496H8572J469o18j699q5J867J902J067P61J69j161j541j71J109J030Q57J474
55480I5002J650Q33M89J041Q17n75j185m37k86j209j037P07J284m22j791j241
55464I3640r60k402l150j230J147J264M8l87l13o92o86L11Q02j68r70k73N43K0
55446H6544r22j100j046j099l24R67O68j393k347q09Q58O70NL05L73o71j072K72
55428G9879J452R88M98J421K166J212n8j80l10j444k007q60K25j94n31N83J413
55411H4253L91o96J44J558J494P29P29N80q18k009j517p54j365j983q00R49J116
$$ plain form
55394 82001 82313 82601 83285 83529 83073 82725 82602 81988 81238 81595 82910 83742 83883 84507 85751 86575 87115 88595
55376 88595 90650 91318 90130 88728 88033 87233 85986 85129 84727 83809 82544 82321 83158 83349 82226 81049 80698
55359 80698 80712 81016 82276 84056 84871 84548 84360 84510 83805 82231 81411 81914 82436 82202 81980 82167 82101 81726 81824
55340 81824 82160 81601 80369 79883 80086 79397 77646 76490 76486 76401 75935 76364 77795 78547 78143 78216 79424 80098 79148
55321 79148 77846 77447 77404 77185 77618 79089 80471 81049 81595 82439 82551 81630 81033 81418 81430 80005 78082 76823
55303 76823 75956 75127 75058 76064 76993 76921 76492 76558 76920 77297 78055 79137 79729 79688 79813 80118 79609 78387 78150
55284 78150 79792 82254 84432 86386 87923 88037 86740 85618 85614 85837 85426 84884 84760 84699 84584 84921 85382 84724
55266 84724 82913 81537 81375 81346 80554 79519 78697 77721 76848 77168 78625 79710 79848 80118 80955 81253 80530 79789
$$ packed form
55394H2001L12K88O84K44m56l48j23o14p50L57J315Q32J41O24J244Q24N40J480
55376H8595K055O68j188j402o95q00j247q57m02r18j265k23Q37J91j123j177l51
55359H0698J4L04J260J780Q15l23j88J50p05j574q20N03N22k34k22J87o6l75R8
55340H1824L36n59j232m86K03o89j751j156mq5m66M29J431P52m04P3J208O74r50
55321G9148j302l99m3k19M33J471J382N78N46Q44J12r21n97L85J2j425j923j259
55303G6823q67q29o9J006R29p2m29O6L62L77P58J082N92m1J25L05n09j222k37
55284G8150J642K462K178J954J537J14j297j122mK23m11n42j24o1j15L37M61o58
55266H4724j811j376j62k9p92j035q22r76q73L20J457J085J38K70Q37K98p23p41
$$ plain form
55248 79789 79447 78670 77625 77970 80030 81784 81917 81573 81817 81708 80338 78646 77630 76782 75789 75761 77191
55231 77191 78591 78690 78189 77934 77300 75947 75209 75989 76997 76784 75928 75552 75280 74309 73081 72364 71986 71835
55213 71835 72643 74508 76156 76840 77325 77938 77624 76278 75854 77464 79369 79708 79321 79942 81340 82408 83510
55196 83510 85508 87634 88411 87816 86823 85743 84529 83697 83541 83502 83463 84268 85821 86358 85055 83627 83760
55179 83760 84725 85222 85752 87068 88021 87301 86002 86142 87644 88919 89495 90017 90477 90456 90423 91032 91820 92126
55161 92126 92401 93092 93363 92502 91540 91734 92511 92671 92595 93421 94915 95925 96178 96051 95418 94283 93571 93817
55143 93817 94058 93488 92940 93134 92830 90682 87740 86133 86209 86852 87531 88107 87699 85910 84317 84628 86170
55126 86170 87137 87422 88059 88764 88415 87431 87354 88294 88857 88409 87548 86596 85447 84680 85118 86447 87778 89165
$$ packed form
55248G9789l42p77j045L45K060J754J33l44K44j09j370j692j016q48r93k8J430
55231G7191J400R9n01k55o34j353p38P80J008k13q56l76k72r71j228p17l78j51
55213G1835Q08J865J648O84M85O13l14j346m24J610J905L39l87O21J398J068J102
55196H3510J998K126P77n95r93j080j214q32j56l9l9Q05J553N37j303j428J33
55179H3760R65M97N30J316R53p20j299J40J502J275N76N22M60k1l3O09P88L06
55161I2126K75O91K71q61r62J94P77J60p6Q26J494J010K53j27o33j135p12K46
55143I3817K41n70n48J94l04k148k942j607P6O43O79N76m08j789j593L11J542
55126H6170R67K85O37P05l49r84p7R40N63m48q61r52j149p67M38J329J331J387
$$ plain form
55108 89165 91055 92758 93122 92306 91388 90711 90103 90092 91225 92773 93754 94617 96246 98007 98632 98466 98951
55091 98951 100310 101594 102575 103721 104647 104533 103872 104032 105191 106320 106980 107532 107841 107403 106559 106093 105845
55074 105845 105237 104772 105461 107017 108143 108341 108038 107323 106111 105144 105265 106005 106272 105971 105532 104559 102663
55057 102663 101007 101039 102054 101976 100411 99023 98964 99728 100551 101233 101448 100849 100008 99897 100381 100462 99937 99551 99659
55038 99659 100028 100719 101868 102771 102430 100864 98868 96906 95304 94790 95533 96242 95623 94167 93228 93067 93203
55021 93203 93751 94777 95247 94420 93533 94216 95999 97279 97965 99019 100108 100044 99063 98392 97929 96713 95373
55004 95373 95676 97678 99725 101257 103303 106014 108060 108829 109138 109320 108654 107072 105591 104654 103750 102935
54988 102935 103003 103926 104808 105558 106877 108537 109465 109613 109950 110543 110478 109754 109286 108975 107750 105665 103995 103128
$$ packed form
55108H9165J890J703L64q16r18o77o08j1J133J548R81Q63J629J761O25j66M85
55091I8951J359J284R81J146R26j14o61J60J159J129O60N52L09m38q44m66k48
55074A05845o08m65O89J556J126J98l03p15j212r67J21P40K67l01m39r73j896
55057A02663j656L2J015p8j565j388n9P64Q23O82K15n99q41j11M84Q1n25l86J08
55038I9659L69O91J149R03l41j566j996j962j602n14P43P09o19j456r39j61J36
55021I3203N48J026M70q27q87O83J783J280O86J054J089o4r81o71m63j216j340
55004I5373L03K002K047J532K046K711K046P69L09J82o66j582j481r37r04q15
54988A02935O8R23Q82P50J319J660R28J48L37N93o5p24m68l11j225k085j670q67
$$ plain form
54970 103128 102403 102087 103233 105342 106544 106639 107611 110430 113522 115285 116043 116552 116530 115790 115178 115347 115940
54953 115940 116667 117733 118616 118087 116152 114440 113939 113901 113568 113364 113660 113892 113708 113600 113772 113778 113785 114692 116455
54934 116455 117850 118417 119027 120004 120487 120394 121212 123920 127690 131509 135582 140199 144793 149097 153926 159835
54918 159835 166257 172729 179614 186742 192627 195925 196576 194890 190807 184788 178129 171574 164746 157520
54904 157520 150695 144748 139339 134593 131418 129843 128500 126504 124436 122844 121295 119710 119029 119653 120686
54889 120686 121605 123222 126074 129297 132057 134617 137086 138730 139646 141647 146156 152458 159153 166021 173296
54874 173296 180376 186582 192024 196520 198812 198136 195508 192212 188050 182361 175692 169061 162471 155584
54860 155584 149146 144325 141071 138339 135577 133077 131245 130296 130220 130460 130182 129291 128478 127908 126898 125334
$$ packed form
54970A03128p25l16J146K109J202R5R72K819L092J763P58N09k2p40o12J69N93
54953A15940P27J066Q83n29j935j712n01l8l33k04K96K32j84j08J72OPR07J763
54934A16455J395N67O10R77M83r3Q18K708L770L819M073M617M594M304M829N909
54918A59835O422O472O885P128N885L298O51j686m083o019o659o555o828p226
54904A57520o825n947n409m746l175j575j343j996k068j592j549j585o81O24J033
54889A20686R19J617K852L223K760K560K469J644R16K001M509O302O695O868P275
54874A73296P080O206N442M496K292o76k628l296m162n689o669o631o590o887
54860A55584o438m821l254k732k762k500j832r49p6K40k78q91q13n70j010j564
$$ plain form
54844 125334 124147 123736 123127 121485 119252 117013 114554 111966 110347 110249 110565 110164 109542 109656 110195 110361 110396
54827 110396 110871 111256 110655 109475 108989 109545 110334 110652 110449 109927 109436 109447 109935 110176 109736 109173 109240 109980 111109
54808 111109 112570 114152 115287 115775 116077 116501 116911 117547 119044 121176 122759 123393 124042 125206 125855 125068
54792 125068 123511 122277 121418 120660 120409 120900 121360 121208 121212 122346 124357 126470 128583 130676 131992 132072 131819
54775 131819 132396 133732 135186 136939 139632 143332 147884 153593 160578 168178 175930 184292 193396 201988
54761 201988 208781 214037 218612 222165 223561 222460 219354 214613 208619 202279 196349 190656 184818 179112
54747 179112 173855 168741 163654 159228 155635 151823 147153 142871 140602 140074 139646 138486 136968 135566 134564
54732 134564 134400 135151 136194 137344 139571 143498 148042 151858 155380 159926 165434 170641 175161 179885 185409
$$ packed form
54844A25334j187m11o09j642k233k239k459k588j619r8L16m01o22J14N39J66L5
54827A10396M75L85o01j180m86N56P89L18k03n22m91J1M88K41m40n63O7P40J129
54808A11109J461J582J135M88L02M24M10O36J497K132J583O34O49J164O49p87
54792A25068j557j234q59p58k51M91M60j52MJ134K011K113K113K093J316Q0k53
54775A31819N77J336J454J753K693L700M552N709O985P600P752Q362R104Q592
54761B01988O793N256M575L553J396j101l106m741n994o340n930n693n838n706
54747A79112n257n114n087m426l593l812m670m282k269n28m28j160j518j402j002
54732A34564j64P51J043J150K227L927M544L816L522M546N508N207M520M724N524
$$ plain form
54717 185409 191293 196701 200706 202218 200702 196847 191697 185531 178447 171371 165361 160317 155488 150828
54703 150828 146802 143378 140302 137978 136898 136535 135817 134412 132711 130994 129544 128964 129311 129470 128498 127085
54687 127085 126585 127114 127689 127794 127630 127224 126413 125383 124263 122588 120140 117799 116596 116418 116578 116961 117620
54670 117620 118007 117813 117829 118699 119538 119142 117910 117141 117006 116733 116311 116400 116868 116914 116455 116061 115778 115304 114987
54651 114987 115319 115720 115202 113970 113137 113120 113584 114514 115964 117163 117380 117365 118435 120305 121419 121261 120840
54634 120840 120927 121296 121717 122277 122644 122224 121134 119985 118895 117821 117367 117900 118351 117487 116014 115626 116256
54617 116256 116215 115101 114545 115629 117418 118662 119402 120153 120847 121293 121640 121830 121532 120974 120880 121299 121535 121453
54599 121453 121822 123028 124439 125305 125476 125090 124452 124278 125104 126372 126957 126605 125939 125264 124406 123579 123144 122650
$$ packed form
54717A85409N884N408M005J512j516l855n150o166p084p076o010n044m829m660
54703A50828m026l424l076k324j080l63p18j405j701j717j450n80L47J59r72j413
54687A27085n00N29N75J05j64m06q11j030j120j675k448k341j203j78J60L83O59
54670A17620L87j94J6Q70Q39l96j232p69j35k73m22Q9M68M6m59l94k83m74l17
54651A14987L32M01n18j232q33j7M64R30J450J199K17j5J070J870J114j58m21
54634A20840Q7L69M21N60L67m20j090j149j090j074m54N33M51q64j473l88O30
54617A16256m1j114n56J084J789J244P40P51O94M46L47J90k98n58r4M19K36q2
54599A21453L69J206J411Q66J71l86o38j74Q26J268N85l52o66o75q58q27m35m94
$$ plain form
54581 122650 121399 119898 119444 120262 121354 122196 123123 123969 123854 122701 121562 121035 120600 119860 119189 118782 118260
54564 118260 117633 117522 118056 118643 119166 120285 122207 124232 125833 127134 128077 128302 128148 128589 129788 130847
54548 130847 131382 132160 133711 135458 136708 137529 138144 138488 138856 139991 142020 144075 145426 146182 146592 146522 145942
54531 145942 145138 144188 142976 141777 141005 140430 139647 139173 139797 140910 140966 139803 138940 139132 139228 138129 136446
54514 136446 135358 135065 135199 135673 136266 136297 135624 135174 135734 136859 137595 137606 137080 136212 135356 135038 135309 135665 135849
54495 135849 136115 136542 136900 137343 138307 139502 140023 139700 139353 139433 139504 139385 139620 140412 141205 141856 143087 145233
54477 145233 147513 149128 150112 150643 150646 150602 151552 153582 155419 156298 157141 158959 161133 162311 162309 162105 162459 163404
54459 163404 164684 165892 166507 166322 165579 164421 162671 160436 158267 156464 154837 153423 152681 152710 153028 153325
$$ packed form
54581A22650j251j501m54Q18J092Q42R27Q46j15j153j139n27m35p40o71m07n22
54564A18260o27j11N34N87N23J119J922K025J601J301R43K25j54M41J199J059
54548A30847N35P78J551J747J250Q21O15L44L68J135K029K055J351P56M10p0n80
54531A45942q04r50j212j199p72n75p83m74O24J113N6j163q63J92R6j099j683
54514A36446j088k93J34M74N93L1o73m50N60J125P36J1n26q68q56l18K71L56J84
54495A35849K66M27L58M43R64J195N21l23l47Q0P1j19K35P92P93O51J231K146
54477A45233K280J615R84N31Lm4R50K030J837Q79Q43J818K174J178kk04L54R45
54459A63404J280J208O15j85p43j158j750k235k169j803j627j414p42K9L18K97
$$ plain form
54443 153325 153606 153432 152067 149794 148072 147850 148561 149201 149468 149384 148744 147599 146563 146144 146358 147181 148569
54426 148569 149838 150069 149410 148935 148991 148868 148373 148370 149217 150018 150194 150505 151679 153160 154062 154334 154133 153107
54408 153107 151285 149759 149518 150248 151026 151478 151672 151745 152251 153930 156452 158339 158799 158618 158644 158626 158401 158887
54390 158887 160732 163038 164618 165621 166719 167594 167536 166840 166315 165955 165268 164530 164517 165324 166338 167118 167585
54373 167585 167708 167679 167939 168493 168801 168861 169570 171390 173530 175208 176807 178951 181361 183593 185959 188609
54357 188609 190525 190712 189779 189174 189315 189501 189125 187964 185796 182801 179934 177882 176081 173646 170763 168269
54341 168269 166444 165146 164545 164669 164683 163719 162039 160519 159462 158786 158767 159494 160089 159615 158407 157541 157370
54324 157370 157523 157868 158470 158994 159213 159678 160823 161837 161560 160174 158883 158123 157242 155818 154255 153076
$$ packed form
54443A53325K81j74j365k273j722k22P11O40K67q4o40j145j036m19K14Q23J388
54426A48569J269K31o59m75N6j23m95lQ47Q01J76L11J174J481R02K72k01j026
54408A53107j822j526k41P30P78M52J94P3N06J679K522J887M60j81K6j8k25M86
54390A58887J845K306J580J003J098Q75n8o96n25l60o87p38j3Q07J014P80M67
54373A67585J23k9K60N54L08O0P09J820K140J678J599K144K410K232K366K650
54357A88609J916J87r33o05J41J86l76j161k168k995k867k052j801k435k883k494
54341A68269j825j298o01J24J4r64j680j520j057o76j9P27N95m74j208q66j71
54324A57370J53L45O02N24K19M65J145J014k77j386j291p60q81j424j563j179
$$ plain form
54308 153076 152489 152561 153075 153411 153250 153137 153661 154523 155209 156043 157576 159356 160402 160634 160766 160962 160642 159542
54290 159542 158074 156637 155334 154359 153945 154016 154389 155136 156292 157665 159438 162270 166118 169606 171454 171946
54274 171946 172136 172249 171886 171099 170137 168637 166305 163982 162797 162623 162540 162449 162959 163964 164726 165305 166613
54257 166613 168951 171591 173841 175546 176588 176906 177023 177626 178619 179380 179766 180003 179860 178904 177376 175866
54241 175866 174390 172746 171436 171039 170950 170045 168453 167352 167053 166661 165767 165133 165344 165925 166230 166289 166420 166825
54223 166825 167783 169451 171262 172300 172473 172589 173138 173677 173514 172421 170705 169169 168781 169612 170365 169798 168365
54206 168365 167496 167537 167568 167149 166903 167240 167658 167647 167335 166913 166229 165178 163829 162176 160492 159810 161040 163603
54188 163603 165855 166918 167181 167102 166684 166226 166430 167414 168529 169402 170321 171479 172703 174054 175736 177301
$$ packed form
54308A53076n87P2N14L36j61j13N24Q62O86Q34J533J780J046K32J32J96l20j100
54290A59542j468j437j303r75m14P1L73P47J156J373J773K832L848L488J848M92
54274A71946J90J13l63p87r62j500k332k323j185j74q3r1N10J005P62N79J308
54257A66613K338K640K250J705J042L18J17O03R93P61L86K37j43r56j528j510
54241A75866j476j644j310l97q9r05j592j101k99l92q94o34K11N81L05N9J31M05
54223A66825R58J668J811J038J73J16N49N39j63j093j716j536l88Q31P53n67j433
54206A68365q69M1L1m19k46L37M18j1l12m22o84j051j349j653j684o82J230K563
54188A63603K252J063K63p9m18m58K04R84J115Q73R19J158J224J351J682J565
$$ plain form
54172 177301 177920 177614 177215 176946 176099 174328 172255 170440 168794 167358 166636 166665 166587 165656 164004 162117 160325
54155 160325 159056 158781 159322 159936 160305 160705 161044 160652 159344 157835 156738 155970 155448 155474 156070 156735 157267 158012
54137 158012 158938 159363 159084 158940 159672 160941 162056 162984 163990 164840 165016 164430 163505 162843 163020 164217 165851
54120 165851 167033 167585 168086 168863 169638 170382 171607 173479 175401 177000 178839 181618 185223 189075 192944
54105 192944 196909 200909 204781 208382 211308 212843 212621 211130 209278 207635 206211 204673 202657 200178
54091 200178 197793 196025 194656 193036 191079 189437 188561 188082 187280 185875 184260 183210 183258 184076 184735 184878
54075 184878 185232 186448 188026 189216 190488 192954 196587 200158 202956 205405 207882 210043 211554 212462 212552
54060 212552 211328 209016 206784 205593 205516 206292 207714 209265 210274 210722 211240 212173 213435 215293 218228 221775
$$ packed form
54172A77301O19l06l99k69q47j771k073j815j646j436p22K9p8r31j652j887j792
54155A60325j269k75N41O14L69M00L39l92j308j509j097p68n22K6N96O65N32P45
54137A58012R26M25k79j44P32J269J115R28J006Q50J76n86r25o62J77J197J634
54120A65851J182N52N01P77P75P44J225J872J922J599J839K779L605L852L869
54105A92944L965M000L872L601K926J535k22j491j852j643j424j538k016k479
54091B00178k385j768j369j620j957j642q76m79q02j405j615j050M8Q18O59J43
54075A84878L54J216J578J190J272K466L633L571K798K449K477K161J511R08R0
54060B12552j224k312k232j191p7P76J422J551J009M48N18R33J262J858K935L547
$$ plain form
54044 221775 224602 226181 227537 229964 233807 238793 244629 250849 256879 262702 268777 275144 281394 287651
54030 287651 294610 302386 310387 318622 327912 338311 348443 357050 364246 370628 376124 380431 383681 385943
54016 385943 386859 386438 385438 384287 382380 379149 375113 371172 367489 363703 359564 354743 348699 341408 333699
54001 333699 326305 319199 312359 306374 301608 297422 292998 288420 284339 281070 278583 276834 275519 273975
53987 273975 271788 269053 265811 262007 258266 255742 254631 253776 252368 251099 250831 251076 250758 249785 248909 248611
53971 248611 249030 250480 253164 256742 260913 266007 272366 279675 287406 295122 301630 304814 303503 299015
53957 299015 293783 288902 283984 278861 274172 270486 267973 266867 267280 268577 269795 270760 272127 274388 277549
53942 277549 281607 286582 291992 296939 300932 304310 307907 312531 318462 325069 331142 335988 339936 343551
$$ packed form
54044B21775K827J579J356K427L843M986N836O220O030N823O075O367O250O257
54030B87651O959P776Q001Q235R290J0399J0132Q607P196O382N496M307L250K262
54016C85943R16m21j000j151j907l231m036l941l683l786m139m821o044p291p709
54001C33699p394p106o840n985m766m186m424m578m081l269k487j749j315j544
53987B73975k187k735l242l804l741k524j111q55j408j269k68K45l18r73q76k98
53971B48611M19J450K684L578M171N094O359P309P731P716O508L184j311m488
53957B99015n232m881m918n123m689l686k513j106M13J297J218R65J367K261L161
53942B77549M058M975N410M947L993L378L597M624N931O607O073M846L948L615
$$ plain form
53928 343551 346898 349945 353121 356816 360814 364802 369026 373880 379312 385251 392076 399945 408139 415896
53914 415896 423511 431759 440581 449301 457974 467546 478595 490661 502851 514562 525526 535599 544515
53901 544515 551539 555643 556492 554982 552325 548908 544557 539594 534848 530707 526762 522368 517031 510385
53887 510385 502327 493183 483374 473023 462221 451363 440798 430338 419633 408849 398535 388997
53875 388997 380255 372446 365739 359901 354331 348528 342359 336048 330083 324819 319934 314658 308738 302758
53861 302758 297264 292165 287421 283703 281638 280740 279750 277847 275087 271894 268658 265641 262851 260107 257460
53846 257460 255245 253519 251860 250064 248623 248110 248436 249036 249397 249195 248323 247122 246134 245473 244924 244716 245332
53829 245332 246397 246787 246271 246023 246848 247945 248203 247739 247284 246964 246732 247142 248479 249802 250100 249873 250433
$$ packed form
53928C43551L347L047L176L695L998L988M224M854N432N939O825P869Q194P757
53914D15896P615Q248Q822Q720Q673R572J1049J2066J2190J1711J0964J0073Q916
53901E44515P024M104Q49j510k657l417m351m963m746m141l945m394n337o646
53887E10385q058r144r809j0351j0802j0858j0565j0460j0705j0784j0314r538
53875C88997q742p809o707n838n570n803o169o311n965n264m885n276n920n980
53861C02758n494n099m744l718k065q98r90j903k760l193l236l017k790k744k647
53846B57460k215j726j659j796j441n13L26O00L61k02q72j201r88o61n49k08O16
53829B45332J065L90n16k48Q25J097K58m64m55l20k32M10J337J323K98k27N60
$$ plain form
53812 250433 252070 254145 256531 259634 263194 266403 269196 272327 276134 280307 284897 290480 297138 304158
53798 304158 310928 317494 324204 331465 339756 349125 358663 367222 374583 381304 387581 393000 397299 400560
53784 400560 402726 403724 404005 404187 404186 403462 402016 400311 398186 394763 389624 383355 376712 369886 362839 355858
53768 355858 349471 344051 339491 335072 329833 323469 316703 310458 304953 299924 295258 290843 286278 281492
53754 281492 277303 274551 272914 271310 269280 267210 265343 263327 260771 257662 254349 251514 249877 249381
53740 249381 249079 248390 247959 248572 249721 250179 249609 248657 247755 246889 246324 246431 246829 246712 246085 245816 246399 247423
53722 247423 248294 248777 248840 248678 248884 249953 251753 253959 256651 259753 262361 263615 263915 264273 264752 264682 264235
53705 264235 264494 265932 267936 270029 272568 276011 280360 285480 291155 296771 301684 305887 309589 312359
$$ packed form
53812B50433J637K075K386L103L560L209K793L131L807M173M590N583O658P020
53798C04158O770O566O710P261Q291R369R538Q559P361O721O277N419M299L261
53784D00560K166R98K81J82jp24j446j705k125l423n139o269o643o826p047o981
53768C55858o387n420m560m419n239o364o766o245n505n029m666m415m565m786
53754B81492m189k752j637j604k030k070j867k016k556l109l313k835j637m96
53740B49381l02o89m31O13J149M58n70r52r02q66n65J07L98j17o27k69N83J024
53722B47423Q71M83O3j62K06J069J800K206K692L102K608J254L00L58M79p0m47
53705B64235K59J438K004K093K539L443M349N120N675N616M913M203L702K770
$$ plain form
53691 312359 313673 314152 315167 317241 319874 322810 326207 329533 331657 332396 332769 333333 333416 332457 331040 329984
53675 329984 329284 328555 327811 327265 326917 326779 327010 327574 328227 328969 329910 330688 330720 330107 329543 329302 329030 328636 328516
53656 328516 328806 329194 329538 329915 330036 329520 328763 328568 328826 328589 327598 326666 326330 326161 325756 325402 325411 325752 326689
53637 326689 328829 332061 335289 337678 339433 341056 342621 344078 345548 347072 348742 351123 354656 358659
53623 358659 361914 364344 366954 370080 373000 375496 378322 381630 384354 385836 386844 388263 389974 391718
53609 391718 393874 396577 399248 401811 405191 409700 414091 417312 420091 423569 427360 430346 432607 435107
53595 435107 437994 440553 442572 444481 446300 447570 448254 448759 449170 449319 449367 449478 449049 447238 444331 441724
53579 441724 440359 439799 439017 437563 435725 433872 431905 429376 426146 422786 420036 417901 415769 413450 411525
$$ packed form
53691C12359J314M79J015K074K633K936L397L326K124P39L73N64Q3r59j417j056
53675C29984p00p29p44n46l48j38K31N64O53P42R41P78L2o13n64k41k72l94j20
53656C28516K90L88L44L77J21n16p57j95K58k37r91r32l36j69m05l54RL41R37
53637C26689K140L232L228K389J755J623J565J457J470J524J670K381L533M003
53623C58659L255K430K610L126K920K496K826L308K724J482J008J419J711J744
53609C91718K156K703K671K563L380M509M391L221K779L478L791K986K261K500
53595D35107K887K559K019J909J819J270O84N05M11J49M8J11m29j811k907k607
53579D41724j365n60p82j454j838j853j967k529l230l360k750k135k132k319j925
$$ plain form
53564 411525 410448 409917 409432 408962 408717 408720 408959 409483 410087 410342 410167 409945 409967 410271 411078 412601 414317 415271 415386
53545 415386 415564 416303 417206 418242 420251 423499 426869 429377 431578 434508 438077 441658 445579 450793 457377
53530 457377 464403 471140 477622 484230 491402 499546 508652 518211 527957 538274 549468 561261 573522
53517 573522 586735 600992 615330 629018 642898 658343 675347 692832 710543 729427 750194
53506 750194 772633 796449 821758 848412 875579 902425 928692 954455 979673 1004167 1027740
53495 1027740 1050206 1071554 1092095 1112312 1132627 1153332 1174458 1195545 1215914 1235352 1254231
53484 1254231 1272868 1291275 1309690 1328640 1348140 1367453 1386069 1404310 1422568 1440698 1458699
53473 1458699 1477166 1496204 1514426 1529932 1542006 1551235 1558387 1563880 1567887 1570185 1570138 1567454 1562570
$$ packed form
53564D11525j077n31m85m70k45LK39N24O04K55j75k22K2L04Q07J523J716R54J15
53545D15386J78P39R03J036K009L248L370K508K201K930L569L581L921N214O584
53530D57377P026O737O482O608P172Q144R106R559R746J0317J1194J1793J2261
53517E73522J3213J4257J4338J3688J3880J5445J7004J7485J7711J8884K0767
53506G50194K2439K3816K5309K6654K7167K6846K6267K5763K5218K4494K3573
53495A027740K2466K1348K0541K0217K0315K0705K1126K1087K0369J9438J8879
53484A254231J8637J8407J8415J8950J9500J9313J8616J8241J8258J8130J8001
53473A458699J8467J9038J8222J5506J2074R229P152N493M007K298m7k684m884
$$ plain form
53460 1562570 1555718 1546137 1533116 1517474 1501192 1485747 1471418 1457846 1444423 1430381 1415322 1399631
53448 1399631 1383712 1367075 1348879 1329248 1309305 1289979 1271313 1252847 1234132 1215058 1196226
53437 1196226 1178817 1163625 1150443 1138851 1129135 1121806 1116640 1112972 1110654 1109866 1110165 1110546 1110510 1110459 1111110
53422 1111110 1113078 1116884 1122761 1130436 1139472 1149712 1161118 1173623 1187587 1203882 1222894 1243861
53410 1243861 1265828 1288793 1313186 1338776 1365027 1392194 1421025 1451613 1483484 1516655 1551613
53399 1551613 1588290 1626029 1664671 1704854 1747162 1791723 1838688 1888277 1940145 1993323 2046983
53388 2046983 2100896 2155260 2210640 2267805 2326823 2386319 2444330 2499974 2553656 2605782 2656061
53377 2656061 2704097 2749821 2793035 2833151 2869684 2902602 2932028 2957891 2979878 2997477 3010206
$$ packed form
53460A562570o852r581j3021j5642j6282j5445j4329j3572j3423j4042j5059j5691
53448A399631j5919j6637j8196j9631j9943j9326j8666j8466j8715j9074j8832
53437A196226j7409j5192j3182j1592r716p329n166l668k318p88K99L81l6n1O51
53422A111110J968L806N877P675R036J0240J1406J2505J3964J6295J9012K0967
53410A243861K1967K2965K4393K5590K6251K7167K8831L0588L1871L3171L4958
53399A551613L6677L7739L8642M0183M2308M4561M6965M9589N1868N3178N3660
53388B046983N3913N4364N5380N7165N9018N9496N8011N5644N3682N2126N0279
53377B656061M8036M5724M3214M0116L6533L2918K9426K5863K1987J7599J2729
$$ plain form
53366 3010206 3018157 3021968 3021731 3016181 3003577 2983202 2955502 2921223 2881218 2836885 2789842 2741093
53354 2741093 2691110 2640528 2589961 2539275 2487969 2436285 2385250 2335703 2288155 2243347 2201814
53343 2201814 2162687 2123999 2084492 2044274 2003510 1961639 1918489 1875284 1833734 1794570 1757571
53332 1757571 1722541 1689593 1658749 1629860 1602926 1578203 1556000 1536459 1519266 1503476 1487842
53321 1487842 1471524 1454320 1436246 1417225 1397352 1377223 1357789 1339910 1323972 1309756 1296675
53310 1296675 1284289 1272553 1261620 1251752 1243559 1237850 1234843 1233765 1233613 1234034 1235191 1237238 1240486 1245696
53296 1245696 1253512 1263782 1275962 1289937 1305861 1323459 1342196 1362035 1383433 1406626 1431401
53285 1431401 1457322 1483664 1509441 1534197 1558523 1583032 1607032 1628971 1648103 1664922 1680018
$$ packed form
53366C010206P951L811k37n550j2604k0375k7700l4279m0005m4333m7043m8749
53354B741093m9983n0582n0567n0686n1306n1684n1035m9547m7548m4808m1533
53343B201814l9127l8688l9507m0218m0764m1871m3150m3205m1550l9164l6999
53332A757571l5030l2948l0844k8889k6934k4723k2203j9541j7193j5790j5634
53321A487842j6318j7204j8074j9021j9873k0129j9434j7879j5938j4216j3081
53310A296675j2386j1736j0933r868q193n709l007j078j52M21J157K047L248N210
53296A245696P816J0270J2180J3975J5924J7598J8737J9839K1398K3193K4775
53285A431401K5921K6342K5777K4756K4326K4509K4000K1939J9132J6819J5096
$$ plain form
53274 1680018 1693324 1704492 1713213 1718993 1721276 1719995 1715604 1708558 1699256 1688300 1676135 1662460 1646620
53261 1646620 1628502 1608461 1586514 1562369 1536247 1508924 1480956 1452526 1424046 1396125 1368821
53250 1368821 1341585 1314122 1286706 1259614 1232850 1206517 1180917 1156153 1132071 1108534 1085272
53239 1085272 1061621 1037045 1011882 987005 962863 939412 916733 894963 873822 853031 833111
53228 833111 814939 798587 783412 769196 756394 745253 735547 727055 719362 711217 701164 688990
53216 688990 675710 662046 647791 632710 616974 600565 583345 565974 549748 535155 521523
53205 521523 508425 496428 485991 476567 467356 458154 448986 439714 430575 422342 415317 408693 401459
53192 401459 393456 385154 376945 369104 361934 355482 349489 343897 338979 334830 331213 328006 325153 322073
$$ packed form
53274A680018J3306J1168Q721N780K283j281m391p046r302j0956j2165j3675j5840
53261A646620j8118k0041k1947k4145k6122k7323k7968k8430k8480k7921k7304
53250A368821k7236k7463k7416k7092k6764k6333k5600k4764k4082k3537k3262
53239A085272k3651k4576k5163k4877k4142k3451k2679k1770k1141k0791j9920
53228H33111j8172j6352j5175j4216j2802j1141r706q492p693q145j0053j2174
53216F88990j3280j3664j4255j5081j5736j6409j7220j7371j6226j4593j3632
53205E21523j3098j1997j0437r424r211r202r168r272r139q233p025o624p234
53192D01459q003q302q209p841p170o452n993n592m918m149l617l207k853l080
$$ plain form
53178 322073 317965 312965 308257 304686 301973 299561 297430 295650 293913 292060 290373 288848 286858 284107
53164 284107 281370 279665 279105 279033 278905 278561 278017 277425 276984 276589 275842 274582 273108 271819 271025 271037 271835 272645
53146 272645 272553 271621 270673 269961 268947 267507 266248 265319 263983 261988 260384 260238 261219 262173 262523 262512 262606 263297
53128 263297 264989 267518 270136 272314 274157 275795 277067 278180 279920 282608 285435 287384 288371 289026 289972
53113 289972 291713 294662 298657 302817 306293 308750 309970 309740 308517 307380 306710 305577 302981 299145 295081
53098 295081 291563 288983 287466 286484 285030 282855 280884 279782 278856 277142 274794 272453 269970 266909 263924
53083 263924 262368 262580 263501 264024 263979 263752 263607 263524 263253 262472 261210 259996 259261 258860 258506 258374 258792 259589
53065 259589 260227 260418 260237 259823 259332 258977 258786 258505 257981 257418 257050 256829 256624 256371 255885 254994 254015 253623 254050
$$ packed form
53178C22073m108n000m708l571k713k412k131j780j737j853j687j525j990k751
53164B84107k737j705n60p2j28l44n44n92m41l95p47j260j474j289p94J2P98Q10
53146B72645r2r32r48p12j014j440j259r29j336j995j604j46R81R54L50j1R4O91
53128B63297J692K529K618K178J843J638J272J113J740K688K827J949R87O55R46
53113B89972J741K949L995M160L476K457J220k30j223j137o70j133k596l836m064
53098B95081l518k580j517r82j454k175j971j102r26j714k348k341k483l061k985
53083B63924j556K12R21N23m5k27j45q3k71p81j262j214p35m01l54j32M18P97
53065B59589O38J91j81m14m91l55j91k81n24n63l68k21k05k53m86q91r79l92M27
$$ plain form
53046 254050 254906 255943 257335 258991 260297 260886 260998 260809 260167 259328 259047 259447 259643 259115 258622 259044 260099
53029 260099 261024 261800 262770 263646 263919 263813 263928 264225 264267 264203 264620 265554 266371 266573 266171 265405 264625 264348 264943
53010 264943 266354 268270 270297 271793 272169 271696 271440 271959 272694 273021 273180 273591 273981 273927 273666 273648 273816 274024
52992 274024 274577 275684 276917 277907 278983 280458 281880 282748 283348 284184 285293 286847 289595 293636 297589
52977 297589 300107 301565 303031 304245 304130 302854 301799 301536 301284 300479 299586 299144 299110 299416 300214 301327 302326
52960 302326 303341 305005 307359 309523 310618 310473 309342 307586 305714 304140 302814 301453 300093 298986
52946 298986 298142 297392 296658 295710 294136 292067 290415 289682 289101 287793 286204 285323 284970 284143 282817 282053 282291
52929 282291 282739 282642 282101 281405 280623 280171 280864 282897 285372 287206 288037 288073 287543 286560 285181 283552 282158
$$ packed form
53046B54050Q56J037J392J656J306N89J12j89o42q39k81M00J96n28m93M22J055
53029B60099R25P76R70Q76K73j06J15K97M2o4M17R34Q17K02m02p66p80k77N95
53010B64943J411J916K027J496L76m73k56N19P35L27J59M11L90n4k61j8J68K08
52992B74024N53J107J233R90J076J475J422Q68O00Q36J109J554K748M041L953
52977B97589K518J458J466J214j15j276j055k63k52q05q93m42l4L06P98J113R99
52960C02326J015J664K354K164J095j45j131j756j872j574j326j361j360j107
52946B98986q44p50p34r48j574k069j652p33n81j308j589q81l53q27j326p64K38
52929B82291M48r7n41o96p82m52O93K033K475J834Q31L6n30r83j379j629j394
$$ plain form
52912 282158 281684 282279 283279 284056 284683 285214 284939 283219 280634 278374 276850 275799 275377 275984 277206 278048
52896 278048 278247 278405 278895 279545 280323 281376 282429 283025 283306 283652 283729 282912 281477 280282 279396 278204 276849
52879 276849 276281 276742 277446 278018 279048 280890 283010 285005 287233 289933 292623 294913 297175 299915 303064
52864 303064 306246 309152 311389 312557 312700 312147 310832 308387 304970 301314 297908 294725 291730 288906 285864
52849 285864 282236 278475 275402 273039 270692 268103 265584 263088 260220 257139 254384 251831 248951 246163
52835 246163 244677 244841 245780 246802 247948 249033 249559 249882 251081 253181 254879 255555 256184 257629 259315 260403
52819 260403 260981 261243 260663 259048 257459 257029 257607 258447 259490 261022 262714 263920 264572 265036 265552 266254 267271
52802 267271 268299 268669 268204 267376 266387 264966 263344 262333 261873 260687 258122 255355 253874 253730 254122 254735
$$ packed form
52912B82158m74N95J000P77O27N31k75j720k585k260j524j051m22O07J222Q42
52896B78048J99J58M90O50P78J053J053N96K81L46P7q17j435j195q86j192j355
52879B76849n68M61P04N72J030J842K120J995K228K700K690K290K262K740L149
52864C03064L182K906K237J168J43n53j315k445l417l656l406l183k995k824l042
52849B85864l628l761l073k363k347k589k519k496k868l081k755k553k880k788
52835B46163j486J64R39J022J146J085N26L23J199K100J698O76O29J445J686J088
52819B60403N78K62n80j615j589m30N78Q40J043J532J692J206O52M64N16P02J017
52802B67271J028L70m65q28r89j421j622j011m60j186k565k767j481j44L92O13
$$ plain form
52786 254735 255505 255869 255354 254352 253441 252556 251632 251278 251812 252357 251970 251128 251016 251848 252894 253743 254510 255136
52768 255136 255460 255696 256044 256154 255770 255389 255485 255553 254882 253842 253413 253811 254548 255481 256775 258081 258841 259254
52750 259254 260005 261160 262180 262872 263483 264070 264627 265644 267600 270082 272272 274102 275997 277801 279046
52735 279046 280181 282231 285158 287715 289214 290377 291981 293667 294694 295156 295826 297174 298966 300534 301173
52720 301173 300615 299295 297886 296565 295078 293476 292189 291319 290428 289245 288161 287782 288341 289608 291031
52705 291031 291906 291840 291154 290497 290047 289506 288836 288414 288295 287906 286837 285516 284716 284631 284800 284781 284578 284426 284375
52686 284375 284241 283857 283300 282750 282246 281768 281534 281883 282674 283162 282745 281599 280278 278937 277347 275544 273958
52669 273958 272914 272397 272369 272947 274064 275205 275716 275414 274812 274670 275311 276396 277461 278553 280073 282070
$$ packed form
52786B54735P70L64n15j002r11q85r24l54N34N45l87q42j12Q32J046Q49P67O26
52768B55136L24K36L48J10l84l81R6O8o71j040m29L98P37R33J294J306P60M13
52750B59254P51J155J020O92O11N87N57J017J956K482K190J830J895J804J245
52735B79046J135K050K927K557J499J163J604J686J027M62O70J348J792J568O39
52720C01173n58j320j409j321j487j602j287q70q91j183j084l79N59J267J423
52705B91031Q75o6o86o57m50n41o70m22j19l89j069j321q00q5J69j9k03j52n1
52686B84375j34l84n57n50n04m78k34L49P91M88m17j146j321j341j590j803j586
52669B73958j044n17k8N78J117J141N11l02o02j42O41J085J065J092J520J997
$$ plain form
52653 282070 284084 285785 287393 289303 291664 294508 297934 301801 305464 308075 309085 308381 306291 303650
52639 303650 301455 300101 299130 297938 296460 294906 293203 291133 288821 286728 285263 284701 285292 287040 289388
52624 289388 291468 292753 293316 293399 292846 291149 288177 284766 282254 281228 281041 280818 280562 280827 281675 282665 283592
52607 283592 284426 284692 283889 282568 282048 282843 284183 285294 286235 287188 287858 288070 288128 288104 287541 286373 285307 284855
52589 284855 284758 284878 285765 287653 289719 291075 291774 292172 292141 291781 292069 293792 296407 298917 301221 303627 305641
52572 305641 306433 306124 305526 304870 303835 302572 301676 301313 301272 301642 302526 303281 302997 301567 299473 296797 293440
52555 293440 290102 287944 287267 287406 287779 288122 287901 286721 285334 285075 286053 286945 286817 286163 285824 285871 286040 286445
52537 286445 287279 288374 289514 290754 292085 293218 293937 294342 294538 294523 294468 294715 295334 296029 296607 297237 298201 299691
$$ packed form
52653B82070K014J701J608J910K361K844L426L867L663K611J010p04k090k641
52639C03650k195j354r71j192j478j554j703k070k312k093j465n62N91J748K348
52624B89388K080J285N63Q3n53j697k972l411k512j026j87k23k56K65Q48R90R27
52607B83592Q34K66q03j321n20P95J340J111R41R53O70K12N8k4n63j168j066m52
52589B84855r7J20Q87J888K066J356O99L98l1l60K88J723K615K510K304K406K014
52572C05641P92l09n98o56j035j263q96l63m1L70Q84P55k84j430k094k676l357
52555B93440l338k158o77J39L73L43k21j180j387k59R78Q92j28o54l39M7J69M05
52537B86445Q34J095J140J240J331J133P19M05J96j5n5K47O19O95N78O30R64J490
$$ plain form
52519 299691 301737 303959 305621 306368 306767 307591 308814 309891 310835 312273 314475 317058 319664 322301 325006
52504 325006 327700 330310 332492 333391 332355 329747 326380 322405 317657 312909 309585 308048 307148 305793 304087
52489 304087 302628 301536 300619 299757 298684 297015 294924 293244 292482 292248 292044 292104 293020 294879 297126 299015
52473 299015 300028 300190 300151 300698 302114 304289 307267 311010 314729 317300 318613 319881 322272 325781 329605
52458 329605 333047 335694 337315 337970 337855 336827 334550 331254 327794 324706 321754 318613 315430 312409 309481
52443 309481 306811 305045 304531 304717 304765 304397 303746 302788 301504 300305 299772 299991 300485 300748 300632 300390 300500 301291
52425 301291 302528 303534 303890 303867 304032 304639 305531 306480 307480 308758 310483 312351 313637 313951 313811 314125 315203
52408 315203 316663 318249 320276 323227 327275 332203 337534 342839 348299 354770 362782 371554 379441 385152
$$ packed form
52519B99691K046K222J662P47L99Q24J223J077R44J438K202K583K606K637K705
52504C25006K694K610K182Q99j036k608l367l975m748m748l324j537r00j355j706
52489C04087j459j092r17q62j073j669k091j680p62k34k04O0R16J859K247J889
52473B99015J013J62l9N47J416K175K978L743L719K571J313J268K391L509L824
52458C29605L442K647J621O55j15j028k277l296l460l088k952l141l183l021k928
52443C09481k670j766n14J86M8l68o51r58j284j199n33K19M94K63j16k42J10P91
52425C01291J237J006L56k3J65O07Q92R49J000J278J725J868J286L14j40L14J078
52408C15203J460J586K027K951M048M928N331N305N460O471Q012Q772P887N711
$$ plain form
52394 385152 388079 387867 384638 379559 374234 369323 364475 359573 355119 351309 347809 344805 343212 343296 344004
52379 344004 344382 344796 345994 347612 348647 349024 349758 351704 354855 358862 363588 369029 375092 381516 387793
52364 387793 393139 396761 398226 397652 395770 393747 392494 391979 391483 390619 389730 389306 389497 390375 392041 394210
52348 394210 396161 397444 398242 398779 398959 398962 399637 401699 404809 408020 410893 413721 416896 420580 424982 430471
52332 430471 437238 444977 452909 460271 467056 474281 483162 493906 505719 518084 531477 546495 562824
52319 562824 579611 596444 613378 630156 646109 660956 675328 690245 706260 723244 740993
52308 740993 759844 780554 803443 827836 852577 877008 901255 925716 950596 975853 1001131
52297 1001131 1025725 1048965 1070703 1091132 1110180 1127373 1142174 1154053 1162430 1167225 1169465 1170657
$$ packed form
52394C85152K927k12l229n079n325m911m848m902m454l810l500l004j593Q4P08
52379C44004L78M14J198J618J035L77P34J946L151M007M726N441O063O424O277
52364C87793N346L622J465n74j882k023j253n15m96q64q89m24J91Q78J666K169
52348C94210J951J283P98N37J80LO75K062L110L211K873K828L175L684M402N489
52332D30471O767P739P932P362O785P225Q881J0744J1813J2365J3393J5018J6329
52319E62824J6787J6833J6934J6778J5953J4847J4372J4917J6015J6984J7749
52308G40993J8851K0710K2889K4393K4741K4431K4247K4461K4880K5257K5278
52297A001131K4594K3240K1738K0429J9048J7193J4801J1879Q377M795K240J192
$$ plain form
52285 1170657 1171443 1171363 1170022 1167720 1164746 1160782 1155519 1149361 1143117 1137266 1131847 1126732 1121807 1117182 1113366
52270 1113366 1110912 1109816 1109717 1110703 1113317 1117629 1122935 1128615 1134715 1141533 1149344 1158762 1170564 1184665
52256 1184665 1199945 1215595 1232023 1249897 1268919 1288265 1307722 1327647 1348052 1368410 1388078
52245 1388078 1406302 1422043 1434539 1444045 1451511 1457531 1462042 1464930 1466399 1466653 1465567 1462829 1458237
52232 1458237 1451821 1443763 1434284 1423671 1412488 1401543 1391259 1381178 1370511 1359225 1348097 1337673
52220 1337673 1327765 1318149 1309102 1300900 1293322 1286130 1279678 1274639 1271375 1269833 1269695 1270354 1271108 1271808 1273079
52205 1273079 1275615 1279444 1284113 1289320 1295056 1301329 1307986 1314744 1321363 1327924 1334878 1342531 1350619 1358803
52191 1358803 1367382 1376898 1387070 1396767 1405111 1411904 1417002 1420058 1421102 1420611 1418744 1415230 1410183 1404196
$$ packed form
52285A170657P86q0j341k302k974l964n263o158o244n851n419n115m925m625l816
52270A113366k454j096r9R86K614M312N306N680O100O818P811R418J1802J4101
52256A184665J5280J5650J6428J7874J9022J9346J9457J9925K0405K0358J9668
52245A388078J8224J5741J2496R506P466O020M511K888J469K54j086k738m592
52232A458237o416q058r479j0613j1183j0945j0284j0081j0667j1286j1128j0424
52220A337673r908r616r047q202p578p192o452n039l264j542j38O59P54P00J271
52205A273079K536L829M669N207N736O273O657O758O619O561O954P653Q088Q184
52191A358803Q579R516J0172R697Q344O793N098L056J044m91j867l514n047n987
$$ plain form
52177 1404196 1397343 1388981 1379052 1368747 1359356 1351121 1343650 1336747 1330304 1324130 1318487 1314073 1310859 1307684
$$ packed form
52177A404196o853q362r929j0305r391q235p471o903o443o174n643m414l214l175
$$ [...]
##END NTUPLES=NMR SPECTRUM
##END=
