##TITLE=AC1712_14FALM0001_8743523_LyKpv0qBwT
##JCAMPDX= 6.0         $$ Bruker NMR JCAMP-DX V2.0
##DATA TYPE= NMR SPECTRUM
##DATA CLASS= NTUPLES
##ORIGIN= BRUKER
##OWNER= Administrator
$$ 1.72 TOPSPIN		Version 2.1
$$ 2015-08-08 03:20:05.016 -0700  Administrator@X
$$ Compression mode = diff/dup
##.OBSERVE FREQUENCY= 400.02188249412
##.OBSERVE NUCLEUS= ^1H
##.ACQUISITION MODE= SIMULTANEOUS (DQD)
##.ACQUISITION SCHEME= undefined
##.AVERAGES= 64
##.DIGITISER RES= 22
##SPECTROMETER/DATA SYSTEM= spect
##.PULSE SEQUENCE= noesygpps1d.comp
##.SOLVENT NAME= COFFEE_meoh
##.SHIFT REFERENCE= INTERNAL, COFFEE_meoh, 1, 14.96161
##AUDIT TRAIL= $$ (NUMBER, WHEN, WHO, WHERE, PROCESS, VERSION, WHAT)
$$ ##TITLE= Audit trail, TOPSPIN		Version 2.1
$$ ##JCAMPDX= 5.01
$$ ##ORIGIN= Bruker BioSpin GmbH
$$ ##OWNER= Administrator
$$ $$ E:\/data/COFFEE/nmr/AC1712_14FALM0001_8743523_LyKpv0qBwT/42/pdata/1/auditp.txt
$$ ##AUDIT TRAIL=  $$ (NUMBER, WHEN, WHO, WHERE, PROCESS, VERSION, WHAT)
(   1,<2015-08-08 03:19:59.391 -0700>,<Administrator>,<X>,<go>,<TOPSPIN 2.1>,
      <created by zg
	started at 2015-08-08 03:08:29.953 -0700,
	POWCHK enabled, PULCHK disabled,
       configuration hash MD5:
       21 0F 79 D6 B3 7B B4 F6 88 20 88 DB 03 48 BD 9F
       data hash MD5: 64K
       22 49 A6 58 83 A1 8B 9F 59 07 71 4E 16 DC 85 94>)
(   2,<2015-08-08 03:20:02.891 -0700>,<Administrator>,<X>,<proc1d>,<TOPSPIN 2.1>,
      <Start of raw data processing
       efp LB = 0.3 FT_mod = 6 PKNL = 1 PHC0 = 0 PHC1 = 0 SI = 128K 
       data hash MD5: 128K
       26 1C AC 2A 77 BC CB 56 C1 94 CC 29 F0 C3 8F EC>)
(   3,<2015-08-08 03:20:03.797 -0700>,<Administrator>,<X>,<proc1d>,<TOPSPIN 2.1>,
      <pk PHC0 = -85.578 PHC1 = 0 
       data hash MD5: 128K
       EC 04 88 94 29 C0 B1 8A A0 FD 05 10 3E D7 50 D6>)
(   4,<2015-08-08 03:20:04.188 -0700>,<Administrator>,<X>,<proc1d>,<TOPSPIN 2.1>,
      <abs ABSG = 1 
       data hash MD5: 128K
       CC DD AA 28 F4 65 56 5F 1D 39 2B 40 75 53 74 46>)
(   5,<2015-08-08 03:20:04.281 -0700>,<Administrator>,<X>,<proc1d>,<TOPSPIN 2.1>,
      <abs ABSG = 2 
       data hash MD5: 128K
       CE 84 02 E7 CA F0 FD 0D F3 F5 6E D3 4C 1B 4A B5>)
(   6,<2015-08-08 03:20:04.375 -0700>,<Administrator>,<X>,<proc1d>,<TOPSPIN 2.1>,
      <abs ABSG = 3 
       data hash MD5: 128K
       0E D7 C0 D1 A8 26 FF 86 A4 5D B4 C5 22 CE 7C B2>)
(   7,<2015-08-08 03:20:04.453 -0700>,<Administrator>,<X>,<proc1d>,<TOPSPIN 2.1>,
      <abs ABSG = 4 
       data hash MD5: 128K
       DD 46 2B D7 9A 90 AE 7A 09 80 83 43 70 42 97 D1>)
(   8,<2015-08-08 03:20:04.547 -0700>,<Administrator>,<X>,<proc1d>,<TOPSPIN 2.1>,
      <abs ABSG = 5 
       data hash MD5: 128K
       E3 F1 7D A6 8E 1B 5B 59 1F EC 17 49 4C 55 00 19>)
$$ ##END=
$$ 
$$ $$ hash MD5
$$ $$ 66 DF 0C D2 33 B1 06 6F 1D 59 E2 51 BE 60 7F 9F
##$RELAX= 
##$RELAX= 
##$RELAX= 
##$RELAX= 
##$RELAX= 
##$RELAX= 
##$RELAX= 
##$RELAX= 
$$ Bruker specific parameters
$$ --------------------------
##$DU= <E:\>
##$EXPNO= 42
$$ [...]
150 150 150 150 150 150 150 150
##$TP07= 0
##$TPNAME0= <>
##$TPNAME1= <>
##$TPNAME2= <>
##$TPNAME3= <>
##$TPNAME4= <>
##$TPNAME5= <>
##$TPNAME6= <>
##$TPNAME7= <>
##$TPOAL= (0..7)
0.5 0.5 0.5 0.5 0.5 0.5 0.5 0.5
##$TPOFFS= (0..7)
0 0 0 0 0 0 0 0
##$TUNHIN= 0
##$TUNHOUT= 0
##$TUNXOUT= 0
##$USERA1= <user>
##$USERA2= <user>
##$USERA3= <user>
##$USERA4= <user>
##$USERA5= <user>
##$V9= 5
##$VALIST= <valist>
##$VCLIST= <CCCCCCCCCCCCCCC>
##$VD= 0
##$VDLIST= <DDDDDDDDDDDDDDD>
##$VPLIST= <PPPPPPPPPPPPPPP>
##$VTLIST= <TTTTTTTTTTTTTTT>
##$WBST= 2048
##$WBSW= 25
##$XGAIN= (0..3)
0 0 0 0
##$XL= 0
##$YL= 0
##$YMAX_a= 7983586
##$YMIN_a= -14096855
##$ZGOPTNS= <>
##$ZL1= 120
##$ZL2= 120
##$ZL3= 120
##$ZL4= 120
##$ABSF1= 14.96161
##$ABSF2= -5.596572
##$ABSG= 5
##$ABSL= 3
##$ALPHA= 0
##$AQORDER= 0
##$ASSFAC= 0
##$ASSFACI= 0
##$ASSFACX= 0
##$ASSWID= 0
##$AUNMP= <proc_prof1d_extract.lims>
##$AXLEFT= 0
##$AXNAME= <>
##$AXNUC= <1H>
##$AXRIGHT= 0
##$AXTYPE= 0
##$AXUNIT= <>
##$AZFE= 0.1
##$AZFW= 0.1
##$BCFW= 0
##$BC_mod= 0
##$BYTORDP= 0
##$COROFFS= 0
##$CY= 15
##$DATMOD= 1
##$DC= 0
##$DFILT= <>
##$DTYPP= 0
##$F1P= 0
##$F2P= 0
##$FCOR= 0.5
##$FTSIZE= 131072
##$FT_mod= 6
##$GAMMA= 0
##$GB= 0
##$INTBC= 1
##$INTSCL= 1
##$ISEN= 128
##$LB= 0.3
##$LEV0= 0
##$LPBIN= 0
##$MAXI= 10000
##$MC2= 0
##$MEAN= 0
##$ME_mod= 0
##$MI= 0
##$NCOEF= 0
##$NC_proc= -2
##$NLEV= 6
##$NOISF1= 0
##$NOISF2= 0
##$NSP= 0
##$NTH_PI= 0
##$NZP= 0
##$OFFSET= 14.96161
##$PC= 1
##$PHC0= -85.578
##$PHC1= 0
##$PH_mod= 1
##$PKNL= yes
##$PPARMOD= 0
##$PPDIAG= 0
##$PPIPTYP= 0
##$PPMPNUM= 2147483647
##$PPRESOL= 1
##$PSCAL= 4
##$PSIGN= 0
##$PYNMP= <proc.py>
##$REVERSE= no
##$SF= 400.0200093941
##$SI= 131072
##$SIGF1= 0
##$SIGF2= 0
##$SINO= 400
##$SIOLD= 131072
##$SPECTYP= <>
##$SREGLST= <1H.CDCl3>
##$SSB= 0
##$STSI= 131072
##$STSR= 0
##$SW_p= 8223.68421052631
##$SYMM= 0
##$S_DEV= 0
##$TDeff= 65536
##$TDoff= 0
##$TI= <>
##$TILT= no
##$TM1= 0
##$TM2= 0
##$TOPLEV= 0
##$USERP1= <user>
##$USERP2= <user>
##$USERP3= <user>
##$USERP4= <user>
##$USERP5= <user>
##$WDW= 1
##$XDIM= 131072
##$YMAX_p= 416603873
##$YMIN_p= -10918
##$CURPLOT= <Network HP LaserJet P1505>
##$CURPRIN= <$Network HP LaserJet P1505>
##$DFORMAT= <normdp>
##$LAYOUT= <+/1D_H.xwp>
##$LFORMAT= <normlp>
##$PFORMAT= <normpl>
##$SURQMSG= 1
$$ End of Bruker specific parameters
$$ ---------------------------------
##NTUPLES= NMR SPECTRUM
##VAR_NAME=  FREQUENCY,     SPECTRUM/REAL,   SPECTRUM/IMAG
##SYMBOL=    X,             R,               I
##VAR_TYPE=  INDEPENDENT,   DEPENDENT,       DEPENDENT
##VAR_FORM=  AFFN,          ASDF,            ASDF
##VAR_DIM=   131072,        131072,          131072
##UNITS=     HZ,            ARBITRARY UNITS, ARBITRARY UNITS
##FACTOR=    0.0627417313425164, 1,          1
##FIRST=     8223.62146879497, 185,          -62979
##LAST=      0,             2009,            -63910
##MIN=       0,             -10918,          0
##MAX=       8223.62146879497, 416603873,    0
$$ Real data points
##PAGE= N=1
##DATA TABLE= (X++(R..R)), XYDATA
$$ [...]
$$ plain form
61430 462083 470226 477175 482874 487897 492415 496027 498551 500427 502295 504598 507536 510839 513556 514719
61416 514719 514436 513745 513173 512058 509652 506205 502394 498279 493536 488390 483527 479229 475237 471403 467865
61401 467865 464634 461586 458887 456882 455535 454504 453773 453625 453906 453920 453265 452285 451444 450769 450217 450143 450963
61384 450963 452584 454503 456243 457434 457800 457484 457235 457887 459638 462035 464530 466843 468915 470880 473120
61369 473120 476089 479957 484456 489049 493225 496721 499616 502252 505053 508431 512773 518350 525208 533246
61355 533246 542403 552663 563921 576026 588963 602799 617515 632939 648683 663845 677060 687405
61343 687405 695291 702015 708377 714223 719276 723674 727376 729775 730405 729514 727426 723776 717992 710217 701168
61328 701168 691368 681182 671358 662727 655416 648998 643491 639506 637254 636002 634821 633436 632062 630849
$$ packed form
61430D62083Q143O949N699N023M518L612K524J876J868K303K938L303K717J163
61416E14719k83o91n72j115k406l447l811m115m743n146m863m298l992l834l538
61401D67865l231l048k699k005j347j031p31j48K81J4o55r80q41o75n52p4Q20
61384D50963J621J919J740J191L66l16k49O52J751K397K495K313K072J965K240
61369D73120K969L868M499M593M176L496K895K636K801L378M342N577O858Q038
61355E33246R157J0260J1258J2105J2937J3836J4716J5424J5744J5162J3215J0345
61343F87405P886O724O362N846N053M398L702K399O30q91k088l650n784p775r049
61328G01168r800j0186r824q631p311o418n507l985k252j252j181j385j374j213
$$ plain form
61314 630849 629823 629155 629120 629857 631363 633672 636949 641446 647321 654401 662182 670185 678143 685565 691321
61299 691321 694115 693449 689872 684355 677837 671236 665289 660087 655135 650135 645466 641728 639094 637315
61285 637315 636174 635790 636608 639078 643090 647749 652075 655988 660174 664968 669943 674853 680342 687206 695282
61270 695282 703616 711499 718913 726161 733541 741374 749994 759785 771380 785570 802610 821785 841962
61257 841962 862299 881959 899489 913321 922936 928894 931574 930567 925579 917312 906915 895009 881743
61244 881743 867503 852914 838231 823330 808444 794447 782124 771450 761812 752807 744527 737114
61232 737114 730363 723941 717907 712834 709355 707613 707156 707298 707564 707800 707930 707668 706624 704787 702795 701529
61216 701529 701405 702288 704053 706860 710624 714550 717590 719362 720334 721228 722606 724996 728891 734388 741133
$$ packed form
61314F30849j026o68l5P37J506K309L277M497N875P080P781Q003P958P422N756
61299F91321K794o66l577n517o518o601n947n202m952n000m669l738k634j779
61285F37315j141l84Q18K470M012M659M326L913M186M794M975M910N489O864Q076
61270F95282Q334P883P414P248P380P833Q620R791J1595J4190J7040J9175K0177
61257H41962K0337J9660J7530J3832R615N958K680j007m988q267j0397j1906j3266
61244H81743j4240j4589j4683j4901j4886j3997j2323j0674r638r005q280p413
61232G37114o751o422o034n073l479j742m57J42K66K36J30k62j044j837j992j266
61216G01529j24Q83J765K807L764L926L040J772R72Q94J378K390L895N497O745
$$ plain form
61201 741133 748922 758171 769530 783171 798708 815762 834363 854703 876595 899112 920742 939996
61189 939996 956013 968652 978139 984955 990093 994933 1000343 1006000 1010941 1014725 1017583 1019388 1018997 1015072
61175 1015072 1007492 997690 987519 977822 967997 956839 943756 929196 913949 898287 881995 865096
61163 865096 848119 831564 815426 799536 784200 770248 758464 749080 741781 736125 732021 729872
61151 729872 730134 732718 736873 741595 745931 748965 749870 748170 743646 735978 725023 711836 698819 688217
61137 688217 680569 675085 671181 668997 668634 669886 672905 678282 686074 695394 705506 716814 730212 745803
61123 745803 762876 780905 799932 819993 840752 861839 883163 904658 926000 946757 966804
61112 966804 986437 1006037 1025518 1044100 1060799 1075203 1087650 1098568 1107821 1114725 1118441 1118218
$$ packed form
61201G41133P789R249J1359J3641J5537J7054J8601K0340K1892K2517K1630J9254
61189I39996J6017J2639R487O816N138M840N410N657M941L784K858J805l91l925
61175A015072p580r802j0171r697r825j1158j3083j4560j5247j5662j6292j6899
61163H65096j6977j6555j6138j5890j5336j3952j1784r384p299n656m104k149
61151G29872K62K584M155M722M336L034R05j700m524p668j0955j3187j3017j0602
61137F88217p648n484l904k184l63J252L019N377P792R320J0112J1308J3398J5591
61123G45803J7073J8029J9027K0061K0759K1087K1324K1495K1342K0757K0047
61112I66804J9633J9600J9481J8582J6699J4404J2447J0918R253O904L716k23
$$ plain form
61100 1118218 1113596 1104669 1091973 1075954 1056889 1035559 1013529 992190 971648 951129 930331 909841
61088 909841 890271 871692 854179 838326 824712 813108 802645 792717 783488 775488 768955 763658
61076 763658 759283 755860 753659 752676 752412 752309 752319 752903 754562 757420 761151 765246 769548 774619 781275 789574
61060 789574 798608 807577 816696 826709 837844 849808 862544 876365 891509 908190 926924 948097
61048 948097 971223 995362 1020327 1046726 1074673 1103286 1131795 1160387 1189493 1219009 1248807
61037 1248807 1279443 1311563 1344932 1378753 1412766 1447346 1482631 1518276 1554352 1592058 1633238
61026 1633238 1679128 1729625 1783697 1840483 1899867 1961877 2025945 2091486 2159320 2231982 2312398
61015 2312398 2402848 2505376 2622380 2756029 2907351 3076510 3264034 3472045 3705420 3972698
$$ packed form
61100A118218m622q927j2696j6019j9065k1330k2030k1339k0542k0519k0798k0490
61088I09841j9570j8579j7513j5853j3614j1604j0463r928r229q000o533n297
61076G63658m375l423k201r83k64j03J0N84J659K858L731M095M302N071O656Q299
61060G89574R034Q969R119J0013J1135J1964J2736J3821J5144J6681J8734K1173
61048I48097K3126K4139K4965K6399K7947K8613K8509K8592K9106K9516K9798
61037A248807L0636L2120L3369L3821L4013L4580L5285L5645L6076L7706M1180
61026A633238M5890N0497N4072N6786N9384O2010O4068O5541O7834P2662Q0416
61015B312398R0450J02528J17004J33649J51322J69159J87524K08011K33375K67278
$$ plain form
61005 3972698 4285633 4657301 5100691 5628962 6255916 6995863 7864949 8885243 10088854
60996 10088854 11519619 13232653 15286509 17712333 20453608 23308629 25937862 27969656
60988 27969656 29158114 29492540 29190329 28594155 28048994 27810221 27981137 28470085 28993584
60979 28993584 29163311 28642187 27287207 25193046 22621356 19877017 17208459 14768078
60971 14768078 12621760 10778581 9218948 7912643 6827322 5931664 5196603 4595708
60963 4595708 4104957 3702791 3370745 3093746 2859616 2658648 2483709 2330009 2194008
60954 2194008 2072594 1963301 1864723 1776240 1697511 1628328 1568186 1515446 1467285 1421025 1375302
60943 1375302 1329738 1284140 1238620 1193996 1151224 1110604 1072146 1036384 1003988 974703 947480
$$ packed form
61005C972698L12935L71668M43390N28271O26954P39947Q69086J020294J203611
60996A0088854J430765J713034K053856K425824K741275K855021K629233K031794
60988B7969656J188458L34426l02211n96174n45161k38773J70916M88948N23499
60979B8993584J69727n21124j354980k094161k571690k744339k668558k440381
60971A4768078k146318j843179j559633j306305j085321q95658p35061o00895
60963D595708m90751m02166l32046k76999k34130k00968j74939j53700j36001
60954B194008j21414j09293r8578q8483p8729o9183o0142n2740m8161m6260m5723
60943A375302m5564m5598m5520m4624m2772m0620l8458l5762l2396k9285k7223
$$ plain form
60932 947480 921760 897937 876451 857138 839720 824289 810967 799474 789365 780321 771961 763750
60920 763750 755392 747041 738880 730761 722529 714409 706703 699366 692311 685970 681050 677597 674680 671240
60906 671240 667096 662900 659212 655866 652248 647999 643330 638816 635032 632252 630203 628115 625312 621902
60892 621902 618736 616607 615725 616018 617531 620212 623637 627491 632204 638568 646628 655407 663901 672035 680417
60877 680417 689532 699426 709895 720527 730685 739937 748628 757746 768044 779447 791478 804077
60865 804077 817723 832793 849100 866225 884026 902618 922056 942428 964207 988001 1013682
60854 1013682 1039997 1065303 1088596 1109714 1128904 1146624 1163553 1180166 1196037 1209905 1220629
60843 1220629 1227820 1231255 1229973 1222473 1208002 1187356 1162197 1133748 1102430 1068676 1033637 998749
$$ packed form
60932I47480k5720k3823k1486j9313j7418j5431j3322j1493j0109r044q360q211
60920G63750q358q351q161q119q232q120p706p337p055o341m920l453k917l440
60906F71240m144m196l688l346l618m249m669m514l784k780k049k088k803l410
60892F21902l166k129q82K93J513K681L425L854M713O364Q060Q779Q494Q134Q382
60877F80417R115R894J0469J0632J0158R252Q691R118J0298J1403J2031J2599
60865H04077J3646J5070J6307J7125J7801J8592J9438K0372K1779K3794K5681
60854A013682K6315K5306K3293K1118J9190J7720J6929J6613J5871J3868J0724
60843A220629P191L435j282p500j4471k0646k5159k8449l1318l3754l5039l4888
$$ plain form
60831 998749 964843 932032 900382 870232 841766 814776 789163 765394 744034 724998 707636
60820 707636 691556 676977 664216 653127 643187 633968 625413 617776 611408 606526 602996 600292 597659
60807 597659 594474 590673 586907 584133 582868 582902 583691 584822 585993 586822 587005 586573 585723 584491 582839 581023
60791 581023 579546 578654 578030 577039 575224 572632 569735 566970 564266 561175 557475 553312 548601 542793 535779
60776 535779 528622 522709 518147 513669 508166 501792 495381 489382 483664 477951 472094 466152 460481 455572
60762 455572 451670 448728 446729 445705 445357 445045 444381 443568 443047 443129 444049 445888 448252 450480 452490 454965
60746 454965 458372 462218 465718 468803 471908 475009 477471 478758 478832 477928 476426 474976 474290 474688 476018
60731 476018 477977 480174 481897 482212 480570 477270 473274 469527 466286 463001 458965 454119 448974 443800
$$ packed form
60831I98749l3906l2811l1650l0150k8466k6990k5613k3769k1360j9036j7362
60820G07636j6080j4579j2761j1089r940r219q555p637o368m882l530k704k633
60807E97659l185l801l766k774j265L4P89J131J171Q29J83m32q50j232j652j816
60791E81023j477q92o24r91j815k592k897k765k704l091l700m163m711n808p014
60776E35779p157n913m562m478n503o374o411n999n718n713n857n942n671m909
60762D55572l902k942j999j024l48l12o64q13n21Q2R20J839K364K228K010K475
60746D54965L407L846L500L085L105L101K462J287P4r04j502j450o86L98J330
60731D76018J959K197J723L15j642l300l996l747l241l285m036m846n145n174
$$ plain form
60717 443800 438316 432397 426521 421129 415958 410551 405075 400046 395476 390937 386391 382357 379288 377256
60703 377256 376157 375639 374965 373608 372053 371353 371752 372390 372459 372114 372016 372635 374167 376478 378761 379880 379552
60686 379552 378800 378874 380098 382064 384427 387006 389528 391902 394529 397837 401735 405922 410515 415881 422014
60671 422014 428531 435114 441511 447261 451884 455405 458285 460929 463564 466498 470007 473919 477610 480509
60657 480509 482445 483598 484380 485249 486360 487506 488575 489834 491461 493073 494180 494817 495171 494756 492642
60642 492642 488562 483152 476997 470090 462444 454667 447541 441365 436008 431253 426840 422507 418314 414683
60628 414683 411886 409765 408140 407147 406888 407025 407050 406725 406005 404847 403458 402438 402220 402507 402728 402899 403576
60611 403576 404972 406597 407842 408541 408942 409506 410802 413079 415687 417312 417209 416079 415373 415816 416803 417214
$$ packed form
60717D43800n484n919n876n392n171n407n476n029m570m539m546m034l069k032
60703C77256j099n18o74j357j555p00L99O38O9l45r8O19J532K311K283J119l28
60686C79552p52P4J224J966K363K579K522K374K627L308L898M187M593N366O133
60671D22014O517O583O397N750M623L521K880K644K635K934L509L912L691K899
60657D80509J936J153P82Q69J111J146J069J259J627J612J107O37L54m15k114
60642D92642m080n410o155o907p646p777p126o176n357m755m413m333m193l631
60628D14683k797k121j625r93k59J37K5l25p20j158j389j020k18K87K21J71O77
60611D03576J396J625J245O99M01N64J296K277K608J625j03j130p06M43R87M11
$$ plain form
60595 417214 416507 415059 413757 413388 414266 416196 418729 421487 424268 426936 429360 431542 433680 435957 438263
60580 438263 440193 441338 441497 440668 439020 436970 435150 434181 434444 436135 439341 443913 449335 455007 460727
60565 460727 466792 473611 481328 489836 499005 508783 519115 529793 540332 550069 558478 565371 570583
60552 570583 573576 573689 570992 566608 561966 557836 554257 551290 549478 549508 551525 554900 558731 562715 567563
60537 567563 574485 584183 596530 611144 627855 646281 665288 683449 699961 714648 727013 735855
60525 735855 740133 739852 735822 728850 719586 708926 697991 687651 678394 670719 665177 661726 659433 657261
60511 657261 655123 653864 654226 656166 659228 663193 668124 673959 680398 687185 694461 702880 713420 726898
60497 726898 743492 762917 785200 811090 841438 876354 915298 957754 1003299 1050998 1099257
$$ packed form
60595D17214p07j448j302l69Q78J930K533K758K781K668K424K182K138K277K306
60580D38263J930J145J59q29j648k050j820r69K63J691L206M572N422N672N720
60565D60727O065O819P717Q508R169R778J0332J0678J0539R737Q409O893N212
60552E70583K993J13k697m384m642m130l579k967j812L0K017L375L831L984M848
60537E67563O922R698J2347J4614J6711J8426J9007J8161J6512J4687J2365Q842
60525G35855M278k81m030o972r264j0660j0935j0340r257p675n542l451k293k172
60511F57261k138j259L62J940L062L965M931N835O439O787P276Q419J0540J3478
60497G26898J6594J9425K2283K5890L0348L4916L8944M2456M5545M7699M8259
$$ plain form
60486 1099257 1146316 1190325 1228765 1258484 1276931 1283168 1277410 1259995 1231337 1192575 1145681 1092943
60474 1092943 1036847 980235 925852 875449 829629 788577 752424 720898 693242 668864 647684
60463 647684 629585 613910 599870 587149 575739 565433 555869 546975 538996 532197 526819 523126 521005
60450 521005 519501 517269 513709 509401 505300 501732 498394 495007 491691 488753 486438 484868 484006 483599 483347
60435 483347 483198 483284 483524 483533 483172 482927 483373 484299 484822 484433 483561 482897 482574 482329 482124 482098 482144 482065 482135 482960 484703
60414 484703 486874 488983 490959 492792 494161 494723 494481 493702 492744 492093 492194 492992 493909 494475 494732 494891 495068
60397 495068 495557 496903 499225 501869 504155 506154 508250 510338 512080 513658 515563 517785 519910 521966
60383 521966 524457 527475 530483 533107 535481 537665 539441 540970 542973 545828 549012 551866 554408 556976
$$ packed form
60486A099257M7059M4009L8440K9719J8447O237n758j7415k8658l8762m6894n2738
60474A092943n6096n6612n4383n0403m5820m1052l6153l1526k7656k4378k1180
60463F47684j8099j5675j4040j2721j1410j0306r564q894p979o799n378l693k121
60450E21005j504k232l560m308m101l568l338l387l316k938k315j570q62m07k52
60435D83347j49Q6K40Rl61k45M46R26N23l89q72o64l23k45k05k6M6p9P0Q25J743
60414D84703K171K109J976J833J369N62k42p79r58o51J01P98R17N66K57J59J77
60397D95068M89J346K322K644K286J999K096K088J742J578J905K222K125K056
60383E21966K491L018L008K624K374K184J776J529K003K855L184K854K542K568
$$ plain form
60369 556976 559496 561678 563557 565284 566670 567553 568398 569895 572007 573969 575331 576531 578296 580854 583838
60354 583838 586650 588809 590231 591477 593623 597666 603891 611729 620244 628913 637947 647744 658040 667835
60340 667835 676092 682151 685459 685508 682391 676990 670205 662332 653598 644760 636590 629092 621937 615365 609874
60325 609874 605228 600727 596462 593360 591761 590834 589725 588453 587233 585688 583475 581189 579868 579848 580684
60310 580684 581999 583902 586647 590339 594944 600348 606481 613587 622125 632291 643911 657035 672157
60297 672157 689437 708033 726512 743516 757658 767350 771537 770314 764191 753108 737048 717459
60285 717459 696997 677632 659724 643115 628278 615921 606077 598126 591416 585528 580254 575646 571863
60272 571863 568764 565898 562990 560175 557642 555492 553997 553454 553481 553014 551458 549454 548071 547625 547724 548145
$$ packed form
60369E56976K520K182J879J727J386Q83Q45J497K112J962J362J200J765K558K984
60354E83838K812K159J422J246K146M043O225P838Q515Q669R034R797J0296R795
60340F67835Q257O059L308M9l117n401o785p873q734q838q170p498p155o572n491
60325F09874m646m501m265l102j599r27j109j272j220j545k213k286j321k0Q36
60310E80684J315J903K745L692M605N404O133P106Q538J0166J1620J3124J5122
60297F72157J7280J8596J8479J7004J4142R692M187j223o123j1083j6060j9589
60285G17459k0462j9365j7908j6609j4837j2357r844p951o710n888n274m608l783
60272E71863l099k866k908k815k533k150j495n43K7m67j556k004j383m46R9M21
$$ plain form
60256 548145 549022 550294 551519 552238 552163 551126 549284 547283 545804 544876 543966 542768 541592 540986 541263 542373
60240 542373 543934 545372 546349 547057 547871 548824 549803 551146 553441 556643 559948 562811 565584 568707 571724
60225 571724 573722 574585 575170 576184 577448 578522 579571 581181 583586 586527 589715 592931 595639 597124 597387
60210 597387 597577 599024 601942 605417 608532 611058 613091 614602 615619 616485 617563 618828 619975 620808 621316
60195 621316 621521 621392 620823 619666 617919 615916 613974 611822 608833 605083 601683 599682 598985 598855 599080 599996
60179 599996 601541 603041 603942 604176 603744 602565 600883 599257 597966 596909 596295 596813 598749 601442 604013
60164 604013 606260 608367 610178 611368 612081 612782 613550 614070 614290 614523 614817 614850 614633 614835 616052 618127 620551
60147 620551 623202 626210 629325 632098 634715 638012 642333 646847 650487 653240 655973 659156 662490 665887
$$ packed form
60256E48145Q77J272J225P19p5j037j842k001j479r28r10j198j176o06K77J110
60240E42373J561J438R77P08Q14R53R79J343K295L202L305K863K773L123L017
60225E71724J998Q63N85J014J264J074J049J610K405K941L188L216K708J485K63
60210E97387J90J447K918L475L115K526K033J511J017Q66J078J265J147Q33N08
60195F21316K05j29n69j157j747k003j942k152k989l750l400k001o97j30K25R16
60179E99996J545J500R01K34m32j179j682j626j291j057o14N18J936K693K571
60164F04013K247K107J811J190P13P01P68N20K20K33K94L3k17K02J217K075K424
60147F20551K651L008L115K773K617L297M321M514L640K753K733L183L334L397
$$ plain form
60133 665887 670014 675415 681560 687357 692268 696326 699222 700159 698719 695313 690563 684744 678111 671346
60119 671346 665260 660253 656297 653202 650637 648126 645420 642755 640482 638544 636607 634584 632684 630975
60105 630975 629253 627453 625878 624819 624116 623305 622151 620896 620052 620109 621427 624170 628092 632471 636548
60090 636548 640208 644031 648537 653523 658342 662645 666486 669870 672677 675082 677557 680240 682660 684309
60076 684309 685144 685207 684066 681089 676129 669614 662011 653610 644780 636108 628169 621300 615592 610913 606946
60061 606946 603405 600176 597141 594024 590674 587427 584830 582937 581193 579093 576736 574629 573183 572477
60047 572477 572289 572202 571909 571649 572153 573855 576184 577876 578071 577040 575783 574962 574220 572494 569057 564306
60031 564306 559449 555304 551466 546827 540916 534496 528734 524021 519755 515127 509802 503933 497914 492257
$$ packed form
60133F65887M127N401O145N797M911M058K896R37j440l406m750n819o633o765
60119F71346o086n007l956l095k565k511k706k665k273j938j937k023j900j709
60105F30975j722j800j575j059p03q11j154j255q44N7J318K743L922M379M077
60090F36548L660L823M506M986M819M303L841L384K807K405K475K683K420J649
60076F84309Q35O3j141k977m960o515p603q401q830q672p939o869n708m679l967
60061F06946l541l229l035l117l350l247k597j893j744k100k357k107j446p06
60047E72477j88q7k93k60N04J702K329J692J95j031j257q21p42j726l437m751
60031E64306m857m145l838m639n911o420n762m713m266m628n325n869o019n657
$$ plain form
60017 492257 487391 483339 479767 476579 474233 473190 473207 473527 473748 474166 475255 477078 479275 481398 483193
60002 483193 484778 486596 488931 491423 493331 494356 494933 495622 496497 497346 498248 499740 502458 506611 511618
59987 511618 516244 519428 521129 522168 523267 524525 525826 527173 528360 528875 528496 527678 526921 526153 525171 524381
59971 524381 524509 525733 527585 529564 531342 532480 532600 531974 531487 531882 533298 535545 538408 541610 544860
59956 544860 548079 551304 554303 556577 557806 558035 557438 556214 554761 553589 552888 552375 551595 550173 547819
59941 547819 544461 540392 536053 531685 527501 524097 522146 521574 521489 521114 520458 519921 519611 519292 518759 518055 517490
59924 517490 517471 518075 518848 519359 519920 521277 523646 526593 529920 533921 538541 543102 547370 552215 558500 565783
59908 565783 572818 579012 584696 590256 595713 600988 605821 609471 611214 611231 610434 609398 608079 606602 605566
$$ packed form
60017D92257m866m052l572l188k346j043J7L20K21M18J089J823K197K123J795
60002D83193J585J818K335K492J908J025N77O89Q75Q49R02J492K718M153N007
59987E11618M626L184J701J039J099J258J301J347J187N15l79q18p57p68r82p90
59971E24381J28J224J852J979J778J138J20o26m87L95J416K247K863L202L250
59956E44860L219L225K999K274J229K29n97j224j453j172p01n13p80j422k354
59941E47819l358m069m339m368m184l404j951n72q5l75o56n37l10l19n33p04n65
59924E17490j9O04P73N11N61J357K369K947L327M001M620M561M268M845O285P283
59908E65783P035O194N684N560N457N275M833L650J743J7p97j036j319j477j036
$$ plain form
59893 605566 605253 605083 604298 602841 601351 600569 600968 602558 604786 606952 608910 611079 613633 616141 618313
59878 618313 620574 623401 626450 628875 630299 630912 630819 629901 628375 626848 625611 624354 622769 621047 619510
59863 619510 618074 616434 614578 612823 611415 610419 609903 610018 610833 612258 614083 616057 618056 620421 623961
59848 623961 629411 636794 645489 654934 665096 676265 688510 701290 713389 723196 729375 731558 730516
59835 730516 727781 725125 724119 725527 728694 731642 732138 728920 722035 712257 700411 687211 673454 660105
59821 660105 647997 637432 628123 619662 612037 605586 600480 596368 592645 589009 585779 583631 582898 583043
59807 583043 582999 582224 581203 580685 580692 580785 580929 581372 581633 580566 577829 574551 571992 570119 568076 565558 562956
59790 562956 560513 558061 555481 552826 550144 547729 546260 546064 546474 546633 546663 547156 547692 547027 544962 542987
$$ packed form
59893F05566l13j70p85j457j490p82L99J590K228K166J958K169K554K508K172
59878F18313K261K827L049K425J424O13r3r18j526j527j237j257j585j722j537
59863F19510j436j640j856j755j408r96n16J15Q15J425J825J974J999K365L540
59848F23961N450P383Q695R445J0162J1169J2245J2780J2099R807O179K183j042
59835G30516k735k656j006J408L167K948M96l218o885r778j1846j3200j3757j3349
59821F60105j2108j0565r309q461p625o451n106m112l723l636l230k148p33J45
59807E83043m4p75j021n18PR3J44M43K61j067k737l278k559j873k043k518k602
59790E62956k443k452k580k655k682k415j469j96M10J59L0M93N36o65k065j975
$$ plain form
59774 542987 542637 543993 546206 548635 550920 552699 554021 555574 557846 560404 562560 564311 566009 567474
59760 567474 568208 568311 568511 569285 570527 572086 574144 576875 580094 583342 586179 588458 590496 592854 595755
59745 595755 598828 601590 603956 606027 607725 609008 610231 611797 613544 614875 615481 615612 615676 615884 616278 616758
59729 616758 617043 616796 615864 614368 612717 611580 611546 612555 613889 614913 615588 616099 616427 616676 617349 618754 620390
59712 620390 621526 622212 623164 624819 627033 629588 632380 635175 637791 640497 643635 646887 649528 651445 653159
59697 653159 654817 655972 656581 657395 658848 660245 660618 659855 658394 656320 653521 650466 647984 646279 644804
59682 644804 643236 641943 641208 640404 638376 634561 629506 624303 619668 615577 611669 607833 604256 600942 597426
59667 597426 593232 588599 584478 581667 580004 578572 576708 574677 573241 572730 572788 572995 573454 574566 576406
$$ packed form
59774E42987l50J356K213K429K285J779J322J553K272K558K156J751J698J465
59760E67474P34J03K00P74J242J559K058K731L219L248K837K279K038K358K901
59745E95755L073K762K366K071J698J283J223J566J747J331O06J31O4K08L94M80
59729F16758K85k47r32j496j651j137l4J009J334J024O75N11L28K49O73J405J636
59712F20390J136O86R52J655K214K555K792K795K616K706L138L252K641J917J714
59697F53159J658J155O09Q14J453J397L73p63j461k074k799l055k482j705j475
59682F44804j568j293p35q04k028l815n055n203m635m091l908l836l577l314l516
59667E97426m194m633m121k811j663j432j864k031j436n11N8K07M59J112J840
$$ plain form
59652 576406 578525 580311 581414 581910 582149 582345 582195 581015 578379 574525 570085 565677 561930 559477 558488
59637 558488 558366 558313 558168 558355 559142 560312 561518 562519 563045 562826 561813 560131 557826 555035 552293 550233
59621 550233 548953 548104 547608 547711 548205 548188 546982 544925 542921 541534 540732 540216 539669 538974 538501 538933 540466
59604 540466 542431 543986 545011 545967 547099 548156 548794 548884 548444 547584 546620 546030 546298 547807 550659 554344
59588 554344 557774 560073 561396 562710 564712 567150 569246 570487 570864 570534 569524 567734 565075 561533 557174
59573 557174 552140 546656 540991 535417 530165 525419 521339 518079 515782 514499 514052 514064 514286 514870 516148
59558 516148 518085 520116 521623 522434 522867 523522 525050 527782 531310 534774 537801 540933 544824 549434 554429
59543 554429 560086 567087 575495 584585 593881 603992 616321 632221 652095 674488 695823 711760
$$ packed form
59652E76406K119J786J103M96K39J96j50j180k636l854m440m408l747k453r89
59637E58488j22n3j45J87P87J170J206J001N26k19j013j682k305k791k742k060
59621E50233j280q49m96J03M94j7j206k057k004j387q02n16n47o95m73M32J533
59604E40466J965J555J025R56J132J057O38R0m40q60r64n90K68J509K852L685
59588E54344L430K299J323J314K002K438K096J241L77l30j010j790k659l542m359
59573E57174n034n484n665n574n252m746m080l260k297j283m47J2K22N84J278
59558E16148J937K031J507Q11M33O55J528K732L528L464L027L132L891M610M995
59543E54429N657P001Q408R090R296J0111J2329J5900J9874K2393K1335J5937
$$ plain form
59531 711760 719635 719849 715129 708768 703296 699887 698391 698101 698755 700638 703729 707186 709863 710983 710154
59516 710154 707182 702187 695573 687627 678377 668049 657298 646713 636349 626024 615839 606202 597548
59503 597548 590200 584261 579537 575783 573051 571458 570598 569656 568262 566735 565399 564223 563333 563132 563518
59488 563518 563630 562914 561913 561463 561575 561760 562038 562928 564674 567122 570243 574228 579151 584918 591415 598394
59472 598394 605441 612334 619051 625097 629397 631381 631733 631510 631064 630487 630515 632010 634949 638930 644430 652402
59456 652402 662655 673739 684559 695145 705688 715830 725275 734173 742434 749379 754511 757998 759959
59443 759959 759879 757150 751703 743754 733481 721431 708787 696821 686375 678024 672123 668253 665201
59430 665201 662074 659175 657367 657029 658037 660386 664258 669722 676837 685796 696476 708099 719877 731891
$$ packed form
59531G11760P875K14m720o361n472l409j496k90O54J883L091L457K677J120q29
59516G10154k972m995o614p946r250j0328j0751j0585j0364j0325j0185r637q654
59503E97548p348n939m724l754k732j593q60r42j394j527j336j176q90k01L86
59488E63518J12p16j001m50J12J85K78Q90J746K448L121L985M923N767O497O979
59472E98394P047O893O717O046M300J984L52k23m46n77K8J495K939L981N500P972
59456F52402J0253J1084J0820J0586J0543J0142R445Q898Q261O945N132L487J961
59443G59959q0k729n447p949j0273j2050j2644j1966j0446q351n901l870l052
59430F65201l127k899j808l38J008K349L872N464P115Q959J0680J1623J1778J2014
$$ plain form
59416 731891 744894 759295 774778 790913 807749 825531 843769 860393 871876 874776 867859 852929
59404 852929 833669 813790 796060 782262 773378 769936 772283 779960 790292 798177 798407 788740 770752
59391 770752 748131 724516 702428 683054 666482 652380 640628 631195 623701 617623 612894 609783
59379 609783 608216 607774 608360 610206 613076 616157 619027 622130 625912 630097 634358 639145 645119 652038 658953
59364 658953 665416 671825 678547 685382 692107 698978 706345 714156 722171 730406 739105 748553 759166 771491
59350 771491 785703 801174 816866 832090 846657 860474 873379 885332 896344 906098 913931 919321
59338 919321 922126 922240 919261 912753 902750 889871 875017 858944 842017 824314 806079 788060
59326 788060 771219 756128 742856 731379 721736 713664 706545 699998 694267 689780 686579 684419 683112
$$ packed form
59416G31891J3003J4401J5483J6135J6836J7782J8238J6624J1483K900o917j4930
59404H52929j9260j9879j7730j3798q884l442K347P677J0332P885K30r667j7988
59391G70752k2621k3615k2088j9374j6572j4102j1752r433p494o078m729l111
59379F09783j567m42N86J846K870L081K870L103L782M185M261M787N974O919O915
59364F58953O463O409O722O835O725O871P367P811Q015Q235Q699R448J0613J2325
59350G71491J4212J5471J5692J5224J4567J3817J2905J1953J1012R754P833N390
59338I19321K805J14k979o508j0003j2879j4854j6073j6927j7703j8235j8019
59326G88060j6841j5091j3272j1477r643q072p119o547n731m487l201k160j307
$$ plain form
59313 683112 682412 681812 680902 679886 679381 679766 680989 682868 685279 688112 691367 695199 699626 704371 709387
59298 709387 715326 723004 732527 743546 756365 772055 791012 811586 830231 842795 846063 839155
59286 839155 824115 804779 784491 764907 746912 731762 720552 712991 707790 704381 703524 705940 711034
59273 711034 717488 724648 732703 741651 750830 759638 768124 776456 784121 790155 794056 796007 796203 794450
59259 794450 790574 784823 777536 768736 758367 746785 734749 723029 712174 702469 693879 686241 679719
59246 679719 674846 671926 670760 671249 673821 678678 684901 691051 696593 702184 708503 715368 721970 727431
59232 727431 731070 732732 732976 732427 730822 727268 721578 714728 707744 700751 693483 686137 679202 672870 667178
59217 667178 662468 659174 657308 656528 656621 657518 658912 660216 661014 661489 662396 664487 667711 671043 673470 675108
$$ packed form
59313F83112p00o00r10j016n05L85J223J879K411K833L255L832M427M745N016
59298G09387N939P678R523J1019J2819J5690J8957K0574J8645J2564L268o908
59286H39155j5040j9336k0288j9584j7995j5150j1210p561n201l409q57K416N094
59273G11034O454P160Q055Q948R179Q808Q486Q332P665O034L901J951J96j753
59259G94450l876n751p287q800j0369j1582j2036j1720j0855r705q590p638o522
59246F79719m873k920j166M89K572M857O223O150N542N591O319O865O602N461
59232G27431L639J662K44n49j605l554n690o850o984o993p268p346o935o332n692
59217F67178m710l294j866p80R3Q97J394J304P98M75R07K091L224L332K427J638
$$ plain form
59201 675108 676856 679008 680868 681900 682517 683273 683951 684069 683758 683481 683265 682930 682777 683273 684153 684639 684616 684919
59183 684919 686258 688343 690305 691601 692330 692981 694081 695864 698173 700737 703580 706979 711121 716069 722031
59168 722031 729408 738380 748575 759211 769540 779212 788231 796517 803553 808664 811601 812577 811682 808727
59154 808727 803825 797619 790582 782560 773519 764329 756090 748830 741560 733698 725788 718707 712684 707332
59140 707332 702197 696941 691299 685256 679240 673897 669580 666135 663245 660956 659759 660043 661602 664000
59126 664000 667291 671967 678098 685076 692461 700568 709842 720190 731413 743872 758072 773860 790704
59113 790704 808556 827722 847957 868387 888367 907830 926769 944980 962320 978619 993292
59102 993292 1005598 1015398 1023043 1028387 1030532 1028816 1023609 1016007 1007260 998608 990958 984322 978049 971934
$$ packed form
59201F75108J748K152J860J032O17P56O78J18l11k77k16l35j53M96Q80M86k3L03
59183F84919J339K085J962J296P29O51J100J783K309K564K843L399M142M948N962
59168G22031P377Q972J0195J0636J0329R672R019Q286P036N111K937R76q95k955
59154H08727m902o206p037q022r041r190q239p260p270p862p910p081o023n352
59140G07332n135n256n642o043o016n343m317l445k890k289j197K84J559K398
59126F64000L291M676O131O978P385Q107R274J0348J1223J2459J4200J5788J6844
59113G90704J7852J9166K0235K0430J9980J9463J8939J8211J7340J6299J4673
59102I93292J2306R800P645N344K145j716n207p602q747q652p650o636o273o115
$$ plain form
59088 971934 966579 962376 958694 954562 949672 944099 937430 928841 917959 905187 891265 876976 863158
59075 863158 850518 839286 829274 820252 812045 804421 797207 790527 784648 779534 774761 769847 764487
59062 764487 758532 752015 745317 739114 733988 730017 726722 723414 719674 715615 711737 708559 706350 705120
59048 705120 704750 705154 706377 708449 711058 713523 715317 716489 717419 718352 719516 721471 724791 729339 734280
59033 734280 739002 743700 748973 755223 762560 771007 780687 792050 805906 822730 841922 862231 882882
59020 882882 903592 923371 940261 952896 961572 967084 969208 967417 962672 957213 952426 947955 943214
59007 943214 938869 936198 935625 936586 938585 941743 946340 952229 958770 965113 970471 974256 976033 975446 972315
58992 972315 966861 959595 950904 940878 929622 917555 905202 892804 880290 867661 855278 843857
$$ packed form
59088I71934n355m203l682m132m890n573o669q589j0882j2772j3922j4289j3818
59075H63158j2640j1232j0012r022q207p624p214o680n879n114m773m914n360
59062G64487n955o517o698o203n126l971l295l308l740m059l878l178k209j230
59048G05120l70M04J223K072K609K465J794J172R30R33J164J955L320M548M941
59033G34280M722M698N273O250P337Q447R680J1363J3856J6824J9192K0309K0651
59020H82882K0710J9779J6890J2635Q676N512K124j791m745n459m787m471m741
59007I43214m345k671n73R61J999L158M597N889O541O343N358L785J777n87l131
58992I72315n454p266q691j0026j1256j2067j2353j2398j2514j2629j2383j1421
$$ plain form
58980 843857 834212 826867 821754 818275 815802 814159 813661 814775 817853 823025 830065 838261 846648 854609
58966 854609 862257 870107 878466 887268 896406 905883 915421 924150 931015 935521 937881 938368 936746 932437
58952 932437 925226 915708 904990 893920 882532 870414 857692 845517 835340 827768 822383 818666
58940 818666 816678 816687 818444 821110 823710 825405 825523 823769 820408 815939 810443 803467 794658 784368 773582
58925 773582 763367 754493 747290 741593 736824 732452 728504 725475 723604 722480 721532 720762 720627 721256 722273
58910 722273 723623 726103 730611 737012 744259 751662 759580 768775 779520 791630 804987 819566 834988
58897 834988 850442 865154 878739 891056 902110 912374 923092 935742 950943 967984 985649
58886 985649 1003291 1020749 1037308 1051361 1061438 1067208 1069142 1067521 1062246 1053371 1041228 1026055
$$ packed form
58980H43857r645p345n113l479k473j643m98J114L078N172P040Q196Q387P961
58966H54609P648P850Q359Q802R138R477R538Q729O865M506K360M87j622m309
58952I32437p211r518j0718j1070j1388j2118j2722j2175j0177p572n385l717
58940H18666j988RJ757K666K600J695J18j754l361m469n496o976q809j0290j0786
58925G73582j0215q874p203n697m769m372l948l029j871j124r48p70j35O29J017
58910G22273J350K480M508O401P247P403P918R195J0745J2110J3357J4579J5422
58897H34988J5454J4712J3585J2317J1054J0264J0718J2650J5201J7041J7665
58886I85649J7642J7458J6559J4053J0077N770J934j621n275q875j2143j5173
$$ plain form
58874 1026055 1008099 988249 968017 948640 930544 913882 899116 886633 876109 866719 857928 849756
58862 849756 842277 835156 827742 819491 810316 800682 791313 782668 774703 767121 759786 752834 746517 741067
58848 741067 736562 732755 729026 724614 718996 712162 704620 697084 690003 683438 677496 672660 669365 667334
58834 667334 665780 664344 663345 662963 662709 662151 661750 662380 664060 665734 666425 666281 666300 667215 668825 670338 671145
58817 671145 671159 670491 669126 667197 665360 664412 664374 664376 663700 662616 661881 661658 661332 660347 658842 657441 656624 656310
58799 656310 655954 655051 653616 652092 650744 649433 648090 647065 646679 646668 646510 646227 646474 647845 650411 653906
58783 653906 657999 662330 666643 671021 675783 681039 686570 692209 698051 704083 709750 714101 716358 716295 714185
58768 714185 710527 705837 700610 695421 690866 687262 684423 681901 679544 677723 676960 677393 678617 680007 681173
$$ packed form
58874A026055j7956j9850k0232j9377j8096j6662j4766j2483j0524r390q791q172
58862H49756p479p121p414q251r175r634r369q645p965p582p335o952o317n450
58848G41067m505l807l729m412n618o834p542p536p081o565n942m836l295k031
58834F67334j554j436r99l82k54n58m01O30J680J674O91j44J9R15J610J513Q07
58817F71145J4o68j365j929j837r48l8Ko76j084p35k23l26r85j505j401q17l14
58799F56310l56r03j435j524j348j311j343j025l86j1j58k83K47J371K566L495
58783F53906M093M331M313M378M762N256N531N639N842O032N667M351K257o3k110
58768G14185l658m690n227n189m555l604k839k522k357j821p63M33J224J390J166
$$ plain form
58753 681173 682158 683276 684728 686392 687955 689291 690689 692741 695924 700266 705461 711370 718310 726738
58739 726738 736719 747890 759886 772563 785816 799501 813603 828201 843072 857537 870824 882346
58727 882346 891534 897668 900234 899302 895425 889412 882477 876225 871926 869701 868725 868268 868272 868973 870274 871629
58711 871629 872331 871820 869883 866692 862558 857600 851639 844358 835455 824708 812072 797763 782203 765865
58697 765865 749229 732775 716995 702468 689890 679752 671820 665124 658732 652393 646335 640717 635608
58684 635608 631266 627909 625234 622604 619882 617759 617084 618084 620308 623079 625845 628407 631119 634884
58670 634884 640698 649025 659576 671673 684887 699335 715224 732042 748348 762489 773395 780573
58658 780573 783626 782294 776992 768854 759087 748518 737874 728075 719869 713337 708065 703697 700073 696964
$$ packed form
58753F81173R85J118J452J664J563J336J398K052L183M342N195N909O940Q428
58739G26738R981J1171J1996J2677J3253J3685J4102J4598J4871J4465J3287J1522
58727H82346R188O134K566r32l877o013o935o252m299k225r76m57MP01J301J355
58711H71629P02n11j937l191m134m958n961p281q903j0747j2636j4309j5560j6338
58697G65865j6636j6454j5780j4527j2578j0138p932o696o392o339o058n618n109
58684F35608m342l357k675k630k722k123o75J000K224K771K766K562K712L765
58670F34884N814Q327J0551J2097J3214J4448J5889J6818J6306J4141J0906P178
58658G80573L053j332n302q138r767j0569j0644r799q206o532n272m368l624l109
$$ plain form
58644 696964 694096 691539 689725 688855 688456 687803 686636 685226 683832 682436 681096 680115 679573 678969 677735 676052
58628 676052 674826 674796 675933 677774 680065 682951 686758 691724 697797 704574 711539 718470 725515 732874 740542
58613 740542 748316 755724 761887 765806 767142 766556 765089 763324 761300 758975 756415 753633 750572 747331
58599 747331 744189 741338 738762 736439 734558 733395 733051 733412 734464 736564 740276 745915 753436 762733 773812
58584 773812 786477 800115 814037 827787 840828 852214 861110 867519 872036 875056 876826 878126 880099
58571 880099 883243 887292 892386 899662 910301 924499 941742 961556 983493 1006876 1031115 1055975
58559 1055975 1081059 1105304 1127406 1146554 1162498 1175236 1185004 1192189 1196854 1198569 1197042 1192535
58547 1192535 1185406 1175735 1163800 1150333 1135708 1119373 1100778 1080593 1060349 1041135 1023223 1006664
$$ packed form
58644F96964k868k557j814q70l99o53j167j410j394j396j340r81n42o04j234j683
58628F76052j226l0J137J841K291K886L807M966O073O777O965O931P045P359P668
58613G40542P774P408O163L919J336n86j467j765k024k325k560k782l061l241
58599G47331l142k851k576k323j881j163l44L61J052K100L712N639P521R297J1079
58584G73812J2665J3638J3922J3750J3041J1386Q896O409M517L020J770J300J973
58571H80099L144M049N094P276J0639J4198J7243J9814K1937K3383K4239K4860
58559A055975K5084K4245K2102J9148J5944J2738R768P185M665J715j527m507
58547A192535p129r671j1935j3467j4625j6335j8595k0185k0244j9214j7912j6559
$$ plain form
58535 1006664 991502 977560 964673 953053 942982 934312 926763 920425 915419 911427 908298 906832 908121
58522 908121 912172 917901 924402 931503 939109 946769 954051 960722 966528 971242 974884 977406 978338 977340 974918
58507 974918 971923 968463 964019 958462 952221 945596 938762 932317 926882 922115 917091 911703 906758 902623
58493 902623 898921 895843 894528 895564 898092 901131 904982 910488 917581 925474 934017 944039 956349 970946
58479 970946 987137 1004047 1020904 1036988 1051364 1062832 1070450 1074087 1074194 1071212 1065631 1058378 1050445
58466 1050445 1042170 1033547 1025262 1018564 1013923 1010589 1007871 1006216 1006723 1010107 1016399 1025065 1035047 1045191
58452 1045191 1054939 1064215 1072520 1078724 1081964 1082184 1079720 1075143 1069693 1064999 1061831 1059735 1058301 1058116
58438 1058116 1059935 1063488 1067748 1071988 1076197 1080761 1086096 1092271 1098846 1105486 1112776 1121811 1132867 1145200
$$ packed form
58535A006664j5162j3942j2887j1620j0071q670p549o338n006l992l129j466J289
58522I08121M051N729O501P101P606P660P282O671N806M714L642K522R32r98k422
58507I74918k995l460m444n557o241o625o834o445n435m767n024n388m945m135
58493I02623l702l078j315J036K528L039L851N506P093P893Q543J0022J2310J4597
58479I70946J6191J6910J6857J6084J4376J1468P618L637J07k982n581p253p933
58466A050445q275q623q285o698m641l334k718j655N07L384O292Q666R982J0144
58452A045191R748R276Q305O204L240K20k464m577n450m694l168k096j434j85
58438A058116J819L553M260M240M209M564N335O175O575O640P290R035J1056J2333
$$ plain form
58424 1145200 1158268 1172221 1186825 1200858 1213194 1223735 1232714 1239801 1244554 1247059 1247411 1245180 1240114
58411 1240114 1232926 1224719 1216100 1207413 1199317 1192406 1186692 1182093 1179056 1178137 1179326 1182265 1186691 1192220
58397 1192220 1198264 1204759 1212391 1221429 1230744 1238659 1244420 1248301 1250797 1252399 1253719 1255050 1256054 1256411
58383 1256411 1256505 1257035 1258418 1261070 1265665 1272404 1280417 1288530 1296318 1303926 1311445 1319082 1327468 1337042 1347505
58368 1347505 1358366 1369516 1380702 1391165 1400638 1410126 1420819 1432677 1444891 1457206 1469822 1482415
58356 1482415 1494273 1505150 1515143 1523999 1531528 1538472 1546000 1554413 1563086 1571580 1580108 1589105 1599146
58343 1599146 1611171 1625970 1643447 1662887 1683874 1706344 1729960 1753963 1777536 1799868 1820209
58332 1820209 1838338 1854667 1869454 1882341 1893083 1902145 1910064 1916885 1922842 1928968 1936300 1945011 1954915
$$ packed form
58424A145200J3068J3953J4604J4033J2336J0541Q979P087M753K505L52k231n066
58411A240114p188q207q619q687q096o911n714m599l037r19J189K939M426N529
58397A192220O044O495P632R038R315P915N761L881K496J602J320J331J004L57
58383A256411R4N30J383K652M595O739Q013Q113P788P608P519P637Q386R574J0463
58368A347505J0861J1150J1186J0463R473R488J0693J1858J2214J2315J2616J2593
58356A482415J1858J0877R993Q856P529O944P528Q413Q673Q494Q528Q997J0041
58343A599146J2025J4799J7477J9440K0987K2470K3616K4003K3573K2332K0341
58332A820209J8129J6329J4787J2887J0742R062P919O821N957O126P332Q711R904
$$ plain form
58319 1954915 1966110 1978478 1991472 2005258 2021172 2040031 2060807 2082031 2103641 2126256 2149534
58308 2149534 2172683 2195967 2220285 2245815 2272414 2300634 2330762 2361411 2390733 2418631 2446178
58297 2446178 2473384 2499369 2524486 2550305 2577437 2605177 2633374 2662935 2694187 2726403 2759307
58286 2759307 2793543 2829310 2865963 2903372 2942374 2983484 3026369 3070918 3117695 3167005 3218595
58275 3218595 3272504 3329173 3388489 3449744 3512620 3577281 3643545 3710953 3779609 3849974 3922072
58264 3922072 3995961 4072493 4152245 4234049 4315980 4397487 4479089 4560439 4640513 4719569 4799195
58253 4799195 4880530 4964080 5051113 5143342 5241224 5344332 5453306 5569657 5693633 5824084
58243 5824084 5960456 6103317 6253219 6410760 6577365 6753996 6939548 7132620 7334341
$$ packed form
58319A954915J1195J2368J2994J3786J5914J8859K0776K1224K1610K2615K3278
58308B149534K3149K3284K4318K5530K6599K8220L0128L0649K9322K7898K7547
58297B446178K7206K5985K5117K5819K7132K7740K8197K9561L1252L2216L2904
58286B759307L4236L5767L6653L7409L9002M1110M2885M4549M6777M9310N1590
58275C218595N3909N6669N9316O1255O2876O4661O6264O7408O8656P0365P2098
58264C922072P3889P6532P9752Q1804Q1931Q1507Q1602Q1350Q0074P9056P9626
58253D799195Q1335Q3550Q7033R2229R7882J03108J08974J16351J23976J30451
58243E824084J36372J42861J49902J57541J66605J76631J85552J93072K01721
$$ plain form
58234 7334341 7547202 7771803 8007456 8255385 8518318 8797357 9092434 9405535 9740111
58225 9740111 10097446 10477205 10881536 11314891 11779781 12276739 12808772 13381712 13999807
58216 13999807 14665462 15384035 16164457 17014579 17940812 18953411 20067267 21296888 22656348
58207 22656348 24165686 25852199 27745522 29879503 32302160 35078666 38285254 42010798
58199 42010798 46368582 51499082 57560084 64725457 73196960 83205764 95003650 108879901
58191 108879901 125211363 144502097 167386972 194591649 226728456 263707737 303804996
58184 303804996 343002090 375458653 395329658 399043756 386664141 361587660 328977006
58177 328977006 293949282 260326403 230168822 203931350 181000421 160382225 141293475
$$ packed form
58234G334341K12861K24601K35653K47929K62933K79039K95077L13101L34576
58225I740111L57335L79759M04331M33355M64890M96958N32033N72940O18095
58216A3999807O65655P18573P80422Q50122R26233J012599J113856J229621J359460
58207B2656348J509338J686513J893323K133981K422657K776506L206588L725544
58199D2010798M357784N130500O061002P165373Q471503J0008804J1797886J3876251
58191A08879901J6331462J9290734K2884875K7204677L2136807L6979281M0097259
58184C03804996L9197094L2456563J9871005L714098j2379615k5076481l2610654
58177C28977006l5027724l3622879l0157581k6237472k2930929k0618196j9088750
$$ plain form
58170 141293475 123443854 106964280 92135997 79147912 68008527 58584838 50674941
58163 50674941 44059247 38528859 33900701 30019985 26754623 23992438 21642896 19635466
58155 19635466 17912949 16426960 15137795 14013187 13024690 12146734 11358969 10646399 9996379
58146 9996379 9397659 8842625 8327821 7851300 7411050 7005848 6635121 6297167 5989069
58137 5989069 5708442 5453449 5221216 5008327 4812830 4633368 4466138 4305195 4146607
58128 4146607 3990511 3838681 3692130 3551716 3418896 3294536 3178212 3069448 2968403
58119 2968403 2874765 2787258 2704905 2627695 2555635 2488215 2425076 2366031 2310177 2256181 2203734
58108 2203734 2153593 2105996 2060211 2015667 1972253 1929425 1886494 1843952 1803047 1763812 1725082
$$ packed form
58170A41293475j7849621j6479574j4828283j2988085j1139385r423689p909897
58163E0674941o615694n530388m628158l880716l265362k762185k349542k007430
58155A9635466j722517j485989j289165j124608r88497q77956p87765p12570o50020
58146I996379n98720n55034n14804m76521m40250m05202l70727l37954l08098
58137E989069k80627k54993k32233k12889j95497j79462j67230j60943j58588
58128D146607j56096j51830j46551j40414j32820j24360j16324j08764j01045
58119B968403r3638q7507q2353p7210p2060o7420o3139n9045n5854n3996n2447
58108B203734n0141m7597m5785m4544m3414m2828m2931m2542m0905l9235l8730
$$ plain form
58097 1725082 1686827 1650890 1618817 1590374 1564693 1541453 1520252 1500297 1481660 1465704 1453383
58086 1453383 1443970 1436119 1429153 1422559 1415082 1405179 1391879 1374843 1354305 1331388 1307677 1284127
58074 1284127 1261025 1239054 1219265 1201688 1185143 1168885 1153492 1139666 1127284 1116169 1106707
58063 1106707 1099029 1092545 1086988 1082880 1080228 1077734 1074152 1069633 1064864 1059639 1053301 1046053 1038879 1032446
58049 1032446 1026776 1021666 1016875 1012165 1007619 1003558 999799 995525 990245 984375 978479 972574 966660 961219
58035 961219 956652 952758 949301 946481 944259 941779 938127 933249 927579 921314 914643 908251 902841 898452
58021 898452 894784 891881 889956 888852 888219 887964 888061 888202 888151 888236 889041 890771 893193 896033 899146 902547 906401
58004 906401 910704 914913 918368 921253 924522 928640 933009 936889 940260 943430 946537 949881 953982 958697
$$ packed form
58097A725082l8255l5937l2073k8443k5681k3240k1201j9955j8637j5956j2321
58086A453383r413p851o966o594p477r903j3300j7036k0538k2917k3711k3550
58074A284127k3102k1971j9789j7577j6545j6258j5393j3826j2382j1115r462
58063A106707p678o484n557m108k652k494l582m519m769n225o338p248p174o433
58049A032446n670n110m791m710m546m061l759m274n280n870n896n905n914n441
58035I61219m567l894l457k820k222k480l652m878n670o265o671o392n410m389
58021H98452l668k903j925j104o33k55R7J41n1Q5Q05J730K422K840L113L401L854
58004I06401M303M209L455K885L269M118M369L880L371L170L107L344M101M715
$$ plain form
57990 958697 962892 965629 967088 967760 967444 965912 963911 962417 961168 958932 955125 950318 945192 939884 934456
57975 934456 929292 924731 920808 917554 915186 913838 913364 913475 913878 914319 914681 915038 915535 916343 917747 919936
57959 919936 922589 925115 927562 930777 935305 940558 945540 950097 954926 960641 967257 974397 981545 988266
57945 988266 994634 1001288 1008799 1017188 1026306 1036246 1046996 1058096 1069234 1080791 1093218 1106125 1118694
57932 1118694 1130789 1142940 1155166 1166424 1175322 1180973 1183131 1181976 1177957 1171620 1163433 1153858 1143401
57919 1143401 1132413 1120975 1109183 1097434 1086285 1076260 1067834 1061198 1055863 1051071 1046930 1044568
57907 1044568 1044648 1046255 1047869 1048972 1050026 1051340 1052951 1055433 1059806 1066417 1074582 1083451 1092667 1102030
57893 1102030 1111164 1119838 1128334 1137217 1146853 1157073 1167141 1176218 1184125 1191462 1198614 1204903 1209087
$$ packed form
57990I58697M195K737J459O72l16j532k001j494j249k236l807m807n126n308n428
57975I34456n164m561l923l254k368j348m74J11M03M41L62L57M97Q08J404K189
57959I19936K653K526K447L215M528N253M982M557M829N715O616P140P148O721
57945I88266O368O654P511Q389R118R940J0750J1100J1138J1557J2427J2907J2569
57932A118694J2095J2151J2226J1258Q898N651K158j155m019o337q187r575j0457
57919A143401j0988j1438j1792j1749j1149j0025q426o636n335m792m141k362
57907A044568Q0J607J614J103J054J314J611K482M373O611Q165Q869R216R363
57893A102030R134Q674Q496Q883R636J0220J0068R077P907P337P152O289M184
$$ plain form
57880 1209087 1210470 1209154 1205570 1200392 1194646 1189150 1183858 1178225 1172188 1166299 1161087 1156880 1154025 1152568
57866 1152568 1151815 1151001 1150443 1151364 1154496 1159455 1165457 1171925 1178408 1184700 1191261 1198783 1207132 1215374 1223035
57851 1223035 1230591 1238447 1246157 1253078 1259172 1264696 1269568 1273487 1276313 1278031 1278710 1278766 1278887 1279406 1280126
57836 1280126 1280927 1282087 1283843 1286181 1289311 1293702 1299320 1305432 1311591 1318236 1325812 1333931 1342067 1350599
57822 1350599 1360340 1371257 1382366 1392777 1402248 1410836 1418645 1425918 1432891 1439478 1445552 1451495 1457940
57809 1457940 1464850 1471191 1475766 1478161 1478772 1478119 1476293 1473116 1468760 1464120 1460356 1458021 1456817 1456242 1456171
57794 1456171 1456698 1457792 1459374 1461539 1464371 1467746 1471532 1475818 1480714 1486202 1492417 1499806 1508652 1518656
57780 1518656 1529312 1540502 1552359 1564775 1577469 1590368 1603468 1616386 1628554 1639827 1650461
$$ packed form
57880A209087J383j316l584n178n746n496n292n633o037n889n212m207k855j457
57866A152568p53q14n58R21L132M959O002O468O483O292O561P522Q349Q242P661
57851A223035P556P856P710O921O094N524M872L919K826J718O79N6J21N19P20
57836A280126Q01J160J756K338L130M391N618O112O159O645P576Q119Q136Q532
57822A350599R741J0917J1109J0411R471Q588P809P273O973O587O074N943O445
57809A457940O910O341M575K395O11o53j826l177m356m640l764k335j204n75p1
57794A456171N27J094J582K165K832L375L786M286M896N488O215P389Q846J0004
57780A518656J0656J1190J1857J2416J2694J2899J3100J2918J2168J1273J0634
$$ plain form
57769 1650461 1660417 1669121 1676072 1681366 1685471 1688775 1691492 1693739 1695421 1696197 1695802 1694491 1693113 1692619 1693332
57754 1693332 1694656 1695669 1696102 1696561 1697702 1699493 1701562 1704000 1707358 1711896 1717179 1722471 1727270 1731488
57740 1731488 1735462 1739837 1745148 1751339 1757852 1764162 1770109 1775827 1781672 1788147 1795480 1803156 1810220 1816247
57726 1816247 1821762 1827584 1834011 1840852 1847986 1855598 1863934 1873031 1882621 1892185 1901235 1909647 1917639 1925277
57712 1925277 1932250 1938339 1943969 1949981 1956858 1964398 1972158 1979921 1987631 1995149 2002373 2009603 2017522 2026670
57698 2026670 2036977 2047829 2058582 2068975 2079157 2089375 2099653 2109718 2119261 2128244 2136851 2145134
57686 2145134 2152942 2160388 2168157 2176980 2186895 2197455 2208747 2221654 2236841 2253937 2272231 2291962
57674 2291962 2314403 2340783 2371603 2406974 2447054 2492042 2542350 2599292 2665181 2741965 2829015
$$ packed form
57769A650461R956Q704O951N294M105L304K717K247J682P76l95j311j378m94P13
57754A693332J324J013M33M59J141J791K069K438L358M538N283N292M799M218
57740A731488L974M375N311O191O513O310N947N718N845O475P333P676P064O027
57726A816247N515N822O427O841P134P612Q336R097R590R564R050Q412P992P638
57712A925277O973O089N630O012O877P540P760P763P710P518P224P230P919R148
57698B026670J0307J0852J0753J0393J0182J0218J0278J0065R543Q983Q607Q283
57686B145134P808P446P769Q823R915J0560J1292J2907J5187J7096J8294J9731
57674B291962K2441K6380L0820L5371M0080M4988N0308N6942O5889P6784Q7050
$$ plain form
57663 2829015 2921497 3010139 3082714 3127460 3137548 3114080 3065258 3002345 2935477 2871669 2814827
57652 2814827 2766424 2726366 2694072 2669248 2651666 2640431 2633961 2630842 2630369 2632094 2635314 2639499 2644921
57639 2644921 2652209 2661195 2670729 2679915 2689103 2699293 2710905 2723533 2736688 2750153 2763602 2776456
57627 2776456 2788501 2800315 2812692 2825764 2838982 2851915 2864726 2877778 2891085 2904306 2917150
57616 2917150 2929540 2941524 2953325 2965475 2978530 2992424 3006343 3019570 3032385 3045824 3060544
57605 3060544 3076222 3092105 3107797 3123372 3139000 3154730 3170518 3186220 3201687 3217011 3232539
57594 3232539 3248402 3264162 3279204 3293424 3307319 3321466 3336210 3351783 3368325 3385493 3402350
57583 3402350 3417966 3432205 3445796 3459608 3474006 3488883 3504165 3519998 3536395 3552986 3569441
$$ packed form
57663B829015R2482Q8642P2575M4746J0088k3468m8822o2913o6868o3808n6842
57652B814827m8403m0058l2294k4824j7582j1235o470l119m73J725L220M185N422
57639B644921P288Q986R534R186R188J0190J1612J2628J3155J3465J3449J2854
57627B776456J2045J1814J2377J3072J3218J2933J2811J3052J3307J3221J2844
57616B917150J2390J1984J1801J2150J3055J3894J3919J3227J2815J3439J4720
57605C060544J5678J5883J5692J5575J5628J5730J5788J5702J5467J5324J5528
57594C232539J5863J5760J5042J4220J3895J4147J4744J5573J6542J7168J6857
57583C402350J5616J4239J3591J3812J4398J4877J5282J5833J6397J6591J6455
$$ plain form
57572 3569441 3586038 3603373 3621368 3639021 3655486 3671135 3687096 3703961 3721429 3739175 3757395
57561 3757395 3776297 3795532 3814546 3833215 3851805 3870504 3889394 3908774 3929074 3950331 3972051
57550 3972051 3993755 4015474 4037455 4059545 4081184 4102143 4123061 4144958 4168214 4192199 4215994
57539 4215994 4239280 4262439 4285951 4309915 4334001 4357647 4380351 4402122 4423679 4445976 4469392
57528 4469392 4493489 4517563 4541244 4564518 4587431 4609996 4632361 4654933 4678280 4702837 4728554
57517 4728554 4754864 4781112 4807071 4832959 4859069 4885580 4912651 4940363 4968498 4996631 5024504
57506 5024504 5052118 5079467 5106535 5133608 5161150 5189148 5216972 5244239 5271441 5299237 5327390
57495 5327390 5355007 5381810 5408614 5436341 5464960 5493586 5521417 5548399 5575156 5602416 5630451
$$ packed form
57572C569441J6597J7335J7995J7653J6465J5649J5961J6865J7468J7746J8220
57561C757395J8902J9235J9014J8669J8590J8699J8890J9380K0300K1257K1720
57550C972051K1704K1719K1981K2090K1639K0959K0918K1897K3256K3985K3795
57539D215994K3286K3159K3512K3964K4086K3646K2704K1771K1557K2297K3416
57528D469392K4097K4074K3681K3274K2913K2565K2365K2572K3347K4557K5717
57517D728554K6310K6248K5959K5888K6110K6511K7071K7712K8135K8133K7873
57506E024504K7614K7349K7068K7073K7542K7998K7824K7267K7202K7796K8153
57495E327390K7617K6803K6804K7727K8619K8626K7831K6982K6757K7260K8035
$$ plain form
57484 5630451 5659063 5688141 5718051 5749185 5781251 5813477 5845586 5878075 5911283 5944581 5976909
57473 5976909 6007920 6038291 6069083 6101127 6134814 6169905 6205487 6240601 6275141 6309920 6345671
57462 6345671 6382234 6418849 6454930 6490344 6525261 6560113 6595545 6631935 6668908 6705683 6741978
57451 6741978 6778227 6814814 6851473 6887772 6923861 6960353 6997574 7035380 7073713 7112888 7153057
57440 7153057 7193709 7234054 7273841 7313495 7353408 7393344 7432717 7471307 7509524 7547964 7586905
57429 7586905 7626359 7666407 7707151 7748309 7789219 7829541 7869761 7910650 7952305 7994070 8035446
57418 8035446 8076642 8118046 8159475 8200408 8240827 8281434 8322874 8365043 8407319 8449400 8491684
57407 8491684 8534767 8578673 8622752 8666345 8709461 8752603 8796043 8839573 8883118 8927244 8972669
$$ packed form
57484E630451K8612K9078K9910L1134L2066L2226L2109L2489L3208L3298L2328
57473E976909L1011L0371L0792L2044L3687L5091L5582L5114L4540L4779L5751
57462F345671L6563L6615L6081L5414L4917L4852L5432L6390L6973L6775L6295
57451F741978L6249L6587L6659L6299L6089L6492L7221L7806L8333L9175M0169
57440G153057M0652M0345L9787L9654L9913L9936L9373L8590L8217L8440L8941
57429G586905L9454M0048M0744M1158M0910M0322M0220M0889M1655M1765M1376
57418H035446M1196M1404M1429M0933M0419M0607M1440M2169M2276M2081M2284
57407H491684M3083M3906M4079M3593M3116M3142M3440M3530M3545M4126M5425
$$ plain form
57396 8972669 9019260 9065926 9111688 9156641 9201621 9247100 9292756 9338130 9383320 9428773 9474640
57385 9474640 9520686 9566761 9612921 9659039 9704697 9749793 9794885 9840515 9886355 9931517 9975674
57374 9975674 10019419 10063391 10107510 10151335 10194786 10238150 10281593 10325076 10368601 10412218 10455835
57363 10455835 10499361 10543028 10587275 10632219 10677494 10722735 10768021 10813685 10859814 10906144 10952452
57352 10952452 10998914 11045993 11093949 11142585 11191502 11240510 11289630 11338740 11387456 11435462 11482773
57341 11482773 11529643 11576375 11623231 11670274 11717251 11763975 11810939 11859027 11908221 11957064 12004050
57330 12004050 12049374 12094599 12140681 12187110 12233116 12278858 12324836 12370789 12415905 12459925 12503313
57319 12503313 12546355 12588751 12630322 12671613 12713407 12755869 12798478 12840690 12882314 12923262 12963328
$$ packed form
57396H972669M6591M6666M5762M4953M4980M5479M5656M5374M5190M5453M5867
57385I474640M6046M6075M6160M6118M5658M5096M5092M5630M5840M5162M4157
57374I975674M3745M3972M4119M3825M3451M3364M3443M3483M3525M3617M3617
57363A0455835M3526M3667M4247M4944M5275M5241M5286M5664M6129M6330M6308
57352A0952452M6462M7079M7956M8636M8917M9008M9120M9110M8716M8006M7311
57341A1482773M6870M6732M6856M7043M6977M6724M6964M8088M9194M8843M6986
57330A2004050M5324M5225M6082M6429M6006M5742M5978M5953M5116M4020M3388
57319A2503313M3042M2396M1571M1291M1794M2462M2609M2212M1624M0948M0066
$$ plain form
57308 12963328 13002385 13040581 13077983 13114151 13148504 13181282 13213777 13247215 13281531 13315578 13348505
57297 13348505 13380570 13412529 13444625 13476396 13507251 13536962 13565687 13593774 13621577 13649359 13677266
57286 13677266 13705256 13732903 13759384 13783967 13806660 13828146 13848966 13868994 13887868 13905622 13922529
57275 13922529 13938528 13953270 13966808 13979793 13992736 14005317 14016730 14026597 14035240 14043018 14049783 14055265
57263 14055265 14059819 14064329 14069300 14074385 14079102 14083728 14089043 14095321 14101991 14108356 14114213 14119611 14124419 14128384
57249 14128384 14131347 14133067 14133095 14131168 14127575 14122746 14116547 14108304 14097460 14083851 14067317 14047528 14024372
57236 14024372 13998235 13969585 13938375 13904019 13865885 13823763 13778011 13729453 13679090 13627712 13575771
57225 13575771 13523621 13471764 13420640 13370243 13320261 13270717 13222241 13175354 13129555 13083497 13036300
$$ packed form
57308A2963328L9057L8196L7402L6168L4353L2778L2495L3438L4316L4047L2927
57297A3348505L2065L1959L2096L1771L0855K9711K8725K8087K7803K7782K7907
57286A3677266K7990K7647K6481K4583K2693K1486K0820K0028J8874J7754J6907
57275A3922529J5999J4742J3538J2985J2943J2581J1413R867Q643P778O765N482
57263A4055265M554M510M971N085M717M626N315O278O670O365N857N398M808L965
57249A4128384K963J720K8j927l593m829o199q243j0844j3609j6534j9789k3156
57236A4024372k6137k8650l1210l4356l8134m2122m5752m8558n0363n1378n1941
57225A3575771n2150n1857n1124n0397m9982m9544m8476m6887m5799m6058m7197
$$ plain form
57214 13036300 12988473 12941312 12895552 12850891 12806778 12763263 12720917 12680179 12640990 12603017 12566066
57203 12566066 12530274 12495900 12462855 12430449 12397846 12364852 12332138 12300525 12270066 12239862 12208814
57192 12208814 12176625 12144185 12112820 12083049 12054339 12026420 12000420 11977762 11957627 11936251 11909323
57181 11909323 11874897 11833834 11788176 11739795 11690107 11640028 11589972 11540339 11491921 11445236 11399570
57170 11399570 11353406 11306005 11258009 11210285 11162781 11114805 11065894 11015921 10964630 10911523 10856127
57159 10856127 10798064 10736901 10672019 10602534 10527247 10444937 10354843 10256841 10151273 10039106 9922379
57148 9922379 9803938 9686228 9570433 9457012 9346786 9241077 9140939 9046722 8958580 8877064
57138 8877064 8802916 8736184 8675622 8619015 8564062 8508792 8451182 8388902 8319928 8243375 8159495
$$ packed form
57214A3036300m7827m7161m5760m4661m4113m3515m2346m0738l9189l7973l6951
57203A2566066l5792l4374l3045l2406l2603l2994l2714l1613l0459l0204l1048
57192A2208814l2189l2440l1365k9771k8710k7919k6000k2658k0135k1376k6928
57181A1909323l4426m1063m5658m8381m9688n0079n0056m9633m8418m6685m5666
57170A1399570m6164m7401m7996m7724m7504m7976m8911m9973n1291n3107n5396
57159A0856127n8063o1163o4882o9485p5287q2310r0094r8002j05568j12167j16727
57148I922379j18441j17710j15795j13421j10226j05709j00138r4217q8142q1516
57138H877064p4148o6732o0562n6607n4953n5270n7610o2280o8974p6553q3880
$$ plain form
57127 8159495 8069187 7974123 7877258 7782489 7693587 7613763 7545946 7492457 7453966 7429216 7415788
57116 7415788 7410484 7409225 7408099 7404908 7398182 7384144 7357522 7318807 7280755 7265078 7291408 7369896
57104 7369896 7503633 7695498 7951779 8282246 8700549 9225855 9883825 10706675 11733565
57095 11733565 13010992 14591838 16533172 18893691 21730381 25093933 29024265 33547686
57087 33547686 38674706 44396619 50680994 57466403 64653872 72092556 79564512 86781270
57079 86781270 93403267 99081192 103505772 106448471 107782039 107481111 105611078 102312696
57071 102312696 97784038 92258885 85984438 79204631 72151748 65042336 58071927 51407450
57063 51407450 45180205 39481939 34364564 29843418 25903634 22508353 19606970 17142326
$$ packed form
57127H159495r0308r5064r6865r4769q8902p9824o7817n3489l8491k4750j3428
57116G415788n304j259j126l191o726j4038k6622l8715l8052j5677K6330P8488
57104G369896J33737J91865K56281L30467M18303N25306O57970Q22850J026890
57095A1733565J277427J580846J941334K360519K836690L363552L930332M523421
57087C3547686N127020N721913O284375O785409P187469P438684P471956P216758
57079H6781270O621997N677925M424580K942699J333568l00928j870033l298382
57071A02312696m528658n525153o274447o779807p052883p109412o970409o664477
57063E1407450o227245n698266n117375m521146l939784l395281k901383k464644
$$ plain form
57055 17142326 15056411 13294150 11805268 10545100 9475185 8563419 7783268 7112423
57047 7112423 6531955 6026227 5582862 5192296 4847004 4540693 4267769 4023332 3803544
57038 3803544 3605626 3427169 3265524 3118076 2982970 2859284 2746579 2644612 2553373 2472950
57028 2472950 2403231 2344122 2296211 2260845 2239247 2231905 2239445 2264064 2309286 2376926 2462749 2553833
57016 2553833 2629907 2668917 2654737 2583450 2464718 2317162 2160388 2008546 1868815 1743847
57006 1743847 1634471 1540415 1460065 1391061 1331496 1280260 1236348 1198482 1165573 1137119 1112756
56995 1112756 1091669 1072731 1055131 1038608 1023139 1008595 994818 982002 970901 962543 957612 956090
56983 956090 957514 961275 966258 970189 969768 961927 945198 920273 889673 856831 824809 795292 768692
$$ packed form
57055A7142326k085915j762261j488882j260168j069915r11766p80151o70845
57047G112423n80468n05728m43365l90566l45292l06311k72924k44437k19788
57038C803544j97918j78457j61645j47448j35106j23686j12705j01967r1239q0423
57028B472950o9719n9109m7911l5366k1598p342P540K4619M5222O7640Q5823R1084
57016B553833P6074L9010j4180p1287j18732j47556j56774j51842j39731j24968
57006A743847j09376r4056q0350o9004n9565n1236m3912l7866l2909k8454k4363
56995A112756k1087j8938j7600j6523j5469j4544j3777j2816j1101q358m931j522
56983I56090J424L761M983L931m21p841j6729k4925l0600l2842l2022k9517k6600
$$ plain form
56970 768692 745160 725132 708828 695804 685528 678123 673973 672791 673738 676538 681945 690905 703708
56957 703708 720214 740260 762992 785633 803472 811722 807863 792519 768464 739013 707223 675982
56945 675982 647930 624658 606080 591002 578484 568576 561878 558799 559421 563808 572137 584570 601231
56932 601231 622306 648014 678180 711449 744514 772064 788090 788235 771691 741344 702182 659278
56920 659278 616520 576346 539984 507810 479719 455562 435413 419397 407222 397934 390285 383380
56908 383380 376992 371367 366830 363463 360986 358919 357011 355520 354869 355041 355499 355861 356511 358269 361491
56893 361491 365694 370268 375451 382406 392255 405125 420292 437132 455585 475442 495305 512446
56881 512446 523840 527516 523329 512859 498592 482906 467491 453468 441687 432701 426603 423213
$$ packed form
56970G68692k3532k0028j6304j3024j0276p405m150j182R47K800N407Q960J2803
56957G03708J6506K0046K2732K2641J7839Q250l859j5344k4055k9451l1790l1241
56945F75982k8052k3272j8578j5078j2518r908o698l079O22M387Q329J2433J6661
56932F01231K1075K5708L0166L3269L3065K7550J6026J45j6544l0347l9162m2904
56920F59278m2758m0174l6362l2174k8091k4157k0149j6016j2175r288p649o905
56908C83380o388n625m537l367k477k067j908j491o51J72M58L62O50J758L222
56893C61491M203M574N183O955R849J2870J5167J6840J8453J9857J9863J7141
56881E12446J1394L676m187j0470j4267j5686j5415j4023j1781q986o098l390
$$ plain form
56869 423213 422554 424995 430968 440633 453774 469922 488800 510935 537802 570941 610656 655311
56857 655311 701239 742852 773416 787340 782860 762608 731487 694262 655044 617793 585872 560938
56845 560938 542834 530797 524422 523641 528440 538880 555153 577508 606421 642907 688305 743495
56833 743495 808229 880574 955843 1025580 1078601 1104892 1099968 1066376 1011649 944870 874182 805696
56821 805696 743270 688801 642886 605464 576130 554311 539546 531675 530705 536525 548985 568202
56809 568202 594560 628234 668811 715113 764569 812047 849647 869023 865205 838818 794986 740485
56797 740485 681747 624201 571895 526953 489632 459222 434944 416262 402820 394377 390690 391357
56785 391357 395963 404430 417025 433956 455131 480172 508046 536106 559757 573793 574715 562190
$$ packed form
56869D23213o59K441N973R665J3141J6148J8878K2135K6867L3139L9715M4655
56857F55311M5928M1613L0564J3924m480k0252l1121l7225l9218l7251l1921k4934
56845E60938j8104j2037o375p81M799J0440J6273K2355K8913L6486M5398N5190
56833G43495O4734P2345P5269O9737N3021K6291m924l3592n4727o6779p0688o8486
56821H05696o2426n4469m5915l7422k9334k1819j4765p871r70N820J2460J9217
56809E68202K6358L3674M0577M6302M9456M7478L7600J9376l818k6387m3832n4501
56797G40485n8738n7546n2306m4942l7321l0410k4278j8682j3442q443l687O67
56785C91357M606Q467J2595J6931K1175K5041K7874K8060K3651J4036R22j2525
$$ plain form
56773 562190 538743 508335 474943 441645 410260 381542 355745 333091 313839 298026 285282
56762 285282 274934 266284 258852 252420 246953 242462 238895 236073 233714 231546 229400 227241 225154 223300
56748 223300 221736 220234 218442 216283 214057 212022 210059 208037 206307 205386 205123 204629 203243 201232 199330
56733 199330 197901 196864 196198 196059 196448 197128 197879 198574 199071 199360 199809 200902 202616 204339 205524 206168 206538
56716 206538 206761 206907 207229 207945 208913 209777 210427 211079 211945 212989 213974 214587 214546 213807 212703 211664 210809 209952
56698 209952 209026 208296 208082 208359 208731 208741 208227 207482 207040 207216 207839 208547 209236 210009 210755 211068 210705 209906 209082
56679 209082 208366 207582 206569 205453 204691 204780 205693 206600 206499 205283 203916 203376 203744 204563 205658 207118 208683
56662 208683 209838 210554 211444 212976 214876 216441 217222 217285 217119 217443 218846 221322 224307 227237 229937 232368
$$ packed form
56773E62190k3447l0408l3392l3298l1385k8718k5797k2654j9252j5813j2744
56762B85282j0348q650p432o432n467m491l567k822k359k168k146k159k087j854
56748B23300j564j502j792k159k226k035j963k022j730r21k63m94j386k011j902
56733A99330j429j037o66j39L89O80P51O95M97K89M49J093J714J723J185O44L70
56716B06538K23J46L22P16R68Q64O50O52Q66J044R85O13m1p39j104j039q55q57
56698B09952r26p30k14K77L72J0n14p45m42J76O23P08O89P73P46L13l63p99q24
56679B09082p16p84j013j116p62Q9R13R07j01j216j367n40L68Q19J095J460J565
56662B08683J155P16Q90J532J900J565P81O3j66L24J403K476K985K930K700K431
$$ plain form
56646 232368 234302 235596 236673 238371 241193 244855 248686 252277 255592 258450 260188 260135 258405 255924 253550
56631 253550 251369 248986 246221 243213 240071 236905 234149 232363 231558 231080 230281 228998 227274 225014 222202
56616 222202 219219 216616 214655 213260 212291 211656 211293 211214 211497 212091 212681 212901 212670 212244 211994 212114 212465 212707
56598 212707 212657 212474 212337 212129 211739 211573 212294 213945 215741 216950 217618 218279 219246 220456 221696 222697 223268
56581 223268 223558 223977 224628 225126 225220 225261 225691 226330 226655 226674 227080 228472 230666 232838 234314 235269 236621 239054
56563 239054 242243 245420 248674 253007 258895 265523 271908 278087 284511 290804 296089 300278 304172 308341
56549 308341 312700 317128 321633 325811 328936 330875 332243 333371 333766 332943 331222 329247 327144 324598 321432
56534 321432 317703 313441 308715 303830 299174 294879 290825 286946 283394 280445 278230 276500 274705 272470
$$ packed form
56646B32368J934J294J077J698K822L662L831L591L315K858J738n3j730k481k374
56631B53550k181k383k765l008l142l166k756j786q05m78p99j283j724k260k812
56616B22202k983k603j961j395r69o35l63p9K83N94N90K20k31m26k50J20L51K42
56598B12707n0j83j37k08l90j66P21J651J796J209O68O61R67J210J240J001N71
56581B23268K90M19O51M98R4M1M30O39L25J9M06J392K194K172J476R55J352K433
56563B39054L189L177L254M333N888O628O385O179O424O293N285M189L894M169
56549C08341M359M428M505M178L125J939J368J128L95q23j721j975k103k546l166
56534C21432l729m262m726m885m656m295m054l879l552k949k215j730j795k235
$$ plain form
56520 272470 269917 267403 265077 262965 261298 260341 259959 259689 259212 258438 257286 255845 254629 254137 254157 254014
56504 254014 253437 252608 251431 249543 247198 245344 244458 244016 243470 243057 243076 243023 242173 240646 239220 238362 238045
56487 238045 238274 239075 239971 240150 239340 238203 237699 238277 239669 241237 242486 243446 244550 246036 247545 248438
56471 248438 248466 248011 247766 248194 249209 250333 251326 252521 254257 256089 257122 257189 257089 257396 257626 257064 255911
56454 255911 255094 255198 256078 257243 258135 258265 257618 256813 256487 256618 256774 256755 256566 256065 255199 254451 254444 255162 256063
56435 256063 256920 257964 259207 260227 260810 261349 262354 263859 265452 266629 267080 266970 267032 268040 270002 272093
56419 272093 273502 274164 274567 275115 275868 276773 277953 279589 281451 282690 282502 281104 279657 278906 278369 277341
56403 277341 276256 276245 277510 279041 280081 281048 282687 284973 287346 289486 291332 292736 293712 294793 296562
$$ packed form
56520B72470k553k514k326k112j667r57l82k70m77p74j152j441j216m92K0j43
56504B54014n77q29j177j888k345j854q86m42n46m13J9n3q50j527j426q58l17
56487B38045K29Q01Q96J79q10j137n04N78J392J568J249R60J104J486J509Q93
56471B48438K8m55k45M28J015J124R93J195J736J832J033O7j00L07K30n62j153
56454B55911q17J04Q80J165Q92J30o47q05l26J31J56j9j89n01q66p48pP18R01
56435B56063Q57J044J243J020N83N39J005J505J593J177M51j10O2J008J962K091
56419B72093J409O62M03N48P53R05J180J636J862J239j88j398j447p51n37j028
56403B77341j085j1J265J531J040R67J639K286K373K140J846J404R76J081J769
$$ plain form
56388 296562 298845 300855 302169 303207 304631 306577 308594 310176 311218 312008 312842 313673 314254 314667 315518 317388
56372 317388 320108 322802 324636 325407 325442 325168 324809 324349 323688 322894 322251 321901 321516 320664 319522 318865 319109 319760
56354 319760 320160 320409 320979 321687 321841 321497 321736 323279 325462 327106 327871 328173 328237 328018 327782 327992 328672 329583
56336 329583 330904 332950 335284 336978 337904 338901 340418 341880 342777 343545 344796 346404 348003 349726 351747
56321 351747 353649 355059 356497 358691 361335 363374 364471 365382 366865 368901 371119 373381 375753 378268
56307 378268 380872 383360 385427 387032 388554 390322 392292 394543 397601 401622 405613 408379 410132 412169
56293 412169 414981 417722 419797 421871 424688 427716 429851 430970 431946 433438 435456 437984 441231 445101
56279 445101 449062 452780 456477 460405 464449 468517 472915 477808 482585 486393 489359 492732 497573 503794
$$ packed form
56388B96562K283K010J314J038J424J946K017J582J042P90Q34Q31N81M13Q51J870
56372C17388K720K694J834P71L5k74l59m60o61p94o43l50l85q52j142o57K44O51
56354C19760M00K49N70P08J54l44K39J543K183J644P65L02O4k19k36K10O80R11
56336C29583J321K046K334J694R26R97J517J462Q97P68J251J608J599J723K021
56321C51747J902J410J438K194K644K039J097R11J483K036K218K262K372K515
56307C78268K604K488K067J605J522J768J970K251L058M021L991K766J753K037
56293D12169K812K741K075K074K817L028K135J119R76J492K018K528L247L870
56279D45101L961L718L697L928M044M068M398M893M777L808K966L373M841O221
$$ plain form
56265 503794 510713 518034 525759 533581 541158 548902 557788 568303 580196 593282 607800 623837 641151
56252 641151 659867 680698 704051 729573 756947 786442 818096 850995 884057 917086 950376
56241 950376 983739 1016580 1048476 1078809 1106192 1129195 1147455 1161304 1170494 1174219 1172340 1165719
56229 1165719 1155319 1141765 1125788 1108219 1089361 1069107 1047801 1026216 1004517 982077 958669
56218 958669 935135 912516 891206 871385 853575 838093 824317 811205 798406 786399 775571
56207 775571 765550 755653 745806 736890 730053 725689 723193 721671 720570 719541 718266 716864 716073 716388
56193 716388 717212 717443 716772 715839 715276 715307 716172 718206 721297 724849 728432 732010 735548 738929 742298 745909
56177 745909 749623 753097 756551 760727 765965 771841 777845 783916 790245 797006 804351 812219 820201 828153
$$ packed form
56265E03794O919P321P725P822P577P744Q886J0515J1893J3086J4518J6037J7314
56252F41151J8716K0831K3353K5522K7374K9495L1654L2899L3062L3029L3290
56241I50376L3363L2841L1896L0333K7383K3003J8260J3849R190L725j879o621
56229A165719j0400j3554j5977j7569j8858k0254k1306k1585k1699k2440k3408
56218I58669k3534k2619k1310j9821j7810j5482j3776j3112j2799j2007j0828
56207G75571j0021r897r847q916o837m364k496j522j101j029j275j402p91L15
56193G16388Q24K31o71r33n63L1Q65K034L091L552L583L578L538L381L369L611
56177G45909L714L474L454M176N238N876O004O071O329O761P345P868P982P952
$$ plain form
56163 828153 836867 847489 860183 873999 888023 902041 916069 930109 944564 960209 977432 996111
56151 996111 1016353 1038693 1063332 1089915 1118405 1149652 1184825 1224816 1270400 1322399 1381526
56140 1381526 1448713 1525870 1615703 1720247 1839757 1972770 2116249 2265113 2412232 2549800
56130 2549800 2671249 2772728 2854093 2919099 2973888 3024099 3072434 3117954 3156875 3184370 3196945
56119 3196945 3194111 3178112 3152477 3120906 3086288 3048920 3005238 2949338 2876318 2784197 2673675
56108 2673675 2547963 2413199 2277378 2147583 2028305 1922066 1830330 1753279 1689779 1638335
56098 1638335 1597675 1566319 1542549 1525176 1513558 1506678 1503090 1501969 1503205 1506251 1509940 1513718 1517933
56085 1517933 1522624 1527334 1532530 1539814 1549985 1562049 1574861 1588579 1603750 1620097 1637150 1655059
$$ packed form
56163H28153Q714J0622J2694J3816J4024J4018J4028J4040J4455J5645J7223J8679
56151I96111K0242K2340K4639K6583K8490L1247L5173L9991M5584N1999N9127
56140A381526O7187P7157Q9833J04544J19510J33013J43479J48864J47119J37568
56130B549800J21449J01479Q1365O5006N4789N0211M8335M5520L8921K7495J2575
56119C196945k834j5999k5635l1571l4618l7368m3682n5900p3020r2121j10522
56108B673675j25712j34764j35821j29795j19278j06239r1736p7051o3500n1444
56098A638335m0660l1356k3770j7373j1618o880l588j121J236L046L689L778M215
56085A517933M691M710N196P284J0171J2064J2812J3718J5171J6347J7053J7909
$$ plain form
56073 1655059 1673888 1693016 1712135 1732072 1753783 1777214 1801831 1827440 1853774 1880077 1905817
56062 1905817 1931185 1956288 1980662 2004041 2026784 2049050 2070556 2091599 2113307 2136322 2160303
56051 2160303 2185154 2211543 2239699 2269024 2299436 2331673 2365549 2399519 2432853 2466785 2502501
56040 2502501 2539540 2577270 2616500 2658312 2702596 2748982 2797975 2849888 2903751 2958477 3014102
56029 3014102 3070978 3128969 3188353 3250094 3314185 3379227 3444637 3511648 3581119 3652237 3724680
56018 3724680 3799986 3879227 3961303 4045372 4133105 4226475 4325023 4427351 4533767 4645360 4761905
56007 4761905 4882728 5008358 5139478 5275676 5416999 5565154 5721427 5885123 6055855
55998 6055855 6235374 6425189 6624458 6832246 7049610 7277324 7514028 7759185 8015522
$$ packed form
56073A655059J8829J9128J9119J9937K1711K3431K4617K5609K6334K6303K5740
56062A905817K5368K5103K4374K3379K2743K2266K1506K1043K1708K3015K3981
56051B160303K4851K6389K8156K9325L0412L2237L3876L3970L3334L3932L5716
56040B502501L7039L7730L9230M1812M4284M6386M8993N1913N3863N4726N5625
56029C014102N6876N7991N9384O1741O4091O5042O5410O7011O9471P1118P2443
56018C724680P5306P9241Q2076Q4069Q7733R3370R8548J02328J06416J11593J16545
56007D761905J20823J25630J31120J36198J41323J48155J56273J63696J70732
55998F055855J79519J89815J99269K07788K17364K27714K36704K45157K56337
$$ plain form
55989 8015522 8286142 8571834 8873820 9196070 9541774 9910491 10302140 10720811 11171153
55980 11171153 11654402 12171964 12729513 13333209 13985354 14688571 15450890 16281909 17187980
55971 17187980 18176842 19263137 20463574 21791195 23261514 24900524 26740554 28814705
55963 28814705 31165093 33852961 36953838 40551858 44752683 49697878 55555973 62508068
55955 62508068 70756853 80539790 92115533 105754583 121783772 140656284 162979398
55948 162979398 189492300 220959596 257763621 299006822 341486878 379517311 406330184
55941 406330184 416603873 408603814 384618145 349628735 309267199 268213427 229537391
55934 229537391 194813956 164579192 138780807 117077482 99000755 84044595 71719385
$$ packed form
55989H015522K70620K85692L01986L22250L45704L68717L91649M18671M50342
55980A1171153M83249N17562N57549O03696O52145P03217P62319Q31019R06071
55971A7187980R88862J086295J200437J327621J470319J639010J840030K074151
55963B8814705K350388K687868L100877L598020M200825M945195N858095O952095
55955F2508068Q248785R782937J1575743J3639050J6029189J8872512K2323114
55948A62979398K6512902L1467296L6804025M1243201M2480056L8030433K6812873
55941D06330184J0273689q000059k3985669l4989410m0361536m1053772l8676036
55934B29537391l4723435l0234764k5798385k1703325j8076727j4956160j2325210
$$ plain form
55927 71719385 61577442 53221378 46311132 40568675 35770960 31736626 28319488 25406741
55919 25406741 22911312 20761215 18896383 17270532 15847954 14597004 13489420 12503563
55911 12503563 11622933 10831725 10115471 9464682 8873463 8334946 7841557 7388669 6973958
55902 6973958 6593565 6242348 5917353 5617661 5341171 5084517 4845623 4623433 4415741
55893 4415741 4220136 4036470 3865608 3706417 3556734 3416508 3287078 3167974 3057372
55884 3057372 2955154 2862541 2779092 2703047 2634529 2575661 2527464 2489083 2459783 2438722 2422318
55873 2422318 2404088 2377682 2338777 2284947 2216519 2137755 2054653 1970863 1887205 1804773 1726022
55862 1726022 1652486 1583653 1518758 1457992 1401503 1348854 1299985 1255391 1215041 1178364 1145420
$$ packed form
55927G1719385j0141943q356064o910246n742457m797715m034334l417138k912747
55919B5406741k495429k150097j864832j625851j422578j250950j107584r85857
55911A2503563q80630p91208p16254o50789n91219n38517m93389m52888m14711
55902F973958l80393l51217l24995k99692k76490k56654k38894k22190k07692
55893D415741j95605j83666j70862j59191j49683j40226j29430j19104j10602
55884C057372j02218r2613q3449p6045o8518n8868m8197l8381k9300k1061j6404
55873B422318j8230k6406l8905n3830o8428p8764q3102q3790q3658q2432p8751
55862A726022p3536o8833o4895o0766n6489n2649m8869m4594m0350l6677l2944
$$ plain form
55851 1145420 1116826 1092417 1071053 1051622 1033060 1013795 992616 969984 947236 924860 902870
55840 902870 882255 864222 848233 832547 816649 801556 787840 774992 762694 751071 739685
55829 739685 727868 716123 705712 696866 688860 681615 675545 669910 663204 655304 647438 639905 631634
55816 631634 622316 613104 604707 596537 588366 581163 575567 571034 567325 565523 566676 570434 575749 581947
55802 581947 588551 594956 600872 606284 610565 612482 611357 607404 600713 590944 578310 563889 548692
55789 548692 533373 518940 506647 496942 489536 484552 482289 481610 479982 475629 468599 459522 448843
55776 448843 437761 428362 421817 417419 414098 411844 410981 411075 411361 411356 410392 407535 402650 396674 390185 382660
55760 382660 373820 364708 356547 349423 342962 337498 333576 330833 328233 324962 320483 314312 306432 297505
$$ packed form
55851A145420k8594k4409k1364j9431j8562j9265k1179k2632k2748k2376k1990
55840I02870k0615j8033j5989j5686j5898j5093j3716j2848j2298j1623j1386
55829G39685j1817j1745j0411q846q006p245o070n635o706p900p866p533q271
55816F31634r318r212q397q170q171p203n596m533l709j802J153L758N315O198
55802E81947O604O405N916N412M281J917j125l953o691r769j2634j4421j5197
55789E48692j5319j4433j2293r705p406m984k263o79j628m353p030r077j0679
55776D48843j1082r399o545m398l321k254q63R4K86nr64k857m885n976o489p525
55760C82660q840r112q161p124o461n464l922k743k600l271m479o171p880q927
$$ plain form
55746 297505 288147 278598 269445 261794 256070 251477 247334 244067 242084 240541 238315 235563 233249 231625
55732 231625 230243 229138 228873 229538 230551 231359 231584 230728 228590 225912 223821 222538 221226 219153 216464
55717 216464 213848 211919 210955 210765 210757 210425 209748 208961 208172 207463 207104 207265 207714 208088 208315 208553 208923 209451 209981
55698 209981 209977 208836 206581 203790 200636 196636 191713 186865 183182 180676 178722 177195 176503 176800 177828
55683 177828 179308 180892 181960 182124 181904 182402 184329 187606 191620 195425 198024 199117 199429 199862 200524 201054
55667 201054 201518 202275 203188 203794 204257 205366 207494 210291 213607 218011 223926 230716 237096 242241 246189
55652 246189 249332 251822 253388 253520 251828 248320 243342 237251 230211 222359 214086 206124 199253 193809
55638 193809 189418 185348 181280 177633 175051 173640 172804 171761 170055 167701 165045 162578 160766 159851 159592
$$ packed form
55746B97505r358r549r153p651n724m593m143l267j983j543k226k752k314j624
55732B31625j382j105k65O65J013Q08K25q56k138k678k091j283j312k073k689
55717B16464k616j929r64j90ql32o77p87p89p09l59J61M49L74K27K38L70N28N30
55698B09981mj141k255k791l154m000m923m848l683k506j954j527o92K97J028
55683A77828J480J584J068J64k20M98J927L277M014L805K599J093L12M33O62N30
55667B01054M64P57R13O06M63J109K128K797L316M404N915O790O380N145L948
55652B46189L143K490J566J32j692l508m978o091p040p852q273p962o871n444
55638A93809m391m070m068l647k582j411q36j043j706k354k656k467j812r15k59
$$ plain form
55623 159592 159244 158077 156116 154151 152740 151550 150015 148394 147484 147374 147243 146533 145590 144824 143928 142494
55607 142494 140898 139922 139753 139934 140101 140266 140396 140225 139548 138395 136876 135059 133042 131055 129465 128657
55591 128657 128671 128942 128699 127746 126597 125758 125260 125099 125669 127361 129950 132769 135278 137207 138444 139193 140103
55574 140103 141813 144392 147478 150825 154432 158223 161972 165560 169117 172887 177037 181469 185702 189042
55560 189042 190988 191431 190492 188386 185415 181775 177317 171921 166178 161189 157446 154376 151300 148381 146179
55545 146179 144703 143446 142148 141013 140282 140012 140143 140470 140658 140578 140484 140564 140518 139945 138944 138025 137535 137445 137468
55526 137468 137081 135703 133281 130587 128547 127399 126724 126055 125087 123592 121626 119693 118232 117085 115878
55511 115878 114737 114131 114104 114165 113935 113398 112569 111422 110237 109530 109462 109614 109472 108912 108139 107410 106924 106854 107355
$$ packed form
55623A59592l48j167j961j965j411j190j535j621r10j10j31p10r43p66q96j434
55607A42494j596r76j69J81J67J65J30j71o77j153j519j817k017j987j590q08
55591A28657J4K71k43r53j149q39m98j61N70J692K589K819K509J929J237P49R10
55574A40103J710K579L086L347L607L791L749L588L557L770M150M432M233L340
55560A89042J946M43r39k106k971l640m458n396n743m989l743l070l076k919k202
55545A46179j476j257j298j135p31k70J31L27J88q0r4Q0m6n73j001r19m90r0K3
55526A37468l87j378k422k694k040j148o75o69r68j495j966j933j461j147j207
55511A15878j141o06k7O1k30n37q29j147j185p07o8J52j42n60p73p29m86p0N01
$$ plain form
55492 107355 108539 110236 111795 112442 112044 111258 110687 110188 109324 108118 106952 106004 105244 104725 104403 103940 103212
55475 103212 102753 103102 103991 104788 105519 106670 108148 109311 110020 110747 111514 111636 110864 109963 109685 109800 109662 109238
55457 109238 109064 109522 110546 111776 112698 112964 112820 112859 113132 113038 112379 111959 112614 114053 115276 115833 116077 116370
55439 116370 116648 116743 116641 116374 116053 115976 116281 116491 115879 114425 113022 112512 112792 113133 113209 113503 114675 116730
55421 116730 118958 120603 121484 121962 122529 123591 125537 128694 133074 138296 143794 149014 153467 156796 158863
55406 158863 159612 158846 156416 152670 148425 144302 140348 136469 132907 129991 127620 125383 123093 120870 118763
55391 118763 116699 114869 113792 113733 114220 114370 113649 112262 110857 109962 109695 109860 110202 110524 110602 110146 109012
55374 109012 107446 106016 105195 105037 105285 105764 106538 107639 108769 109417 109395 109145 109391 110423 111764 112565 112311
$$ packed form
55492A07355J184J697J559O47l98p86n71m99q64j206j166r48p60n19l22m63p28
55475A03212m59L49Q89P97P31J151J478J163P09P27P67J22p72r01k78J15j38m24
55457A09238j74M58J024J230R22K66j44L9K73r4o59m20O55J439J223N57K44K93
55439A16370K78R5j02k67l21p7L05K10o12j454j403n10K80L41P6K94J172K055
55421A16730K228J645Q81M78N67J062J946L157M380N222N498N220M453L329K067
55406A58863P49p66k430l746m245m123l954l879l562k916k371k237k290k223k107
55391A18763k064j830j077n9M87J50p21j387j405q95k67J65L42L22P8m56j134
55374A09012j566j430q21j58K48M79P74J101J130O48k2k50K46J032J341Q01k54
$$ plain form
55357 112311 111158 109663 108340 107487 107293 107875 109117 110631 112030 113161 113958 114197 113667 112553 111321 110161
55341 110161 108897 107607 106928 107364 108471 109157 108807 107807 106986 106866 107465 108462 109330 109592 109254 108895 109141
55324 109141 110040 111019 111450 111136 110346 109483 108796 108316 107987 107824 107979 108683 110022 111635 112721 112629 111573 110559
55306 110559 110361 110679 110547 109558 108407 108140 109086 110670 112080 112895 113088 112730 111971 111230 111094 111833 113085
55289 113085 114208 114865 115134 115174 115025 114744 114432 114065 113524 112858 112288 111914 111672 111670 112212 113290 114338 114745 114482
55270 114482 113978 113595 113390 113244 113011 112684 112498 112647 112796 112237 110759 109051 108006 107937 108714 110197 112049
55253 112049 113515 114033 113889 113767 113890 114120 114624 115678 116902 117475 117191 116616 116087 115302 114092 112878 111977
55236 111977 111112 110073 109366 109597 110530 111287 111349 110916 110398 109991 109742 109693 109873 110292 110950 111773 112649 113612 114778
$$ packed form
55357A12311j153j495j323q53j94N82J242J514J399J131P97K39n30j114j232j160
55341A10161j264j290o79M36J107O86l50j000q21j20N99R97Q68K62l38l59K46
55324A09141Q99R79M31l14p90q63o87m80l29j63J55P04J339J613J086r2j056j014
55306A10559j98L18j32r89j151k67R46J584J410Q15J93l58p59p41j36P39J252
55289A13085J123O57K69M0j49k81l12l67n41o66n70l74k42kN42J078J048M07k63
55270A14482n04l83k05j46k33l27j86J49J49n59j478j708j045o9P77J483J852
55253A12049J466N18j44j22J23K30N04J054J224N73k84n75n29p85j210j214r01
55236A11977q65j039p07K31R33P57O2m33n18m07k49m9J80M19O58Q23Q76R63J166
$$ plain form
55217 114778 115968 116553 115931 114197 112221 111079 111353 112804 114626 116073 116930 117346 117367 116896 116088 115417 115203
55200 115203 115284 115312 115178 114997 114846 114717 114615 114559 114485 114246 113725 113004 112447 112452 112936 113274 112985 112409 112346 113158 114552
55179 114552 116165 117792 119033 119321 118634 117744 117475 117961 118849 119816 120641 121147 121522 122381 124034 125822 126663
55162 126663 126256 125411 125154 125780 126811 127628 127986 127992 127761 127232 126455 125892 126087 126909 127402 126644 124653 122347
55144 122347 120714 120136 120287 120491 120285 119770 119380 119295 119311 119340 119700 120671 121980 122999 123391 123375 123432 123890 124690
55125 124690 125410 125632 125403 125289 125845 127107 128589 129671 129989 129654 129170 128920 128710 128043 126853 125643 124863
55108 124863 124484 124306 124265 124290 124251 124250 124596 125226 125584 125405 125157 125312 125595 125538 125401 125822 126712 127225 126923 126306 126060
55087 126060 126268 126674 127269 128221 129388 130211 130084 128809 126730 124523 122774 121712 121291 121356 121674 122014 122363
$$ packed form
55217A14778J190N85o22j734j976j142K74J451J822J447Q57M16K1m71q08o71k14
55200A15203Q1K8j34j81j51j29j02n6p4k39n21p21n57NM84L38k89n76o3Q12J394
55179A14552J613J627J241K88o87q90k69M86Q88R67Q25N06L75Q59J653J788Q41
55162A26663m07q45k57O26J031Q17L58Ok31n29p77n63J95Q22M93p58j991k306
55144A22347j633n78J51K04k06n15l90q5J6K9L60R71J309J019L92j6N7M58Q00
55125A24690P20K22k29j14N56J262J482J082L18l35m84k50k10o67j190j210p80
55108A24863l79j78m1K5l9jL46O30L58j79k48J55K83n7j37M21Q90N13l02o17k46
55087A26060K08M06N95R52J167Q23j27j275k079k207j749j062m21O5L18L40L49
$$ plain form
55070 122363 122882 123493 123765 123459 122937 122657 122532 122251 122046 122513 123651 124743 125349 125863 126746 127705 128096 127819
55052 127819 127371 127139 127108 127202 127443 127713 127731 127440 127146 127092 127091 126824 126380 126202 126493 126940 127099 126846 126341 125773 125380
55031 125380 125502 126306 127532 128704 129594 130224 130521 130302 129600 128673 127624 126396 125256 124855 125535 126875 128247
55014 128247 129538 131000 132605 133975 134855 135318 135555 135747 136153 136968 137987 138663 138619 138033 137434 137167 137100 136800
54996 136800 135967 134701 133367 132312 131736 131704 132055 132425 132615 132895 133644 134744 135674 136178 136396 136335 135822 135156
54978 135156 135237 136595 138690 140555 141815 142716 143490 144079 144225 143532 141784 139577 138218 138514 139974 141646
54962 141646 143311 145224 147127 148401 149058 149750 150766 151772 152644 153775 155325 156704 157153 156498 155214
54947 155214 154071 153712 154146 154625 154461 153998 154217 155335 156435 156678 156359 156452 157540 159502 161838 164067 166043
$$ packed form
55070A22363N19O11K72l06n22k80j25k81k05M67J138J092O06N14Q83R59L91k77
55052A27819m48k32l1R4K41K70J8k91k94n4jk67m44j78K91M47J59k53n05n68l93
55031A25380J22Q04J226J172Q90O30K97k19p02r27j049j228j140m01O80J340J372
55014A28247J291J462J605J370Q80M63K37J92M06Q15J019O76m4n86n99k67o7l00
54996A36800q33j266j334j055n76l2L51L70J90K80P49J100R30N04K18o1n13o66
54978A35156Q1J358K095J865J260R01P74N89J46o93j748k207j359K96J460J672
54962A41646J665J913J903J274O57O92J016J006Q72J131J550J379M49o55j284
54947A55214j143l59M34M79j64m63K19J118J100K43l19R3J088J962K336K229J976
$$ plain form
54930 166043 168118 170774 174112 178131 183419 190877 200426 210587 219695 227135 233060 237440 239897 240182
54916 240182 238341 234602 229430 223435 216907 209720 201982 194378 187460 181038 174833 169401 165652 163543
54902 163543 162016 160349 158970 158627 159255 160039 160359 160290 160248 160477 160964 161714 162891 164659 166947 169537 172416
54885 172416 175950 180619 186661 193957 202072 210334 218073 225005 231287 236929 241220 242989 241612 237653
54871 237653 232387 226693 220575 213756 206507 199533 193136 186941 180681 174832 170077 166435 163404 160763
54857 160763 158662 156998 155385 153826 152771 152288 151771 150777 149599 148645 147751 146613 145425 144467 143390 141594
54841 141594 139212 137074 135688 134800 134020 133364 133038 133119 133653 134722 136207 137735 139091 140415 141769 142746
54825 142746 142835 142124 141306 140935 140923 140933 140971 141265 141592 141212 139702 137615 135983 135342 135482 135994 136637 137299 138050
$$ packed form
54930A66043K075K656L338M019N288P458R549J0161R108P440N925M380K457K85
54916B40182j841l739n172n995o528p187p738p604o918o422o205n432l749k109
54902A63543j527j667j379l43O28P84L20o9m2K29M87P50J177J768K288K590K879
54885A72416L534M669O042P296Q115Q262P739O932O282N642M291J769j377l959
54871B37653n266n694o118o819p249o974o397o195o260n849m755l642l031k641
54857A60763k101j664j613j559j055m83n17r94j178r54q94j138j188r58j077j796
54841A41594k382k138j386q88p80o56l26Q1N34J069J485J528J356J324J354R77
54825A42746Q9p11q18l71j2J0L8K94L27l80j510k087j632o41J40N12O43O62P51
$$ plain form
54806 138050 139312 141498 144347 146994 148835 149927 150422 150204 149456 149065 149838 151485 152922 153501 153515 153604 154126
54789 154126 155189 156806 158776 160591 161759 162255 162648 163714 165826 168673 171647 174508 177562 181266 185898
54774 185898 191583 198299 205836 214088 223414 234296 246504 259087 271358 283258 294352 303054 307521
54761 307521 307152 302867 296335 289321 283200 278125 272757 265555 256353 246243 236148 226283 216926 208807
54747 208807 202435 197648 194040 191338 189154 186896 184251 181437 178848 176814 175777 176209 178099 180846
54733 180846 183772 186463 188688 190549 192780 196301 201299 207280 214029 221707 229747 236532 240845 242954
54719 242954 243585 242460 238735 232552 225186 217724 210380 203167 196475 190776 186190 182546 179524 176752
54705 176752 174110 171959 170676 169995 169201 167956 166459 164816 162876 160850 159483 159193 159462 159418 158750 157698
$$ packed form
54806A38050J262K186K849K647J841J092M95k18p48l91P73J647J437N79J4Q9N22
54789A54126J063J617J970J815J168M96L93J066K112K847K974K861L054L704M632
54774A85898N685O716P537Q252R326J0882J2208J2583J2271J1900J1094Q702M467
54761C07521l69m285o532p014o121n075n368p202r202j0110j0095r865r357q119
54747B08807o372m787l608k702k184k258k645k814k589k034j037M32J890K747
54733A80846K926K691K225J861K231L521M998N981O749P678Q040O785M313K109
54719B42954O31j125l725o183p366p462p344p213o692n699m586l644l022k772
54705A76752k642k151j283o81p94j245j497j643j940k026j367k90K69m4o68j052
$$ plain form
54689 157698 156470 155106 153735 152558 151633 150988 150799 151140 151649 151849 151746 151705 151735 151399 150599 149919 149865 150123
54671 150123 150074 149768 149772 150124 150094 149209 147963 147114 146679 146096 145176 144343 143976 143968 144064 144240 144629 145319 146316 147454
54651 147454 148288 148418 148045 147865 148215 148700 148924 149204 150079 151396 152457 152962 153185 153192 152584 151361 150477 150894
54633 150894 152285 153275 153083 152414 152487 153495 154443 154380 153373 152113 150984 149930 149076 148953 149915 151619 153379
54616 153379 154809 155890 156545 156535 155849 154941 154471 154816 155799 156758 157005 156427 155631 155281 155359 155328 154958 154589 154509
54597 154509 154483 154219 153984 154435 155917 158201 160755 162998 164383 164628 164013 163218 162760 162653 162589 162390 162234 162521
54579 162521 163438 164627 165415 165541 165481 165875 166776 167795 168771 169879 171042 171793 171890 171658 171423 170966 169933 168531
54561 168531 167429 167012 167057 167065 166646 165637 164266 163226 163289 164647 166743 168811 170493 171907 173333 174914
$$ packed form
54689A57698j228j364j371j177r25o45j89L41N09K00j03m1L0l36q00o80n4K58
54671A50123m9l06ML52l0q85j246q49m35n83r20q33l67qR6J76L89O90R97J138
54651A47454Q34J30l73j80L50M85K24K80Q75J317J061N05K23Po08j223q84M17
54633A50894J391R90j92o69P3J008R48o3j007j260j129j054q54j23R62J704J760
54616A53379J430J081O55j0o86r08m70L45R83R59K47n78p96l50P8l1l70l69q0
54597A54509k6k64k35M51J482K284K554K243J385K45o15p95m58j07o4j99j56K87
54579A62521R17J189P88J26o0L94R01J019R76J108J163P51R7k32k35m57j033j402
54561A68531j102m17M5Qm19j009j371j040O3J358K096K068J682J414J426J581
$$ plain form
54545 174914 176506 177741 178332 178406 178520 179280 180898 183032 185013 186351 187174 188058 189342 190692 191514 191656
54529 191656 191462 191249 190994 190517 189621 188093 185886 183434 181444 180253 179597 179111 178747 178560 178399 178074 177669
54512 177669 177477 177741 178588 179958 181414 182259 182142 181399 180605 179951 179316 178690 178161 177587 176749 175831 175393 175755
54494 175755 176674 177736 178821 180066 181581 183295 184995 186409 187323 187664 187456 186836 186241 186406 187790 189991
54478 189991 191996 193122 193507 193642 193748 193780 193796 193998 194475 195082 195673 196334 197350 198899 200738 202263 203040
54461 203040 203252 203460 203919 204350 204411 204149 203846 203677 203740 204251 205352 206722 207640 207568 206594 205234 203899 202649
54443 202649 201434 200396 199754 199361 198574 196824 194306 191920 190494 190220 190819 191951 193243 194241 194673 194797
54427 194797 195169 196032 197040 197569 197178 195831 193938 192202 191161 190704 190242 189450 188685 188489 188874 189351 189592
$$ packed form
54545A74914J592J235N91P4J14P60J618K134J981J338Q23Q84J284J350Q22J42
54529A91656j94k13k55m77q96j528k207k452j990j191o56m86l64j87j61l25m05
54512A77669j92K64Q47J370J456Q45j17p43p94o54o35o26n29n74q38r18m38L62
54494A75755R19J062J085J245J515J714J700J414R14L41k08o20n95J65J384K201
54478A89991K005J126L85J35J06L2J6K02M77O07N91O61J016J549J839J525P77
54461B03040K12K08M59M31O1k62l03j69O3N11J101J370R18p2r74j360j335j250
54443B02649j215j038o42l93p87j750k518k386j426k74N99J132J292R98M32J24
54427A94797L72Q63J008N29l91j347j893j736j041m57m62p92p65j96L85M77K41
$$ plain form
54410 189592 189776 190206 190829 191300 191493 191756 192604 194112 195704 196676 196980 197228 197783 198114 197519 196382 196093 197432
54392 197432 199566 201046 201474 201559 201768 201650 200692 199186 197892 197137 196643 196091 195558 195445 196085 197306 198356
54375 198356 198537 198045 197834 198463 199442 200052 200370 200919 201558 201474 200351 198931 198146 198180 198607 199082 199542 200007 200537
54356 200537 201198 201862 202236 202369 202854 204090 205499 206009 205383 204567 204494 204944 204977 204261 203477 203384 203887 204237 203895
54337 203895 202954 201843 200919 200308 199919 199490 198757 197659 196342 194968 193649 192545 191854 191649 191888 192590 193739
54320 193739 194899 195259 194421 192980 191943 191591 191299 190560 189737 189566 190211 191177 192006 192682 193331 193877 194192 194337
54302 194337 194449 194484 194224 193461 192062 190054 187879 186394 186161 186716 186995 186626 186284 186511 186765 186259 185275 184813
54284 184813 185039 185034 184236 183304 183132 183700 184450 185257 186322 187472 188191 188244 187759 186800 185348 183683 182375 181895
$$ packed form
54410A89592J84M30O23M71J93K63Q48J508J592R72L04K48N55L31n95j137k89J339
54392A97432K134J480M28Q5K09j18r58j506j294p55m94n52n33j13O40J221J050
54375A98356J81m92k11O29R79O10L18N49O39q4j123j420p85L4M27M75M60M65N30
54356B00537O61O64L74J33M85J236J409N10o26q16p3M50L3p16p84r3N03L50l42
54337B03895r41j111r24o11l89m29p33j098j317j374j319j104o91k05K39P02J149
54320A93739J160L60q38j441j037l52k92p39q23j71O45R66Q29O76O49N46L15J45
54302A94337J12L5k60p63j399k008k175j485k33N55K79l69l42K27K54n06r84m62
54284A84813K26np98r32j72N68P50Q07J065J150P19N3m85r59j452j665j308m80
$$ plain form
54266 181895 182397 183657 184983 185592 185487 185654 186844 188518 189579 189829 189975 190443 191100 192040 193587 195362
54250 195362 196361 196334 196207 196646 196993 196282 194665 193101 192069 191351 190801 190600 190776 191048 191155 191012 190592 189968
54232 189968 189367 188902 188396 187784 187470 187916 188961 189833 189812 188731 187048 185617 185103 185330 185391 184665 183427 182198
54214 182198 180927 179308 177577 176380 176006 176290 177131 178511 180040 181120 181616 181868 182040 182022 182045 182727 184201
54197 184201 185730 186542 186719 186866 187222 187471 187323 186947 186753 186945 187353 187698 187994 188410 188648 187810 185364 182131
54179 182131 179720 178891 178940 178834 178332 177697 176908 175803 174700 174199 174345 174486 174093 173374 172921 172990 173280 173314 172861
54160 172861 172043 171094 170108 169091 168261 168085 168865 170307 171717 172629 173160 173746 174648 175756 176772 177517 178098
54143 178098 178795 179738 180668 181118 180917 180476 180464 181149 182208 183192 184037 184948 185925 186697 187116 187391 187790 188324 188842
$$ packed form
54266A81895N02J260J326O09j05J67J190J674J061K50J46M68O57R40J547J775
54250A95362R99k7j27M39L47p11j617j564j032p18n50k01J76K72J07j43m20o24
54232A89968o01m65n06o12l14M46J045Q72k1j081j683j431n14K27O1p26j238j229
54214A82198j271j619j731j197l74K84Q41J380J529J080M96K52J72j8K3O82J474
54197A84201J529Q12J77J47L56K49j48l76j94J92M08L45K96M16K38q38k446l233
54179A82131k411q29M9j06n02o35p89j105j103n01J46J41l93p19m53O9K90L4m53
54160A72861q18r49r86j017q30j76P80J442J410R12N31N86R02J108J016P45N81
54143A78098O97R43R30M50k01m41j2O85J059R84Q45R11R77P72M19K75L99N34N18
$$ plain form
54124 188842 189304 189777 190313 190964 191781 192617 193109 193089 192959 193343 194365 195455 195903 195492 194594 193785 193384 193258
54106 193258 193069 192682 192189 191548 190526 189208 188241 188107 188367 188115 187156 186250 186132 186722 187436 187843 187805 187309
54088 187309 186474 185530 184653 183997 183940 184931 186871 188958 190432 191272 191955 192795 193770 194719 195354 195343 194767 194348
54070 194348 194785 195921 197003 197732 198573 199941 201594 203090 204460 206030 207803 209485 211163 213572 217453
54055 217453 222784 228861 235070 241463 248552 256878 266897 278985 293009 307606 320208 328177 330208
54042 330208 326824 319723 310720 301048 291325 281998 273763 267409 263260 260974 260050 260292 261589 263472 265357
54027 265357 267197 269457 272285 275082 277130 278444 279713 281510 283773 285981 287571 288219 287980 287257 286472
54012 286472 285681 284610 283087 281255 279242 276836 273744 270092 266420 263082 259827 256097 251669 246909
$$ packed form
54124A88842M62M73N36O51Q17Q36M92k0j30L84J022J090M48m11q98q09m01j26
54106A93258j89l87m93o41j022j318r67j34K60k52r59r06j18N90P14M07l8m96
54088A87309q35r44q77o56n7R91J940K087J474Q40O83Q40R75R49O35j1n76m19
54070A94348M37J136J082P29Q41J368J653J496J370J570J773J682J678K409L881
54055B17453N331O077O209O393P089Q326J0019J2088J4024J4597J2602P969K031
54042C30208l384p101r003r672r723r327q235o354m149k286r24K42J297J883J885
54027B65357J840K260K828K797K048J314J269J797K263K208J590O48k39p23p85
54012B86472p91j071j523j832k013k406l092l652l672l338l255l730m428m760
$$ plain form
53998 246909 242529 239162 237091 236145 235798 235492 234969 234297 233604 232840 231852 230603 229268 228085 227164 226414 225666
53981 225666 224868 224151 223702 223593 223767 224143 224590 224752 224064 222211 219683 217683 217200 218078 219217 219747 219805 220066
53963 220066 220786 221711 222763 224305 226547 229075 231244 232816 234012 235252 237159 240500 245618 251916 258302
53948 258302 264183 269728 275173 280316 284821 288625 291776 294135 295545 296225 296764 297779 299610 302244 305350
53933 305350 308523 311671 315144 319335 324134 328850 332683 335299 337046 338706 340972 344027 347499 350715
53919 350715 352978 353837 353389 352391 351876 352589 354843 358810 364566 371679 378991 385129 389260 391367 391976 391800
53903 391800 391579 391929 393163 395180 397583 400023 402539 405506 409240 413792 419306 426275 434971 444534 452938
53888 452938 458000 458246 453043 442560 427923 410976 393462 376505 360873 347193 335524 325197
$$ packed form
53998B46909m380l367k071r46l47l06n23o72o93p64r88j249j335j183r21p50p48
53981B25666p98p17m49j09J74L76M47J62o88j853k528k000m83Q78J139N30N8K61
53963B20066P20R25J052J542K242K528K169J572J196J240J907L341N118O298O386
53948B58302N881N545N445N143M505L804L151K359J410O80N39J015J831K634L106
53933C05350L173L148L473M191M799M716L833K616J747J660K266L055L472L216
53919C50715K263Q59m48r98n15P13K254L967N756P113P312O138M131K107O09j76
53903C91800k21L50J234K017K403K440K516K967L734M552N514O969Q696R563Q404
53888D52938N062K46n203j0483j4637j6947j7514j6957j5632j3680j1669j0327
$$ plain form
53876 325197 315657 307240 300564 295402 290791 286172 281775 277787 273848 269663 265615 262337 259970 258166
53862 258166 256593 255124 253681 252203 250723 249278 247804 246247 244707 243332 242104 240881 239584 238264
53848 238264 236997 235835 234793 233828 232854 231842 230887 230141 229711 229617 229807 230230 230896 231728 232282 231896 230439
53831 230439 228732 227799 227723 227745 227508 227566 228342 229228 229378 228998 229088 229967 230837 230967 230644 230578 230892 231200 231451 232104
53811 232104 233455 235228 236920 238270 239213 239646 239607 239662 240772 243528 247492 251486 254595 256843 258926 261524
53795 261524 264991 269426 274618 279878 284348 287725 290563 293652 297167 300529 302999 304246 304495 304364 304520
53780 304520 305221 306099 306538 306327 305802 305229 304256 302199 298941 295301 292363 290445 288867 286813 284186 281419
53764 281419 278658 275591 272161 268937 266387 264147 261592 258926 257070 256375 256112 255508 254678 254036 253258 251569
$$ packed form
53876C25197r540q417o676n162m611m619m397l988l939m185m048l278k367j804
53862B58166j573j469j443j478j480j445j474j557j540j375j228j223j297j320
53848B38264j267j162j042r65r74j012r55p46m30r4J90M23O66Q32N54l86j457
53831B30439j707r33p6K2k37N8P76Q86J50l80R0Q79Q70J30l23o6L14L08K51O53
53811B32104J351J773J692J350R43M33l9N5J110K756L964L994L109K248K083K598
53795B61524L467M435N192N260M470L377K838L089L515L362K470J247K49j31J56
53780C04520P01Q78M39k11n25n73r73k057l258l640k938j918j578k054k627k767
53764B81419k761l067l430l224k550k240k555k666j856o95k63o04q30o42p78j689
$$ plain form
53748 251569 248970 246488 245076 244723 244786 244744 244351 243380 241634 239177 236394 233868 232226 231811 232305 232867 232987
53731 232987 233130 234232 236580 239462 241981 243864 245276 246152 246205 245622 245293 246068 247970 250414 252991 255630
53715 255630 258086 259844 260834 261780 263360 265266 266570 266963 267163 268108 270231 273563 277970 282933 287460
53700 287460 290736 292810 294435 296376 299016 302402 306275 310113 313490 316403 319078 321541 323615 325332
53686 325332 327017 328897 330834 332577 334095 335524 336878 337980 338691 339188 339909 341111 342473 343345 343503
53671 343503 343486 343972 345002 346056 346707 346806 346094 344204 341293 338274 336093 334946 334441 334262 334262 334132 333460 332216
53653 332216 330818 329622 328655 327955 327811 328353 329093 329193 328177 326237 323946 321905 320623 320390 321070 322147
53637 322147 323102 323731 324111 324446 324990 325921 327117 328121 328488 328265 328051 328574 330134 332394 334676 336525 338023
$$ packed form
53748B51569k599k482j412l53O3m2l93r71j746k457k783k526j642m15M94N62J20
53731B32987J43J102K348K882K519J883J412Q76N3n83l29P75J902K444K577K639
53715B55630K456J758R90R46J580J906J304L93K00R45K123L332M407M963M527
53700B87460L276K074J625J941K640L386L873L838L377K913K675K463K074J717
53686C25332J685J880J937J743J518J429J354J102P11M97P21J202J362Q72J58
53671C43503j7M86J030J054O51R9p12j890k911l019k181j147n05j79%j30o72j244
53653C32216j398j196r67p00j44N42P40J00j016j940k291k041j282k33O80J077
53637C22147R55O29L80L35N44R31J196J004L67k23k14N23J560K260K282J849J498
$$ plain form
53620 338023 339556 341394 343616 346332 349640 353321 356869 359994 362894 365860 368906 372011 375476 379616
53606 379616 384230 388718 392775 396643 400677 404930 409217 413316 417069 420509 423939 427679 431713 435679
53592 435679 439236 442281 444932 447523 450417 453529 456198 457948 459237 460923 463094 465051 466482 467925
53578 467925 469907 472336 475038 478092 481198 483424 484237 484187 483866 482743 479901 475487 470461 465163 459208
53563 459208 452781 446887 442059 437738 433370 429361 426441 424718 423871 423757 424243 424817 424939 424603 424175 423885
53547 423885 423860 424347 425512 427159 429008 431052 433345 435681 437899 440312 443367 447007 450829 454788 459219
53532 459219 464178 469276 474300 479563 485388 491648 498086 504922 512809 522257 533238 545251 557647
53519 557647 570017 582414 595219 608721 622883 637529 652597 668149 684305 701326 719600
$$ packed form
53620C38023J533J838K222K716L308L681L548L125K900K966L046L105L465M140
53606C79616M614M488M057L868M034M253M287M099L753L440L430L740M034L966
53592D35679L557L045K651K591K894L112K669J750J289J686K171J957J431J443
53578D67925J982K429K702L054L106K226Q13n0l21j123k842m414n026n298n955
53563D59208o427n894m828m321m368m009k920j723q47j14M86N74J22l36m28k90
53547D23885k5M87J165J647J849K044K293K336K218K413L055L640L822L959M431
53532D59219M959N098N024N263N825O260O438O836P887R448J0981J2013J2396
53519E57647J2370J2397J2805J3502J4162J4646J5068J5552J6156J7021J8274
$$ plain form
53508 719600 739349 760377 782305 805012 828682 853415 878971 904939 930958 956731 982059
53497 982059 1007035 1032082 1057577 1083532 1109803 1136448 1163539 1190640 1216910 1242033 1266817
53486 1266817 1292481 1319291 1346125 1371458 1394662 1416274 1437142 1457498 1476900 1494996 1512121
53475 1512121 1529039 1546199 1563473 1580655 1597950 1615728 1633844 1651328 1666790 1679218 1688555
53464 1688555 1695577 1701043 1704851 1706175 1704413 1699680 1692209 1681735 1667982 1651583 1633960 1616242 1598631
53451 1598631 1580783 1562307 1542740 1521515 1498356 1473555 1447698 1421286 1394714 1368284 1342043
53440 1342043 1315831 1289732 1264279 1239926 1216563 1193905 1172258 1152502 1135288 1120529 1107777
53429 1107777 1096826 1087749 1080550 1075001 1070881 1068226 1067312 1068393 1071499 1076465 1083126 1091450 1101525 1113412
$$ packed form
53508G19600J9749K1028K1928K2707K3670K4733K5556K5968K6019K5773K5328
53497I82059K4976K5047K5495K5955K6271K6645K7091K7101K6270K5123K4784
53486A266817K5664K6810K6834K5333K3204K1612K0868K0356J9402J8096J7125
53475A512121J6918J7160J7274J7182J7295J7778J8116J7484J5462J2428R337
53464A688555P022N466L808J324j762m733p471j0474j3753j6399j7623j7718j7611
53451A598631j7848j8476j9567k1225k3159k4801k5857k6412k6572k6430k6241
53440A342043k6212k6099k5453k4353k3363k2658k1647j9756j7214j4759j2752
53429A107777j0951r077p199n549m120k655r14J081L106M966O661Q324J0075J1887
$$ plain form
53415 1113412 1126995 1141964 1158002 1175020 1193160 1212534 1233158 1255237 1279291 1305656 1333883
53404 1333883 1362968 1392335 1422441 1454337 1488767 1525748 1564880 1605906 1648987 1694482 1742511
53393 1742511 1792889 1845546 1900714 1958386 2017805 2077954 2138532 2199994 2262626 2326114 2390086
53382 2390086 2454416 2518682 2581888 2643241 2702790 2760767 2816635 2869444 2918976 2965896 3010774
53371 3010774 3053502 3093697 3131114 3165449 3196236 3223280 3246848 3267133 3283559 3294726 3298831
53360 3298831 3294083 3279075 3253208 3216898 3171330 3118063 3058777 2995128 2928562 2860117 2790417
53349 2790417 2719818 2648622 2577281 2506417 2436600 2368223 2301641 2237236 2175024 2114295 2054021
53338 2054021 1993768 1933989 1875370 1818278 1763012 1710218 1660569 1614034 1569838 1527329 1486768
$$ packed form
53415A113412J3583J4969J6038J7018J8140J9374K0624K2079K4054K6365K8227
53404A333883K9085K9367L0106L1896L4430L6981L9132M1026M3081M5495M8029
53393A742511N0378N2657N5168N7672N9419O0149O0578O1462O2632O3488O3972
53382B390086O4330O4266O3206O1353N9549N7977N5868N2809M9532M6920M4878
53371C010774M2728M0195L7417L4335L0787K7044K3568K0285J6426J1167M105
53360C298831m748j5008k5867l6310m5568n3267n9286o3649o6566o8445o9700
53349B790417p0599p1196p1341p0864o9817o8377o6582o4405o2212o0729o0274
53338B054021o0253n9779n8619n7092n5266n2794m9649m6535m4196m2509m0561
$$ plain form
53327 1486768 1449200 1415592 1386165 1360517 1338227 1319190 1303268 1289765 1277476 1265372 1253137
53316 1253137 1241020 1229297 1218010 1207149 1196856 1187377 1178965 1171921 1166673 1163566 1162470 1162750 1163824
53303 1163824 1165695 1168741 1173063 1178386 1184592 1191918 1200432 1209825 1220144 1232334 1247456 1265527 1285709
53290 1285709 1307495 1330987 1356053 1382044 1408692 1436540 1465979 1496443 1527126 1557983 1589265
53279 1589265 1620403 1650177 1677983 1704286 1729761 1754556 1778438 1801044 1821769 1839877 1854997
53268 1854997 1867152 1876247 1881961 1884240 1883356 1879226 1871203 1858911 1842820 1823547 1801033 1774951 1745590
53255 1745590 1713704 1679654 1643378 1605186 1565994 1526590 1487085 1447195 1406793 1366197 1326284
53244 1326284 1288293 1253037 1220122 1188271 1156494 1124632 1092810 1060970 1029136 997594 966459
$$ packed form
53327A486768l7568l3608k9427k5648k2290j9037j5922j3503j2289j2104j2235
53316A253137j2117j1723j1287j0861j0293r479q412p044n248l107j096K80J074
53303A163824J871L046M322N323O206P326Q514R393J0319J2190J5122J8071K0182
53290A285709K1786K3492K5066K5991K6648K7848K9439L0464L0683L0857L1282
53279A589265L1138K9774K7806K6303K5475K4795K3882K2606K0725J8108J5120
53268A854997J2155R095N714K279q84m130q023j2292j6091j9273k2514k6082k9361
53255A745590l1886l4050l6276l8192l9192l9404l9505l9890m0402m0596l9913
53244A326284l7991l5256l2915l1851l1777l1862l1822l1840l1834l1542l1135
$$ plain form
53233 966459 935443 904391 873744 844151 815910 789144 764230 741648 721549 703811 688276
53222 688276 674666 662540 651657 642130 633820 625867 617354 608161 598664 588798 578120 566734 555387
53209 555387 544569 534117 523849 513901 504218 494337 484142 474365 465901 458879 452715 446759 440614
53196 440614 434153 427549 421017 414291 406802 398701 391218 385452 381067 376809 372039 367119 362428 357848
53182 357848 353326 349204 345626 342175 338528 335054 332267 329969 327475 324586 321802 319573 317813 316320
53168 316320 315165 314315 313220 311303 308757 306405 304706 303380 302086 300950 300083 299093 297608 295983 294844
53153 294844 294094 292982 291167 289061 287042 285044 283141 281825 281245 280702 279489 277821 276353 275099 273520
53138 273520 271529 269725 268606 268087 267936 268193 268955 270146 271648 273374 275023 276024 276061 275543 275341 276004
$$ packed form
53233I66459l1016l1052l0647k9593k8241k6766k4914k2582k0099j7738j5535
53222F88276j3610j2126j0883r527q310p953q513r193r497r866j0678j1386j1347
53209E55387j0818j0452j0268r948r683r881j0195r777q464p022o164n956o145
53196D40614o461o604o532o726p489q101p483n766m385m258m770m920m691m580
53182C57848m522m122l578l451l647l474k787k298k494k889k784k229j760j493
53168C16320j155q50j095j917k546k352j699j326j294j136q67r90j485j625j139
53153B94844p50j112j815k106k019j998j903j316n80n43j213j668j468j254j579
53138B73520j991j804j119n19j51K57P62J191J502J726J649J001L7n18k02O63
$$ plain form
53122 276004 277300 278573 279508 280443 281782 283247 284070 283959 283515 283416 283586 283478 282866 281864 280401 278261 275691
53105 275691 273485 272281 272042 272214 272133 271365 270024 268798 268320 268497 268771 268971 269409 270117 270521 270161 269301 268545
53087 268545 268181 268159 268395 268731 268847 268550 268061 267723 267524 267231 266935 267158 268308 270143 271910 273033 273687 274629
53069 274629 276374 278626 280645 282137 283465 284949 286339 287133 287184 286628 285418 283351 280584 277802 275632
53054 275632 274069 272688 271326 270209 269381 268386 266892 265388 264694 264764 264574 263510 262324 262206 263238 264332
53038 264332 264538 263848 262808 261911 261455 261482 261686 261728 261651 261659 261535 260825 259588 258411 257544 256646 255643 255210 255959
53019 255959 257607 259336 260607 261233 261085 260301 259510 259282 259393 259140 258384 257881 258494 260268 262369 263796 264187
53002 264187 264026 264084 264696 265722 266989 268360 269406 269657 269382 269539 270576 271779 272241 271986 271605 271222 270519
$$ packed form
53122B76004J296J273R35R35J339J465Q23j11m44r9J70j08o12j002j463k140k570
53105B75691k206j204k39J72q1p68j341j226m78J77K74K00M38P08M04l60q60p56
53087B68545l64k2K36L36J16k97m89l38j99k93k96K23J150J835J767J123O54R42
53069B74629J745K252K019J492J328J484J390P94N1n56j210k067k767k782k170
53054B75632j563j381j362j117q28r95j494j504o94P0j90j064j186j18J032J094
53038B64332K06o90j040q97m56K7K04M2p7Qj24p10j237j177q67q98j003m33P49
53019B55959J648J729J271O26j48p84p91k28J11k53p56n03O13J774K101J427L91
53002B64187j61N8O12J026J267J371J046K51k75J57J037J203M62k55l81l83p03
$$ plain form
52985 270519 269496 268471 267562 266834 266807 268009 270024 271784 272923 274069 275617 277004 277634 277885 278596 279980
52969 279980 281623 283270 285024 286820 288236 288922 288966 288733 288531 288458 288457 288413 288220 287822 287245 286628 286086 285408 284086
52950 284086 281885 279271 276972 275207 273703 272395 271560 271164 270670 269823 269174 269404 270419 271550 272393 272985
52934 272985 273329 273309 273039 272791 272440 271404 269345 266678 264203 262461 261588 261490 261913 262482 262875 262924 262462 261372
52916 261372 259940 258867 258563 258615 258403 258092 258427 259490 260343 260295 259938 260343 261563 262682 263181 263523 264269 265354
52898 265354 266523 267861 269348 270380 270357 269641 269391 270477 272869 275978 279168 281897 283740 284481 284088 282664
52882 282664 280551 278289 276155 273851 271029 268035 265713 264442 263814 263362 263125 263277 263599 263705 263571 263523
52866 263523 263831 264556 265671 267011 268151 268686 268746 269104 270574 273234 276227 278349 278872 277840 275624 272450
$$ packed form
52985B70519j023j025r09p28k7J202K015J760J139J146J548J387O30K51P11J384
52969B79980J643J647J754J796J416O86M4k33k02p3jm4j93l98n77o17n42o78j322
52950B84086k201k614k299j765j504j308q35l96m94q47o49K30J015J131Q43N92
52934B72985L44k0k70k48l51j036k059k667k475j742q73r8M23N69L93M9m62j090
52916B61372j432j073l04N2k12l11L35J063Q53m8l57M05J220J119M99L42P46J085
52898B65354J169J338J487J032k3p16k50J086K392L109L190K729J843P41l93j424
52882B82664k113k262k134k304k822k994k322j271o28m52k37J52L22J06j34m8
52866B63523L08P25J115J340J140N35O0L58J470K660K993K122N23j032k216l174
$$ plain form
52850 272450 268549 264499 260993 258191 255708 253339 251386 250057 248956 247541 245851 244378 243351 242557
52836 242557 241785 241034 240238 239218 238049 237192 237079 237753 239006 240561 241953 242577 242247 241599 241579 242502 243895
52819 243895 245291 246829 248960 251851 255411 259712 264985 271086 277209 282256 285454 286587 285871 283739
52805 283739 280629 276841 272605 268285 264336 260973 257987 255098 252391 250192 248579 247203 245638 243744
52791 243744 241702 239863 238586 238037 238048 238263 238438 238524 238514 238442 238587 239368 240812 242320 243221 243539 243969 245046
52773 245046 246553 247861 248714 249457 250442 251402 251615 250770 249475 248738 248936 249494 249654 249354 249177 249522 250028 249932
52755 249932 248856 247167 245591 244568 243985 243434 242697 242007 241871 242527 243548 244069 243644 242826 242660 243488 244513
52738 244513 244711 244018 243354 243626 245038 247287 249960 252576 254642 256021 257167 258642 260417 261832 262284
$$ packed form
52850B72450l901m050l506k802k483k369j953j329j101j415j690j473j027p94
52836B42557p72p51p96j020j169q57j13O74J253J555J392O24l30o48k0R23J393
52819B43895J396J538K131K891L560M301N273O101O123N047L198J133p16k132
52805B83739l110l788m236m320l949l363k986k889k707k199j613j376j565j894
52791B43744k042j839j277n49J1K15J75Q6j0p2J45P81J444J508R01L18M30J077
52773B45046J507J308Q53P43R85R60K13q45j295p37J98N58J60l00j77L45N06r6
52755B49932j076j689j576j023n83n51p37o90j36O56J021N21m25q18j66Q28J025
52738B44513J98o93o64K72J412K249K673K616K066J379J146J475J775J415M52
$$ plain form
52723 262284 261805 260917 260090 259393 258647 257819 257233 257359 258358 259872 261302 262316 263026 263698 264367 264815 264836 264399
52705 264399 263546 262297 260819 259585 259079 259231 259355 258862 258015 257763 258771 260691 262452 263190 262868 262117 261637
52688 261637 261784 262606 264026 265809 267511 268726 269460 270061 270646 270804 270016 268309 266326 264838 264208 264153 263903
52671 263903 262839 261204 260069 260334 261838 263650 265006 265686 265727 265324 264995 265271 266016 266452 266109 265397 265076
52654 265076 265460 266414 267849 269812 272204 274623 276476 277189 276517 274809 272791 270982 269471 268268 267477
52639 267477 266991 266489 266063 266449 268110 270405 272260 273501 274918 277046 279564 281986 284275 286386 287717
52624 287717 287559 285915 283510 281034 278665 276274 273824 271498 269478 267667 265707 263435 261283 260004
52610 260004 259967 260965 262655 264782 266823 267966 267874 267256 267188 267990 269122 269978 270298 269936 268915 267858 267733
$$ packed form
52723B62284m79q88q27o97p46q28n86J26R99J514J430J014P10O72O69M48K1m37
52705B64399q53j249j478j234n06J52J24m93q47k52J008J920J761P38l22p51m80
52688B61637J47Q22J420J783J702J215P34O01N85J58p88j707j983j488o30n5k50
52671B63903j064j635j135K65J504J812J356O80M1m03l29K76P45M36l43p12l21
52654B65076L84R54J435J963K392K419J853P13o72j708k018j809j511j203p91
52639B67477m86n02m26L86J661K295J855J241J417K128K518K422K289K111J331
52624B87717j58j644k405k476k369k391k450k326k020j811j960k272k152j279
52610B60004l7R98J690K127K041J143r2o18o8Q02J132Q56L20l62j021j057j25
$$ plain form
52593 267733 268823 270349 271466 272272 273432 275075 276618 277602 278180 278743 279436 280207 281043 281929 282742 283307 283531
52576 283531 283475 283381 283553 284015 284324 283967 282971 281903 281263 281112 281273 281487 281230 279849 277300 274580 272968 272804
52558 272804 273264 273288 272503 271295 270299 269951 270305 271134 272169 273277 274386 275334 275899 275910 275257 273896 271980
52541 271980 269908 268093 266747 265961 265802 266124 266504 266717 267172 268495 270683 273051 275036 276645 277951 278652
52525 278652 278522 277946 277511 277202 276485 275242 274158 273979 274705 275735 276581 277177 277618 277985 278398 278961 279561 279949
52507 279949 280143 280580 281730 283653 285999 288147 289277 288679 286410 283483 281005 279211 277671 276223 275164
52492 275164 274561 274017 273315 272731 272512 272574 272975 274088 275889 277596 278606 279399 280941 283427 286163 288390
52476 288390 289721 290074 289857 290027 291267 293175 294833 296010 297103 298076 298379 298046 297972 298789 300151 301442
$$ packed form
52593B67733J090J526J117Q06J160J643J543R84N78N63O93P71Q36Q86Q13N65K24
52576B83531n6r4J72M62L09l57r96j068o40j51J61K14k57j381k549k720j612j64
52558B72804M60K4p85j208r96l48L54Q29J035J108J109R48N65J1o53j361j916
52541B71980k072j815j346p86j59L22L80K13M55J323K188K368J985J609J306P01
52525B78652j30n76m35l09p17j243j084j79P26J030Q46N96M41L67M13N63O00L88
52507B79949J94M37J150J923K346K148J130n98k269k927k478j794j540j448j059
52492B75164o03n44p02n84k19O2M01J113J801J707J010P93J542K486K736K227
52476B88390J331L53k17J70J240J908J658J177J093R73L03l33p4Q17J362J291
$$ plain form
52460 301442 302496 303212 303060 301577 299017 296111 293485 291541 290491 290103 289715 288871 287766 286845 286266 285872
52444 285872 285388 284479 283055 281695 281330 282217 283630 284737 285262 285139 284237 282884 281974 281921 282043 281621 281065
52427 281065 281298 282333 283283 283533 283145 282349 281391 280874 281448 283083 285142 287176 289123 290860 292248 293641
52411 293641 295708 298587 301766 304852 307979 311415 315334 320077 326081 333287 340954 348207 354350 358638
52397 358638 360304 359109 355566 350479 344545 338357 332286 326285 320290 314914 311165 309265 308316 307387 306381
52382 306381 305551 304824 304221 304406 306008 308522 310589 311436 311599 312135 313546 315614 317896 320144 322376 324705
52366 324705 327055 329030 330239 330825 331534 333010 335048 336751 337542 337851 338599 340116 341904 343432 344750
52351 344750 346127 347487 348581 349449 350253 350845 350966 350822 351002 351780 352907 354163 355753 358035 361162 365070
$$ packed form
52460C01442J054P16j52j483k560k906k626j944j050l88l88q44j105r21n79l94
52444B85872m84r09j424j360l65Q87J413J107N25j23r02j353r10n3J22m22n56
52427B81065K33J035R50K50l88p96r58n17N74J635K059K034J947J737J388J393
52411B93641K067K879L179L086L127L436L919M743O004P206P667P253O143M288
52397C58638J666j195l543n087n934o188o071o001n995n376l749j900r49r29j006
52382C06381q30p27o03J85J602K514K067Q47J63N36J411K068K282K248K232K329
52366C24705K350J975J209N86P09J476K038J703P91L09P48J517J788J528J318
52351C44750J377J360J094Q68Q04N92J21j44J80P78J127J256J590K282L127L908
$$ plain form
52335 365070 369458 373692 377095 379633 382094 385427 390047 395812 402404 409467 416635 423718 430891 438527
52321 438527 446815 455477 463910 471667 478838 485850 492833 499515 505910 512774 520981 530677 541509 553386
52307 553386 566395 580044 593346 605848 618081 630861 644605 659412 675202 691462 707394
52296 707394 722627 737442 752024 765960 778776 790546 801563 811730 820693 828348 834872 840506
52284 840506 845577 850505 855381 859697 862796 864488 865054 864883 864360 863891 863644 863352 862609 861308 859621 857734
52268 857734 855881 854541 854305 855377 857207 858687 858958 858256 857814 858647 860581 862870 865525 869374 874886
52253 874886 881760 889810 899416 910597 922413 933873 944953 956175 967574 978680 989134 998765
52241 998765 1007383 1015090 1022563 1030437 1038514 1045974 1052171 1056861 1060011 1061843 1062799 1063018 1062156 1060134 1057577
$$ packed form
52335C65070M388M234L403K538K461L333M620N765O592P063P168P083P173P636
52321D38527Q288Q662Q433P757P171P012O983O682O395O864Q207R696J0832J1877
52307E53386J3009J3649J3302J2502J2233J2780J3744J4807J5790J6260J5932
52296G07394J5233J4815J4582J3936J2816J1770J1017J0167Q963P655O524N634
52284H40506N071M928M876M316L099J692N66j71n23m69k47k92p43j301j687j887
52268H57734j853j340k36J072J830J480K71p02m42Q33J934K289K655L849N512
52253H74886O874Q050R606J1181J1816J1460J1080J1222J1399J1106J0454R631
52241I98765Q618P707P473P874Q077P460O197M690L150J832R56K19q62k022k557
$$ plain form
52226 1057577 1054919 1051563 1046706 1040673 1034588 1028938 1023295 1017321 1011103 1004556 997409 989959 983013 976886
52212 976886 971204 965843 961316 957926 955268 952917 950975 949593 948555 947762 947624 948486 950059 951836 953813
52197 953813 956393 959867 964240 969335 974823 980306 985504 990152 993748 995833 996583 996661 996358 995409 993806
52182 993806 992133 990718 989080 986691 983837 981159 978733 976193 973470 970809 968195 965361 962311 959349
52168 959349 956543 953584 950242 946731 943574 941228 939740 938520 936697 934040 931437 930067 930076 930468 930382 930130
52152 930130 930745 932673 935221 937317 938644 939817 941481 943550 945513 947204 948774 949954 949890 947986 944605
52137 944605 940768 937458 935332 934650 935090 935954 936908 938349 940762 944009 947606 951452 955840 960986 967037
52122 967037 974307 982904 992121 1000806 1008519 1015858 1023530 1031565 1039695 1048033 1056957 1066603 1076934 1088167
$$ packed form
52226A057577k658l356m857o033o085n650n643n974o218o547p147p450o946o127
52212I76886n682n361m527l390k658k351j942j382j038p93j38Q62J573J777J977
52197I53813K580L474M373N095N488N483N198M648L596K085P50P8l03r49j603
52182I93806j673j415j638k389k854k678k426k540k723k661k614k834l050k962
52168I59349k806k959l342l511l157k346j488j220j823k657k603j370RL92q6k52
52152I30130O15J928K548K096J327J173J664K069J963J691J570J180o4j904l381
52137I44605l837l310k126o82M40Q64R54J441K413L247L597L846M388N146O051
52122I67037P270Q597R217Q685P713P339P672Q035Q130Q338Q924R646J0331J1233
$$ plain form
52108 1088167 1100677 1114393 1128658 1142928 1157405 1172725 1189102 1206040 1222909 1239482 1255693
52097 1255693 1271090 1284936 1296858 1307048 1315769 1322958 1328553 1332896 1336523 1339666 1342196 1344000 1345178
52084 1345178 1345865 1346023 1345434 1343823 1341004 1337008 1332049 1326355 1320034 1313098 1305469 1297039 1287929 1278677 1269988
52069 1269988 1262266 1255643 1250355 1246633 1244148 1242144 1240417 1239661 1240477 1242598 1245575 1249724 1255567 1262699
52055 1262699 1270139 1277743 1286208 1295459 1304018 1310616 1315730 1320781 1326223 1331244 1335231 1338736 1342741 1347494
52041 1347494 1352455 1357147 1361586 1365844 1369495 1371855 1372718 1372487 1371433 1369164 1365223 1359994 1354393 1348602
52027 1348602 1341619 1332385 1320999 1308498 1295776 1283089 1270400 1257711 1245075 1232668 1220923 1210258
52015 1210258 1200577 1191272 1181902 1172683 1164076 1155911 1147075 1136217 1122798 1107436 1091247 1074909 1058419
$$ packed form
52108A088167J2510J3716J4265J4270J4477J5320J6377J6938J6869J6573J6211
52097A255693J5397J3846J1922J0190Q721P189N595M343L627L143K530J804J178
52084A345178O87J58n89j611k819l996m959n694o321o936p629q430r110r252q689
52069A269988p722o623n288l722k485k004j727p56Q16K121K977M149N843P132
52055A262699P440P604Q465R251Q559O598N114N051N442N021L987L505M005M753
52041A347494M961M692M439M258L651K360Q63k31j054k269l941n229n601n791
52027A348602o983r234j1386j2501j2722j2687j2689j2689j2636j2407j1745j0665
52015A210258r681r305r370r219q607q165q836j0858j3419j5362j6189j6338j6490
$$ plain form
52002 1058419 1041639 1024766 1008235 992343 977186 962804 949215 936284 923702 911073 898106
51991 898106 884800 871449 858209 844637 829983 814150 797979 782204 766355 749298 730797
51980 730797 711980 694132 677668 662584 649342 638634 630441 623958 618514 614091 610814 608449 606779
51967 606779 606169 607228 609851 612926 615125 615783 614874 612404 608225 602481 595885 589287 583096 577328 572065
51952 572065 567554 563889 560986 559026 558569 559941 562677 565952 569503 573831 579520 586617 594674 603068
51938 603068 611134 618272 624175 628903 632672 635654 637962 639604 640287 639443 636642 632027 626248 619946 613208
51923 613208 605448 595934 584740 573090 562417 553088 544502 536517 530129 526352 524900 524627 524969 526348
51909 526348 529237 533498 538639 544202 549733 554860 559584 564116 568333 571744 574121 575818 577432 579562
$$ packed form
52002A058419j6780j6873j6531j5892j5157j4382j3589j2931j2582j2629j2967
51991H98106j3306j3351j3240j3572j4654j5833j6171j5775j5849j7057j8501
51980G30797j8817j7848j6464j5084j3242j0708q193o483n444m423l277k365j670
51967F06779o10J059K623L075K199O58r09k470m179n744o596o598o191n768n263
51952E72065m511l665k903j960m57J372K736L275L551M328N689P097Q057Q394
51938F03068Q066P138N903M728L769K982K308J642O83q44k801m615n779o302o738
51923F13208p760r514j1194j1650j0673r329q586p985o388l777j452k73L42J379
51909E26348K889M261N141N563N531N127M724M532M217L411K377J697J614K130
$$ plain form
51895 579562 583020 588809 597641 609824 625787 646166 670982 698857 727026 751682 768464 773843
51883 773843 767167 751212 730245 707675 685648 665858 649471 636393 625676 616722 609324 602563
51871 602563 594712 584733 573169 561194 549417 538100 527890 519586 513372 508767 505147 501940 498622
51858 498622 495097 492024 490284 490075 490754 491438 491429 490193 487425 483268 478196 472586 466538 460061 453233 446272
51842 446272 439742 434591 431564 430498 430530 431073 432246 434207 436564 438837 441192 444113 447444 450294 452018
51827 452018 452757 452794 451879 449787 447228 445487 445043 445173 445167 445355 446414 448114 449489 450089 450235 449947 448391
51810 448391 444894 439981 434885 430390 426697 424137 423144 423408 423765 423383 422717 422803 423797 424690 424559 423702 423284
51793 423284 424010 425545 427256 429095 431336 433574 434630 433682 431181 428239 425406 422521 419586 417151 415590
$$ packed form
51895E79562L458N789Q832J2183J5963K0379K4816K7875K8169K4656J6782N379
51883G73843o676j5955k0967k2570k2027j9790j6387j3078j0717q954p398o761
51871F02563p851r979j1564j1975j1777j1317j0210q304o214m605l620l207l318
51858D98622l525l073j740k09O79O84rj236k768m157n072n610o048o477o828o961
51842D46272o530n151l027j066L2N43J173J961K357K273K355K921L331K850J724
51827D52018P39L7r15k092k559j741m44J30oJ88J059J700J375O00J46k88j556
51810D48391l497m913n096m495l693k560r93K64L57l82o66Q6R94Q93j31q57m18
51793D23284P26J535J711J839K241K238J056r48k501k942k833k885k935k435j561
$$ plain form
51778 415590 414561 413619 413146 414252 417700 423198 429712 436238 442239 447550 452084 455692 458179 459361 458990
51763 458990 456800 452861 447903 442962 438513 434206 429693 425454 422385 420654 419405 417692 415373 413002
51749 413002 411161 410092 409648 409383 408925 408564 409273 411778 415637 419585 422777 425445 428314 431696 435333
51734 435333 438968 442820 447399 452856 458451 462863 465219 465786 465516 464976 464098 462917 462081 462271 463274 463948
51718 463948 463139 460572 457035 453860 452116 451966 452664 453241 453218 452834 452825 454105 457331 462377 468161 473165 476217
51701 476217 476836 475165 471880 468105 464968 463060 462423 463089 465316 469050 473271 476158 476133 472880 467454
51686 467454 461393 455680 450492 445846 442112 439695 438279 436769 434084 429962 425055 420397 416719 413976
51672 413976 411499 408824 406385 405079 405108 405760 406660 408785 413558 420916 428897 435427 440147 444091 447805
$$ packed form
51778D15590j029r42m73J106L448N498O514O526O001N311M534L608K487J182l71
51763D58990k190l939m958m941m449m307m513m239l069j731j249j713k319k371
51749D13002j841j069m44k65m58l61P09K505L859L948L192K668K869L382L637
51734D35333L635L852M579N457N595M412K356N67k70n40q78j181q36J90J003O74
51718D63948q09k567l537l175j744j50O98N77k3l84rJ280L226N046N784N004L052
51701D76217O19j671l285l775l137j908o37O66K227L734M221K887k5l253n426
51686D67454o061n713n188m646l734k417j416j510k685m122m907m658l678k743
51672D13976k477k675k439j306K9O52R00K125M773P358P981O530M720L944L714
$$ plain form
51657 447805 450418 450791 449163 447222 446572 447529 449498 452040 455190 458960 463147 467680 472593 477287 480153
51642 480153 479466 474784 467247 458550 449814 441398 433406 426077 419735 414593 410701 408035 406616 406533 407830
51627 407830 410384 413902 418029 422407 426648 430282 432809 433824 433175 431016 427704 423634 419122 414356
51613 414356 409434 404556 400268 397376 396331 396683 397357 397594 397504 397702 398706 400819 404215 408726 413674 418458
51597 418458 423402 429702 438312 449062 461025 473468 486028 497971 507639 513046 513305 509532 504314
51584 504314 500055 497715 496982 497466 499490 503812 510925 520754 532768 546088 559696 572926 585889
51571 585889 599218 613292 627675 641158 652213 659689 663636 665715 668608 674835 686143 703765
51559 703765 728491 759975 796253 834528 872446 908372 940758 968005 989138 1003979 1012282 1013074
$$ packed form
51657D47805K613L73j628j941o50R57J969K542L150L770M187M533M913M694K866
51642D80153o87m682p537q697q736q416p992p329o342n142l892k666j419q3J297
51627D07830K554L518M127M378M241L634K527J015o49k159l312m070m512m766
51613D14356m922m878m288k892j045L52O74K37r0J98J004K113L396M511M948M784
51597D18458M944O300Q610J0750J1963J2443J2560J1943R668N407K59l773n218
51584E04314m259k340p33M84K024M322P113R829J2014J3320J3608J3230J2963
51571E85889J3329J4074J4383J3483J1055P476L947K079K893O227J1308J7622
51559G03765K4726L1484L6278L8275L7918L5926L2386K7247K1133J4841Q303P92
$$ plain form
51547 1013074 1005280 988844 964910 935066 900742 863199 823641 783221 743053 704230 667679
51536 667679 634091 604116 578435 557309 540164 525919 513742 503280 494335 486733 480519 475789
51524 475789 472198 468979 465672 462539 460041 458140 456345 454317 452209 450382 448893 447245 444743 441260
51510 441260 437545 434527 432423 430804 429326 427848 425942 423076 419510 416280 413913 411909 410032 409271
51496 409271 410637 413494 416217 418235 420322 422893 425283 427032 428793 431250 433951 435922 436873 437022 436219
51481 436219 434103 430954 427531 424080 420162 415610 411064 407313 404515 402226 399918 397289 394347 391412
51467 391412 388851 386692 384576 382185 379610 377268 375581 374688 374315 373953 373426 373253 374190 376379 379243 382249
51451 382249 385448 389165 393573 398860 405493 413978 424491 436997 451393 467008 482074 494307 502286
$$ packed form
51547A013074p794j6436k3934k9844l4324l7543l9558m0420m0168l8823l6551
51536F67679l3588k9975k5681k1126j7145j4245j2177j0462q945p602o214m730
51524D75789l591l219l307l133k498j901j795k028k108j827j489j648k502l483
51510D41260l715l018k104j619j478j478j906k866l566l230k367k004j877p61
51496D09271J366K857K723K018K087K571K390J749J761K457K701J971R51J49q03
51481D36219k116l149l423l451l918m552m546l751k798k289k308k629k942k935
51467C91412k561k159k116k391k575k342j687q93l73l62n27j73R37K189K864L006
51451C82249L199L717M408N287O633Q485J0513J2506J4396J5615J5066J2233P979
$$ plain form
51438 502286 506164 507180 506973 507338 509744 514300 519286 522258 521680 517356 509642 498971 486293 473267
51424 473267 461403 451130 441990 433654 426353 420392 415667 411879 408982 407123 406199 405709 405172 404600 404353
51409 404353 404521 404608 404072 403136 402828 404049 406734 410053 413294 416333 419367 422579 426193 430576 436022 442492
51393 442492 449743 457684 466457 476208 486953 498716 511654 525922 541463 558060 575678 594786
51381 594786 616306 641187 669918 702455 738632 778575 822546 870254 920290 970185 1016966
51370 1016966 1057740 1090128 1112622 1124769 1126817 1119022 1101380 1074182 1038656 996739 950222 900394
51358 900394 848582 796646 746618 699989 657597 620014 587622 560209 536863 516579 498910
51347 498910 483903 471486 461122 452123 444182 437450 432100 427908 424335 420921 417495 414093 410936
$$ packed form
51438E02286L878J016k07L65K406M556M986K972n78m324p714j0671j2678j3026
51424D73267j1864j0273r140q336p301n961m725l788k897j859r24m90n37n72k47
51409D04353J68Q7n36r36l08J221K685L319L241L039L034L212L614M383N446O470
51393D42492P251P941Q773R751J0745J1763J2938J4268J5541J6597J7618J9108
51381E94786K1520K4881K8731L2537L6177L9943M3971M7708N0036M9895M6781
51370A016966M0774L2388K2494J2147K048p795j7642k7198l5526m1917m6517m9828
51358I00394n1812n1936n0028m6629m2392l7583l2392k7413k3346k0284j7669
51347D98910j5007j2417j0364q999p941o732n350m192l573l414l426l402l157
$$ plain form
51334 410936 408496 407255 407150 407472 407520 407191 406723 406164 405495 405019 404983 404831 403484 400617 397066 393652 390194
51317 390194 386279 382469 379936 378969 378659 378251 378098 378885 380420 381742 382255 382272 382393 382776 383164 383397 383645
51300 383645 384140 384794 385219 385096 384501 383844 383514 383640 384150 384965 386120 387714 389755 392023 394089 395562 396379
51283 396379 396855 397441 398420 399772 401299 402832 404274 405382 405694 404881 403217 401459 400151 399269 398681 398631
51267 398631 399417 400777 402029 402853 403496 404147 404541 404421 404045 403938 404268 404726 404900 404556 403666 402399 401071
51250 401071 399951 399100 398452 397940 397462 396936 396537 396715 397688 398996 399888 400126 400215 400807 402072 403671 405141
51233 405141 406259 407205 408384 409965 411645 413056 414317 415822 417512 418799 419352 419535 419737 419659 418746 417099
51217 417099 415470 414370 413706 413340 413433 413989 414470 414264 413371 412325 411615 411499 412186 413790 416064 418602 421333
$$ packed form
51334D10936k440j241j05L22M8l29m68n59o69m76l6j52j347k867l551l414l458
51317C90194l915l810k533r67l10m08j53P87J535J322N13J7J21L83L88K33K48
51300C83645M95O54M25j23n95o57l30J26N10Q15J155J594K041K268K066J473Q17
51283C96379M76N86R79J352J527J533J442J108L12q13j664j758j308q82n88n0
51267C98631P86J360J252Q24O43O51L94j20l76j07L30M58J74l44q90j267j328
51250D01071j120q51o48n12m78n26l99J78R73J308Q92K38Q9N92J265J599J470
51233D05141J118R46J179J581J680J411J261J505J690J287N53J83K02p8r13j647
51217D17099j629j100o64l66R3N56M81k06q93j046p10j16O87J604K274K538K731
$$ plain form
51200 421333 424480 427856 430603 432019 432437 432921 434079 435515 436513 436946 437278 437913 438787 439584 440076 440175 439830
51183 439830 439051 437996 436844 435543 433884 431979 430492 430076 430549 430924 430387 429017 427327 425406 422922
51168 422922 419903 417020 414961 413844 413461 413739 414624 415716 416461 416781 417250 418474 420424 422461 423966 424841
51152 424841 425457 426170 426965 427539 427655 427271 426349 424780 422611 420244 418219 416793 415825 415048 414384 414022 414240
51135 414240 415208 416950 419482 422812 426634 430163 432676 434275 435728 437396 438703 439030 438719 438672 439114 439405
51119 439405 439080 438508 438302 438504 438663 438454 438042 437949 438708 440467 442851 445380 447952 450660 453241 455207 456633
51102 456633 458209 460313 462520 464397 466236 468452 470732 472462 473766 475345 477299 478817 479217 478678 477738
51087 477738 476559 475073 473447 471979 470687 469343 467915 466730 466107 465898 465488 464382 462857 461804 461738
$$ packed form
51200D21333L147L376K747J416M18M84J158J436R98M33L32O35Q74P97M92R9l45
51183D39830p79j055j152j301j659j905j487m16M73L75n37j370j690j921k484
51168D22922l019k883k059j117l83K78Q85J092P45L20M69J224J950K037J505Q75
51152D24841O16P13P95N74J16l84r22j569k169k367k025j426r68p77o64l62K18
51135D14240R68J742K532L330L822L529K513J599J453J668J307L27l11m7M42K91
51119D39405l25n72k06K02J59k09m12r3P59J759K384K529K572K708K581J966J426
51102D56633J576K104K207J877J839K216K280J730J304J579J954J518M00n39r40
51087D77738j179j486j626j468j292j344j428j185o23k09m10j106j525j053o6
$$ plain form
51072 461738 462226 462708 463612 465935 469580 472903 474403 474465 474890 476939 480397 484439 488750 493631 499430 506154
51056 506154 513457 520763 527488 533303 538255 542692 547176 552477 559464 568751 580271 593163 606222
51043 606222 618642 630371 641635 652150 661003 667349 670958 672017 670824 667936 664236 660271 655518
51030 655518 648787 639422 627840 614919 601442 588351 576980 568384 562502 558431 555541 553995 554141
51017 554141 555796 558431 561845 566291 571889 578167 584351 590029 595415 601019 607254 614397 622672 632082
51003 632082 642222 652597 663254 674825 687733 701528 715315 728665 741714 754439 766401
50992 766401 777472 788355 799911 812157 824383 836091 847331 858156 868386 878132 888029 898609
50980 898609 909772 921205 932853 944510 955270 964080 970843 976511 982221 988973 998151 1011528 1030209
$$ packed form
51072D61738M88M82R04K323L645L323J500O2M25K049L458M042M311M881N799O724
51056E06154P303P306O725N815M952M437M484N301O987R287J1520J2892J3059
51043F06222J2420J1729J1264J0515Q853O346L609J059j193k888l700l965m753
51030F55518o731r365j1582j2921j3477j3091j1371q596n882m071k890j546J46
51017E54141J655K635L414M446N598O278O184N678N386N604O235P143Q275R410
51003F32082J0140J0375J0657J1571J2908J3795J3787J3350J3049J2725J1962
50992G66401J1071J0883J1556J2246J2226J1708J1240J0825J0230R746R897J0580
50980H98609J1163J1433J1648J1657J0760Q810O763N668N710O752R178J3377J8681
$$ plain form
50967 1030209 1053962 1081922 1113618 1149003 1187913 1230025 1275095 1322692 1371859 1421576 1471508
50956 1471508 1521702 1571407 1618762 1661906 1700068 1733267 1761348 1783826 1800578 1812181 1819437
50945 1819437 1822895 1823161 1821494 1819729 1819440 1821223 1824633 1828420 1830603 1828790 1821218 1807877 1790446 1770956
50931 1770956 1750566 1729486 1707505 1684182 1658790 1630599 1599316 1565133 1528503 1490072 1450611
50920 1450611 1410576 1369825 1328118 1285937 1244411 1204475 1166536 1131074 1099018 1071058 1046842
50909 1046842 1025300 1005752 988358 973417 960524 948714 937418 927027 918322 911427 905573 899947
50897 899947 894453 889440 885001 881014 877716 875657 874956 875043 875370 876021 877387 879511 882058 884718 887375
50882 887375 890082 893175 897272 902799 909496 916614 923626 930597 937915 945861 954455 963575 973208 983729
$$ packed form
50967A030209K3753K7960L1696L5385L8910M2112M5070M7597M9167M9717M9932
50956A471508N0194M9705M7355M3144L8162L3199K8081K2478J6752J1603P256
50945A819437L458K66j667j765k89J783L410L787K183j813p572j3341j7431j9490
50931A770956k0390k1080k1981k3323k5392k8191l1283l4183l6630l8431l9461
50920A450611m0035m0751m1707m2181m1526l9936l7939l5462l2056k7960k4216
50909A046842k1542j9548j7394j4941j2893j1810j1296j0391q705o895n854n626
50897H99947n494n013m439l987l298k059p01Q7L27O51J366K124K547K660K657
50882H87375K707L093M097N527O697P118P012O971P318P946Q594R120R633J0521
$$ plain form
50868 983729 995849 1010105 1026279 1043437 1060726 1078236 1097121 1118797 1143947 1172336 1203678
50857 1203678 1238519 1278035 1323000 1373276 1428378 1488213 1553188 1623939 1701202 1785620 1877289
50846 1877289 1975597 2079708 2189019 2302874 2420069 2538987 2658029 2775492 2889049 2995781
50836 2995781 3092741 3177239 3246729 3299045 3333178 3349763 3350734 3338556 3315618 3284090 3246299 3205303
50824 3205303 3164765 3127774 3095825 3069305 3048781 3035146 3028409 3026857 3027572 3027201 3022211 3009281 2986317
50811 2986317 2952921 2909519 2856301 2793313 2721170 2641125 2554743 2464026 2371616 2280189 2191633
50800 2191633 2107294 2028827 1958050 1895828 1841794 1795503 1757376 1728166 1707914 1695959 1691741
50789 1691741 1695036 1705317 1721251 1741107 1763557 1787900 1813418 1838662 1861521 1880105 1893458
$$ packed form
50868I83729J2120J4256J6174J7158J7289J7510J8885K1676K5150K8389L1342
50857A203678L4841L9516M4965N0276N5102N9835O4975P0751P7263Q4418R1669
50846A877289R8308J04111J09311J13855J17195J18918J19042J17463J13557J06732
50836B995781R6960Q4498O9490N2316L4133J6585R71j2178k2938l1528l7791m0996
50824C205303m0538l6991l1949k6520k0524j3635o737j552P15l71m990j2930k2964
50811B986317l3396m3402n3218o2988p2143q0045q6382r0717r2410r1427q8556
50800B191633q4339p8467p0777o2222n4034m6291l8127k9210k0252j1955m218
50789A691741L295J0281J5934J9856K2450K4343K5518K5244K2859J8584J3353
$$ plain form
50778 1893458 1901461 1904344 1902541 1896723 1887572 1875506 1860869 1844213 1825943 1805697 1782493 1755586
50766 1755586 1724858 1690403 1652303 1611104 1568041 1524465 1481297 1439253 1399203 1361884 1327550
50755 1327550 1296356 1268920 1246037 1227931 1214154 1204124 1197353 1193179 1190799 1189777 1190303 1192921 1198250
50742 1198250 1207006 1219897 1237206 1258619 1283630 1312102 1344447 1381388 1423555 1471126 1523778
50731 1523778 1580995 1642408 1707736 1776409 1847357 1919090 1989895 2058205 2123095 2184466 2242428
50720 2242428 2296367 2344614 2384861 2414749 2432384 2436864 2428629 2409142 2380251 2344031 2303104 2260595
50708 2260595 2219545 2182500 2151445 2127577 2110886 2100462 2095516 2095843 2101023 2109522 2118840 2126337 2129701
50695 2129701 2127036 2117087 2099400 2074120 2041810 2003690 1961802 1918508 1875842 1835472 1798876 1767072
$$ packed form
50778A893458Q003K883j803n818r151j2066j4637j6656j8270k0246k3204k6907
50766A755586l0728l4455l8100m1199m3063m3576m3168m2044m0050l7319l4334
50755A327550l1194k7436k2883j8106j3777j0030o771m174k380j022N26K618N329
50742A198250Q756J2891J7309K1413K5011K8472L2345L6941M2167M7571N2652
50731A523778N7217O1413O5328O8673P0948P1733P0805O8310O4890O1371N7962
50720B242428N3939M8247M0247K9888J7635M480q235j9487k8891l6220m0927m2509
50708B260595m1050l7045l1055k3868j6691j0424m946L27N180Q499R318P497L364
50695B129701k665r949j7687k5280l2310l8120m1888m3294m2666m0370l6596l1804
$$ plain form
50683 1767072 1740338 1718691 1702651 1693162 1690875 1695987 1708775 1729790 1759316 1797076 1842742 1896463
50671 1896463 1958571 2028820 2105931 2187698 2271382 2354106 2433019 2505332 2568666 2621803 2665090
50660 2665090 2699799 2727142 2748050 2763588 2774855 2782295 2785535 2784060 2777598 2765689 2747502 2722706
50648 2722706 2692431 2658951 2624396 2589924 2556016 2523307 2493133 2467408 2447894 2435492 2430236
50637 2430236 2431822 2439769 2452969 2469572 2487748 2506461 2525282 2543733 2561137 2576992 2591231 2604421
50625 2604421 2617998 2633663 2651278 2666743 2672518 2661121 2628951 2577704 2513243 2443389 2375551
50614 2375551 2314813 2263271 2221093 2188168 2164629 2150111 2143187 2141949 2144832 2150606 2157795 2164578
50602 2164578 2169292 2170575 2166856 2156083 2136368 2106909 2068165 2021350 1968045 1910147 1849723 1788650
$$ packed form
50683A767072k6734k1647j6040r489k287N112J2788K1015K9526L7760M5666N3721
50671A896463O2108P0249P7111Q1767Q3684Q2724P8913P2313O3334N3137M3287
50660B665090L4709K7343K0908J5538J1267P440L240j475o462j1909j8187k4796
50648B722706l0275l3480l4555l4472l3908l2709l0174k5725j9514j2402n256
50637B430236J586P947J3200J6603J8176J8713J8821J8451J7404J5855J4239J3190
50625B604421J3577J5665J7615J5465N775j1397l2170n1247o4461o9854o7838
50614B375551o0738n1542m2178l2925k3539j4518o924j238K883N774P189O783
50602B164578M714J283l719j0773j9715k9459l8744m6815n3305n7898o0424o1073
$$ plain form
50590 1788650 1728435 1670289 1615121 1563495 1515904 1473125 1435944 1404341 1377344 1353971 1334066
50579 1334066 1317889 1305188 1295181 1287369 1281782 1278232 1275776 1273286 1270445 1267928 1266729 1267540 1270697
50566 1270697 1276294 1284096 1293544 1304292 1316830 1332350 1351819 1375341 1402631 1433955 1470255 1512413
50554 1512413 1560710 1615003 1674961 1739861 1808296 1878310 1947741 2014506 2076957 2134259 2186292
50543 2186292 2233112 2274825 2312190 2346920 2380973 2415703 2451995 2490762 2532598 2576960 2622323
50532 2622323 2667410 2711981 2756515 2801840 2849419 2901456 2960039 3025978 3098593 3176523 3258549
50521 3258549 3343732 3430984 3518637 3604477 3686173 3761494 3827919 3882365 3921858 3944636 3950243
50510 3950243 3938524 3909001 3861513 3796985 3717251 3624459 3521190 3410901 3297571 3184781
$$ packed form
50590A788650o0215n8146n5168n1626m7591m2779l7181l1603k6997k3373j9905
50579A334066j6177j2701j0007p812n587l550k456k490k841k517j199Q11L157
50566A270697N597P802R448J0748J2538J5520J9469K3522K7290L1324L6300M2158
50554A512413M8297N4293N9958O4900O8435P0014O9431O6765O2451N7302N2033
50543B186292M6820M1713L7365L4730L4053L4730L6292L8767M1836M4362M5363
50532B622323M5087M4571M4534M5325M7579N2037N8583O5939P2615P7930Q2026
50521C258549Q5183Q7252Q7653Q5840Q1696P5321O6425N4446L9493K2778N607
50510C950243j1719k9523m7488o4528p9734r2792j03269j10289j13330j12790
$$ plain form
50500 3184781 3075403 2972205 2878304 2796812 2730109 2679397 2644669 2625086 2619688 2627809 2648604
50489 2648604 2680125 2719177 2762160 2805667 2846071 2878871 2898980 2901884 2884692 2846531 2788403
50478 2788403 2712724 2622710 2521986 2414519 2304351 2194771 2087629 1983679 1883674 1788888
50468 1788888 1700631 1619590 1545859 1479334 1419835 1366991 1320313 1279382 1243843 1213285 1187257
50457 1187257 1165338 1147064 1131867 1119222 1108745 1100056 1092682 1086337 1081135 1077300 1074817 1073690 1074404
50444 1074404 1077551 1082897 1089360 1096216 1103934 1113384 1124398 1135525 1145160 1152666 1158548 1163894 1169719
50431 1169719 1176576 1184696 1194556 1207127 1223352 1243464 1267063 1293734 1323189 1354868 1387913 1421832
50419 1421832 1456914 1493783 1532715 1573585 1616285 1660882 1707433 1755867 1806063 1857826 1910790
$$ packed form
50500C184781j09378j03198r3901q1492o6703n0712l4728j9583n398Q121K0795
50489B648604L1521L9052M2983M3507M0404L2800K0109K904j7192l8161n8128
50478B788403p5679r0014j00724j07467j10168j09580j07142j03950j00005r4786
50468A788888q8257q1041p3731o6525n9499n2844m6678m0931l5539l0558k6028
50457A187257k1919j8274j5197j2645j0477q689p374o345n202l835k483j127P14
50444A074404L147N346O463O856P718R450J1014J1127R635P506N882N346N825
50431A169719O857Q120R860J2571J6225K0112K3599K6671K9455L1679L3045L3919
50419A421832L5082L6869L8932M0870M2700M4597M6551M8434N0196N1763N2964
$$ plain form
50408 1910790 1964457 2018436 2072546 2126572 2179908 2231454 2279886 2323943 2362451 2394276 2418588
50397 2418588 2435250 2444595 2446487 2439717 2422645 2394455 2355512 2306684 2248879 2183492 2112857 2039719
50385 2039719 1966374 1894566 1826043 1762689 1705996 1656735 1615312 1582214 1557888 1542330 1535077
50374 1535077 1535535 1543106 1556883 1575337 1596290 1617151 1635219 1648062 1653903 1651714 1640983 1621548
50362 1621548 1593851 1559198 1519462 1476417 1431457 1385777 1340396 1295823 1252074 1209266 1167966
50351 1167966 1128685 1091314 1055502 1021470 989988 961524 935838 912488 891342 872441 855685
50340 855685 840922 828156 817434 808675 801693 796211 791711 787535 783441 779975 778030 778076 779901 783025
50326 783025 787194 792564 799598 808813 820533 834828 851612 870538 890629 910117 926823 938846
$$ packed form
50408A910790N3667N3979N4110N4026N3336N1546M8432M4057L8508L1825K4312
50397B418588J6662R345J892o770j7072k8190l8943m8828n7805o5387p0635p3138
50385B039719p3345p1808o8523o3354n6693m9261m1423l3098k4326j5558p253
50374A535077M58P571J3777J8454K0953K0861J8068J2843N841k189j0731j9435
50362A621548k7697l4653l9736m3045m4960m5680m5381m4573m3749m2808m1300
50351A167966l9281l7371l5812l4032l1482k8464k5686k3350k1146j8901j6756
50340H55685j4763j2766j0722q759o982n482m500m176m094l466j945M6J825L124
50326G83025M169N370P034R215J1720J4295J6784J8926K0091J9488J6706J2023
$$ plain form
50314 938846 945115 945744 942080 936234 930240 925526 923025 923333 926492 931889 938729 946515 954831 962945 970111
50299 970111 976197 981586 986389 990175 992558 993658 993805 993118 991603 989389 986522 982619 977028 969349 959851
50284 959851 949507 939677 931438 924958 919634 914981 911240 908956 908309 909187 911701 916125 922341 929848
50270 929848 938423 948331 959657 971795 983896 995594 1007000 1018175 1028975 1039317 1049243 1058727
50258 1058727 1067693 1076137 1083957 1090650 1095547 1098445 1099750 1099923 1099147 1097740 1096535 1096379 1097329 1098652 1099758
50243 1099758 1101020 1103745 1109427 1118987 1132585 1150134 1171942 1198721 1230987 1268763 1312111 1361709
50231 1361709 1418565 1483249 1555679 1635409 1721465 1811597 1902038 1988488 2067596 2137740 2198770
50220 2198770 2251365 2296722 2336606 2373232 2408392 2442136 2472114 2494179 2503568 2495790 2467393 2417054
$$ packed form
50314I38846O269O29l664n846n994m714k501L08L159N397O840P786Q316Q114P166
50299I70111O086N389M803L786K383J100J47o87j515k214k867l903n591p679r498
50284I59851j0344r830q239o480n324m653l741k284o47Q78K514M424O216P507
50270I29848Q575R908J1326J2138J2101J1698J1406J1175J0800J0342R926R484
50258A058727Q966Q444P820O693M897K898J305J73p76j407j205j56R50J323J106
50243A099758J262K725N682R560J3598J7549K1808K6779L2266L7776M3348M9598
50231A361709N6856O4684P2430P9730Q6056R0132R0441Q6450P9108P0144O1030
50220B198770N2595M5357L9884L6626L5160L3744K9978K2065R389p778k8397n0339
$$ plain form
50208 2417054 2346336 2259012 2159536 2052339 1942282 1834660 1733950 1642655 1561649 1491260
50198 1491260 1431482 1381218 1337891 1298090 1258717 1217875 1175198 1131609 1088687 1048102 1011317
50187 1011317 979280 952070 928921 908889 891471 876579 864163 854073 846154 840228 836086 833546
50175 833546 832383 832081 831945 831640 831372 831360 831507 831859 832853 834598 836315 837251 837901 839509 842432 845869 849346
50158 849346 853546 859273 866403 874473 883636 894255 905871 917390 928106 937931 946663 953789 959157
50145 959157 963351 967104 970646 973750 976154 977878 979377 981513 985131 990609 998044 1007827 1020544 1036158
50131 1036158 1053683 1071990 1090715 1110147 1130550 1152019 1174915 1200089 1228628 1261575 1299756
50120 1299756 1343651 1393572 1450288 1515445 1591067 1678587 1778537 1891039 2016145 2153503 2301719
$$ packed form
50208B417054p0718q7324r9476j07197j10057j07622j00710r1295q1006p0389
50198A491260n9778n0264m3327l9801l9373m0842m2677m3589m2922m0585l6785
50187A011317l2037k7210k3149k0032j7418j4892j2416j0090p919n926m142k540
50175H33546j163l02j36l05k68j2J47L52R94J745J717R36O50J608K923L437L477
50158H49346M200N727P130Q070R163J0619J1616J1519J0716R825Q732P126N368
50145I59157M194L753L542L104K404J724J499K136L618N478P435R783J2717J5614
50131A036158J7525J8307J8725J9432K0403K1469K2896K5174K8539L2947L8181
50120A299756M3895M9921N6716O5157P5622Q7520R9950J12502J25106J37358J48216
$$ plain form
50109 2301719 2457788 2616769 2772372 2918956 3053731 3177083 3290897 3397189 3498303
50100 3498303 3596973 3694478 3788349 3872380 3938882 3980657 3991523 3966822 3904860 3807941 3681495
50089 3681495 3532036 3365791 3188515 3005677 2822288 2642539 2469704 2306352 2154670
50080 2154670 2016418 1892518 1782800 1686380 1602234 1529273 1466069 1411024 1362936 1321204 1285395
50069 1285395 1254821 1228650 1206214 1187118 1171145 1157970 1146874 1136983 1128027 1120533 1114755 1109731
50057 1109731 1104114 1097760 1091507 1085377 1078097 1068857 1058532 1048467 1038897 1029403 1020229 1012082 1005059
50044 1005059 998825 993623 990087 988095 986771 985674 985177 985638 987096 989980 995143 1002704 1011515 1020253
50030 1020253 1028581 1036861 1045241 1053451 1061138 1067986 1073849 1079090 1084488 1090465 1096598 1102071 1106320 1109073
$$ packed form
50109B301719J56069J58981J55603J46584J34775J23352J13814J06292J01114
50100C498303R8670R7505R3871Q4031O6502M1775J0866k4701o1962r6919j26446
50089C681495j49459j66245j77276j82838j83389j79749j72835j63352j51682
50080B154670j38252j23900j09718r6420q4146p2961o3204n5045m8088m1732l5809
50069A285395l0574k6171k2436j9096j5973j3175j1096r891q956p494n778n024
50057A109731n617o354o253o130p280r240j0325j0065r570r494r174q147p023
50044A005059o234n202l536j992j324j097m97M61J458K884N163P561Q811Q738
50030A020253Q328Q280Q380Q210P687O848N863N241N398N977O133N473M249K753
$$ plain form
50016 1109073 1110314 1110651 1111342 1113407 1116921 1121595 1127733 1135929 1145899 1156337 1166279 1176248 1187822 1202347
50002 1202347 1220405 1242296 1268522 1299615 1335751 1376860 1423122 1475145 1533630 1599092 1671848
49991 1671848 1751776 1837592 1926450 2014593 2098366 2174611 2240684 2295153 2338874 2374979 2407413
49980 2407413 2439322 2472322 2506240 2538816 2565793 2581689 2580705 2557554 2508653 2433617 2335747 2220793
49968 2220793 2095174 1965150 1836674 1714856 1603052 1502674 1414028 1337214 1272263 1218695
49958 1218695 1175233 1140122 1111842 1089511 1072483 1059599 1049111 1039441 1029829 1020149 1010358 1000364
49946 1000364 990194 979882 969084 957008 942870 926475 908380 889473 870395 851390 832671
49935 832671 814588 797246 780286 763554 747834 734404 723700 714907 706920 699324 692332 686369
$$ packed form
50016A109073J241L37O91K065L514M674O138Q196R970J0438R942R969J1574J4525
50002A202347J8058K1891K6226L1093L6136M1109M6262N2023N8485O5462P2756
49991A671848P9928Q5816Q8858Q8143Q3773P6245O6073N4469M3721L6105L2434
49980B407413L1909L3000L3918L2576K6977J5896r84k3151m8901p5036r7870j14954
49968B220793j25619j30024j28476j21818j11804j00378q8646p6814o4951n3568
49958A218695m3462l5111k8280k2331j7028j2884j0488r670r612r680r791r994
49946A000364j0170j0312j0798j2076j4138j6395j8095j8907j9078j9005j8719
49935H32671j8083j7342j6960j6732j5720j3430j0704q793p987p596o992n963
$$ plain form
49923 686369 682014 679803 679620 680551 681747 683189 685255 687831 690306 692354 694357 697087 701168 706783 713704
49908 713704 721687 730865 741452 752996 764343 774592 783724 792078 799587 805895 810809 814257 816070
49895 816070 816180 814672 811273 805219 796112 784571 771515 757268 741967 726459 712002 699219 688038
49882 688038 678372 670040 662161 653658 644496 635673 627904 621070 615003 609947 605979 602848 600731 600330
49868 600330 601805 604359 607372 611284 616803 623894 632176 641700 652583 664337 676377 688840 702067
49855 702067 715416 727376 736891 743974 749036 752269 753783 753787 752427 749749 745801 740458 733250 723922
$$ packed form
49923F86369m355k211j83R31J196J442K066K576K475K048K003K730M081N615O921
49908G13704P983R178J0587J1544J1347J0249R132Q354P509O308M914L448J813
49895H16070J10j508l399o054r107j1541j3056j4247j5301j5508j4457j2783j1181
49882F88038r666q332p879q503r162q823p769o834o067n056l968l131k117m01
49868F00330J475K554L013L912N519P091Q282R524J0883J1754J2040J2463J3227
49855G02067J3349J1960R515P083N062L233J514Mj360k678l948n343p208r328
$$ [...]
##END NTUPLES=NMR SPECTRUM
##END=
