##TITLE=AC1712_14FALM0001_8743523_LyKpv0qBwT
##JCAMPDX= 6.0         $$ Bruker NMR JCAMP-DX V2.0
##DATA TYPE= NMR SPECTRUM
##DATA CLASS= NTUPLES
##ORIGIN= BRUKER
##OWNER= Administrator
$$ 1.72 TOPSPIN		Version 2.1
$$ 2015-08-08 03:43:55.984 -0700  Administrator@X
$$ Compression mode = diff/dup
##.OBSERVE FREQUENCY= 400.02188249412
##.OBSERVE NUCLEUS= ^1H
##.ACQUISITION MODE= SIMULTANEOUS (DQD)
##.ACQUISITION SCHEME= undefined
##.AVERAGES= 8
##.DIGITISER RES= 22
##SPECTROMETER/DATA SYSTEM= spect
##.PULSE SEQUENCE= zg30
##.SOLVENT NAME= COFFEE_meoh
##.SHIFT REFERENCE= INTERNAL, COFFEE_meoh, 1, 14.98509
##AUDIT TRAIL= $$ (NUMBER, WHEN, WHO, WHERE, PROCESS, VERSION, WHAT)
$$ ##TITLE= Audit trail, TOPSPIN		Version 2.1
$$ ##JCAMPDX= 5.01
$$ ##ORIGIN= Bruker BioSpin GmbH
$$ ##OWNER= Administrator
$$ $$ E:\/data/COFFEE/nmr/AC1712_14FALM0001_8743523_LyKpv0qBwT/50/pdata/1/auditp.txt
$$ ##AUDIT TRAIL=  $$ (NUMBER, WHEN, WHO, WHERE, PROCESS, VERSION, WHAT)
(   1,<2015-08-08 03:43:48.766 -0700>,<Administrator>,<X>,<go>,<TOPSPIN 2.1>,
      <created by zg
	started at 2015-08-08 03:42:42.359 -0700,
	POWCHK enabled, PULCHK disabled,
       configuration hash MD5:
       21 0F 79 D6 B3 7B B4 F6 88 20 88 DB 03 48 BD 9F
       data hash MD5: 64K
       C8 FA 0C 1C 37 21 D9 06 84 F4 B9 71 87 30 B3 6B>)
(   2,<2015-08-08 03:43:51.875 -0700>,<Administrator>,<X>,<proc1d>,<TOPSPIN 2.1>,
      <Start of raw data processing
       efp LB = 0 FT_mod = 6 PKNL = 1 PHC0 = 0 PHC1 = 0 SI = 32K 
       data hash MD5: 32K
       7D 16 36 47 E7 39 0E 19 9B 64 A9 FD D3 3D C2 B2>)
(   3,<2015-08-08 03:43:52.172 -0700>,<Administrator>,<X>,<proc1d>,<TOPSPIN 2.1>,
      <pk PHC0 = 93.09814 PHC1 = 0 
       data hash MD5: 32K
       B8 14 65 20 F2 47 1A A6 26 EF BF D5 64 12 36 04>)
(   4,<2015-08-08 03:43:52.281 -0700>,<Administrator>,<X>,<proc1d>,<TOPSPIN 2.1>,
      <abs ABSG = 1 
       data hash MD5: 32K
       4A 2C BA CF 4B A9 56 AC 4F F7 C4 81 D6 A1 B3 EB>)
(   5,<2015-08-08 03:43:52.344 -0700>,<Administrator>,<X>,<proc1d>,<TOPSPIN 2.1>,
      <abs ABSG = 2 
       data hash MD5: 32K
       1C 1A 43 9F AE 82 A2 8E CD 04 84 9A 47 80 E2 A1>)
(   6,<2015-08-08 03:43:52.406 -0700>,<Administrator>,<X>,<proc1d>,<TOPSPIN 2.1>,
      <abs ABSG = 3 
       data hash MD5: 32K
       6D D8 60 EC 18 8E 16 12 BC 3F C9 C1 BC 44 27 E7>)
(   7,<2015-08-08 03:43:52.453 -0700>,<Administrator>,<X>,<proc1d>,<TOPSPIN 2.1>,
      <abs ABSG = 4 
       data hash MD5: 32K
       48 8B C3 A0 7E BB 23 0E A5 F7 A0 06 64 CB 81 05>)
(   8,<2015-08-08 03:43:52.531 -0700>,<Administrator>,<X>,<proc1d>,<TOPSPIN 2.1>,
      <abs ABSG = 5 
       data hash MD5: 32K
       93 77 EC D4 BC 65 45 E0 29 E9 BA 54 B1 C4 8A 96>)
$$ ##END=
$$ 
$$ $$ hash MD5
$$ $$ 02 2E 0F ED 64 6C BA 68 B1 13 B0 D2 22 14 3F 87
##$RELAX= 
##$RELAX= 
##$RELAX= 
##$RELAX= 
##$RELAX= 
##$RELAX= 
##$RELAX= 
$$ Bruker specific parameters
$$ --------------------------
##$DU= <E:\>
##$EXPNO= 50
##$NAME= <AC1712_14FALM0001_8743523_LyKpv0qBwT>
$$ [...]
150 150 150 150 150 150 150 150
##$TP07= 0
##$TPNAME0= <>
##$TPNAME1= <>
##$TPNAME2= <>
##$TPNAME3= <>
##$TPNAME4= <>
##$TPNAME5= <>
##$TPNAME6= <>
##$TPNAME7= <>
##$TPOAL= (0..7)
0.5 0.5 0.5 0.5 0.5 0.5 0.5 0.5
##$TPOFFS= (0..7)
0 0 0 0 0 0 0 0
##$TUNHIN= 0
##$TUNHOUT= 0
##$TUNXOUT= 0
##$USERA1= <user>
##$USERA2= <user>
##$USERA3= <user>
##$USERA4= <user>
##$USERA5= <user>
##$V9= 5
##$VALIST= <valist>
##$VCLIST= <CCCCCCCCCCCCCCC>
##$VD= 0
##$VDLIST= <DDDDDDDDDDDDDDD>
##$VPLIST= <PPPPPPPPPPPPPPP>
##$VTLIST= <TTTTTTTTTTTTTTT>
##$WBST= 2048
##$WBSW= 25
##$XGAIN= (0..3)
0 0 0 0
##$XL= 0
##$YL= 0
##$YMAX_a= 599540
##$YMIN_a= -506206
##$ZGOPTNS= <>
##$ZL1= 120
##$ZL2= 120
##$ZL3= 120
##$ZL4= 120
##$ABSF1= 14.98509
##$ABSF2= -5.573092
##$ABSG= 5
##$ABSL= 3
##$ALPHA= 0
##$AQORDER= 0
##$ASSFAC= 0
##$ASSFACI= 0
##$ASSFACX= 0
##$ASSWID= 0
##$AUNMP= <proc_prof1d_extract_pilot.lims>
##$AXLEFT= 0
##$AXNAME= <>
##$AXNUC= <1H>
##$AXRIGHT= 0
##$AXTYPE= 0
##$AXUNIT= <>
##$AZFE= 0.1
##$AZFW= 0.1
##$BCFW= 0
##$BC_mod= 0
##$BYTORDP= 0
##$COROFFS= 0
##$CY= 15
##$DATMOD= 1
##$DC= 0
##$DFILT= <>
##$DTYPP= 0
##$F1P= 0
##$F2P= 0
##$FCOR= 0.5
##$FTSIZE= 32768
##$FT_mod= 6
##$GAMMA= 0
##$GB= 0
##$INTBC= 1
##$INTSCL= 1
##$ISEN= 128
##$LB= 0
##$LEV0= 0
##$LPBIN= 0
##$MAXI= 10000
##$MC2= 0
##$MEAN= 0
##$ME_mod= 0
##$MI= 0
##$NCOEF= 0
##$NC_proc= -8
##$NLEV= 6
##$NOISF1= 0
##$NOISF2= 0
##$NSP= 0
##$NTH_PI= 0
##$NZP= 0
##$OFFSET= 14.98509
##$PC= 1
##$PHC0= 93.09814
##$PHC1= 0
##$PH_mod= 1
##$PKNL= yes
##$PPARMOD= 0
##$PPDIAG= 0
##$PPIPTYP= 0
##$PPMPNUM= 2147483647
##$PPRESOL= 1
##$PSCAL= 4
##$PSIGN= 0
##$PYNMP= <proc.py>
##$REVERSE= no
##$SF= 400.02
##$SI= 32768
##$SIGF1= 0
##$SIGF2= 0
##$SINO= 400
##$SIOLD= 32768
##$SPECTYP= <>
##$SREGLST= <1H.CDCl3>
##$SSB= 0
##$STSI= 32768
##$STSR= 0
##$SW_p= 8223.68421052631
##$SYMM= 0
##$S_DEV= 0
##$TDeff= 65536
##$TDoff= 0
##$TI= <>
##$TILT= no
##$TM1= 0
##$TM2= 0
##$TOPLEV= 0
##$USERP1= <user>
##$USERP2= <user>
##$USERP3= <user>
##$USERP4= <user>
##$USERP5= <user>
##$WDW= 1
##$XDIM= 32768
##$YMAX_p= 440343860
##$YMIN_p= -630779
##$CURPLOT= <Network HP LaserJet P1505>
##$CURPRIN= <$Network HP LaserJet P1505>
##$DFORMAT= <normdp>
##$LAYOUT= <+/1D_H.xwp>
##$LFORMAT= <normlp>
##$PFORMAT= <normpl>
##$SURQMSG= 1
$$ End of Bruker specific parameters
$$ ---------------------------------
##NTUPLES= NMR SPECTRUM
##VAR_NAME=  FREQUENCY,     SPECTRUM/REAL,   SPECTRUM/IMAG
##SYMBOL=    X,             R,               I
##VAR_TYPE=  INDEPENDENT,   DEPENDENT,       DEPENDENT
##VAR_FORM=  AFFN,          ASDF,            ASDF
##VAR_DIM=   32768,         32768,           32768
##UNITS=     HZ,            ARBITRARY UNITS, ARBITRARY UNITS
##FACTOR=    0.250966925370066, 1,           1
##FIRST=     8223.43324360094, -30522,       -63245
##LAST=      0,             106182,          -114831
##MIN=       0,             -630779,         0
##MAX=       8223.43324360094, 440343860,    0
$$ Real data points
##PAGE= N=1
##DATA TABLE= (X++(R..R)), XYDATA
$$ [...]
19525h3073A58661B463K46586J09880A62075o4279J6083m6986a03692j63679A1549
$$ -83073 158661 2463 249049 358929 162075 97796 113879 66893 -103692 -267371 11549
19513a39649D091M737a14101m4015B98461o0061M8011A41534a54375j40142A36382
$$ -139649 4091 8828 -114101 -158116 298461 238400 286411 141534 -154375 -294517 136382
19501b35774E8493d7107E484c181n6752B5517O8080d5095j09528n1254j46218
$$ -235774 58493 -47107 5484 -3181 -59933 25517 93597 -45095 -154623 -205877 -352095
19490c52095a41250J7608j02563J1714G5703a81877h3563I0424a61191C2948f8571
$$ -352095 -141250 -123642 -226205 -214491 75703 -181877 -83563 90424 -161191 32948 -68571
19478i1440B54431b8239j64592f711B3387h9757n599q819A4142J24047a47785
$$ -91440 254431 -28239 -192831 -6711 23387 -89757 -95356 -104175 14142 138189 -147785
19466a51911P1126a8788H4251e9227A46135a34840q877j3704e0183m1946k34664
$$ -151911 -80785 -18788 84251 -59227 146135 -134840 -143717 -157421 -50183 -92129 -326793
19455c26793k3786A05774b83279i1002B05837a96304i6669I8826a44443b9095
$$ -326793 -350579 105774 -283279 -91002 205837 -196304 -96669 98826 -144443 -29095
19444a9251o7973o149K7723R390H7098J02039m1067i0192H0552K0637b29185j26043
$$ -19251 -87224 -93373 -65650 -56260 87098 189137 148070 -90192 80552 101189 -229185 -355228
19432c55228h4897r647F9840f2826A56365b65018A1450h4652q0444A2460J34467
$$ -355228 -84897 -94544 69840 -62826 156365 -265018 11450 -84652 -165096 12460 146927
19421A46927b42020A80548c04635i9927E2511c4508C5570c10587g7084j76727
$$ 146927 -242020 180548 -304635 -99927 52511 -34508 35570 -310587 -77084 -253811
19411b53811l0951i4899p9385j30926b5000j20150B22322b10217M2971j58061
$$ -253811 -284762 -94899 -174284 -305210 -25000 -145150 222322 -210217 -167246 -325307
19401c25307m5273h6690h088p0478l0731k23897G8052L5202a6199l3747A62888
$$ -325307 -370580 -86690 -8088 -78566 -109297 -333194 78052 113254 -16199 -49946 162888
19389A745a49435f692j51813k12332B15553a49169O1002k6102D2235b46508F3891
$$ 1745 -149435 -6692 -158505 -370837 215553 -149169 -88167 -114269 42235 -246508 63891
19377b73576h8314j52496e3956k5466B5514a15721M6343q010b0046k50288A54197
$$ -273576 -88314 -240810 -53956 -79422 25514 -115721 -69378 -77388 -20046 -270334 154197
19365b1890j50047A12679C2382i8994R008L3432m60271K35614A23082a01171D8661
$$ -21890 -171937 112679 32382 -98994 -89986 -56554 -516825 -281211 123082 -101171 48661
19353A43346b12895D6820b7060q4756E0530M9693J6063h3247A81840h0674C04616
$$ 143346 -212895 46820 -27060 -111816 50530 100223 116286 -83247 181840 -80674 304616
19341b63224e1624B34498d21356J96624i6006k82836e1837a9364F7198d28239
$$ -263224 -51624 234498 -421356 -224732 -96006 -378842 -51837 -19364 67198 -428239
19330b30808i2576k2530q024D1216J88062b33969g9414D8192Q9239B881c5791
$$ -230808 -92576 -115106 -123130 41216 229278 -233969 -79414 48192 137431 2881 -35791
19318i6939M4648j74557r3067A07042b68977J28184c1490b842l25158B02698N3582
$$ -96939 -52291 -226848 -319915 107042 -268977 -140793 -31490 -2842 -328000 202698 256280
19307B56280D4569J3894A6634J34453b72022A65051h0357L2150r894E1565P7121
$$ 256280 44569 58463 16634 151087 -272022 165051 -80357 -48207 -58101 51565 128686
19296A28686P7333j00105c11899f1255I6658d13483k7356A21929b58569c7616
$$ 128686 206019 105914 -311899 -61255 96658 -413483 -440839 121929 -258569 -37616
19285c0431j16963I8394L6738L1514a39802j76659g5005m69889b72071d1963C0271
$$ -30431 -147394 98394 135132 166646 -139802 -316461 -75005 -544894 -272071 -41963 30271
19273d3456j63010a216A79577b04164l694O844j32715A76438f9127j32774B6411
$$ -43456 -206466 -1216 179577 -204164 -207858 -201014 -333729 176438 -69127 -201901 26411
19261a66289k98572H2638b20790A42360c46940A23543N3988C2867K8379a12638
$$ -166289 -464861 82638 -220790 142360 -346940 123543 177531 32867 61246 -112638
19250G960b21464E9681a43249m6299j05395J45327A57666a24201A52700o4179
$$ 7960 -221464 59681 -143249 -189548 -294943 -149616 157666 -124201 152700 88521
19240H8521a01036l06007F3086a99692C59349A06278O0800E4148b61214Q5492
$$ 88521 -101036 -407043 63086 -199692 359349 106278 167078 54148 -261214 -175722
19230a75722O8028j09798D5187b59084j4547k141a28832m3806N617B5394e4951
$$ -175722 -107694 -217492 45187 -259084 -273631 -275772 -128832 -172638 -167021 25394 -54951
19218a32255M315K530b8771o519j26927I5204K424b20836O6900c8396B86615a2288
$$ -132255 -127940 -125410 -28771 -35290 -162217 95204 97628 -220836 -153936 -38396 286615 -12288
19205i333m980j3078m26699a59841A71775g8942E9660a86896B67305g9076b8687
$$ -9333 -14313 -27391 -454090 -159841 171775 -78942 59660 -186896 267305 -79076 -28687
19193e3821B38157a86574l1370R2876j57646D0984R1185d27j07940c862l21809
$$ -53821 238157 -186574 -217944 -125068 -282714 40984 132169 -427 -108367 -3862 -325671
19182c25671A85757a15729Q565k1677l4427D1798a96086A72172a9954O519o6452
$$ -325671 185757 -115729 -107164 -128841 -163268 41798 -196086 172172 -19954 -13435 -79887
19171g9887K8481l00927F5042c73058a54499O2775j2531A08199e8688j20730R216
$$ -79887 -51406 -352333 65042 -373058 -154499 -91724 -104255 108199 -58688 -179418 -170202
19160a70202h2181B4413m551b50906J04296k7933a5757o5481A6336c78840A06413
$$ -170202 -82181 24413 19862 -250906 -146610 -174543 -15757 -81238 16336 -378840 106413
19148I4082b32590N7866A31708K73295d76046D2991f2394l03285a80980j09029
$$ 94082 -232590 -174724 131708 405003 -476046 42991 -62394 -365679 -180980 -290009
19138b90009A27434F1693a44571a638k63930c1785k6519G4145K04435c43550a27791
$$ -290009 127434 61693 -144571 -1638 -265568 -31785 -58304 74145 278580 -343550 -127791
19126a14668J5208A08904i9568j1974R829C84536f9294j83710b9725m496R141
$$ -114668 -99460 108904 -99568 -111542 -101713 384536 -69294 -253004 -29725 -34221 -25080
19115b5080B3138b23547H824i7446A11902d6077j34508d7664F1150J67384a71266
$$ -25080 23138 -223547 8824 -97446 111902 -46077 -180585 -47664 61150 228534 -171266
19103b82534H1684C84R9873a01841B57809a61056j42878r3256A5628J11432g0110
$$ -282534 81684 384 100257 -101841 257809 -161056 -303934 -397190 15628 127060 -70110
19091A20857R6187c99693A05150b39721B93636G645a82292h3788j66347g1639
$$ 120857 217044 -399693 105150 -239721 293636 7645 -182292 -83788 -250135 -71639
19080b54902d0764j73346M3337B45370a74227l79305K29294D9833a33196A99523
$$ -254902 -40764 -214110 -170773 245370 -174227 -553532 -324238 49833 -133196 199523
19069h0672L5279C0521a48302m2499M1187f3504j11940k75662a72759A45284a72599
$$ -80672 -45393 30521 -148302 -190801 -149614 -63504 -175444 -451106 -172759 145284 -172599
19057f6556j35403i3463i38r160k08831e6563a3303j47940N0720D1989J03694
$$ -66556 -201959 -93463 -938 -10098 -218929 -56563 -13303 -161243 -110523 41989 145683
19046A45683c9788E5257f566C6065b67137B8601e9831A03205a6758j49242K5373
$$ 145683 -39788 55257 -6566 36065 -267137 28601 -59831 103205 -16758 -166000 -140627
19035a40627A51792Q2715I9857M4655A8227g4149A85203A6035Q3499i4059E4779
$$ -140627 151792 234507 99857 144512 18227 -74149 185203 16035 99534 -94059 54779
19023b22850C6343g6105A25379a34319A87942P8327b73619J25043K5992j29122
$$ -222850 36343 -76105 125379 -134319 187942 266269 -273619 -148576 -122584 -251706
19013b51706B09471a86975o7160N0887d0639j17289B69652I0885J42070a08352
$$ -251706 209471 -186975 -254135 -203248 -40639 -157928 269652 90885 232955 -108352
19002i9577l4626c0520A26144D4076b23147i9686B0393b91558C97917e0741D1227
$$ -99577 -134203 -30520 126144 44076 -223147 -99686 20393 -291558 397917 -50741 41227
18990G7548b91933E3666a67810c4634j6006l71530d3687j20503j00548c5789A7599
$$ 77548 -291933 53666 -167810 -34634 -50640 -422170 -43687 -164190 -264738 -35789 17599
18978A23752f990r0957q1205P2704o1193f5741l1783A71444D093a45034j16146
$$ 123752 -6990 -97947 -179152 -106448 -167641 -65741 -97524 171444 4093 -145034 -261180
18967b61180a06137E5692K13762b28468B47559F6291a46385A69471m6349K3940
$$ -261180 -106137 55692 269454 -228468 247559 66291 -146385 169471 123122 147062
18957A47062d59762a23693A43168B6914c4841m0714A14131b04463e0852j10933
$$ 147062 -459762 -123693 143168 26914 -34841 -75555 114131 -204463 -50852 -161785
18947a61785D0047a97356j41273B38022A301N6526a36153H5645a61627n9762f2446
$$ -161785 40047 -197356 -338629 238022 1301 57827 -136153 85645 -161627 -221389 -62446
18935A4672J47337D1982a62237H8314J66986j24281d93902A74364c55729C6966
$$ 14672 162009 41982 -162237 88314 255300 131019 -493902 174364 -355729 36966
18924f7377K1503j3215F8645a21499d5608k25684A65727c01375d5343B31930m2338
$$ -67377 -45874 -59089 68645 -121499 -45608 -271292 165727 -301375 -45343 231930 189592
18913A89592a36697A92416a46537O0471P663A90342F14a71689A26695B0528b8389
$$ 189592 -136697 192416 -146537 -86066 -78403 190342 614 -171689 126695 20528 -28389
18901e1307B4258e235k0904B5402e8573A49908f8281j4857A9010a00791p3381
$$ -51307 24258 -5235 -26139 25402 -58573 149908 -68281 -83138 19010 -100791 -174172
18890a74172P6738K9431j07353k59581B07490i54k09183l2316A25312h7757A66453
$$ -174172 -97434 -68003 -175356 -434937 207490 -954 -210137 -242453 125312 -87757 166453
18878D98903c0548j09181j58514A04838C7006d1542F9324a41382j01783O9849
$$ 498903 -30548 -139729 -298243 104838 37006 -41542 69324 -141382 -243165 -173316
18868a73316A97165b42042E1337i6104r5457k6611c2084A68514f4064p951l63254
$$ -173316 197165 -242042 51337 -96104 -191561 -218172 -32084 168514 -64064 -72015 -435269
18857d35269a37709L3652A59356b34803K9185H4364Q0189J34611j09249a05182
$$ -435269 -137709 -104057 159356 -234803 -205618 84364 164553 299164 189915 -105182
18846A021c05248B0378Q0229a32658e0915A8819h5297A20367l9621a35059d7280
$$ 1021 -305248 20378 100607 -132658 -50915 18819 -85297 120367 80746 -135059 -47280
18834a75627E9777a5834j23985N524E1859a33912j16611A07402a20287A63641
$$ -175627 59777 -15834 -139819 -134295 51859 -133912 -250523 107402 -120287 163641
18823d43914A10743H606a2110j5547j16297m7273f2456B41831M9582D3904d530
$$ -443914 110743 8606 -12110 -27657 -143954 -191227 -62456 241831 291413 43904 -4530
18811A24318E9218L4614a1529o4073F7508L0833d1957j39889E9104L6257a15693
$$ 124318 59218 93832 -11529 -75602 67508 98341 -41957 -181846 59104 95361 -115693
18799D6906A7007J87409A00953P8036l5922c08170c7155D1046c8975A22601C7635
$$ 46906 17007 204416 100953 178989 143067 -308170 -37155 41046 -38975 122601 37635
18787c00786a45533a5924k35258D5963a53253j3216D5796Q1705P8434E1678a80464
$$ -300786 -145533 -15924 -251182 45963 -153253 -166469 45796 127501 205935 51678 -180464
18775i0109n1386K9815A19818k907J9550c2404j18813j24228C06707j45417g8528
$$ -90109 -141495 -111680 119818 116911 136461 -32404 -151217 -275445 306707 161290 -78528
18763a88383A25680J53441i5724L2424a5633d085n6366B9361a69587g4499b2892
$$ -188383 125680 279121 -95724 -63300 -15633 -4085 -60451 29361 -169587 -74499 -22892
18751B01225c95377a05916j58308J04130j76502B57425i5958j25513f3525c0218
$$ 201225 -395377 -105916 -264224 -160094 -336596 257425 -95958 -221471 -63525 -30218
18740b63059A06462A1268a07580k51790K7075Q611O1884R4718j41204A31506j2038
$$ -263059 106462 11268 -107580 -359370 -332295 -323684 -261800 -167082 -308286 131506 119468
18729A19468a53437A06840A1798O3392a46795H1885c60928l6728H6343b62809
$$ 119468 -153437 106840 11798 75190 -146795 81885 -360928 -397656 86343 -262809
18718e8412F8058J02447n2016l085O3347e2134I940L165h1753c5264F3269a0392
$$ -58412 68058 170505 118489 115404 178751 -52134 9940 13105 -81753 -35264 63269 -10392
18705b53458j33537f280k85732M2921e852I1127b08611c1876B65137a59909B4619
$$ -253458 -386995 -6280 -292012 -249091 -5852 91127 -208611 -31876 265137 -159909 24619
18693d4495j93036R0584A62549m7622E0637c92062J48122A24908j9200a80860
$$ -44495 -237531 -146947 162549 114927 50637 -392062 -243940 124908 105708 -180860
18682a32502P586f133p5830F5397g898A0291a78340A61580n112e1653A19166D4528
$$ -132502 -124916 -6133 -81963 65397 -7898 10291 -178340 161580 156468 -51653 119166 44528
18669d0703j50080A7962K38888J90306a27251C39241a86414e9213p023l66002
$$ -40703 -190783 17962 256850 447156 -127251 339241 -186414 -59213 -66236 -432238
18659d32238E0213h2282C90902b3588k09978B69112C3928a94331A91585j5875
$$ -432238 50213 -82282 390902 -23588 -233566 269112 33928 -194331 191585 175710
18649A75710B3491b03146j27620a1649A9100K10484h6407p1490B5812f9708c4310
$$ 175710 23491 -203146 -330766 -11649 19100 229584 -86407 -157897 25812 -69708 -34310
18637g7587j88438A03742b92346A72186O962b4807p1014K5036j13860F2959c95723
$$ -77587 -266025 103742 -292346 172186 179148 -24807 -95821 -70785 -184645 62959 -395723
18625b15019n2817J12818M3806j58613h0147m9935j1989e6612k35297A55797R755
$$ -215019 -267836 -155018 -111212 -269825 -80147 -130082 -142071 -56612 -291909 155797 165552
18614A65552a83345k87241A67075c19754a33174j3948A28346c48845e7735D5408
$$ 165552 -183345 -470586 167075 -319754 -133174 -147122 128346 -348845 -57735 45408
18603F9842l337a64211F4121Q055B1983a03255H9973c6926E5422K4903a91295
$$ 69842 66505 -164211 64121 72176 21983 -103255 89973 -36926 55422 80325 -191295
18591d7443l10102P8124A0977a27022C5305L8385e5536A35266a20317A67376B9596
$$ -47443 -357545 -279421 10977 -127022 35305 73690 -55536 135266 -120317 167376 29596
18579b24092R1176D8306J25813J56622a13180H506K42164A1927a30813N5028A91501
$$ -224092 -132916 48306 174119 330741 -113180 8506 250670 11927 -130813 -75785 191501
18567a39502k53849a37093j525p616G5465I535M13455f5043l49588a50593l25809
$$ -139502 -393351 -137093 -138618 -146234 75465 9535 422990 -65043 -414631 -150593 -476402
18556d76402b35308p713q140A61035a65213O3910c6260a4520F9638L4335c41620
$$ -476402 -235308 -243021 -251161 161035 -165213 -101303 -36260 -14520 69638 103973 -341620
18544a70522B84668a91084f2007j66339e1742k59446F4460a2793j06040B85869
$$ -170522 284668 -191084 -62007 -228346 -51742 -311188 64460 -12793 -118833 285869
18533a47244O9367A0117K3097f9276a9306k32685C7638b69118j20343A62540c46912
$$ -147244 -77877 10117 33214 -69276 -19306 -251991 37638 -269118 -389461 162540 -346912
18521b02474C3646c49789J37706n5681F2620L5415b38565A27389L8044E9758k5744
$$ -202474 33646 -349789 -212083 -267764 62620 98035 -238565 127389 165433 59758 34014
18510C4014O8952b74117F3694a30723h496k1578o0964A43374O7610c7371p0935
$$ 34014 102966 -274117 63694 -130723 -8496 -30074 -91038 143374 210984 -37371 -108306
18499a08306k31256J60190B10003A04898b57548B6263a42308e2234k46179R7627
$$ -108306 -339562 -179372 210003 104898 -257548 26263 -142308 -52234 -298413 -200786
18489b00786K4543q1603A95608c7075A19256c26957O4447a9825A14011b17956
$$ -200786 -176243 -257846 195608 -37075 119256 -326957 -262510 -19825 114011 -217956
18478c78663f0001o0977A4629a67521Q2324k2562F7097b90569D5948f8953A79739
$$ -378663 -60001 -120978 14629 -167521 -85197 -107759 67097 -290569 45948 -68953 179739
18466c35871a9514D31582E8440R1928a72248B60115h6530j38301H5521a70864
$$ -335871 -19514 431582 58440 150368 -172248 260115 -86530 -224831 85521 -170864
18455b34686O8638A53619L5300f0005A42303a73755O2071p9361j60219O6411C30210
$$ -234686 -166048 153619 188919 -60005 142303 -173755 -111684 -191045 -351264 -284853 330210
18443B02505D7038b21852j20054d0999A22896a59029B56411a458k49879J19202
$$ 202505 47038 -221852 -341906 -40999 122896 -159029 256411 -1458 -251337 -132135
18433a32135j40574L9824A2765b67846O6501f0960B13464a28200G216c9474j25670
$$ -132135 -272709 -232885 12765 -267846 -201345 -60960 213464 -128200 7216 -39474 -165144
18422a65144I72c3556A17566A8594K26086G1626d3159j26511j2751P1467q1266
$$ -165144 972 -33556 117566 18594 244680 71626 -43159 -169670 -182421 -110954 -192220
18411a92220B90702f2587A05692D8309L1821g1352F6878h0589j12047D6797A6176
$$ -192220 290702 -62587 105692 48309 80130 -71352 66878 -80589 -192636 46797 16176
18399a68110C4481g4853l30141a67558q5590a11235B85219b14295E1432B3410
$$ -168110 34481 -74853 -404994 -167558 -253148 -111235 285219 -214295 51432 23410
18388b75689f3623J9894F3122j7727a10891n7442E1997M3669b01136J5340J8482
$$ -275689 -63623 -43729 63122 45395 -110891 -168333 51997 95666 -201136 -185796 -167314
18377a67314A09963B2203b93645e5458k4974j0655B67383E7004b67494a27260
$$ -167314 109963 22203 -293645 -55458 -80432 -91087 267383 57004 -267494 -127260
18366A96301E5472b76702D08312G9951c00140a40204A62269H0084B1101b20703
$$ 196301 55472 -276702 408312 79951 -300140 -140204 162269 80084 21101 -220703
18355B21100a60246A02273L1673a75566j81688A00171a71095B18960c08253g5784
$$ 221100 -160246 102273 133946 -175566 -357254 100171 -171095 218960 -308253 -75784
18344g2979k2741G1412k0354R8858c60418e6743j95477j4711B0193f066A63531
$$ -72979 -95720 71412 51058 149916 -360418 -56743 -252220 -266931 20193 -6066 163531
18332a74162p7252g321I2193g7387q7312l2608P5943H6523A3220c2714k0698C97968
$$ -174162 -251414 -7321 92193 -77387 -164699 -197307 -121364 86523 13220 -32714 -53412 397968
18319F981a19307I0500a22675A10327J40868l4472q7556F0374a29725N6085n6793
$$ 6981 -119307 90500 -122675 110327 251195 216723 129167 60374 -129725 -73640 -130433
18308a30433A19511P0346K216g7470a6295n9655A63442a41484A69014g481A67423
$$ -130433 119511 189857 192073 -77470 -16295 -75950 163442 -141484 169014 -7481 167423
18296e4089A3191J26685d87219e0241A80005d7526k67094e0784A41703J82931
$$ -54089 13191 139876 -487219 -50241 180005 -47526 -314620 -50784 141703 324634
18286C24634b73120h6533j66387A20822A6718c31339A68681b05388J01198c7937
$$ 324634 -273120 -86533 -252920 120822 16718 -331339 168681 -205388 -104190 -37937
18275B96784b90143E0352a41921D5190c6273G1140B2778b11021c7193C4852e7955
$$ 296784 -290143 50352 -141921 45190 -36273 71140 22778 -211021 -37193 34852 -57955
18263A51483J08456a085j8764G9810R9121c14532a44925B46442K4444c8624m0112
$$ 151483 259939 -1085 -19849 79810 178931 -314532 -144925 246442 270886 -38624 -78736
18252g8736A0296b20180G7099a59954k60943d4519k50710B55366J75534i3565
$$ -78736 10296 -220180 77099 -159954 -420897 -44519 -295229 255366 430900 -93565
18241e8421F5600B5189Q0167J90607R9084b07163B91408c7390j29042k8097d7457
$$ -58421 65600 25189 105356 295963 395047 -207163 291408 -37390 -166432 -194529 -47457
18229B57907k2200b16002N1416J6038E5762c26267Q4599J0245A60093g9831A1573
$$ 257907 235707 -216002 -164586 -148548 55762 -326267 -241668 -231423 160093 -79831 11573
18217a55328k39618A20564n2925Q8192B1783a8131j25798H768J72317a50282D97223
$$ -155328 -394946 120564 67639 155831 21783 -18131 -143929 8768 181085 -150282 497223
18205b88942J44344B9799e3558C3345d0931E2482J30179g4899D7678A3218a16866
$$ -288942 -144598 29799 -53558 33345 -40931 52482 182661 -74899 47678 13218 -116866
18193b7896l16375F4711g6606E2030q266a12437C11062c76741c2758H7760R384
$$ -27896 -344271 64711 -76606 52030 43764 -112437 311062 -376741 -32758 87760 97144
18182I7144J54386h16m2326A37166J24739G0016d931B7678e1158o9313j8147f6530
$$ 97144 251530 -816 -43142 137166 261905 70016 -4931 27678 -51158 -120471 -138618 -66530
18169g3026j11180A06775d1066G9345a59382d0208k28078A90047L9015E0133j0489
$$ -73026 -184206 106775 -41066 79345 -159382 -40208 -268286 190047 229062 50133 39644
18158C9644J1121b52689b0273B112a98077k21833a94525H7469c25759b9899j43467
$$ 39644 50765 -252689 -20273 2112 -198077 -419910 -194525 87469 -325759 -29899 -173366
18147a73366B7708b95468J34111k68074K12002e5055j00454o3601C4456a21193
$$ -173366 27708 -295468 -161357 -429431 -217429 -55055 -155509 -219110 34456 -121193
18136a54505j16463C97197a20185B38939i1771A50173d6467j11090m6923M2430
$$ -154505 -270968 397197 -120185 238939 -91771 150173 -46467 -157557 -204480 -162050
18126a62050M944A33535b42746a5054k03123h4220F7859J67312j2760h8232c6677
$$ -162050 -157106 133535 -242746 -15054 -218177 -84220 67859 235171 222411 -88232 -36677
18114f2870j32910h4325A4277a51999A96621g7902n2722a3898A18632b03215C7498
$$ -62870 -195780 -84325 14277 -151999 196621 -77902 -130624 -13898 118632 -203215 37498
18102a98199H4791d6568j32825A63598f2560C01121H2034a65053a5370j22040
$$ -198199 84791 -46568 -179393 163598 -62560 301121 82034 -165053 -15370 -137410
18092a37410L7987G2033c22869E7321c7291k32254j43466g1449B884a15727j21328
$$ -137410 -99423 72033 -322869 57321 -37291 -269545 -413011 -71449 2884 -115727 -237055
18081b37055A16560g3202j67446a10549C24436a8114B02626c26394a19835d5300
$$ -237055 116560 -73202 -240648 -110549 324436 -18114 202626 -326394 -119835 -45300
18070C43220b6877A16512a76426B25812a0562k1735C2234b34629b8440C02342
$$ 343220 -26877 116512 -176426 225812 -10562 -32297 32234 -234629 -28440 302342
18059a28930e6334j78251N4427A07860a85503H2755a39125m9297O6560A48472
$$ -128930 -56334 -234585 -180158 107860 -185503 82755 -139125 -188422 -121862 148472
18048D48981e2217B03764r5983d0136B81286n7481m7418a2087n8419A22692E8026
$$ 448981 -52217 203764 107781 -40136 281286 223805 176387 -12087 -70506 122692 58026
18036B1341c08066A16355a32988F870i7361m12446G935J03710b7617B75501c23310
$$ 21341 -308066 116355 -132988 6870 -97361 -509807 7935 111645 -27617 275501 -323310
18024E6338Q7871N804b12563n7271B5648a63934A2472l007L9458M116b5919A42777
$$ 56338 144209 150013 -212563 -269834 25648 -163934 12472 9465 48923 53039 -25919 142777
18011a02785D7609j3472a84474O1036d1540j27972I4832a28180m8866a3140j81172
$$ -102785 47609 34137 -184474 -123438 -41540 -169512 94832 -128180 -177046 -13140 -194312
18000a94312i5737K8876k4948C7378J04946a30220P488c3827a6228B1313a5358
$$ -194312 -95737 -66861 -91809 37378 142324 -130220 -122732 -33827 -16228 21313 -15358
17988b77297J02957E6774m423c58025I2825J6416a63146P6245A0583J36447M4783
$$ -277297 -174340 56774 52351 -358025 92825 109241 -163146 -86901 10583 147030 191813
17977A91813q2701b5252A39144n0747J64535A2335J32216f8666D23501I0815g9169
$$ 191813 109112 -25252 139144 88397 252932 12335 144551 -68666 423501 90815 -79169
17965g7550n6410j89A03841J75255a56023P4199A10614B8926a42858B50507r4282
$$ -77550 -133960 -134149 103841 279096 -156023 -81824 110614 28926 -142858 250507 156225
17954A56225b51245B37461a65877i406q0603H1831L2903C6322J00209J23810g167
$$ 156225 -251245 237461 -165877 -9406 -90009 81831 114734 36322 136531 260341 -7167
17942A63535B4468K78801j37079a28179A84331J40173d4966k38806d2551A2638
$$ 163535 24468 303269 166190 -128179 184331 324504 -44966 -283772 -42551 12638
17931A58384M9827G4449J9909J93781b72765C2839Q8843D6888e2014A36127b53542
$$ 158384 208211 74449 94358 288139 -272765 32839 121682 46888 -52014 136127 -253542
17919b01382E2134b84934j38633a67620a6187q5565n1602P162A05593J60032q9934
$$ -201382 52134 -284934 -423567 -167620 -16187 -101752 -153354 -146192 105593 265625 175691
17908A75691J74740b70755f3831A84153a18282j74106A86981Q1755N765C3860
$$ 175691 350431 -270755 -63831 184153 -118282 -292388 186981 268736 274501 33860
17897B2Q0950J61041a44788b844k46352g8508B87925a44680l5612A9920J91577
$$ 22 80972 242013 -144788 -2844 -249196 -78508 287925 -144680 -180292 19920 211497
17886B11497f7575j42906j90261j81820B63433A04936d5975k80749A73292H211
$$ 211497 -67575 -210481 -400742 -582562 263433 104936 -45975 -326724 173292 8211
17875a77495q4519F2610g5923r9960r0720A30876a2787A0649b79998A08469b83414
$$ -177495 -262014 62610 -75923 -175883 -266603 130876 -12787 10649 -279998 108469 -283414
17863A64710a41476n7805B0474R3297K44442g809j12186m1982j64115F570M0253
$$ 164710 -141476 -199281 20474 113771 358213 -7809 -119995 -161977 -326092 6570 46823
17852D6823L2747l8447K26526a80395e0786j43807c8534j95178A58882m4132e247
$$ 46823 79570 41123 267649 -180395 -50786 -194593 -38534 -233712 158882 114750 -5247
17840A52218c62903B13107J17072g1j4164F2934a3290B76195j12565c98680E6075
$$ 152218 -362903 213107 330179 -71 -14235 62934 -13290 276195 163630 -398680 56075
17828H3604b27484B2997P8231e3278N42A207i5846K5079D2169A822a15491C0902
$$ 83604 -227484 22997 101228 -53278 -52736 1207 -95846 -70767 42169 1822 -115491 30902
17815e7947k5332A17318j5876b63397e3668j24907A06643L7776a38779A64604
$$ -57947 -83279 117318 101442 -263397 -53668 -178575 106643 144419 -138779 164604
17804A23089D0109c93200H8597f9950m7109C83709e9738A77179i6897j75243L1275
$$ 123089 40109 -393200 88597 -69950 -117059 383709 -59738 177179 -96897 -272140 -240865
17793b40865A00524k0817k9295J17131f7750j58995B40080a09674H7590A1452
$$ -240865 100524 79707 50412 167543 -67750 -226745 240080 -109674 87590 11452
17782a02411I9341a19695B95069F2306K51123b20504g4438B1480R7528b8041D8649
$$ -102411 99341 -119695 295069 62306 313429 -220504 -74438 21480 119008 -28041 48649
17770B29203m7830q8621a97379A05459a81398A73588a900F8766a09862K6826B2195
$$ 229203 181373 92752 -197379 105459 -181398 173588 -1900 68766 -109862 -83036 22195
17758A5965J45057L441E8515N4238j5759G924i8966m8003B43997c66432P6257
$$ 15965 161022 164463 58515 112753 96994 7924 -98966 -146969 243997 -366432 -290175
17747b90175A59211P9094a41062E022a53523A87224F3634J16994a4014j12929
$$ -290175 159211 238305 -141062 5022 -153523 187224 63634 180628 -14014 -126943
17737a26943K9108k64828B3874a88522J4312O6173k81080B85020c14902D5395
$$ -126943 -97835 -362663 23874 -188522 -174210 -108037 -389117 285020 -314902 45395
17726b0805k33487j16032b7947a2453B46657A05189b85545a01212B73845I6112
$$ -20805 -254292 -370324 -27947 -12453 246657 105189 -285545 -101212 273845 96112
17715A1045Q0825J00467H1742c3626C239a17173B52830a6205j8014A15416K36410
$$ 11045 91870 192337 81742 -33626 3239 -117173 252830 -16205 -34219 115416 351826
17704C51826B6612i5326K9389A20207L08531a37848B09369h1034D6121J35988
$$ 351826 26612 -95326 -65937 120207 428738 -137848 209369 -81034 46121 182109
17694A82109a31099F9391g6065n2974L9709j46421C4279h1438l520o2367E6697
$$ 182109 -131099 69391 -76065 -129039 -89330 -235751 34279 -81438 -84958 -147325 56697
17682a4505F3895a09148A88331J6996d4976B8793K2293K6600h9332A03630a65707
$$ -14505 63895 -109148 188331 205327 -44976 28793 51086 77686 -89332 103630 -165707
17670a25715e0510q4014I5939j3700P8845F1003k7742c6244m3196D1844L5094
$$ -125715 -50510 -134524 95939 82239 161084 61003 33261 -36244 -79440 41844 76938
17659G6938Q5873m141J53603O6074a06064A11128h6419H3270A9680a59205G857
$$ 76938 162811 158670 312273 378347 -106064 111128 -86419 83270 19680 -159205 7857
17647a55198d7051j50166r5739I379N3397c84602I0935l5218L7167a31328n5982
$$ -155198 -47051 -197217 -292956 9379 62776 -384602 90935 55717 92884 -131328 -187310
17636a87310k4606Q7784E7408K05501b3415l56585J31874a3068k37435d2322k91806
$$ -187310 -211916 -124132 57408 262909 -23415 -380000 -248126 -13068 -250503 -42322 -334128
17625c34128E608b03413j17420a24291q7539A92155G2756a12525E466K66465I6785
$$ -334128 5608 -203413 -320833 -124291 -211830 192155 72756 -112525 5466 271931 96785
17613H967a42789A95755J93610G9734a06801J6370d3007E5132A3939K31673F7197
$$ 8967 -142789 195755 389365 79734 -106801 -90431 -43007 55132 13939 245612 67197
17601F0452J46436b40903B67504r1935a90390j15058J24896D3662a70282B07338
$$ 60452 206888 -240903 267504 175569 -190390 -305448 -180552 43662 -170282 207338
17590b371B18238O7178a7909B68509b38670d9147j47209j561B06210n4110O9402
$$ -2371 218238 285416 -17909 268509 -238670 -49147 -196356 -197917 206210 152100 221502
17579B21502J5144n7585o7206N5114b023B62863j21586K50658j83126J3704l5871
$$ 221502 236646 179061 111855 166969 -2023 262863 141277 391935 208809 222513 186642
17568A86642o3211m6364b2898A48566g3282r5571I9653O1551J51392j24059a19146
$$ 186642 123431 77067 -22898 148566 -73282 -168853 99653 161204 312596 188537 -119146
17556c11261f8162A76155p5064b29811H016d2065k22649h9694c6803k08881f8753
$$ -311261 -68162 176155 101091 -229811 8016 -42065 -264714 -89694 -36803 -245684 -68753
17544E9536L17082A78618J29482h6363L0984F7836R7767c1306J2186o3476B28588
$$ 59536 376618 178618 308100 -86363 -55379 67836 165603 -31306 -19120 -82596 228588
17532a7781m3073B01631b8982J730D5990J33448E715b84975B60790A16450R0956
$$ -17781 -60854 201631 -28982 -27252 45990 179438 5715 -284975 260790 116450 207406
17521B07406D0010K62510K9854l5950A6005N7254P5638a10937G301K6817e3222
$$ 207406 40010 302520 332374 296424 16005 73259 148897 -110937 7301 34118 -53222
17509e0377A98185m9196n6286O4760g633E0113b1064B47048d3781k6179A72789
$$ -50377 198185 148989 92703 157463 -7633 50113 -21064 247048 -43781 -69960 172789
17497B16036J30317D7030J39095J67158A61552a0529n3137A89600K3356M8584
$$ 216036 346353 47030 186125 353283 161552 -10529 -63666 189600 212956 261540
17487B61540q1769r939Q0726q1218M4420a72972h692A41854J97320A04713M537
$$ 261540 179771 169832 250558 169340 213760 -172972 -8692 141854 339174 104713 109250
17476A09250L4450J3594J24722m6405K27175a84715A39571J25605a36207J4842
$$ 109250 143700 157294 282016 235611 462786 -184715 139571 265176 -136207 -121365
17466a21365B13293J08438a08j62799m5714B2562d029C589K96802H5141N2641
$$ -121365 213293 321731 -108 -162907 -208621 22562 -4029 3589 300391 85141 137782
17455A37782e0894B40644A09632L30048g6733E10815A26533K82915J41670B00832
$$ 137782 -50894 240644 109632 439680 -76733 510815 126533 409448 551118 200832
17444B29077p1776G7906K41785J92498D4172J22653J38480L1695A08030g9080
$$ 229077 157301 77906 319691 512189 44172 166825 305305 337000 108030 -79080
17433A8467K74081k5105k7134b39369B61720i3112A72649L36739A52832K73031
$$ 18467 292548 267443 240309 -239369 261720 -93112 172649 509388 152832 425863
17423D25863p0340o5228N7976I5906P4256J45220j05726a04962C5757L47468m6460
$$ 425863 355523 290295 348271 95906 170162 315382 209656 -104962 35757 383225 336765
17412C36765K3326C6213K78648j22546H9659O925a72882A40860k7862a78507A02563
$$ 336765 360091 36213 314861 192315 89659 96584 -172882 140860 112998 -178507 102563
17400G5046a57172C1142L07046I63J71946a6474F7263K3373J46906m7226M6837
$$ 75046 -157172 31142 338188 963 172909 -16474 67263 90636 237542 190316 237153
17389B37153r7371l4514c62100D99571a93156F0712J04462K65564A96443a40468
$$ 237153 139782 105268 -362100 499571 -193156 60712 165174 430738 196443 -140468
17378E6449Q9330P8419d1716i86n79B78958q3818a74428D14046a16661D04391
$$ 56449 145779 224198 -41716 -986 -1565 278958 195140 -174428 414046 -116661 404391
17366C14305F6510j0860b057j63956F4589a47573B18330I5611C1939J03160J07913
$$ 314305 66510 55650 -2057 -166013 64589 -147573 218330 95611 31939 135099 243012
17355B43012J96779E0133L37795j42644d7634D0279L06060c929B13811m7976j1569
$$ 243012 439791 50133 387928 245284 -47634 40279 346339 -3929 213811 165835 154266
17344A54266K25400j31016J69212A23831J7219a55905A26364d6770C00047j22942
$$ 154266 379666 248650 417862 123831 141050 -155905 126364 -46770 300047 177105
17334A77105j6691R9843E327J99689L16185a7699o9882A34362K08488A65152b8825
$$ 177105 160414 260257 5327 205016 521201 -17699 -87581 134362 342850 165152 -28825
17322B94061J23689j31427q3724d0859D8249K13016J07662m5482c18340D36916
$$ 294061 417750 286323 202599 -40859 48249 261265 368927 323445 -318340 436916
17311D05399e3530C15180j24985Q7936J39636D4262L3733J5207J66617J06374
$$ 405399 -53530 315180 190195 278131 417767 44262 77995 93202 259819 366193
17301C66193G4180Q7144E93c7061C38186R2106j67273q0195D8630L06934A13828
$$ 366193 74180 161324 593 -37061 338186 430292 263019 182824 48630 355564 113828
17289b5895C69129G2088K26391R7339D7950J22007j8041K38938O3801a89192A21401
$$ -25895 369129 72088 298479 395818 47950 169957 151916 390854 454655 -189192 121401
17277C91776a31864G2712K7647K03473j36430q1604k7704J2635O0955J19205N838
$$ 391776 -131864 72712 100359 303832 167402 85798 58094 70729 131684 250889 256727
17266B56727p6515J5014E0624P9112J90899a8087j10400d2974E7432K58947j1927
$$ 256727 180212 195226 50624 129736 320635 -18087 -128487 -42974 57432 316379 304452
17255C04452J61000F8179J50824Q083r4269i3409b9741p8252A29743d217C99402
$$ 304452 465452 68179 219003 227086 132817 -93409 -29741 -107993 129743 -4217 399402
17243D43850g74F3519K36410a29494B19448K37743A81774n5615m0364b8128G5582
$$ 443850 -774 63519 299929 -129494 219448 457191 181774 126159 85795 -28128 75582
17231A68319C7420j1206L78486A05111K76168j66448O5385p4424J3684I7442j5749
$$ 168319 37420 26214 404700 105111 381279 214831 280216 205792 219476 97442 81693
17220H1693J54275p5800a14164B66199I4878L5293N3160K0320L04615A53664M106
$$ 81693 235968 160168 -114164 266199 94878 130171 183331 203651 508266 153664 157770
17209A57770A0253Q3622P9194k4350J81532m9322r9282a34237B0733N44259k26059
$$ 157770 10253 93875 173069 148719 330251 280929 181647 -134237 20733 564992 338933
17198C38933k3367L5535K04641B71898j6513l191A22851a71971B06843G9559N6137
$$ 338933 315566 351101 555742 271898 255385 252194 122851 -171971 206843 79559 135696
17187A35696L2589L34269h8113F1982N32192A18453J35127L1626A14598N73382
$$ 135696 168285 502554 -88113 61982 594174 118453 253580 285206 114598 687980
17177F87980k79808r5149J73220c0657n8035D33755A62854J7415G6056L17583
$$ 687980 408172 313023 486243 -30657 -88692 433755 162854 180269 76056 393639
17167C93639j08065J6460J72844j03130J97286B28861J85245q1213A17824N4409
$$ 393639 285574 302034 474878 371748 569034 228861 414106 332893 117824 172233
17157A72233a8561A49153K32638p5377A08590K8965h0074C33236p3489K67745
$$ 172233 -18561 149153 381791 306414 108590 137555 -80074 333236 259747 527492
17147E27492A91700L09111B06417J98707j76312J8287K7981j30848L29317o0380
$$ 527492 191700 500811 206417 405124 228812 247099 275080 144232 473549 413169
17137D13169k1072K47567j93758j3091k04313K13471j55045J66011O4131j41555
$$ 413169 392097 639664 445906 432815 228502 441973 286928 452939 517070 375515
17127C75515K1721A78727p5383N09953B84975F9348K94183D1494K74277M48739
$$ 375515 397236 178727 103344 613297 284975 69348 363531 41494 315771 764510
17117G64510j69822A30624L44858k22014L26292L3417A50636K07703j50287K05434
$$ 764510 594688 130624 475482 253468 579760 613177 150636 358339 208052 413486
17107D13486j97936K89827A86294K91545J21406j10929J84125C32961M36938C10083
$$ 413486 215550 505377 186294 477839 599245 488316 672441 332961 769899 310083
17096D81628a03588F21162L4326A98266K41125B18136L17392K77918j5869B37243
$$ 481628 -103588 621162 655488 198266 439391 218136 535528 813446 797577 237243
17085B12249K57190J88335k17656j82760J72538O5874j72322M55552o4496M5451
$$ 212249 469439 657774 440118 257358 429896 495770 323448 779000 714504 759955
17075G59955l46897J20323K52262j30184q6679P3498A65023N18235k38672L50913
$$ 759955 413058 533381 785643 655459 568780 642278 165023 683258 444586 795499
17065G95499B24479M99550k05783J55217k45990j55415L41908O3865A40411J0448
$$ 795499 224479 724029 518246 673463 427473 272058 613966 677831 140411 150859
17055A50859N33573j31944j89817M7282K65924n8178l0793P3037j20083n6277
$$ 150859 684432 552488 362671 409953 675877 617699 586906 659943 539860 483583
17045D83583K85180j77210m0589P9364k29564n0878N97507j95833k80714L34713
$$ 483583 768763 591553 550964 630328 400764 349886 947393 751560 470846 805559
17035H05559k76763m5064l7488j18728K82546j2245L0259j19650J71346O1489
$$ 805559 528796 483732 446244 327516 610062 597817 628076 508426 679772 741261
17025G41261q9937j57690L4100P7450p0180O9205K38979j25249K23104l44946
$$ 741261 651324 493634 527734 605184 535004 604209 843188 717939 941043 596097
17015E96097q525J29526K03730k61585K69613k88695J39111O3320j75556k65921
$$ 596097 587572 717098 920828 659243 928856 640161 779272 842592 667036 401115
17005D01115M45457k0902k99212J39941J65980q6731n0949J85487p7599J779k49626
$$ 401115 846572 825670 526458 666399 832379 745648 694699 880186 802587 804366 554740
16994E54740L85585l10166K61189K4639J80546k48941K70956k43665J09261j23109
$$ 554740 940325 630159 891348 915987 1096533 847592 1118548 874883 984144 861035
16984H61035N278j0525N5246o35M8238j76016L1547n5260J73328J2694J07034
$$ 861035 866313 855788 911034 910399 958637 782621 814168 758908 932236 944930 1051964
16973A051964M20968m94971q3430O556J88682N0067r5017L3391R4024m3020Q0685
$$ 1051964 1472932 977961 894531 901087 1089769 1139836 1044819 1078210 1172234 1129214 1209899
16962A209899m44864L09230Q8430j61094R7496K58135m08071L29435j90823P0484
$$ 1209899 765035 1074265 1162695 1001601 1099097 1357232 949161 1278596 1087773 1158257
16952A158257j90674L33987l28118K65692l7001K44469j86279J45449M6659j19648
$$ 1158257 967583 1301570 973452 1239144 1202143 1446612 1260333 1405782 1452441 1332793
16942A332793K37985l02784r7304L62029J07978l81093j38640K64818J28716o0166
$$ 1332793 1570778 1267994 1170690 1532719 1640697 1259604 1120964 1385782 1514498 1454332
16932A454332N3247j86455Q2567L709J31144o2616o1509L6342m4619L30153m47028
$$ 1454332 1507579 1321124 1403691 1407400 1538544 1475928 1414419 1450761 1406142 1736295 1289267
16921A289267J40718l3143K01988L24707j16553j28462R8768q9278k22325k76060
$$ 1289267 1429985 1396842 1598830 1923537 1806984 1678522 1777290 1688012 1465687 1189627
16911A189627L49329L51231K48575m71307J86581n8502k67675L94609Q4180m2325
$$ 1189627 1538956 1890187 2138762 1667455 1854036 1795534 1527859 1922468 2006648 1964323
16901A964323K5820J42536K43169k64119l17236N08235l08865K51658J39260k93461
$$ 1964323 1990143 2132679 2375848 2111729 1794493 2302728 1993863 2245521 2384781 2091320
16891B091320N26865j42415R3717q1786j1653J1114J60945j39657L63634m25118
$$ 2091320 2618185 2475770 2569487 2487701 2476048 2487162 2648107 2508450 2872084 2446966
16881B446966Q3241P3027Q549j83836O7438K17085K10146m98845M2491M63655
$$ 2446966 2530207 2603234 2611783 2427947 2495385 2712470 2922616 2423771 2466262 2929917
16871B929917j80312L53888k69389L89950j50563r4144k188K41972j7152j9803
$$ 2929917 2749605 3103493 2834104 3224054 3073491 2979347 2977159 3219131 3201979 3182176
16861C182176Q804M34406j96334j70252K93944K6359N2553K62719r0155k8839
$$ 3182176 3190980 3625386 3429052 3258800 3552744 3579103 3631656 3894375 3804220 3775381
16851C775381m03607J85447M44119Q573J52627p2895j28240K58901J68086m4282
$$ 3775381 3371774 3557221 4001340 4009913 4162540 4089645 3961405 4220306 4388392 4344110
16841D344110L445K02928m21455L51772P1029L63683k24719L41259K24687j16107
$$ 4344110 4347555 4550483 4129028 4480800 4551829 4915512 4690793 5032052 5256739 5140632
16831E140632j09226L4650K92039J51773q3097N61288j60711R4674n6753J64939
$$ 5140632 5031406 5066056 5358095 5509868 5426771 5988059 5827348 5922022 5865269 6030208
16821F030208K35470L90009j09744k2281L36759L1345J23960M97486q9631L6651
$$ 6030208 6265678 6655687 6545943 6523662 6860421 6891766 7015726 7513212 7423581 7460232
16811G460232k3895M65681M02900K46892p6485k04287M27318Q4744J40244K3044
$$ 7460232 7436337 7902018 8304918 8551810 8475325 8271038 8698356 8783100 8923344 8946388
16801H946388L91578J83078O47559k30269O73693p5063K04247P6932L88722M25903
$$ 8946388 9337966 9521044 10168603 9938334 10612027 10536964 10741211 10818143 11206865 11632768
16791A1632768L33943K92155K79250J55641M15818j4487R36431K11708K33921
$$ 11632768 11966711 12258866 12538116 12693757 13109575 13095088 14031519 14243227 14477148
16782A4477148N50532M14394K23911N68453K63989Q80919M84297L35046P65584
$$ 14477148 15027680 15442074 15665985 16234438 16498427 17379346 17863643 18198689 18964273
16773A8964273N24381N55356O05811P57892M19836Q94322P56291P54207Q54336
$$ 18964273 19488654 20044010 20649821 21407713 21827549 22721871 23478162 24232369 25086705
16764B5086705P78001O53440J261585J222597R02400J186457J195341J183920
$$ 25086705 25864706 26518146 27779731 29002328 29904728 31091185 32286526 33470446
16756C3470446J359639J281294J408692J454957J490955J504184K152080J539380
$$ 33470446 34830085 36111379 37520071 38975028 40465983 41970167 44122247 45661627
16748D5661627K461447J986521K108933K240060K373838K943380K312677L064116
$$ 45661627 48123074 50109595 52218528 54458588 56832426 59775806 62088483 65152599
16740F5152599K837630L397057K650570L684778L727712L466359L827227M228335
$$ 65152599 67990229 71387286 74037856 77722634 81450346 84916705 88743932 92972267
16732I2972267M158041L868289M509053M056061M543982M018182M184452L939937
$$ 92972267 97130308 100998597 105507650 109563711 114107693 118125875 122310327 126250264
16724A26250264L772532L279705L042052K744713K246842J640573R40588N58765
$$ 126250264 130022796 133302501 136344553 139089266 141336108 142976681 143917269 144476034
16716A44476034O8256r62633j186699j847595k543130k926837l031046l817058
$$ 144476034 144544290 143581657 142394958 140547363 138004233 135077396 132046350 128229292
16708A28229292l661226m682910m426102m350064m663188m305495m228862m256478
$$ 128229292 124568066 119885156 115459054 111108990 106445802 102140307 97911445 93654967
16700I3654967m167869m165580l884845l922737l659411l416140l119114l374382
$$ 93654967 89487098 85321518 81436673 77513936 73854525 70438385 67319271 63944889
16692F3944889k860011k712509k830368k650822k168160k326280k170172j748631
$$ 63944889 61084878 58372369 55542001 52891179 50723019 48396739 46226567 44477936
16684D4477936k118316j894341j477662j990929r24808j573975j702873j278042
$$ 44477936 42359620 40465279 38987617 36996688 36071880 34497905 32795032 31516990
16676C1516990j335892q99470j178526r56552j029490r26871r14877o07835j079932
$$ 31516990 30181098 29281628 28103102 27146550 26117060 25190189 24275312 23667477 22587545
16667B2587545l98849j017173m89033j057585l19569j279739k606l77138q47937
$$ 22587545 22188696 21171523 20682490 19624905 19305336 18025597 18022991 17645853 16797916
16658A6797916k84691p54143l66239m63191k01992q44719m5612n25753n19704
$$ 16797916 16513225 15759082 15392843 14929652 14727660 13882941 13837329 13311576 12791872
16649A2791872R558p40468k79228J19896k94402n08562j34220n05643l36976j46473
$$ 12791872 12801430 12060962 11781734 11901630 11607228 11098666 10964446 10458803 10121827 9975354
16639I975354j86978p4985o43410J2179k30326k46107K329j67594l38052l33353
$$ 9975354 9788376 9713391 9069981 9082160 8851834 8605727 8608056 8440462 8102410 7769057
16629G769057n9845K53090o05203k27624l27689o517L9859L0445k48729M3872
$$ 7769057 7709212 7962302 7357099 7129475 6801786 6795269 6835128 6865573 6616844 6660716
16619F660716o2912m38796j74212J09022l05891j22889J0628j70597o4438J16464
$$ 6660716 6597804 6159008 5984796 6093818 5787927 5665038 5675666 5505069 5440631 5557095
16609E557095j47173Q623n91896K1121M4893o9156j12156j23119j5290l07330
$$ 5557095 5409922 5418545 4826649 4847770 4892663 4823507 4711351 4588232 4572942 4265612
16599D265612J81033L09682o03410O14746n13945l2683l61998n0609K54351l36857
$$ 4265612 4446645 4756327 4152917 4767663 4253718 4221035 3859037 3808428 4062779 3725922
16589C725922N0809j91802p5587L39940m24612q3867K124L5807o7140J04980o9820
$$ 3725922 3776731 3584929 3509342 3849282 3424670 3340803 3342927 3378734 3311594 3416574 3346754
16578C346754k67123O3109J89213k55235j23495q1223K84487l66680j52379J68031
$$ 3346754 3079631 3142740 3331953 3076718 2953223 2872000 3156487 2789807 2637428 2805459
16568B805459j55196K46647k79276l33799N17037o9432l22711K33732j20370j03622
$$ 2805459 2650263 2896910 2617634 2283835 2800872 2731440 2408729 2642461 2522091 2418469
16558B418469j72986K13048Q7537m2709j37608L33437o02010j54958M58123l64426
$$ 2418469 2245483 2458531 2546068 2503359 2365751 2699188 2097178 1942220 2400343 2035917
16548B035917o0881j512l180M1555R2527J60292j24557k45184K15698o7586j72080
$$ 2035917 1975036 1973524 1970344 2011899 2104426 2264718 2140161 1894977 2110675 2043089 1871009
16537A871009r2459M5900N5601l1843K14781j58939l23355m5704M83078m39231
$$ 1871009 1778550 1824450 1880051 1848208 2062989 1904050 1580695 1534991 2018069 1578838
16527A578838J49565j949l20637J78002N4283M83k53951L92126k12515j09721
$$ 1578838 1728403 1726454 1405817 1583819 1638102 1638585 1384634 1776760 1564245 1454524
16517A454524J26582L20130l95266n5035o1786q2572M5183M121K24506j00789
$$ 1454524 1581106 1901236 1505970 1450935 1389149 1306577 1351760 1355881 1580387 1479598
16507A479598p1801k41837J79971n9413N6015l8632J03886j32991m4222J33902
$$ 1479598 1407797 1165960 1345931 1286518 1342533 1303901 1407787 1274796 1230574 1364476
16497A364476n82119M54454R873L3147J27109j97001R0620j76216O2950j47773
$$ 1364476 782357 1236811 1246684 1279831 1406940 1209939 1300559 1124343 1187293 1039520
16487A039520J40403k51431L55860K39469n66568J49940k7392J92177j12591R7297
$$ 1039520 1179923 928492 1284352 1523821 957253 1107193 1079801 1271978 1159387 1256684
16477A256684j5462j70868Q467j73450j37299L16631j22290K43289J52942n31534
$$ 1256684 1241222 1070354 1078821 905371 768072 1084703 962413 1205702 1358644 827110
16467H27110J50115L1676K65157P7074l18618j65779j98146Q8110J76772O7521
$$ 827110 977225 1008901 1274058 1351132 1032514 866735 668589 756699 933471 1000992
16457A000992p3847l3046J20838j74700k9965m0003J31973l34280K96368N1210
$$ 1000992 927145 894099 1014937 840237 810272 770269 902242 567962 864330 915540
16447I15540l3146K01712q1695j20517p3724k64148J96374q1917K0831L33179
$$ 915540 882394 1084106 1002411 881894 808170 544022 740396 658479 679310 1012489
16437A012489D92299M28415J08236l22360O4971j03433r6762J09630K50504l41958
$$ 1012489 492299 920714 1028950 706590 771561 668128 571366 680996 931500 589542
16427E89542K63729k13384O4374k7270J99243l33558R4528J03972K9780r338l5917
$$ 589542 853271 639887 704261 676991 876234 542676 637204 741176 770956 761618 725701
16416G25701j75254K58582j05625j30477K014j07757j87663J69223N11328k4462
$$ 725701 550447 809029 703404 572927 574941 467184 279521 448744 960072 935610
16406I35610C80832J42399j41367Q6588K17984K1565j39093j70887L4521K21683
$$ 935610 380832 523231 381864 468452 686436 708001 568908 398021 432542 654225
16396F54225M9471n1585l4433N545k55647J99675N15176n12282q614J03270j57854
$$ 654225 703696 652111 617678 623223 367576 567251 1082427 570145 561531 664801 506947
16385E06947K91681C10440L42955k44067O5793j89400K36333R5619l05772M09615
$$ 506947 798628 310440 653395 409328 475121 285721 522054 617673 311901 721516
16375G21516k37394o3209j51662J73677l351J5239B27360K34814p401j9522j41072
$$ 721516 484122 420913 269251 442928 439577 454816 227360 462174 454773 435251 294179
16364B94179A19151J27058K07941K31776C27267Q8024L50536B46908N9103j32172
$$ 294179 119151 246209 454150 685926 327267 415291 765827 246908 306011 173839
16354A73839R1853K44673l6373m9562J33027B59136J70318J48618k87301K59416
$$ 173839 265692 510365 473992 424430 557457 259136 429454 578072 290771 550187
16344E50187B15259K69008A53605J86839O6729k5485J28813j89137N5764l3770
$$ 550187 215259 484267 153605 340444 407173 381688 510501 321364 377128 343358
16334C43358A42243P5641R1190K86269j80254a19935C79587J86104G8115J75812
$$ 343358 142243 217884 309074 595343 415089 -119935 379587 565691 78115 253927
16324B53927A03714J04134K68207B26672L3740j14869K69860r3351m4791L65685
$$ 253927 103714 207848 476055 226672 260412 145543 415403 322052 277261 642946
16314F42946k31935q9323O1118H3452M97929B83057J13306b3125C23765L7829
$$ 642946 411011 321688 382806 83452 581381 283057 396363 -23125 323765 361594
16304C61594q7920n7436n3901K52282J89886B81371n5968k0805o0417L66755A79822
$$ 361594 273674 216238 162337 414619 604505 281371 225403 204598 144181 510936 179822
16292B94237J02130N1183j16473q2105K86372j92728I6848K20520J48906j77005
$$ 294237 396367 447550 331077 248972 535344 342616 96848 317368 466274 289269
16282B89269J27214j45314f0218C84025c3965D04969J28370A63395K81152H7770
$$ 289269 416483 271169 -60218 384025 -33965 404969 533339 163395 444547 87770
16271B05991P6448K90463A96807Q2210J26662a09109D31758j78861D1313L3313
$$ 205991 282439 572902 196807 279017 405679 -109109 431758 252897 41313 74626
16261G4626L64247r5744j30754D6326J13069K03983o0606J9893J58291H6731K41086
$$ 74626 438873 343129 212375 46326 159395 363378 302772 322665 480956 86731 327817
16250C27817n1723o2008P2478k8246J06442a96043A98254K41716r9640b39907
$$ 327817 276094 214086 286564 258318 364760 -196043 198254 439970 340330 -239907
16239F9878K3095K98814r2364j28326a18352A36704c684o2497A15255O1873P1369
$$ 69878 92973 391787 299423 171097 -118352 136704 -3684 -66181 115255 177128 248497
16228B48497K39464b45928B59980A9020a09863B98667F0753B4197J59163m8341
$$ 248497 487961 -245928 259980 19020 -109863 298667 60753 24197 183360 135019
16218A35019K22282n8070N8125j0502L5370c348q348A87709J99147j79335J70570
$$ 135019 357301 299231 357356 346854 382224 -3348 -11696 187709 386856 207521 378091
16207C78091N6051A20632Q5067a05982B59832d3790B33604l8747f3989C62395
$$ 378091 434142 120632 205699 -105982 259832 -43790 233604 194857 -63989 362395
16196F5455J99741j10443L07586e1421J8990m5709C62327A17560K5668L25391
$$ 65455 265196 154753 462339 -51421 -32431 -78140 362327 117560 143228 468619
16186D68619D3031i7307j73082A50009N3690o2342h0505B3247K71866j12549j9092
$$ 468619 43031 -97307 -270389 150009 203699 141357 -80505 23247 295113 182564 163472
16175A63472O4723A03367j7291j62L28507j02868I6490L2839b68790C37730q7817
$$ 163472 228195 103367 86076 85914 414421 311553 96490 129329 -268790 337730 249913
16164B49913j09602a43247B31820f4691D7891N5278K39002B6617M6751j0964b48609
$$ 249913 140311 -143247 231820 -64691 47891 103169 342171 26617 73368 62404 -248609
16152A96874Q0929A27767a19065n1231n1671k8245g3723C4594K578M1021K83289
$$ 196874 277803 127767 -119065 -170296 -221967 -250212 -73723 34594 37172 78193 361482
16141C61482F4204J4016J94608j3829B8933c2020D6673g9205A03457K49318a20488
$$ 361482 64204 78220 272828 258999 28933 -32020 46673 -79205 103457 352775 -120488
16129B9921c9953D23667n7528a83020G806d3173G5645a3439b099B39548e7565
$$ 29921 -39953 423667 366139 -183020 7806 -43173 75645 -13439 -2099 239548 -57565
16117B78562l8847e843B01875a34008A04991L59661A58032N0669K6795R5010a07386
$$ 278562 239715 -5843 201875 -134008 104991 464652 158032 208701 235496 330506 -107386
16105D6346M2762h819A3188J51644o6709L59049b96885f880A08678i9757H843
$$ 46346 89108 -8819 13188 164832 98123 457172 -296885 -6880 108678 -99757 8843
16093I9862B2069K7016a24832A73068b24054D4004P1284j1289J12847J52505j47582
$$ 99862 22069 49085 -124832 173068 -224054 44004 115288 103999 216846 369351 221769
16082B21769a89858f7384B01760b24959h2479A38241E5622J69867b626G6345K58909
$$ 221769 -189858 -67384 201760 -224959 -82479 138241 55622 225489 -2626 76345 335254
16071C35254a64018I6368c1295D3009P4746J77130h3145B80071k8360O7476j51358
$$ 335254 -164018 96368 -31295 43009 117755 294885 -83145 280071 251711 319187 167829
16060A67829e0343D678a52258n9863c1285a5061F7940M8100m7543a98703F5233
$$ 167829 -50343 4678 -152258 -212121 -31285 -15061 67940 116040 68497 -198703 65233
16048B10145F8707C0149b58855i3533j12314A46470a19868B15130c1936q3145
$$ 210145 68707 30149 -258855 -93533 -205847 146470 -119868 215130 -31936 -115081
16038a15081C31017b58274O9510i0003F3230c8940a2758m4596A02440a77718j69471
$$ -115081 331017 -258274 -188764 -90003 63230 -38940 -12758 -57354 102440 -177718 -347189
16027c47189A60540A8981a24451A8926O3540e8388m059n3001e231j92489c8289
$$ -347189 160540 18981 -124451 18926 82466 -58388 -62447 -115448 -5231 -197720 -38289
16015b0444A13567m358E2257a39853A2301R4587a29216C5910L7939J91049A30749
$$ -20444 113567 109209 52257 -139853 12301 106888 -129216 35910 73849 264898 130749
16003A82207g5131A02414c0443A83782N818m6843f1302B54002G4870b21114A26585
$$ 182207 -75131 102414 -30443 183782 189600 142757 -61302 254002 74870 -221114 126585
15991a34419C27728d14839a00021B23171H8512j1117M8428c5898q2403E4522L08276
$$ -134419 327728 -414839 -100021 223171 88512 77395 125823 -35898 -118301 54522 362798
15980C62798A45637e925H5875a06095A30582E4815b66259f8271I7759a94816m8934
$$ 362798 145637 -5925 85875 -106095 130582 54815 -266259 -68271 97759 -194816 -243750
15969b43750C5415J09530R789j701L3683e7523A22598D3333e3220G7796K02257
$$ -243750 35415 144945 154734 153033 186716 -57523 122598 43333 -53220 77796 280053
15958B80053f9054b3665k07917A54273a24464A97790a0344F6218J75309a04576
$$ 280053 -69054 -23665 -231582 154273 -124464 197790 -10344 66218 241527 -104576
15947A89032B795a15782K9474E1483a39652l18344i8430H8406j0152J49168b9914
$$ 189032 2795 -115782 -86308 51483 -139652 -457996 -98430 88406 78254 227422 -29914
15935F3833a65745A39072D9750i1568f995l47447a354j82071j23728d584j06377
$$ 63833 -165745 139072 49750 -91568 -6995 -354442 -1354 -183425 -307153 -4584 -110961
15924a10961b8572j72345D8867J79997f4533l5971E4597d3635I0603C1139f9942
$$ -110961 -28572 -200917 48867 228864 -64533 -100504 54597 -43635 90603 31139 -69942
15912B73879g1273M416A12965f2043A00351h9753C17405D0951M9513j8720Q2580
$$ 273879 -71273 -66857 112965 -62043 100351 -89753 317405 40951 90464 71744 154324
15901A54324d4223D0358b0730A07343i3773P069b0060l45366A67216G5730i8164
$$ 154324 -44223 40358 -20730 107343 -93773 -86704 -20060 -365426 167216 75730 -98164
15889c3216F7069K95682n3625j02485D070R8549b92473a16972B19430F2757K1943
$$ -33216 67069 362751 309126 206641 4070 102619 -292473 -116972 219430 62757 84700
15878H4700B6262o036g4788q9857J5744l77073A95765O9736E8621a59854Q368
$$ 84700 26262 20226 -74788 -164645 -148901 -525974 195765 265501 58621 -159854 -151486
15867a51486A87809g9856Q417D2544L4808c80391K7628B71706j08548C7873c6589
$$ -151486 187809 -79856 -71439 42544 77352 -380391 -352763 271706 163158 37873 -36589
15855a57623j9389E5284e9176A34807M97h7610C24921f0894Q475l39113C2554
$$ -157623 -177012 55284 -59176 134807 135304 -87610 324921 -60894 -52419 -391532 32554
15843C1744J89204c56406a31310K5593B11926a3920C21479A33502f2390B7970
$$ 31744 220948 -356406 -131310 -105717 211926 -13920 321479 133502 -62390 27970
15832a6397A09155J5751n2979g4876m422m2323L939j75118b1939F634J21408a1783
$$ -16397 109155 124906 71927 -74876 -79298 -121621 -117682 -292800 -21939 6634 128042 -11783
15819a18657J7270A58566O3114c5779j06056A75684C3334O262a41067k7649B07306
$$ -118657 -101387 158566 221680 -35779 -141835 175684 33334 39596 -141067 -168716 207306
15807a55038B06762E4121J03043a11078K8060n9286b4628j79980E4152K03922
$$ -155038 206762 54121 157164 -111078 -83018 -142304 -24628 -204608 54152 258074
15797B58074E9090J8568k2853b52713q7564J66040n3148A82880M8992q8148J50746
$$ 258074 59090 77658 54805 -252713 -340277 -174237 -227385 182880 231872 143724 294470
15786B94470c2667A4333a12216q4659K6722A3057L36846b83567a22849E4483a78728
$$ 294470 -32667 14333 -112216 -196875 -170153 13057 349903 -283567 -122849 54483 -178728
15774A42971J0887C6534L8311a13490e1552A20310R9886a99583R9321o4622C25528
$$ 142971 153858 36534 74845 -113490 -51552 120310 220196 -199583 -100262 -164884 325528
15762A79601c9828k6875m2490b7738H6333a30047A65512J11390H1053N608c47189
$$ 179601 -39828 -66703 -109193 -27738 86333 -130047 165512 276902 81053 86661 -347189
15750b33887b3067A15556a37209A60297R9070p2770g2223B27918e8559A73576
$$ -233887 -23067 115556 -137209 160297 259367 186597 -72223 227918 -58559 173576
15739A14885a66228e8419B63891b14489n4890P3936j583I1368a84302J8076B2436
$$ 114885 -166228 -58419 263891 -214489 -269379 -195443 -197026 91368 -184302 -166226 22436
15727a9465H4529b05712E1526A4611a64066j4033M0146H8821B6685f1263G1267
$$ -19465 84529 -205712 51526 14611 -164066 -178099 -137953 88821 26685 -61263 71267
15715D8596j1265R5694i0078F8990e3308J6229l96573a3938C5772b92594c4419
$$ 48596 37331 133025 -90078 68990 -53308 -37079 -433652 -13938 35772 -292594 -34419
15703g5052K3971m6422M4406J7867A56736E8637a58297l6430A29955a7947B35414
$$ -75052 -51081 -97503 -53097 -35230 156736 58637 -158297 -194727 129955 -17947 235414
15691B57247A21732N7131J18576a14404J7000k2041o8501N8809N5864K6385I506
$$ 257247 121732 178863 297439 -114404 -97404 -119445 -187946 -129137 -73273 -46888 9506
15679B70343a72915F5944h6766k49981J65255C1094a03481H6139a43977o1472
$$ 270343 -172915 65944 -86766 -336747 -171492 31094 -103481 86139 -143977 -205449
15669b05449h9996k85949a08563C58036C6733b79403B6143L12724b00767l8499
$$ -205449 -89996 -375945 -108563 358036 36733 -279403 26143 338867 -200767 -239266
15659b39266H746e4020r1457k01687A75066a42963L8956J7931B53920n7048d7238
$$ -239266 8746 -54020 -145477 -347164 175066 -142963 -104007 -86076 253920 196872 -47238
15647e3416j09300j60805B3946O010a28525E0963h3770E997J15096e4429j59987
$$ -53416 -162716 -323521 23946 29956 -128525 50963 -83770 5997 121093 -54429 -214416
15636b14416j62243A27857R906H653P1093i2301A13024a78626B95182b315k610
$$ -214416 -376659 127857 137763 8653 79746 -92301 113024 -178626 295182 -2315 -4925
15625d925k74812Q1533a8204E9454a18097H209e7941J1758A02184K34144e209
$$ -4925 -279737 -198204 -18204 59454 -118097 8209 -57941 -46183 102184 336328 -5209
15613i2449L244J0615a7636A96096D4657a35644j67817d312H9109O923c3918k2518
$$ -92449 -89205 -78590 -17636 196096 44657 -135644 -303461 -4312 89109 96032 -33918 -56436
15601e6436C54460O5382A30645e6801M039B23263A09709k0443j9258b78058D7320
$$ -56436 354460 419842 130645 -56801 -52762 223263 109709 89266 70008 -278058 47320
15589A99352h1751I8441K68190E7886N1625O9468G3114a7652E68317b34582A11794
$$ 199352 -81751 98441 366631 57886 109511 178979 73114 -17652 568317 -234582 111794
15577a6457j43950F1822K83467h1500l37918a29918A5010K47350F5277N415M7543
$$ -16457 -160407 61822 345289 -81500 -419418 -129918 15010 262360 65277 70692 118235
15566A18235j242l9244i4158k46061g2549n1126k38071A98488q1108b2320B8733
$$ 118235 116993 77749 -94158 -340219 -72549 -123675 -361746 198488 117380 -22320 28733
15554b39854A93766a8022r8422N8033E5503b57052A38325K63979I3918K35190
$$ -239854 193766 -18022 -116444 -58411 55503 -257052 138325 402304 93918 329108
15544C29108j58785c92625H6273c1778F7900a39417C326a14848G7749J77018c13905
$$ 329108 170323 -392625 86273 -31778 67900 -139417 3326 -114848 77749 254767 -313905
15532h7945k29950J24755O8545o0974f993k37479D17610A63787c89437h4805j50793
$$ -87945 -317895 -193140 -124595 -185569 -6993 -244472 417610 163787 -389437 -84805 -235598
15521b35598j09161h0774A08639a88331b8715B89037b48734c2865C57271B4143
$$ -235598 -344759 -80774 108639 -188331 -28715 289037 -248734 -32865 357271 24143
15510b101E762K18708C087h5982B2088a18148I7018K7892a0368j63917h2543r8390
$$ -2101 5762 224470 3087 -85982 22088 -118148 97018 124910 -10368 -174285 -82543 -180933
15498a80933h7541M0982A50244a60726n1543f2876A42993o9556a88906q926A04273
$$ -180933 -87541 -46559 150244 -160726 -212269 -62876 142993 73437 -188906 -197832 104273
15486e1407F0864N5770i5770j28191a11869j24936I0154D3469b61693a1638B86495
$$ -51407 60864 116634 -95770 -223961 -111869 -236805 90154 43469 -261693 -11638 286495
15474a7562A43475b64299A19820a58014B46707F945N3005h4884A73283E8624h4694
$$ -17562 143475 -264299 119820 -158014 246707 6945 59950 -84884 173283 58624 -84694
15462A70259g8979C6177R7865n7280R5894Q7227c3166m9553K5951A38882K32849
$$ 170259 -78979 36177 134042 76762 172656 259883 -33166 -82719 -56768 138882 371731
15451C71731A6737b9571D76603c32720l350I3120e5015D2851K77235j00683q0585
$$ 371731 16737 -29571 476603 -332720 -336070 93120 -55015 42851 320086 219403 138818
15440A38818k1521f832j20459c9145k45671A39722n605R4745l9835p8751d5330
$$ 138818 117297 -6832 -127291 -39145 -284816 139722 134117 228862 189027 110276 -45330
15428G608e9693C65257a17537M9181I2329a55177A52179B7151R2440a42378r155
$$ 7608 -59693 365257 -117537 -68356 92329 -155177 152179 27151 119591 -142378 -151533
15417a51533H4589J40495e07691I2967L6523J27117H4713G257N1951c83765I3598
$$ -151533 84589 225084 -507691 92967 129490 256607 84713 7257 59208 -383765 93598
15405g5074r2069A36774J44145B232J52564J9972a47408d845B19315C4240c0019
$$ -75074 -167143 136774 280919 2232 154796 174768 -147408 -4845 219315 34240 -30019
15393a85856p0500J20694G6059C0484M8912c30844D8980c9177m3223q0310f2256
$$ -185856 -256356 -135662 76059 30484 79396 -330844 48980 -39177 -82400 -162710 -62256
15381A63242F1023a63620C9195J24479e3762l00470F9134c2510C4985a85866A31511
$$ 163242 61023 -163620 39195 163674 -53762 -354232 69134 -32510 34985 -185866 131511
15369a35401k9913B14114l4890C1761b91427K2943A29885J75632j2293d4997A21680
$$ -135401 -165314 214114 179224 31761 -291427 -268484 129885 305517 293224 -44997 121680
15357C57571j30942b92557j3753g3250A71302a15321j77509A99481m1211a76856
$$ 357571 226629 -292557 -306310 -73250 171302 -115321 -292830 199481 158270 -176856
15346b19908A00422i7964I675c3934n8118H0664P0174c5686A88597b73762C6564
$$ -219908 100422 -97964 9675 -33934 -92052 80664 150838 -35686 188597 -273762 36564
15334E5230J08412M1143R617L5261p3715J90010A5094K98975o7435j02395D4916
$$ 55230 163642 204785 214402 249663 175948 365958 15094 314069 246634 144239 44916
15322E5948a61009A69485f6163A22329b19819I5703k4145B3955b84412a12461
$$ 55948 -161009 169485 -66163 122329 -219819 95703 71558 23955 -284412 -112461
15311A06975M5439a24170F5581l0729A3508M8843J99577A11800d5890A54461o7660
$$ 106975 152414 -124170 65581 34852 13508 62351 261928 111800 -45890 154461 86801
15300H6801K488K62758q5262D3103P0818h3009B08278c9490k65723L3557H9129
$$ 86801 89289 352047 266785 43103 113921 -83009 208278 -39490 -305213 -271656 89129
15288A44640g9388A69688g3306j51061A46053b0442j17499o2022H5326Q0157A790
$$ 144640 -79388 169688 -73306 -224367 146053 -20442 -137941 -199963 85326 165483 1790
15276A08210K22316n9889a45730L2756L174A76607D6645J32320d8248j61701a6547
$$ 108210 330526 270637 -145730 -112974 -109800 176607 46645 178965 -48248 -209949 -16547
15264a39234A06879j6138a55498f7759B62381J64048k06505C4716L37058I5764
$$ -139234 106879 90741 -155498 -67759 262381 426429 219924 34716 371774 95764
15253B34850m1644a03296A6659P64062L05347R10416o81612K02779m41313n11639
$$ 234850 193206 -103296 16659 780721 1086068 1996484 1314872 1517651 1076338 564699
15243E64699j43610a70892G4276M2125O3289J20381r8244J86033b00099A82670
$$ 564699 421089 -170892 74276 116401 179690 300071 201827 387860 -200099 182670
15232E0644h9098k72365F8855J00746b8567G3045f6591C8467P0673a11177A85628
$$ 50644 -89098 -361463 68855 169601 -28567 73045 -66591 38467 109140 -111177 185628
15220a44548B8865l571J72407D420b0047j63217g9476O861C08862R568a59025
$$ -144548 28865 25294 197701 4420 -20047 -183264 -79476 -72615 308862 318430 -159025
15208B15484f4451j42749C84209A57306P2341J40410b43275B61579H1444K47833
$$ 215484 -64451 -207200 384209 157306 229647 370057 -243275 261579 81444 329277
15198C29277F4304B3116L513a39979f9361A11205a9223A0031M06531b13354j8396
$$ 329277 64304 23116 26629 -139979 -69361 111205 -19223 10031 416562 -213354 -231750
15187b31750C17080G243a04548r3628K2654A42280K14904A22767b4665A90010
$$ -231750 317080 7243 -104548 -198176 -175522 142280 357184 122767 -24665 190010
15176C2998k26f7925F9013f3281k02264B01496d4170m0819A50990m2225A1939
$$ 32998 32772 -67925 69013 -63281 -265545 201496 -44170 -84989 150990 108765 11939
15164a21277A51418n854e5749B55153g0587A38358a18429D2472b7372j44273I1061
$$ -121277 151418 145564 -55749 255153 -70587 138358 -118429 42472 -27372 -171645 91061
15152B63875c4919H5004A0777J20965a65606B80064J20988A98365a62012C01512
$$ 263875 -34919 85004 10777 131742 -165606 280064 401052 198365 -162012 301512
15141C14888h1724m15716G6753b7683F3647d564k55852B60084n5952n5726B869
$$ 314888 -81724 -497440 76753 -27683 63647 -4564 -260416 260084 204132 148406 2869
15129A35780R5973a07144B9945M78619B09166q6824E0479M40404A54439M4035
$$ 135780 231753 -107144 29945 508564 209166 122342 50479 490883 154439 198474
15119A98474j557E1441K16568j17445L6999H758b4565C40276o1417I8286Q4556
$$ 198474 196917 51441 268009 150564 187563 8758 -24565 340276 278859 98286 182842
15108A82842J10163A17617i620A26287e48426i3060B22067O5242b27927A79883
$$ 182842 293005 117617 -9620 126287 -548426 -93060 222067 287309 -227927 179883
15097d5895B65460M1873j48676Q5375m992K06461B03255M3383c6139A5724J97431
$$ -45895 265460 307333 158657 244032 239040 445501 203255 246638 -36139 15724 213155
15086B13155E0422J71372F8955J47298q3766j4154a67568A42100E6806Q4666D5912
$$ 213155 50422 221794 68955 216253 132487 118333 -167568 142100 56806 141472 45912
15074a6645k62725B55174A17360D4782K97809J15439a3461F31781E4423b18674
$$ -16645 -279370 255174 117360 44782 342591 458030 -13461 631781 54423 -218674
15063A45573K63610j23960n4343J02370E4908J97430J89n4100L1679q9377K88764
$$ 145573 409183 285223 230880 333250 54908 252338 252527 198427 230106 140729 429493
15052D29493A94296K13178E6811M13082A19228J00393a36446I9075e0481a1057
$$ 429493 194296 407474 56811 469893 119228 219621 -136446 99075 -50481 -11057
15041F8959K75415k4517A21301J64994L2526n250A00804b58126B70568I4956K64863
$$ 68959 344374 319857 121301 286295 318821 313571 100804 -258126 270568 94956 359819
15030C59819A19118b23121C41440a11221B42840q2727o3536K51023r8395m1142
$$ 359819 119118 -223121 341440 -111221 242840 160113 96577 347600 249205 208063
15020B08063E9591B3336M32828e4923A21954J35853q8922N524k0568f2634C05459
$$ 208063 59591 23336 456164 -54923 121954 257807 168885 174409 153841 -62634 305459
15008C4628K56054N2320j52842P4363K20685k38759e3418A07005l5919p143K34233
$$ 34628 290682 343002 190160 264523 485208 246449 -53418 107005 71086 63943 298176
14997B98176B3150a52493B33585m2189b615B39253A10319P3536m0981b72063B81686
$$ 298176 23150 -152493 233585 191396 -2615 239253 110319 183855 142874 -272063 281686
14985B64963E4733J21824G8467J8439B1220J60603a96975c8668A3924N14301b09939
$$ 264963 54733 176557 78467 96906 21220 181823 -196975 -38668 13924 528225 -209939
14973A71824K26036j28646J35211I7914c8221B59323M8530j03381K60197k25606
$$ 171824 397860 269214 404425 97914 -38221 259323 307853 204472 464669 239063
14963B39063h159A75093m0649J55407J58949L518D4584J41596O2508A05416m8748
$$ 239063 -8159 175093 134444 289851 448800 452318 44584 186180 248688 105416 56668
14952E6668J84789d8870B49371A10933L26042j97321L0154A26884J58520I0455
$$ 56668 241457 -48870 249371 110933 436975 239654 269808 126884 285404 90455
14941A38398J13874A15210j9771l0081J80915A12715j6876K60537E4018R8566
$$ 138398 252272 115210 95439 65358 246273 112715 95839 356376 54018 152584
14931A52584J87179A08637J4987J64454L0913j44854N20655B39135E4656K65649
$$ 152584 339763 108637 123624 288078 318991 174137 694792 239135 54656 320305
14921C20305q0814A02135J49985K80399A62867f4803C91728C7818K5717L84770
$$ 320305 239491 102135 252120 532519 162867 -64803 391728 37818 63535 448305
14911D48305B00764r0014K89554B9759J41660J83555o2425A41087J13714J36701
$$ 448305 200764 110750 400304 29759 171419 354974 292549 141087 254801 391502
14901C91502j05025p3943K30687j33558N7220F6530k5918L36355j3474J35229
$$ 391502 286477 212534 443221 309663 366883 66530 40612 376967 363493 498722
14891D98722B19601J53543M9499q8968k3493M9j8420O8189m2216J12417j63327
$$ 498722 219601 373144 422643 333675 310182 310231 291811 360000 317784 430201 266874
14880B66874J62011q3410o3474n5407Q1351r2521P4027j35846K64996J45715L2181
$$ 266874 428885 345475 282001 226594 307945 215424 289451 153605 418601 564316 596497
14869E96497k58731j0458j47041K39954A09861E4147K56668J43973j1268j95661
$$ 596497 337766 327308 180267 420221 109861 54147 310815 454788 443520 247859
14859B47859P2913b3614B28308K29717j74813K29473j0604p2707M1214R846q9641
$$ 247859 320772 -23614 228308 458025 283212 512685 502081 429374 470588 480434 390793
14848C90793Q9631j7181M9257A75836K49908n2652J62975A13954M11248B55429
$$ 390793 480424 463243 512500 175836 425744 373092 536067 113954 525202 255429
14837E05559J99662k55750D5411N89667B22983J94085J701N8623J34002j76509
$$ 505559 705221 449471 45411 635078 222983 417068 418769 477392 611394 434885
14827D34885J7378p7488o2602L75177A95302K36735k1960n5933A60184J16470
$$ 434885 452263 374775 312173 687350 195302 432037 410077 354144 160184 276654
14817B76654L99705j11516j41164P1196M4488J14293k54835R5247J18509K7730
$$ 276654 676359 564843 423679 494875 539363 653656 398821 494068 612577 640307
14807F40307B73355A32633J81212R0610A15219L51575r8203Q2664j69365K96819
$$ 640307 273355 132633 313845 404455 115219 466794 368591 451255 281890 578709
14797E78709J42504k47934j05186J10815P5613R53K33702J40696D07263J39758
$$ 578709 721213 473279 368093 478908 554521 555474 789176 929872 407263 547021
14787E47021j87537L463L71380P855o8266q7962q9564M0145B05655J47550M262
$$ 547021 359484 362947 734327 742182 673916 585954 496390 536535 205655 353205 357467
14776C57467J77375k3621k27239K67707k46736M46503C51194J36504j53828L56311
$$ 357467 534842 511221 283982 551689 304953 751456 351194 487698 333870 690181
14766F90181J80711k96596K2242k08103J63265j80573L28115M1308k30998R2383
$$ 690181 870892 574296 596538 388435 551700 371127 699242 740550 509552 601935
14756F01935j49842n272J68029q7995K1720m4319J80510K28100k23497B02663
$$ 601935 452093 446821 614850 526855 548575 504256 684766 912866 689369 202663
14745F27185j33150L54920j13321A23788L20009K17183L16360k46497k35869K47718
$$ 627185 494035 848955 735634 123788 443797 660980 977340 730843 494974 742692
14735G42692n9409m2151J54390j87152J40091k28757L54592l94300Q0303L06852
$$ 742692 683283 641132 795522 608370 748461 519704 874296 479996 560299 867151
14725H67151j15532K25042k43309L30247l97335K14373j99877K6139J33591j34029
$$ 867151 751619 976661 733352 1063599 666264 880637 680760 706899 840490 706461
14715G06461L13267m13053o1088K45312k3766J06473M3054j6718l16760J40448
$$ 706461 1019728 606675 545587 790899 767133 873606 916660 899942 583182 723630
14705G23630k98656O03167j65003J78130j44905l123j59383L56576m00604K05297
$$ 723630 424974 1028141 863138 1041268 896363 893240 733857 1090433 689829 895126
14695H95126l531k31168J27769J26570p780L9564J26717j07200j88050J1224j41899
$$ 895126 891595 660427 788196 914766 906986 946550 1073267 966067 778017 789241 647342
14684F47342r803M28072l28925P0557J71031R1946k8888Q2049j89145L19347m95173
$$ 647342 637539 1065611 736686 807243 978274 1070220 1041332 1123381 934236 1253583 758410
14673G58410N13501n4896j10052l11759K02566N1213m10658K28722M4925K82341
$$ 758410 1271911 1217015 1106963 795204 997770 1048983 638325 867047 911972 1194313
14663A194313k28576j42646L7595M38893l85359M1262N267J28552J30127l60849
$$ 1194313 965737 823091 860686 1299579 914220 955482 960749 1089301 1219428 858579
14653H58579O5390J99347J00529k52157J45188J08430m52182L10604K4676j82841
$$ 858579 923969 1123316 1223845 971688 1116876 1225306 773124 1083728 1108404 925563
14643I25563K87787M0589J37848j84021k48500K81548M81543l03580J24924n36509
$$ 925563 1213350 1253939 1391787 1207766 959266 1240814 1722357 1418777 1543701 1007192
14633A007192K1451J93760J86879l48299J40513K13378j18569J60874j01104k8477
$$ 1007192 1028643 1222403 1409282 1060983 1201496 1414874 1296305 1457179 1356075 1327598
14623A327598j10020L49588l48890L77794k50360N2328J27372l22483L05438P6790
$$ 1327598 1217578 1567166 1218276 1596070 1345710 1398038 1525410 1202927 1508365 1585155
14613A585155k85123j6838K83093j35792J4960k04389K46829K47712j05025j08702
$$ 1585155 1300032 1283194 1566287 1430495 1445455 1241066 1487895 1735607 1630582 1521880
14603A521880j94245L40032l02731K57527j34055K02645j58023L40364m04132
$$ 1521880 1327635 1667667 1364936 1622463 1488408 1691053 1533030 1873394 1469262
14594A469262J40331J95442j37835k77556M41652j07906Q4994K52629n3482k90512
$$ 1469262 1609593 1805035 1667200 1389644 1831296 1723390 1808384 2061013 2007531 1717019
14584A717019M8381J19344m493l26108M86738l12115L15819M2755J54516k72353
$$ 1717019 1765400 1884744 1880251 1554143 2040881 1728766 2044585 2087340 2241856 1969503
14574A969503j1356K5269J0608k05242Q9771L97732J13339o789k20481L65404
$$ 1969503 1958147 1983416 1994024 1788782 1878553 2276285 2389624 2382835 2162354 2527758
14564B527758j34038J13340j76610M88499k09531M81774k64164L00450J1375O7238
$$ 2527758 2393720 2507060 2330450 2818949 2609418 3091192 2827028 3127478 3138853 3206091
14554C206091K73518K69027M7694O80175J446238J806363M064947P739914J3097517
$$ 3206091 3479609 3748636 3796330 4476505 5922743 7729106 11794053 19533967 32631484
14545C2631484Q382538j9669294H868163D278659j038120q94708j15838j07904
$$ 32631484 41014022 21344728 8868163 4278659 3240539 2345831 2229993 2122089
14537B122089j61747j69455J05525Q9483K45730k73287k56941L45404O8056j72712
$$ 2122089 1960342 1790887 1896412 1985895 2231625 1958338 1701397 2046801 2114857 1942145
14527A942145M14509k35995K13308j24040J80296J7698n1549L12463j28274K97509
$$ 1942145 2356654 2120659 2333967 2209927 2390223 2407921 2356372 2668835 2540561 2838070
14517B838070j27816q5809q767o8266P7592k4734k75068L51102L5544j35675M94315
$$ 2838070 2710254 2624445 2615678 2547412 2625004 2600270 2325202 2676304 2711848 2576173 3070488
14506C070488k23923q5712M2228Q1447j39349J37571L39494l8800L6147l32276
$$ 3070488 2846565 2760853 2803081 2884528 2745179 2882750 3222244 3183444 3219591 2887315
14496B887315K89676j70077j4935K94629L27060o0484R5086l11394J83336j48943
$$ 2887315 3176991 3006914 2991979 3286608 3613668 3553184 3648270 3336876 3520212 3371269
14486C371269k34134K60678K17111k63750p6632N34307n5754J62195L68932l88940
$$ 3371269 3137135 3397813 3614924 3351174 3274542 3808849 3753095 3915290 4284222 3895282
14476C895282J81513l28668L774K04818L35689k02060J89385J45025p6576J50865
$$ 3895282 4076795 3748127 3751901 3956719 4292408 4090348 4279733 4424758 4348182 4499047
14466D499047o0539J24502R2643o7688j66916K60870o9847K35917k14640L48679
$$ 4499047 4438508 4563010 4655653 4587965 4421049 4681919 4612072 4847989 4633349 4982028
14456D982028M5937K5851k36698L65105J66715n23015L67525K33762j27089J91635
$$ 4982028 5027965 5053816 4817118 5182223 5348938 4825923 5193448 5427210 5300121 5491756
14446E491756Q4760j31244M08375r934r7654J80157m4885J44362O2102j49459
$$ 5491756 5576516 5445272 5853647 5843713 5746059 5926216 5881331 6025693 6087795 5938336
14436E938336K11924M62679j27635M7399M32383k17401r501J8656k46221O7921
$$ 5938336 6150260 6612939 6485304 6532703 6965086 6747685 6738184 6756840 6510619 6578540
14426F578540M68012K84101J57850l55522L21541L0756J23477M5560K57360O23071
$$ 6578540 7046552 7330653 7488503 7132981 7454522 7485278 7608755 7654315 7911675 8534746
14416H534746l55574K52304k90799N26870m18378J31821M65539J13247O8630K8386
$$ 8534746 8179172 8431476 8140677 8667547 8249169 8380990 8846529 8959776 9028406 9056792
14406I056792N81522j4281j00396M10628k58207M54542J81441M56714k57380R4923
$$ 9056792 9638314 9624033 9523637 9934265 9676058 10130600 10312041 10768755 10511375 10606298
14396A0606298N71958P8379J32225K0341J91863N51094K67431J24595J74853N81970
$$ 10606298 11178256 11256635 11388860 11409201 11601064 12152158 12419589 12544184 12719037 13301007
14386A3301007k54118J25859L55861M27762J92913o5109O00253K2729K45219L91272
$$ 13301007 13046889 13172748 13528609 13956371 14149284 14084175 14684428 14707157 14952376 15343648
14376A5343648M23879P9597N71747J56599J30726N99180J15512P16835M55813
$$ 15343648 15767527 15847124 16418871 16575470 16706196 17305376 17420888 18137723 18593536
14367A8593536J04834O10435q2251O46969N28759N07330L92223K92351M14990
$$ 18593536 18698370 19308805 19226554 19873523 20402282 20909612 21301835 21594186 22009176
14358B2009176Q26272J7081Q51915M8731R26674P43828N10826M57254O67452Q43991
$$ 22009176 22835448 22852529 23704444 23753175 24679849 25423677 25934503 26391757 27059209 27903200
14348B7903200L92741J113612M40288N55726P67664J046332J184456N74182Q71894
$$ 27903200 28295941 29409553 29849841 30405567 31173231 32219563 33404019 33978201 34850095
14339C4850095J045716N80704J001108J420551J120693O81323J534084J067451
$$ 34850095 35895811 36476515 37477623 38898174 40018867 40700190 42234274 43301725
14331D3301725J333761J102212J583012J592343J569890J026849J947062J587178
$$ 43301725 44635486 45737698 47320710 48913053 50482943 51509792 53456854 55044032
14323E5044032K024817J870005J699279J893100K491379K207176K202199K672906
$$ 55044032 57068849 58938854 60638133 62531233 65022612 67229788 69431987 72104893
14315G2104893K660869K904197K931351K782287L521208L097881L862927M097663
$$ 72104893 74765762 77669959 80601310 83383597 86904805 90002686 93865613 97963276
14307I7963276L768864M554130M324944M796915N036540N346139N501865O157037
$$ 97963276 101732140 106286270 110611214 115408129 120444669 125790808 131292673 137449710
14299A37449710O035220P448774O718915P469685Q048145Q254011Q507725R245488
$$ 137449710 143484930 150933704 157652619 165122304 173170449 181424460 189932185 199177673
14291A99177673R845088R958697J1020235J1096913J2065839J2567089J2768765
$$ 199177673 209022761 218981458 230001693 241098606 253164445 265731534 278500299
14284B78500299J3571748J3621522J3827980J4451583J4019517J4405118J2808652
$$ 278500299 292072047 305693569 319521549 333973132 347992649 362397767 375206419
14277C75206419J3815769J2611250J2099581J0165371O892871J663752R81974
$$ 375206419 389022188 401633438 413733019 423898390 430791261 432455013 433436987
14270D33436987K874952M031921l614119k878990m593869q803059j0668040j2056833
$$ 433436987 436311939 440343860 436729741 433850751 429256882 420453823 409785783 397728950
14262C97728950j3963035j4692507j5528789j5197803j6011127j5534782j5046767
$$ 397728950 383765915 369073408 353544619 338346816 322335689 306800907 291754140
14255B91754140j4479919j3092103j3703849j3178236j2295918j1622502j1024501
$$ 291754140 277274221 264182118 250478269 237300033 225004115 213381613 202357112
14248B02357112j0474065r828937q863120q751862p957693p446617p287474o924035
$$ 202357112 191883047 182054110 173190990 164439128 156481435 149034818 141747344 134823309
14240A34823309o280135o158383n124801n166586n041827m407450m661322m094349
$$ 134823309 128543174 122384791 117259990 112093404 107051577 102644127 97982805 93888456
14232I3888456l965569l378913l290127l825334l145703k695389k721612k791604
$$ 93888456 89922887 86543974 83253847 79428513 76282810 73587421 70865809 68074205
14224F8074205k508264k407393k477926j918361j657304k037095k266195j499824
$$ 68074205 65565941 63158548 60680622 58762261 57104957 55067862 52801667 51301843
14216E1301843j573783j586141r59321j713157j445180j530230j356194j306432
$$ 51301843 49728060 48141919 47182598 45469441 44024261 42494031 41137837 39831405
14208C9831405q61740n24817j371332j327256r90026j142495p59337p99465l37648
$$ 39831405 38969665 38444848 37073516 35746260 34756234 33613739 32854402 32054937 31717289
14199C1717289j205233r55498p74359q41283l59440p51867p01111o15967n20807
$$ 31717289 30512056 29556558 28782199 27940916 27581476 26829609 26128498 25512531 24991724
14190B4991724q65071m23686p36655p41172j59337p49340l12979m86110k74143
$$ 24991724 24126653 23702967 22966312 22225140 22065803 21316463 21003484 20517374 20243231
14181B0243231n77764j56275n98059l51687m37467l32810m89906k36757l13292
$$ 20243231 19665467 19509192 18911133 18559446 18121979 17789169 17299263 17062506 16749214
14172A6749214l00757k64585l20669j31300n20578m73661K33774k56036n15795
$$ 16749214 16448457 16183872 15863203 15731903 15211325 14737664 14971438 14715402 14199607
14163A4199607k31611j83816m23405q5694j45622l59088K3873p50663L93832l11354
$$ 14199607 13967996 13784180 13360775 13275081 13129459 12770371 12794244 12043581 12437413 12126059
14153A2126059k79222l77427j05759k30926k01781j63780k40686k21k41686L4044
$$ 12126059 11846837 11469410 11363651 11132725 10930944 10767164 10526478 10526257 10284571 10318615
14143A0318615l21027k31175q5529j18152m61003O2795m3025k34104j43234j03410
$$ 10318615 9997588 9766413 9680884 9562732 9101729 9164524 9121499 8887395 8744161 8640751
14133H640751k39j88645J17940J14769p26319Q489J60828n00339Q1093K1785m28529
$$ 8640751 8640512 8451867 8569807 8684576 7958257 7966746 8127574 7627235 7708328 7730113 7301584
14122G301584J69489l7753l29739k371k05602K04684l89145N1461l67596K98230
$$ 7301584 7471073 7433320 7103581 7101210 6895608 7100292 6711147 6762608 6395012 6693242
14112F693242o6851o3443k6225l18992k40449J76734J17293l45471k46701J42674
$$ 6693242 6626391 6562948 6536723 6217731 5977282 6154016 6271309 5925838 5679137 5821811
14102E821811R9938k19577j80365J39331k03614k34100R0519k8508j36225n9486
$$ 5821811 5921749 5702172 5521807 5661138 5457524 5223424 5313943 5285435 5149210 5089724
14092E089724n2233n1819K23818l36529j62201n749J4620J07680k02795J05936
$$ 5089724 5037491 4985672 5209490 4872961 4710760 4705011 4719631 4827311 4624516 4730452
14082D730452k48919L00133j80728n378k03021K0620k00238O9972j09870j06026
$$ 4730452 4481533 4781666 4600938 4595560 4392539 4413159 4212921 4282893 4173023 4066997
14072D066997Q8974l5342j27624j75888k92015L58914L3333k5914j16867J59409
$$ 4066997 4155971 4120629 3993005 3817117 3525102 3884016 3917349 3891435 3774568 3933977
14062C933977k24823J81473n35103M70592k62002J14394J88153j68804j11012
$$ 3933977 3709154 3890627 3355524 3826116 3564114 3678508 3866661 3697857 3586845
14053C586845k78628J37897n4635J8356j48273o5660K38363l78841Q3052O7560
$$ 3586845 3308217 3446114 3391479 3409835 3261562 3195902 3434265 3055424 3138476 3206036
14043C206036j69799k2639J62847l92967J61089K73756n16603L30542k54946J67476
$$ 3206036 3036237 3013598 3176445 2783478 2944567 3218323 2701720 3032262 2777316 2944792
14033B944792J66756k64467J14721k53635M07479l18953O5618k20561j89204n3202
$$ 2944792 3111548 2847081 2961802 2708167 3115646 2796693 2862311 2641750 2452546 2399344
14023B399344L82806k26216J54371j88195j11408O112o2336J21179j22907K54303
$$ 2399344 2782150 2555934 2710305 2522110 2410702 2416814 2354478 2475657 2352750 2607053
14013B607053j93875j65983L26477m72114J08585J98880K4238o1186j14851L3073
$$ 2607053 2413178 2247195 2573672 2101558 2210143 2409023 2433261 2372075 2257224 2290297
14003B290297J7560l53473K35425j15206K61200m42859J39634P2300n9402J04888
$$ 2290297 2307857 1954384 2189809 2074603 2335803 1892944 2032578 2104878 2045476 2150364
13993B150364J03345O9882L99859K48847J216797L162147O004496J2215922J5923565
$$ 2150364 2253709 2323591 2723450 2972297 4189094 7351241 13355737 25571659 41495224
13984D1495224j7205220j1614016m894943k312426j061649n48237o86554k91247
$$ 41495224 24290004 12675988 7781045 5468619 4406970 3858733 3172179 2880932
13976B880932j30401j08463k24366K98079k37620m6022q1626N2447m90159K17245
$$ 2880932 2750531 2642068 2417702 2715781 2478161 2432139 2350513 2402960 1912801 2130046
13966B130046m6628N863j29242K19968K168k64962m8848K80301k0547j12370j73873
$$ 2130046 2083418 2089281 1960039 2180007 2182175 1917213 1868365 2148666 2128119 2015749 1841876
13955A841876L4715R3973r8023M9914O3240l58268K44320K12831j87304k22690
$$ 1841876 1876591 1970564 1872541 1922455 1985695 1627427 1871747 2084578 1897274 1674584
13945A674584K29182j43522j66337R1394r2780l1377m00604J39606M29784m6004
$$ 1674584 1903766 1760244 1593907 1685301 1592521 1561144 1160540 1300146 1729930 1683926
13935A683926M7765j83995R1116q3087o4648l2703J85159m01006M16974j61734
$$ 1683926 1731691 1547696 1638812 1555725 1491077 1458374 1643533 1242527 1659501 1497767
13925A497767M7643J4981k22623K81578p1959m8903J12047q1586N4439j88723
$$ 1497767 1545410 1560391 1337768 1619346 1547387 1498484 1610531 1528945 1583384 1394661
13915A394661l6707q8573j03662j66324K00215L3045L83359l74223j0130K17638
$$ 1394661 1357954 1269381 1165719 999395 1199610 1232655 1616014 1241791 1231661 1449299
13905A449299l12525K61267k6467p7342K23973m36342K08405Q3408Q0391j61997
$$ 1449299 1136774 1398041 1371574 1294232 1518205 1081863 1290268 1373676 1454067 1292070
13895A292070l08742M38182k54112l83121P83684n22085J33548J64606m19089
$$ 1292070 983328 1421510 1167398 784277 1567961 1045876 1179424 1344030 924941
13886I24941J86695J04880j246J70028j54348k61361K78311m15658K91745L7203
$$ 924941 1111636 1216516 1215270 1385298 1230950 969589 1247900 832242 1123987 1161190
13876A161190L8761k01674K96928K2197k17618J35899k23277P8171J92466l44078
$$ 1161190 1199951 998277 1295205 1317402 1099784 1235683 1012406 1090577 1283043 938965
13866I38965J20041M109N9356o8580j30867J35633P9889l74819P9660L70210k53339
$$ 938965 1059006 1063115 1122471 1053891 923024 1058657 1138546 763727 843387 1213597 960258
13855I60258R5701k2592l1513J35671j04625k02260j1581k1014K25275p6728K1000
$$ 960258 1055959 1033367 1001854 1137525 1032900 830640 819059 798045 1023320 946592 967592
13844I67592j55233K13143k93313j37233M11179m8864q2247o3163j55992l5426
$$ 967592 812359 1025502 732189 594956 1006135 957271 875024 811861 655869 620443
13834F20443k6327M28514k18558L62789k39019n559q4506J58782k06854J56288
$$ 620443 594116 1022630 804072 1166861 927842 922283 837777 996559 789705 945993
13824I45993R8839P5954k15008m4972j21531K01895o7612L7738Q1252D54606M38870
$$ 945993 1044832 1120786 905778 860806 739275 941170 873558 911296 992548 454606 893476
13813H93476L8494K3219l4648q4967m2398j09631j7068M3004k1124k6906M40140
$$ 893476 931970 955189 920541 835574 793176 683545 666477 709481 688357 661451 1101591
13802A101591m86375l7457K92415R5284k88055j76581M46615K6610m78913M15486
$$ 1101591 615216 577759 870174 965458 677403 500822 947437 974047 495134 910620
13792I10620k89780K6978l4869J13798k05851K67703l07627L37796k36214O5302
$$ 910620 620840 647818 612949 726747 520896 788599 480972 818768 582554 647856
13782F47856M0673k4768J6106l19101L59733k1329k63268L64336C37154J61752
$$ 647856 688529 663761 679867 360766 720499 699170 435902 800238 337154 498906
13772D98906M02924l14371r3435J17150B98240M20086j80009J78634j76829k10759
$$ 498906 901830 587459 494024 611174 298240 718326 538317 716951 540122 329363
13762C29363L03973P8621l2316k59766L52724k4471C11564k2003J83441O6761
$$ 329363 633336 711957 679641 419875 772599 748128 311564 289561 473002 539763
13752E39763R4036J04247j55479J92667l57780L02879j62329n87j64275K10577
$$ 539763 633799 738046 582567 775234 417454 720333 558004 557417 393142 603719
13742F03719j47934q7064J27751j15436M76215C60851j33689N06024k40914J18242
$$ 603719 455785 368721 496472 381036 857251 360851 227162 733186 492272 610514
13732F10514J10665C36423K50358J37959j68617m7969K7612p7087A62399L03503
$$ 610514 721179 336423 586781 724740 556123 508154 535766 458679 162399 465902
13722D65902N7948M7455M5119l6117q3380q3304L46423k02991k0465m1620o3295
$$ 465902 523850 571305 616424 580307 496927 413623 760046 557055 536590 494970 431675
13711D31675K39961j51808K36920k72623J39452q6774l5994j83269L2764J35598
$$ 431675 671636 519828 756748 484125 623577 536803 500809 317540 350304 485902
13701D85902L10944l21054J23523m609k21443q9679j15540K82079l9933J71206
$$ 485902 796846 475792 599315 594706 373263 283584 168044 450123 410190 581396
13691E81396q9570J23961j71753D7944P24579j14012j75059m7380j00914L11992
$$ 581396 491826 615787 444034 47944 772523 658511 483452 436072 335158 647150
13681F47150j52889R2226E9268R64419C77458J54573j45467l3859Q9102j66811
$$ 647150 494261 586487 59268 1023687 377458 532031 386564 352705 441807 274996
13671B74996K37546J15685k18503K5255k15431L29856j12970j15914J77644j61109
$$ 274996 512542 628227 409724 434979 219548 549404 436434 320520 498164 337055
13661C37055j09860K59281A57301M93776l01236m411J88209k18401P8028j8437
$$ 337055 227195 486476 157301 651077 349841 345430 533639 315238 393266 374829
13651C74829J05063K2699K03463R8036l24578H3764K49673J02746j64295J63542
$$ 374829 479892 502591 706054 804090 479512 83764 333437 436183 271888 435430
13641D35430l3219j43819j00819J89124K19900j90384J49863B0891M84964Q6899
$$ 435430 402211 258392 157573 346697 566597 376213 526076 20891 505855 592754
13631E92754B83180O0392A66090L51599o2608m2281J89317L0974r8100o9784l4167
$$ 592754 283180 343572 166090 517689 455081 412800 602117 633091 534991 465207 431040
13620D31040D3311J5005K36163J03746j53267J73477j2818N8081K81535B39711
$$ 431040 43311 58316 294479 398225 244958 418435 405617 463698 745233 239711
13609B45161A07725K75135K2357j66468J24270J71612E8161L04797j9969J31490
$$ 245161 107725 382860 405217 238749 363019 534631 58161 362958 342989 474479
13599D74479M1941j61610J01003j40656M270j26455K16446r4611J32870M8585
$$ 474479 516420 354810 455813 315157 319427 192972 409418 314807 447677 496262
13589D96262j09385j21954K17585j43852j00745m9566M30221B91841Q3511R284
$$ 496262 386877 264923 482508 338656 237911 188345 618566 291841 375352 384636
13579C84636P5290K83892C09750N03525F798B093K90895A23434O1695M15938J739
$$ 384636 459926 743818 309750 813275 6798 2093 292988 123434 185129 601067 602806
13568F02806k31548m5224k1608p1154J23155g1819A0647K96279J3007Q7645o8118
$$ 602806 371258 326034 304426 233272 356427 -71819 10647 306926 319933 407578 339460
13557C39460J27510B00349D955L14217o1712C7742K30608B8429J78553J11293
$$ 339460 466970 200349 4955 319172 257460 37742 268350 28429 206982 318275
13547C18275n1871G8652M71014A56829P8480K71142B5460M03574j539A58353L5510
$$ 318275 266404 78652 549666 156829 235309 506451 25460 429034 427495 158353 193863
13536A93863J15033J3986R3426F9479K00990Q0067P7296q2092K275K3087A33893
$$ 193863 308896 322882 416308 69479 270469 350536 427832 345740 348015 371102 133893
13524C91398A90797K72458j74368A13299K64308B3346K63935D6657P1749M9367
$$ 391398 190797 463255 288887 113299 377607 23346 287281 46657 118406 167773
13514A67773J94210j32856o1663M0207H1558K71293H6255P2316J27285J63943
$$ 167773 361983 229127 167464 207671 81558 352851 86255 158571 285856 449799
13504D49799I3076f009l5816D77236k14481L44137k38094r9976J19783A54770
$$ 449799 93076 -6009 -41825 477236 262755 606892 368798 268822 388605 154770
13493g5456C62203J49262A79268K4774N4187N7473B1800K62903A31371P2750J86227
$$ -75456 362203 511465 179268 204042 258229 315702 21800 284703 131371 204121 390348
13482C90348I4493J47429j17660D789K69396n9085I2953M15959A50301a7387D17641
$$ 390348 94493 241922 124262 4789 274185 215100 92953 508912 150301 -17387 417641
13470A94827J74865l2646J90740A22682N3404J40518B9086J58637J46546d4244
$$ 194827 369692 337046 527786 122682 176086 316604 29086 187723 334269 -44244
13459c1049C76123j60174a77562C41014o9666n8855L68160k71431D0657K90422
$$ -31049 376123 215949 -177562 341014 271348 212493 580653 309222 40657 331079
13449C31079J04686H6592k5599K19002D5901O6735O4951Q3799b5406A47651L9093
$$ 331079 435765 86592 60993 279995 45901 112636 177587 261386 -25406 147651 186744
13438A86744g7661C80106F2968L61856C4081K40880j03514Q5324b7363H5153J92507
$$ 186744 -77661 380106 62968 424824 34081 274961 171447 256771 -27363 85153 277660
13427B77660o9398j8034a48472H3214J50345m2032K22607j36284L32217A87535
$$ 277660 208262 190228 -148472 83214 233559 191527 414134 277850 610067 187535
13416A89277e5574C3421K42087J26207C5475J85463a56216g7213L2110K1879A19855
$$ 189277 -55574 33421 275508 401715 35475 220938 -156216 -77213 -45103 -23224 119855
13404D06082A77764D3217R9368L53037B16906Q457J83939o0943b919A93373M6780
$$ 406082 177764 43217 142585 495622 216906 225363 409302 348359 -2919 193373 240153
13393B40153l8591J27128a19335D34055j40381r9282l3421N2276R7643J59296
$$ 240153 201562 328690 -119335 434055 293674 194392 160971 213247 310890 470186
13383D70186M1760b0477A14839K11907C2109L55999j01401H9521P3761o745K4831
$$ 470186 511946 -20477 114839 326746 32109 388108 286707 89521 163282 156537 181368
13372A81368K5062L2733b0694B22548k5254L08198B47971j8416M2627F6093Q4577
$$ 181368 206430 239163 -20694 222548 197294 505492 247971 229555 272182 66093 150670
13361A50670L7467n6635d8540A72777O624d2255B03363D5078L08793N8714A10444
$$ 150670 188137 131502 -48540 172777 179401 -42255 203363 45078 353871 412585 110444
13349A10990J51502i5057G52987l44841n3198n999n9516E4471L08175j8069J49328
$$ 110990 262492 -95057 752987 408146 354948 348949 289433 54471 362646 344577 493905
13338D93905J44101B02442J05793J13313o4685j0216A21103J8247K60920a20457
$$ 493905 638006 202442 308235 421548 356863 346647 121103 139350 400270 -120457
13327A80725k6567K91854j51076j24762J59265d3803E21989a1334B78611N3495
$$ 180725 154158 446012 294936 170174 329439 -43803 521989 -11334 278611 332106
13317C32106f7168A06569l8290M00223I4314J36089A11542J99836p906K88091
$$ 332106 -67168 106569 68279 468502 94314 230403 111542 311378 303472 591563
13307E91563b01571D98178A05884C2143K73682J414i238E8186J437M41698A30445
$$ 591563 -201571 498178 105884 32143 305825 307239 -9238 58186 59623 501321 130445
13295d68712C71355J7328E3328g0325A29268M9962G2122L8970A359O9220c22847
$$ -468712 371355 388683 53328 -70325 129268 179230 72122 111092 1359 70579 -322847
13283h3890c9204B78146j7213A27172C9986M3109h1014C63301g7970j41844E0557
$$ -83890 -39204 278146 260933 127172 39986 83095 -81014 363301 -77970 -219814 50557
13271a34609K9978L9579C30853A51830a1083d72B82373f874A14457J48485a8403
$$ -134609 -104631 -65052 330853 151830 -11083 -472 282373 -6874 114457 262942 -18403
13259A50481h7164A2521b35498I5817m4130d3818C65346A70206i5028a0797j2442
$$ 150481 -87164 12521 -235498 95817 51687 -43818 365346 170206 -95028 -10797 -23239
13248b3239A12898D3978d03495F964h3428B6276h2816b4240n9145A81572P4476
$$ -23239 112898 43978 -403495 6964 -83428 26276 -82816 -24240 -83385 181572 256048
13237B56048H1481a26323I2889a26791N4973H3646K53149j10726a56811A22321
$$ 256048 81481 -126323 92889 -126791 -71818 83646 336795 226069 -156811 122321
13226a3616k40397C0460a6359C9555c69188g229C2657Q1259J40209D0564O8912
$$ -13616 -254013 30460 -16359 39555 -369188 -7229 32657 113916 254125 40564 109476
13215A09476L6160J59263C0617J07435b8837p0882B97062H6805j3374J87724d0230
$$ 109476 145636 304899 30617 138052 -28837 -99719 297062 86805 73431 261155 -40230
13203A93936a3304l24103B86196j15598L17J94302j17077D8138J53578o7875J81441
$$ 193936 -13304 -337407 286196 170598 170915 365217 248140 48138 201716 133841 315282
13192C15282q4632J13844j20349K0521B2039K99174g6718E9166f3776A25320Q1694
$$ 315282 230650 344494 224145 244666 22039 321213 -76718 59166 -63776 125320 207014
13181B07014P7279q4200a8828B18818B0290K96295D2531R7419m4454N2035J6745
$$ 207014 284293 200093 -18828 218818 20290 316585 42531 139950 95496 147531 164276
13170A64276g5206L0725l2623C4175a83490h1939D20665o5122I0549J9134K42561
$$ 164276 -75206 -44481 -77104 34175 -183490 -81939 420665 355543 90549 109683 352244
13159C52244J7633C9656Q393J72614J33015b5332J1473D200K70321j24605J6082
$$ 352244 369877 39656 48049 220663 353678 -25332 -13859 4200 274521 149916 165998
13148A65998J33581a18964A03624J09907a58240A32397a6183B10024d6465C54796
$$ 165998 299579 -118964 103624 213531 -158240 132397 -16183 210024 -46465 354796
13137B72477m9732d29C51653e9268I2085K17258A52011a68033A36269M2427m8654
$$ 272477 222745 -429 351653 -59268 92085 309343 152011 -168033 136269 178696 130042
13126A30042a10470B76429b111H7236a49206A1539K05733m3896C6358b14611B82668
$$ 130042 -110470 276429 -2111 87236 -149206 11539 217272 173376 36358 -214611 282668
13114B37007d0443k00830A85362c22379B81629b04578A8777a4539F4940a87430
$$ 237007 -40443 -241273 185362 -322379 281629 -204578 18777 -14539 64940 -187430
13103d75q7726I4259L1742n358J44108P2928j61018G855f9439a0575o880C3161
$$ -475 -88201 94259 126001 120643 264751 337679 176661 7855 -69439 -10575 -17455 33161
13090G5813K5397m7791e0591E1477K21974I1041P8150e8844H802J98930c53973
$$ 75813 101210 53419 -50591 51477 273451 91041 169191 -58844 8802 207732 -353973
13078B46525j1751H9078J72344O9097e0316A1644J16492i0569a5147B2976J67272
$$ 246525 234774 89078 261422 330519 -50316 11644 128136 -90569 -15147 22976 190248
13067A90248E6512e1430A9446J85570a45594C44866a08094B98194c17565A37737
$$ 190248 56512 -51430 19446 205016 -145594 344866 -108094 298194 -317565 137737
13056A80290a422F8023K52033D8315J88284a53495B26398b00839J00010J6249
$$ 180290 -1422 68023 320056 48315 236599 -153495 226398 -200839 -100829 -84580
13046h4580D7676K70851D9179K56355A03924m4354L62362F3420K56806j55890
$$ -84580 47676 318527 49179 305534 103924 59570 421932 63420 320226 164336
13036A64336I430e5348C308M16311G0416b11236C20883A06895h5371A2494J19658
$$ 164336 9430 -55348 3308 419619 70416 -211236 320883 106895 -85371 12494 132152
13025A32152b1379A12271j9818r105a41198j00204C76068C9105B762L1617J10404
$$ 132152 -21379 112271 92453 83348 -141198 -241402 376068 39105 2762 34379 144783
13014A44783J21379J9760E5924K0384j2356L3383Q2416c1248l8638D48490j98412
$$ 144783 266162 285922 55924 76308 63952 97335 179751 -31248 -69886 448490 250078
13003B50078c5629R010D52535A84494n9248a03595A49673n1410D2824L0174f1373
$$ 250078 -35629 -26619 452535 184494 125246 -103595 149673 98263 42824 72998 -61373
12991c9264A58606i096j0541A79400i7201r1456A86457J56696j38034b7101C52806
$$ -39264 158606 -9096 -19637 179400 -97201 -188657 186457 343153 205119 -27101 352806
12979a16193C00233c55885F8364K11161d755I0217g221C15231a42799K8550a410
$$ -116193 300233 -355885 68364 279525 -4755 90217 -7221 315231 -142799 -114249 -1410
12967B97636N79C5298A7545a08189k5125N4647A56768k5961e8489K3879a6923
$$ 297636 298215 35298 17545 -108189 -133314 -78667 156768 130807 -58489 -34610 -16923
12955b26443D47486G8950K87737E5538d5954F8762L28690b8355k56405B4826J3418
$$ -226443 447486 78950 366687 55538 -45954 68762 397452 -28355 -284760 24826 38244
12944C8244A7770K494a60337a8732p8758B36120c09641J3961f4501F6634J51965
$$ 38244 17770 20264 -160337 -18732 -97490 236120 -309641 -295680 -64501 66634 218599
12933B18599C288J53676L4648A3622a62347B00250Q4412a69194B32583a85687
$$ 218599 3288 156964 191612 13622 -162347 200250 284662 -169194 232583 -185687
12922c2561j38829n415c7210C21202a84015G7484J1423g9314B0644J16494Q2439
$$ -32561 -171390 -176805 -37210 321202 -184015 77484 88907 -79314 20644 137138 219577
12911B19577n7545a13510M5577A23136a79300B2672K8212j1765h0969F3331a75430
$$ 219577 162032 -113510 -67933 123136 -179300 22672 50884 39119 -80969 63331 -175430
12899A07896a46826C4458a28433D3787a81854h6467b0719Q218A65184a0062E2011
$$ 107896 -146826 34458 -128433 43787 -181854 -86467 -20719 -12501 165184 -10062 52011
12887a08737a1008C65c11126B55425p7108G7608k6703h1472H0251K894J83567
$$ -108737 -11008 365 -311126 255425 178317 77608 50905 -81472 80251 83145 266712
12876B66712i2311E5678K5972f062j64987H0251M1089L5044G7559K98600c2136
$$ 266712 -92311 55678 81650 -6062 -171049 80251 121340 156384 77559 376159 -32136
12864A34011o1150K10892D4501J89810C2309a48464P965o7415g7646F4379N9916
$$ 134011 72861 283753 44501 234311 32309 -148464 -140499 -207914 -77646 64379 124295
12853A24295h6355I788L1041Q8502N8691a91955f5673D4203K60860a59675C06871
$$ 124295 -86355 9788 40829 129331 188022 -191955 -65673 44203 305063 -159675 306871
12841B16825a24454B69748D2800b7321B32335C1527i2206A38606e3954B47348
$$ 216825 -124454 269748 42800 -27321 232335 31527 -92206 138606 -53954 247348
12830b92018b4461B36109h6719A49107e1871F1830r762J51507j01035k7616a10658
$$ -292018 -24461 236109 -86719 149107 -51871 61830 52068 203575 102540 74924 -110658
12818G8835J71725a03946n6350A90605a2302G9424K46410j50254E247J8440a96035
$$ 78835 250560 -103946 -160296 190605 -12302 79424 325834 175580 5247 23687 -196035
12806G8671i6622b2835E6363b6024k81097A27891Q3694r1971Q2710f5361j1435
$$ 78671 -96622 -22835 56363 -26024 -307121 127891 211585 119614 202324 -65361 -76796
12795g6796B08330b80373A90722h5912q2883C37121e1347K2877j45296B22280
$$ -76796 208330 -280373 190722 -85912 -168795 337121 -51347 -28470 -173766 222280
12784i4804b9589i604j62345B68006c7587k9570C01975g2309C11690A10527J06802
$$ -94804 -29589 -9604 -171949 268006 -37587 -67157 301975 -72309 311690 110527 217329
12773B17329G0177c7145j11848O6934j18218G8365A1573b23912L7360A1210J24262
$$ 217329 70177 -37145 -148993 -82059 -200277 78365 11573 -223912 -186552 11210 135472
12762A35472e7460G367a07659n5958A03744J05834a7846C8886a19757A16343R1703
$$ 135472 -57460 7367 -107659 -163617 103744 209578 -17846 38886 -119757 116343 208046
12751B08046O8813p74n0088a97907A0641J74115a91683A01602J64190J01915b02808
$$ 208046 276859 276085 225997 -197907 10641 184756 -191683 101602 265792 367707 -202808
12739A53116h3756k2170L3917B36629d8652A64939a40987A55477d640j93161R2298
$$ 153116 -83756 -105926 -72009 236629 -48652 164939 -140987 155477 -4640 -197801 -105503
12728a05503C6405a49856M2854d750F5904e0175A0287c23377I200b111n6107p679
$$ -105503 36405 -149856 -107002 -4750 65904 -50175 10287 -323377 9200 -2111 -58218 -65897
12716f5897l16552E9309d0627j57783A80468k2078R0698a05381G01953A72726
$$ -65897 -382449 59309 -40627 -198410 180468 158390 249088 -105381 701953 172726
12705A2731K48715m0269N3506A07260l1194b7420r7459K2135q4264P3407M0173
$$ 12731 261446 221177 274683 107260 76066 -27420 -124879 -102744 -187008 -113601 -73428
12694g3428A29722K66235j68406C8828O2116m296b494k06007R991B88907j07964
$$ -73428 129722 395957 227551 38828 100944 96648 -2494 -208501 -198510 288907 180943
12683A80943C1649O5790c16012B14461Q2108J75913k32238F5470B2846J7402g4298
$$ 180943 31649 97439 -316012 214461 296569 472482 240244 65470 22846 40248 -74298
12671a92070P4891H1997Q541m4107K7768K20435I9391A7673b61795R6574B77380
$$ -192070 -117179 81997 90538 46431 74199 294634 99391 17673 -261795 -165221 277380
12659i6092J1261A85694C0243a18562A50727J05103a40960d2172j9428r6136C12698
$$ -96092 -84831 185694 30243 -118562 150727 255830 -140960 -42172 -61600 -157736 312698
12647d9665A71741f9684F6210Q53l2987Q4315N9698K61595j28666A38976l5622
$$ -49665 171741 -69684 66210 67063 34076 118391 178089 439684 311018 138976 103354
12636A03354B7563R4265C2030J40864o9576j346G44P4602j4956M9998a38434A49651
$$ 103354 27563 121828 32030 172894 103318 101972 744 75346 60390 110388 -138434 149651
12623B06887h4094A13030K21387h1736K9794A23098J18600H976N2972J72840a71848
$$ 206887 -84094 113030 334417 -81736 -51942 123098 241698 8976 61948 234788 -171848
12611B86870a33568j29077J26748C06361c0051G0941Q9213a660G2345J04050i4321
$$ 286870 -133568 -262645 -135897 306361 -30051 70941 160154 -1660 72345 176395 -94321
12599A00628j4122J29794D515b5784C9834N98K87519H7134k8302d5657A63010
$$ 100628 86506 216300 4515 -25784 39834 40432 327951 87134 58832 -45657 163010
12587A11070a56827B7801J0810d6441b0468A45560n7531e221r7661A48525K01079
$$ 111070 -156827 27801 38611 -46441 -20468 145560 88029 -5221 -102882 148525 349604
12576C49604o289D0211b3337C69825b1047o3362G7270R3981n7652a10876j4896
$$ 349604 343315 40211 -23337 369825 -21047 -84409 77270 171251 113599 -110876 -125772
12565a25772b3598I6360q622N9521b59517C2433O1486K5739g8758B22387b87248
$$ -125772 -23598 96360 87738 147259 -259517 32433 93919 119658 -78758 222387 -287248
12553A81940a49825M7183A69783J06876J531f237B68587a49263C7307g0145H1728
$$ 181940 -149825 -102642 169783 276659 278190 -6237 268587 -149263 37307 -70145 81728
12541B8441a91976e6608m0653A29223m6777b11708E3044N566i6120k60926B12717
$$ 28441 -191976 -56608 -97261 129223 82446 -211708 53044 58610 -96120 -357046 212717
12529C55829f659G5051a4625A14879D1480N7494Q2983J14947j4771A02235b9174
$$ 355829 -6659 75051 -14625 114879 41480 98974 181957 296904 282133 102235 -29174
12517F1677Q6663K16258i5584E985J54723a16733A37559a26871L1643A12499K4450
$$ 61677 148340 364598 -95584 5985 160708 -116733 137559 -126871 -95228 112499 136949
12506A36949K26574h4552r8896Q9696A59398b7091j92246A49036O1606L21508
$$ 136949 363523 -84552 -183448 -93752 159398 -27091 -219337 149036 210642 532150
12496E32150A13261J1535D2840L63292B4765e02443B51125h9340A11004K4746
$$ 532150 113261 124796 42840 406132 24765 -502443 251125 -89340 111004 135750
12486A35750J53576a76104c8015l50056a1486m2575D9364k3700a08183b8971C07899
$$ 135750 289326 -176104 -38015 -388071 -11486 -54061 49364 25664 -108183 -28971 307899
12474i2373M185D85442a0545j40068j78464I3415b38312N3412I125J93888a61718
$$ -92373 -88188 485442 -10545 -150613 -329077 93415 -238312 -184900 9125 203013 -161718
12462E9361O8172b21165q12B57936d4599B47808a12350q599L3661B41467E8502
$$ 59361 127533 -221165 -221977 257936 -44599 247808 -112350 -120949 -87288 241467 58502
12450a87809M6978l8794b0768F8834J71379c4511k03720j44658D2295a17994A6792
$$ -187809 -140831 -179625 -20768 68834 240213 -34511 -238231 -382889 42295 -117994 16792
12438c8051j54275F1098c9205o735G5228R225k0568a33139A15368P4697e0467
$$ -38051 -192326 61098 -39205 -45940 75228 84453 63885 -133139 115368 190065 -50467
12426b21979j62082A78663h6839K2577j1974B82259G206J05869j593k6763c6643
$$ -221979 -384061 178663 -86839 -64262 -76236 282259 7206 113075 111482 84719 -36643
12414a74332h2074A7779L26054a48414b2924o7040j4916A40223c02227A05141
$$ -174332 -82074 17779 343833 -148414 -22924 -89964 -104880 140223 -302227 105141
12403b54636j29750E6104c32724f2154B12100r194a98358A50565O350Q760a19046
$$ -254636 -384386 56104 -332724 -62154 212100 202906 -198358 150565 156915 165675 -119046
12391b24519l938D0400a02827E9141b31613A55735G0295j3589J13573b41513P0713
$$ -224519 -228457 40400 -102827 59141 -231613 155735 70295 56706 170279 -241513 -170800
12380a70800e3278B45542a6573B84i5639c3169A59112R4919b14057A64050B1242
$$ -170800 -53278 245542 -16573 284 -95639 -33169 159112 254031 -214057 164050 21242
12368b71722H3914a02001A09587L8056b5572E9399k1121J56397B816d6013C8361
$$ -271722 83914 -102001 109587 147643 -25572 59399 38278 194675 2816 -46013 38361
12356A40554g5701B78500a6336A09670K50667j57601h9673k92646M6057e3395
$$ 140554 -75701 278500 -16336 109670 360337 202736 -89673 -382319 -336262 -53395
12345e4988n52E6497b79746A9104c6777G3678P8112c84960a24740d9929j440B42232
$$ -54988 -55540 56497 -279746 19104 -36777 73678 151790 -384960 -124740 -49929 -51369 242232
12332d9760j66021D9731A5201b39896B98358c6872C50561a74203C5588K125b21206
$$ -49760 -215781 49731 15201 -239896 298358 -36872 350561 -174203 35588 37713 -221206
12320b73376b3486p4413a1011j20652A14617k1074g9609J4352A34796m7467A354
$$ -273376 -23486 -97899 -11011 -131663 114617 93543 -79609 -65257 134796 87329 1354
12308A45883o2610J40586G1499a33799A67700G5927e8268a388j109j20398R165
$$ 145883 83273 223859 71499 -133799 167700 75927 -58268 -1388 -2497 -122895 -113730
12297a13730n7899B56435A07449J43493b0433C16364a93928d1056F6886a9627
$$ -113730 -171629 256435 107449 250942 -20433 316364 -193928 -41056 66886 -19627
12286c8315r761D64277h0217D6852J5630N7215J52018j13156R321j6920j2644
$$ -38315 -48076 464277 -80217 46852 62482 119697 271715 158559 167880 150960 138316
12275A38316J53485m9525d9239C13400G7952J38039a57205H944K14765i6307D27705
$$ 138316 291801 242276 -49239 313400 77952 215991 -157205 8944 223709 -96307 427705
12263D131a343B56838E4986b41988B92427j46209i0056L8144k9594j1714E8640
$$ 4131 -1343 256838 54986 -241988 292427 146218 -90056 -51912 -81506 -93220 58640
12251A72572b0768A16859N997m7025J4994J4751C2210O6710a14041C01871b0128
$$ 172572 -20768 116859 122856 75831 90825 105576 32210 98920 -114041 301871 -20128
12239D33708A28981b85813d0613K0130J137B11950c7459A70369f2085K7786n829
$$ 433708 128981 -285813 -40613 -20483 -19346 211950 -37459 170369 -62085 -34299 -40128
12228d0128r941j35509N2771A37348a35759B63561m7267a55499g3301E97139b35933
$$ -40128 -50069 -185578 -132807 137348 -135759 263561 216294 -155499 -73301 597139 -235933
12216A60085R3038R5531p1028j21643o9129L26600b0286A00973b6325A09129J23981
$$ 160085 253123 348654 277626 155983 86854 413454 -20286 100973 -26325 109129 233110
12205B33110k8822D6227F578K17246N7934A20241R3737j97A03516M4181b10052
$$ 233110 204288 46227 6578 223824 281758 120241 213978 213781 103516 147697 -210052
12193e8544C2543K59733J55188j17618P8133j65426a989j00198q4216C35163H3869
$$ -58544 32543 292276 447464 329846 407979 242553 -1989 -102187 -186403 335163 83869
12181B47999B7824b3578A49438D4208J78365a35017a9033A72491o7157P4268M9526
$$ 247999 27824 -23578 149438 44208 222573 -135017 -19033 172491 105334 179602 229128
12170B29128K549o8314P69070a17041A81237i3412c8486B02629J64159e3281q146
$$ 229128 231677 163363 932433 -117041 181237 -93412 -38486 202629 366788 -53281 -61427
12159f1427B8941O0460R7692J99509r7372A28918a52454A21496g11A58252b39745
$$ -61427 28941 89401 187093 386602 289230 128918 -152454 121496 -711 158252 -239745
12147F7245l1510i089A84649J74175j34901K1256H866J60922k4637P9211l1785
$$ 67245 35735 -9089 184649 358824 223923 245179 8866 169788 145151 224362 192577
12136A92577A046a3153d848D45708A168b36565L8694B44832a1269A36987D6123
$$ 192577 1046 -13153 -4848 445708 1168 -236565 -197871 244832 -11269 136987 46123
12124i2160G531a22196a6687o8949G8879J12937H26b19388G4707M9328b10035
$$ -92160 7531 -122196 -16687 -85636 78879 191816 826 -219388 74707 124035 -210035
12112a6954j10407a99j89914G3212M5865a16947b7075B76424D4254L2446J14944
$$ -16954 -127361 -199 -190113 73212 119077 -116947 -27075 276424 44254 76700 191644
12101A91644c6009j24988p0016I2498a95885A75621d19039J66415P733H1871e1258
$$ 191644 -36009 -160997 -231013 92498 -195885 175621 -419039 -252624 -244891 81871 -51258
12089E6724a45020J6175r512e3963k76048F8617L2110a09250H3864b890B23555
$$ 56724 -145020 -128845 -138357 -53963 -330011 68617 100727 -109250 83864 -2890 223555
12077f8017n2336a3344l2990j08196M2182A81052J28486K3470N62459R50255F06280
$$ -68017 -120353 -13344 -46334 -154530 -112348 181052 309538 333008 895467 1845722 606280
12065B94554b54709a06304n8825B64456o8584f8129A44665k9736J5846a47064
$$ 294554 -254709 -106304 -165129 264456 195872 -68129 144665 114929 130775 -147064
12054f2065q9582i466C86304j32050j05688F5346B0252b38274A13779a2489B47453
$$ -62065 -151647 -9466 386304 254254 148566 65346 20252 -238274 113779 -12489 247453
12042F5498O7755J9144B686h0791j23845B02649b001k94748F0429J10828Q887
$$ 65498 133253 152397 2686 -80791 -204636 202649 -2001 -296749 60429 171257 180144
12031A80144G6342L8218b4994j38325b2277A14844J23719a7359F1982M129A1994
$$ 180144 76342 114560 -24994 -163319 -22277 114844 238563 -17359 61982 66111 11994
12019C1510a53650b5783l00713J30990C497b38442A36958C3829I110J65057e5827
$$ 31510 -153650 -25783 -326496 -195506 3497 -238442 136958 33829 9110 174167 -55827
12007B93773a74215C1300b05704A67640G2906H745J20065b11717i8334C03049
$$ 293773 -174215 31300 -205704 167640 72906 8745 128810 -211717 -98334 303049
11996b09778b1177m1252B73561f8902k43523A47741m4978a98905G0267p389K10969
$$ -209778 -21177 -62429 273561 -68902 -312425 147741 102763 -198905 70267 62878 273847
11985B73847g341m3533l09168h1340r9227c3973M428B47597l7331b4037j34593
$$ 273847 -7341 -50874 -360042 -81340 -180567 -33973 -29545 247597 210266 -24037 -158630
11974a58630A42598b96591o6488g6423A72197E4270a39505L0258K0024C7599F103
$$ -158630 142598 -296591 -363079 -76423 172197 54270 -139505 -109247 -89223 37599 6103
11962F335a20983d0418j28119b5757G1368J23437d0126A60701f5083H2202O1339
$$ 6335 -120983 -40418 -168537 -25757 71368 194805 -40126 160701 -65083 82202 143541
11951A43541n8320J19527c6635m5718B18508A6219K37958A08098L950r409J45299
$$ 143541 85221 204748 -36635 -82353 218508 16219 254177 108098 112048 102639 247938
11940B47938e103A48687a01722G4926k9339e11250C5844J02112n6270k8607N6643
$$ 247938 -5103 148687 -101722 74926 45587 -511250 35844 137956 81686 53079 109722
11929A09722c71549B8296M00148j90956J07080j72227B3549f4447H5743c01136
$$ 109722 -371549 28296 428444 237488 344568 172341 23549 -64447 85743 -301136
11918a98219j77129m0850A00885e8890B09159a72632j32450H8092c24745C14178
$$ -198219 -375348 -416198 100885 -58890 209159 -172632 -305082 88092 -324745 314178
11907a77086A70784k7886F810J14935J94464i7284G7187M9329f3661I2048g3065
$$ -177086 170784 142898 6810 121745 316209 -97284 77187 126516 -63661 92048 -73065
11895G005K54820D6468b42338M4319h4385L2601j75821b6696M701A7355J02284
$$ 7005 261825 46468 -242338 -198019 -84385 -51784 -227605 -26696 -21995 17355 119639
11884A19639n9209a5438p4058E1372K63299I8442J53607J0765j06304a07926C5159
$$ 119639 60430 -15438 -89496 51372 314671 98442 252049 262814 156510 -107926 35159
11872b04149a730D72645e3033l1460g168j8528I2109D0611b21299R5615F0180
$$ -204149 -1730 472645 -53033 -84493 -7168 -25696 92109 40611 -221299 -125684 60180
11860f124p8156B72740j10941b3894k88433e2197O977B79522f5970j3085c1743
$$ -6124 -84280 272740 161799 -23894 -312327 -52197 -45220 279522 -65970 -79055 -31743
11848a41845C0428a14274q1948J9707e297B00073J60386A3741a82588J572j16273
$$ -141845 30428 -114274 -196222 -176515 -5297 200073 360459 13741 -182588 -181016 -297289
11837b97289a6446A16158M4184F3792a25197C8568b35811D0379j9762a5029A70532
$$ -297289 -16446 116158 160342 63792 -125197 38568 -235811 40379 20617 -15029 170532
11825b16537l1177B21340h9099l8531o2717f7384K9588j75875f204l9216L47F0638
$$ -216537 -247714 221340 -89099 -127630 -190347 -67384 -37796 -213671 -6204 -45420 -45073 60638
11812a15698G3530j221a27337A05411K20239A59599i0620k6232J3515b7127R198
$$ -115698 73530 72309 -127337 105411 325650 159599 -90620 -116852 -103337 -27127 -17929
11801a7929M877k1405k91460e6324m6641A11776b3449E8010f754j95653C4883
$$ -17929 -13052 -34457 -325917 -56324 -102965 111776 -23449 58010 -6754 -202407 34883
11789b18878A08844J59076c85968M8414B38319c04124B8730c6989j5766A52010
$$ -218878 108844 267920 -385968 -337554 238319 -304124 28730 -36989 -52755 152010
11778i8320C971L2152K55524a91546a4562k79918f3378A89731a86371A98860C7047
$$ -98320 3971 36123 291647 -191546 -14562 -294480 -63378 189731 -186371 198860 37047
11766B87570b85540H2874h0833J2641c2148j87389F1062a82772A1760J68059b36467
$$ 287570 -285540 82874 -80833 -68192 -32148 -219537 61062 -182772 11760 179819 -236467
11754a01946C3010g5561E1282P0796a9806o5680A0014M9586i9143A39858a7360
$$ -101946 33010 -75561 51282 122078 -19806 -85486 10014 59600 -99143 139858 -17360
11742A85501C1403a08285p18b2455n8825G4036R80a52700B75567K0892D6824a15632
$$ 185501 31403 -108285 -109003 -22455 -81280 74036 75016 -152700 275567 296459 46824 -115632
11729B93057D8462O0554G016J30139k0442b7611j34890B12678c6913q2698A6156
$$ 293057 48462 109016 7016 137155 116713 -27611 -162501 212678 -36913 -119611 16156
11717G5097a63956A35168J30376E8521J06450c9356B81768a2093l59989a00338
$$ 75097 -163956 135168 265544 58521 164971 -39356 281768 -12093 -372082 -100338
11706A17519B7812K73954b45735r1707C19526j03917A0074d69977D2806a72165
$$ 117519 27812 301766 -245735 -337442 319526 215609 10074 -469977 42806 -172165
11695F3921d07291d2455I059K12770d5804B56634O8318D2468e9002D1468N2057
$$ 63921 -407291 -42455 9059 221829 -45804 256634 324952 42468 -59002 41468 93525
11684I3525P3364J26912b46538f2916j27879g9308C65436F336K32955l5711D9844
$$ 93525 166889 293801 -246538 -62916 -190795 -79308 365436 6336 239291 203580 49844
11672A04673a07095D98343a93524c2149l09390h130A24758c2049A58738M1488
$$ 104673 -107095 498343 -193524 -32149 -341539 -8130 124758 -32049 158738 200226
11662B00226J92e11958A09813c5395E5307A4850J5156i1309B14878i4427F0431
$$ 200226 200418 -511958 109813 -35395 55307 14850 30006 -91309 214878 -94427 60431
11650d84859A31305a35124B73151O855p0032I2927K41218A32152b14387E8599
$$ -484859 131305 -135124 273151 280006 209974 92927 334145 132152 -214387 58599
11639a10630j96326j00602J47307A30180O6286b12766d8972B6603J66932A5381
$$ -110630 -306956 -407558 -260251 130180 196466 -212766 -48972 26603 193535 15381
11628B75828b09919M7123D5961i2640k0883A01841b16433F6427K077D19J22452
$$ 275828 -209919 -162796 45961 -92640 -113523 101841 -216433 66427 68504 419 122871
11617A22871a96374i0603k09504i286j35180L6953H5430j7223e3617p2027I0767
$$ 122871 -196374 -90603 -300107 -9286 -144466 -107513 85430 68207 -53617 -125644 90767
11605A21764b41806A73758m39K0162a30146A64684g3173I9678R9129f1759H9288
$$ 121764 -241806 173758 173319 193481 -130146 164684 -73173 99678 198807 -61759 89288
11593A62450d0404B01776a77734f1739k36853i683B59178j15942K0093P1018g7614
$$ 162450 -40404 201776 -177734 -61739 -298592 -9683 259178 143236 163329 234347 -77614
11581D095a7909A61792H0443A6409b44159Q8105B40160r3474i2744A38719e2031
$$ 4095 -17909 161792 80443 16409 -244159 -156054 240160 146686 -92744 138719 -52031
11569B25053h6370H5300k9361f3329A2491K06877c07974a37756A60793n2747a83753
$$ 225053 -86370 85300 55939 -63329 12491 219368 -307974 -137756 160793 108046 -183753
11557D5816Q6679A5823J31680k5831l8199M4998a23768q1490b6288b223j59803
$$ 45816 132495 15823 147503 121672 83473 128471 -123768 -205258 -26288 -2223 -162026
11546a62026A25949L7773a55479B05501J7806B726b800F9008a1046C60926b48995
$$ -162026 125949 163722 -155479 205501 223307 2726 -2800 69008 -11046 360926 -248995
11534C64913A18271Q9148J32143A56246L8450J9254K40309H0856j2669J5951c96637
$$ 364913 118271 207419 339562 156246 194696 213950 454259 80856 68187 84138 -396637
11522B45370J8J90204r2346C8014J95852a47126E1670J4824J86916a22129A24551
$$ 245370 245388 435592 343246 38014 233866 -147126 51670 66494 253410 -122129 124551
11510e8119B59640q4754a43885G6857J02743K52D1681i4033D11944d3355B572
$$ -58119 259640 174886 -143885 76857 179600 179852 41681 -94033 411944 -43355 2572
11498C57681r4302F2553N3988D1756O2073b7941A34007J2626K7312a9175B39955
$$ 357681 263379 62553 116541 41756 103829 -27941 134007 146633 173945 -19175 239955
11486A2169N6545J44467J1898a71629g243l6426A32866K04499N3090D9087g4852
$$ 12169 68714 213181 225079 -171629 -7243 -43669 132866 337365 390455 49087 -74852
11474I0941B8068R1415e5595l5343B51946j4832J55167o2602c9402F7079O8492
$$ 90941 28068 119483 -55595 -90938 251946 237114 392281 329679 -39402 67079 135571
11463A35571J65775m8934K1308F3750j4443L41642g0014j61484f8365b0272l4646
$$ 135571 301346 252412 273720 63750 49307 390949 -70014 -231498 -68365 -20272 -54918
11452e4918D492R3706a1917A35076a78687C8319K68598c1775B37545a67191e2615
$$ -54918 4492 98198 -11917 135076 -178687 38319 306917 -31775 237545 -167191 -52615
11440B67828B365J19766J13i950A26766A6700a498o9815C5943b87895J05725A62510
$$ 267828 2365 122131 122244 -9950 126766 16700 -1498 -71313 35943 -287895 -182170 162510
11427B1706a55637D2354D892R5514l6987K58877A06714J52168A04732o271K10979
$$ 21706 -155637 42354 4892 100406 63419 322296 106714 258882 104732 98461 309440
11416C09440E7071h0650F1015J31320H2576a65230a1276A23221g8100q5633f5161
$$ 309440 57071 -80650 61015 192335 82576 -165230 -11276 123221 -78100 -163733 -65161
11404A05757i5744B43912h9193B09428f0082F5656J14384i5559I6365O5620F560
$$ 105757 -95744 243912 -89193 209428 -60082 65656 180040 -95559 96365 161985 6560
11392B3265O4220i1472A83042C812c11290e713j56809k46594P5948A25996E7553
$$ 23265 87485 -91472 183042 3812 -311290 -5713 -162522 -409116 -333168 125996 57553
11380i0215J6447J3005C33629j22699a64994I6595a73685C51148a66281P9551
$$ -90215 -73768 -60763 333629 210930 -164994 96595 -173685 351148 -166281 -86730
11370h6730B75930b16518A57343b09947J707C98b5752I7363I483J8655c5415k14458
$$ -86730 275930 -216518 157343 -209947 -208240 398 -25752 97363 9483 28138 -35415 -249873
11358b49873A47727i2695j51344j21450J28098A52682g9873A12713D3489b2736
$$ -249873 147727 -92695 -244039 -365489 -237391 152682 -79873 112713 43489 -22736
11347A34324l7182B4615a19359A46951b7792k22115R0338D5203c2930A4921Q7939
$$ 134324 97142 24615 -119359 146951 -27792 -249907 -159569 45203 -32930 14921 102860
11336A02860R4975I6807qA9970a84608a4518m835k1698k92042i887k48458a00770
$$ 102860 197835 96807 96799 19970 -184608 -14518 -19353 -41051 -333093 -9887 -258345 -100770
11323h3146C5923A5961K0130b1532q4146F9074b10921H9376O2541K5674m3437
$$ -83146 35923 15961 36091 -21532 -105678 69074 -210921 89376 151917 177591 134154
11312A34154a38473M8493k72656B07901a09820B44057b21644A86958b08986i7021
$$ 134154 -138473 -89980 -362636 207901 -109820 244057 -221644 186958 -208986 -97021
11301a86394e758j09598B78303A5272K71641a43867A61598g5749j71443D0342
$$ -186394 -5758 -115356 278303 15272 286913 -143867 161598 -75749 -247192 40342
11290a60814n3385q9843G2516a3964F7303k7578o137R7593J30929b63741A50561
$$ -160814 -214199 -304042 72516 -13964 67303 39725 33588 131181 262110 -263741 150561
11278A6571h1179K2953J8950j40358j73091A0183a59922M1031K4945A9129g0744
$$ 16571 -81179 -58226 -39276 -179634 -352725 10183 -159922 -118891 -93946 19129 -70744
11266a08988B85967a39640F4945F258J55466h7873k00257B35897b07611R7778
$$ -108988 285967 -139640 64945 6258 161724 -87873 -288130 235897 -207611 -109833
11256a09833m040J596K3780K9042A64884b97895k4217d24j45327q5853M3142Q0628
$$ -109833 -113873 -112277 -88497 -59455 164884 -297895 -322112 -424 -145751 -231604 -188462 -107834
11244a07834k0r021m3680K4306n1553h9579L7632K2542q3119a2448A22093L40201
$$ -107834 -107854 -116875 -160555 -136249 -187802 -89579 -51947 -29405 -112524 -12448 122093 462294
11232D62294b01845N8378C14447A24518D8937b18908a2493B95811I118K70696
$$ 462294 -201845 -143467 314447 124518 48937 -218908 -12493 295811 9118 279814
11222B79814d4029H5443O7296D8677b23932L2111i1740l78094a19771G5239b56522
$$ 279814 -44029 85443 152739 48677 -223932 -191821 -91740 -469834 -119771 75239 -256522
11210i9298F0727J83491F2862J66759m7461a42713O6300j10732k55832B50383
$$ -99298 60727 244218 62862 229621 182160 -142713 -76413 -187145 -442977 250383
11199A87490l0072E1018b845k77663k606A39671b53788A5293a63063@a39078k0306
$$ 187490 157418 51018 -2845 -280508 -283114 139671 -253788 15293 -163063 0 -139078 -159384
11187a59384j72254F8155a87885h762j45925O2706k97912R7526f948B3309i4866
$$ -159384 -331638 68155 -187885 -8762 -154687 -91981 -389893 -292367 -6948 23309 -94866
11175B7021j2898J00288J51569d6150l816k70419K7439B09062q9306e2746K1973
$$ 27021 14123 114411 265980 -46150 -49966 -320385 -292946 209062 119756 -52746 -30773
11164c0773I1134J45706G6011a37033j88758J20771n9114G2367b23138A2953J00455
$$ -30773 91134 236840 76011 -137033 -325791 -205020 -264134 72367 -223138 12953 113408
11153A13408m4090J80854F7077a60881M4896N2756j54179C6579L863a82539o2698
$$ 113408 69318 250172 67077 -160881 -115985 -63229 -217408 36579 40442 -182539 -245237
11142b45237e6636n6812j4996A75741M3860P8646l8301I7525l8729P0119K5875
$$ -245237 -56636 -113448 -128444 175741 219601 298247 259946 97525 58796 128915 154790
11131A54790c88432A60183J08069I733b9787j25976A70982m3273P8241d0719j0400
$$ 154790 -388432 160183 268252 9733 -29787 -155763 170982 127709 205950 -40719 -51119
11120e1119E21096A06824N8984J71049A55165b35184i4298A46308M7781o7875
$$ -51119 521096 106824 165808 336857 155165 -235184 -94298 146308 194089 126214
11110A26214k9513l9606J88460q5191m6991i974E00066j66172o1185a71207b4907
$$ 126214 96701 57095 245555 160364 113373 -9974 500066 333894 272709 -171207 -24907
11098B63442J39700A58867n417B5226J00995h6138C57312L2644j08977J34138
$$ 263442 403142 158867 153450 25226 126221 -86138 357312 389956 280979 415117
11088D15117A85429b1492B81462q054j34185R2434J10803a69019A07478J83707
$$ 415117 185429 -21492 281462 273408 139223 231657 342460 -169019 107478 291185
11078B91185R9273k0709A13931k2420J88274L87796A50849K96997j23667j60833
$$ 291185 390458 369749 113931 91511 279785 667581 150849 447846 324179 163346
11068A63346M68997k56225j6197Q0894j88947M32437l37466J54012o9956J22476
$$ 163346 632343 376118 359921 440815 251868 684305 346839 500851 430895 553371
11058E53371r4384j39244L02339K75093D19117L14065j01063J25061n5300J13481
$$ 553371 458987 319743 622082 897175 419117 733182 632119 757180 701880 815361
11048H15361J78547q9566k02480L57285l38344K29366k73003n60P0039Q7839K47121
$$ 815361 993908 904342 701862 1059147 720803 950169 677166 676606 746645 834484 1081605
11037A081605E22352M73304j78737j82311q3849K30333k09550N3113O9147L3898
$$ 1081605 522352 995656 816919 634608 550759 781092 571542 624655 693802 727700
11027G27700j65115j6016K53894K1390k36302J43565j03901J56340k76256K57578
$$ 727700 562585 546569 800463 821853 585551 729116 625215 781555 505299 762877
11017G62877k01569K87644l45318N0740j20207M21401j41732l06169L38573j2056
$$ 762877 561308 848952 503634 554374 434167 855568 713836 407667 746240 734184
11007G34184k96440R2640q8867P5115J84024P4487j62158m7666K59698l48533
$$ 734184 437744 530384 441517 516632 700656 775143 612985 565319 825017 476484
10997D76484K47486k80793J79752J11363j17316R7868j22405L00894q1967J48299
$$ 476484 723970 443177 622929 734292 616976 714844 592439 893333 811366 959665
10987I59665p7770L05804j83246l09786K70711J85330j18181J85062o2656K78824
$$ 959665 881895 1187699 1004453 694667 965378 1150708 1032527 1217589 1154933 1433757
10977A433757j36376N31961J58804K50659J79279L50309J51229J28184N26702
$$ 1433757 1297381 1829342 1988146 2238805 2418084 2768393 2919622 3047806 3574508
10968C574508l31455n41626L8677n19538j19316l37995K23133k90284l63224O1631
$$ 3574508 3243053 2701427 2740104 2220566 2101250 1763255 1986388 1696104 1332880 1394511
10958A394511J08550L5561j73645m06825M21345k22611k2958D80874J76581J4040
$$ 1394511 1503061 1538622 1364977 958152 1379497 1156886 1133928 480874 657455 671495
10948F71495K67773m21760B12464K28143A47278K01739R8342j33501P0756I9800
$$ 671495 939268 517508 212464 440607 147278 349017 447359 313858 384614 99800
10937A98803G489M6215M07009e0246A64771p3078d788D75350j33456B495c42177
$$ 198803 7489 53704 460713 -50246 164771 91693 -4788 475350 341894 2495 -342177
10925C387h2946b452D1140N3774a7331A73982b7465I7458a44263B78861E9846
$$ 3387 -82946 -2452 41140 94914 -17331 173982 -27465 97458 -144263 278861 59846
10913A34260i5896A44926D2261N5525M6519a327C54701H5746J78594G5064e3739
$$ 134260 -95896 144926 42261 97786 144305 -1327 354701 85746 264340 75064 -53739
10901a6730A25479a52682J399j06894k9048C2768K4904a62874A58340J8786i8778
$$ -16730 125479 -152682 -151283 -258177 -287225 32768 57672 -162874 158340 177126 -98778
10889B27088b24615A1454K00272h8918m3950A74705a29956f4325A4866g7045A08513
$$ 227088 -224615 11454 211726 -88918 -132868 174705 -129956 -64325 14866 -77045 108513
10877i2010p8513d1339J6731A12319B6081a36603A65995b02788q4603c4714A51052
$$ -92010 -170523 -41339 -24608 112319 26081 -136603 165995 -202788 -287391 -34714 151052
10865F9470a4463A73361d3024J1598j75100P8215C9640g0927L0850n3004j45531
$$ 69470 -14463 173361 -43024 -31426 -206526 -128311 39640 -70927 -40077 -93081 -238612
10854b38612A84107P7650a66889B94075A02835a36280f2068p8468l4469A25503
$$ -238612 184107 261757 -166889 294075 102835 -136280 -62068 -140536 -175005 125503
10843B57081a83589e9097j53978d5503J5284p2905l0569f5163k31573H8626c873
$$ 257081 -183589 -59097 -213075 -45503 -30219 -103124 -133693 -65163 -296736 88626 -3873
10831C4544Q9508i3919a1812j04311c7046m2730k5392d8368G6471h6100m9880
$$ 34544 124052 -93919 -11812 -116123 -37046 -79776 -105168 -48368 76471 -86100 -135980
10820a35980j21913e0313k20136M9460J05193q1440J0362N314c7242O646j64172
$$ -135980 -257893 -50313 -270449 -220989 -115796 -197236 -186874 -181560 -37242 -30596 -194768
10809a94768Q7702f323p2395m2554B21765c26458f0690A92725n4166a09289B20401
$$ -194768 -107066 -6323 -78718 -121272 221765 -326458 -60690 192725 138559 -109289 220401
10797G328K6775i5884A13892g2510j61490g1993A87684b9252A66408L89851B21836
$$ 7328 34103 -95884 113892 -72510 -234000 -71993 187684 -29252 166408 556259 221836
10785b41102E6249D111a9315q705A18407I884g6827A0067d5432n5758A63309M2287
$$ -241102 56249 4111 -19315 -28020 118407 9884 -76827 10067 -45432 -101190 163309 205596
10773B05596a17832k64247i2763k31038B91632G7262a29382N1489E5970Q528g3442
$$ 205596 -117832 -382079 -92763 -323801 291632 77262 -129382 -77893 55970 64498 -73442
10761b34275G6652B1814O2093P5831l9781b85116N9920A3312b54835k7230E8357
$$ -234275 76652 21814 83907 159738 119957 -285116 -225196 13312 -254835 -282065 58357
10749A2086J44843a52274k1261d179C45253a37797A00411a3301j32218n3942B57338
$$ 12086 156929 -152274 -173535 -4179 345253 -137797 100411 -13301 -145519 -199461 257338
10737c03335A53789n8960c7470l1054B19548F0330B5829R724g432C27362A51802
$$ -303335 153789 94829 -37470 -68524 219548 60330 25829 35553 -7432 327362 151802
10725e1181D66650d0532A05005b83207h8603A9797i914A589b02356C58108i2316
$$ -51181 466650 -40532 105005 -283207 -88603 19797 -9914 1589 -202356 358108 -92316
10713H3098h4155G2016f8029O676E45L2248a24547A25271a38644f4442k0666a5663
$$ 83098 -84155 72016 -68029 -61353 545 32793 -124547 125271 -138644 -64442 -85108 -15663
10700B0820J53816b68249B024J05274b75175P209B77283a21235q5479c1304l26594
$$ 20820 174636 -268249 2024 107298 -275175 -267966 277283 -121235 -206714 -31304 -357898
10689c57898a25299j10177B45898d1247J2007l01309f9899A13960l7736a6568
$$ -357898 -125299 -235476 245898 -41247 -29240 -330549 -69899 113960 76224 -16568
10678B43917d14389F4008a69839c1558j55045L6090B50254F0221a38942c1008
$$ 243917 -414389 64008 -169839 -31558 -186603 -150513 250254 60221 -138942 -31008
10667B09289g721k0270H4404m094b26583A62313b79734L4395J08428n2464K2328
$$ 209289 -7721 -27991 84404 80310 -226583 162313 -279734 -245339 -136911 -189375 -167047
10656a67047B9417b01948B3854K42075b72259A11557i4239c3123D9300g2984j54187
$$ -167047 29417 -201948 23854 265929 -272259 111557 -94239 -33123 49300 -72984 -227171
10645b27171K9577D3306J33624b10133a02906F0997M2271g8382j6427j90493E9362
$$ -227171 -197594 43306 176930 -210133 -102906 60997 103268 -78382 -94809 -285302 59362
10633A06492a70594k34110a37929F3881J02789c27476a56801A57654b39021r1379
$$ 106492 -170594 -404704 -137929 63881 166670 -327476 -156801 157654 -239021 -330400
10623c30400h2142B00210a33636N2256k93461K8598a14314j32727a2298k52679
$$ -330400 -82142 200210 -133636 -81380 -374841 -346243 -114314 -247041 -12298 -264977
10613b64977A82869a50341C14453a85584C27050b42441D2761J33976a25759D3923
$$ -264977 182869 -150341 314453 -185584 327050 -242441 42761 176737 -125759 43923
10602a33666j60639H820h335G4428L68931b45618h5065A30843a73449A50786A6091
$$ -133666 -294305 8820 -8335 74428 443359 -245618 -85065 130843 -173449 150786 16091
10590D34222A42530J46125j43219a63535A06748M7869b97372A86119d797A5223
$$ 434222 142530 288655 145436 -163535 106748 154617 -297372 186119 -4797 15223
10579a44072N5304j49083J17704m3826E4791a78863d490A14666c47201A36802
$$ -144072 -88768 -237851 -120147 -163973 54791 -178863 -4490 114666 -347201 136802
10568e4685m8133C3717f3483J3412A3473f05k52589n3467F1297K05102A31430
$$ -54685 -102818 33717 -63483 -50071 13473 -605 -253194 -306661 61297 266399 131430
10556A34631f6067j78029C1064a35604F6329d7814F3494a21050r2693A67807G7294
$$ 134631 -66067 -244096 31064 -135604 66329 -47814 63494 -121050 -213743 167807 77294
10544B67971a06249I0441a11989A99681b69296e0264m7550C44766a63956k57675
$$ 267971 -106249 90441 -111989 199681 -269296 -50264 -97814 344766 -163956 -421631
10534d21631A17151b2464A0321J20165a86001J3553j21517c6624n662N653n1305
$$ -421631 117151 -22464 10321 130486 -186001 -172448 -293965 -36624 -42286 -36633 -87938
10523h7938C9047J81783c31471G983P9121B5537b62946o5021A18617J96667A21736
$$ -87938 39047 220830 -331471 7983 87104 25537 -262946 -327967 118617 315284 121736
10511d0281C9712L7466L58405f8339k68576B98521b46842j03953J30441i1022
$$ -40281 39712 77178 435583 -68339 -336915 298521 -246842 -350795 -220354 -91022
10500C06216A39992c54413h7443O290j63238a04212A29982a43925B54429j2778
$$ 306216 139992 -354413 -87443 -81153 -244391 -104212 129982 -143925 254429 241651
10490B41651C9214f8666A03217J1725M9830P446a22574q6787A64697K53562A66844
$$ 241651 39214 -68666 103217 114942 164772 172218 -122574 -209361 164697 418259 166844
10478C72026P4129A16043M2191l5882c0562k61989J0491B8145d39593A25786a36196
$$ 372026 446155 116043 158234 122352 -30562 -292551 -282060 28145 -439593 125786 -136196
10466H3895b21639K2452I8631C1080i1682r0275A75687I373M3077b3931j59655
$$ 83895 -221639 -199187 98631 31080 -91682 -181957 175687 9373 52450 -23931 -183586
10455a83586A2208c63192e652j57599j24760Q6008h5019m4834e9496B06610l8044
$$ -183586 12208 -363192 -5652 -163251 -288011 -202003 -85019 -129853 -59496 206610 168566
10444A68566E5713c46993B43166n0713C1975b13746A07109e8540k78827i5369
$$ 168566 55713 -346993 243166 192453 31975 -213746 107109 -58540 -337367 -95369
10433b05226a00885h057j92684D1429P4409a04587c7902A2874L33143F06h9974
$$ -205226 -100885 -8057 -200741 41429 115838 -104587 -37902 12874 346017 606 -89974
10421A2662K99873c9432k89780B79919a07521A03269c3604H1266b51982F0906
$$ 12662 312535 -39432 -329212 279919 -107521 103269 -33604 81266 -251982 60906
10410h2406A06365b83050J07316A30088a75436F3220a10623B80838b91451h4885
$$ -82406 106365 -283050 -175734 130088 -175436 63220 -110623 280838 -291451 -84885
10399A35696L8456A3814b55000g1988C56493a44625A99276r4157N6272K2328G6987
$$ 135696 174152 13814 -255000 -71988 356493 -144625 199276 105119 161391 183719 76987
10387C24187l4321A16942d41A99208O2073b4675f963B29854O8201j44330J68868
$$ 324187 289866 116942 -441 199208 261281 -24675 -6963 229854 298055 153725 322593
10376C22593q8914J6228M8082n1914J41955n1862o1837I6324L60957B24903L3996
$$ 322593 233679 249907 297989 246075 388030 336168 274331 96324 457281 224903 258899
10365B58899K02095k8855j18423J77158p9367j48099G8129J62426M2737j39848
$$ 258899 460994 432139 313716 490874 411507 263408 78129 240555 283292 143444
10355A43444O3233o4735Q0961L78450n2427l3244N18295B35952K8007L90760B93460
$$ 143444 206677 141942 222903 601353 548926 515682 1033977 235952 263959 654719 293460
10343D57379K95171k29133j31940m6976j15455J59883b79990C67368j78604J79559
$$ 457379 752550 523417 391477 344501 229046 388929 -279990 367368 188764 368323
10333C68323A47222a7926B11171g7683H1789J40782e3836B52324A1658c4526D24560
$$ 368323 147222 -17926 211171 -77683 81789 222571 -53836 252324 11658 -34526 424560
10321B82145o0138j4923J05683d1584A69240C7794b62766H2258c1365p985G5457
$$ 282145 222007 207084 312767 -41584 169240 37794 -262766 82258 -31365 -39350 75457
10309A11476b67795A87340J84927A57068a31794K8553j08821e6370j55813A75897
$$ 111476 -267795 187340 372267 157068 -131794 -103241 -212062 -56370 -212183 175897
10298F3333J24653h4666A84484a2154I8790D2702a36379C4471L24935e2291k19717
$$ 63333 187986 -84666 184484 -12154 98790 42702 -136379 34471 359406 -52291 -272008
10287b72008c1714r214B5594a8457B536Q8262b43967k4539F4595h061j25304a3231
$$ -272008 -31714 -40928 25594 -18457 2536 90798 -243967 -268506 64595 -8061 -133365 -13231
10274B3784b2490j911r1589F6390J07581E8632a46632k48714I664J37374g0848
$$ 23784 -22490 -24401 -115990 66390 173971 58632 -146632 -395346 9664 147038 -70848
10262A06318K0484D4602L44497C0612d741C49608d2595B04894c3882G3897J48847
$$ 106318 126802 44602 389099 30612 -4741 349608 -42595 204894 -33882 73897 222744
10251B22744A03935b630k80524A55315b3033j27113L1093i180j21944A06958a58022
$$ 222744 103935 -2630 -283154 155315 -23033 -150146 -119053 -9180 -131124 106958 -158022
10239F2179a93087h8633m8856A15582m3868K51204g0405B62098b08234a4016A2680
$$ 62179 -193087 -88633 -137489 115582 71714 322918 -70405 262098 -208234 -14016 12680
10227b34445A58265B1096J84717P5235i8438a4862A26966n3917a34193C0639b51693
$$ -234445 158265 21096 205813 281048 -98438 -14862 126966 73049 -134193 30639 -251693
10215b9003A92338n7187m8528k4828c14663J43829P6806j62220M6938j65786J82273
$$ -29003 192338 135151 86623 61795 -314663 -170834 -94028 -256248 -209310 -375096 -192823
10204a92823A80749g1161D3707d2698J7500B63688B5866J3084b39552O9444P8281
$$ -192823 180749 -71161 43707 -42698 -25198 263688 25866 38950 -239552 -170108 -91827
10193i1827F3883f270r2594b4925j32341k2120A09767b32839j94391J52404B7702
$$ -91827 63883 -6270 -98864 -24925 -157266 -179386 109767 -232839 -427230 -274826 27702
10181g8547H7928a70858r0427A5279C224J79358f0808a2573A05825a94912A12110
$$ -78547 87928 -170858 -261285 15279 3224 182582 -60808 -12573 105825 -194912 112110
10169a7397A01229c4304J1807G1899j3998a28253A28056h3789F949e25558h5135
$$ -17397 101229 -34304 -22497 71899 57901 -128253 128056 -83789 6949 -525558 -85135
10157c1307H3015a74712B1417g0919q1101j5768E0220L14452b01245k76241E1823
$$ -31307 83015 -174712 21417 -70919 -152020 -167788 50220 364672 -201245 -477486 51823
10145I7402b04738H884b0665j78323j54878B45257b60484O1583C3565K455J19991
$$ 97402 -204738 8884 -20665 -198988 -353866 245257 -260484 -198901 33565 36020 156011
10134A56011c6326j05651j29112A05117D3348h618l75556a23838j19696A50453
$$ 156011 -36326 -141977 -271089 105117 43348 -8618 -384174 -123838 -243534 150453
10123a59782B21189a26763A52764c9872j91112A52969l6469a68735E5068k3383
$$ -159782 221189 -126763 152764 -39872 -230984 152969 116500 -168735 55068 31685
10113C1685J03213O4669a8126l62493p0280i7546j17340a05386q4534A8254J55836
$$ 31685 134898 199567 -18126 -380619 -450899 -97546 -214886 -105386 -189920 18254 174090
10102A74090d5469p3839j01192A53739a37764j86861J13957g6639C3951K6713
$$ 174090 -45469 -119308 -220500 153739 -137764 -324625 -210668 -76639 33951 60664
10092F0664c3769j7665k43579A38904e0884C5256K6617F793a96987A17799b91247
$$ 60664 -33769 -51434 -295013 138904 -50884 35256 61873 6793 -196987 117799 -291247
10080a10171B1495M4815a79826E3306E267b3004l33235J39794J06575B2699a93808
$$ -110171 21495 66310 -179826 53306 5267 -23004 -356239 -216445 -109870 22699 -193808
10068G4772C1533J32414b48984R6556D3063J40449b64231M47D6714Q8348b14821
$$ 74772 31533 163947 -248984 -152428 43063 183512 -264231 -263784 46714 135062 -214821
10056b43100Q7403k2096N7600A09308B1282a06755c9652a872G6489A6023a82515
$$ -243100 -155697 -177793 -120193 109308 21282 -106755 -39652 -1872 76489 16023 -182515
10044a38046n5168j76987a16081A79442a60642j5771N5663j17880P5314n0815
$$ -138046 -193214 -370201 -116081 179442 -160642 -176413 -120750 -238630 -163316 -214131
10034b14131B1372J237N7670O0727o9821J55935b34599b5138C281i6238A09670
$$ -214131 21372 22609 80279 141006 71185 227120 -234599 -25138 3281 -96238 109670
10022B9002c64578j69998b14274n5200e7455j46541L7371M3621k42849a68835
$$ 29002 -364578 -534576 -214274 -269474 -57455 -203996 -166625 -123004 -365853 -168835
10011c7580C5188b05063f0098j2608H2927a54562N649D320M2547c92040J05922
$$ -37580 35188 -205063 -60098 -72706 82927 -154562 -148913 4320 46867 -392040 -286118
10000b86118j7734c8603l8227j03610o2573A91022i8044j06712H3048a16296E2893
$$ -286118 -303852 -38603 -76830 -180440 -243013 191022 -98044 -204756 83048 -116296 52893
9988a10537B66832a01707A32383E7483g882A06271N7594h8768b7767r7237k1619
$$ -110537 266832 -101707 132383 57483 -7882 106271 163865 -88768 -27767 -125004 -146623
9977a46623m6930A5230h4228I4177b2840I383c08902B6324b47729j36992n5458
$$ -146623 -193553 15230 -84228 94177 -22840 9383 -308902 26324 -247729 -384721 -440179
9966d40179a47757F2831c06130a28410O2200a8948B66212b46711e5867C37091
$$ -440179 -147757 62831 -306130 -128410 -66210 -18948 266212 -246711 -55867 337091
9955b3927A83235c23721h3027A06913a34519p7293D3511a65977F8142c1679D7851
$$ -23927 183235 -323721 -83027 106913 -134519 -211812 43511 -165977 68142 -31679 47851
9943a81589C3313a69356D15913c5878B53387c0132l8006C03691A47563c4449D9503
$$ -181589 33313 -169356 415913 -35878 253387 -30132 -68138 303691 147563 -34449 49503
9931b24956g5964m1422k6745b4066k288j1895k13597g6089B56273a28902C78946
$$ -224956 -75964 -117386 -144131 -24066 -26354 -38249 -251846 -76089 256273 -128902 378946
9919d21782h1343B0351M2303J34441b67233A62987n3468C0982a38871f8951l1468
$$ -421782 -81343 20351 62654 197095 -267233 162987 109519 30982 -138871 -68951 -100419
9908a00419k334m11537a68230j328J3936L5822A31326b77488a36411A08840J22809
$$ -100419 -102753 -514290 -168230 -169558 -155622 -119800 131326 -277488 -136411 108840 231649
9897B31649d39147O4413h675D16038a6979A95459b62589c001r524p5202h551B35947
$$ 231649 -439147 -374734 -8675 416038 -16979 195459 -262589 -3001 -12525 -87727 -8551 235947
9884E4536a20654a8367k80361A8945b6499B66951I0089c09515n231A27154C2712
$$ 54536 -120654 -18367 -298728 18945 -26499 266951 90089 -309515 -314746 127154 32712
9872b1620E9495b14322L7802O0056I1854N6593c47954c5648k76065J32704D1683
$$ -21620 59495 -214322 -176520 -116464 91854 148447 -347954 -35648 -311713 -179009 41683
9860c0293j70547l333a2515H7025M839a30578P200l5096m0731B01841c6847J4553
$$ -30293 -200840 -204173 -12515 87025 91864 -130578 -123378 -158474 -199205 201841 -36847 -22294
9848b2294m0841A69261b885D6688a67369j70393b9131A0081a33374j09906h062
$$ -22294 -63135 169261 -2885 46688 -167369 -337762 -29131 10081 -133374 -243280 -8062
9836b6964n8665c1563j12541A48705a21949M8753D5662c4515a0299A49365e3042
$$ -26964 -85629 -31563 -144104 148705 -121949 -73196 45662 -34515 -10299 149365 -53042
9824c0032k18749j01570J48268d7533j17648A6149b54473i8297A6929i3560H0451
$$ -30032 -248781 -350351 -202083 -47533 -165181 16149 -254473 -98297 16929 -93560 80451
9812e510j93826A97659c00349a19309i017A68248G3156B4349F804a8525D6400
$$ -5510 -199336 197659 -300349 -119309 -9017 168248 73156 24349 6804 -18525 46400
9800C00215a17617E3868e8073C299J01791b54443R1180M7087l07527B42293C795
$$ 300215 -117617 53868 -58073 3299 105090 -254443 -163263 -116176 -423703 242293 3795
9788A2025Q7384m1092L3945J16757B8300h3598k42572H2933h22p9864A71113c5263
$$ 12025 99409 58317 92262 209019 28300 -83598 -326170 82933 -822 -80686 171113 -35263
9775e6444j95001i093k23092a06672c4680A04311d64710c3439j2046p2815j7288
$$ -56444 -251445 -9093 -232185 -106672 -34680 104311 -464710 -33439 -45485 -118300 -135588
9764a35588a5287C54372A05974j4332J71094c8818a2726D0172a18833k04488C28779
$$ -135588 -15287 354372 105974 91642 262736 -38818 -12726 40172 -118833 -323321 328779
9752h2914j07641P2374M4525I4838a78405g3816o0982N9056j12397e7840A8589
$$ -82914 -190555 -118181 -73656 94838 -178405 -73816 -134798 -75742 -188139 -57840 18589
9740D8524a80792A32764k0587c5211j57656A16436a82668g1335j31401r0861e1312
$$ 48524 -180792 132764 112177 -35211 -192867 116436 -182668 -71335 -202736 -293597 -51312
9728a60295N1561l1898J6904A21113m0288d216j50725C55124A31633h1174k03083
$$ -160295 -108734 -140632 -123728 121113 80825 -4216 -154941 355124 131633 -81174 -284257
9717b84257l1653g9777j7341A34052b01328L6163j01367C52025a52158B89494
$$ -284257 -315910 -79777 -97118 134052 -201328 -165165 -266532 352025 -152158 289494
9706a39450A5377b2837o5676C1574a17919j67321e1210B37424a2607j32649j72104
$$ -139450 15377 -22837 -88513 31574 -117919 -285240 -51210 237424 -12607 -145256 -317360
9695c17360b7112o8248B117b51834A2210b18550A28431b3587j14392C6768M9488
$$ -317360 -27112 -95360 2117 -251834 12210 -218550 128431 -23587 -137979 36768 86256
9684H6256e57541a02482B28455b62026F1030K6917h1622I1111a99731m6844k3563
$$ 86256 -557541 -102482 228455 -262026 61030 87947 -81622 91111 -199731 -246575 -270138
9673b70138h8964a1725j22444J7965j97740J52330o2107M2665a9901I4271e98
$$ -270138 -88964 -11725 -134169 -116204 -313944 -161614 -223721 -181056 -19901 94271 -598
9661C17068A2974e8707k40531P6257k9887G658K01090A0972J28711a14072k32529
$$ 317068 12974 -58707 -299238 -222981 -252868 7658 208748 10972 139683 -114072 -346601
9650c46601a16702L5608F6306b31847j7578B28134c0356j35313l3659J6694f4916
$$ -346601 -116702 -81094 66306 -231847 -249425 228134 -30356 -165669 -199328 -182634 -64916
9638D2346c22926a26921j09773g8501G1365k3906a98914A19374c24420I3983c6377
$$ 42346 -322926 -126921 -236694 -78501 71365 47459 -198914 119374 -324420 93983 -36377
9626A2048b17425b298l75728I6860N6358l2672j7489h3733k42334a13773j81732
$$ 12048 -217425 -2298 -378026 96860 153218 120546 103057 -83733 -326067 -113773 -295505
9615b95505A5212J4812b41362a09625I628a65189p8449M210r7632A59896k7798
$$ -295505 15212 30024 -241362 -109625 9628 -165189 -243638 -239428 -337060 159896 132098
9604A32098b4475k1514A10920a54820l1968I537N4577A2373g5769A35979a43553
$$ 132098 -24475 -45989 110920 -154820 -186788 9537 64114 12373 -75769 135979 -143553
9592a0604k66472J30546b3557C1621h4601K2039D1556d1970G0436f4501m8471
$$ -10604 -277076 -146530 -23557 31621 -84601 -62562 41556 -41970 70436 -64501 -112972
9581a12972j13151d6487A55672K02260a84814P0366q4152B14990g7259r7926d5859
$$ -112972 -226123 -46487 155672 357932 -184814 -114448 -198600 214990 -77259 -175185 -45859
9569B36825b05245a1192j63041c1074N486I4001L42961A7096J77920a33059j31450
$$ 236825 -205245 -11192 -174233 -31074 -25588 94001 436962 17096 195016 -133059 -264509
9558b64509a05133B0678P4656a03229q8609m35494A7982K39549b16835l306C01762
$$ -264509 -105133 20678 95334 -103229 -191838 -627332 17982 257531 -216835 -220141 301762
9546b11507H0402e7694k0867I3077j873C141a36338f5932A2771b84760a8947A8351
$$ -211507 80402 -57694 -78561 93077 91204 3141 -136338 -65932 12771 -284760 -18947 18351
9533a94565E9836a66746C8283e20386a17626G2066A4528L15140A02412a79933
$$ -194565 59836 -166746 38283 -520386 -117626 72066 14528 329668 102412 -179933
9522A70604G7392b00750j13313J03840k7751r7142g2852m7844F6662k9005b6872
$$ 170604 77392 -200750 -314063 -210223 -237974 -335116 -72852 -120696 66662 37657 -26872
9510b74735k358P9254L8500g0641A53000M7934b52262a3630j27650O0249B35617
$$ -274735 -277093 -197839 -159339 -70641 153000 200934 -252262 -13630 -141280 -81031 235617
9498a27738R70A88069L1709K6447a76184J9969j56083c570j03935Q278A16090
$$ -127738 -126768 188069 219778 246225 -176184 -156215 -312298 -3570 -107505 -99227 116090
9486b07078E489J29032d36180a07121j34466J12993L9006j28719n1557A40751
$$ -207078 5489 134521 -436180 -107121 -241587 -128594 -89588 -218307 -269864 140751
9475e6889r6487q8516O9020K500l0947G6635J01877c6442q520j3356F2760b12973
$$ -56889 -153376 -241892 -172872 -170372 -201319 76635 178512 -36442 -44962 -58318 62760 -212973
9462a39562j57782I6370K43530j9025c12899P9431A35097b92496i5924L6866m8870
$$ -139562 -297344 96370 339900 320875 -312899 -233468 135097 -292496 -95924 -59058 -107928
9451a07928a6125j48623E7137a45893i239k82024i773j99657m5259J21495A72479
$$ -107928 -16125 -164748 57137 -145893 -9239 -291263 -9773 -209430 -254689 -133194 172479
9439a74945K7720m7333k41106C3896Q011N9718K7797a39058i82l31115C88885
$$ -174945 -147225 -194558 -435664 33896 41907 101625 129422 -139058 -982 -332097 388885
9427A01314b93138B84122F6598g5901i009I4662f0945C53963a66082A48544L1016
$$ 101314 -293138 284122 66598 -75901 -9009 94662 -60945 353963 -166082 148544 179560
9416A79560b83281A94696J78902a77123c282j23195A51647a30702E0403B3687
$$ 179560 -283281 194696 373598 -177123 -3282 -126477 151647 -130702 50403 23687
9405E6159O5378E0250c93961A58059c2534k62196b1653J0177n14599B70162E0930
$$ 56159 121537 50250 -393961 158059 -32534 -294730 -21653 -11476 -526075 270162 50930
9393a79764h3851q9427j9577K6007P7915a8686p1873M4565A52613p1274l0518
$$ -179764 -83851 -173278 -192855 -166848 -88933 -18686 -90559 -45994 152613 81339 50821
9382E0821f2678n5841l245j99177R9008j24721C7628a9983G5519k6547d1415j23012
$$ 50821 -62678 -118519 -121764 -320941 -221933 -346654 37628 -19983 75519 48972 -41415 -164427
9370a64427b8138H9412J0394J23930H6188l3300K1884a71297M1185f2962E3055
$$ -164427 -28138 89412 99806 223736 86188 52888 74772 -171297 -130112 -62962 53055
9358g0546C0831a90663K5763L3576H7426c88652O1986J61233j2615A09032C2619
$$ -70546 30831 -190663 -164900 -131324 87426 -388652 -326666 -165433 -178048 109032 32619
9346c9067B87897a27488i262F7341a50522A2402g7984k85375A31450b86140J07439
$$ -39067 287897 -127488 -9262 67341 -150522 12402 -77984 -363359 131450 -286140 -178701
9335a78701P1675n304A64869c70161a6033D694J33515M6808a96667C01063e7430
$$ -178701 -107026 -112330 164869 -370161 -16033 4694 138209 185017 -196667 301063 -57430
9323H649b41748e455n23889A91070b77505A86804d6730B67178e5078j53526b3282
$$ 8649 -241748 -5455 -529344 191070 -277505 186804 -46730 267178 -55078 -208604 -23282
9311B35948d10378J79225B19100g7958a2443H6172c02902k8692a26359A1403E453
$$ 235948 -410378 -231153 219100 -77958 -12443 86172 -302902 -331594 -126359 11403 5453
9299b73080b5822B41279d73926K30665d3197l9148F3681a30730k16900D527i1866
$$ -273080 -25822 241279 -473926 -243261 -43197 -82345 63681 -130730 -347630 4527 -91866
9287a39789L5350E3798B0305b53717A36515m0277M5370k919O359F6602N1382m3469
$$ -139789 -104439 53798 20305 -253717 136515 96238 141608 138689 145048 66602 117984 74515
9275G4515K9108a65395A31299b67547O9210A26618n2598b78001h2623o9048e0340
$$ 74515 103623 -165395 131299 -267547 -198337 126618 74020 -278001 -82623 -151671 -50340
9263E3323f1281A21269l5598m0152J2302a49453d9897j08722j5781D662g9662
$$ 53323 -61281 121269 85671 45519 57821 -149453 -49897 -158619 -174400 4662 -79662
9251b12082A10757c2126D862K46743b20633f7190h619m8809n4710b8948C32165
$$ -212082 110757 -32126 4862 251605 -220633 -67190 -8619 -57428 -112138 -28948 332165
9239C10270A43352l6802B3630c6145B36763c41354F3457q268h3823A71144H5208
$$ 310270 143352 106550 23630 -36145 236763 -341354 63457 55189 -83823 171144 85208
9227c3490B73914b12071B03580a39950C5030a36588L246j83419g6212j07477H8647
$$ -33490 273914 -212071 203580 -139950 35030 -136588 -133342 -316761 -76212 -183689 88647
9215I605h4984d2254L938p2711j33918C3557L6677b05842e2382m9673A04202D9830
$$ 9605 -84984 -42254 -38316 -111027 -244945 33557 70234 -205842 -52382 -102055 104202 49830
9202C00230a03472j51744J13056g311o4313J0757j21199B7507K48203a67101j09680
$$ 300230 -103472 -255216 -142160 -7311 -71624 -60867 -182066 27507 275710 -167101 -276781
9191b76781P3979B50187A6157a53238A1948L46185a650o2376A56461i164o3398
$$ -276781 -202802 250187 16157 -153238 11948 358133 -1650 -64026 156461 -9164 -72562
9180g2562j37373R3500m3774e8089A31155c42736j12264C12773b5520A64499A630
$$ -72562 -209935 -116435 -160209 -58089 131155 -342736 -455000 312773 -25520 164499 1630
9168i5237l3940Q408A0628K7851h5639B28762c87725J34905k9057R1227G3887
$$ -95237 -129177 -120769 10628 38479 -85639 228762 -387725 -252820 -281877 -190650 73887
9156a25042M4477A28077a09342B7941b32205D6390P684a1812k92291A02094K01709
$$ -125042 -80565 128077 -109342 27941 -232205 46390 54074 -11812 -304103 102094 303803
9145C03803A8614M4107b00587a2040B21169f7488D7i9676E4926G916b1811r0201
$$ 303803 18614 62721 -200587 -12040 221169 -67488 47 -99676 54926 7916 -21811 -112012
9133a12012B65065b60992e7908j31825I2604J09282e0034m1977c4310B70666j19177
$$ -112012 265065 -260992 -57908 -189733 92604 201886 -50034 -92011 -34310 270666 151489
9122A51489a58125K9626N559j34778A40055a76384f6759l00762A29952D6724b18996
$$ 151489 -158125 -128499 -122940 -257718 140055 -176384 -66759 -367521 129952 46724 -218996
9110d50570B22117a72238f6365A34372b27163G4363i2770l0994d531j67599j0493
$$ -450570 222117 -172238 -66365 134372 -227163 74363 -92770 -123764 -4531 -172130 -182623
9099a82623j77224A29390c86958f4459A54749a0881r8854J0498A4447a78242k43064
$$ -182623 -359847 129390 -386958 -64459 154749 -10881 -109735 -99237 14447 -178242 -421306
9088d21306A94812i0939k9772G6039K1413a9358B3807K8903c28013a2284n8817
$$ -421306 194812 -90939 -120711 76039 97452 -19358 23807 52710 -328013 -12284 -71101
9077g1101r6406M7723k74356a21378a7123j32438g4722A32610c37995a35317H255
$$ -71101 -167507 -119784 -394140 -121378 -17123 -149561 -74722 132610 -337995 -135317 8255
9065a20860j62822m9947a26044k15559R2055D9078b49368k5364J12910c9749F0448
$$ -120860 -283682 -333629 -126044 -341603 -249548 49078 -249368 -274732 -161822 -39749 60448
9053a20508O823L6177A11936k4546J15448b05399m5144a00146A15251d13188A58451
$$ -120508 -113685 -77508 111936 87390 202838 -205399 -250543 -100146 115251 -413188 158451
9041A84158b64542f2413l9154j53826B39415d2478E7499b67657N9002A20815a84903
$$ 184158 -264542 -62413 -101567 -255393 239415 -42478 57499 -267657 -208655 120815 -184903
9029A1313O3878J14318a34289J8473d4365n346b660k03736M2535k01670J59907
$$ 11313 75191 189509 -134289 -115816 -44365 -49711 -2660 -206396 -163861 -365531 -205624
9018b05624k34045M1254a14260A0945N6238f4987I9393J06720E707O2084b7080
$$ -205624 -439669 -398415 -114260 10945 67183 -64987 99393 206113 5707 67791 -27080
9006i0104r0001B0798a89242j58831J42813e6650G3477Q5673b11964k8643G2277
$$ -90104 -180105 20798 -189242 -348073 -205260 -56650 73477 159150 -211964 -240607 72277
8994a66715B11512d0707a9992F0499a81144C5556c84204D8519r784f859m2824
$$ -166715 211512 -40707 -19992 60499 -181144 35556 -384204 48519 38735 -6859 -49683
8983d9683A29824h5979K1680G223a32050f3611j09182j7223G6860J0723a01491
$$ -49683 129824 -85979 -64299 7223 -132050 -63611 -172793 -190016 76860 87583 -101491
8971a66486A05965l2215a59353E407J28159i0210L0717k22594a30703B42617I1909
$$ -166486 105965 73750 -159353 5407 133566 -90210 -59493 -282087 -130703 242617 91909
8959a66360I4066a8212A30762h6056F0056d16078F501f2557a6974E4949a21656
$$ -166360 94066 -18212 130762 -86056 60056 -416078 6501 -62557 -16974 54949 -121656
8947A17569g9718B8867J09489j4342g1884a6124G1280a58016r2667L6903D9373
$$ 117569 -79718 28867 138356 124014 -71884 -16124 71280 -158016 -250683 -213780 49373
8935i9907K5538j4370A15418a10436J0546A01549K28597a52638B9462J5822P0947
$$ -99907 -74369 -88739 115418 -110436 -99890 101549 330146 -152638 29462 45284 116231
8924A16231a96537C74607I2863J96573h0343B8079c18472A88304I0812L2131C1333
$$ 116231 -196537 374607 92863 289436 -80343 28079 -318472 188304 90812 122943 31333
8912a79395N5327b7203m7984r7487B1132L5163c12704h4065j0102L3211C02900
$$ -179395 -124068 -27203 -75187 -172674 21132 56295 -312704 -84065 -94167 -60956 302900
8900b14762A41184a77814h4879H3882J76989j20464G293b09425a4127k08744C1789
$$ -214762 141184 -177814 -84879 83882 260871 140407 7293 -209425 -14127 -222871 31789
8888b85148G3702f1698A1695O4240b03432J9713e9411j62163H9554J55263f4167
$$ -285148 73702 -61698 11695 75935 -203432 -183719 -59411 -221574 89554 244817 -64167
8876a55124k43O5679j98291N7715O6403h1184p3373j39669B05719r1932E4762
$$ -155124 -155367 -89688 -287979 -230264 -163861 -81184 -154557 -294226 205719 113787 54762
8864D2941a30759d8424l8868G6853J05355G6530q205J6319D820B015a58799j40874
$$ 42941 -130759 -48424 -87292 76853 182208 76530 68325 84644 4820 2015 -158799 -299673
8852b99673f9294r7515m9005B38538a63462P9974m7890A18541b00281H3101N102
$$ -299673 -69294 -166809 -215814 238538 -163462 -83488 -131378 118541 -200281 83101 88203
8841H8203i4329r0686C3364a90512R2691j6653j5483C81626a28185j41347J27659
$$ 88203 -94329 -185015 33364 -190512 -97821 -114474 -129957 381626 -128185 -269532 -141873
8830a41873B75434a1727B58372h9715A10382J88765c80653a0222j76535g942A05451
$$ -141873 275434 -11727 258372 -89715 110382 299147 -380653 -10222 -186757 -7942 105451
$$ [...]
##END NTUPLES=NMR SPECTRUM
##END=
