##TITLE=AC1712_14FALM0001_8743523_LyKpv0qBwT
##JCAMPDX= 6.0         $$ Bruker NMR JCAMP-DX V2.0
##DATA TYPE= NMR SPECTRUM
##DATA CLASS= NTUPLES
##ORIGIN= BRUKER
##OWNER= Administrator
$$ 1.72 TOPSPIN		Version 2.1
$$ 2015-08-11 16:51:56.554 -0700  Administrator@X
$$ Compression mode = diff/dup
##.OBSERVE FREQUENCY= 400.02188249412
##.OBSERVE NUCLEUS= ^1H
##.ACQUISITION MODE= SIMULTANEOUS (DQD)
##.ACQUISITION SCHEME= undefined
##.AVERAGES= 8
##.DIGITISER RES= 22
##SPECTROMETER/DATA SYSTEM= spect
##.PULSE SEQUENCE= zg30
##.SOLVENT NAME= COFFEE_meoh
##.SHIFT REFERENCE= INTERNAL, COFFEE_meoh, 1, 14.98509
##AUDIT TRAIL= $$ (NUMBER, WHEN, WHO, WHERE, PROCESS, VERSION, WHAT)
$$ ##TITLE= Audit trail, TOPSPIN		Version 2.1
$$ ##JCAMPDX= 5.01
$$ ##ORIGIN= Bruker BioSpin GmbH
$$ ##OWNER= Administrator
$$ $$ E:\/data/COFFEE/nmr/AC1712_14FALM0001_8743523_LyKpv0qBwT/60/pdata/1/auditp.txt
$$ ##AUDIT TRAIL=  $$ (NUMBER, WHEN, WHO, WHERE, PROCESS, VERSION, WHAT)
(   1,<2015-08-11 16:51:49.039 -0700>,<Administrator>,<X>,<go>,<TOPSPIN 2.1>,
      <created by zg
	started at 2015-08-11 16:50:42.710 -0700,
	POWCHK enabled, PULCHK disabled,
       configuration hash MD5:
       21 0F 79 D6 B3 7B B4 F6 88 20 88 DB 03 48 BD 9F
       data hash MD5: 64K
       9F 9C B2 EF 5E 11 F8 1F 57 B1 06 AE E3 AA D0 4C>)
(   2,<2015-08-11 16:51:52.335 -0700>,<Administrator>,<X>,<proc1d>,<TOPSPIN 2.1>,
      <Start of raw data processing
       efp LB = 0 FT_mod = 6 PKNL = 1 PHC0 = 0 PHC1 = 0 SI = 32K 
       data hash MD5: 32K
       11 0A 2F D7 06 33 7A 1B C3 6D 4F 4A F3 6E 83 81>)
(   3,<2015-08-11 16:51:52.617 -0700>,<Administrator>,<X>,<proc1d>,<TOPSPIN 2.1>,
      <pk PHC0 = 89.40674 PHC1 = 0 
       data hash MD5: 32K
       DA 15 C7 7A 20 13 EA 29 DD 2D ED F9 14 15 5D 1A>)
(   4,<2015-08-11 16:51:52.726 -0700>,<Administrator>,<X>,<proc1d>,<TOPSPIN 2.1>,
      <abs ABSG = 1 
       data hash MD5: 32K
       E9 87 7E 01 0F F4 19 D6 72 04 9F 07 5F 63 86 FF>)
(   5,<2015-08-11 16:51:52.789 -0700>,<Administrator>,<X>,<proc1d>,<TOPSPIN 2.1>,
      <abs ABSG = 2 
       data hash MD5: 32K
       DC 0F 38 09 03 63 A7 BC 04 52 70 70 3D 1F 65 AE>)
(   6,<2015-08-11 16:51:52.851 -0700>,<Administrator>,<X>,<proc1d>,<TOPSPIN 2.1>,
      <abs ABSG = 3 
       data hash MD5: 32K
       98 16 38 0E 2C 2B F7 95 6B F1 66 F4 FF 0F C4 D0>)
(   7,<2015-08-11 16:51:52.914 -0700>,<Administrator>,<X>,<proc1d>,<TOPSPIN 2.1>,
      <abs ABSG = 4 
       data hash MD5: 32K
       FC D0 DB B1 D3 55 85 BB 59 CF CD F2 7C 8E 2C F9>)
(   8,<2015-08-11 16:51:52.976 -0700>,<Administrator>,<X>,<proc1d>,<TOPSPIN 2.1>,
      <abs ABSG = 5 
       data hash MD5: 32K
       29 BB 55 59 7B A1 BE 51 F6 61 2A 0F 86 15 EB 2B>)
$$ ##END=
$$ 
$$ $$ hash MD5
$$ $$ 57 A4 14 D8 7B 5E 7C 92 DE D6 98 29 68 C7 74 F7
##$RELAX= 
##$RELAX= 
##$RELAX= 
##$RELAX= 
##$RELAX= 
##$RELAX= 
##$RELAX= 
$$ Bruker specific parameters
$$ --------------------------
##$DU= <E:\>
##$EXPNO= 60
##$NAME= <AC1712_14FALM0001_8743523_LyKpv0qBwT>
$$ [...]
##$TP= (0..7)
150 150 150 150 150 150 150 150
##$TP07= 0
##$TPNAME0= <>
##$TPNAME1= <>
##$TPNAME2= <>
##$TPNAME3= <>
##$TPNAME4= <>
##$TPNAME5= <>
##$TPNAME6= <>
##$TPNAME7= <>
##$TPOAL= (0..7)
0.5 0.5 0.5 0.5 0.5 0.5 0.5 0.5
##$TPOFFS= (0..7)
0 0 0 0 0 0 0 0
##$TUNHIN= 0
##$TUNHOUT= 0
##$TUNXOUT= 0
##$USERA1= <user>
##$USERA2= <user>
##$USERA3= <user>
##$USERA4= <user>
##$USERA5= <user>
##$V9= 5
##$VALIST= <valist>
##$VCLIST= <CCCCCCCCCCCCCCC>
##$VD= 0
##$VDLIST= <DDDDDDDDDDDDDDD>
##$VPLIST= <PPPPPPPPPPPPPPP>
##$VTLIST= <TTTTTTTTTTTTTTT>
##$WBST= 2048
##$WBSW= 25
##$XGAIN= (0..3)
0 0 0 0
##$XL= 0
##$YL= 0
##$YMAX_a= 602557
##$YMIN_a= -518338
##$ZGOPTNS= <>
##$ZL1= 120
##$ZL2= 120
##$ZL3= 120
##$ZL4= 120
##$ABSF1= 14.98509
##$ABSF2= -5.573092
##$ABSG= 5
##$ABSL= 3
##$ALPHA= 0
##$AQORDER= 0
##$ASSFAC= 0
##$ASSFACI= 0
##$ASSFACX= 0
##$ASSWID= 0
##$AUNMP= <proc_prof1d_extract_pilot.lims>
##$AXLEFT= 0
##$AXNAME= <>
##$AXNUC= <1H>
##$AXRIGHT= 0
##$AXTYPE= 0
##$AXUNIT= <>
##$AZFE= 0.1
##$AZFW= 0.1
##$BCFW= 0
##$BC_mod= 0
##$BYTORDP= 0
##$COROFFS= 0
##$CY= 15
##$DATMOD= 1
##$DC= 0
##$DFILT= <>
##$DTYPP= 0
##$F1P= 0
##$F2P= 0
##$FCOR= 0.5
##$FTSIZE= 32768
##$FT_mod= 6
##$GAMMA= 0
##$GB= 0
##$INTBC= 1
##$INTSCL= 1
##$ISEN= 128
##$LB= 0
##$LEV0= 0
##$LPBIN= 0
##$MAXI= 10000
##$MC2= 0
##$MEAN= 0
##$ME_mod= 0
##$MI= 0
##$NCOEF= 0
##$NC_proc= -8
##$NLEV= 6
##$NOISF1= 0
##$NOISF2= 0
##$NSP= 0
##$NTH_PI= 0
##$NZP= 0
##$OFFSET= 14.98509
##$PC= 1
##$PHC0= 89.40674
##$PHC1= 0
##$PH_mod= 1
##$PKNL= yes
##$PPARMOD= 0
##$PPDIAG= 0
##$PPIPTYP= 0
##$PPMPNUM= 2147483647
##$PPRESOL= 1
##$PSCAL= 4
##$PSIGN= 0
##$PYNMP= <proc.py>
##$REVERSE= no
##$SF= 400.02
##$SI= 32768
##$SIGF1= 0
##$SIGF2= 0
##$SINO= 400
##$SIOLD= 32768
##$SPECTYP= <>
##$SREGLST= <1H.CDCl3>
##$SSB= 0
##$STSI= 32768
##$STSR= 0
##$SW_p= 8223.68421052631
##$SYMM= 0
##$S_DEV= 0
##$TDeff= 65536
##$TDoff= 0
##$TI= <>
##$TILT= no
##$TM1= 0
##$TM2= 0
##$TOPLEV= 0
##$USERP1= <user>
##$USERP2= <user>
##$USERP3= <user>
##$USERP4= <user>
##$USERP5= <user>
##$WDW= 1
##$XDIM= 32768
##$YMAX_p= 445469068
##$YMIN_p= -674996
##$CURPLOT= <Network HP LaserJet P1505>
##$CURPRIN= <$Network HP LaserJet P1505>
##$DFORMAT= <normdp>
##$LAYOUT= <+/1D_H.xwp>
##$LFORMAT= <normlp>
##$PFORMAT= <normpl>
##$SURQMSG= 1
$$ End of Bruker specific parameters
$$ ---------------------------------
##NTUPLES= NMR SPECTRUM
##VAR_NAME=  FREQUENCY,     SPECTRUM/REAL,   SPECTRUM/IMAG
##SYMBOL=    X,             R,               I
##VAR_TYPE=  INDEPENDENT,   DEPENDENT,       DEPENDENT
##VAR_FORM=  AFFN,          ASDF,            ASDF
##VAR_DIM=   32768,         32768,           32768
##UNITS=     HZ,            ARBITRARY UNITS, ARBITRARY UNITS
##FACTOR=    0.250966925370066, 1,           1
##FIRST=     8223.43324360094, -202615,      11727
##LAST=      0,             -181418,         -48699
##MIN=       0,             -674996,         0
##MAX=       8223.43324360094, 445469068,    0
$$ Real data points
##PAGE= N=1
##DATA TABLE= (X++(R..R)), XYDATA
$$ [...]
19553i2016j67593A54827J11089a6389j5949j88789r774a04133n066o5192A71177
19541D1909a00822K5128B514a93052h5058G1977m92g362n2852k25884J25328E6830
19528G1871k3567a59132H6615D359M9903a4883D6159d5650j09215A26900J49794
19517B76694A3015b5257F2610d16878A27190b51609A08405a75342D59007a21415
19506b21374E01358c79667A78315L06564c46823A18214c80935e9645j6207i877
19495D3534c4123k23789l1350a17998j5923k07668D26512f6120j79369R7177l37721
19484d86033A77099d51731N0810F9940g4390b4834n7494J9906j44967B12339b63196
19472C9309c21881a4437k92256e7096F5045Q2857e9833R32A58236L838c9682r3958
$$ y = [-92016, -259609, 154827, 265916, -16389, -32338, -221127, -230901, -104133, -109199, -174391, 171177, 41909, -100822, -75694, 2514, -193052, -85058, 71977, 71485, -7362, -60214, -286098, -160770, 56830, 71871, 48304, -159132, 86615, 4359, 54262, -14883, 46159, -45650, -154865, 126900, 276694, 13015, -25257, 62610, -416878, 127190, -251609, 108405, -175342, 459007, -121415, -221374, 501358, -379667, 178315, 484879, -346823, 118214, -380935, -59645, -75852, -9877, 43534, -34123, -257912, -289262, -117998, -133921, -341589, 426512, -66120, -245489, -148312, -486033, 177099, -451731, -400921, 69940, -74390, -24834, -82328, -62422, -207389, 212339, -263196, 39309, -321881, -14437, -306693, -57096, 65045, 147902, -59833, -58901, 158236, 162074, -39682, -133640]
19460a33640d0195j71715h7454A54809p4279d6662o6331J910c6204j52484K4092
19449a64596l7440N2392q565B15624D0123L4043e8801a8045k70020P7921M3567
19438a66577F2597J25163p2774e8597a3895I1992b87560m1864a36464H3336P54
19427H4090K46282a34298o6595b6711k79993a51805H1628c40419J43802P9253
19417a17364B72136A19671b87850a10337d2772j83807J11050k09427f7948j00119
19407a68067J22B1283c3279a6537j37229k56433J24983J15720O0916C7244i1907
19395C4375J0446a1735A29127o461a9356k48439K8697O0828g1537A53425b1223
19383A00212a26674J3673m02541a12509F6559g1465K1191k6621n4226F7748b92021
$$ y = [-133640, -40195, -211910, -87454, 154809, 80530, -46662, -112993, -111083, -36204, -188688, -164596, -202036, -149644, -158209, 215624, 40123, 74166, -58801, -18045, -288065, -210144, -166577, 62597, 187760, 114986, -58597, -13895, 91992, -287560, -329424, -136464, 83336, 84090, 330372, -134298, -200893, -26711, -306704, -151805, 81628, -340419, -196617, -117364, 272136, 119671, -287850, -110337, -42772, -226579, -115529, -324956, -67948, -168067, -167945, 21283, -33279, -16537, -153766, -410199, -285216, -169496, -108580, 37244, -91907, 34375, 44821, -11735, 129127, 122666, -19356, -267795, -239098, -178270, -71537, 153425, -21223, 100212, -126674, -113001, -515542, -112509, 66559, -71465, -50274, -76895, -131121, 67748, -292021]
19371a24149k7500d9645a5076m15174a68769I6554b30610h0700B1113a18249C3406
19359d0057A26218b17590f1009j55048f6876J0j78848q4225A8755b82372f3798
19347C7563e3318p4615j1505j19124A17224b4448H9927c95112e0593k89231C3424
19335a14412j90242M9156a2074F0948a72527k59792g9099j44648L7168m3461J00265
19324a29775B03134F5820a80877O9296j8036D1597N0197g8967q1838f5641C45779
19312b59251q112A24078E1073a82393g5958j52578R6253B54664D5245K67786j4962
19301B98069a4961B8022b2828A65873J0843a6153l7500k6448k60534a16707A5808
19289a61454a5070l7593A31883A0705a22504c8294C4787J84523h197j21701l16469
$$ y = [-124149, -151649, -49645, -15076, -430250, -168769, 96554, -230610, -80700, 21113, -118249, 33406, -40057, 126218, -217590, -61009, -216057, -66876, -66866, -245714, -329939, 18755, -282372, -63798, 37563, -53318, -127933, -139438, -258562, 117224, -24448, 89927, -395112, -50593, -339824, 33424, -114412, -304654, -255498, -12074, 60948, -172527, -432319, -79099, -223747, -186579, -230040, -129775, 203134, 65820, -180877, -111581, -129617, 41597, 91794, -78967, -160805, -65641, 345779, -259251, -267363, 124078, 51073, -182393, -75958, -228536, -132283, 254664, 45245, 313031, 298069, -14961, 28022, -22828, 165873, 176716, -16153, -53653, -80101, -340635, -116707, 15808, -161454, -15070, -52663, 131883, 10705, -122504, -38294, 34787, 219310, -8197, -129898, -446367]
19278d46367h5398A43792m7959J1439f783I2315a26542A54172j7875F451K0878
19267B7329J36294k6796a10965M1200J9368J3783I4059J73887C8285h1999L2553
19256d9446q2081d4706I1944N7822B5074j0078K79996g284r6075c1002A30958
19244f74996f5016D7948c1125B3842M7929h9702q1843e7790K6641l36823A08164
19232a22259p2946B30086E0592K33723a86854c6091o6057J8559L3279C46701a20912
19220a1292j69198k19900A76358b9527A01012d9443A38429c2457D4605c4584p020
19209d1604l3563A46166F8397K0266a86560j8309b1319k14248C939K8603j4660
19198A7882P066J49110B4075B240j63a50829H8696e7548m06455B21268D1520a98215
$$ y = [-446367, -85398, 143792, 95833, 107272, -6783, 92315, -126542, 154172, 136297, 6451, 27329, 163623, 136827, -110965, -69765, -50397, -36614, 94059, 267946, 38285, -81999, -49446, -131527, -44706, 91944, 149766, 25074, 14996, 294992, -7284, -103359, -31002, 130958, -674996, -65016, 47948, -31125, 23842, 71771, -89702, -171545, -57790, -31149, -367972, 108164, -122259, -195205, 230086, 50592, 284315, -186854, -36091, -102148, -83589, -50310, 346701, -120912, -11292, -180490, -400390, 176358, -29527, 101012, -49443, 138429, -32457, 44605, -34584, -41604, -75167, 146166, 68397, 88663, -186560, -204869, -21319, -235567, 3939, 32542, 17882, 24948, 174058, 24075, 2240, 2077, -150829, 88696, -57548, -464003, 221268, 41520, -198215]
19185A05473a17776b8388j6068k72859a28267A66049A3328a19192j45402f1709
19174e3348m2407a3431k13763E1923h1510k3654j29631J11238e2763p917k04454
19163b65134b7020l73997g2859o16c0066j75908l3760K1454B28722a42949L1960
19152a10989n235k91960a2269k5367k22616A00156l2692a33075A43723J0674c72675
19140d4153A01677a35531G6767k8391f6886K7374j7109A18091b4510l01686C99035
19128a77170A40222b2890B83602A37036a80565o1876J02471G7594a88858M8581
19118a40277A39883b27273J00147E1230c01956E5046K95052j28234a27798c2672
19107I3916c08511B56088A7572c94531C9273b33467F874d32145A55776c9184B7839
$$ y = [105473, -117776, -28388, -44456, -317315, -128267, 166049, 13328, -119192, -264594, -61709, -53348, -95755, -13431, -227194, 51923, -81510, -105164, -234795, -123557, -52763, -60680, -265134, -27020, -401017, -72859, -73475, -30066, -205974, -239734, -218280, 228722, -142949, -110989, -116224, -408184, -12269, -37636, -260252, 100156, 67464, -133075, 143723, 154397, -372675, -44153, 101677, -135531, 76767, 48376, -66886, -39512, -56621, 118091, -24510, -326196, 399035, -177170, 140222, -22890, 283602, 137036, -180565, -242441, -139970, 77594, -188858, -140277, 139883, -227273, -127126, 51230, -301956, 55046, 350098, 221864, -127798, -32672, 93916, -308511, 256088, 17572, -394531, 39273, -233467, 6874, -432145, 155776, -39184, 27839]
19095G3224a64836o525J2779k1892Q831B29746a92750H3693a55743O4030k75573
19084c67286e8295A96678o7303F1044a67015k15757j134d4846j12595A09581Q2755
19073A92336d74653g2400i326B42196C6121a01553j86212o0444R4945j46731a84507
19061A72176a20225A81500e6515l55631K04598D22610d2833j11336A06965g2513
19050H5584C6172b99400a26551d2537C55650D7365R373d15138g1207A11660a02562
19038C55754a8076j32105K6768f0402j54655c5451k5918F8391N4114a11649e0002
19026b64322i2451G6517A1614f852A16019c4418D35296a85788k863P9074D9479
19014a64151b30j05419l3999H7863e9812n420F2928N0878a50377D1931A9268c2604
$$ y = [73224, -164836, -171361, -158582, -180474, -171643, 229746, -192750, 83693, -155743, -91713, -367286, -58295, 196678, 129375, 61044, -167015, -382772, -383906, -44846, -157441, 109581, 192336, -474653, -72400, -9326, 242196, 36121, -101553, -287765, -348209, -253264, -399995, -184507, 172176, -120225, 181500, -56515, -412146, -207548, 422610, -42833, -154169, 106965, -72513, 85584, 36172, -299400, -126551, -42537, 355650, 47365, 56738, -415138, -71207, 111660, -102562, 355754, -18076, -150181, -123413, -60402, -215057, -35451, -61369, 68391, 122505, -111649, -50002, -264322, -92451, 76517, 11614, -6852, 116019, -34418, 435296, -185788, -188651, -109577, 49479, -164151, -230, -105649, -139648, 87863, -59812, -65232, 62928, 113806, -150377, 41931, 19268, -32604]
19001a24431B18601a75158Q927A58831l8873a55967j15184o7291a57175q7208
18991b44383A11481J3334a5514A30818N1127G3561d77159a01406j65372a8598
18980D2572a93067i2780a6730r6951k24269f3843I5700a68577o91B45091b74491
18968C03013a72130q0050e2116q2482H2695L8910c22498D0077J00177a46757B36844
18956d9689A74897D9624a95979h609B13141B6063J77300C3980e00661A31706a0509
18944d6895D39101a30286l8124A11732a51602M7139m107e4058A14962i1649D02163
18932A71222C1945N9248a05630B2162J14983a14736k72986C37233b81764a19950
18921A2603a30007l4921a4021q9518M6247K6875F1542J96869a73958j7546N0324
$$ y = [-124431, 218601, -175158, -166231, 158831, 119958, -155967, -271151, -338442, -157175, -244383, 111481, 124815, -15514, 130818, 181945, 73561, -477159, -101406, -266778, -18598, 42572, -193067, -92780, -16730, -113681, -337950, -63843, 95700, -168577, -169268, 245091, -274491, 303013, -172130, -252180, -52116, -134598, 82695, 121605, -322498, 40077, 140254, -146757, 236844, -49689, 174897, 49624, -195979, -8609, 213141, 26063, 203363, 33980, -500661, 131706, -10509, -46895, 439101, -130286, -168410, 111732, -151602, -104463, -108570, -54058, 114962, -91649, 402163, 171222, 31945, 91193, -105630, 22162, 137145, -114736, -387722, 337233, -281764, -119950, 12603, -130007, -164928, -14021, -103539, -57292, -30417, 61542, 258411, -173958, -191504, -141180]
18910a41180H4204a15499j0301H4407b83029A0809B757K62996c29193B22383c11988
18898A23801c0785j88666l6665M5892N949A22642b26584L1355G2366N9578b90601
18886F0489a24754e1516p1894B57815I2827a93129P1838G0236a08465E5497J46114
18875B01611L0725B1171M2831e3301L257i074H775i946j66669j3620H6158L6071
18863A22229d82206g493j29549j02851A49809a64772b2687l0416c66n1414A3875
18851a60941K3181B44485a75536A4749J09663D430b33805J1281A94658A1748a6259
18839d9356r4673F0679a1233B02654c7814C8083a59028l1660o8193N4428A9252
18827a20477e8364R983B31382a43171j88024A58970L6630c7053A92714Q6237b4345
$$ y = [-141180, 84204, -115499, -125800, 84407, -283029, 10809, 2757, 265753, -329193, 222383, -311988, 123801, -30785, -219451, -256116, -210224, -204275, 122642, -226584, -195229, 72366, 131944, -290601, 60489, -124754, -51516, -123410, 257815, 92827, -193129, -121291, 70236, -108465, 55497, 201611, 232336, 21171, 64002, -53301, -50044, -9074, 8775, -9946, -176615, -190235, 86158, 122229, -482206, -7493, -137042, -239893, 149809, -164772, -22687, -53103, -366, -51780, 13875, -160941, -137760, 244485, -175536, 14749, 124412, 4430, -233805, -222524, 194658, 11748, -16259, -49356, -144029, 60679, -11233, 202654, -37814, 38083, -159028, -190688, -258881, -204453, 19252, -120477, -58364, -48381, 231382, -143171, -331195, 158970, 195600, -37053, 192714, 278951, -24345]
18815G0971b13811i0252B32752P2939A19670b87187A08121a2114A21428a39551
18804H9194A2912a28539a4527E2401a9872q7508H226K8472c3710H8830d3564j45493
18792a89057k47508D4286O1079L3480b95085a31836A30036e5481j63467q7501
18782c06449O9940F2036b54415N2734b1500A9416a57931K4622p4979h0948A61776
18770I6118a9481l29648A6947L5545a9497A92662a59555k28846B35M6444b30735
18758I5866A3242a67221L770A21044a09099A69861i5909A46847b15440a2716j32287
18747a45003b2001D6544O3776a5054A48101E8654c39990A41785O4930a19635A05911
18735e6992j84848D8716l399g4833j78569a16349A98747q9689e5339F822M1469
$$ y = [70971, -213811, -90252, 232752, 305691, 119670, -287187, 108121, -12114, 121428, -139551, 89194, 12912, -128539, -14527, 52401, -19872, -107380, 8226, 36698, -33710, 88830, -43564, -189057, -436565, 44286, 105365, 138845, -295085, -131836, 130036, -55481, -218948, -306449, -236509, 62036, -254415, -201681, -21500, 19416, -157931, -133309, -208288, -80948, 161776, 96118, -19481, -349129, 16947, 52492, -19497, 192662, -159555, -388401, 235, 46679, -230735, 95866, 13242, -167221, -163451, 121044, -109099, 169861, -95909, 146847, -215440, -12716, -145003, -22001, 46544, 110320, -15054, 148101, 58654, -339990, 141785, 206715, -119635, 105911, -56992, -241840, 48716, 45317, -74833, -253402, -116349, 198747, 109058, -55339, 6822, 48291]
18724D8291J10929d47040J34761k6147O7386B82690c31810C72407g4191C8431
18713a13213i312E267N4705J71852b1511j26265p6612k6701D3297K91171f2552
18701B23172a91116F8642R248a59026l6537B31378H8634c6758l59734a17987o998
18690a24985f1463l641o5785m66A79669n1152c55940B46199g9996j83774I3412
18678A99856c91209J60882f2950A41780e75508D4938d0661q180r7131l21792a7760
18666H4523c29689R895a04899j59076f9658J4290j84821C5861c0082D9007J69655
18655B18662b09263B10736C7213i9710j40559r7948b6778E900a45417d1278o770
18644d8048k25930F0512O7916J3001b04232A76343h0049A18698c98434a02566
$$ y = [48291, 159220, -447040, -312279, -338426, -271040, 282690, -331810, 372407, -74191, 38431, -113213, -9312, 5267, 59972, 231824, -21511, -147776, -224388, -251089, 43297, 334468, -62552, 223172, -191116, 68642, 77890, -159026, -195563, 231378, 88634, -36758, -396492, -117987, -124985, -61463, -65104, -130889, -131355, 179669, 128517, -355940, 246199, -79996, -263770, 93412, 199856, -391209, -230327, -62950, 141780, -575508, 44938, -40661, -48841, -145972, -467764, -17760, 84523, -329689, -319794, -104899, -263975, -69658, -55368, -240189, 35861, -30082, 49007, 218662, -209263, 210736, 37213, -99710, -240269, -338217, -26778, 5900, -145417, -41278, -48048, -273978, 60512, 128428, 141429, -204232, 176343, -80049, 118698, -398434, -102566]
18633A45518g6591m3673j30853C4740j3249b01335D5602a59179j55122a9752k3090
18622d2842B14682F482d3285o5077j77429C14216a02463A93715E9086c97737a80897
18610c55665A20657e7043N88j17938a9241j59136P8863j00027A6534g6581n9651
18599a36232H218J2198a94274N8114L4280G0618a14908C11767b12476B01634J24180
18588C25814b51546l3860A6188g9127j19138B58824A04548D74Q8419B28d0386
18576C2080e6814C6820n247i4126B31899o0338n1234A7085a94A45023c5570j00594
18564a36164K824j34827h2191j76163e4527B34462a97512B53690F6517j7010P1026
18553A20533g9110K1357k46843P623B094R6489l4708g7051j29691f8781B475K5902
$$ y = [145518, -76591, -120264, -251117, 34740, 21491, -201335, 45602, -159179, -314301, -19752, -42842, 214682, 6482, -43285, -108362, -285791, 314216, -102463, 193715, 59086, -397737, -180897, -355665, 120657, -57043, -56455, -174393, -19241, -178377, -99514, -199541, 16534, -76581, -136232, 8218, 20416, -194274, -136160, -101880, 70618, -114908, 311767, -212476, 201634, 325814, -251546, -285406, 16188, -79127, -198265, 258824, 104548, 474, 88893, 228, -40386, 32080, -56814, 36820, 31573, -94126, 231899, 171561, 120327, 17085, -194, 145023, -35570, -136164, -133340, -268167, -82191, -258354, -54527, 234462, -197512, 253690, 66517, 49507, 120533, -79110, -57753, -304596, -296973, 2094, 98583, 63875, -77051, -206742, -68781, 2475, 28377]
18541B8377a36379G4082a34066A89345b35887h4161F0135h42H3454J9086c9577
18529a64675E6195g7453j8535k59186N4046F2694J49306n9398l2207c00997B29385
18517b02594b0783q9880Q021j80250I1647J0149a4177A84730q1015c42465D4326
18505b59477p246q7875f0525B11676I8104C4707L468a94006m8441i6460j25187
18494b21647g8278j85294J09729j25356L8857B03717d014o1788j14072O0720B48726
18482a89162r5295a18336K1285b4655l05541e2617o8604p9741n0708G6674b0055
18470C0846c9336q5295A4485E356K20178A7481K38859n0174D0864b33464B73398
18458B4090c58953D5377J3412J21128a36850E3905K6046i1614J1832n0933d4172
$$ y = [28377, -136379, 74082, -134066, 189345, -235887, -84161, 60135, -842, 83454, 102540, -39577, -164675, 56195, -77453, -95988, -355174, -301128, 62694, 212000, 152602, 120395, -300997, 229385, -202594, -20783, -110663, -102642, -282892, 91647, 101796, -14177, 184730, 103715, -342465, 44326, -259477, -266723, -354598, -60525, 211676, 98104, 34707, 38175, -194006, -242447, -96460, -221647, -78278, -263572, -153843, -279199, -240342, 203717, -4014, -65802, -179874, -119154, 248726, -189162, -284457, -118336, -97051, -24655, -330196, -52617, -121221, -200962, -251670, 76674, -20055, 30846, -39336, -124631, 14485, 5356, 225534, 17481, 256340, 206166, 40864, -233464, 273398, 24090, -358953, 45377, 58789, 179917, -136850, 53905, 79951, -91614, -79782, -130715, -44172]
18446i4935A34365g6338c6669C5781L31568F4762J63199i0025C00426d5794j20358
18435a66152L7904p1773R4991a4769G4658J77423n0099a40952A81434m6388c16730
18423e1291B0646P5856g3241A7692L5999a84717M6657B278a08321K5139F7642
18411A18411a94800e309A43503d8904o2374d1828B1111h3829A9214b51934B41945
18399h6148A00345c32573B72243a30552k05625c0954j07049e6372A76663G799
18388B34697c3273k58476a05808A60960a79695Q4967c4970k08674M9729O96K3287
18377a69932d9369l01892a40207d2700p1516A7148g600q5420j219k8486j23269
18366b45994a6537A86309b31582d582A67860o091M0443f3417A58237k9306m4649
$$ y = [-94935, 134365, -76338, -36669, 35781, 367349, 64762, 227961, -90025, 300426, -45794, -166152, -128248, -200021, -105030, -14769, 74658, 252081, 201982, -140952, 181434, 135046, -316730, -51291, 20646, 96502, -73241, 17692, 53691, -184717, -138060, 2278, -108321, -83182, 67642, 118411, -194800, -5309, 143503, -48904, -111278, -41828, 21111, -83829, 19214, -251934, 241945, -86148, 100345, -332573, 272243, -130552, -336177, -30954, -138003, -56372, 176663, 7799, 234697, -33273, -291749, -105808, 160960, -179695, -94728, -34970, -243644, -193915, -193219, -169932, -49369, -351261, -140207, -42700, -114216, 17148, -7600, -93020, -94239, -122725, -245994, -16537, 186309, -231582, -4582, 167860, 161769, 202212, -63417, 158237, 128931, 84282]
18355H4282l6254a17046L4453A72618a42588j8900C611Q441a08468A702b14782
18343A00481a06502p770A02132J38718l5037i5689m3169c0557n1273A3166K52712
18332B65878I3597J41107j08150i5397A1772M5039b46344k25053B65620f6220
18321f538F0938J0683c66297F4345a90074A44430a34957a862C5753a08528o3029
18310a71557c1034C9342L1884a78621Q2965m1438e9532H3819a09799j97260j53692
18299d60751a23013C11017a83789D01215g6569C11026a16565j43312R3619D7860
18288a74892D9991a1968j17744A80379q1667a33813A4199J76940b5110r022j95557
18277b29689a0285j14504k51296A89625b31745B69057a55864e343A1116b2583
$$ y = [84282, 48028, -117046, -82593, 172618, -142588, -161488, 3611, 12052, -108468, 1702, -214782, 100481, -106502, -114272, 102132, 240850, 205813, -95689, -138858, -30557, -81830, 13166, 265878, 93597, 234704, 126554, -95397, 11772, 56811, -246344, -471397, 265620, -66220, -6538, 60938, 71621, -366297, 64345, -190074, 144430, -134957, -1862, 35753, -108528, -171557, -31034, 39342, 71226, -178621, -95656, -137094, -59532, 83819, -109799, -307059, -460751, -123013, 311017, -183789, 401215, -76569, 311026, -116565, -259877, -166258, 47860, -174892, 49991, -11968, -129712, 180379, 98712, -133813, 14199, 191139, -25110, -34132, -229689, -10285, -124789, -376085, 189625, -231745, 269057, -155864, -5343, 11116, -22583]
18266E5375L2236d57010a36338N1976k52024Q8811p8285B66801C5337J73761a5469
18254A32174l0231b7572j3015f251k0479j41011m6812D3051N2681R865a69675
18242b6143j0127k81209f8839l7455n2842f221j30096C9676A4012J71204e8928
18230a67214M1533k38159J75785C7714b47408h0581B93413d8029k8564n8823I1943
18218C1197J04689D317M1474a41617C9346b64667Q5343E812h5509j03273I7039
18206c54775I2109b80724J6250m8079a39403d2282j20897J6779c0168l72319a62191
18194A26182J18250A00820a35744K9571A7792b46974K6045j52315C67087F4493
18183h3025I5081e7637a8003k32235A69730C850J13651k7556c3856j33118m176
$$ y = [55375, 87611, -457010, -136338, -84362, -336386, -247575, -325860, 266801, 35337, 209098, -15469, 132174, 101943, -27572, -40587, -6251, -26730, -167741, -214553, 43051, 95732, 105597, -169675, -26143, -36270, -317479, -68839, -106294, -159136, -6221, -136317, 39676, 14012, 185216, -58928, -167214, -125681, -363840, -188055, 37714, -247408, -80581, 293413, -48029, -76593, -135416, 91943, 31197, 135886, 4317, 45791, -141617, 39346, -264667, -179324, 5812, -85509, -188782, 97039, -354775, 92109, -280724, -264474, -312553, -139403, -42282, -163179, -146400, -30168, -402487, -162191, 126182, 244432, 100820, -135744, -106173, 17792, -246974, -220929, -373244, 367087, 64493, -83025, 95081, -57637, -18003, -250238, 169730, 3850, 117501, 89945, -33856, -166974, -171150]
18172a71150E4189J22111H8139R1068a27221o6978e2538k39413A25126d2205k243
18161d4448j54201O8214D1716K25373a58258B3127b04101D5490f8043I5696J06224
18150B01920c04794f5811A95337a01865o8683k19416A6858g4886A57858D3241
18139A38382L299e2995p8181N5901a7064j87336E7864N4060a40027C1799K77259
18128C09058b24336e994k31688G8048d6364k45941g9945j87276I6439a50385O0717
18117h9668A82624f398o0982b7927j41467n0360g2988B16867A07798M578b36851
18105A81839E8849b12073c412l30373c2970B12206r7624m3572e9800k3712j9125
18094a02637j69156C0140J64427K0309h8088I6707b9668k1270k28570b9715j46498
$$ y = [-171150, 54189, 176300, 88139, 179207, -127221, -194199, -52538, -291951, 125126, -42205, -44448, -198649, -130435, 41716, 267089, -158258, 23127, -204101, 45490, -68043, 95696, 201920, -304794, -65811, 195337, -101865, -170548, -389964, 16858, -74886, 157858, 43241, 138382, 141681, -52995, -131176, -75275, -17064, -204400, 57864, 111924, -140027, 31799, 309058, -224336, -5994, -237682, 78048, -46364, -292305, -79945, -267221, 96439, -150385, -89668, 182624, -6398, -67380, -27927, -169394, -219754, -72988, 216867, 107798, 112376, -236851, 181839, 58849, -212073, -3412, -333785, -32970, 212206, 114582, 71010, -59800, -83512, -102637, -271793, 30140, 194567, 214876, -88088, 96707, -29668, -50938, -279508, -29715, -176213]
18083a76213e9378p9839B2849a32265A4789b6569C45408b50262d5268k64279a17001
18071A74152m0297c70608a24013d5013B28717l3838p4760a89831A33232b83924
18060A52766m2963B4595a15364A9942J74914a66906A1230b6071m09790A86472
18049f5068E0874J15409M8922G1344C4001a27429A03957l5118K52407H490a33915
18037a95910D3915J00825n3775a76993C06393a36550A246R0567f9998p917j10709
18026a88624b877A56397F5422J6798l8712a1897D7545e2645l2191c685G1192J05596
18014A76788g7479l20980F6728a12205j0559A12951d6562k05003B3778L11763
18004C35541b25210e6443A44575K205e5897p967A6288O9167f6457j35465B6455
$$ y = [-176213, -59378, -139217, 22849, -132265, 14789, -26569, 345408, -250262, -45268, -309547, -117001, 174152, 133855, -370608, -124013, -45013, 228717, 194879, 120119, -189831, 133232, -283924, 152766, 109803, 24595, -115364, 19942, 194856, -166906, 11230, -26071, -435861, 186472, -65068, 50874, 166283, 215205, 71344, 34001, -127429, 103957, 68839, 321246, 8490, -133915, -195910, 43915, 144740, 90965, -176993, 306393, -136550, 1246, 91813, -69998, -77915, -188624, -2877, 156397, 65422, 82220, 43508, -11897, 47545, -52645, -84836, -3685, 71192, 176788, -77479, -398459, 66728, -112205, -122764, 112951, -46562, -251565, 23778, 335541, -225210, -56443, 144575, 146780, -55897, -63864, 16288, 85455, -66457, -201922, 26455]
17992B87876C1303c68565D2089L5989k599l6786J07942C9216K56068j35618a92320
17980G4413L7113m1381j4966a87332M1971b4412j30320n6A53955L6459c4426B7695
17967c21420a9749k12729B88819g7259A39400k1092b21114Q4653L2092B35392
17956b49071C1136A1226Q3414b83765A05026b3121j04334D13a35396B9444J8799
17945D8243c78479e3380B06015a74055k8806H3017a56379A96758m3353h7389J7041
17934g0348A808b0152k94657J02691A9102i6305L545e262l3544A08741k886a78216
17921A48582B7229f9165H3591f1300N009k06783E5705c1247A41629f2972C0154
17909a17181H1446g2876j78749B91943B9387P3986j9612e1893j68664N8627A51324
$$ y = [287876, 31303, -368565, 42089, 78078, 75479, 38693, 146635, 39216, 295284, 159666, -192320, 74413, 111526, 70145, 55179, -187332, -145361, -24412, -154732, -154788, 153955, 190414, -34426, 27695, -321420, -19749, -232478, 288819, -77259, 139400, 118308, -221114, -136461, -104369, 235392, -249071, 31136, 11226, 94640, -283765, 105026, -23121, -127455, 413, -135396, 29444, 48243, -378479, -53380, 206015, -174055, -202861, 83017, -156379, 196758, 153405, -87389, -70348, 1808, -20152, -314809, -212118, 19102, -96305, -92760, -5262, -38806, 108741, 105855, -178216, 148582, 27229, -69165, 83591, -61300, -56291, -263074, 55705, -31247, 141629, -62972, 30154, -117181, 81446, -72876, -251625, 291943, 29387, 103373, 83761, -51893, -220557, -161930, 151324]
17897b6883k16797J7786e9111D279N7485P9747m2297a18839e5860j892n5392B34611
17884E4586a63672A41683a36873B318a00494A08183J2884A1295L2981J30904a74519
17872F4770J1808a50549L0996B43790a29186I8389a99560O5241M4593A12411a9103
17860a8037j15090f2836F4931a54545c1983j38823p4114B12854a61621I8722a51771
17848d4888B22949a13936A06197a38023l8183A76831G0899C3480J79999O7242
17838B80721E5409E245c263l4834j5266q9279g987N46l247A5769b31258l3066
17826b64324B04609C9565L2155e9549G8834f2194k32688A29424a7844b302j20798
17815a23100J3836a8741B16313F5075a55468E74658k83284B9370J0410J2189b15725
$$ y = [-26883, -243680, -225894, -59111, 4279, 61764, 141511, 99214, -118839, -55860, -57752, -113144, 234611, 54586, -163672, 141683, -136873, 2318, -100494, 108183, 121067, 11295, 44276, 175180, -174519, 64770, 76578, -150549, -119553, 243790, -129186, 98389, -199560, -134319, -89726, 112411, -19103, -18037, -133127, -62836, 64931, -154545, -31983, -170806, -244920, 212854, -161621, 98722, -151771, -44888, 222949, -113936, 106197, -138023, -176206, 176831, 70899, 33480, 213479, 280721, 55409, 5245, -3263, -38097, -53363, -142642, -7987, -7441, -10688, 15769, -231258, -264324, 204609, 39565, 71720, -59549, 78834, -62194, -294882, 129424, -17844, -2302, -123100, -109264, -18741, 216313, 65075, -155468, 574658, 291374, 29370, 39780, 51969, -215725]
17803B8265h1978A8944K2648G624b46481F309K9044J80468e2338E4760c3376j34934
17791a68310j4150B51042i8013M0778I8669b06361b7207p1307j0908F5043a86071
17779a89215a5482j0902l37327B51577C4249a44209B90577g6364J5305q3370h278
17767d3251B25349o8425a0798H2717P8385E4842a19378C28915G2993a11968b4874
17755a36834c6748B56981M8606D4361a61143M1313I8536a79058c9466j01206d1676
17743d3867j4386B86413D0839L8477O9287P8151A02209a62149A94399g7091m4309
17732a21400A12991a8329A38408b44955f2415H8928l2411K80325c25291h8140
17721F4984q340N9841B8406d4542N151B50278a56098b0125o6955o864D9427M3502
$$ y = [28265, -81978, 18944, 41592, 7624, -246481, 6309, 35353, 215821, -52338, 54760, -33376, -168310, -182460, 251042, -98013, -57235, 98669, -206361, -27207, -98514, -109422, 65043, -186071, -189215, -15482, -26384, -363711, 251577, 34249, -144209, 290577, -76364, -61059, -144429, -8278, -43251, 225349, 156924, -10798, 82717, 161102, 54842, -119378, 328915, 72993, -111968, -24874, -136834, -36748, 256981, 305587, 44361, -161143, -119830, 98536, -179058, -39466, -140672, -41676, -43867, -58253, 286413, 40839, 79316, 148603, 226754, 102209, -162149, 194399, -77091, -121400, 112991, -18329, 138408, -244955, -62415, 88928, 56517, 336842, -325291, -88140, 64984, 56644, 116485, 28406, -44542, -39391, 250278, -156098, -20125, -87080, -93944, 49427, 92929]
17709I2929a23143N3965F1105a81734O100B71437A09247E798O4370a13129L541
17698a09588C42943a8741j37100f2840A6419J11913g1728B23099E5859B3337k645
17687B0692J57336M6552N69263B49400p7912G5772a04525m4013B26106e8084A62951
17675C05461a88956d2963B38817j01114B3447a05053A56039b9960A61331Q5503
17665B46834B3099g2599a5063p3807j6536j91066B7209K97480j57501a38034B02151
17653B8245K0927G952N0881L00195a00757G8307b27743G4397c75381A78476a65823
17641A79256J43935I3496a93399B24442J63354A7691h19k34313B53243m2820E0581
17629B49681m2252a5815k93726N5314a15105N0449F0391K696a57j1344B75845
$$ y = [92929, -123143, -69178, 61105, -181734, -175634, 271437, 109247, 5798, 70168, -113129, -109588, 342943, -18741, -155841, -62840, 16419, 128332, -71728, 223099, 55859, 23337, 20692, 178028, 224580, 793843, 249400, 171488, 75772, -104525, -148538, 226106, -58084, 162951, 305461, -188956, -42963, 238817, 137703, 23447, -105053, 156039, -29960, 161331, 246834, 23099, -72599, -15063, -88870, -105406, -296472, 27209, 324689, 167188, -138034, 202151, 28245, 49172, 7952, 58833, 359028, -100757, 78307, -227743, 74397, -375381, 178476, -165823, 179256, 323191, 93496, -193399, 224442, 387796, 17691, -819, -235132, 253243, 210423, 50581, 249681, 207429, -15815, -309541, -254227, -115105, -64656, 60391, 63087, -157, -11501, 275845]
17617I911K83703D3768b39595g4731A28088c8547k219a5318A57519a92466j744
17606a94210C78344g754j21360m2307A08658M7845a8563j05019D3347K1373K92260
17595C56980B6283e1118A01351a33414A60144P7612F3954J65419a99566A90207
17584c2101A59339E0613J38534a6717A89690a83618l5672N5952H0384O5057a81325
17572C7707a25743d880B47631j06170B921b34346R9231A30107A7655c6723o905
17561d3628j5727F2064K13192A00925m0786a02068M3372B76397A08045J15571
17551B23616d4839J1918A15611d0056G7815g4348I2909D1457a1927B77897G5722
17539a20515A13456n21K2459j6268c4963j56024B02361R7574g7057G3123a01371
$$ y = [9911, 293614, 43768, -239595, -74731, 128088, -38547, -40766, -15318, 157519, -192466, -194210, 378344, -7754, -129114, -171421, 108658, 156503, -18563, -123582, 43347, 64720, 356980, 26283, -51118, 101351, -133414, 160144, 237756, 63954, 229373, -199566, 190207, -32101, 159339, 50613, 189147, -16717, 189690, -183618, -219290, -163338, 80384, 145441, -181325, 37707, -125743, -4880, 247631, 141461, 2921, -234346, -135115, 130107, 17655, -36723, -43628, -59355, 62064, 275256, 100925, 60139, -102068, -58696, 276397, 108045, 223616, -44839, -32921, 115611, -40056, 77815, -74348, 92909, 41457, -11927, 277897, 75722, -120515, 113456, 112935, 135394, 119126, -34963, -190987, 202361, 299935, -77057, 73123, -101371]
17527g7914A88141J90498a08617m3659H636J74939b75348B90160A5224a11645
17516B60641J43632b53267b7355D33731A17984m2336k6097J62122H017a39987
17505A45774b65087I4075Q1361l3840j7126D8153O6205f2982C29652H4739A6671
17493A46709i0451A76876p4831c1980A08470J82044b7863C56431I6383R607O4036
17482A70026A0194K8800b7276B21458a72876B32084o1742J32807r4738O975J44814
17471C60200j71314e5336C62692L7471G3005P1262b9338F4027J88121o2197J16046
17460C05997J3908k1820n7297J57791j90915a93558B18631N9539K9551J88693
17450D96414A24263L69097d6605B16527j785l7500K87155E752R5767K41593O1492
$$ y = [-77914, 188141, 378639, -108617, -152276, 8636, 183575, -275348, 290160, 15224, -111645, 260641, 404273, -253267, -27355, 433731, 117984, 75648, 49551, 211673, 8017, -139987, 145774, -265087, 94075, 175436, 141596, 124470, 48153, 114358, -62982, 329652, 84739, 16671, 146709, -90451, 176876, 102045, -31980, 108470, 290514, -27863, 356431, 96383, 105990, 170026, 10194, 38994, -27276, 221458, -172876, 232084, 170342, 303149, 208411, 215386, 360200, 188886, -55336, 362692, 400163, 73005, 144267, -29338, 64027, 252148, 189951, 305997, 319905, 298085, 240788, 398579, 207664, -193558, 218631, 278170, 307721, 496414, 124263, 493360, -46605, 216527, 214742, 177242, 464397, 5752, 101519, 343112, 404604]
17439D04604j25691E6683B4058K04577b1875A79502p4899J90219G4148J54800
17429B28948K2329m1368P377m031Q0786J26919n7042a42331C39574H7695K64626
17418C52321d3307C70798A60813R8106j25414K19900C8149J02933a31197A30909
17407B86957J2823e5654B6831K30083H4255C0969P5574J3023B5157P857d8934
17395A76939J48651j57232K02305G2194K05871R1973p5537A15325C9129B720a145
17383A34940L12915B17184e7134l62138F3924Q5074C3363J91718o6002F8282M910
17372G3192J22386J19667C687L08723j00799o2386k2869b4455B12007J01172q6967
17361B26212J95921A22158K28849C876f2689G6903J37498J0935J49279j05193
$$ y = [404604, 278913, 56683, 24058, 228635, -21875, 179502, 104603, 294822, 74148, 228948, 251277, 209909, 217286, 213255, 294041, 420960, 363918, -142331, 339574, 87695, 352321, -43307, 370798, 160813, 258919, 133505, 353405, 38149, 141082, -131197, 130909, 286957, 299780, -55654, 26831, 256914, 84255, 30969, 106543, 119566, 25157, 33014, -48934, 176939, 325590, 168358, 370663, 72194, 278065, 370038, 294501, 115325, 39129, 2720, -1145, 134940, 447855, 217184, -57134, -419272, 63924, 148998, 33363, 225081, 159079, 68282, 73192, 195578, 315245, 3687, 312410, 211611, 149225, 126356, -24455, 212007, 313179, 226212, 422133, 122158, 351007, 3876, -62689, 76903, 214401, 225336, 374615, 269422]
17351B69422k2072k4174l4270J72225j18320H2960a2177C78111R1795B28571l4477
17340A94094p7011J81311c5393A95605J89723E3220L5163J12640j502J59763J26006
17329D85290B35649f9806H8132P0843J43361I6174K6214K24893m525C6452N4040
17318I0492J00475K049p8944E5809a00331b2900C64195q7832j18431K86300A9018
17306D34287A11659K5440J24376o2766J34809a40943C35678j52827O3845F181
17295A28368b105D30793j91999m459K43423q1209I4501K14508o2442P141a1328
17283C23392E8302d5754p0959A98734A0702a77588B12396K44403F4100A947L60735
17272C62682D8041O531J84923n4607J98433p1978j17960e397C48605j52342E7733
$$ y = [269422, 247350, 223176, 188906, 361131, 242811, 82960, -12177, 378111, 469906, 228571, 194094, 117083, 298394, -35393, 195605, 385328, 53220, 88383, 201023, 199521, 359284, 485290, 235649, -69806, 88132, 158975, 302336, 96174, 122388, 347281, 342756, 36452, 90492, 190967, 193016, 114072, 55809, -100331, -22900, 364195, 276363, 157932, 444232, 19018, 434287, 111659, 137099, 261475, 198709, 333518, -140943, 335678, 182851, 246696, 6181, 128368, -2105, 430793, 238794, 234335, 477758, 396549, 94501, 309009, 246567, 253708, -11328, 323392, 58302, -45754, -116713, 198734, 10702, -177588, 212396, 456799, 64100, 1947, 362682, 48041, 54572, 239495, 184888, 383321, 311343, 193383, -5397, 348605, 196263, 57733]
17260A38475E3132J23451J18460q9150l981K9020J09536Q7789j30010j20479J16794
17249B94562q1010J31133C9383K21995G6718P7680J23221p5466J36113m23A36871
17237A06540J92270q1626o9210K40884b15897B66399J52055J70566A81108E5738
17226B85447l4010m3382p1459J7413C7262K77915B1323g7167A46337K06576O816
17215C59729L8926j89827K19271B04174H2423K55022K302j02960q9575b30873
17204C49809j13305J4420K53935a2342B53692r7710b44162A56260P6113p1450
17194A60923L98413j16605A39505Q6841P5672K58538j55865I0185L08682H4708
17183B89605q6169L58833j92045j37247J6994K610l2639J60470o2219R354o3220
$$ y = [138475, 53132, 176583, 295043, 205893, 201912, 230932, 340468, 428257, 298247, 177768, 294562, 213552, 344685, 39383, 261378, 76718, 154398, 277619, 202153, 338266, 337843, 136871, 106540, 298810, 217184, 147974, 388858, -215897, 266399, 418454, 589020, 181108, 55738, 285447, 251437, 208055, 136596, 154009, 37262, 315177, 21323, -77167, 146337, 352913, 359729, 398655, 208828, 428099, 204174, 82423, 337445, 339747, 236787, 147212, -230873, 349809, 236504, 250924, 504859, -12342, 253692, 155982, -244162, 156260, 232373, 160923, 559336, 442731, 139505, 226346, 302018, 560556, 404691, 90185, 398867, 84708, 289605, 203436, 562269, 370224, 232977, 249971, 252581, 219942, 380412, 318193, 327547, 264327]
17172B64327j08064C0541b7902B2526d4896C51018A65904n3724D8740J08736n841
17161A51635A9577J16063L42455m4850J73543C03018J73848m6331A32601J59319
17151B91920L81K34576k51795B5343M93719j88790m6412K35849j00771K6345B03540
17139C78444r6960K66750k4829M6601G7001Q7762l7152J30164L22322k64926J75717
17128D90888P2008k37427Q303J56477k10617K5702j52028K79159B8933L37622
17118C66555L11782l10370R508j44720J53557Q7726P1906j85763m0598R502K83149
17107F12234B31787J804K38453j39868K36417J34465l7125k92576k4677P683R715
17096C66078J5553A44681J76870L45792N9595l9841k32155j33468L93159l39329
$$ y = [264327, 156263, 30541, -27902, 22526, -44896, 351018, 165904, 112180, 48740, 157476, 151635, 19577, 135640, 478095, 433245, 606788, 303018, 476866, 430535, 132601, 291920, 292301, 526877, 275082, 25343, 519062, 330272, 283860, 519709, 418938, 445283, 203540, 378444, 281484, 548234, 523405, 570006, 77001, 164763, 127611, 257775, 580097, 315171, 490888, 562896, 325469, 333772, 490249, 279632, 305334, 153306, 432465, 28933, 366555, 678337, 367967, 377475, 232755, 386312, 474038, 545944, 360181, 319583, 329085, 612234, 231787, 233591, 472044, 332176, 568593, 703058, 665933, 373357, 348680, 356363, 366078, 381631, 144681, 321551, 667343, 726938, 687097, 454942, 321474, 714633, 375304]
17086C75304O7357O6398K93458C32789O8983A79965J92864K51801N5310B24250
17075G48712C37568K64364j64988o5812K46572j78757A90944L03266J88230l15204
17065C67236l5281j1614K28557l744M6862K9445j82644J72648j71808M47368k07069
17054F79956k3689k04522Q5204N15540m47467P6998J68532p4031o2276j13775
17044F00470k46466M14021k82182J72129j42289K62249l41514N08129o9515l36104
17034E38928J27405k03025K26742K7066L4429k59401M31811k20858k08518k4391
17024D70188K16518K43363l77194M04969m27389j21704O17138j00796j45420R1567
17014H71240l4843l63787K77447J0192j17402J66607o187l02179N95712m0004
$$ y = [375304, 442661, 509059, 802517, 332789, 401772, 179965, 372829, 624630, 679940, 224250, 748712, 337568, 601932, 436944, 371132, 617704, 438947, 190944, 494210, 682440, 367236, 331955, 320341, 548898, 545154, 592016, 621461, 438817, 611465, 439657, 887025, 679956, 656267, 451745, 536949, 1052489, 605022, 682020, 850552, 776521, 714245, 600470, 354004, 768025, 485843, 657972, 515683, 777932, 436418, 944547, 875032, 538928, 666333, 463308, 690050, 717116, 751545, 492144, 923955, 703097, 494579, 470188, 686706, 930069, 552875, 957844, 530455, 408751, 1025889, 925093, 779673, 871240, 836397, 472610, 750057, 760249, 642847, 809454, 803267, 501088, 1096800, 1056796]
17004A056796K6729l93573K76192M6973O4862o5575r6268J26209m5390j75365
16994H21590K70142k96469K36499N5684j98444K30794k25205k19887j1066K94895
16984I58533k56R019J25876p4820j18316K80148l74452M98460j52169j01301J36788
16973A187510o6758j19601K02872j32389o5353J46988j03349k38826J43577K8576
16963I83247J43243K02518l1161k99856L51319j91140K08955q5875k39100K15834
16953A257984O7077R3717l7808J89441k60090K71098k45482j69725j47462J03129
16943A121879J33761j2469J07909K22249j87702J58237j17207O6800k99408L58249
16933A552298M9800j34856K18628m18266N12544k41923j90178K51015N16153m44975
$$ y = [1056796, 1083525, 689952, 966144, 1013117, 1077979, 1012404, 916136, 1042345, 996955, 821590, 1091732, 795263, 1031762, 1087446, 889002, 1119796, 894591, 674704, 663638, 958533, 958277, 967296, 1093172, 1018352, 900036, 1180184, 805732, 1304192, 1152023, 1050722, 1187510, 1120752, 1001151, 1204023, 1071634, 1006281, 1153269, 1049920, 811094, 954671, 983247, 1126490, 1329008, 1297847, 997991, 1349310, 1158170, 1367125, 1281250, 1042150, 1257984, 1325061, 1418778, 1380970, 1570411, 1310321, 1581419, 1335937, 1166212, 1018750, 1121879, 1255640, 1243171, 1351080, 1573329, 1385627, 1543864, 1426657, 1493457, 1194049, 1552298, 1602098, 1467242, 1685870, 1267604, 1780148, 1538225, 1348047, 1599062, 2115215, 1670240]
16923A670240j12337j26092K58617k79954L15993L6294k53842L26441J08503j41188
16913A802675m2469L20496o6819l28617L07461K15773m01887J23492J59498K00310
16903B289913j1854j16271k34618J7487M07089K60955m10457K31431j70090k39566
16893B024019J5759M85177m31819p0065K34640L6794J37172L22776k1664R5296
16883B828085m2482P9128Q46j85371j12863L83519m9540N0799R7621M0347k64359
16872B825730J40524J76351k82022N08225k33454j63637L27389J51745M408l24408
16862C130851L25857r4250N0473L39370r5545M39853m03455J63877r7844K26760
16852C985947J84586J58991L14760m44261K83159j0357j82438K00948K08351J97760
$$ y = [1670240, 1557903, 1431811, 1690428, 1410474, 1726467, 1762761, 1508919, 1835360, 1943863, 1802675, 1760206, 2080702, 2013883, 1685266, 1992727, 2208500, 1806613, 1930105, 2089603, 2289913, 2278059, 2161788, 1927170, 1944657, 2351746, 2612701, 2202244, 2433675, 2263585, 2024019, 2039778, 2524955, 2093136, 2023071, 2257711, 2294505, 2431677, 2754453, 2732789, 2828085, 2785603, 2864731, 2865577, 2680206, 2567343, 2950862, 2901322, 2952121, 3049742, 3090089, 2825730, 2966254, 3142605, 2860583, 3368808, 3135354, 2971717, 3299106, 3450851, 3455259, 3130851, 3456708, 3362458, 3412931, 3752301, 3656756, 4096609, 3693154, 3857031, 3759187, 3985947, 4170533, 4329524, 4644284, 4200023, 4483182, 4472825, 4290387, 4491335, 4699686, 4897446]
16842D897446P3134j4591j27877L30244n9188L8055K09224J76901j0298K34746
16832E747796J4627K55947l66558K67288l9215J92753J57017J28966K93489P2817
16822F724927J69766K42686J10J57515l0008L05824j80340N16811M28779L0724
16812H366794J13051o8271P33629Q6762Q7155l00965R15990k41019L27055K22819
16802A0243000J13695M15341L56827K17137J80641J59163O29615J43199O76340
16793A3134958l61910P90877O1920Q36085L17983K68893K14377J126839J24819
16784A6514841M93954L76915Q81967J23947O56656M89950P00895M18869R36600
16775B1594594P73388M90917J085479M83033R83899Q49990J180027P85606J419944
$$ y = [4897446, 4970580, 4955989, 4828112, 5158356, 5099168, 5137223, 5346447, 5523348, 5513050, 5747796, 5762423, 6018370, 5651812, 5919100, 5879885, 6072638, 6229655, 6358621, 6652110, 6724927, 6894693, 7137379, 7137489, 7295004, 7264996, 7570820, 7390480, 7907291, 8336070, 8366794, 8479845, 8411574, 9145203, 9231965, 9319120, 9018155, 9934145, 9693126, 10020181, 10243000, 10356695, 10772036, 11128863, 11346000, 11526641, 11685804, 12315419, 12458618, 13134958, 12773048, 13563925, 13625845, 14461930, 14779913, 15048806, 15263183, 16390022, 16514841, 17008795, 17385710, 18267677, 18391624, 19048280, 19538230, 20239125, 20657994, 21594594, 22367982, 22858899, 23944378, 24427411, 25411310, 26261300, 27441327, 28226933, 29646877]
16766B9646877J052560J115317J182711R32759J449903J155737J868796J368432
16758C9773092J601022K028742J631883J791000K332968J963449K383542K352369
16750E5858067K864040K405937K422938L144994L233873L402756L221257L187388
16742G9741250L965523L647822M374006L186504M345481M311559M266395L902009
16734A11740549M422334L763775L961108L666661L695136K865299K810846K583788
16726A39509496J438523J481621P81512K89171m00318q33565j338756k031165
16718A38896519k178205k987178k981352l225153l925625m131117l728811m261452
16710A11477626m204518m085159m430340m006524l785712l927048l712753l778006
$$ y = [29646877, 30699437, 31814754, 32997465, 33930224, 35380127, 36535864, 38404660, 39773092, 41374114, 43402856, 45034739, 46825739, 49158707, 51122156, 53505698, 55858067, 58722107, 61128044, 63550982, 66695976, 69929849, 73332605, 76553862, 79741250, 83706773, 87354595, 91728601, 94915105, 99260586, 103572145, 107838540, 111740549, 116162883, 119926658, 123887766, 127554427, 131249563, 134114862, 136925708, 139509496, 140948019, 142429640, 143211152, 143500323, 143100005, 142266440, 140927684, 138896519, 136718314, 133731136, 130749784, 127524631, 123599006, 119467889, 115739078, 111477626, 107273108, 103187949, 98757609, 94751085, 90965373, 87038325, 83325572, 79547566]
16702G9547566l631188k964220l686575k730192k972942k777678k887871k183706
16694E5713194k701209k221482k247850k094211j588953j744642k253629j196317
16686C9664901j673661j768605j064532j426933j489537j078526j752111m45750
16678B8965246j342528n41182j098444r01345j142080l69846r39921r45247k38714
16669B1445939r90689m37197r11906l05055n59238r40773r4289j031747n47558
16660A5627487j7540l05251q04926J85947n75088m95458m96112n08106j30243
16651A2480710j46926l56722k38748m09797j41359o98825L9909m91974L8759k31622
16641I843405m92773P1996l28760k01585M1462n44786L7596k64139k65342n6987
$$ y = [79547566, 75916378, 72952158, 69265583, 66535391, 63562449, 60784771, 57896900, 55713194, 53011985, 50790503, 48542653, 46448442, 44859489, 43114847, 40861218, 39664901, 37991240, 36222635, 35158103, 33731170, 32241633, 31163107, 29410996, 28965246, 27622718, 27081536, 25983092, 25081747, 23939667, 23569821, 22629900, 21684653, 21445939, 20455250, 20018053, 19106147, 18801092, 18241854, 17301081, 17206792, 16175045, 15627487, 15609947, 15304696, 14499770, 14685717, 14110629, 13615171, 13119059, 12610953, 12480710, 12333784, 11977062, 11738314, 11328517, 11187158, 10488333, 10528242, 10036268, 10075027, 9843405, 9350632, 9422628, 9093868, 8892283, 8933745, 8388959, 8426555, 8162416, 7897074, 7840087]
16631G840087j19927P0539n66185m0114j14140k83165J55026j74277l06526k02982
16621F258336j8767N882N5200m11902j9918Q916n07205J82368K10749l73232q7055
16610E303372j1748j8413k90266J29301k34045N0097l25336L03077n58518J86678
16600D534199M31311n23151Q7076l20346k20922K5648k83131R1884J27578J48707
16590D098853j72779n29454J46430P1919j94629K00556K89323k53658l07240J90606
16580C539927m80383J04666J28929o195k42124L8285P8678k70703P6182j33454
16570B833808P1854L18917n51109k69182K39804k0133j53716j4924N3078J26375
16560B634772K22378r3974p0608k28424j11341J40368j44402j63900L1703J20287
$$ y = [7840087, 7720160, 7790699, 7224514, 7184400, 7070260, 6787095, 6942121, 6767844, 6461318, 6258336, 6239569, 6245451, 6300651, 5888749, 5868831, 5877747, 5370542, 5552910, 5763659, 5390427, 5303372, 5291624, 5273211, 4982945, 5112246, 4878201, 4928298, 4602962, 4906039, 4347521, 4534199, 4965510, 4442359, 4529435, 4209089, 3988167, 4013815, 3730684, 3822568, 3950146, 4098853, 3926074, 3396620, 3543050, 3614969, 3420340, 3620896, 3910219, 3656561, 3349321, 3539927, 3059544, 3164210, 3293139, 3286944, 3044820, 3083105, 3161783, 2891080, 2967262, 2833808, 2905662, 3224579, 2673470, 2404288, 2644092, 2623959, 2470243, 2455319, 2508397, 2634772, 2857150, 2763176, 2692568, 2464144, 2352803, 2493171, 2348769, 2184869, 2216572, 2336859]
16550B336859o543j39913J04242k15334J9758n5300k02319L98887j22787k18067
16540A899483Q5086j44888K63542J02850l10624k7978k01927L38320l85196j10758
16530A507910K11976K5384M6440K88911n36715O4569M48599p69569K74940K24964
16520A787409k77566J07133r6795L76136l13666k1202n0892O8053K0842R6858
16510A696310m75627L82768j11244J50454k94717L20051n57870M00585k58210
16501A252500K16558Q4623m48484K27811m24431M59634m76028P63954k73921k29172
16491A153044j0112m4112q8581M27514r9037k38222P8257j30641K13027k05739
16481A055398K15785r7926l8332j22113K73000k13153k21649O00124k97605Q7820
$$ y = [2336859, 2330316, 2190403, 2294645, 2079311, 2099069, 2043769, 1841450, 2240337, 2117550, 1899483, 1984569, 1839681, 2103223, 2206073, 1895449, 1867471, 1665544, 2003864, 1618668, 1507910, 1719886, 1745270, 1791710, 2080621, 1543906, 1608475, 2057074, 1287505, 1562445, 1787409, 1509843, 1616976, 1520181, 1896317, 1582651, 1561449, 1510557, 1578610, 1599452, 1696310, 1220683, 1603451, 1492207, 1642661, 1347944, 1667995, 1110125, 1510710, 1252500, 1469058, 1553681, 1105197, 1333008, 908577, 1368211, 892183, 1656137, 1382216, 1153044, 1142932, 1098820, 1010239, 1437753, 1338716, 1100494, 1178751, 1048110, 1261137, 1055398, 1271183, 1173257, 1134925, 1012812, 1285812, 1072659, 851010, 1451134, 1153529, 1241349]
16471A241349m15084J82538J23015Q4476n02497L59441j61683J47955j3569l48355
16461F97586N08324j61709k82290J58100L97371n49864M27413k48095L5985j8909
16451I63912J15039n09210K53144j54361l2654K30119K62504j82715k34713J47409
16441H58474l22724J91768Q4865j0130p5545L41542k88810M0614k5334k22218
16431E72502j01838N19504J91501D33500r1531N19421j19902J85685j78508J30978
16421H79643j5240k00391O3387M3622k97742M72983k08581l64642M93564l40085
16411E26518A86338M88093j71645N13282D40095M56043k37959L3641k09699j18454
16401C63667K93614C00089K93123k34840M56955j52810j53800m8589K14621L6620
$$ y = [1241349, 826265, 1008803, 1131818, 1216294, 713797, 1073238, 911555, 1059510, 1045941, 697586, 1205910, 1044201, 761911, 920011, 1317382, 767518, 1194931, 946836, 982821, 963912, 1078951, 569741, 822885, 668524, 635870, 865989, 1128493, 945778, 711065, 858474, 535750, 727518, 812383, 802253, 726708, 1068250, 779440, 820054, 794720, 572502, 470664, 990168, 1181669, 433500, 341969, 861390, 741488, 927173, 748665, 879643, 864403, 664012, 727399, 771021, 473279, 946262, 737681, 373039, 866603, 526518, 186338, 674431, 502786, 1016068, 440095, 896138, 658179, 691820, 482121, 363667, 657281, 300089, 593212, 358372, 815327, 662517, 508717, 460128, 674749, 711369]
16391G11369K54881D75893J90319j03126k14200K85416k30151M24970C40893J25690
16381D66583L41652k16969J35846K42302k99039l03590g6436D78207J336j33734
16371C45809l9783J15557N9521L73883k78245G5963K94859j14559m6467J97064
16361D06860O6480k26078K10998A75200K60978A95419O7664J88931j26892K6073
16351C51195r823J21058A50333M00253M0849m5192j17178K05030k52623P7387
16341D58859n2064K7892j1346q7219J96722Q2716l8125k08851A24929J88831J50496
16330D64256m9198j84978J48216k92I4656M95566r2802q5846o8331N65750D01659
16318B56020L29937q7025j89452A8897M28414k23517M8974K1101l2427i326A35300
$$ y = [711369, 966250, 475893, 666212, 563086, 348886, 634302, 404151, 829121, 340893, 466583, 808235, 591266, 727112, 969414, 670375, 366785, -76436, 478207, 479543, 345809, 306026, 421583, 481104, 854987, 576742, 75963, 370822, 256263, 209796, 406860, 473340, 247262, 458260, 175200, 436178, 195419, 263083, 452014, 325122, 351195, 341372, 462430, 150333, 550586, 591435, 546243, 429065, 634095, 381472, 458859, 406795, 434687, 423341, 336122, 532844, 615560, 577435, 368584, 124929, 313760, 464256, 415058, 230080, 378296, 378004, 94656, 590222, 497420, 411574, 343243, 908993, 401659, 256020, 585957, 498932, 309480, 18897, 447311, 223794, 272768, 293869, 261442, -9326, 135300]
16306B03227J69531R1088k2802A16266K94647P1565O70K04522l19044A69046J56758
16295C25804L645j49247L64183j92429a31470A65931N4832J57988H4090M80844
16285E64934k70394m0246A16107J36841J2892f4238B42015J41311J07997A93123
16274A01768L51840j54404J92956A48461Q9459L4719k005j3703K50977k07043
16264C00865K12028J67956C25860l9622J73698j64215L5192E8178L48076D1798
16253B41898J51145j0116j71642d2010I5371J94553j31936K77787G6502J77899
16243B54401R598I3468J07140L62039B17326F6362R0718J71147M7501o3227A41954
16231B72094A04293m3148K25432r1341k8418J6533O6250J28987A43186k7738J81385
$$ y = [203227, 372758, 463846, 441044, 116266, 410913, 482478, 483148, 687670, 368626, 169046, 325804, 329449, 180202, 544385, 351956, -131470, 165931, 220763, 378751, 84090, 564934, 294540, 254294, 116107, 252948, 265840, -64238, 242015, 383326, 491323, 193123, 101768, 453608, 299204, 492160, 148461, 237920, 272639, 270634, 256931, 507908, 300865, 512893, 680849, 325860, 286238, 459936, 295721, 330913, 58178, 406254, 41798, 241898, 393043, 382927, 211285, -42010, 95371, 289924, 157988, 435775, 76502, 254401, 263999, 93468, 200608, 562647, 217326, 66362, 157080, 328227, 375728, 312501, 141954, 272094, 104293, 61145, 286577, 195236, 166818, 183351, 249601, 378588, 143186, 115448, 296833]
16220B96833l9610J65295L6599I4609J29963J22145A62519b4069A24108M4133
16210A68241L30494p2615f7979n9308B11108I8532J4429K63670A75391J88133
16200C63524j78913a18626p5745A12824b79744D15575e1775A75796k3371j8893
16190A33532i5726C34341l4457R323L02153e8247C51071A05988K9040J49695H4309
16178F9312a9716q5287j46696D5421L70910j95207E9338a7671A12879C6963Q9127
16167A26090P5089C3594L19884m2227a25425c1627A15500f0303E8639K40996j48158
16156A51477O8161A03384N9870B1426h9751B69936b60748D4299j7700M03J80478
16145B07480a5814B46792C1117d02354B64522G6107K12580n4341q7311n7610M393
$$ y = [296833, 257223, 422518, 459117, 94609, 224572, 346717, 162519, -24069, 124108, 168241, 498735, 426120, -67979, -127287, 211108, 98532, 112961, 376631, 175391, 363524, 184611, -118626, -194371, 112824, -279744, 415575, -51775, 175796, 152425, 133532, -95726, 334341, 299884, 309207, 611360, -58247, 351071, 105988, 135028, 284723, 84309, 69312, -19716, -105003, -251699, 45421, 416331, 221124, 59338, -17671, 112879, 36963, 126090, 201179, 33594, 353478, 311251, -125425, -31627, 115500, -60303, 58639, 299635, 151477, 219638, 103384, 163254, 21426, -89751, 269936, -260748, 44299, 26599, 27002, 207480, -15814, 246792, 31117, -402354, 264522, 76107, 288687, 234346, 147035, 89425, 93818]
16134I3818a38058A27842J61156C081a66567j78351J49491C3271d0710j60551
16124b01261A9289m2a41933e2760l7398B00149c6860B2996K4207L6268K87998
16113C71469a6762B14063n3365c65377B27349p0247J9402G9266N6752K42483B3883
16101C97701j11180f7516A27420K0591l8860f3060k12689B89321i160q636C00163
16089B45840q4425c4839A51115M5476j4015K02542A30569P5380J70576b03286
16078E6169c0970A67675n8758L13629a53401d0855G861K18563i6666A61195G9487
16066B24125G3557a36679A20172J68155e2225J742A91543h7718k5531B84476A06482
16054B13000D5500J41687i0769B13781p3679i105K035B07954G243K52451a11795
$$ y = [93818, -138058, 127842, 288998, 3081, -166567, -344918, -195427, 33271, -40710, -201261, 19289, 19247, -141933, -52760, -90158, 200149, -36860, 22996, 47203, 83471, 371469, -16762, 214063, 160698, -365377, 227349, 157102, 176504, 79266, 136018, 378501, 23883, 397701, 286521, -67516, 127420, 148011, 109151, -63060, -275749, 289321, -9160, -17796, 300163, 245840, 161415, -34839, 151115, 196591, 182576, 385118, 130569, 205949, 376525, -203286, 56169, -30970, 167675, 108917, 422546, -153401, -40855, 7861, 226424, -96666, 161195, 79487, 224125, 73557, -136679, 120172, 288327, -52225, -50483, 191543, -87718, -113249, 284476, 106482, 213000, 45500, 187187, -90769, 213781, 140102, -9105, -7070, 207954, 7243, 259694, -111795]
16042d7493j37144n2724L1912e3425a2180A91518O4257H7231a46342A31875J49972
16031B81847i2326c9524q0636D1201J82993q5876J72584j15695c31842C48519
16020C40075b12399J04256E4787i3694I2768j4678a72541F7292J00186M3460a01656
16008I8385a27607B22597e5938f855j42237O119C42277A04116L2051f3337I0397
15996A41590i7933C91099j61232F9644K1159J79290G6613K06485b64517a30059
15985B51925j0710K25065F593K07392e5716A08576D1797J37853n3945J10389m0955
15974A95139b77695a4977o2223p8848n1366m9761c3113I4321g4560C02448i3748
15962A05851N816a72110B96053G7024J49812a81314M7721k8823B8513J0087a51664
$$ y = [-47493, -184637, -237361, -205449, -53425, -12180, 191518, 255775, 87231, -146342, 131875, 281847, -92326, -39524, -120160, 41201, 224194, 138318, 310902, 195207, -331842, 348519, 340075, -212399, -108143, 54787, -93694, 92768, 78090, -172541, 67292, 167478, 210938, -101656, 98385, -127607, 222597, -55938, -6855, -149092, -142973, 342277, 104116, 136167, -63337, 90397, 141590, -97933, 391099, 229867, 69644, 90803, 270093, 76613, 283098, -264517, -130059, 251925, 241215, 466280, 6593, 213985, -55716, 108576, 41797, 179650, 125705, 236094, 195139, -277695, -14977, -77200, -156048, -207414, -257175, -33113, 94321, -74560, 302448, -93748, 105851, 111667, -172110, 296053, 77024, 226836, -181314, -133593, -162416, 28513, 38600, -151664]
15950D7616c6243h121p2942L7169A29057b56246I4712N7805b06340i1904A65490
15938B26516g5263D5385b84145i2523l29959a7818E63J03182J25797A04366a14384
15926e8540k7494A33378c02922A75197m7163B9541j566J06862b54720c7899k3739
15915f1638r8412D1896N1144d4238k19597A82958a11639A24037J3349A4059J9962
15904C4021e2097A74040n4036m7367a00174F6895j8460L13062a34930H8724a1100
15892b48814j0944a6591A98093C243b97668Q8659A0087J83946a31131e4790A13537
15880H0696k3951a94508H3190c8541j34752B12626r9801n032M9550d973A54413
15868A28103F0259a96369A2353J4053J94191H0062M2333b42989e7242B11798a22027
$$ y = [47616, -36243, -8121, -81063, -43894, 129057, -256246, 94712, 152517, -206340, -91904, 165490, 226516, -75263, 45385, -284145, -92523, -422482, -17818, 563, 103745, 229542, 104366, -114384, -58540, -86034, 133378, -302922, 175197, 128034, 29541, 27975, 134837, -254720, -37899, -61638, -160050, 41896, 93040, -44238, -263835, 182958, -111639, 124037, 137386, 14059, 34021, -52097, 174040, 120004, 72637, -100174, 66895, 48435, 361497, -134930, 88724, -11100, -248814, -259758, -16591, 198093, 3243, -297668, -209009, 10087, 194033, -131131, -54790, 113537, 80696, 56745, -194508, 83190, -38541, -173293, 212626, 112825, 107793, 157343, -4973, 154413, 128103, 60259, -196369, 12353, 26406, 220597, 80062, 122395, -242989, -57242, 211798, -122027]
15856b32654P9243A09892J94584g2114I6036k9693J94837D9351b61577m8592e5577
15844A68497e3671a0168A08723O514e3431e998j92887A65947G9193b2709A25079
15832B83597j01372c70078a14892A80983n2309c55653C581d6301H2183a02537
15821C02281c16066E9568b62571e3985A7344i3005L8851D0587a97587A10783g0705
15809B73963h8569E271J12763e5253k28676a11128I6162k3590l1036K17570a01850
15797A35982a70855k11544J90625A61208p443c0528B5136f5226k52420C3225c35947
15785H0040J33459l1364a65512C59468b3693k17913j35677a06343F288b84959
15774I9497a11695j37099a68A95782a07715A01660d093A41874a08207l8304C5052
$$ y = [-232654, -153411, 109892, 304476, -72114, 96036, 66343, 261180, 49351, -261577, -310169, -55577, 168497, -53671, -10168, 108723, 115237, -53431, -5998, -198885, 165947, 79193, -22709, 125079, 283597, 182225, -370078, -114892, 180983, 128674, -355653, 3581, -46301, 82183, -102537, 302281, -316066, 59568, -262571, -53985, 17344, -93005, -54154, 40587, -197587, 110783, -70705, 273963, -88569, 5271, 118034, -55253, -283929, -111128, 96162, 72572, 41536, 259106, -101850, 135982, -170855, -382399, -191774, 161208, 153765, -30528, 25136, -65226, -317646, 33225, -335947, 80040, 213499, 182135, -165512, 359468, -23693, -241606, -377283, -106343, 6288, -284959, 99497, -111695, -248794, -168, 195782, -107715, 101660, -4093, 141874, -108207, -146511, 35052]
15762A04929O9686a18139L4210A94464h4955C37111l5949j43704d0883C4311a44716
15750A68190D5829J5963a11858k1044K6789l0609A62171R7674n7474a9052j34517
15739a53569A64969D7949a40727o0706p7073F0439a90263j86095b8746B3158p437
15728A5721c0126m7520A30005D1599L8520f3413B12039b48996a16035C05060a83336
15716g7947G9969M4771l5574k8101c64348A87537b36200J003h2285k1022o1106
15705a64413J3302n2757i3333m0386p2490B81793H340L67786f8290r4344H5856
15693D99P8453J10781i9093A97442b0638l78794f3538o7562o7981B9857d00173
15681B44602b550o1861c0846k8767n1944K3046o4790j80946b8362K820p7419l0002
$$ y = [104929, 174615, -118139, -83929, 194464, -84955, 337111, 301162, 157458, -40883, 34311, -144716, 168190, 45829, 61792, -111858, -132902, -106113, -136722, 162171, 259845, 202371, -19052, -153569, 164969, 47949, -140727, -201433, -278506, 60439, -190263, -376358, -28746, 23158, 15721, -30126, -77646, 130005, 41599, 80119, -63413, 212039, -248996, -116035, 305060, -183336, -77947, 79969, 124740, 89166, 61065, -364348, 187537, -236200, -235197, -82285, -103307, -164413, -151111, -203868, -93333, -133719, -206209, 281793, 8340, 376126, -68290, -162634, 85856, 499, 78952, 189733, -99093, 197442, -20638, -399432, -63538, -131100, -199081, 29857, -400173, 244602, -2550, -64411, -30846, -59613, -111557, -88511, -153301, -334247, -28362, -25542, -102961, -132963]
15669a32963B2563f205j42839K9013B64654b09139J5909j48917A7863L7367L6854
15658I2084i8198n6031A67699b29958f7645A29017g7420A66754l4588d040p9879
15647h3919K4962D0174J81657a01635B41418D8828q855c60788h97A81859O4684
15636B46543k6728h5840l76824a85472B98116d8676g805j56236J0789O9988J7488
15625f5776b7302G8404C4752J56502h1914o1095e2325B62139b91774c1258A98578
15613B19465D4581J11146Q2908E1975j6078M4687C1336c2922A7108O3800a54157
15601D1873a82372c7749B2856b1258k5625j2840B30527j1235r4719N3667b03943
15589F4308L1398J10806a51083b7439B50414o4265a1586q5389m72968B5042K46665
$$ y = [-132963, 22563, -6205, -149044, -120031, 264654, -209139, -193230, -342147, 17863, 55230, 92084, -98198, -154229, 167699, -229958, -67645, 129017, -77420, 166754, 132166, -4040, -83919, -58957, 40174, 221831, -101635, 241418, 48828, 39973, -360788, -897, 181859, 246543, 219815, -85840, -462664, -185472, 298116, -48676, -7805, -164041, -153252, -83264, -65776, -27302, 78404, 34752, 191254, -81914, -143009, -52325, 262139, -291774, -31258, 198578, 219465, 44581, 155727, 238635, 51975, 35897, 80584, 31336, -32922, 17108, 80908, -154157, 41873, -182372, -37749, 22856, -21258, -46883, -59723, 230527, 219292, 124573, 178240, -203943, 64308, 95706, 206512, -151083, -27439, 250414, 186149, -11586, -96975, -569943, 25042, 271707]
15578B71707h3141j21658R9233q0888G1742J88951I609d35946G2570a40027G1662
15566b20155l4215a7412k02484h0674A99212b29609J10321B59629a93932h6035
15555B84797f3699l1498A43113d7662A44137M0605e7069B17186c8132k17442a5026
15543a42567G7469J46281M1947l0851a43520E24898A91411L8939a59686F4360
15532a5039j2355R547m6789B78748f699A92071l2999c8088G3012k460a9187m6962
15520f6149H155e4381q2644A51742M2056p8958h3266b523k40017B2508a89336
15508A62276e5605B06088b8905j46373I5940c1407q9882A16289L3183J15161a74115
15496I8873P2886F6987K2236m3552B307i8903A4019K16115p6621D2711b06610
$$ y = [271707, -83141, -204799, -105566, -186454, 71742, 260693, 9609, -435946, 72570, -140027, 71662, -220155, -254370, -17412, -219896, -80674, 199212, -229609, -119288, 259629, -193932, -86035, 284797, -63699, -95197, 143113, -47662, 144137, 184742, -57069, 217186, -38132, -255574, -15026, -142567, 77469, 223750, 265697, 234846, -143520, 524898, 191411, 230350, -159686, 64360, -15039, -27394, -17847, -64636, 278748, -6699, 192071, 159072, -38088, 73012, 70552, -19187, -66149, 8155, -54381, -137025, 151742, 193798, 114840, -83266, -2523, -242540, 22508, -189336, 162276, -55605, 206088, -28905, -175278, 95940, -31407, -121289, 116289, 149472, 264633, -174115, 98873, 171759, 66987, 89223, 45671, 2307, -98903, 14019, 230134, 153513, 42711, -206610]
15484A70870Q651a94596A19072B5317J66457n0243a9919C1415P7418A9909f9174
15472a37291A8835J05989b87286A92203F0113e7869A71386a22267L2331k57183
15462c47119e8676g231B38272a89993m6716C15444a98924A94427a34953K6390
15452a08563B2256K17069m2344g5512H2444k4800a01013j4783m3708P3098j21816
15441b08222R1782j74461a32016e7561A39522K19761a06635N2723F7820k9531
15431C8289b38531f7207p8572c0291q5289n7071f3867E7590b39102a4691F6850
15419b06886C8912a79795G2063J36086O9976c77568I0890D0743i713j68825D1983
15407B24357a33448J0574A97846m3462A8043R5178b18351A96059N6439a90735
$$ y = [170870, 179521, -194596, 119072, 25317, 191774, 141531, -19919, 31415, 108833, 19909, -69174, -137291, 18835, 124824, -287286, 192203, 60113, -57869, 171386, -122267, -89936, -347119, -58676, -7231, 238272, -189993, -236709, 315444, -198924, 194427, -134953, -108563, 22256, 239325, 196981, -75512, 82444, 57644, -101013, -115796, -159504, -86406, -208222, -116440, -290901, -132016, -57561, 139522, 359283, -106635, -53912, 67820, 38289, -238531, -67207, -145779, -30291, -115580, -172651, -63867, 57590, -239102, -14691, 66850, -206886, 38912, -179795, 72063, 208149, 278125, -377568, 90890, 40743, -9713, -178538, 41983, 224357, -133448, -122874, 197846, 154384, 18043, 113221, -218351, 196059, 252498, -190735]
15396A64730l6267c0295A3669b22345B76824j10258l3650h6265J3445E9490A0235
15384C547h920j53084f5600A80551G1564e7846a570B4511K74309A24922b37086
15372a29390C9779b3320A24596A7676b58372b4889G8819I203P7359C66a03147
15360A06068b424B18040B8853L4438J55910m4014a91368P0875A87138f5547I0307
15348a67355O9445n2713o2924O3984f4420K1293p1623c4785B14601a65452a2690
15336A33023e4638K1902o8967j81137O2050a2682n4203k9118C02177H8186a7593
15324d1082A34337a35010c222D11126b5460A98632c05628a11246c6827B97426
15313E0258q982J57181c31369D186J6882J58497K8809d814o0838A8266R9339g1545
$$ y = [164730, 128463, -30295, 13669, -222345, 276824, 166566, 132916, -86265, -72820, 59490, 10235, 3547, -8920, -162004, -65600, 180551, 71564, -57846, -1570, 24511, 298820, 124922, -237086, -129390, 39779, -23320, 124596, 17676, -258372, -24889, 78819, 9203, 86562, 366, -103147, 106068, -2424, 218040, 28853, 63291, 219201, 175187, -191368, -120493, 187138, -65547, 90307, -167355, -97910, -150623, -213547, -149563, -64420, -43127, -114750, -34785, 214601, -165452, -12690, 133023, -54638, -32736, -101703, -282840, -220790, -12682, -66885, -96003, 302177, 88186, -17593, -41082, 134337, -135010, -3222, 411126, -25460, 198632, -305628, -111246, -36827, 297426, 50258, 41276, 198457, -331369, 4186, 21068, 179565, 208374, -4814, -65652, 18266, 117605, -71545]
15300A02751e104A03843J79293a33968B23802H3037d1091B8278a07751q2111A84737
15288a76069d7469B85025b29748F1065K41318a83534H074J55242J31618j31546
15278A63388c5915j92289C27254a72522B6911b01409N7861K9907E940b22953E9434
15266i7482m1555A25672D8194R8578i172A86477N8546J34929A3328M3619J12901
15255A69848a40156C5012K28193P6571L12802q4021O92368R36382o83068K6086
15245A540325K56241F09020J41955B18621a14055I2375J62145j22823a05925A64737
15234A04731L2679E3440d06577A23996L57136A60987K10617j431c7368B12490
15223c8288A24876Q1804A8257i9519B20477n8855b08201C1714J81266j00301c15259
$$ y = [102751, -5104, 103843, 283136, -133968, 223802, 83037, -41091, 28278, -107751, -189862, 184737, -176069, -47469, 285025, -229748, 61065, 302383, -183534, 8074, 163316, 294934, 163388, -35915, -228204, 327254, -172522, 26911, -201409, -143548, -113641, 5940, -222953, 59434, -97482, -139037, 125672, 48194, 146772, -9172, 186477, 245023, 379952, 13328, 56947, 169848, -140156, 35012, 263205, 339776, 652578, 568557, 1260925, 2197307, 1514239, 1540325, 1796566, 609020, 750975, 218621, -114055, 92375, 254520, 131697, -105925, 164737, 104731, 137410, 53440, -406577, 123996, 481132, 160987, 371604, 370173, -37368, 212490, -38288, 124876, 206680, 18257, -99519, 220477, 161622, -208201, 31714, 212980, 112679, -315259]
15211C07063b0155A56296i075C8293b11235A39433n0528d4103B43397m1517H4134
15199f8462j54353A90807D667R0463J91039o9231J85331A41131e29481C27180
15188B00764a5122A56447a45816B59656a85188g6506A64630P4056o6602b99186
15177B80003b14526D8813J07001M2729K63973q5936E1878L3719J0838a72745A11636
15165G4539J579K49624p6173a15655C31067H5673f6834o0884H2030B4381J63697
15154A88078k5568a72015B61479j19954C2809g6041H5234C63b2355B05112a00900
15142b43879h0146A20493J02838a44477d0257A06216l0147B9099b30131d6973
15131B17223G3671B3249a84357A17482l9429C7308N149a1030B67230l3716I7819
$$ y = [307063, -20155, 156296, -9075, 38293, -211235, 139433, 88905, -44103, 243397, 201880, 84134, -68462, -222815, 190807, 4667, 95130, 286169, 216938, 402269, 141131, -529481, 327180, 200764, -15122, 156447, -145816, 259656, -185188, -76506, 164630, 238686, 172084, -299186, 280003, -214526, 48813, 155814, 198543, 462516, 376580, 51878, 85597, 96435, -172745, 111636, 74539, 76118, 325742, 249569, -115655, 331067, 85673, -66834, -127718, 82030, 24381, 188078, 162510, -172015, 261479, 141525, 32809, -76041, 85234, 363, -22355, 205112, -100900, -243879, -80146, 120493, 223331, -144477, -40257, 106216, 76069, 29099, -230131, -46973, 217223, 73671, 23249, -184357, 117482, 78053, 37308, 42457, -11030, 267230, 233514, 97819]
15119C6125L75146H9121a05057o8275e8872A98676A9864a62081A96924a47388
15108A4963b52882d833q2926p643D9771J67362K15059a21772A29439c658k970
15097f628C30484A63836b80391A55770n8276P3164J98248A70375K45899e042C10790
15085A91573B3693c499k10739F7001e0736C7733J34908p320o4478a9141D49730
15073B66683f3185C55595d2193A36007m5981M70851B25181J15205a06712D51158
15062c917A95054k8148B3871J96689r4654j7784D2259J8535q64b3087A86610R495
15050A96105G5717j5021L9407J30340f1079B60326o8907K8115l1068J33601A08643
15038D7600L13647j67912j1510q0574e8306A38835J65213e0274A91410G0656J73924
$$ y = [36125, 411271, 89121, -105057, -173332, -58872, 198676, 19864, -162081, 196924, -147388, 14963, -252882, -4833, -87759, -95402, 49771, 217133, 432192, -121772, 129439, -3658, -6628, 330484, 163836, -280391, 155770, 97494, 170658, 368906, 170375, 416274, -5042, 310790, 191573, 23693, -3499, -214238, 67001, -50736, 37733, 172641, 165321, 100843, -19141, 449730, 266683, -63185, 355595, -42193, 136007, 90026, 560877, 225181, 340386, -106712, 451158, -3917, 195054, 166906, 23871, 220560, 125906, 108122, 42259, 60794, 59930, -23087, 186610, 196105, 75717, 60696, 100103, 230443, -61079, 260326, 191419, 219534, 188466, 322067, 108643, 47600, 361247, 193335, 181825, 101251, -58306, 138835, 304048, -50274, 191410, 70656, 244580]
15027B44580G8517R0814g33D7585K06171o7301P9129Q05J89178a29302A25701
15015A27318k9864J23010A3301N35335B06426N4730j04039l6196A5213J66011
15005A81224H0009N8332K39103A34809b7658B9943A4480L056K08265j3604K47281
14994D59478B20554N4932K3950Q8774G3595K88656A59639J93293A67293J79094
14984C46387j144j26995O0067K64656A87846d0892B81835m0272G2160J6769h8641
14972A55877n2276K53976A1832N20188B15516a43461B91605L7531A63691K33797
14962C97488j90700B3049K67970J45618k7013a86291H4694J74343r7921F3917
14951B77782j01656D2934K62050i9103A54429J30917p8777b5341C38706f9D63904
$$ y = [244580, 78517, 169331, -733, 47585, 253756, 186455, 265584, 266389, 455567, -129302, 125701, 127318, 97454, 220464, 13301, 548636, 206426, 261156, 157117, 120921, 15213, 181224, 80009, 138341, 377444, 134809, -27658, 29943, 14480, 17536, 225801, 212197, 459478, 220554, 275486, 299436, 388210, 73595, 362251, 159639, 352932, 167293, 346387, 345243, 218248, 278315, 542971, 187846, -40892, 281835, 241563, 72160, 88929, -88641, 155877, 103601, 357577, 11832, 532020, 215516, -143461, 291605, 329136, 163691, 397488, 206788, 23049, 291019, 436637, 409624, -186291, 84694, 259037, 161116, 63917, 277782, 176126, 42934, 304984, -99103, 154429, 285346, 206569, -25341, 338706, -69, 463904]
14939B81797J34060j87728J65337j37100A03794J64121j6624H0438O180K11800
14929B98418j04508L49992A47226a92220A04088K80212C9966K44407R7579j35636
14919B46316n1599O8551K5703J57562B21282N9117K04413j77958D4801J86313
14909B31114L50637k47242P604K5140j1590L70939A85431J28478M5570r9938H2776
14897A25275J21809R1984j15062K75169k27768J4499j32299L19653K24341j46071
14887E51530k15427P9001K18967j46208Q6182k42233r0460J97675k211j06180
14877C30636J17783m2552L39558k40296j74434K60582B49926p6114a17516A30487
14866B69721J26268n152m3742K10800A85827L82291j09156L22758l56151L1903
$$ y = [281797, 415857, 228129, 393466, 256366, 103794, 267915, 251291, 80438, 86618, 298418, 193910, 543902, 147226, -192220, 104088, 384300, 39966, 284373, 381952, 246316, 194717, 263268, 288971, 446533, 221282, 280399, 484812, 306854, 44801, 231114, 581751, 334509, 342113, 367253, 355663, 726602, 185431, 313909, 359479, 259541, 82776, 125275, 247084, 339068, 224006, 499175, 271407, 285906, 153607, 473260, 697601, 551530, 336103, 415104, 634071, 487863, 574045, 331812, 241352, 439027, 436816, 330636, 448419, 405867, 745425, 505129, 330695, 591277, 249926, 173812, -117516, 130487, 269721, 395989, 390837, 347095, 557895, 185827, 568118, 458962, 781720, 425569, 457472]
14856D57472L5496M0586G8731J46213M22416k29292A41102M20268B65972R5673
14846C61645J77500k40746q1149J71086J3212k702N4721j29210j32668J87887
14836C79576l6198L74115l21157j78080J05737j40709L01224m6309o1690J53034
14826E29543j96644P7617j0436p5226n9019J23548J46543j22262n0985M9754J15765
14815E28198j81370K62096k32487K35242j91674J42995Q7962r608j55316L1254
14805E17292J79016J17199l14322k11522N2721R6469n1300M40241l02535R3349
14795F16608K8509m349k26162Q4940k24420K518L31495L329q0201B59965O1205
14784C21170K16338r1395L4974B07983J29184K21500G3753O50970k26325I3398
$$ y = [457472, 492968, 533554, 78731, 224944, 647360, 418068, 141102, 561370, 265972, 361645, 539145, 298399, 217250, 388336, 401548, 398846, 453567, 324357, 191689, 379576, 343378, 717493, 396336, 218256, 323993, 183284, 484508, 438199, 376509, 529543, 332899, 410516, 400080, 324854, 265835, 389383, 535926, 413664, 362679, 412433, 528198, 346828, 608924, 376437, 611679, 420005, 563000, 650962, 641354, 486038, 517292, 696308, 813507, 499185, 287663, 340384, 436853, 385553, 825794, 523259, 616608, 645117, 640768, 414606, 499546, 275126, 277644, 609139, 612468, 532267, 259965, 321170, 537508, 446113, 481087, 207983, 337167, 558667, 73753, 724723, 498398, 93398]
14773G87942C48175P0479j8467J13220J47064l2309j65086L10554j8612P6973
14763H31991j32346k37156j50763K94648o4878K32775k41974J54708k28242O1227
14753E19990M4333R5896o37o1034m2099J65840O5189B65341M29140n7616Q9412
14742G26277k64892K55106C32331M00804K74690C79071M92921o6428j08201J26671
14732H24034J02209J55496j10083l4587o8547m03528k8755N07563j29600q331
14722H05871m9793N3576P1824j00283l08664k998K46082k65215L21552k7547K08887
14711I53292l0252l31699L15434j3896j09164j50710J78199j82959j86930L02924
14701G44239J94443p9250K46605D77319N14311m08522K18796K68438k62676J10888
$$ y = [787942, 348175, 418654, 400187, 513407, 660471, 628162, 463076, 773630, 755018, 831991, 699645, 462489, 311726, 606374, 541496, 774271, 532297, 687005, 458763, 519990, 564323, 660219, 659582, 598548, 556449, 722289, 787478, 265341, 694481, 636865, 726277, 461385, 716491, 332331, 733135, 1007825, 379071, 871992, 805564, 697363, 824034, 926243, 1081739, 971656, 937069, 868522, 464994, 436239, 943802, 814202, 805871, 756078, 809654, 881478, 781195, 472531, 469533, 715615, 450400, 771952, 744405, 953292, 923040, 591341, 906775, 892879, 783715, 633005, 811204, 628245, 441315, 744239, 938682, 859432, 1106037, 477319, 991630, 583108, 801904, 1070342, 807666, 918554]
14691I18554k19995J37357J31104J9148k62045k4195L4913L2831J20033p7226
14681H10479q2482M48909k25084J15263k16514q8668K92326J16999k92635J83055
14671A061648o5948J4764j52891R521J30389p8098J73460k98915j32344N77208
14661A238794o150l11546j54739K46995P9680O6578r5909Q6232k40221K91445
14651A201159j02870J8362j20524K21971n18319L02368J12865J29327j2938k54167
14641I77234L43751l76333J55709K07961J19847k7517k10175K84334k24088J80917
14631A431640F82936M13402L16415l11644k9673M53033l08618J2618l23996L79704
14621A284177M5034j83514L92382o8615K61734k62972j80687J44092k26202J67756
$$ y = [918554, 698559, 835916, 967020, 986168, 724123, 699928, 734841, 767672, 887705, 810479, 727997, 1176906, 951822, 1067085, 850571, 761903, 1054229, 1171228, 878593, 1061648, 995700, 1010464, 857573, 867094, 997483, 919385, 1092845, 793930, 661586, 1238794, 1232644, 921098, 766359, 1013354, 1093034, 1159612, 1063703, 1149935, 909714, 1201159, 1098289, 1116651, 996127, 1218098, 699779, 1002147, 1115012, 1244339, 1231401, 977234, 1320985, 944652, 1100361, 1308322, 1428169, 1400652, 1190477, 1474811, 1250723, 1431640, 682936, 1096338, 1412753, 1101109, 1071436, 1524469, 1215851, 1228469, 904473, 1284177, 1329211, 1145697, 1538079, 1469464, 1731198, 1468226, 1287539, 1431631, 1205429, 1373185]
14611A373185p0168P7703r8431L11786j36617O5748J0046J6748l77058J53169
14601A326111k4033J32887M98337l33172j14991K73955k25377Q1955K09295o935
14591A818032j32988J2898k57959M31541j49853k44275J90939m5852L14505K2332
14581A959320M794k87012Q0424M36111l99647j5214L97852m11353M25979n8312
14571B132942j79450j53848L4927M16630J62496l43378j13006N97939m9092n8786
14561B447374j04210J67901N28904l38149K34197J63887m7222L18842J68050N85123
14551D124697N58738J099732K759047M959758J0763603J2772539K736496A9296539
14542H989777m363003j672215m53737j90270m22182J92358n94710J91460L03126
$$ y = [1373185, 1303017, 1380720, 1282289, 1594075, 1457458, 1523206, 1533252, 1550000, 1172942, 1326111, 1302078, 1434965, 1933302, 1600130, 1485139, 1759094, 1533717, 1615672, 1824967, 1818032, 1685044, 1697942, 1439983, 1871524, 1721671, 1477396, 1668335, 1622483, 1936988, 1959320, 1964114, 1677102, 1757526, 2193637, 1793990, 1778776, 2176628, 1765275, 2191254, 2132942, 1953492, 1799644, 1834571, 2251201, 2413697, 2070319, 1957313, 2555252, 2506160, 2447374, 2343164, 2511065, 3039969, 2701820, 2936017, 3099904, 3052682, 3371524, 3539574, 4124697, 4683435, 5783167, 8542214, 13501972, 24265575, 37038114, 39774610, 19296539, 8989777, 4626774, 2954559, 2500822, 2310552, 1888370, 2080728, 1486018, 1677478, 1980604]
14533A980604J61816l88462L37727l4022n5800K00118k08451J87147m2092L8902
14523B177487j0649J4613J87508j58859K89216j62559J00355k9030k8277K55284
14513B635089J92920l69919N7041K77088L6936j27507Q933N7137o5907r8815K86535
14502B889531J95112j16593L04281l24920O6328J38728j71713J22547J89683r3083
14492C199901Q7938k94391J34380M13294j93331O819O3508J22710r89j29305k9525
14481C381009Q7885l6506m3075M29320l8097K32742l74158N6960K52207J05028
14471D053315J4970j3131n490j25045N26628k70768J26788J9029k7331j7556o8750
14460D212659K93686j10193J17993r650K3035J11400O9678j12322O7826N98687
$$ y = [1980604, 2142420, 1753958, 2091685, 2057663, 2001863, 2201981, 1993530, 2180677, 2138585, 2177487, 2166838, 2181451, 2368959, 2210100, 2499316, 2336757, 2437112, 2408082, 2379805, 2635089, 2828009, 2458090, 2515131, 2792219, 2829155, 2701648, 2710581, 2767718, 2701811, 2602996, 2889531, 3084643, 2968050, 3272331, 2947411, 3013739, 3152467, 2980754, 3103301, 3292984, 3199901, 3287839, 2993448, 3127828, 3541122, 3347791, 3354610, 3418118, 3540828, 3539839, 3410534, 3381009, 3468894, 3432388, 3389313, 3818633, 3780536, 4013278, 3639120, 3696080, 3948287, 4053315, 4068285, 4055154, 4049664, 3924619, 4451247, 4180479, 4307267, 4326296, 4298965, 4281409, 4212659, 4506345, 4396152, 4514145, 4504495, 4527530, 4638930, 4708608, 4596286, 4664112, 5262799]
14450E262799o73918L81361l9831j2832K31390K94210R2364J06009j20248P2365
14440E593669j2837N81821j84796j43191j88626M25631j26326J51355M06053j60073
14430F342680j02223K66702N51977j43349j57464N6256P4020K39872J43298L4332
14420G306101J56132j74315M55579j5426K85264k07360J82987J43741L27521J76857
14410H637081k94218M02502M8463M88766l10901M03828l39434J43385L18753L86985
14400I885210l5229L23916J331N89141j17215J09715K12584P5312N64732j82934
14390A1426563M70401K74437j42735k0353K15866K18248R43962l95625M10242
14381A3401006L99365J77135J05581K56564M27229N1828O33538L25068J17220
$$ y = [5262799, 4588881, 4970242, 4930411, 4917579, 5148969, 5443179, 5535543, 5641552, 5521304, 5593669, 5580832, 6162653, 5977857, 5834666, 5646040, 6071671, 5945345, 6096700, 6502753, 6342680, 6240457, 6507159, 7059136, 6915787, 6758323, 6814579, 6888599, 7128471, 7271769, 7306101, 7462233, 7287918, 7743497, 7728071, 8013335, 7805975, 7988962, 8132703, 8460224, 8637081, 8342863, 8745365, 8793828, 9282594, 8971693, 9375521, 9036087, 9179472, 9498225, 9885210, 9849981, 10173897, 10175228, 10764369, 10647154, 10756869, 10969453, 11044765, 11609497, 11426563, 11896964, 12171401, 12028666, 12008313, 12224179, 12442427, 13386389, 12990764, 13401006, 13800371, 13977506, 14083087, 14339651, 14766880, 14818708, 15452246, 15777314, 15894534]
14372A5894534L35165m5639O09523O60013J50037M04888K07590O43456K45699
14363A9105266L03584K87912O18087N65889N86543M47460K64652N22483N54017
14354B3255893O33625N72365P64751K83377O23373P37071N86077N24356R36596
14345B8917484O42054R95507Q79453Q23973Q33857Q12088R49332R21290J099980
14336C6875018J168392P54742J511345J031734J191464J311147J403685J276976
14328D6524503J588366J441081J826373J430138K047927J950637J885672K117884
14320F0812581K021946K447367K361778K268139K659182K824416K821329L279333
14312H1496071L581551L250185L662717L858890M395730M133491M770948M844569
$$ y = [15894534, 16229699, 16184060, 16793583, 17453596, 17603633, 18008521, 18216111, 18859567, 19105266, 19408850, 19696762, 20314849, 20880738, 21467281, 21914741, 22179393, 22701876, 23255893, 23889518, 24461883, 25226634, 25510011, 26133384, 26870455, 27456532, 27980888, 28917484, 29559538, 30555045, 31434498, 32258471, 33092328, 33904416, 34853748, 35775038, 36875018, 38043410, 38798152, 40309497, 41341231, 42532695, 43843842, 45247527, 46524503, 48112869, 49553950, 51380323, 52810461, 54858388, 56809025, 58694697, 60812581, 62834527, 65281894, 67643672, 69911811, 72570993, 75395409, 78216738, 81496071, 85077622, 88327807, 91990524, 95849414, 100245144, 104378635, 109149583, 113994152]
14304A13994152N187850N622379N399268O555355O660231P070842P758784P855920
14296A66104781Q463880Q878822R815668R717261J0774788J0860208J2232097
14289B36847505J2358573J2820540J3507871J3778421J4493746J4846320J5042469
14282C33695445J4982672J4561179J4598431J3977305J2978695J1974595J0886307
14275D27654629Q830712O038006K945721j260962j431054n178836J996199m259727
14267D35334688m904222p881481r378075j1014822j2915578j3126322j4145844
14260C61968344j5227596j5154202j5405912j5144103j4868587j3943684j2569659
14253B59654601j2952719j2564443j1834802j1376565j0359209j0320870r352150
$$ y = [113994152, 119182002, 124804381, 130203649, 136759004, 143419235, 150490077, 158248861, 166104781, 174568661, 183447483, 193263151, 202980412, 213755200, 224615408, 236847505, 249206078, 262026618, 275534489, 289312910, 303806656, 318652976, 333695445, 348678117, 363239296, 377837727, 391815032, 404793727, 416768322, 427654629, 436485341, 442523347, 445469068, 444208106, 442777052, 437598216, 439594415, 435334688, 430430466, 422548985, 413170910, 402156088, 389240510, 376114188, 361968344, 346740748, 331586546, 316180634, 301036531, 286167944, 272224260, 259654601, 246701882, 234137439, 222302637, 210926072, 200566863, 190245993, 180893843]
14246A80893843r149466q208047p357142p590945p316382o611876o116044n719169
14238A22824772n375632m807564m843605n007672m014708m597260l787516l140631
14230H7250184l643227l184024l453608k548208k699289l254530k354367k332706
14222F3780225k500762j709026k100021k076359j862920j737757j745179j314240
14214D8733961j372527j408702j566285j355345j176632j442011r76381p63384
14206C8672694j012970j325803q47923r25066j296524q05133n80736j017486q28659
14197C0032394n91294n99102p21494q11108o38726n12423q47014o88616m30560
14188B4192057o48956p21248q3242q49707l87186m09371n64625j32007o68271
$$ y = [180893843, 171744377, 163536330, 156179188, 148588243, 141271861, 134659985, 128543941, 122824772, 117449140, 112641576, 107797971, 102790299, 98775591, 94178331, 90390815, 87250184, 83606957, 80422933, 76969325, 74421117, 71721828, 68467298, 66112931, 63780225, 61279463, 59570437, 57470416, 55394057, 53531137, 51793380, 50048201, 48733961, 47361434, 45952732, 44386447, 43031102, 41854470, 40412459, 39436078, 38672694, 37659724, 36333921, 35485998, 34560932, 33264408, 32459275, 31878539, 30861053, 30032394, 29441100, 28841998, 28120504, 27309396, 26670670, 26158247, 25311233, 24622617, 24192057, 23543101, 22821853, 22738611, 21888904, 21501718, 21092347, 20527722, 20395715, 19727444]
14179A9727444l77333m34466o40082k53171l95345n00016j9921l11981l51153
14170A6443976m55554j70052j85904n05912j14424j36852l59668q1431l08738
14161A4125441p34603J05722l72451j35364k82817m06434J95782q93673L72945
14152A1974548l39036l21589m11479J88053k36609k54302p4434L780k39536j6815
14142A0272581l47427q7301j87447q3849Q0697m73666m0080j59059j69055j71540
14132H633854k40554P9399r0761j34626j86839K24135k80989j07113k05301p3939
14122G617266j45645j07823J16200j96494p07116N12719J04741l56650Q6661j38859
14112F785000k71953L0757O3442j39862j00797k08452m2946k54121K36023J4569
$$ y = [19727444, 19350111, 18915645, 18275563, 18022392, 17627047, 17127031, 17107110, 16795129, 16443976, 15988422, 15818370, 15632466, 15126554, 15012130, 14875278, 14515610, 14434179, 14125441, 13390838, 13496560, 13124109, 12988745, 12705928, 12299494, 12495276, 11601603, 11974548, 11635512, 11313923, 10902444, 11090497, 10853888, 10599586, 10525152, 10528932, 10289396, 10272581, 9925154, 9837853, 9650406, 9566557, 9647254, 9173588, 9133508, 8974449, 8805394, 8633854, 8393300, 8472699, 8381938, 8247312, 8060473, 8284608, 8003619, 7896506, 7691205, 7617266, 7471621, 7363798, 7479998, 7283504, 6576388, 7089107, 7193848, 6837198, 6923859, 6785000, 6513047, 6543804, 6607246, 6467384, 6366587, 6158135, 6115189, 5861068, 6097091, 6111660]
14102F111660k62359j51200L39327l26136K04530l66291j72510k98973Q0594o1104
14092E097538K09945k44353J95340n8622k23396j07096m9904l16325K07166J35437
14082D845730k8226l69532K86351j98271J38169l94409K7643R7023j06489j57124
14072D140865J32898j24409Q5188j12535J45837j47543j40361l35295M94650k96141
14062C843154r2595L9781Q549m3048Q0018J7435n64735K00351j08124k11926M21694
14051C590554j10999l26656J40443L7983m28220K64184J69158k13554J01080k73585
14041B950388K71781j03870k09566j52627J75467K46537o70912L02622J19733
14032B929553Q154k36012K75081L8414k44847n03182M15916O1274n558o6375j53698
$$ y = [6111660, 5849301, 5698101, 6037428, 5711292, 5915822, 5549531, 5377021, 5078048, 5158642, 5097538, 5307483, 5063130, 5258470, 5199848, 4976452, 4869356, 4819452, 4503127, 4710293, 4845730, 4817504, 4447972, 4734323, 4536052, 4674221, 4279812, 4307455, 4404478, 4297989, 4140865, 4273763, 4149354, 4234542, 4122007, 4267844, 4120301, 3979940, 3644645, 4139295, 3843154, 3750559, 3790340, 3798889, 3755841, 3835859, 3853294, 3288559, 3488910, 3380786, 3168860, 3590554, 3479555, 3152899, 3293342, 3331325, 2903105, 3167289, 3336447, 3122893, 3223973, 2950388, 3222169, 3118299, 2908733, 2756106, 2931573, 3178110, 2507198, 2809820, 2929553, 2937707, 2701695, 2976776, 3015190, 2770343, 2267161, 2683077, 2744351, 2738793, 2672418, 2518720]
14021B518720J94421k43018r2145K14536K33811n57816J69551j00498J20341k09128
14011B248775K42837j53513m84665O07491k95538j36727Q6101l0155k07959L82380
14001B259027l31512K77387l97986j68719K42496k6769J99239k6405p203l20291
13991A699264N59094M67703J070015L844601R321549J4401667J0477081j9074851
13983B2766123j0482276m884808j880149j041559r55446k03848j43244n55078
13975B619715K25406k26817O8134j04045k05319K31662m90407J71827q0083j03231
13965B106842k31437j60364J59479L3652Q8929K818J45432j79826n9014j07618
13955A798893J07173k27283K55295j72831J28595q6928M92892l38949j01153l0223
$$ y = [2518720, 2713141, 2470123, 2377978, 2592514, 2826325, 2268509, 2438060, 2337562, 2457903, 2248775, 2491612, 2338099, 1853434, 2460925, 2165387, 2028660, 2114761, 2084606, 1876647, 2259027, 1927515, 2204902, 1806916, 1638197, 1880693, 1853924, 2053163, 2026758, 2019555, 1699264, 2258358, 2726061, 3796076, 7640677, 16962226, 31363893, 41840974, 22766123, 12283847, 7399039, 5518890, 4477331, 3521885, 3318037, 3174793, 2619715, 2845121, 2618304, 2686438, 2582393, 2377074, 2608736, 2118329, 2290156, 2210073, 2106842, 1875405, 1715041, 1874520, 1908172, 1997101, 1999919, 2145351, 1965525, 1906511, 1798893, 1906066, 1678783, 1934078, 1761247, 1889842, 1802914, 2295806, 1956857, 1855704, 1825481]
13945A825481k17558J05381L33552l77560K41763l45490J86750j10596j71008
13936A470715K80688k27347j4993n30853K91592J91114Q8775K06469k06747n3690
13926A495723m26352N14504j79871N410k8732K98654j32967j28601j48177L56881
13916A626472L3697M8473l60102J11782k29112K22061k8000O1621n17594J51687
13906A120985K29303J23697l122k74710L24616l41626k50840L35883k7827l5601
13896A200758q2536K18382N4199j35261k59341J58308J73323j39184m8253J3119
13886A153514j13416J21733J49051k98650J67803j51872q5985R9332K03408k52
13876A244666k15236J64268m34035M13164E61709K17467P07312l92345K1780j13449
$$ y = [1825481, 1607923, 1713304, 2046856, 1669296, 1911059, 1565569, 1752319, 1641723, 1470715, 1751403, 1524056, 1509063, 978210, 1269802, 1460916, 1549691, 1756160, 1549413, 1495723, 1069371, 1583875, 1404004, 1409414, 1380682, 1679336, 1546369, 1417768, 1269591, 1626472, 1660169, 1708642, 1348540, 1460322, 1231210, 1453271, 1425271, 1486892, 969298, 1120985, 1350288, 1473985, 1470863, 1196153, 1520769, 1179143, 928303, 1264186, 1236359, 1200758, 1118222, 1336604, 1390803, 1255542, 996201, 1154509, 1327832, 1188648, 1140395, 1153514, 1040098, 1161831, 1310882, 1012232, 1180035, 1028163, 942178, 1041510, 1244918, 1244666, 1029430, 1193698, 759663, 1172827, 561709, 779176, 1486488, 1094143, 1115923, 1002474]
13866A002474k33353N26403l28605M9363r6432J28826l75136L27616l32963M06123
13856A074316m88271N95860l64891j71423L06875Q7432j46921J74532l2051l55658
13846F79800L59554j73832J77190k16879K69159j19431j45354p1958O8746L02756
13836A129751j91806k80292L63928k91378L13230l31393J28707r4816K74625j90116
13826H30440J4297j63200N1418k06636L69707j93420O9170J81304n8860J06567
13816A000787l77760M01831k73610j2720J77948J196l67578J66914j22047K56021
13806H50982M3620p8364M7974k72478J14776J18561j32590l8215J44321o7980
13796G30607j42714J85201n4433M9992R5213j63518O4887j38314J01804j83980
$$ y = [1002474, 769121, 1295524, 966919, 1016282, 919850, 1048676, 673540, 1001156, 668193, 1074316, 586045, 1181905, 817014, 645591, 952466, 1039898, 892977, 1067509, 1035458, 679800, 1039354, 865522, 1042712, 825833, 1094992, 975561, 830207, 758249, 826995, 1129751, 937945, 657653, 1021581, 730203, 1043433, 712040, 840747, 745931, 1020556, 830440, 844737, 681537, 732955, 526319, 896026, 702606, 771776, 953080, 894220, 1000787, 623027, 1024858, 751248, 738528, 916476, 917672, 550094, 717008, 594961, 850982, 894602, 816238, 864212, 591734, 706510, 825071, 692481, 654266, 798587, 730607, 587893, 773094, 718661, 768653, 863866, 700348, 765235, 626921, 728725, 544745]
13786E44745K47452L07418k97303k53375L10424k80072j23790K73878k72690K59438
13776G16125n1915R4338j98569m4897k00128P28714l22107k40710m0352K43896
13766F84395P8217j40579j9437B42956M69931O0239j27695J05678j55348J66229
13756G61990n374j02951k68022Q0993L32401C55239K66832k27754K55595l4539
13746F15373N7734j17172K01389O5837k13167M8244j23461K04706k52735K24729
13736G11477j43994j30088J66907r1549k24473K57861K68568k50262R2223j90453
13726D66217j57009L51111J5082j54226o5892j15632m8200J93731j91513n0448
13716B43221J67250K24540K09156C56825o9931K60722j57025j07458J83285n4603
$$ y = [544745, 792197, 1099615, 802312, 548937, 859361, 579289, 455499, 729377, 456687, 716125, 664210, 758548, 559979, 515082, 314954, 1043668, 721561, 480851, 440499, 684395, 762612, 622033, 602596, 242956, 712887, 773126, 645431, 751109, 595761, 761990, 756616, 653665, 385643, 466636, 799037, 355239, 622071, 394317, 649912, 615373, 673107, 555935, 757324, 823161, 609994, 658238, 534777, 739483, 486748, 711477, 567483, 437395, 604302, 512753, 288280, 546141, 814709, 564447, 656670, 466217, 309208, 660319, 675401, 521175, 455283, 339651, 291451, 485182, 293669, 243221, 410471, 635011, 844167, 356825, 286894, 547616, 390591, 283133, 466418, 411815]
13706D11815P4271j50299K50469L3669j6206j17586J95739n9115p0538j38214
13696D14005J36481K45617l65414Q3789k01172M80107k93012N8023L4727J26263
13686G19414k57569K91018B08746J51560j54667O5336l0244J23553G0848N07446
13676E78294k81687K4536J19492K07046B39952M05526l07226J9619M0723q6268
13666C12326L31982K6961k65436R4397B33785j03348J40691k8782N1527M161J54508
13655D52542p9761N5008j78564J38337L020J26992q1420d864C32835J93057n5642
13644D70250A85971K34132Q8103j58498j1431N6177K70752k85272E6672L53057
13634D09729K29195j69875A94748K19645A41003M08893K1705j17362l347J38107
$$ y = [411815, 486086, 335787, 586256, 619925, 603719, 486133, 681872, 622757, 552219, 414005, 550486, 796103, 430689, 514478, 313306, 793413, 500401, 558424, 593151, 719414, 461845, 752863, 208746, 360306, 205639, 270975, 240731, 364284, 70848, 578294, 296607, 321143, 440635, 647681, 239952, 645478, 338252, 357871, 398594, 312326, 644308, 671269, 405833, 500230, 233785, 130437, 271128, 242346, 293873, 298034, 452542, 372781, 427789, 249225, 387562, 390582, 517574, 436154, -4864, 332835, 525892, 470250, 185971, 420103, 508206, 349708, 338277, 394454, 665206, 379934, 56672, 409729, 638924, 469049, 194748, 414393, 141003, 549896, 571601, 454239, 450892, 588999]
13624E88999O2512j3268A44120R5599M40357j38865j54369j11389A10904K35462
13614C46366J69077j53250o3740M2839j35783K53155o2864G9332J81334m6565
13604B14101J04497j51222M58949j68978j86654q5395M30380l05537K3902Q4979
13594D19022A76544N3520M7768J41908o3704j58030Q7699j16220K26902J15378
13584E11765j25621i6822B33421M15067k01728j68121p6764j71a12675C70676
13573E32948j99413j55071J58032M4338q7527r8244K49470j77474F1794J08455
13563A70249a0470B18578K30585p0882j3516K8519m8032j12585l6503L6610o0322
13552A72452J6163K86902B35323O7433A37306O2000n209I5544L97033j24663A74690
$$ y = [588999, 651511, 638243, 144120, 239719, 680076, 541211, 386842, 275453, 110904, 346366, 515443, 362193, 298453, 341292, 205509, 458664, 395800, 79332, 260666, 214101, 318598, 167376, 626325, 457347, 270693, 185298, 615678, 310141, 334043, 419022, 176544, 230064, 277832, 419740, 356036, 198006, 285705, 169485, 396387, 511765, 386144, -96822, 233421, 648488, 446760, 278639, 201875, 201704, -112675, 370676, 532948, 333535, 178464, 336496, 380834, 293307, 195063, 444533, 267059, 61794, 170249, -10470, 218578, 449163, 378281, 364765, 393284, 345252, 232667, 196164, 232774, 172452, 188615, 475517, 235323, 302756, 137306, 199306, 194097, 95544, 492577, 367914, 174690]
13540C95578a31190F21530b1646D36439P853f3731j59710G3140K80035A1079M37367
13529D48446h008H4073K10101J59391j42370K5833j60438J29007n2822J22986
13519C75761j3340J5734I1604K98912A18034J9335Q193a38195M7328A27320K48933
13508C76253j73926e0292B55421a04716D25736j32989C6924L8266J68349a04833
13497I5114M09356A30580J9098K84525A63163J48726c8041B00456K22961C6044
13486H9591J21279J50990I6263D2982L92350A39253O1357r7591A8808O54963B84346
13474B36541n2305M6841J38795I1474J90698O3953A26299k1105K12882A50500
13463b8797A89000J55688r0805P0823P6161k4086p4454p4060G3951a8299j9157
$$ y = [395578, -131190, 621530, -21646, 436439, 444292, -63731, -223441, 73140, 353175, 11079, 448446, -8008, 84073, 294174, 453565, 311195, 337028, 176590, 305597, 252775, 375761, 362421, 378155, 91604, 390516, 118034, 137369, 145562, -138195, -90867, 127320, 376253, 202327, -50292, 255421, -104716, 425736, 292747, 36924, 75190, 243539, -104833, 95114, 504470, 130580, 149678, 434203, 163163, 311889, -38041, 200456, 423417, 36044, 89591, 210870, 361860, 96263, 42982, 435332, 139253, 200610, 103019, 18808, 673771, 284346, 236541, 184236, 231077, 369872, 91474, 282172, 346125, 126299, 105194, 318076, 150500, -28797, 189000, 344688, 253883, 324706, 400867, 376781, 302327, 228267, 73951, -18299, -37456]
13452c7456E54921B00685J91285j55752K90989k49462E3310a99373A55718e5918
13441A78878M05513A83080M5992K47574j90664H7444J75786P5245e2411B43743
13430B03116r4617J23662c7061A31141n6769K46349J5437i574B43697a9846A95601
13418E7679l947J4860J40180J27379j36486O2104F3895M065K77430g6484C48271
13406A25334J21338k4542K4705l3187K97228k38850J60212I8119K455f3983C2581
13394A06022L02834j4766r0644n7501i277E2215a13172C08161a83956A46704K83225
13383D29929A76969k6826B6698J88390c8187b546C67236l2163J23378B7688J59353
13372A87041f4570C48494A44839F8588L77759J37558k69053A52412J22049M2805
$$ y = [-37456, 554921, 200685, 391970, 236218, 527207, 277745, 53310, -199373, 155718, -55918, 178878, 584391, 183080, 229072, 476646, 285982, 87444, 263230, 338475, -52411, 243743, 203116, 108499, 232161, -37061, 131141, 74372, 320721, 336158, -9574, 243697, -19846, 195601, 57679, 53732, 68592, 208772, 336151, 199665, 261769, 63895, 67960, 345390, -76484, 348271, 125334, 246672, 222130, 246835, 213648, 510876, 272026, 432238, 98119, 100574, -63983, 32581, 106022, 408856, 394090, 303446, 245945, -9277, 52215, -113172, 308161, -183956, 146704, 429929, 176969, 150143, 26698, 215088, -38187, -2546, 367236, 335073, 458451, 27688, 187041, -64570, 348494, 144839, 68588, 446347, 583905, 314852, 152412, 274461, 317266]
13362C17266p1068K58258b1225C83945A55136C4217b0045C56332a52456A44294
13351A42397J05036i8196B08971R0138J0672A11597J73490B7027K50314j17312
13341A60029M12903k74027J0532j29006H7986K06974o5343j3020a43208D66185
13330B54013J17313j36350O1621A2173J75479K00163g9779C34972Q0961I4651
13319A66923E9919L30001q4712L99028A54832J88835J39462k13954j05047h3264
13308D4087a223D24828A87812a57598B73582b32273C35944A31914J15207A09948
13297G6394P7415p5902M63704B47528O5349o6441k4692E7790K66732A05168J98824
13286C03992m9789g6365D07827q8831A8060J48399l9929c5165m3196k0493A51025
$$ y = [317266, 246198, 504456, -21225, 383945, 155136, 34217, -20045, 356332, -152456, 144294, 142397, 247433, -98196, 208971, 299109, 309781, 111597, 285087, 27027, 277341, 160029, 572932, 298905, 309437, 180431, 87986, 294960, 229617, 216597, -143208, 466185, 254013, 371326, 234976, 296597, 12173, 187652, 387815, -79779, 334972, 415933, 94651, 166923, 59919, 389920, 305208, 704236, 154832, 343667, 483129, 269175, 164128, -83264, 44087, -1223, 424828, 187812, -157598, 273582, -232273, 335944, 131914, 247121, 109948, 76394, 153809, 77907, 541611, 247528, 312877, 246436, 221744, 57790, 324522, 105168, 303992, 254203, -76365, 407827, 318996, 18060, 166459, 126530, -35165, -78361, -98854, 151025]
13274a42515e3583n9904A31243L67346B21666C4756J37251c40494A403P3346M9757
13263A24506a30825A30634a99690B38280A07790M8655L7419b0596f581I6029h9244
13251A4825L24610F8582J14326A7722a03341B19443g8755j87886F4262K16905
13241B81167C7924O7673k3815K34936A49616l0432Q5751a2935A39190D2853g0037
13229D8170a52249A16362m3587c6613B21666f2808A4731g4506A95606c35168a64765
13217B12328K15623A40084F1644a76439B29025b72454A01035J53094H6681K10174
13207B96855n8535r1925a75292A55983l5249E1991L08991k1608G8139e8238A38345
13195B07154J0317P098I8525b09869a04481A31354i8314C69848A20853E0813Q5480
$$ y = [-142515, -53583, -113487, 131243, 498589, 221666, 34756, 172007, -340494, 1403, 74749, 124506, -130825, 130634, -199690, 238280, 107790, 156445, 193864, -20596, -6581, 96029, -89244, 14825, 339435, 68582, 182908, 17722, -103341, 219443, -78755, -266641, 64262, 281167, 37924, 105597, 81782, 316718, 149616, 119184, 204935, -12935, 139190, 42853, -70037, 48170, -152249, 116362, 72775, -36613, 221666, -62808, 14731, -74506, 195606, -335168, -164765, 212328, 427951, 140084, 61644, -176439, 229025, -272454, 101035, 254129, 86681, 296855, 238320, 146395, -175292, 155983, 120734, 51991, 360982, 339374, 78139, -58238, 138345, 207154, 217471, 224569, 98525, -209869, -104481, 131354, -98314, 369848, 120853, 50813, 136293]
13184A36293m1743P6442I067c8341Q629G5132L5168J09749k0318k9238a13308
13172D65022d6322A52122E0892a24519A08273D5640P0710c86303H9762N4621c6847
13160d3118A87266a497G7326f4200k1469j27979B00796p2580m4613C4057J61358
13149A95415a46545A37135A7111f7252A08887N4054p255j9800k6652A8474a55320
13137g7207A03907D7673J51425r4226J19294B9727J22798i0253k7193A9171c9197
13125A78428j6657a03071B72222j07301L3238C8961L13960a54411D00599f4079
13114F6719j8060f138m9831b5102o3164A91645f0622k29452f9876A19602L8921
13103A58523B2401J50803J43111g1875E9871J31875E2206L09650E7203k6265a43847
$$ y = [136293, 94550, 170992, 9067, -38341, -29712, 75132, 110300, 220049, 199731, 170493, -113308, 465022, -46322, 152122, 50892, -124519, 108273, 45640, 116350, -386303, 89762, 144383, -36847, -43118, 187266, -1497, 77326, -64200, -85669, -213648, 200796, 128216, 83603, 34057, 195415, -146545, 137135, 17111, -67252, 108887, 162941, 155686, 135886, 109234, 18474, -155320, -77207, 103907, 47673, 199098, 104872, 224166, 29727, 152525, -90253, -117446, 19171, -39197, 178428, 161771, -103071, 272222, 164921, 198159, 38961, 352921, -154411, 400599, -64079, 66719, 48659, -6138, -55969, -25102, -88266, 191645, -60622, -290074, -69876, 119602, 158523, 22401, 173204, 316315, -71875, 59871, 191746, 52206, 361856, 57203, 30938, -143847]
13091b2193j71326C05108A03600g7350B96575j03679D7672a72455A06564j2338
13081I4226a60873B21218C4695R8829b73391A17140C8565b7869j1635f589C57720
13069B35963q231e2228H6425a011j87171a9265A46348D3072N2694K20001B3398
13057a95974A15093K03792b51189A73470A6898h3307C7921J73398J45876C2882
13046A33526E2320L26368a66329A111J782e6280A165g294H7063J56343J51841
13035C95247H8038a732B1482a2985B81467a30861j27197n193A34788E1861Q694
13024F0555e2859j77097A14869d6268A06184R9598b17597H9346J69263J53261
13014D11870A01199J85242j29175l1356J25093a81935A15869K07867b2114F8625
$$ y = [-22193, -193519, 305108, 103600, -77350, 296575, 192896, 47672, -172455, 106564, 94226, -160873, 221218, 34695, 133524, -273391, 117140, 38565, -27869, -39504, -6589, 357720, 235963, 227732, -52228, 86425, -1011, -188182, -19265, 146348, 43072, 95766, 315767, 23398, -195974, 115093, 318885, -251189, 173470, 16898, -83307, 37921, 211319, 357195, 32882, 133526, 52320, 378688, -166329, 1111, 2893, -56280, 1165, -7294, 87063, 243406, 395247, 88038, -1732, 21482, -12985, 281467, -130861, -258058, -263251, 134788, 51861, 60555, -52859, -229956, 114869, -46268, 106184, 205782, -217597, 89346, 258609, 411870, 101199, 286441, 157266, 125910, 251003, -181935, 115869, 323736, -22114, 68625]
13003B14934H2890b28707H3492K43083F9302a37511L9531C34189i5848M4676A90343
12991A00853b1638B81733A20734b54070A6458J08581a70141G7657h3754C90463
12980b46582B16668F4365K48807c5454A19863a5039j18421L5413J3200A1877a18185
12968a74687D15213a66669e4758J9717A63503i2641A08618J9000a19190C83135
12957b4987B49499e3100D63108I5968J9622c5578C13816e5537j35320l285b8913
12945B05764a46026M2657A1637O9282j337J84775I1477J5703R532b4543G3699
12933A5548f148j9756n7439B56865a58542J2163j21863C24126l6816H2925c17547
12921b33157D91093a28702m3307h0449C45092D4782g7374j64918A52862a5424
$$ y = [214934, 82890, -228707, 83492, 326575, 69302, -137511, -97980, 334189, -95848, -51172, 190343, 100853, -21638, 281733, 120734, -254070, 16458, 125039, -170141, 77657, -83754, 390463, -246582, 216668, 64365, 313172, -35454, 119863, -15039, -133460, -98047, -84847, 11877, -118185, -174687, 415213, -166669, -54758, -35041, 163503, -92641, 108618, 127618, -119190, 383135, -24987, 249499, -53100, 463108, 95968, 115590, -35578, 313816, -55537, -190857, -194142, -28913, 205764, -146026, -103369, 11637, 80919, 79582, 264357, 91477, 107180, 116712, -24543, 73699, 15548, -6148, -25904, -83343, 256865, -158542, -146379, -268242, 324126, 287310, 82925, -317547, -233157, 491093, -128702, -172009, -80449, 345092, 44782, -77374, -242292, 152862, -15424]
12910B02557q3643A991c66702b0032j56245o1151P6134O8348h257D3978a72994
12898F3995f6558A80562a95024G4129J28771k6934d7949H0348h134j54487c7894
12886B09653G1852h4966A36641J62991D5020b48767A36881c74762a66092E8215
12875D19003A21982b16111h3845B78041g306B52406k1339h03C91035a68208A12737
12863A03899c5267l8330C8707P4131M8869n5907D0031c9967J3061A15215n2268
12852F2947N3209i3319B62543a44161A69766d1338l96592a21707B1570e1578E00236
12840A40936Q2906I5042e203j00861B48415I3000B1573R2043F780a1012j26716
12829a37728A00278c22436f7448j4304j74488j32918A48212B7842K02300b1430
$$ y = [202557, 118914, 1991, -366702, -20032, -176277, -237428, -161294, -92946, -8257, 43978, -172994, 63995, -66558, 180562, -195024, 74129, 202900, 175966, -47949, 80348, -8134, -162621, -37894, 209653, 71852, -84966, 136641, 299632, 45020, -248767, 136881, -374762, -166092, 58215, 419003, 121982, -216111, -83845, 278041, -7306, 252406, 231067, -803, 391035, -168208, 112737, 103899, -35267, -73597, 38707, 112838, 161707, 105800, 40031, -39967, -26906, 115215, 62947, 116156, -93319, 262543, -144161, 169766, -41338, -437930, -121707, 21570, -51578, 500236, 140936, 223842, 95042, -5203, -106064, 248415, 93000, 21573, 113616, 6780, -11012, -137728, 100278, -322436, -67448, -81752, -256240, -389158, 148212, 27842, 230142, -21430]
12818a39818j18744A26677b3542q1074m1227N4179A31215n85m5919a28346a2684
12806G0535c20647a20550A05081a15741H4155f3381K5493E4200M2820A2163b11080
12794B3842a07906e0478B337b08965A4446a61009H9892q48b61164b0327I4811
12782F5961a28111A00730J49675r1867Q619a27000m9300C9320Q578a67033q821
12771a75854a0970m08102A35283a6011p323I76K03069a2117C2605K26632G5161
12759D1808J66252g4836c2412j56234Q3221o9485b7228m997J5058k97096A18283
12747f3898k65128B86481A1424f966I9631O6513n4626Q3102K33695c63990a25050
12735C28007C7142L6585a33056f5650j16156A64619f3483B10243j7098E7308P333
$$ y = [-139818, -258562, 126677, -23542, -104616, -145843, -91664, 131215, 130630, 84711, -128346, -12684, 70535, -320647, -120550, 105081, -115741, 84155, -63381, -37888, 54200, 97020, 12163, -211080, 23842, -107906, -50478, 2337, -208965, 14446, -161009, 89892, 89044, -261164, -20327, 94811, 65961, -128111, 100730, 250405, 158538, 167157, -127000, -176300, 39320, 47898, -167033, -175854, -10970, -419072, 135283, -16011, -23334, 976, 204045, -12117, 32605, 259237, 75161, 41808, 208060, -74836, -32412, -188646, -105425, -174910, -27228, -32225, -17167, -314263, 118283, -63898, -329026, 286481, 11424, -6966, 99631, 166144, 111518, 194620, 428315, -363990, -125050, 328007, 37142, 73727, -133056, -65650, -181806, 164619, -63483, 210243, 193145, 57308, 64641]
12724F4641g9012A274J7967m498f6981j54640d7533k5207A8285f5289O541m0971
12712i9719B55757c8415j7498A86842k6968k9221B1087L00828j16155o2978J28846
12701B71628D3769K51387A27953K34534A77346m6146i1694a3977D23010f1131
12690D00641c37836A84796D5838R721M2367A9110J00493l7250P143J41857K6502
12679B57855A02257k9578J00363c00312j12523A50582J23887j32777M1306a94813
12668A21528b2480F4100M8635a47267c5976j73646D0508J92282d10584A89439
12657B39199a09256c4065B90285A35356C8348K3313L19451r5465f936D38364a13599
12645A10700K22161l2919E6609h2212I8371P1767D0818b1871A5383L59942A19574
$$ y = [64641, -79012, 1274, 19241, 14743, -66981, -221621, -47533, -72740, 18285, -65289, -58748, -99719, 255757, -38415, -55913, 186842, 159874, 130653, 21087, 321915, 205760, 142782, 271628, 43769, 295156, 127953, 362487, 177346, 131200, -91694, -13977, 423010, -61131, 400641, -337836, 184796, 45838, 55559, 97926, 19110, 119603, 82353, 89496, 231353, 257855, 102257, 72679, 173042, -300312, -412835, 150582, 274469, 141692, 182998, -194813, 121528, -22480, 64100, 112735, -147267, -35976, -209622, 40508, 232790, -410584, 189439, 239199, -109256, -34065, 290285, 135356, 38348, 61661, 381112, 285647, -6936, 438364, -113599, 110700, 332861, 299942, 56609, -82212, 98371, 170138, 40818, -21871, 15383, 375325, 119574]
12633e354k5562B31058O775K61036B32858B1686L41801A21896Q5934a60619f636
12621a32855A76311i9067A40672a16203A47036K0715E2076L17709f3933I1378
12610C2685f8195B70643A0009M003M5358N7498e7693A65325N1611a7158l2497
12599d9655C69928d6242A26627b4088j19012K2013j83137a7634I6511j622h6009
12587g7864B66622e5556j178q9522j26074J18375o926K3653H2027b44489K56C83198
12574g7574j66753A53809J61480H0924C006L393f1599F9529B9952a11420D27326
12562g2096A61769J6024G2590g1469B35406H42K48117M7214j43556a30683E6200
12550B6521a92935A06635b02731r0462J40689f0347n8206A09760n2204H431b07391
$$ y = [-5354, -30916, 231058, 237833, 498869, 232858, 21686, 363487, 121896, 207830, -160619, -6636, -132855, 176311, -99067, 140672, -116203, 147036, 167751, 52076, 369785, -63933, 91378, 32685, -68195, 270643, 10009, 14012, 59370, 116868, -57693, 165325, 216936, -17158, -49655, 369928, -46242, 126627, -24088, -143100, -121087, -304224, -17634, 96511, 94889, -86009, -77864, 266622, -55556, -56734, -146256, -272330, -153955, -160881, -137228, 82027, -244489, -244233, 383198, -77574, -244327, 153809, 315289, 80924, 3006, 6399, -61599, 69529, 29952, -111420, 427326, -72096, 161769, 177793, 72590, -71469, 235406, 842, 248959, 296173, 152617, -130683, 56200, 26521, -192935, 106635, -202731, -293193, -152504, -60347, -118553, 109760, 57556, 8431, -207391]
12538d0891A1220a53099K8408A68068i2335A21243R6328p7907B6975J12196J20483
12527B59654q7844H3626r084J66197r9600C496d6693o0042A34886b51786c8538
12515D6644a3789l06213E7810d853o1267j61063c9904b613A13313l3291O6001
12504A46023c4882N987Q151l88169J77096I0267J31132c1659A9184J81131k3045
12493A77270B0912M2642J4354N0821e3562A73559g1786K1339h567k3185A19596
12481g2671D4379K38923c3895C02142i1146I0607g0268A6305N7435M1240a20695
12469d3420j98687h3695A46648b49096R9347k3537D4326P5832d66884D6356a68998
12457B60112I9172c01725A17493A5725a72638r8991A5271K6957Q0829J40790j01688
$$ y = [-40891, 11220, -153099, -124691, 168068, -92335, 121243, 217571, 139664, 26975, 139171, 259654, 171810, 83626, 74542, 240739, 141139, 3496, -46693, -106735, 134886, -251786, -38538, 46644, -13789, -320002, 57810, -4853, -66120, -227183, -39904, -2613, 113313, 80022, 146023, -34882, -28895, -20744, -408913, -231817, 90267, 221399, -31659, 19184, 200315, 177270, 20912, 63554, 77908, 128729, -53562, 173559, -71786, -50447, -8567, -31752, 119596, -72671, 44379, 283302, -33895, 302142, -91146, 90607, -70268, 16305, 73740, 114980, -120695, -43420, -242107, -83695, 146648, -249096, -149749, -173286, 44326, 120158, -466884, 46356, -168998, 260112, 99172, -301725, 117493, 15725, -172638, -271629, 15271, 42228, 123057, 263847, 162159]
12446A62159p0599a7063q3751F5987c5549I3294N3467c9534J6343j97262B58889
12434a04871A05284C0768a65585G6234b01984c0129M179j53022A13128D8454M5497
12423I3951a93608F1230J99468a11875H9024h245A4171h0810C93914A62137b5098
12411a09573c9373D2996b58177C82a48971k3585B18498q766a37363B61414b85353
12399a27343N994C5660K0781f1526k25433G348b49220d9770B5811M8459M5204
12388A19474i0734l2571N4557q1960j0693e9493A78411Q0453b94864B71597A33669
12376I5283b12944Q4659k49037B9611d03938a45140c7692n1562B95576a3190r8128
12365a11318A4062a09909o1724A0060J51505b65230q017A35989K6362Q5169a54567
$$ y = [162159, 91560, -17063, -100814, 65987, -35549, 93294, 146761, -39534, -23191, -220453, 258889, -104871, 105284, 30768, -165585, 76234, -201984, -30129, -25950, -178972, 113128, 48454, 93951, -193608, 61230, 260698, -111875, 89024, -8245, 14171, -80810, 393914, 162137, -25098, -109573, -39373, 42996, -258177, 382, -148971, -172556, 218498, 209732, -137363, 261414, -285353, -127343, -121349, 35660, 56441, -61526, -286959, 7348, -249220, -49770, 25811, 74270, 119474, -90734, -123305, -68748, -150708, -161401, -59493, 178411, 258864, -294864, 271597, 133669, 95283, -212944, -128285, -377322, 29611, -403938, -145140, -37692, -89254, 295576, -13190, -111318, 14062, -109909, -171633, 10060, 161565, -265230, -273247, 135989, 162351, 247520, -154567]
12353C9933A7280J22350a49882r9724B14413a6860j2166q1310d0688m2932c1022
12341a87632q5162A11260d14606a78096q6257A3430a3198A01597B6456L2009c2127
12329a93870A62150a32800c3655j24288g2151A87677b07741G8692c9308A56102
12318B485J86935c61344A08118a85496d0660A92169r0146M9803l4307o873b31969
12306g9698E8883R5359h0528c7983I0607K06381a4145k75142A1b45884i22A24720
12293a91799A33637J9813o715b09283A12131a67345A99198B6279J84490f6761
12282a18146i875I2020h4335C25602g7421D9352a69764B62908p9156L43292a06374
12270a29421A67419J60206k9836j09997E3909J24497a78188l3859G3766A3984
$$ y = [39933, 17280, 139630, -149882, -249606, 214413, -16860, -29026, -110336, -40688, -83620, -31022, -187632, -272794, 111260, -414606, -178096, -264353, 13430, -13198, 101597, 26456, 58465, -32127, -193870, 162150, -132800, -33655, -157943, -72151, 187677, -207741, 78692, -39308, 156102, 2485, 189420, -361344, 108118, -185496, -40660, 192169, 102023, 151826, 117519, 110646, -231969, -79698, 58883, 154242, -80528, -37983, 90607, 296988, -14145, -289287, 11, -245884, -922, 124720, -191799, 133637, 153450, 146735, -209283, 112131, -167345, 199198, 26279, 210769, -66761, -118146, -9875, 92020, -84335, 325602, -77421, 49352, -169764, 262908, 183752, 527044, -106374, -129421, 167419, 327625, 297789, 187792, 53909, 178406, -178188, -212047, 73766, 13984]
12259b28962R4545G815N9147a0468A18237N9955A1720a95834C2260J6469l844
12248D4885J82732d2642I8646l9174K490J89873F1465L1486A6229L35185I4567
12236c01324A09560b07403A22051P9881I795J83686n4310a21522I2374c0425A96497
12224D70572J38880k53175F7312j32M2836N47995A67957M8310I8366J58826J02880
12213C60072j77906b3348B9059K87710a17778I4940J437K47935J04047k09660
12203B38699o1983a7645k10303B87711O5839j33443K6486p0831q4360N73918c7516
12191B95734d5442E00183A56930J16477A14621K69892p9283j09895D7400E037
12180g8591A63521J64715M8196I0770D216a20466J3574B74899b4549B73045l8183
$$ y = [-228962, -134417, 7815, 66962, -10468, 118237, 178192, 11720, -195834, 32260, 48729, 44885, 227617, -42642, 98646, 59472, 61962, 251835, 61465, 92951, 16229, 351414, 94567, -301324, 109560, -207403, 122051, 201932, 9795, 193481, 139171, -121522, 92374, -30425, 196497, 470572, 609452, 356277, 67312, 67180, 110016, 658011, 167957, 216267, 98366, 257192, 360072, 182166, -23348, 29059, 316769, -117778, 94940, 96377, 344312, 448359, 238699, 176716, -17645, -227948, 287711, 353550, 220107, 246593, 175762, 91402, 665320, -37516, 295734, -45442, 500183, 156930, 273407, 114621, 384513, 305230, 195335, 47400, 5037, -78591, 163521, 328236, 376432, 90770, 4216, -120466, -106892, 274899, -24549, 273045, 234862]
12169B34862a08598A93795J13104B6011b1861A75915B3410d5099J6054E6199J21319
12158A77518A3516a67566B41169L1574q3308a56728D75889c7712A41304K88e2438
12146A17734H591J16879N8212a01978B71315D5803K39221B3703J33991J7253q4638
12135I0309J31987d6720k32875A97766a760A4411n985g6963A59891J02115E8682
12123d67149b06311A67003a18107b974o2511k87542J31081c0917A57490E9695
12112C82062b39156A1845M27956C4812f527A04151P9040a65392K8828K4797j6605
12101a28372c6229A50466E1485b71528a2528k00150A60037h9324j9496B87519
12090b7388l9777A17855a25023B0929J26176D5076L34877j45435b42110B6378
$$ y = [234862, -108598, 193795, 306899, 26011, -21861, 175915, 23410, -45099, -29045, 56199, 177518, 13516, -167566, 241169, 272743, 189435, -156728, 475889, -37712, 141304, 141592, -52438, 117734, 8591, 125470, 183682, -101978, 271315, 45803, 285024, 23703, 157694, 174947, 90309, 222296, -46720, -279595, 197766, -1760, 14411, 8426, -76963, 159891, 262006, 58682, -467149, -206311, 167003, -118107, -2974, -65485, -353027, -221946, -30917, 157490, 59695, 382062, -239156, 11845, 439801, 34812, -6527, 104151, 183191, -165392, -136564, -111767, -128372, -36229, 150466, 51485, -271528, -12528, -212678, 160037, -89324, -108820, 287519, -27388, -67165, 117855, -125023, 20929, 147105, 45076, 379953, 234518, -242110, 26378]
12079a87706A59768M6580a4526j5564B66223g8851g910r1462b8896F91801P34185
12068A425986J04766E86289k10092a66538a7762j97815M8481Q2314I7769b02106
12057B28628B0268a20278r389G9113g3345j86230B326J04850a29603C58871a7980
12045A98878a52211g4344J302B14445D6286i1543B04952f7895k63731a34289l5888
12034a70177H880g3718B07837a35420a0103A7235c65366C3335N4112A8152b13817
12022A31514J01458A08344b55772J17957B00940a99473a86B7210K2245a56462
12011D9092a77931d6307A89418i8722c5653k34130c1520n4681m5576O5195B1413
11999F1290O9975b55109O8288d2213k3515C31680b95039B33030A03380m3560N4941
$$ y = [-187706, 159768, 206348, -14526, -30090, 266223, -78851, -7910, -99372, -28896, 691801, 1425986, 1530752, 586289, 376197, -166538, -17762, -215577, -167096, -84782, 97769, -202106, 228628, 20268, -120278, -129667, 79113, -73345, -259575, 2326, 107176, -129603, 358871, -17980, 198878, -152211, -74344, -73042, 214445, 46286, -91543, 204952, -67895, -331626, -134289, -170177, 8880, -73718, 207837, -135420, -10103, 17235, -365366, 33335, 87447, 18152, -213817, 131514, 232972, 108344, -255772, -137815, 200940, -199473, -186, 27210, 49455, -156462, 49092, -177931, -46307, 189418, -98722, -35653, -269783, -31520, -86201, -131777, -66582, 21413, 61290, 131265, -255109, -186821, -42213, -65728, 331680, -295039, 233030, 103380, 59820, 114761]
11988A14761a075j13666A57237a4503j79485f3853A03306J52295a7157D3270L4365
11977G7635A3869R6215A4042b21256N9166L2603j26200R8960b597C9593J77195
11966B16788G6822K8990a02382j0076j10916h7910q5741N716h41j54941O4347
11955i1435A17219m3225a17058A02219a376B1384O5576d7497a3841k17168a10169
11943i1912k6075k76469E3557f2856G6443a041I3115h0978j0931k49460Q3341
11932b58028F7409J63942a8090j58248f9933A16938i7452d6993l258B49673a17540
11920b74014A52852b5954A46889a13356D4810a61551A56916a34040A75149d5808
11909a1689A11175f7660F7580d9180i775C7593a19516k24417A92925F8883B1638
$$ y = [114761, -1075, -114741, 157237, -14503, -193988, -63853, 103306, 255601, -17157, 43270, 77635, 13869, 110084, 14042, -221256, -162090, -129487, -255687, -156727, -2597, 39593, 216788, 76822, 105812, -102382, -112458, -223374, -87910, -173651, -167935, -841, -155782, -91435, 117219, 73994, -117058, 102219, -1376, 21384, 86960, -47497, -13841, -231009, -110169, -91912, -117987, -394456, 53557, -62856, 76443, -1041, 93115, -80978, -91909, -341369, -258028, 67409, 231351, -18090, -176338, -69933, 116938, -97452, -46993, -50251, 249673, -117540, -274014, 152852, -25954, 146889, -113356, 44810, -161551, 156916, -134040, 175149, -45808, -11689, 111175, -67660, 67580, -49180, -9775, 37593, -119516, -343933, 192925, 68883, 21638]
11897B1520a89532I9416J63365o4203a69472o6274l3354B31055a40574G5434q28
11886G4606c80651d8404o759F5537d9452b1955j94914a01969d6958B6374c32022
11874b0038j53307D0482K17897O7285e0801k92039E624a9997j85887L415A6292
11862A69127a19063M0873j13039B5287f3461D261L75793b16375g5873p4238J8768
11851a31343d4971j66901k32728f4726D1344J00545b42253E9456d6695B19513
11840G5237O9832d9751M704C04325J3996d10392a17264A50224e0003B62149a89163
11828B4874b4761j33752B72542j21303A6101a49092P2731j73462O1094A1867b55062
11816a01171B26984a26389j70223c4375B9762Q4814f7514A81954c03820g4140
$$ y = [21520, -189532, 99416, 262781, 198578, -169472, -235746, -269100, 231055, -140574, 75434, 74606, -380651, -48404, -55163, 65537, -49452, -21955, -216869, -101969, -46958, 26374, -332022, -20038, -173345, 40482, 258379, 325664, -50801, -342840, 5624, -19997, -205884, -202469, 16292, 169127, -119063, -78190, -191229, 25287, -63461, 4261, 380054, -216375, -75873, -150111, -131343, -44971, -211872, -444600, -64726, 41344, 141889, -242253, 59456, -46695, 219513, 75237, 145069, -49751, -45047, 304325, 318321, -410392, -117264, 150224, -50003, 262149, -189163, 24874, -24761, -158513, 272542, 151239, 16101, -149092, -76361, -249823, -188729, 11867, -255062, -101171, 226984, -126389, -296612, -34375, 29762, 114576, -67514, 181954, -303820, -74140]
11805A90870G7239O5688O0687D8648N5142B5501K79408h360B63783a03491d0901
11793a12241E8328N9105P9116h0218A59360a48213C03906a52639F6963c7121A55422
11781a24215o7243K636A24744a12169E5128R9228G3494h4825k90026D2947M3357
11770H6304a97672a3820B23846H296a41983l02294a81156f3508D5283c20912c2549
11758H1283Q0873E6605a17103A29778l3189b86584a2817j25039D8484L3234J21247
11747B02965c18890a5607j25763l9180m88B44261I5074D089K23171d459p6858
11736h1317o1632a425E9857c0036l276C7970g1168G4787g7792A9858J89628a26348
11723a53902j65024f6675j91867A99097a12626B97224a55908B46228d9250I3476
$$ y = [190870, 77239, 142927, 203614, 48648, 103790, 25501, 304909, -8360, 263783, -103491, -40901, -112241, 58328, 117433, 196549, -80218, 159360, -148213, 303906, -152639, 66963, -37121, 155422, -124215, -191458, -188822, 124744, -112169, 55128, 154356, 73494, -84825, -374851, 42947, 86304, -197672, -13820, 223846, 8296, -141983, -444277, -181156, -63508, 45283, -320912, -32549, 81283, 162156, 56605, -117103, 129778, 96589, -286584, -12817, -137856, 48484, 81718, 202965, -318890, -15607, -141370, -180550, -181038, 244261, 95074, 4089, 227260, -4459, -81317, -142949, -1425, 59857, -30036, -33312, 37970, -71168, 74787, -77792, 19858, 209486, -126348, -153902, -318926, -66675, -258542, 199097, -112626, 297224, -155908, 246228, -49250, 93476]
11712E28117A76943a09108h053A30752a5947l9031a4326G9191b85980D8467g6755
11700a75971N3209e3200K3573J3718j30894c1142C09615A29500Q5922n929q7094
11689A22399a51215A44092B0349a77057b6137j71462R2187A54601b78628C6956
11678A9931b36886P2761j79615h5308k45401B65381o9750b68484I5709b65468
11667e1060M183o3981A30707a52051e2147D6424c4341k97553h53j17490D3093
11655C24085a25078B57386r1118E6093J65849b34173J00603k6293B49492b15136
11644g3717p473o7082C8349i8151j00431O5620j98133J06232B04127g6526p7687
11633a54213O8066B3334h2351A64676P3742n7783a3464j85834p4397A44190m0900
$$ y = [528117, 176943, -109108, -8053, 130752, -15947, -54978, -14326, 79191, -285980, 48467, -76755, -175971, -122762, -53200, -29627, -15909, -146803, -31142, 309615, 129500, 215422, 209493, 122399, -151215, 144092, 20349, -177057, -26137, -197599, -105412, 154601, -278628, 36956, 19931, -236886, -164125, -343740, -85308, -330709, 265381, 195631, -268484, 95709, -265468, -51060, -46877, -110858, 130707, -152051, -52147, 46424, -34341, -331894, -853, -118343, 43093, 324085, -125078, 257386, 166268, 56093, 221942, -234173, -133570, -159863, 249492, -215136, -73717, -81190, -148272, 38349, -98151, -198582, -132962, -331095, -224863, 204127, -76526, -154213, -86147, 23334, -82351, 164676, 238418, 180635, -13464, -199298, -273695, 144190, 103290]
11622A03290f1540A31617f8457j87375J6219j48045F7983L13381A08460a30103
11611c6391k7382p2090J0410A33645D9353N8860C0073a5945C05739j51520b17533
11599F8727A4838Q6265a03508A85311G099L4944M7471l6261B1518d7041o9784
11588a16825A11143J485e8725D81537A33908J12233c2540f62l08555f2824k9511
11577i2335H6403j6488a36322C9426C973b4641j39890A02463M42821I0190a7633
11565A08670l276e8854j28932B81249p4878I8244K25053M3240F5638J17817a19617
11553D4013a75009H6678a28493l9900A29714b51222B25144p4314k7908N6641E0909
11541C17527q6457b7973A67917p5490j8808J71423B8057c6429I5856j8048Q5572
$$ y = [103290, -61540, 131617, -68457, -255832, -239613, -387658, 67983, 381364, 108460, -130103, -36391, -63773, -135863, -125453, 133645, 49353, 108213, 30073, -15945, 305739, 154219, -217533, 68727, 14838, 101103, -103508, 185311, 7099, 42043, 89514, 53253, 21518, -47041, -116825, 111143, 112628, -58725, 481537, 133908, 246141, -32540, -662, -309217, -62824, -92335, 86403, 69915, -136322, 39426, 3973, -24641, -164531, 102463, 545284, 90190, -17633, 108670, 105394, -58854, -187786, 281249, 206371, 98244, 323297, 366537, 65638, 183455, -119617, 44013, -175009, 86678, -128493, -168393, 129714, -251222, 225144, 150830, 122922, 179563, 50909, 317527, 231070, -27973, 167917, 92427, 73619, 245042, 28057, -36429, 95856, 77808, 163380]
11530A63380J19040j5541a08808A63544o2598g5743C24743f7595A56210b7327
11519C9839O6496l6048a66672j21557A23302M5009a09491C52477a4725B35551
11508C75014j08099j19444J27958e0603A28793P9684a69397D53389A85512f6401
11497B66129q4558J07774H1076N3831J07404E0970R0300N4824J15452o3852E3541
11485B06105l4303g620B27051a84345B31572B3906a45120C32225J6797k5492m8566
11474B74964r9347j4695Q7178j01045M4054I2810i730B44519j2818r2485J20482
11463B59698J167A18841N4904H4079M00583H7539B3405J52336G3626g5398B81016
11451A47953J28733n7184a43027E7747A4886J87630O1005g2863q9029k6510B97384
$$ y = [163380, 282420, 266879, -108808, 163544, 100946, -75743, 324743, -67595, 156210, -27327, 39839, 106335, 70287, -166672, -288229, 123302, 168311, -109491, 352477, -14725, 235551, 375014, 266915, 147471, 275429, -50603, 128793, 208477, -169397, 453389, 185512, -66401, 266129, 181571, 289345, 81076, 134907, 242311, 50970, 141270, 196094, 311546, 247694, 53541, 206105, 171802, -7620, 227051, -184345, 231572, 23906, -145120, 332225, 349022, 323530, 274964, 175617, 160922, 248100, 147055, 191109, 92810, -9730, 244519, 231701, 139216, 259698, 260865, 118841, 173745, 84079, 484662, 87539, 23405, 175741, 73626, -75398, 281016, 147953, 276686, 219502, -143027, 57747, 14886, 202516, 263521, -72863, -161892, -188402, 297384]
11439B76213r4806h4569G2308K01286j32086b8470k37360C69981j13454J81677
11429D38204a40307H4786b0112j70816G8325a34887b8116B1956K50347G5729a51284
11417C3291g1276M430E4192a05893A35092a68849J1011B20199m1503A0393K51516
11406B61909a26205A79403i6256A98221j805a46871N9384j14456B25522a32781
11395b30979R6622d8594E1622C627f8036n2577A09923M4925J55724b69668D6358
11383g8353p1270C05091g7463p8923B72617j17787g136A69283C2050P7529i4201
11371h9029A34776M9198a43480B12490a6221E0856h2537A4108a23541C5561a0600
11359b3047A86405M9173B6970a96878I7376c60552a12676o5077j6203d8951Q295
$$ y = [276213, 181407, -84569, 72308, 273594, 141508, -28470, -265830, 369981, 256527, 438204, -140307, 84786, -20112, -190928, 78325, -134887, -28116, 21956, 272303, 75729, -151284, 33291, -71276, -66846, 54192, -105893, 135092, -168849, -157838, 220199, 178696, 10393, 261909, -126205, 179403, -96256, 198221, 196416, -146871, -87487, -201943, 225522, -132781, -230979, -134357, -48594, 51622, 3627, -68036, -120613, 109923, 154848, 310572, -269668, 46358, -78353, -149623, 305091, -77463, -156386, 272617, 154830, -7136, 169283, 32050, 109579, -94201, -89029, 134776, 183974, -143480, 212490, -16221, 50856, -82537, 14108, -123541, 35561, -10600, -23047, 186405, 235578, 26970, -196878, 97376, -360552, -112676, -177753, -193956, -48951, -40656]
11348d0656o0951j43912C11999a84208B92176c37319e1639B49465N5495a49126
11337d1511A27743f5589m9559r2044B4700f0751F5299a84358a2958I7314C9953
11325B11027b2219A10930c9982j28598c8499b60D5666A1213b67033A9739a76469
11313b5911l88759b01329f5128k3132r692A07956J87627I561b90021B34751a29776
11301A44491b3809n8365q8936A97414g6223a2674n9962k04993A19700L1141O3416
11290B14257p9322b47703f0522A31936d33295A13276m5948B9293d7704A52141
11279a3905F8134h4928B8910q200a03777j32274C5663Q596b04173B15510b53064
11267H8155a75965B22510q7733h4438j11351e203G3560a06714b8443j44573e3666
$$ y = [-40656, -101607, -245519, 311999, -184208, 292176, -337319, -51639, 249465, 304960, -149126, -41511, 127743, -65589, -115148, -207192, 24700, -60751, 65299, -184358, -12958, 97314, 39953, 211027, -22219, 110930, -39982, -168580, -38499, -260, 45666, 11213, -267033, 19739, -176469, -25911, -414670, -201329, -65128, -88260, -97952, 107956, 295583, 9561, -290021, 234751, -129776, 144491, -23809, -82174, -171110, 197414, -76223, -12674, -72636, -277629, 119700, 150841, 214257, 134935, -247703, -60522, 131936, -433295, 113276, 67328, 29293, -47704, 152141, -13905, 68134, -84928, 28910, 20710, -103777, -236051, 35663, 44259, -204173, 215510, -253064, 88155, -175965, 222510, 134777, -84438, -195789, -5203, 73560, -106714, -28443, -173016, -53666]
11255E55265a88819e2009N467A19082b7127l35982a55651G2853e283A02206M1788
11244A43994f0432q9228p9644H487O3986k8606a14913B61068j14799b35379n5366
11233b90745j14918a03461A87756o6692j9193e4227j5481j14559i1552D2951R238
11222E2189b18074A41816b17679P5091a1083q7566i291j7842k61594A03655a18597
11210A30839a70278D7042J42580c20433F789a2988j58520A02010e11613B95554
11199e23432J27392a71068A49415c4700j76109f3246F4961a15832a8552G522Q8750
11188I6272a79420k04643B9916b91126a1996j66481C1974a86850H7133a7363A15836
11176b56167j01108a62616P6470G1126Q1054E2632g0179A62631a37487B3505J25364
$$ y = [555265, -188819, -52009, -46542, 119082, -27127, -363109, -155651, 72853, -5283, 102206, 143994, -60432, -149660, -229304, 8487, 72473, 43867, -114913, 261068, 146269, -235379, -290745, -405663, -103461, 187756, 121064, 101871, -54227, -69708, -184267, -91552, 42951, 52189, -218074, 141816, -217679, -142588, -11083, -98649, -9291, -27133, -288727, 103655, -118597, 130839, -170278, 47042, 189622, -320433, 6789, -12988, -171508, 102010, -511613, 295554, -523432, -396040, -171068, 149415, -34700, -210809, -63246, 64961, -115832, -18552, 7522, 96272, -179420, -384063, 29916, -291126, -11996, -178477, 31974, -186850, 87133, -17363, 115836, -256167, -357275, -162616, -86146, 71126, 152180, 52632, -70179, 162631, -137487, 23505, 148869]
11165A48869m3745j4479A0615b219C17926f8407A66248R4231G186b07837A37495
11153A56739L10082b126B529O649J32093E6574A6553Q882J90890n5817b3029C6204
11140A97042L13481A56421a71211B46451a63928e5658A51802c27821a25182B5719
11129D514J04979J81473j10237h3081A96354a05433C2189e2902j89225A07255
11118B59487B8438L7342a37399F2152c2102n6140E6600K34989a70893A0471K51734
11107B62205F4607J92216G3238h1996D1598O6735J10577M1204o2748J8174a18081
11095B32880J03598k4204q0569G6547J73225K45037k01370o6189a0109B34721
11084c27742C89098e6876A51143J98750I7388M21153A28083J07027R6355A25163
$$ y = [148869, 105124, 90645, 10615, -2219, 317926, -68407, 166248, 260479, 7186, -207837, 137495, 156739, 466821, -2126, 2529, 9178, 141271, 56574, 16553, 25435, 216325, 160508, -23029, 36204, 197042, 510523, 156421, -171211, 246451, -163928, -55658, 151802, -327821, -125182, 25719, 4514, 109493, 290966, 180729, -83081, 196354, -105433, 32189, -52902, -242127, 107255, 259487, 28438, 65780, -137399, 62152, -32102, -88242, 56600, 291589, -170893, 10471, 262205, 64607, 256823, 73238, -81996, 41598, 108333, 218910, 260114, 197366, 215540, -118081, 232880, 336478, 312274, 231705, 76547, 249772, 494809, 293439, 227250, -10109, 234721, -327742, 389098, -56876, 151143, 349893, 97388, 518541, 128083, 235110, 331465, 125163]
11073C24101c068D23179A03618O5334M61948B11690J91586A97836l8304J20088
11063B79620L38101k52474J28126K26377j78749J7759q1445K25201k53547J60436
11053F09405R4482j23489R185N76043n10694L07297k83874K76259k41050K7136
11043G40700J95885m41796N15796j20374j27450J37070K11839l24313j36336k44347
11033D06674Q26882m65728J23988P510j43646k59454L73280J08954K33819n50311
11023F61968L96415m27073K65681k99712k45470L72009J3069l19380J78479J96458
11013G92444j2247j9693J30447L9204k45023o9186k06037L66407j12077L01893
11003I66132l17256k36606M03135N771p0548M8338k01927K85446j83796n1450
$$ y = [324101, -3068, 423179, 103618, 168952, 630900, 211690, 403276, 197836, 159532, 279620, 617721, 365247, 493373, 719750, 541001, 558760, 477315, 702516, 448969, 609405, 703887, 580398, 589583, 1165626, 654932, 962229, 678355, 954614, 713564, 740700, 936585, 494789, 1010585, 890211, 762761, 899831, 1111670, 787357, 651021, 406674, 1233556, 767828, 891816, 899326, 755680, 496226, 869506, 978460, 1212279, 661968, 1058383, 631310, 896991, 597279, 351809, 723818, 736887, 417507, 595986, 792444, 780197, 760504, 890951, 930155, 685132, 615946, 409909, 776316, 664239, 966132, 648876, 412270, 815405, 821176, 750628, 798966, 597039, 882485, 698689, 647239]
10993F47239l1227K28626M5783r032j7260j54223J43522K70966j87038Q8058J39735
10982A165149J52746j13112M5123n7710k02224O38609K34236J17001L00511J66693
10972B447022N57293m0406L7093M61495q7143p5004j96318q30032L49466l87427
10962B236039m78481n2242j74231q218k26897K12858k02432K41368L32252m91263
10952A388753o2842o9634j49631m32036J81318r1823k94635j26932J73407j51316
10942C64629A13770K01557q5283j12554R7418e1125A12308j0281L8611f7570C21332
10930A12745J22855b24886A19943f4091C99763d2782k75980a54648C35175b83767
10919d73912a17219j48999a876m410j2738A80480b13867a02589B31725E5457J80749
$$ y = [647239, 616012, 844638, 890421, 881389, 864129, 709906, 853428, 1124394, 937356, 1025414, 1165149, 1317895, 1204783, 1249906, 1192196, 989972, 1628581, 1862817, 1979818, 2280329, 2447022, 3004315, 2963909, 3001002, 3462497, 3375354, 3300350, 3104032, 2274000, 2623466, 2236039, 1757558, 1705316, 1531085, 1522867, 1295970, 1508828, 1306396, 1547764, 1880016, 1388753, 1325911, 1256277, 1106646, 674610, 855928, 764105, 469470, 342538, 515945, 364629, 113770, 315327, 230044, 117490, 214908, -51125, 112308, 102027, 140638, -67570, 321332, 112745, 235600, -224886, 119943, -64091, 399763, -42782, -318762, -154648, 335175, -283767, -473912, -117219, -266218, -1876, -6286, -19024, 180480, -213867, -102589, 231725, 55457, 236206]
10908B36206n4036F2837B5053J06304b67864d5053A8264J48401E9570P3387n7765
10897G5192M7676a71058B56529c86124N8618J7996c433H9274a27585j13012m4350
10886b84947A86457b59144C9305a3770m03968A6894c29172D4074J82762m2097
10876A84739k7696i7908b2937B62116k3151d168D4511M9618f3646A43086P3302
10865B16388e866k111j46907M9768k71415h0003j98501B25651D4248d1088j33094
10854a74182B14092k9805h188j15347j41950A9715b55085H236J06398P9378J05224
10843B99236f2135B7487a19933h814D7433J33776c7101D5685A971b59320C434
10831A21997a50905K8795A09558D1646N50104i6686c0129o4090A30650h7289r1571
$$ y = [236206, 182170, 62837, 25053, 131357, -267864, -45053, 18264, 166665, 59570, 132957, 75192, 122868, -171058, 256529, -386124, -327506, -309510, -3433, 89274, -127585, -240597, -284947, 186457, -259144, 39305, -13770, -417738, 16894, -329172, 44074, 226836, 184739, 157043, -97908, -22937, 262116, 238965, -4168, 44511, 94129, -63646, 143086, 216388, -5866, -7977, -154884, -105116, -376531, -80003, -278504, 225651, 44248, -41088, -174182, 214092, 184287, -8188, -123535, -265485, 19715, -255085, 8236, 114634, 194012, 299236, -62135, 27487, -119933, -8814, 47433, 181209, -37101, 45685, 1971, -259320, 3434, 121997, -150905, -122110, 109558, 41646, 591750, -96686, -30129, -94219, 130650, -87289, -178860]
10820a78860f9817G538b8267k03117E06778a52194D745J1195a67155A55497k4183
10809A31314o4411a23767F2074N7844M4533c69476a5468j19318A32977b36968
10798H2505A3543b28817a10935F4018R0961K06002a94974f8093O569l1387A31557
10786G9403O3794E4994f0450A13196b19861N7734P7292n4350A36039B8731b86369
10774a812k67267B2024d7869j80022E3116b85119B88758d2221j69789O8132b3546
10762b62022A6074P8962N7761F6497d84674b25778j28606d0987c41E7084d5894
10750b67291a15101H0149a39622n6086D1956L10377E8396b68957C12011G992J63299
10739A71291e5126f665D05721A1249e9323D2669N7161a548B84262B4122d4901
$$ y = [-178860, -69817, 7538, -28267, -231384, 506778, -152194, 4745, 15940, -167155, 155497, 131314, 66903, -123767, 62074, 119918, 164451, -369476, -15468, -134786, 132977, -236968, 82505, 13543, -228817, -110935, 64018, 154979, 360981, -194974, -68093, -61524, -92911, 131557, 79403, 143197, 54994, -60450, 113196, -219861, -162127, -84835, -139185, 136039, 28731, -286369, -1812, -269079, 22024, -47869, -227891, 53116, -285119, 288758, -42221, -212010, -143878, -23546, -262022, 16074, 95036, 152797, 66497, -484674, -225778, -354384, -40987, -341, 57084, -45894, -267291, -115101, 80149, -139622, -195708, 41956, 352333, 58396, -268957, 312011, 7992, 171291, -55126, -6665, 405721, 11249, -59323, 42669, 99830, -1548, 284262, 24122, -44901]
10727c768j44071B9738J44635o2754a25688a8126j93611N4774A19881J70635g9151
10715e5875k5045I0954a31217D907K4069b15167A333O9161a85323j01571J41025
10704a45869C33875E6007a01164o6519C29031E3456a19508k0434b4740j22377
10694a47117r31F0653A5986a5692k5920A37368b06661j13373A16261i4969a7668
10682a02759K4201B59334A493J72916c19977g3243k09068E8968A9812e2366j78606
10671b30972C2745J12571a09403N2000n2129J6708L4679J6888l29099a47014A93333
10659c85493R8476C49033b7224B01260a21002J1708A28091a44417a5753D7482
10648A93420m6681J33740n2946R5273b3088k35283m5411o6590a15702A60805a05221
$$ y = [-3768, -147839, 29738, 174373, 111619, -125688, -18126, -211737, -156963, 119881, 290516, -79151, -55875, -80920, 90954, -131217, 4907, 28976, -215167, 1333, 70494, -185323, -286894, -145869, 333875, 56007, -101164, -167683, 329031, 53456, -119508, -139942, -24740, -147117, -148048, 60653, 15986, -15692, -41612, 137368, -206661, -320034, 116261, -94969, -17668, -102759, -78558, 259334, 1493, 174409, -319977, -73243, -282311, 58968, 19812, -52366, -230972, 32745, 145316, -109403, -57403, -109532, -92824, -58145, -41257, -370356, -147014, 193333, -385493, -287017, 349033, -27224, 201260, -121002, -109294, 128091, -144417, -15753, 47482, 193420, 146739, 280479, 227533, 322806, -23088, -258371, -303782, -370372, -115702, 160805, -105221]
10636b33569m8808C6015a32412B13618G0521c11952H8386a67127A946a51536J2063
10625a39473A40054e0482A42271b16159C4129c8266r0633p1651b0190B7436a09479
10613H0651b88153H9151a90481P7490C73229a11702E4344f9954A48727D717O3535
10602F8252a67774j8789Q6215r617D0471c59133D37639i8206D3681a23156j51070
10591b74226e5548K3848H8636J04704d9894k20507O1297q6167F4338i4947j05180
10580b00127A34954b36242A75083c58372A69550c0099n7380b2558J1140m2718
10570e4136H7853M8653E6426K5686R0168a96871k46601A11247a18528m9082P463
10559a60147B70626j12207g4246B9205J74627B0082c6190R602m0694C14055I5345
$$ y = [-233569, -282377, 36015, -132412, 213618, 70521, -311952, 88386, -167127, 1946, -151536, -139473, 140054, -50482, 142271, -216159, 34129, -38266, -128899, -200550, -20190, 27436, -109479, 80651, -288153, 89151, -190481, -112991, 373229, -111702, 54344, -69954, 148727, 4717, 68252, -167774, -186563, -100348, -109965, 40471, -359133, 437639, -98206, 43681, -123156, -274226, -55548, -31700, 88636, 193340, -49894, -270401, -209104, -295271, 64338, -94947, -200127, 134954, -236242, 175083, -358372, 169550, -30099, -87479, -22558, -11418, -54136, 87853, 136506, 56426, 82112, 172280, -196871, -443472, 111247, -118528, -167610, -160147, 270626, 158419, -74246, 29205, 203832, 20082, -36190, -26588, -67282, 314055, 95345]
10547b28590c8106k51652P1049E7879P2652K44620a68298j53847f8201D61842
10536b82382B79263b44214f4694E7603b31399E6796a38077B556c37612m8424f09
10524a52288A65630b5680k70428O5386H5787a00786k17235C33640m4046f0616
10513H8249K21613e879r2029C29590a63732B4885b02143l7326A99566b60276A88185
10501a13029d3540k60629A8361g7210j20728b7980m5531q8418N3337f342A05029
10489A43049a62520j58117J33951h3686D1126g512A91049a23770B88789K2749
10479C11538L4111j52790J35580M0634b36596C86101E2513J40053F5856R1676
10469A57532f2972D5714P7307a28254A45498b6453A76177C1563N6947b66824A47651
$$ y = [-228590, -38106, -289758, -218709, 57879, 130531, 375151, -168298, -322145, -68201, 461842, -282382, 279263, -244214, -64694, 57603, -231399, 56796, -138077, 2556, -337612, -386036, -609, -152288, 165630, -25680, -296108, -230722, 85787, -100786, -318021, 333640, 289594, -60616, 88249, 309862, -5879, -97908, 329590, -163732, 24885, -202143, -239469, 199566, -260276, 188185, -113029, -43540, -304169, 18361, -77210, -197938, -27980, -73511, -161929, -108592, -6342, 105029, 143049, -162520, -320637, -186686, -83686, 41126, -7512, 191049, -123770, 288789, 311538, 345649, 192859, 328439, 369073, -236596, 386101, 52513, 192566, 65856, 157532, -62972, 45714, 123021, -128254, 145498, -26453, 176177, 31563, 88510, -266824, 147651]
10457b96846D7337b58255g133B37343q2416A0487M9343b30229D32810A46589A6820
10445B26463k7406c0219o2488r7323A75319d9980b0596j35733P5641A02300a9705
10433a75631A40158a13397N1402n4218j31703J11587e2212b2634j08635a1214
10422G0469a13042B1093e3252o3135n520k27158A0235L0086K4141J19446l9870
10411A44038h2469A22062a07196D36068c69554D17651A11149c8354J6660K704
10401a8990I7756P2645e1698E8926J93058H9826c1716B72087B625L01719f4872
10389A10195K36061k8555j27314c1528A36523F3586J89186a40296A70895A0089
10378E20883A28405a7308F03452k95655h6139B19701D1366L01875M3882r9526
$$ y = [-296846, 47337, -258255, -7133, 237343, 154927, 10487, 59830, -230229, 432810, 146589, 16820, 226463, 199057, -30219, -92707, -190030, 175319, -49980, -20596, -156329, -80688, 102300, -19705, -175631, 140158, -113397, -61995, -116213, -247916, -136329, -52212, -22634, -131269, -11214, 70469, -113042, 21093, -53252, -116387, -121907, -349065, 10235, 40321, 64462, 183908, 144038, -82469, 122062, -107196, 436068, -369554, 417651, 111149, -38354, -21694, -18990, 97756, 170401, -51698, 58926, 251984, 89826, -31716, 272087, 2625, 304344, -64872, 110195, 346256, 317701, 190387, -31528, 136523, 63586, 252772, -140296, 170895, 10089, 520883, 128405, -17308, 603452, 307797, -86139, 219701, 41366, 343241, 387123, 287597]
10368B87597K90454j5679J17192l21435L96933A29969L71847j21403k9419d748
10357B0231M83082E5170R7719n752N7032m1333O12261k33652j59777J67679B71532
10345B76956J82100k24646M40131j31320A36059K11230O2000b10553C32734A44073
10334B11858o6008H08M27055r0333A33580B7772N2696L79962A68735R8254k8859
10323B38130j09034k4348J01645r6783J22086J7929A07537b32342e7001B47524
10312G4761J73766E1139a98955l3969I9304L3368m6515P8897H714c9966E0000
10300b71250b6872B83160A35281o2466J08192a44843m5854M8630k4244K8164C10079
10288c18237d9373a7957B8900b71146A05148b78995N9993n352c9151G7374b03653
$$ y = [287597, 578051, 562372, 679564, 358129, 755062, 129969, 501816, 380413, 350994, -4748, 20231, 503313, 55170, 152889, 147137, 204169, 162836, 775097, 541445, 381668, 549347, 271532, 276956, 459056, 234410, 674541, 543221, 136059, 347289, 409289, -210553, 332734, 144073, 211858, 145850, 808, 427863, 337530, 133580, 27772, 80468, 460430, 168735, 266989, 238130, 129096, 104748, 206393, 109610, 231696, 249625, 107537, -232342, -57001, 247524, 74761, 248527, 51139, -198955, -232924, 99304, 132672, 86157, 165054, 8714, -39966, 50000, -271250, -26872, 283160, 135281, 72815, 181007, -144843, -190697, -142067, -166311, -138147, 310079, -318237, -49373, -17957, 28900, -271146, 105148, -278995, -219002, -224354, -39151, 77374, -203653]
10276i3009c5940p7288m3783k18957A51823b01776q2029h0630B39757a12101C54592
10264a08191G78N3387J63872a8809j67287A60631K07475B1368P0181i4806G4920
10252e93B40502N6966a87769N7521D589h7216B4158b20535H1775P2314a48747
10240b2038A95455a47744k51590f2603k88943D7026b78780J20164L4336B7530
10229a29516A51037e1721A63810p2936L9540a0713l6414o3430n868A54704d7767
10217d39624J63512K5607e4874j62539M1069h5982o8245G8737b27814B1979a2894
10205b0677E671J967d11047a9801A6767d7101j96120J16385j12105B37940q1671
10194A56269Q4073a77074C158K02976F0690Q9660a16371A46081k4591K4534a4357
$$ y = [-93009, -35940, -113228, -157011, -375968, 151823, -201776, -283805, -80630, 239757, -112101, 354592, -108191, 778, 54165, 218037, -18809, -186096, 160631, 368106, 21368, 91549, -94806, 74920, -593, 240502, 297468, -187769, -130248, 4589, -87216, 24158, -220535, 81775, 154089, -148747, -22038, 195455, -147744, -399334, -62603, -351546, 47026, -278780, -158616, -124280, 27530, -129516, 151037, -51721, 163810, 90874, 130414, -10713, -47127, -110557, -116425, 154704, -47767, -439624, -276112, -250505, -54874, -217413, -176344, -85982, -154227, 78737, -227814, 21979, -12894, -20677, 5671, 7638, -411047, -19801, 16767, -47101, -243221, -126836, -238941, 237940, 156269, 240342, -177074, 3158, 206134, 60690, 150350, -116371, 146081, 121490, 146024, -14357]
10182c34197h873A00037a21804A2412J2955a09494n3570A50797N1799b1615p5811
10171i7426B41417a87707k6647h876I5852a56252j54768a36308j25475m898J22482
10160a44199c9184j0085j72733I4098J23973c7409C49495F3969h492j73930m5233
10149b27655B04879a27264B8729b45010A16531K1421c50031H3827e1343E206R6206
10138A01412J62440b27630B16337G9316L24191D2432b32050l9480L4219A51450
10127a20813F3590K543b26234M4874j20137D9691a35822a8221m3034j38760P93
10116a99222a0955j0072F7665L9925Q0453a66006j39890Q2064A96337a28004d0245
10104D6087J69717a20884A2428b36647D3890J42983h5418H9578m0175N9758f7716
$$ y = [-334197, -8873, 100037, -121804, 12412, 25367, -109494, -163064, 150797, 202596, -21615, -97426, 241417, -187707, -214354, -8876, 95852, -156252, -311020, -136308, -261783, -266681, -144199, -39184, -49269, -222002, 94098, 218071, -37409, 349495, 63969, -8492, -182422, -227655, 204879, -127264, 28729, -245010, 116531, 137952, -350031, 83827, -51343, 5206, 101412, 263852, -227630, 216337, 79316, 403507, 42432, -232050, -271530, -237311, 151450, -120813, 63590, 66133, -226234, -181360, -301497, 49691, -135822, -18221, -61255, -200015, -199222, -10955, -21027, 67665, 107590, 188043, -166006, -305896, -223832, 196337, -128004, -40245, 46087, 215804, -120884, 12428, -236647, 43890, 186873, -85418, 89578, 49403, 109161, -67716]
10092G1714b13084a01212A65296f3130I1247N8943d9164A18322f7666m2499H810
10080a17164k09012P8389a05912A11612b8560k9274o0689j23556A71849O3414
10070B35263e6042n508C8572i117l0834j83952f1569o6972A08741K09252f7116
10058A21963F0023c0554A65164b75123J2155A10872c04664J08580g6769M488n1462
10047a23743e9219b2266A03384c45298G4278l7079a95207R1943n3698j44204a2437
10035A60194F7276o609P6974a59906P3276r41A82238a0879G0579L0208a52476
10023g9480k63558g5666A95523e0468C67P3025g4665o9292g0682l7844l1960G8896
10010b85091C21035d84405h1479D7336b88500A8a80421g4137A17305a16859f336
$$ y = [71714, -213084, -101212, 165296, -63130, 91247, 150190, -49164, 118322, -67666, -110165, 8810, -117164, -326176, -247787, -105912, 111612, -28560, -57834, -118523, -242079, 171849, 235263, -56042, -61550, 38572, -9117, -39951, -223903, -61569, -128541, 108741, 317993, -67116, 121963, 60023, -30554, 165164, -275123, -262968, 110872, -304664, -196084, -76769, -72281, -123743, -59219, -22266, 103384, -345298, 74278, 37199, -195207, -103264, -156962, -301166, -12437, 160194, 67276, 60667, 137641, -159906, -86630, -87571, 182238, -10879, 70579, 100787, -152476, -79480, -343038, -75666, 195523, -50468, 367, 73392, -74665, -143957, -70682, -108526, -140486, 78896, -285091, 321035, -484405, -81479, 47336, -288500, 18, -180421, -74137, 117305, -116859, -6336]
9998H9515e8683I8218a44443e7646A65332P763b4586j30010j3206A51259f9853
9986A72058a06733A58923a11102B87626c45507g4939I4823b09611c7917q824j25685
9975a72426j12332J31033H8194d18399i9363A41602a12983j23604B63246a73741
9964h7912a425j34457B26821J75970j81092d8642j70390d5009j03834L5065j08492
9953b22270a00846j33471B47508j23211a04057F245i6744K4474C3233a4541A79397
9941F0958c46672e2235j14427o7807A73227b76928g6814p1671D6334e3328G4334
9929A7369b15235C31072i1976o7256A14191k4226a38427r2238J08044C7774a91687
9917b7137j23752B13422d77541a37601K7447A12253J9323B0533d6080k29472h369
$$ y = [89515, -58683, 98218, -144443, -57646, 165332, 173095, -24586, -154596, -167802, 151259, -69853, 172058, -106733, 158923, -111102, 287626, -345507, -74939, 94823, -209611, -37917, -46741, -172426, -284758, -153725, 88194, -418399, -99363, 141602, -112983, -236587, 263246, -173741, -87912, -1425, -135882, 226821, 402791, 221699, -48642, -219032, -45009, -148843, -113778, -222270, -100846, -234317, 247508, 124297, -104057, 6245, -96744, -72270, 33233, -14541, 179397, 60958, -346672, -52235, -166662, -234469, 173227, -276928, -76814, -148485, 46334, -53328, 74334, 17369, -215235, 331072, -91976, -159232, 114191, 89965, -138427, -230665, -122621, 37774, -191687, -27137, -150889, 213422, -477541, -137601, -110154, 112253, 131576, 20533, -46080, -275552, -8369]
9905F5273c2044n75663D3619j704f0030B3039L17497a47860J852C646b262B6690
9892d2136k07419M9398M2949j52173J47715B8371M35519b44179L1173N7980j21790
9881b76816D45129b23013Q972A52677l0401o779b25756j4038a5602P355l12295
9870c20542F5321k6483b75686Q5957l0056j56236B4709P3939b837C9567J6820
9859E6387b37596O8586j31358a37423C0948J9439J9362a87158p3297C0987g8463
9847A44h2628o174O761j27719g0832n7941I6531j8292K8964J67213F7953d55710
9834a03645j5116q88j11771B6648L0009c4841E7168d2740D3759B688K5484a7964
9821g4857m7231j06095p5444C6159O2619a35567F6418b8330k83535e6751j2049
$$ y = [65273, -32044, -607707, 43619, 41915, -60030, 23039, 340536, -147860, -146008, 3646, -2262, 26690, -42136, -249555, -200157, -157208, -309381, -161666, 28371, 463890, -244179, -213006, -155026, -276816, 445129, -223013, -214041, 152677, 122276, 115497, -225756, -239794, -15602, -8247, -320542, 65321, 38838, -275686, -189729, -219785, -376021, 24709, 98648, -2837, 39567, 56387, -237596, -169010, -300368, -137423, 30948, 50387, 69749, -187158, -260455, 30987, -78463, 144, -82628, -88802, -82041, -209760, -70832, -128773, 96531, 78239, 107203, 274416, 67953, -455710, -103645, -118761, -119649, -231420, 26648, 56657, -34841, 57168, -42740, 43759, 2688, 28172, -17964, -74857, -122088, -228183, -303627, 36159, 98778, -135567, 66418, -28330, -311865, -56751, -68800]
9810f8800C43173b66506A29715a97301A47779A4243a0640o9753k19934B30446
9799a96855B2559d70298K21243A7330a47443J075a5184F4492M1406c5007k03411
9788b38418k9985L5369A77522e4848G2661J59521b68222f28k16638k1592Q8934
9777a49924B040a5210A39060i3147D5612b1846A16839J0361C537a83109A00867
9765c23763N3669D0099i7399A33757J11601C0907J96947f6884j65158a2377F1682
9753a98978A3533R2511a68246q4991A86453h4306m9277n60A25483a83414E9279
9741g8366C3273g6596r6611h3407j3981M4355l3964m11435K19186j16866c4518
9729A12252C4073b897B79492A14336b32729b5018j39232O2006G6522i8613C08159
$$ y = [-68800, 343173, -266506, 129715, -197301, 147779, 14243, -10640, -80393, -300327, 230446, -196855, 22559, -470298, -249055, 17330, -147443, -146368, -15184, 64492, 105898, -35007, -238418, -268403, -233034, 177522, -54848, 72661, 232182, -268222, -628, -217266, -238858, -149924, 2040, -15210, 139060, -93147, 45612, -21846, 116839, 127200, 3537, -183109, 100867, -323763, -270094, 40099, -97399, 133757, 245358, 30907, 227854, -66884, -232042, -12377, 61682, -198978, 13533, 106044, -168246, -253237, 186453, -84306, -133583, -134143, 125483, -183414, 59279, -78366, 33273, -76596, -173207, -83407, -97388, -53033, -86997, -498432, -279246, -396112, -34518, 112252, 34073, -2897, 279492, 114336, -232729, -25018, -164250, -102244, 76522, -98613, 308159]
9717b89095b22k22455N2082j38554B88779a2246k04793l4796K2437B39712F0052
9705a9165n7287K3108B19503h7801a3623A51909a25177J2723A52283c02922l1078
9694c34000A12376a86107D0572N6874J6288b2244A08216d0321q3491G3287a84137
9682A18235J41210b57416B0875R9038K3716e2699A94913d17636B38778G5112J7246
9671I2358c06069a48874e5215B1999b41649C59154h7832J2306n3228e4105b0137
9659c59940J21714a17957B78595j21554D4285a42152e0493l46385J30212Q9669
9649a76997d4790a1375l4431B01469g812l33044b9485r6300j87110K3780l3880
9638c22995e0712o20727A8979h2300J9500m3038o0432M6226a4242A04348b97426
$$ y = [-289095, -222, -222677, -170595, -309149, 288779, -12246, -217039, -251835, -229398, 239712, 60052, -19165, -76452, -53344, 219503, -87801, -13623, 151909, -125177, -112454, 152283, -302922, -334000, 112376, -186107, 40572, 97446, 113734, -22244, 108216, -40321, -123812, 73287, -184137, 118235, 259445, -257416, 20875, 119913, 143629, -52699, 194913, -417636, 238778, 75112, 92358, -306069, -148874, -55215, 21999, -241649, 359154, -87832, -75526, -128754, -54105, -20137, -359940, -238226, -117957, 278595, 157041, 44285, -142152, -50493, -396878, -266666, -176997, -44790, -11375, -45806, 201469, -7812, -340856, -29485, -125785, -312895, -289115, -322995, -50712, -671439, 18979, -82300, -62800, -105838, -166270, -120044, -14242, 104348, -297426]
9626b26482B19685b30252B3731b17665G3606h4489o3321j71836K147F4076J12464
9615A76540b99014J17642H1123P2770c66513A52908e6693B16259a48626A38967
9604A0600K20258K3702c30028A15456a77840b0887p3337r8222b895n6172A02887
9592A72018d3169C6789M7349K29478L1526b31754g9688l3951o1411A54357B3356
9580B20507F4444a65546A86702c11925a9959j02714B0807a36334H3037i5913l7429
9569a33342A26321a81217j06233D0857b0940j9938j33807A20244L3593a18171
9558I7055a74968J2374q7275B44752b02427E8331c75472i6296B21028c66677a24389
9546B253a65798d4423j5965L959A64034a98040M2259m5368L5289j38223A65108
$$ y = [-226482, 219685, -230252, 23731, -217665, 73606, -84489, -147810, -319646, -317499, 64076, 176540, -299014, -181372, 81123, 153893, -366513, 152908, -56693, 216259, -148626, 138967, 10600, 230858, 254560, -330028, 115456, -177840, -20887, -94224, -192446, -2895, -59067, 102887, 172018, -43169, 36789, 84138, 313616, 345142, -231754, -79688, -113639, -175050, 154357, 23356, 220507, 64444, -165546, 186702, -311925, -19959, -122673, 20807, -136334, 83037, -95913, -133342, 126321, -181217, -287450, 40857, -20940, -40878, -174685, 120244, 153837, -118171, 97055, -174968, -162594, -249869, 244752, -202427, 58331, -375472, -96296, 221028, -366677, -124389, 2253, -165798, -44423, -60388, -56429, 164034, -198040, -155781, -201149, -165860, -304083, 165108]
9534A86950g0462o9083j6817j7131O009B08574b10102j52654Q387B499a18752
9522c48244c5297j19227A70674i7695n2224B7084i7012G7631a90877D5812B907
9510a11315K8950l7051j06857j65081C5668a86636D5000b20863a6020k30383A71213
9498a16026j69192E2568a09275b2686a0026B6818a84257Q2998I2349b741j16096
9487a18837j53634Q7966j01457J28698A13919d09038A09286c3183m58058I9848
9476I6676N2096b70005h2251n3780E5865J79828h8936k08755B84789a32440r1073
9465b23513r1230a56347j38605Q9549C15004b39123c9625A8849c1073B24202A04717
9453B2741a90791i4984B63686d4917k1011B15371g0548B33985a77802A6044J36553
$$ y = [186950, -70462, -139545, -156362, -173493, -167484, 208574, -210102, -362756, -354369, 2499, -118752, -348244, -35297, -154524, 170674, -97695, -149919, 27084, -97012, 77631, -190877, 45812, 2907, -111315, -82365, -119416, -226273, -391354, 35668, -186636, 45000, -220863, -16020, -246403, 171213, -116026, -285218, 52568, -109275, -22686, -10026, 26818, -184257, -101259, 92349, -2741, -118837, -272471, -184505, -285962, -157264, 113919, -409038, 109286, -33183, -491241, 99848, 96676, 148772, -270005, -82251, -136031, 55865, 235693, -88936, -297691, 284789, -132440, -223513, -314743, -156347, -294952, -205403, 315004, -239123, -39625, 18849, -31073, 224202, 104717, 22741, -190791, -94984, 263686, -44917, -65928, 215371, -70548, 233985, -177802, 16044, 152597]
9442A52597o7216J59630b22705I1406h5682o6189A77799c10551J27383J5960m2307
9431b09515L8554p5879P6317g8612j07205D4694a50845j71775a54610A33771D4927
9419b9486m673B86487a26283K0224M6947C3298C981e12670a42326P0922b3169
9407f9408B23732b44223A4246J02155a31728M8970k1803J6511K3573A13100C0248
9395D4183b49285J07896j16C0143f1169j1937C6621a78280C1033b01653b7933
9383G1235b83617d3123k9024r2858A01868a35925C715b557j18156J1783j61310
9372b70240c4980A53558c18282A78873p6287a94720f6660B18886a67158H5231
9361g4980i64F2610a13732D7040k227J76957D6884a54842B7490K32661d9569j06507
$$ y = [152597, 85381, 245011, -222705, 91406, -85682, -151871, 177799, -310551, -183168, -167208, -209515, -170961, -246840, -170523, -78612, -185817, 44694, -150845, -322620, -154610, 133771, 44927, -29486, -34159, 286487, -126283, -106059, -59112, 33298, 3981, -512670, -142326, -71404, -23169, -69408, 223732, -244223, 14246, 116401, -131728, -82758, -104561, -88050, -64477, 113100, 30248, 44183, -249285, -141389, -141505, 30143, -61169, -73106, 36621, -178280, 31033, -201653, -27933, 71235, -283617, -43123, -72147, -165005, 101868, -135925, 3715, -2557, -120713, -108930, -270240, -34980, 153558, -318282, 178873, 102586, -194720, -66660, 218886, -167158, 85231, -74980, -964, 62610, -113732, 47040, 44813, 221770, 46884, -154842, 27490, 260151, -49569, -156076]
9349a56076o0683Q6886d1458B8037p130g8640C99103b26173Q7103j570j19186
9338b59826a19701C9502J32558b96102B68394D3256c96720d3308q226j16797k5930
9327a94261H2557C6372a57919k0843h906j64993g0077A112a49965j61788B89753
9315E2458h1525B61326a82431E2368b65826f3649b8313A72828c0456m40058B08282
9303a79140j4046j44259e9081C1025a31924M980c6334m1302j30857O3339J6593
9292a28561o9399f9835q1739k61966a85849L2632A00523A03f0255B46956c19569
9280b8202j87136P6178A71077a84874h5707D68864B13228a463k80411G1065L156
9269G4221h6121n4599d7508q6824L7793a8437j33877j46402Q3965l01605A13182
$$ y = [-156076, -216759, -129873, -41458, 28037, 20907, -78640, 399103, -226173, -139070, -140640, -259826, -119701, 39502, 172060, -296102, 268394, 43256, -396720, -43308, -51534, -168331, -194261, 82557, 36372, -157919, -178762, -8906, -173899, -70077, 1112, -149965, -311753, 289753, 52458, -81525, 261326, -182431, 52368, -265826, -63649, -28313, 172828, -30456, -470514, 208282, -179140, -193186, -337445, -59081, 31025, -131924, -126944, -36334, -77636, -208493, -145154, -128561, -197960, -69835, -151574, -413540, -185849, -153217, 100523, 103, -60255, 246956, -319569, -28202, -215338, -139160, 171077, -184874, -85707, 468864, 213228, -1463, -281874, 71065, 74221, -86121, -140720, -47508, -134332, -96539, -18437, -152314, -298716, -214751, -516356, 113182]
9257C0710a18896B0029a22080r4059R617h2034A11503c08636J38551j7757k8300
9246b16142h5161A31936b3006j96546c04j76664B48507J05875d0636r0610j65642
9235b96888B6455J1469E982c38847a40584j01775F7875a56015B67250p1479d6279
9223b42962B31713a10094K3224l23460i4046j30739D7727b85361P4411g6537k5723
9212a02260j84371l2653a49792c6587A4694F253K32922a9580B52185g4322d354
9200a00200d6480j41323B2396b74382a27001N4113B16171a3287H6231b3514o1935
9189h5449k07498A67197b15980k12080A69478C234c22565e9663B06631G572a84596
9177d6302j35075L7158a0481B73684b94728g893C7339h9622k11332a15763C7565
$$ y = [30710, -118896, 20029, -122080, -216139, -206522, -82034, 111503, -308636, -170085, -187842, -216142, -85161, 131936, -23006, -219552, -304, -176968, 248507, 354382, -40636, -131246, -296888, 26455, 37924, 5982, -338847, -140584, -242359, 67875, -156015, 267250, 195771, -46279, -242962, 231713, -110094, -86870, -410330, -94046, -224785, 47727, -285361, -210950, -76537, -102260, -286631, -319284, -149792, -36587, 14694, 6253, 239175, -19580, 252185, -74322, -4354, -100200, -46480, -187803, 22396, -274382, -127001, -72888, 216171, -13287, 86231, -23514, -85449, -292947, 167197, -215980, -428060, 169478, 3234, -322565, -59663, 206631, 7572, -184596, -46302, -181377, -144219, -10481, 273684, -294728, -7893, 37339, -89622, -300954, -115763, 37565]
9165a52925f0596k19006J24120c5246j0849C93137b6068A44737m1897R393e0089
9153a0673k2737H6578K7890g6905A2804d1302H9095f431r9594B15550a94571A82503
9140C7666J08747f8571j3623r8220E5837a57184o232m18562b5182k90932b329
9128a81266j33670a15007e6247I0465j7853J27842i1058A41605a71330A83736
9117a86733O6693O475k54078A43844b63881L3791A15058b85562O9184j79159c4749
9105a5268B88439b99581b6890p6048j33299f3631k18890R5840L3279f1854p4249
9094a36103o0095a0998A10974a32819e2153l24077a56457a4957E7209A9253Q1522
9083A00775J15618a45462c1838I359L7714G182c5829o4622j43116M9749G6749
$$ y = [-152925, -60596, -279602, -155482, -35246, -46095, 393137, -26068, 144737, 102840, 112233, -50089, -10673, -33410, 86578, 114468, -76905, 12804, -41302, 89095, -6431, -106025, 215550, -194571, 182503, 37666, 146413, -68571, -82194, -180414, 55837, -157184, -163416, -581978, -25182, -316114, -2329, -181266, -314936, -115007, -56247, 90465, 72612, 200454, -91058, 141605, -171330, 183736, -186733, -120040, -113565, -367643, 143844, -263881, -230090, 115058, -285562, -216378, -395537, -34749, -15268, 288439, -299581, -26890, -102938, -236237, -63631, -282521, -186681, -153402, -61854, -136103, -196198, -10998, 110974, -132819, -52153, -376230, -156457, -14957, 57209, 19253, 100775, 216393, -145462, -31838, 9359, 47073, 7182, -35829, -100451, -243567, -193818, 76749]
9071H6376a03713L1585B2881c49412a29512q1773D68065N6997g002k81601C8856
9059a18107l32523F1642e6481C03727a8752C7661J81703D0319J74895r8329c75360
9047e6000A91765i9744k21983E2336a73598B07581C9115c0787C26054I3691b20795
9035c8646n8375k19420m4750J59820B1632h4958B04957i9298j44519J04203C9064
9023g4525c0397A42020a54933k4366A96552b65660D4998b40566g4449D3122J10176
9012A53298k8849b57305L6987j68511A13673D0158b52555J11442a2868j32037
9002a44905k3114D2928N1750j2623g1573p8466H9307K19432a73124Q5309L193
8991h4622k550A91216n8973b54539B5048a18421l69675A15359g8146A46390d00601
$$ y = [86376, -103713, -72128, 22881, -349412, -129512, -211285, 468065, 525062, -7002, -288603, 38856, -118107, -450630, 61642, -56481, 303727, -18752, 37661, 219364, 40319, 215214, 116885, -375360, -56000, 191765, -99744, -321727, 52336, -173598, 207581, 39115, -30787, 326054, 93691, -220795, -38646, -97021, -316441, -361191, -201371, 21632, -84958, 204957, -99298, -243817, -139614, 39064, -74525, -30397, 142020, -154933, -179299, 196552, -265660, 44998, -240566, -74449, 43122, 153298, 124449, -257305, -220318, -388829, 113673, 40158, -252555, -141113, -12868, -144905, -168019, 42928, 94678, 82055, -71573, -150039, 89307, 308739, -173124, -87815, -84622, -87172, 191216, 132243, -254539, 25048, -118421, -488096, 115359, -78146, 146390, -400601]
8979B60684g7110k11409F6893a84446E767d74465b10640C87969b08556A51608
8968i6115a9027A260J33847f6901A87984d3057D4228J23317b2094q9861m544a0838
8955a0082k85808g0673j77945A1791J44955F1414b15260F0143m269b50469J9513
8944b30956e3313I3493a16918A56005a22489N7595m4983p0110e5833j4685K4974
8933d5544j02554o2139R2273c0440e910B68045a13527j43201B33035G821M84991
8922D92812J171745J377239A461371C21892j35780m1874h3758H1984g7440B21644
8911a75958f4835j41943Q5587k2455B12617D2569f2079J4132B960K1569a35205
8899B44514b0056j86415G4659F42d8821n8329p2128A15546q661e943F1269a58136
$$ y = [260684, -77110, -288519, 66893, -184446, 5767, -474465, -210640, 387969, -208556, 151608, -96115, -19027, 1260, 135107, -66901, 187984, -43057, 44228, 167545, -22094, -111955, -116499, -10838, -10082, -295890, -70673, -248618, 11791, 156746, 61414, -215260, 60143, 55874, -250469, -230956, -53313, 93493, -116918, 156005, -122489, -64894, -109877, -179987, -55833, -70518, -45544, -148098, -210237, -117964, -30440, -5910, 268045, -113527, -256728, 233035, 7821, 492812, 1664557, 3041796, 1461371, 321892, 186112, 144238, -83758, 81984, -77440, 221644, -175958, -64835, -206778, -121191, -143646, 212617, 42569, -62079, -47947, 2960, 24529, -135205, 244514, -20056, -206471, 74659, 642, -48821, -107150, -179278, 115546, 106885, -5943, 61269, -158136]
8886d47288a99997i2831A84133c70320C0721J70516f4809d321H6512a6514j63001
8875a79515A80328K65267i6213D2598b06763D6955J0954b34950K5055B33890d2703
8863a10073a5541A97755C0325L3878Q7389a4140k04789B27001c08209C38938c25546
$$ y = [-447288, -199997, -92831, 184133, -370320, 30721, 201237, -64809, -4321, 86512, -16514, -179515, 180328, 445595, -96213, 42598, -206763, 46955, 57909, -234950, -209895, 233890, -42703, -110073, -15541, 197755, 30325, 64203, 151592, -14140, -218929, 227001, -308209, 338938, -325546]
$$ [...]
##END NTUPLES=NMR SPECTRUM
##END=
