##TITLE=AC1712_14FALM0001_8743523_LyKpv0qBwT
##JCAMPDX= 6.0         $$ Bruker NMR JCAMP-DX V2.0
##DATA TYPE= NMR SPECTRUM
##DATA CLASS= NTUPLES
##ORIGIN= BRUKER
##OWNER= Administrator
$$ 1.72 TOPSPIN		Version 2.1
$$ 2015-08-11 17:04:59.820 -0700  Administrator@X
$$ Compression mode = diff/dup
##.OBSERVE FREQUENCY= 400.02188249412
##.OBSERVE NUCLEUS= ^1H
##.ACQUISITION MODE= SIMULTANEOUS (DQD)
##.ACQUISITION SCHEME= undefined
##.AVERAGES= 64
##.DIGITISER RES= 22
##SPECTROMETER/DATA SYSTEM= spect
##.PULSE SEQUENCE= noesygpps1d.comp
##.SOLVENT NAME= COFFEE_meoh
##.SHIFT REFERENCE= INTERNAL, COFFEE_meoh, 1, 14.96128
##AUDIT TRAIL= $$ (NUMBER, WHEN, WHO, WHERE, PROCESS, VERSION, WHAT)
$$ ##TITLE= Audit trail, TOPSPIN		Version 2.1
$$ ##JCAMPDX= 5.01
$$ ##ORIGIN= Bruker BioSpin GmbH
$$ ##OWNER= Administrator
$$ $$ E:\/data/COFFEE/nmr/AC1712_14FALM0001_8743523_LyKpv0qBwT/62/pdata/1/auditp.txt
$$ ##AUDIT TRAIL=  $$ (NUMBER, WHEN, WHO, WHERE, PROCESS, VERSION, WHAT)
(   1,<2015-08-11 17:04:54.414 -0700>,<Administrator>,<X>,<go>,<TOPSPIN 2.1>,
      <created by zg
	started at 2015-08-11 16:53:24.914 -0700,
	POWCHK enabled, PULCHK disabled,
       configuration hash MD5:
       21 0F 79 D6 B3 7B B4 F6 88 20 88 DB 03 48 BD 9F
       data hash MD5: 64K
       8B DE E2 2E 02 B9 2A 41 51 1D 35 22 96 58 1C 9F>)
(   2,<2015-08-11 17:04:57.757 -0700>,<Administrator>,<X>,<proc1d>,<TOPSPIN 2.1>,
      <Start of raw data processing
       efp LB = 0.3 FT_mod = 6 PKNL = 1 PHC0 = 0 PHC1 = 0 SI = 128K 
       data hash MD5: 128K
       0A E2 1F 34 69 99 7F C1 7E 1B F1 9D 3A 24 64 22>)
(   3,<2015-08-11 17:04:58.632 -0700>,<Administrator>,<X>,<proc1d>,<TOPSPIN 2.1>,
      <pk PHC0 = -89.76929 PHC1 = 0 
       data hash MD5: 128K
       3F 32 1B 61 67 68 01 F0 B7 1F 0C 0C 92 9F 9F 4D>)
(   4,<2015-08-11 17:04:59.007 -0700>,<Administrator>,<X>,<proc1d>,<TOPSPIN 2.1>,
      <abs ABSG = 1 
       data hash MD5: 128K
       15 76 21 18 D9 2D E7 E7 50 FC 8C 0E 53 2D D6 DB>)
(   5,<2015-08-11 17:04:59.117 -0700>,<Administrator>,<X>,<proc1d>,<TOPSPIN 2.1>,
      <abs ABSG = 2 
       data hash MD5: 128K
       AC 2C 67 52 BC 07 EA 87 A3 20 2F 57 B6 EA FE 1C>)
(   6,<2015-08-11 17:04:59.210 -0700>,<Administrator>,<X>,<proc1d>,<TOPSPIN 2.1>,
      <abs ABSG = 3 
       data hash MD5: 128K
       F2 71 89 36 4A 03 3E 7C 7C 4E 5D D9 3C 4A 3F 18>)
(   7,<2015-08-11 17:04:59.304 -0700>,<Administrator>,<X>,<proc1d>,<TOPSPIN 2.1>,
      <abs ABSG = 4 
       data hash MD5: 128K
       91 00 D6 5D C4 86 86 B8 86 AF A8 13 52 14 8A 6B>)
(   8,<2015-08-11 17:04:59.429 -0700>,<Administrator>,<X>,<proc1d>,<TOPSPIN 2.1>,
      <abs ABSG = 5 
       data hash MD5: 128K
       A4 44 83 F4 56 7C AC 64 D1 65 F6 85 C4 23 64 72>)
$$ ##END=
$$ 
$$ $$ hash MD5
$$ $$ 8D 1A 64 2E 8F 11 F7 95 D8 E7 A9 4F 90 A7 59 53
##$RELAX= 
##$RELAX= 
##$RELAX= 
##$RELAX= 
##$RELAX= 
##$RELAX= 
##$RELAX= 
##$RELAX= 
$$ Bruker specific parameters
$$ --------------------------
##$DU= <E:\>
##$EXPNO= 62
$$ [...]
##$TP07= 0
##$TPNAME0= <>
##$TPNAME1= <>
##$TPNAME2= <>
##$TPNAME3= <>
##$TPNAME4= <>
##$TPNAME5= <>
##$TPNAME6= <>
##$TPNAME7= <>
##$TPOAL= (0..7)
0.5 0.5 0.5 0.5 0.5 0.5 0.5 0.5
##$TPOFFS= (0..7)
0 0 0 0 0 0 0 0
##$TUNHIN= 0
##$TUNHOUT= 0
##$TUNXOUT= 0
##$USERA1= <user>
##$USERA2= <user>
##$USERA3= <user>
##$USERA4= <user>
##$USERA5= <user>
##$V9= 5
##$VALIST= <valist>
##$VCLIST= <CCCCCCCCCCCCCCC>
##$VD= 0
##$VDLIST= <DDDDDDDDDDDDDDD>
##$VPLIST= <PPPPPPPPPPPPPPP>
##$VTLIST= <TTTTTTTTTTTTTTT>
##$WBST= 2048
##$WBSW= 25
##$XGAIN= (0..3)
0 0 0 0
##$XL= 0
##$YL= 0
##$YMAX_a= 6709632
##$YMIN_a= -12122544
##$ZGOPTNS= <>
##$ZL1= 120
##$ZL2= 120
##$ZL3= 120
##$ZL4= 120
##$ABSF1= 14.96128
##$ABSF2= -5.596902
##$ABSG= 5
##$ABSL= 3
##$ALPHA= 0
##$AQORDER= 0
##$ASSFAC= 0
##$ASSFACI= 0
##$ASSFACX= 0
##$ASSWID= 0
##$AUNMP= <proc_prof1d_extract.lims>
##$AXLEFT= 0
##$AXNAME= <>
##$AXNUC= <1H>
##$AXRIGHT= 0
##$AXTYPE= 0
##$AXUNIT= <>
##$AZFE= 0.1
##$AZFW= 0.1
##$BCFW= 0
##$BC_mod= 0
##$BYTORDP= 0
##$COROFFS= 0
##$CY= 15
##$DATMOD= 1
##$DC= 0
##$DFILT= <>
##$DTYPP= 0
##$F1P= 0
##$F2P= 0
##$FCOR= 0.5
##$FTSIZE= 131072
##$FT_mod= 6
##$GAMMA= 0
##$GB= 0
##$INTBC= 1
##$INTSCL= 1
##$ISEN= 128
##$LB= 0.3
##$LEV0= 0
##$LPBIN= 0
##$MAXI= 10000
##$MC2= 0
##$MEAN= 0
##$ME_mod= 0
##$MI= 0
##$NCOEF= 0
##$NC_proc= -2
##$NLEV= 6
##$NOISF1= 0
##$NOISF2= 0
##$NSP= 0
##$NTH_PI= 0
##$NZP= 0
##$OFFSET= 14.96128
##$PC= 1
##$PHC0= -89.76929
##$PHC1= 0
##$PH_mod= 1
##$PKNL= yes
##$PPARMOD= 0
##$PPDIAG= 0
##$PPIPTYP= 0
##$PPMPNUM= 2147483647
##$PPRESOL= 1
##$PSCAL= 4
##$PSIGN= 0
##$PYNMP= <proc.py>
##$REVERSE= no
##$SF= 400.020009523015
##$SI= 131072
##$SIGF1= 0
##$SIGF2= 0
##$SINO= 400
##$SIOLD= 131072
##$SPECTYP= <>
##$SREGLST= <1H.CDCl3>
##$SSB= 0
##$STSI= 131072
##$STSR= 0
##$SW_p= 8223.68421052631
##$SYMM= 0
##$S_DEV= 0
##$TDeff= 65536
##$TDoff= 0
##$TI= <>
##$TILT= no
##$TM1= 0
##$TM2= 0
##$TOPLEV= 0
##$USERP1= <user>
##$USERP2= <user>
##$USERP3= <user>
##$USERP4= <user>
##$USERP5= <user>
##$WDW= 1
##$XDIM= 131072
##$YMAX_p= 399176625
##$YMIN_p= -10849
##$CURPLOT= <Network HP LaserJet P1505>
##$CURPRIN= <$Network HP LaserJet P1505>
##$DFORMAT= <normdp>
##$LAYOUT= <+/1D_H.xwp>
##$LFORMAT= <normlp>
##$PFORMAT= <normpl>
##$SURQMSG= 1
$$ End of Bruker specific parameters
$$ ---------------------------------
##NTUPLES= NMR SPECTRUM
##VAR_NAME=  FREQUENCY,     SPECTRUM/REAL,   SPECTRUM/IMAG
##SYMBOL=    X,             R,               I
##VAR_TYPE=  INDEPENDENT,   DEPENDENT,       DEPENDENT
##VAR_FORM=  AFFN,          ASDF,            ASDF
##VAR_DIM=   131072,        131072,          131072
##UNITS=     HZ,            ARBITRARY UNITS, ARBITRARY UNITS
##FACTOR=    0.0627417313425164, 1,          1
##FIRST=     8223.62146879497, 5543,         -59329
##LAST=      0,             6584,            -59039
##MIN=       0,             -10849,          0
##MAX=       8223.62146879497, 399176625,    0
$$ Real data points
##PAGE= N=1
##DATA TABLE= (X++(R..R)), XYDATA
$$ [...]
65209 132106 132353 132636 133261 133946 134045 133200 131767 130602 130377 131085 132214 133361 134532 135816 136997 137698 137852
65192 137852 137762 137618 137239 136435 135413 134514 133731 132837 131945 131596 132183 133536 135102 136282 136613 136076 135350 135348
65174 135348 136216 137175 137647 138132 139448 141412 142899 143195 142724 142354 142437 142713 142762 142334 141499 140745 140738 141762 143459
65155 143459 145188 146483 147119 147037 146536 146449 147779 150972 155580 160636 165308 169245 172530 175452 178274 181022
65139 181022 183479 185549 187648 190519 194463 198890 202837 205880 208307 210541 212703 214684 216284 217201
65125 217201 217273 216812 216333 215806 214555 212138 208953 205612 202052 197708 192395 186594 180968 175937 171647
65110 171647 168028 164826 161831 159035 156421 153769 150960 148353 146513 145610 145356 145458 145801 146187 146240 145668
65094 145668 144502 143036 141675 140734 140217 139877 139665 139909 140783 141837 142446 142609 142952 143966 145625 147662
65078 147662 149753 151507 152749 153849 155225 156485 156690 155741 154918 155527 157344 158922 159238 158577 157888 157753
65062 157753 158070 158320 157947 156692 154847 153143 152224 152146 152389 152331 151645 150310 148498 146603 145202 144631 144553
65045 144553 144234 143356 142294 141442 140614 139428 137978 136708 135735 134783 133754 132893 132281 131579 130539 129488
65029 129488 129001 129207 129699 130142 130785 132133 134153 136007 136849 136856 137121 138415 140317 141793 142391 142577 143096
65012 143096 144296 145977 147635 148947 150191 151944 154171 156006 156831 157228 158270 160099 161866 162946 163449
64997 163449 163519 162937 161763 160735 160627 161554 163206 165357 167791 170139 172150 173962 175804 177588 178952
64982 178952 179493 178863 177029 174678 173036 172881 173871 175026 175659 175598 174813 173268 171146 168889 166941 165453
64966 165453 164208 162823 161186 159707 158905 158724 158574 158151 157818 157964 158298 158097 156986 155238 153485 152369
64950 152369 152264 153041 154157 155186 156088 156855 157129 156569 155421 154375 153825 153544 153167 152745 152687 153231 154127 154901
64932 154901 155344 155598 155707 155381 154473 153483 153128 153436 153691 153333 152543 151833 151508 151673 152266 152848 152818 152249 152061
64913 152061 152960 154573 156177 157903 160586 164534 169184 174038 179309 185384 192099 198879 205363 211597
64899 211597 217694 223511 228647 232740 235768 237967 239375 239557 238036 234936 230955 226714 222381 217990
64885 217990 213813 210203 207225 204654 202314 200217 198337 196409 194179 191862 190184 189754 190430 191449 192162
64870 192162 192479 192590 192455 191704 189900 186868 182922 178856 175516 173252 171841 170944 170400 170012 169401 168315
64854 168315 166917 165522 164185 162747 161180 159669 158495 157998 158454 159660 160747 160740 159430 157527 155965
64839 155965 155176 154985 155013 155105 155466 156392 157855 159484 161027 162638 164518 166553 168614 171057 174435 178630
64823 178630 182730 186031 188930 192451 196904 201311 204306 205550 206092 207256 209251 211008 211328 209990 207642
64808 207642 204933 202136 199504 197442 196023 194624 192519 189827 187521 186383 186278 186604 187106 187767 188163
64793 188163 187611 186146 184763 184293 184451 184461 184266 184466 185224 185956 186244 186432 187087 188370 190180 192477 195116
64776 195116 197777 200494 203956 208839 214939 221338 227322 232778 237820 242529 247174 252323 258457 265496
64762 265496 272698 278993 283497 285988 286958 287059 286403 284439 280546 274717 267645 260266 253284 247033 241506
64747 241506 236347 230985 225142 219290 214307 210563 207614 205002 203052 202533 203737 206236 209357 212543
64733 212543 215458 218213 221390 225337 229550 233210 236250 239313 242734 246209 249444 252357 254501 255158
64719 255158 254315 252836 251244 249018 245525 240981 235955 230554 224774 219148 214275 210088 206196 202613
64705 202613 199449 196315 192880 189746 187865 187127 186406 185039 183525 182635 182555 183141 184332 185929 187511 188962
64689 188962 190757 193387 196770 200504 204445 208695 213145 217334 220808 223480 225577 227291 228540 229096
64675 229096 228851 227821 225967 223299 220181 217182 214508 211938 209485 207668 206828 206620 206590 206840 207616 208584
64659 208584 209235 209784 210958 212904 214973 216673 218261 220248 222798 225819 229222 232899 236733 240752 245039
64644 245039 249385 253326 256557 259038 260687 261344 261179 260875 261178 262337 263945 265313 265991 266012 265484 263969
64628 263969 260762 255954 250676 245824 241078 235855 230772 227134 225135 223586 221624 219680 218323 217034
64614 217034 214838 211687 208558 206379 205306 204877 204462 203638 202428 201209 200256 199522 198958 198868 199761 201932
64598 201932 205250 209281 213616 218231 223495 229649 236386 243208 250127 257601 265714 273790 281017 287151
64584 287151 292458 297135 300983 303547 304541 304166 303005 301515 299739 297591 295180 292571 289462 285440 280416
64569 280416 274553 268011 261171 254802 249408 244581 239541 234152 228852 223788 218840 214414 211329 209721
64555 209721 208833 208125 207840 208186 208698 208880 208906 209218 209922 210948 212335 213940 215300 216206 217033 218097 219075
64538 219075 219427 219012 217879 215905 213165 210391 208493 207708 207497 207133 206101 204226 201813 199534 197922
64523 197922 197077 196909 197302 197920 198336 198681 199710 201836 204483 206804 208703 210683 213078 215899 219088 222354
64507 222354 225045 226835 228351 230451 232914 234456 234126 232221 229735 227422 225551 224192 223392 223190 223595
64492 223595 224476 225463 226121 226283 226204 226463 227684 230103 233210 235921 237271 236905 234962 231803 228021 224393
64476 224393 221522 219566 218380 217697 217138 216449 215967 216450 218148 220335 222132 223487 224913 226538 227884
64461 227884 228475 228185 227076 225283 223105 220925 218965 217325 216162 215654 215904 217019 219080 221803 224397
64446 224397 226147 227131 228131 229888 232592 235949 239576 243494 248366 255017 263512 272979 282592 292469
64432 292469 303334 315692 329723 345697 363918 384394 407078 432554 462185 497589 540067
64421 540067 590254 647921 712202 782333 858015 938635 1022246 1105677 1185716 1260079 1327560
64410 1327560 1387763 1440588 1485499 1521127 1545651 1557442 1555283 1538553 1507891 1465436 1413762
64399 1413762 1354401 1287750 1214236 1135060 1052016 967381 884135 805583 734182 670794 615037
64388 615037 566037 522836 484682 451329 422904 399323 379965 363946 350433 338733 328382
64377 328382 319276 311453 304626 298175 291631 284956 278357 272085 266423 261476 256882 252063 246875 241787
64363 241787 237290 233414 230005 227175 225254 224380 224328 224718 225286 225959 226633 226939 226385 224806 222478 219630
64347 219630 216164 212118 208110 204874 202491 200535 198822 197541 196696 196035 195592 195723 196379 196878 196725 196304
64331 196304 196401 197261 198442 199467 200333 201434 203123 205378 207853 210278 212729 215325 217811 219672 220595
64316 220595 220523 219372 217110 214084 210803 207307 203184 198384 193600 189599 186513 184015 181843 179861 177927
64301 177927 176075 174673 174067 174145 174389 174310 173704 172742 172021 172342 174114 177021 180386 183726 186821 189482 191620
64284 191620 193461 195438 197860 200830 204341 208188 211853 214837 217139 219129 220864 221866 221833 221325 221332 222190
64268 222190 223268 223836 223882 223852 223872 223690 223230 222646 221704 219665 216195 212060 208433 205663 203138 200272 197149
64251 197149 194126 191272 188505 186003 184109 182896 182067 181411 181185 181921 183770 186172 188290 189740 190826
64236 190826 192084 193748 195621 197205 197976 197817 197274 197101 197477 197950 198172 198235 198128 197434 196016 194495 193530
64219 193530 192964 192320 191806 192080 193167 194383 195359 196416 197782 199176 200432 201956 204136 206693 208985
64204 208985 210709 212037 213301 214767 216560 218693 221274 224702 229303 234805 240486 245967 251454 257079
64190 257079 262346 266413 268671 268922 267325 264320 260307 255262 248929 241515 233845 226711 220392 214902
64176 214902 210236 206142 202116 198023 194422 191864 190117 188489 186763 185430 185020 185506 186367 187108 187740
64161 187740 188859 191025 193952 196529 197920 198470 199286 201008 203227 205011 205755 205540 204891 204294 203869 203422
64145 203422 202726 201674 200283 198729 197372 196497 196001 195550 195091 194952 195394 196289 197352 198399 199314 200026 200710
64128 200710 201780 203487 205691 208160 210872 213844 216861 219628 222121 224649 227593 231130 235091 239027
64114 239027 242498 245322 247535 249239 250697 252399 254674 257260 259594 261460 262988 264145 264758 265016 265316
64099 265316 265483 264820 263164 261218 259454 257344 254282 250692 247489 244756 241759 238168 234591 231798 229941
64084 229941 228655 227518 226311 225114 224243 223906 223965 224200 224669 225474 226336 226755 226606 226231 225954 225812 225792 225949
64066 225949 226250 226547 226865 227468 228514 229807 231085 232453 234411 237344 241001 244556 247372 249655 252195
64051 252195 255527 259656 264632 270756 277847 284748 290230 294224 297652 301112 304333 306928 308999 310704
64037 310704 311731 311674 310663 309227 307698 306100 304532 303293 302558 302181 301902 301598 301253 300750 299749 297715
64021 297715 294251 289657 285162 282177 281032 280573 279308 276825 273863 271174 268828 266659 264876 263869
64007 263869 263728 264263 265292 266633 268001 269214 270396 271772 273434 275516 278241 281483 284607 287203 289707
63992 289707 292728 296026 298882 301419 304805 309927 316471 323463 330183 336393 342243 348252 354921 362133
63978 362133 369360 376566 384354 393052 402319 411998 422696 435020 448753 463357 478825 495466 513261
63965 513261 532190 552983 576854 604469 635764 670896 710900 757230 810837 871911 940554
63954 940554 1017702 1105218 1204917 1317640 1443662 1583718 1738791 1908744 2091846 2285884
63944 2285884 2488912 2698488 2911135 3123328 3332301 3534901 3726188 3900271 4052397
63935 4052397 4179427 4278731 4347918 4385807 4392554 4368415 4313252 4227661 4113863 3975010 3814212
63924 3814212 3634872 3441546 3239702 3034443 2829589 2627799 2431158 2241568 2060798
63915 2060798 1890441 1731966 1586685 1455410 1338071 1233969 1142524 1063399 995652 937242
63905 937242 885936 840580 801058 767220 738308 713322 691385 671745 653896 637791 623649
63894 623649 611526 601275 592775 585856 580210 575841 573435 573768 576755 581627 588024 596453 607589 621650
63880 621650 638586 658496 681652 708282 738361 771423 806761 844137 884140 927426 973708
63869 973708 1021843 1070722 1119558 1167604 1214336 1259849 1304307 1346828 1385631 1419531 1448720
63858 1448720 1473813 1494637 1510241 1519645 1522292 1518165 1507778 1491767 1470339 1443325 1410808 1373280
63846 1373280 1331244 1285171 1235971 1184900 1132823 1080035 1026949 974419 923204 873711 826502
63835 826502 782371 741531 703300 667068 633099 601980 573770 548139 524877 503748 484231
63824 484231 465925 448797 432603 416627 400754 386335 375010 366708 359631 352230 344416 336773
63812 336773 329496 322531 316106 310494 305511 300693 295828 290995 286243 281580 277212 273461 270360 267515
63798 267515 264449 261020 257482 254225 251439 248938 246293 243246 240075 237381 235400 233701 231812 229987
63784 229987 228965 228887 229009 228695 228237 228226 228493 228283 227361 226320 225722 225496 225295 224963 224438 223564 222269 220678
63766 220678 218976 217405 216432 216482 217301 217979 217856 217161 216523 216217 216142 216320 217015 218396 220256 222084 223454
63749 223454 224434 225526 226986 228424 229437 230494 232498 235487 238413 240495 242114 244096 246727 249898
63735 249898 253654 258012 262671 267471 272744 278643 284508 289583 294136 299175 305212 311997 319293 327040
63721 327040 334661 340977 345176 347347 347869 346847 344479 341413 338189 334632 330295 325334 320478 316206
63707 316206 312380 308745 305432 302810 301082 300154 299772 299627 299503 299521 300191 302011 304943 308437 311968 315335
63691 315335 318385 320690 321767 321532 320396 318993 317920 317502 317588 317767 318061 319178 321702 325205 328678 331678
63675 331678 334512 337356 339987 342535 345727 349976 354773 359406 363731 367729 370771 372000 371240 368923
63661 368923 365352 360557 354799 348584 342211 335750 329467 323831 319077 315113 311835 309203 307000 304945
63647 304945 303048 301591 300746 300567 301238 302947 305539 308673 312297 316523 321108 325633 330282 335844 342655
63632 342655 350086 357438 364901 373189 382608 392988 404313 416886 430925 446455 463517 482064
63620 482064 501649 521738 542452 564614 588878 615100 642679 671024 699291 726040 749749
63609 749749 769603 785329 796327 801699 801432 797088 790884 784298 777788 771467 765462 759740 754105 748366
63595 748366 742142 734487 724216 710804 694756 677011 658296 639113 620027 601679 584664 569395
63583 569395 555917 543858 532881 523270 515717 510514 507364 506052 506730 509278 512933 517054 521931 528295
63569 528295 536268 545260 554778 564790 575366 586428 598014 610439 624083 639241 656259 675674
63557 675674 698161 724317 754254 787239 821886 856966 891752 925138 954563 976455 988126
63546 988126 989281 981838 968685 952646 936103 920923 908349 898861 892142 887376 883735 880651 877659
63533 877659 874117 869121 861539 850159 834172 813833 790501 765774 740583 715165 689576 663941
63521 663941 638483 613709 590484 569564 551073 534651 519945 506627 494228 482460 471634
63510 471634 462176 453766 445552 437343 429985 424208 419589 415139 410581 406572 403740 401944 400494 398789
63496 398789 396636 394221 391991 390515 390245 391245 393107 395248 397422 399911 403177 407421 412582 418517
63482 418517 424943 431341 437342 443125 448977 454445 458450 460508 461266 461396 460399 457167 451555 444703 437748
63467 437748 430882 423895 417040 410864 405528 400742 396227 391852 387598 383860 381604 381580 383382 385933 389027
63452 389027 393660 400494 408782 417561 427449 440291 457151 477449 500211 525369 553479 584650
63440 584650 618054 651969 683882 710952 731058 743605 749446 750312 748413 746048 745041 746487 751085
63427 751085 759476 772095 789000 810117 835313 863909 894341 924637 953075 978140 998244 1012079
63415 1012079 1019302 1020528 1016748 1009088 998978 988002 977316 967397 958359 950147 942236 933402 922111
63402 922111 907219 888358 865787 840090 812105 783027 754215 726616 700449 675684 652709
63391 652709 632156 614166 598334 584467 572878 563693 556448 550709 546635 544490 544034 544948 547484
63378 547484 552062 558441 565883 574083 583425 594453 607585 623161 641167 660889 681488 703026
63366 703026 726427 752323 780356 809722 839853 870312 900385 929034 955061 977242 994629
63355 994629 1006886 1014195 1016814 1015010 1009404 1001027 990943 980058 969224 959076 949561 939896 929139
63342 929139 916591 901660 883748 862537 838297 811918 784818 758679 734774 713417 694358
63331 694358 677749 664300 654428 647797 643892 642453 642696 642376 638296 628080 611456 590041 566267
63318 566267 542508 520718 502216 487346 475330 464793 454807 445514 437662 431638 427076 423249 419536
63305 419536 415544 411078 406202 401236 396636 392799 389817 387328 384804 382127 379613 377356 374951 372244
63291 372244 369934 368784 368430 367629 365669 362914 359978 357020 354024 351094 348232 345314 342587 340662 339675
63276 339675 338932 337795 336583 336104 336548 337215 337282 336553 335553 335076 335508 336499 337407 338051 338684 339277 339373 338917
63258 338917 338690 339489 341224 343241 345238 347356 349598 351771 353979 356619 359736 362763 365172 367222 369835
63243 369835 373797 379194 385629 392841 400946 410054 419958 430439 441723 454212 467801 481879 496172
63230 496172 511178 527530 545185 563459 581636 599420 617063 635197 654238 673793 692966
63219 692966 711432 729812 748745 768025 787042 805583 823556 840263 854713 866646 876457 883977
63207 883977 887932 887021 881081 870827 856789 838979 817501 793076 766917 740338 714524 690392
63195 690392 668437 648676 630882 614958 601131 589840 581456 576097 573653 573848 576265 580371 585715
63182 585715 592211 600178 609909 621120 632975 644832 656858 669681 683509 697913 712504 727414
63170 727414 742836 758413 773380 787116 799309 809826 818718 826066 831328 833074 830052 822540 812083
63157 812083 799795 785456 768414 748742 727129 704163 680300 656313 633253 611904 592545
63146 592545 575207 559900 546584 535086 525156 516615 509505 504028 500207 497613 495586 493686 491724
63133 491724 489473 486751 483811 481233 479219 477331 475145 472844 470907 469433 468081 466574 465027 463912
63119 463912 463844 465208 467747 470549 472654 473679 473883 473798 473872 474273 474816 475185 475275 475233 475168 475042 474882 474855 475004
63100 475004 475145 475178 475281 475647 476210 476807 477481 478513 480264 482924 486175 489123 490933 491722 492517 494144 496401
63083 496401 498482 499911 500797 501454 502113 502911 503905 505150 506882 509445 512873 516735 520635 524758 529690
63068 529690 535784 542889 550662 558995 568110 578335 589816 602543 616635 632478 650310 669883
63056 669883 690814 713250 737827 764976 794571 826289 859985 895707 933650 974056 1016766
63045 1016766 1060828 1104967 1148589 1192053 1236046 1281054 1327294 1374481 1421659 1467908 1513343
63034 1513343 1558740 1604068 1648220 1690406 1730818 1769235 1803707 1831376 1850207 1859413 1858796 1848470
63022 1848470 1828837 1800183 1762579 1716800 1664975 1609612 1552242 1493576 1434570 1376543 1320540
63011 1320540 1267509 1218913 1176222 1139714 1108604 1082501 1061932 1047259 1037864 1032822 1031808 1034902
62999 1034902 1041907 1052257 1065446 1081220 1099465 1120013 1142524 1166593 1192029 1218842 1246726
62988 1246726 1274819 1302365 1329438 1356462 1383098 1408138 1430475 1449612 1465044 1475639 1479972
62977 1479972 1477063 1466677 1449207 1425462 1396352 1362582 1324642 1283009 1238226 1190957 1142276
62966 1142276 1093744 1046782 1001897 958839 917492 878286 841793 808338 778018 750654 725636
62955 725636 702300 680590 660928 643209 626438 609748 593454 578572 565403 553114 540830
62944 540830 528724 517677 508066 499354 490989 483341 477269 472853 469039 464767 460100 455972 453052 451239
62930 451239 450115 449445 449118 448842 448167 446821 444989 443112 441307 439121 436095 432516 429147 426173 422870
62915 422870 418597 413738 409278 405764 403071 400945 399343 398271 397633 397290 397150 397288 397997 399473 401357
62900 401357 402937 403957 404857 405982 407001 407458 407525 407795 408649 410184 412427 415207 418053 420589 422798 424650
62884 424650 425906 426607 427251 428014 428328 427735 426661 425684 424565 422781 420564 418562 416801 414911 413060 411744
62868 411744 410859 409932 409123 408927 409019 408516 407424 406704 406654 406402 405367 404206 403778 404098 404897 406386 408675 411073
62850 411073 412687 413353 413435 413109 412488 412144 412839 414709 417057 418946 419898 420196 420620 421663 423007 424017 424634
62833 424634 425248 425760 425552 424630 424070 424755 426191 427160 427284 427470 428907 431985 436139 440484 444594 448690
62817 448690 452997 457160 460668 463700 466949 470543 473798 476246 478321 480666 483292 485849 488331 491042
62803 491042 494157 497693 501762 506539 512087 518415 525564 533552 542517 553013 565839 581385 599352
62790 599352 619175 640479 663171 687482 714066 743694 776760 813350 853762 898490 947711
62779 947711 1001212 1058801 1120223 1184665 1251034 1318762 1387587 1456316 1522576 1584115 1639619
62768 1639619 1687903 1727194 1755918 1773614 1780355 1775747 1759258 1731302 1693313 1646860 1593134 1533253
62756 1533253 1468654 1401220 1333099 1266131 1201235 1138679 1079006 1023163 971526 923464 878324
62745 878324 836300 797828 762702 730434 701086 675038 652185 631994 614104 598307 584121
62734 584121 570994 558910 548296 539388 532061 526085 521161 516853 512911 509569 507160 505657 504981 505535
62720 505535 507908 512102 517433 523170 528999 534987 541426 548640 556752 565795 576206 588817 604044
62707 604044 621451 640506 661399 684665 710442 738708 769967 804901 843477 885125 929743
62696 929743 977726 1028843 1081825 1135501 1189698 1244375 1298046 1347708 1390500 1425192 1451887
62685 1451887 1470558 1480324 1480185 1470000 1450404 1422103 1385853 1342992 1295313 1244232 1190618 1135639
62673 1135639 1081114 1028633 978725 931319 886629 845163 807156 772470 740894 712251 686266
62662 686266 662558 640684 620292 601541 585238 571875 560466 549108 537066 525586 516239 509123
62650 509123 503209 497711 492403 487213 482305 478231 475240 472767 470182 467697 465872 464593 463263 461645
62636 461645 459869 457933 455947 454511 454056 454060 453673 452910 452477 452714 453438 454524 455814 456754 457070 457505 458905
62619 458905 460861 462403 463766 466106 469438 472392 474393 476627 480155 484379 488323 492457 498049 505323
62605 505323 513383 521785 531215 542542 555892 570853 587262 605581 626487 650019 675273 701311
62593 701311 728330 757428 789108 822579 856635 890551 923653 954598 981756 1004093 1021224
62582 1021224 1032795 1038230 1037069 1029306 1015506 996781 974425 949321 921765 891943 860325 827563
62570 827563 794388 761772 730743 701737 674445 648671 625005 604225 586279 570328 555647
62559 555647 542045 529491 517871 507244 497916 490000 483081 476577 470321 464635 459848 455940 452682
62546 452682 449930 447616 445532 443349 440953 438611 436707 435384 434526 434004 433797 433980 434683 436054 438198
62531 438198 441225 445232 450081 455256 460334 465618 471912 479570 488252 497857 509098 522691 538391
62518 538391 555432 573646 593581 615696 639992 666323 694490 724032 754378 785238 816497
62507 816497 847776 878348 907315 933527 955705 973199 986464 996222 1002402 1004532 1002920 998648
62495 998648 992467 984571 975426 965898 956368 946644 937074 928878 922853 918279 913635 907881 900677 891879
62481 891879 881436 869463 855919 840328 822078 800805 776477 749633 721748 694700 669341
62470 669341 644926 620397 595860 572447 551145 532316 516017 502078 489929 478947 469066 460660
62458 460660 453829 448126 443014 438250 433769 429516 425529 422060 419446 417904 417368 417496 417888 418388 419134
62443 419134 420250 421590 422861 423922 424881 425971 427339 428837 429980 430235 429467 427976 426136 424105 421882
62428 421882 419453 416816 414041 411356 409049 407189 405567 403971 402424 401094 400065 399229 398399 397557 396985
62413 396985 396972 397306 397295 396495 395239 394237 393842 394029 394854 396465 398695 401118 403572 406315 409559 413188
62397 413188 417032 421119 425535 430132 434555 438537 442264 446371 451408 457266 463436 469878 477062 484949
62383 484949 492605 499418 506109 513794 522388 530805 538514 546023 553936 562453 571862 582621 594712 607626
62369 607626 621247 636228 653405 673470 697182 725115 757001 792024 829948 871270 916185
62358 916185 964159 1014663 1067273 1120640 1172300 1220059 1262889 1300087 1330465 1353106 1368217
62347 1368217 1376468 1378096 1373293 1362862 1347628 1327619 1302591 1272954 1239416 1202183 1161460 1118562
62335 1118562 1075546 1033724 993220 953994 916498 881133 847742 816001 786000 758128 732484
62324 732484 708557 685539 663137 642097 623581 607769 593412 579115 564784 551410 539717
62313 539717 529500 520177 511525 503831 497643 493316 490623 488933 487879 487534 487732 487739 487101 486464 486876 488443
62297 488443 490342 492055 493901 496270 498998 501729 504327 506648 508349 509342 510136 511305 512808 514251 515699
62282 515699 517757 520749 524269 527817 531622 536398 542400 549214 556560 564822 574499 585557 597715 611154
62268 611154 626490 644277 664945 689000 716740 747893 782110 819758 861617 907725 957091
62257 957091 1008563 1061320 1114370 1166249 1215555 1261215 1301820 1335258 1359566 1374034 1379208 1376088
62245 1376088 1365536 1348237 1324860 1296250 1263310 1226448 1185389 1140089 1091851 1042920 994904
62234 994904 948125 902559 858672 817151 778616 743908 713954 688854 667606 649083 632772
62223 632772 618348 605322 593549 583375 574703 566586 558312 550327 543521 538203 534405 532465 532468 533580
62209 533580 534881 536579 539604 544253 550053 556856 565200 575493 587402 600198 613365 626896 641211
62196 641211 656695 673197 690214 707623 725666 743948 761144 776219 789430 801615 813043
62185 813043 823510 832902 840893 846616 849498 850109 849440 847701 844687 841044 838334 837955 840723 847277 858095
62170 858095 873113 892048 914965 941951 972420 1005388 1040126 1075715 1110111 1140601 1165351
62159 1165351 1183953 1196629 1203646 1205419 1202357 1194482 1181795 1164970 1144925 1121730 1094731 1063878
62147 1063878 1030294 995379 960052 925023 891149 859170 829517 802550 778606 757676 739400
62136 739400 723460 709705 697960 688078 680103 674028 669519 666217 664159 663577 664595 667504 672919 681105
62122 681105 691587 704035 718973 736744 756193 775427 793560 810519 825383 836326 842551 845122
62110 845122 845487 844171 841316 837491 833218 828281 822104 814449 805432 795335 784664 774037 763906
62097 763906 754934 748552 746291 748193 752643 758108 764483 772413 782085 793224 805739 819690 834853
62084 834853 850841 867506 884987 903526 923435 944969 968047 992249 1017173 1042636 1068600
62073 1068600 1095165 1122485 1150309 1177744 1203976 1229049 1253391 1276777 1298493 1318413 1337010
62062 1337010 1354157 1368738 1379628 1386339 1388492 1385572 1377669 1365829 1351189 1334194 1314952 1293776
62050 1293776 1270953 1246375 1219751 1190898 1159730 1126503 1092283 1058626 1026466 995644 965697
62039 965697 936642 908841 882601 858152 835593 814672 794951 776325 759012 743165 728981
62028 728981 716965 707274 698850 690133 680741 671593 663247 655083 646345 636955 626933 616159 605266
62015 605266 595713 588199 581853 575788 570700 568000 568004 569911 573104 577549 583177 589733 597106 605185 613485
62000 613485 621368 628366 633885 636998 637095 634531 630121 624251 616838 607829 597352 585712 573605 561938
61986 561938 551017 540301 529302 518227 507426 496940 487155 479126 473361 468811 464009 458832 454283
61973 454283 450875 448259 446294 445418 445793 446935 448423 450295 452579 455038 457665 460871 464883 469363 473950
61958 473950 478915 485016 492792 502182 512746 524172 536526 550079 565066 581759 600600 621887
61946 621887 645389 670757 698326 728928 762697 798644 835711 873678 912623 952003 990807
61935 990807 1028260 1063943 1097614 1129336 1159316 1187099 1211341 1230942 1246017 1257134 1264065 1266116
61923 1266116 1263415 1257035 1247950 1236722 1224298 1212306 1202289 1195138 1191451 1191942 1197197 1207360 1222239
61910 1222239 1241529 1264712 1290865 1318523 1345636 1369855 1389213 1402669 1409956 1411037 1405875 1394503
61898 1394503 1377095 1354022 1326031 1294253 1259894 1224039 1187740 1151948 1117116 1083221 1050357
61887 1050357 1019043 989717 962251 936219 911332 887402 864314 842271 821702 802647 784695
61876 784695 767822 752726 739923 729074 719768 712446 707913 706302 707174 710317 715745 723269 732804
61863 732804 744922 760354 779074 800626 825241 853936 887443 925698 968403 1015456 1066651
61852 1066651 1121464 1179306 1239609 1301535 1363918 1425481 1484894 1540670 1591304 1635394 1671504
61841 1671504 1698283 1715196 1722829 1722040 1713316 1697691 1677910 1657608 1639297 1623980 1612704 1607310
61829 1607310 1609087 1617467 1630738 1647587 1667187 1687972 1707037 1721056 1727592 1725451 1714072 1692995
61817 1692995 1662136 1622317 1575156 1522403 1465694 1406843 1347714 1289501 1232640 1177691 1125759
61806 1125759 1077626 1033081 991739 954028 920625 891297 865112 841559 820614 801907 784733
61795 784733 768943 754968 742784 731570 720548 709530 698512 687439 676662 666941 658636 651277
61783 651277 644280 637706 631989 627310 623489 620213 617098 613740 610006 606216 602895 600332 598307 596229
61769 596229 593761 591414 590128 589979 589754 588434 586700 586139 587081 588184 588221 587325 586065 584195 581096 577033
61753 577033 573208 570618 569217 568116 566320 563396 559765 556325 553640 551522 549513 547606 546271 545853
61739 545853 546152 546741 547585 549158 551796 555085 558144 560546 562629 564882 567402 570161 573352 577121 581225
61724 581225 585367 589599 594091 598747 603450 608366 613555 618554 622794 626239 629099 631144 631853 631095 629092
61709 629092 625906 621503 616198 610409 604060 596878 589236 582049 575833 570395 565404 560661 555851 550784
61695 550784 545994 542404 540219 538768 537530 536607 535999 535190 533915 532709 532143 531955 531401 530183 528542 526685
61679 526685 524514 521881 518862 515841 513433 512107 511712 511466 510547 508681 506215 503813 501922 500341 498388
61664 498388 495754 493010 490943 489609 488564 487814 487865 488789 489929 490759 491535 492844 494949 497777 501118 504609
61648 504609 507932 511280 515324 520425 526183 531933 537403 542646 547522 551467 553656 553349 550322 545122
61634 545122 538821 532461 526698 521716 517197 512537 507483 502545 498548 495918 494613 494427 494921 495386 495559
61619 495559 496203 498280 501550 504638 506515 507269 507385 506960 505760 503383 499208 492834 484816 476370 468050
61604 468050 459305 449621 439464 429708 420697 412413 405158 399453 395360 392269 389374 386209 382836 379604
61590 379604 376649 373718 370637 367713 365249 362896 360068 356847 353817 351076 348279 345679 344141 343770
61576 343770 343489 342528 341522 341336 341536 340942 339353 337728 336729 335958 334789 333319 332192 331879 332456 333721
61560 333721 335209 336209 336214 335490 334964 335250 335851 335710 334576 333435 333417 334670 336568 338526 340122 340965 341191
61543 341191 341849 343976 347288 350484 352861 354961 357618 361063 365093 369361 373242 376044 377693 378819
61529 378819 379908 380755 380856 379911 377825 374693 370951 367141 363429 359689 356014 352680 349695 346977 344947
61514 344947 344234 344733 345546 345920 345606 344410 342295 340071 339016 339374 339949 339545 338164 336527 335221 334666
61498 334666 335111 336076 336433 335599 334252 333459 333626 334608 336242 338246 340084 341411 342354 343098 343641 344145 344993
61481 344993 346294 347847 349729 352164 354632 355993 355911 355291 354882 354309 353090 351699 350833 350375 349887 349558
61465 349558 349776 350258 350469 350576 351179 352365 353725 355074 356515 357946 359084 359847 360331 360652 361157 362403
61449 362403 364500 366841 368909 370928 373335 376102 379127 382797 387581 393401 399899 406911 414252 421519
61435 421519 428695 436401 444845 452981 459492 464314 468464 472637 476687 480324 483564 486458 488934 490949
61421 490949 492473 493350 493439 492711 491012 488120 484283 480322 476787 473375 469506 465078 460295 455217 449964
61406 449964 445046 441050 438169 436190 434599 432687 430168 427766 426398 425677 424238 421855 420022 419837 420518
61391 420518 420883 421148 422096 423431 424326 424943 426054 427585 428827 429728 430837 432205 433507 434961 437034 439421
61375 439421 441460 443327 445718 448478 450751 452458 454459 457187 460273 463654 467913 473162 478560 483466
61361 483466 488415 494553 502525 512137 522716 533705 545171 557662 571290 585354 599322 613611
61349 613611 628575 643187 655747 665739 673985 681104 686909 691354 694982 697978 699584 698862 695621 690439
61335 690439 684217 677690 670943 663418 654879 646129 638226 631278 624740 618679 613825 610357 607500 604478
61321 604478 601262 598255 595790 593953 592487 590991 589601 589180 590341 592764 596103 600966 607988 616358
61307 616358 624446 631678 638610 645183 650166 652513 652258 649878 645733 640404 634728 629196 623945 619393
61293 619393 616082 613843 611923 610068 608743 608181 608042 608083 608404 608998 609835 611400 614306 618323 622626 627043
61277 627043 632215 638455 645402 652832 660837 669077 676848 684196 692098 701339 712042 724332 738512
61264 738512 754353 771173 788807 807522 826754 844891 860566 873206 882191 886724 887012 884432
61252 884432 879865 872764 862426 849325 834568 818858 802672 786736 771618 757376 744109 732354
61240 732354 722447 713993 706308 698986 691807 684726 678163 672737 668499 665127 662890 662449 663476 664470 664400
61225 664400 663664 663008 662416 661588 660630 659623 658295 656805 656144 657130 659466 662265 664927 667097 668480 669299
61209 669299 670398 672468 675696 680433 687400 696770 707787 719868 733355 748661 765411 783062 801707
61196 801707 821533 841995 862097 881055 898169 912623 924050 932954 940076 945693 949812 952510
61184 952510 953759 953450 951880 949555 946235 940916 933183 923837 913754 902906 891038 878477 865575
61171 865575 852054 837608 822612 807529 792154 776099 759624 743362 727651 712681 698899
61160 698899 686817 676707 668788 663194 659462 656748 654895 654657 656463 659634 663196 666632 669200 669382
61146 669382 665879 658827 649492 639228 629140 620135 612628 606584 602206 600111 600503 602816 606536 611787
61132 611787 618792 627476 637881 650178 663940 678338 693418 710156 728779 748052 766880 785581
61120 785581 804900 824795 844942 865388 885777 904858 921660 936425 949659 961235 971159 980157
61108 980157 988452 994933 998525 999451 998140 993939 986065 974909 961093 944198 923830 901202 878186
61095 878186 855410 832670 810580 790258 771732 754122 737257 721796 707939 695184 683225
61084 683225 672030 661294 650839 641346 633714 627934 623350 619627 616610 613880 611428 610153 610599 611866
61070 611866 612888 614142 616777 620684 624813 628966 633835 639612 645957 653032 661329 670720 680926 692541
61056 692541 706290 721636 737382 753295 769880 787104 804871 824319 846900 872238 898378
61045 898378 924115 949742 975684 1001809 1028120 1054828 1081824 1109056 1137128 1166469 1196571
61034 1196571 1227266 1259941 1295973 1334778 1375120 1417463 1463057 1511528 1561652 1613846 1669522
61023 1669522 1728698 1790952 1858344 1934479 2020952 2117685 2226651 2351947 2495983 2659012
61013 2659012 2843089 3053542 3296704 3580525 3918286 4327379 4823068 5417694 6127151
61004 6127151 6973170 7978584 9167875 10573360 12225721 14124846 16227709 18479096
60996 18479096 20840818 23251612 25541137 27421328 28626997 29101780 29043068 28756988 28475698
60987 28475698 28304121 28280417 28401664 28555628 28474857 27837881 26465210 24430653 21994523
60978 21994523 19445028 16990112 14744281 12757661 11038401 9567960 8318812 7265909
60970 7265909 6385286 5650522 5036309 4522755 4093263 3731138 3421290 3153152 2919401
60961 2919401 2713433 2530102 2367118 2223261 2095959 1982093 1879987 1788907 1707478 1634108
60951 1634108 1568225 1509454 1455914 1404607 1353484 1302384 1252270 1204353 1159667 1118670 1081034
60940 1081034 1046020 1012933 981257 950904 922505 896929 874377 854412 836783 821446 807740
60929 807740 794524 781366 768798 757138 746036 735452 726056 718078 710604 702634 694085 685290 676412
60916 676412 668057 661536 657545 655069 652501 649457 646731 644827 643434 642119 640752 639229 637390 635245
60902 635245 632842 629970 626406 622393 618534 615225 612420 609866 607411 605263 604061 604410 606169 608608
60888 608608 611462 615378 620990 628021 635779 644139 653478 663877 674935 686166 697159 707601 717695
60875 717695 728331 740285 753384 766938 780811 795467 811193 827997 846266 866690 889307
60864 889307 913267 937767 962641 987803 1012858 1037679 1062738 1088137 1112711 1134860 1154122
60853 1154122 1171232 1186625 1199498 1208558 1213109 1213082 1208348 1198530 1183458 1163529 1139518 1112181 1082090
60840 1082090 1049774 1015885 981159 946292 912000 879126 848389 819836 792790 766618 741468
60829 741468 718003 696572 677001 659090 642847 628166 614764 602614 592085 583407 576287 570247
60817 570247 565044 560488 556187 551869 547804 544571 542488 541456 541169 541234 541330 541533 542282 543669 545020 545566
60801 545566 545396 545277 545672 546367 546969 547268 547084 546294 545140 544095 543287 542291 540572 537901 534400 530544 527081
60784 527081 524483 522344 519612 515544 510214 504210 498215 492790 487950 482880 476621 469271 462057 455983
60770 455983 450872 445934 440860 435990 431803 428591 426393 424958 423892 423025 422401 421839 420926 419646 418612
60755 418612 418362 418827 419776 421370 423765 426522 429062 431596 435020 439750 445059 449727 452995 454774 455272
60740 455272 454860 454217 454167 454989 455983 456097 455111 453926 453445 453442 452908 451272 448828 446021 442876 439266 435351
60723 435351 431492 427963 424815 421833 418570 414676 410164 405192 399751 393929 388294 383464 379337 375276
60709 375276 371102 367340 364387 362023 359890 357923 356144 354568 353456 353062 352971 352332 351029 349958 349724
60694 349724 349751 349220 348341 348046 348764 350136 351694 353276 354839 356325 357704 359003 360428 362536 365920 370572
60678 370572 375880 381381 387040 392668 397718 402035 406223 410832 415656 420238 424529 428582 432168 435294
60664 435294 438534 442207 445689 448197 449830 451168 452314 453234 454612 457289 460894 464020 465857 466830 467485
60649 467485 467589 466669 464772 462230 459065 455009 449925 443973 437539 431123 425139 419682 414553 409492 404374
60634 404374 399368 395030 391982 390298 389356 388415 387058 385043 382298 379429 377634 377495 378246 378803 379125 379890
60618 379890 381154 382210 382621 382561 382118 381088 379703 378852 379214 380511 381859 382527 382309 381564 381011 381158 381796
60601 381796 382265 382206 381760 381152 380523 380154 380373 381169 382226 383474 385253 387892 391354 395272 399053 401967
60585 401967 403539 403917 403620 402941 401873 400536 399330 398644 398672 399472 400978 403013 405513 408635 412427 416661
60569 416661 421300 426891 434009 442478 451593 460985 470788 481032 491354 501256 510233 517713 523298 526989
60555 526989 528831 528563 526144 522419 518623 515351 512561 510433 509421 509508 510236 511642 514451 519184 525769
60540 525769 534200 544870 557895 572745 588869 606056 623792 640828 655920 668600 678758 685835
60528 685835 688984 687847 682866 675071 665857 656705 648654 641997 636555 632001 627871 623695 619527 616087
60514 616087 614013 613144 612869 613024 614130 616802 621199 627061 634051 641992 650893 660880 672269 685791
60500 685791 702576 723614 749147 778714 811756 848038 887577 930353 975897 1022778 1068582
60489 1068582 1110833 1147970 1179001 1202304 1215495 1216821 1206243 1184836 1153612 1113494 1066261
60478 1066261 1014902 962759 912379 865028 821052 780523 743614 710507 681182 655455 633117
60467 633117 613813 596892 581638 567678 555046 543870 534139 525644 517886 510247 502624 495740 490321
60454 490321 486050 481850 477267 472910 469355 466198 462680 458797 455314 452882 451513 450785 450209 449483 448651
60439 448651 447982 447555 447122 446522 446032 446041 446478 446839 446760 446369 446019 445859 445760 445628 445713 446448 447932 449681 451086
60420 451086 452020 452759 453363 453509 453078 452574 452710 453678 455022 456157 456832 457146 457285 457332 457265 457071 456859 456840 457225
60401 457225 458067 459134 459995 460434 460842 461971 464129 466797 469210 471182 473181 475777 479208 483304 487474
60386 487474 490857 492803 493405 493464 493928 495314 497442 499579 501070 502006 503128 504934 507175 509406 511653
60371 511653 514137 516628 518624 520067 521465 523280 525473 527577 528983 529399 529300 529670 530979 532706 534340
60356 534340 536420 539930 544932 550663 556858 564066 572487 581411 590179 598951 607937 616360 622862 626750
60342 626750 628387 628395 626885 623546 618249 611413 603798 596039 588466 581329 574895 569240 564185 559679 555933
60327 555933 552990 550466 548100 546163 544883 543793 542237 540292 538556 537179 535801 534368 533303 532899
60313 532899 533176 534415 537157 541549 547267 554157 562389 571940 582577 594410 607761 622377 637488
60300 637488 652839 668786 684959 699528 710395 716620 718235 715281 707751 696230 681946 666127
60288 666127 649559 632643 615690 599278 584413 572030 562147 553810 546039 538598 531765 525756 520630
60275 520630 516411 513088 510651 509218 508817 509002 509075 508782 508434 508276 508175 508061 508183 508707 509490 510427 511555
60258 511555 512580 512803 511865 510207 508474 506823 505125 503550 502554 502400 502862 503283 502989 501958 501113 501536
60242 501536 503317 505562 507523 509146 510447 511154 511336 511803 513334 515840 518665 521406 524076 526787 529624
60227 529624 532600 535430 537584 538800 539386 539898 540794 542423 544930 547981 550913 553360 555414 557209 558834
60212 558834 560711 563376 566623 569458 571212 572235 573218 574394 575701 577073 578112 578021 576469 574200 572345
60197 572345 571399 571185 571335 571353 570655 569111 567327 565978 565089 564232 563111 561628 559776 557881 556607 556302
60181 556302 556618 557107 557788 558762 559687 560172 560398 560891 561903 563429 565570 568376 571437 574047 575735 576453
60165 576453 576404 575902 575217 574414 573519 572874 572928 573649 574607 575736 577409 579567 581519 582958 584529 586876 589746
60148 589746 592617 595692 599601 604436 609641 614561 618736 622042 625036 628700 633308 637936 641572 644254
60134 644254 646567 648538 649826 650601 651392 652161 652273 651316 649334 646343 642230 637197 631800 626488 621445
60119 621445 616812 612714 609068 605630 602131 598252 593752 588882 584401 580882 578230 576076 574237 572600
60105 572600 571045 569843 569619 570520 571891 573214 574824 577239 580355 583943 588349 593901 599996 605624 610569
60090 610569 615424 620604 625975 631219 635972 639817 642739 645276 647651 649142 649071 648001 646975 645746 642808
60075 642808 637318 630136 622733 615811 609280 603034 597278 592275 587995 583964 579547 574531 569326 564470
60061 564470 560145 556280 552733 549267 545822 543050 541851 541991 541929 540626 538820 537790 537633 537722 538187 539653
60045 539653 541818 543601 544638 545492 546279 546158 544410 541183 536964 532094 526975 521999 517044 511656 505842
60030 505842 500092 494547 488868 483057 477681 473083 468954 464928 461027 457343 453832 450648 448156 446399
60016 446399 444942 443479 442226 441546 441474 441763 442223 442955 444406 446923 450050 452543 453533 453502 453690 454839 456861
59999 456861 459334 461693 463316 464151 465044 466772 468965 470731 472078 473770 475896 477541 478028 477707 477380
59984 477380 477584 478490 479811 480772 480867 480637 481048 482127 482952 483027 482821 482802 482742 482283 481529 480830 480459 480708 481782
59965 481782 483480 485403 487492 489857 492270 494455 496720 499468 502148 503659 503916 504040 504729 505372 505198
59950 505198 504444 503806 503342 502544 501084 499018 496566 494031 491720 489671 487696 485817 484401 483764 483849 484246
59934 484246 484359 483780 482858 482591 483426 484525 484868 484673 484881 485597 486155 486599 487818 489968 491960 492988 493631
59917 493631 494953 497327 500639 504939 510285 516482 523344 530763 538216 544793 550025 554170 557458 559650
59903 559650 560639 560890 560958 561045 561244 561616 561866 561582 561073 561294 562650 564468 565911 566810 567387 567908 568967 571317
59885 571317 574903 578623 581527 583734 585779 587619 588805 589171 588843 587876 586254 584010 581164 577874 574763
59870 574763 572586 571411 570565 569532 568377 567201 565853 564374 563132 562314 561878 562094 563415 565669 568153
59855 568153 570784 574334 579264 585248 592196 600782 611319 622955 634665 646259 657657 667891 675763
59842 675763 681066 684382 686050 686155 685317 684696 685111 686531 688220 688934 687185 681862 672847 661007 647731
59827 647731 634394 621816 610042 598896 588701 580030 572791 566201 559766 553749 548545 544229 540796
59814 540796 538180 535872 533275 530663 529012 528629 528726 528601 528445 528574 528696 528410 527667 526358 524199 521517
59798 521517 519335 518116 517183 515885 514532 513613 512899 512061 511411 511252 511191 510868 510699 511048 511244 510376 508584
59781 508584 506743 505281 504180 503700 504139 505062 505648 505732 505856 506404 507333 508639 510464 512756 515275 517904
59765 517904 520620 523309 525862 528224 530196 531537 532484 533663 535244 536707 537733 538685 539839 540859 541569
59750 541569 542514 544119 545932 547439 549052 551501 554699 557961 560938 563551 565362 565889 565402 564750 564551
59735 564551 564996 566165 567884 569528 570553 571054 571384 571512 571234 570742 570475 570588 570923 571177 570867 569566 567537
59718 567537 565699 564654 564317 564718 566334 569100 571972 574284 576779 580395 584577 587806 589522 590673 592553
59703 592553 595706 599724 603490 605958 607229 608500 610521 612601 613655 613534 612650 611069 608845 606660 605081
59688 605081 603645 601610 599238 597341 595921 594255 592091 589798 587471 584793 581630 578011 573707 568635
59674 568635 563463 559006 555217 551499 547796 544542 541767 539097 536486 534183 532146 530259 528935 528679
59660 528679 529184 529603 529619 529576 529796 530495 532040 534420 536607 537369 536625 535251 533704 531709 529194 526586 524095
59643 524095 521472 518624 515890 513659 512224 511901 512723 514118 515381 516307 516913 516946 516239 515148 513945 512207
59627 512207 509580 506744 504694 503417 502155 500684 499337 498003 496176 493942 491987 490623 489619 488922
59613 488922 488697 488752 488755 488956 489877 491387 492846 494023 495081 495893 496286 496687 497562 498375 498239 497512 497585 498968
59595 498968 500685 501824 502703 504131 506309 508790 510941 512241 512725 513276 514912 517639 520465 522396 522900
59580 522900 521714 518931 515224 511284 507132 502566 497926 493651 489460 484906 480396 476660 473490 470187
59566 470187 467064 465239 464904 464984 464690 464316 464297 464590 465245 466593 468568 470643 472710 475251 478490 482149
59550 482149 486147 490764 496064 501948 508754 517030 526724 537479 549534 563317 578285 593364 608454
59537 608454 624025 638885 649801 654120 652102 646360 639957 635257 633407 634058 636046 638712 642056 645700
59523 645700 648753 650920 652727 654231 654404 652248 647752 641408 633547 624521 614748 604279 593051 581792
59509 581792 571814 563585 556324 549303 542708 536871 531550 526474 521866 517890 514226 510645 507495 505149
59495 505149 503454 501996 500553 499136 497965 497410 497492 497593 497210 496724 496716 496858 496460 495891 496326 498148 500701
59478 500701 503552 506830 510270 513244 515902 519114 522999 526690 529768 532724 535740 538322 540589 543666
59464 543666 548253 553836 559781 566168 573095 580220 587503 595415 603940 612308 620091 627571 634695 640701
59450 640701 645174 648409 650403 650563 648744 645377 640311 632828 623265 613256 603881 594879 586196 578820
59436 578820 573363 569251 566161 564820 565487 566967 568264 570034 573472 578815 585913 595012 605879 617265
59422 617265 628403 640167 653801 669424 686639 705359 724971 743962 761570 778474 794223
59411 794223 805180 807033 799084 784716 768226 752563 739446 729689 723090 719166 718087 719945 723043
59398 723043 723765 718405 705149 685052 661669 639026 619163 601888 586964 575214 566890 560539
59386 560539 554861 550547 548830 549147 549847 550441 551456 552661 553304 553905 556014 560013 564639 568889 573053
59371 573053 577585 582218 586690 591431 596953 603125 609431 615626 622023 629278 637672 646381 653949 659979
59357 659979 665825 673090 681966 691713 702096 713438 725742 738757 752578 767234 781879 795258
59345 795258 806857 816914 825522 832399 837221 839466 838203 832836 823948 812897 800832 788483 776286
59332 776286 764057 751065 737168 723402 710746 698940 687320 676225 666578 658567 651728 645952
59320 645952 641431 637935 635010 632591 630628 628540 625980 623710 622764 623096 624000 625487 628149 631964 636316
59305 636316 641074 646663 653242 660723 669485 680145 692711 706742 722058 738328 754026 766632
59293 766632 773860 774213 767032 753189 735503 717245 700000 683726 668658 655988 646582 640071 635612
59280 635612 632890 632097 633483 637107 642645 649385 656703 664448 672576 680681 688250 695129 701327 706660
59266 706660 710950 714157 715978 715811 713514 709680 704769 698700 691702 684708 678233 671653 664335 656704
59252 656704 649485 642744 636499 631321 627394 623969 620874 619581 621351 625159 628931 632208 636049 640859
59238 640859 645988 651174 656687 662083 666233 668717 669980 670185 669057 666710 663446 658859 652370 644588
59224 644588 636988 630304 624319 619061 614943 611764 608759 605722 603131 601267 600204 600411 602166 604535
59210 604535 606104 606718 607391 608632 609999 611179 612375 613655 614946 616525 618399 619525 618853 616975 615461
59195 615461 614797 614265 613636 613469 613820 614193 614778 616233 618192 619537 620323 621834 624481 627185 629284 631501
59179 631501 634469 637706 640722 643905 647673 651858 656571 662580 670087 678089 685591 692661 699732 706670
59165 706670 713094 718968 724308 728849 732360 734787 735902 735330 733078 729474 724604 718482 711645 704806
59151 704806 697968 690659 682959 675447 668264 661110 654044 647312 640565 633297 625933 619409 613834 608730
59137 608730 604380 601550 599850 597894 595291 593231 592778 593849 596128 599735 604567 610080 616130 623131
59123 623131 631217 640182 650312 662138 675294 688826 702792 718383 736286 756009 776853 798348
59111 798348 819694 840128 859934 879719 898669 915091 928755 940956 951946 960171 964589 965942
59099 965942 964997 961380 955237 948426 942679 937724 932351 926350 920264 914211 908057 902085 896490 890757
59085 890757 884258 876853 868382 858311 846546 833890 821143 808420 795817 783917 773069 762902
59073 762902 753091 743904 735540 727663 720004 712754 706006 699517 693271 687510 682036 676377 670805 666172
59059 666172 662523 658934 654998 651349 648388 645679 643021 640964 639737 638782 637908 637871 639184 641223 643065
59044 643065 644460 645574 646619 647993 650024 652411 654810 657883 662652 668840 675235 681695 689276 698309
59030 698309 707992 718260 730357 745061 761869 780253 800019 819974 838166 854066 868634 881500
59018 881500 890244 893606 893439 892108 889758 885693 880751 876504 873324 870972 870086 871441 874542 878360 882765
59003 882765 887987 893391 897960 901297 903244 903422 902062 900268 898353 894880 888421 879278 868471 856198
58989 856198 842506 828362 814650 801021 787131 774175 763784 756072 750014 745127 741525 739024
58977 739024 737440 737324 739290 743056 747943 753671 759838 765536 770516 775894 782665 790239 797474 804296
58963 804296 811219 818096 824496 830549 836227 840436 842004 841015 838228 833815 827629 820047 811573 802262
58949 802262 792328 782549 773290 764140 755391 748700 745162 743726 742720 741842 741343 740348 737552 732842 726787
58934 726787 719241 709944 699872 690547 682392 674957 668189 662176 656196 649396 642158 635726 630811 627385
58920 627385 625258 623904 622333 620190 618420 618092 619265 621727 625743 631068 636352 640781 645349 651336
58906 651336 658546 666333 675228 685982 697963 710123 722728 736476 750671 764005 776630 789739
58894 789739 803573 817445 831381 846137 861856 878062 894619 911329 926888 939570 948696 954335
58882 954335 956109 953621 947560 939020 928065 914183 897763 879944 861487 843019 825810 810975
58870 810975 798263 786813 776641 768282 761525 755653 750353 745244 739226 731546 722943 714531 706278
58857 706278 697705 689200 681272 673413 665110 657142 650362 644085 637250 630314 624300 618779 612622 606065
58843 606065 600157 594753 588968 583160 578614 575561 573192 571273 570084 569170 567859 566696 566759 567928 569275
58828 569275 570643 572221 573253 573004 572435 573027 574381 574903 574433 574185 574437 574276 573514 572910 572573 571884 570888
58811 570888 570106 569245 567725 566128 565366 564879 563548 561923 561461 561928 561748 560729 560184 560366 560003 558543 556775
58794 556775 555028 552768 550222 548550 548147 548533 549924 553030 557204 560791 563530 566772 571094 575547 579535
58779 579535 583635 588247 593073 598125 603636 608806 612278 613843 614077 612547 608374 602469 597040 592745
58765 592745 588404 583676 579768 577122 574633 571834 569846 569439 569888 570491 571558 573245 574879 576105 577485
58750 577485 579550 582389 586197 590983 595893 600311 605357 612632 621737 630898 639732 649362 659987 670663
58736 670663 681508 693768 707368 720648 732842 744681 756185 766004 773322 778339 780597 779157
58724 779157 774905 770404 766885 763484 759886 757336 756400 756041 755709 756091 756945 756411 753468 749125 744362 738859
58708 738859 732551 726258 719791 711422 700304 687585 674242 659735 643784 627612 612329 597790
58696 597790 584010 572045 562497 554599 547550 541281 535365 528908 522114 516247 511539 506984 502609 499885
58682 499885 499227 499159 498659 498324 498670 499445 501285 505659 512332 519183 525438 532759 542139 552143 561478 571006
58666 571006 581785 593214 604485 615824 626817 635404 640008 641063 639350 634717 627562 619666 612188
58653 612188 604563 596511 589314 583937 579688 575808 572587 569933 566787 563042 560042 558242 556438 554248
58639 554248 553008 553020 552363 549755 546304 543037 539189 534509 530782 529230 528684 528118 528749 531673 535626 539153
58623 539153 542941 547991 553509 558698 564748 572771 581462 588978 595467 601707 606856 609741 610950 611607
58609 611607 611416 609816 607606 605552 602770 598362 593287 588846 584783 580585 577077 574906 572992 570422
58595 570422 568377 568335 569847 571914 575046 580047 586245 592848 600581 610092 620180 629483 638485 647991
58581 647991 657125 664715 671208 677304 682192 685124 687318 690462 694714 699930 707238 717474 729630 742773
58567 742773 757939 776186 796456 817341 839213 862467 885365 905996 924855 943208 960319
58556 960319 974552 985815 994761 1000983 1004063 1004952 1004127 1000010 991406 979896 967557 954000 938008
58543 938008 920332 902319 883481 863195 843199 825526 809331 792677 776214 762199 751024
58532 751024 741603 734080 729178 725753 722020 718573 717450 718819 721115 723819 727525 731868 735907 740048
58518 740048 745210 750700 755110 758608 762059 764664 764759 762329 758568 753698 747336 740177 733237 726238 718691
58503 718691 711497 705499 699664 692864 686192 681255 677469 673426 669631 667383 666174 664811 664026 665389
58489 665389 668636 672562 677555 684764 693775 703493 714229 726547 739211 750727 761762 773613 785442
58476 785442 795323 802639 807143 807437 803053 796416 789921 782706 773174 762896 754677 748327 741803 735214
58462 735214 730209 726608 723170 720733 721164 723988 727232 730692 735188 739577 741782 741899 741284 739587 735789
58447 735789 730965 726810 722707 717520 712958 711576 712661 713679 714582 717042 720688 723978 727708 733709
58433 733709 741062 747528 753796 762311 772796 782973 792874 804342 816946 828441 838620 848631
58421 848631 857209 861788 862812 862794 861714 857556 850815 844085 837538 829138 819049 809599 801153 792231
58407 792231 783467 777226 773462 770133 767424 767391 769735 772182 774750 779352 785409 790169 793102 795748 797691
58392 797691 797163 795186 794474 794550 792655 789170 787309 787687 788139 788726 791715 796572 800148 802190 805629 811112
58376 811112 816271 820740 826758 834286 840617 845464 851526 859379 866636 872751 879834 888196 895841 902753
58362 902753 910884 919628 926275 931105 936899 943254 946824 947542 949046 952442 955135 956421 958632 962199
58348 962199 965239 968721 976300 988199 1000852 1013297 1028142 1045608 1062555 1078217 1094888 1112151
58336 1112151 1126539 1137698 1148601 1158930 1164845 1166306 1167793 1170557 1171095 1168771 1167844 1170065 1172118
58323 1172118 1172485 1174124 1178257 1182159 1185250 1190833 1199676 1208368 1216019 1226016 1239245 1252360 1264609
58310 1264609 1279352 1296857 1312822 1326169 1340962 1358422 1374569 1388138 1403089 1420524 1435862
58299 1435862 1446999 1457757 1470259 1481483 1490354 1500631 1513753 1526345 1537626 1551454 1568297
58288 1568297 1583367 1595638 1610274 1629149 1647705 1664381 1684029 1708324 1732041 1752806 1775356
58277 1775356 1802081 1828743 1853860 1882817 1918052 1954628 1990201 2029793 2075888 2123547 2170320
58266 2170320 2221097 2278144 2336303 2393134 2453296 2517653 2578863 2633515 2687784 2745380 2801178
58255 2801178 2852748 2906453 2965726 3025287 3083647 3148949 3225202 3305231 3384633 3469815 3564504
58244 3564504 3661875 3758587 3862938 3980091 4102940 4226895 4359525 4505842 4658556 4813198
58234 4813198 4978181 5159356 5349893 5546326 5758694 5993318 6242100 6500904 6781267
58225 6781267 7091300 7423200 7773122 8154299 8576118 9030222 9512833 10040066 10624988
58216 10624988 11261768 11950091 12711814 13564699 14504820 15535748 16688970 17994108 19458545
58207 19458545 21101692 22979283 25148535 27645224 30527503 33908472 37916748 42671280
58199 42671280 48335747 55150258 63363058 73183560 84856766 98728447 115185060 134602046
58191 134602046 157375314 183781814 213561031 245714593 278951001 312165902 343929771
58184 343929771 371287737 389652466 394798416 385503505 364360830 336083590 305005348
58177 305005348 273749148 243441079 214549638 187482524 162721406 140669240 121467983
58170 121467983 104979912 90929134 79028496 68991407 60516661 53331187 47229610
58163 47229610 42045710 37616258 33800979 30507450 27664449 25191678 23018380 21105733
58155 21105733 19423772 17926222 16571041 15344956 14243672 13245436 12325933 11481843
58147 11481843 10717471 10022730 9384397 8804605 8288013 7823136 7394783 7003040 6652582
58138 6652582 6334914 6038153 5763253 5513867 5280448 5050742 4826896 4617120 4419423
58129 4419423 4228104 4047365 3883685 3732481 3586133 3447766 3323909 3210888 3101387
58120 3101387 2997472 2904542 2819128 2734899 2654303 2582362 2515167 2446182 2378002 2316502 2259134
58109 2259134 2200188 2142132 2090599 2043310 1994759 1946942 1904913 1866388 1826112 1786079 1751328
58098 1751328 1720003 1687555 1656441 1631527 1609671 1583890 1554582 1527167 1501852 1475080 1448099
58087 1448099 1424824 1403671 1380146 1355104 1332155 1309515 1282624 1252395 1222942 1193657 1161462
58076 1161462 1128498 1099637 1074419 1049001 1023955 1002707 984266 964879 945096 928207 913526
58065 913526 898107 883120 871707 862415 851546 840108 831666 825162 816693 806750 798950 793001 785489
58052 785489 776340 768162 760507 750971 740631 732321 724898 715282 704723 696852 690842 682712 672325
58039 672325 663004 655266 647009 638983 634001 631279 627302 621746 617080 613017 606939 599203 592565 586848
58025 586848 579485 570800 563585 558024 552089 546331 543084 541559 538857 535279 533529 533243 531546 528572
58011 528572 527245 527841 527816 526832 526922 527868 527383 525819 525848 527460 528045 527370 527718 529080 528989 527362 526832 527931
57993 527931 528446 527953 528625 531055 533307 534511 535495 535733 533617 529926 527192 525498 522620 518220 514003
57978 514003 509928 504303 497554 491862 487132 481351 474763 469511 465313 459856 453568 449488 448112 446769
57964 446769 444579 443592 444332 444563 443481 443121 444611 446739 449087 452800 457413 460574 461955 463955 467745
57949 467745 472036 476510 482793 491044 499020 505630 512286 519933 527927 536568 547408 560129 572201
57936 572201 582501 592269 601938 610208 616861 623122 628451 630343 628197 624121 619033 611313 600371 588230
57922 588230 576280 563534 549360 535069 521507 507824 493840 481051 470206 460352 451148 443555
57910 443555 437442 431208 424619 419401 416236 413842 411778 411319 412736 414582 416583 420478 426895 434055
57896 434055 440545 446822 453149 458724 463694 469347 475401 479794 481978 483661 485462 485776 483874 481160
57882 481160 478245 473770 467349 460759 454824 448003 439481 430940 423745 417027 410013 403632 398273 392566
57868 392566 386061 380672 377820 376490 375604 375876 377685 379563 380619 382203 385376 388918 391663 394666 399033
57853 399033 403521 406306 407595 408649 409579 409701 408831 406899 403627 399579 396073 393184 389583 385189 381878
57838 381878 380540 379657 378024 376730 376989 378159 379480 381814 385989 391157 396365 402026 408406 414404 419329
57823 419329 424126 429333 433608 435865 437221 439199 441539 443360 444896 446532 447539 447319 446496 445344 442572
57808 442572 437116 429782 421848 413486 404828 397005 390646 384805 378706 373124 368754 364789 360491 356609
57794 356609 353870 351632 349500 348657 349987 352331 354233 356095 359019 362805 366653 370681 375326 380332
57780 380332 385585 391707 398673 405184 410507 415420 420229 423642 424958 425546 426526 426740 424825 421606 418527
57765 418527 415188 410529 405168 400419 395962 390528 384151 377979 372552 367767 363795 360565 357116 352788
57751 352788 348247 344201 340130 335541 331339 328600 327031 325797 324717 323515 321306 318140 315625 314624
57737 314624 313801 311914 309918 309053 308419 306484 303713 301680 300576 299539 298500 297906 297517 297143 297570 299154
57721 299154 300606 300849 300914 302208 304086 305015 305042 305097 304939 303868 302496 301796 301292 300191 299334 299845 300757 300285
57703 300285 298802 298274 299282 300757 302143 303588 304398 303582 301796 300700 300448 299587 297264 293864 289856
57688 289856 285738 282699 281493 281055 280083 279531 281481 285996 291270 296841 304482 315734 330553 348649
57674 348649 370373 395947 425508 460312 502429 552689 609838 671747 736316 800990 861909
57663 861909 913108 946220 952962 930440 884026 823568 757202 689819 625618 568684 520718 480552
57651 480552 446547 417913 393711 372629 354274 339210 327384 317815 309868 303429 297801 291975
57639 291975 286086 281201 277646 274867 272826 271971 271869 271410 270402 269546 268864 267675 266074 264872 264084 263019
57623 263019 261806 261196 260856 259618 257531 255964 255439 255030 254184 253433 252961 252077 250555 249042 247738 246127
57607 246127 244446 243909 244934 246417 247252 247425 247226 246634 245892 245532 245449 244972 244056 243316 242718 241468 239424
57590 239424 237365 235601 233466 230513 227160 223947 221109 218969 217691 216607 214841 212561 210574 208939
57576 208939 207244 205925 205775 206297 206170 205298 204714 204449 203335 201167 199283 198575 198489 198339 198085 197505 196274
57559 196274 195229 195830 197850 199328 199356 199201 199994 201104 201674 202166 203236 204420 205030 205265 205506 205554 205388
57542 205388 205704 206898 208410 209690 210948 212391 213705 214782 215948 217019 217263 216776 216711 217580 218418 218230
57526 218230 217191 215898 214570 213523 213323 213857 214309 214531 215325 216914 218403 219238 219880 220468 220247 219147
57510 219147 218565 219589 221530 223084 223905 224257 224178 223867 223917 224317 224189 223149 221929 220972 219585 217326 215052
57493 215052 213668 212799 211729 210682 210224 210195 210127 209961 209572 208430 206537 204834 203939 203314 202420 201745 201823 202193
57475 202193 202240 202250 202682 203192 203325 203413 203937 204663 205292 206291 208149 210372 212033 212900 213379 213837 214489 215366 215922
57456 215922 215360 213827 212545 212384 212987 213607 213870 213453 212141 210670 210353 211358 212485 213090 213825 214933
57440 214933 215345 214506 213645 214094 215477 216651 217368 217928 218252 218447 219236 220773 221990 222147 221984 222319 222645
57423 222645 222258 221633 221377 220965 219832 218726 218552 218791 218489 217888 217686 217558 216891 216155 216015 215887 214976 214021
57405 214021 214361 215847 217213 217965 218377 218251 217417 216966 218171 220422 221869 221890 221406 221008 220531 220336 221271
57388 221271 223162 224802 225678 226417 227431 228395 229173 230033 230778 230849 230467 230612 231748 233488 235482 237627 239483
57371 239483 240593 241361 242581 244097 245017 245190 245334 245686 245697 245239 245006 245440 246221 247038 248017 249230 250507
57354 250507 251862 253382 254711 255391 255632 255946 256137 255580 254458 253811 254243 255388 256678 257878 258851 259543
57338 259543 260259 261309 262475 263378 264151 265015 265519 265016 263755 262648 262165 262160 262539 263280 264086 264801 265857 267455
57320 267455 268748 268787 267914 267206 266939 266714 266714 267517 268845 269749 269978 270007 269808 268785 266937 265009 263491 262526
57302 262526 262607 264149 266399 268037 268955 270227 272234 274065 275001 275436 275982 276640 277158 277441 277428 277314 277849
57285 277849 279583 281913 283777 285093 286565 288289 289811 291366 293746 296919 300040 302869 305861 308770
57271 308770 310589 311131 311399 312054 312767 313365 314374 316037 317930 319955 322563 325675 328483 330708 332974
57256 332974 335576 337947 339688 341072 342198 342790 343197 344447 346878 349725 352408 355091 357701 359677 361173
57241 361173 363259 366294 369263 371311 372920 374928 377474 380570 384615 389560 394456 398512 401897 404974
57227 404974 407623 409816 411970 414252 416441 418864 422339 426709 430626 433451 436222 440005 444428 448668
57213 448668 452768 456993 460905 464160 467433 471564 476476 481746 487514 493889 500280 506284 512512 519588
57199 519588 526937 533631 539825 546351 553376 560492 567752 575568 583832 592008 599956 607965 616151 624428
57185 624428 632750 640789 647834 653773 659887 667904 678373 690535 703514 717073 731426 746944 763921
57172 763921 782208 801248 820852 841666 864466 889264 915420 942357 969824 997749 1026207
57161 1026207 1055271 1084693 1114004 1143030 1171901 1200497 1228543 1256429 1285196 1315416 1346765
57150 1346765 1378938 1412173 1446357 1480529 1514038 1547563 1582219 1618162 1654784 1691922 1730127
57139 1730127 1769951 1811597 1855096 1900356 1947356 1996854 2050771 2111187 2178630 2251348 2326193
57128 2326193 2400320 2472497 2543179 2613388 2683594 2753830 2824650 2897615 2974970 3059161 3152351
57117 3152351 3255613 3368538 3490130 3620246 3760046 3911561 4077470 4261061 4465611
57108 4465611 4693845 4948664 5234563 5558319 5928943 6357574 6857145 7442064 8129369
57099 8129369 8941103 9904897 11051756 12414265 14026872 15924717 18138780 20691450
57091 20691450 23595966 26856268 30464045 34396944 38620915 43091786 47754122 52545464
57083 52545464 57404826 62261526 66989161 71359205 75054479 77754883 79236670 79419825
57075 79419825 78355810 76190429 73125157 69377894 65148792 60605666 55889736 51125002
57067 51125002 46420225 41867747 37543990 33508658 29801598 26442212 23433179 20764077
57059 20764077 18413440 16352832 14552846 12986005 11625611 10445312 9420925 8530773
57051 8530773 7753831 7069727 6461419 5916287 5424317 4977077 4568821 4196458 3857461
57042 3857461 3548972 3269061 3016939 2791129 2588769 2407220 2245063 2101155 1974057
57033 1974057 1862855 1767449 1687700 1623260 1574377 1541908 1526397 1527492 1543527 1570922 1605235
57022 1605235 1643798 1684965 1721884 1738901 1719005 1656423 1560074 1445029 1323523 1203711 1091702
57011 1091702 991036 901804 822696 753200 692839 639999 593122 552012 516833 486996 462081
57000 462081 442584 428560 418518 410746 404805 400773 398091 396222 395737 397751 402689 410194 419604 430125
56986 430125 441280 453501 467436 482339 496003 506376 512191 512005 504275 489161 469053 446617
56974 446617 423189 399444 376425 355235 336599 321166 309330 300483 293504 288260 285644 286081 289293
56961 289293 295553 305506 318462 332662 347683 364623 382843 398220 405904 403767 392505 374013
56949 374013 350974 326697 303687 282742 264112 248581 236630 227658 221081 217411 217429 221177 228595
56936 228595 240256 256585 277070 300935 327769 356830 386457 414543 438496 454382 457766 446842
56924 446842 424122 394361 361595 328524 297159 268600 242857 219808 199784 182711 167686
56913 167686 154127 142395 132683 124340 116999 111181 107039 103649 100438 98078 97063 96575 95814 95250
56899 95250 95498 96101 96714 98432 102547 108741 115837 123765 133604 146162 161448 178929 197474 215682
56885 215682 233104 250271 266670 279553 285821 284503 276785 264695 250688 237372 226206 217010
56873 217010 209595 204986 204215 206952 212576 221599 234813 251948 272590 297656 328476 364862 405227
56860 405227 448067 492048 534940 573333 603040 619464 619092 602222 573640 539474 503887 469392
56848 469392 438676 414183 396546 385149 379853 380960 388183 401235 421017 448929 485472 530620
56836 530620 584637 646928 714708 784345 853125 917518 970068 1000699 1002462 975593 926404 863566
56824 863566 795173 727222 663374 606066 557456 518710 489087 467058 452228 445216 446057 454091
56812 454091 469366 492785 524514 563074 606171 651704 697655 741114 777159 798801 799577 777724
56800 777724 737631 686580 630621 573918 520235 472767 432680 399336 371957 350222 333779
56789 333779 322531 317070 317723 323521 333208 346703 364376 385435 408375 432398 456630 478102
56777 478102 492116 494943 485449 464737 435655 402352 368575 336037 305135 276686 251690 229919
56765 229919 210397 193192 179274 168687 160296 153278 147524 142595 137696 132725 128088 123534 118447
56752 118447 113195 108768 105117 101289 97281 94274 92762 91836 90683 89563 88886 88409 87803 87165 86630 86131
56736 86131 85686 85298 84687 83799 83339 83970 85248 86149 86356 86166 85605 84627 83751 83470 83496 83571 84334 86143 87810
56717 87810 88004 87321 87366 88310 89091 89561 90492 91700 92164 92054 92763 94686 96744 98259 99617 100730 100543
56700 100543 98563 95577 92551 90045 88736 89064 90198 90773 90782 91346 92653 93715 94246 95056 96382 97476
56684 97476 98177 99233 100660 101398 101097 100750 101074 101605 101860 102089 102446 102716 103161 104354 105904 106644 106330 105861
56666 105861 105722 105638 105827 106951 108623 109624 109993 111235 114044 117328 119944 121928 123617 125072 126740
56651 126740 129209 131978 133957 135380 137537 140461 142799 144309 146400 149567 152364 153725 154404 155153 155335
56636 155335 154422 153199 152331 151194 149173 146791 144618 142377 140040 138426 137837 137365 136343 135204 134213
56621 134213 132794 130823 129115 127860 126114 123665 121838 121473 121649 121366 121035 121306 121829 122209 122789 123508
56605 123508 123358 121970 120420 119543 118826 117849 117302 117594 117965 117985 118423 119570 120339 120165 120170 121135 121958 121589 120957
56586 120957 121383 122477 123180 123618 124263 124497 123780 123216 124198 126260 127905 128862 130019 131765 133881 136474
56570 136474 139683 142979 145958 149218 153327 157627 161280 164845 169620 175939 183202 191000 199058 206515
56556 206515 212374 216529 219683 222633 226025 230134 234351 237642 239900 241980 244056 245083 244417 242764
56542 242764 240940 238907 236649 234631 232687 229780 225673 221460 217719 213559 208385 203107 198679 194910
56528 194910 191616 189324 187734 185221 181150 177198 175056 174337 173973 174044 174679 174709 173176 170941 169148 167344
56512 167344 164704 161915 160146 159164 158070 156904 156056 155077 153549 152141 151481 151037 150413 150478 151836 153468
56496 153468 154383 155275 156940 158413 158487 157836 157761 157932 157280 156159 155743 156068 156407 156824 157708 158568 158856 159148
56478 159148 160088 161109 161634 162368 163810 164746 164012 162596 162066 162013 161087 159625 159115 159700 160229 160326 160670 161677
56460 161677 163353 165810 168559 170190 170207 170189 171638 173725 174751 174663 174435 174091 173257 172619 172990 173823 174326
56443 174326 174943 176063 176576 175646 174605 175058 176388 177276 178328 180773 183747 185451 186039 186900 187948 188192
56427 188192 188132 188935 189955 189692 188695 188839 190125 190790 190385 190244 190988 191802 192162 192276 191953 190884 189778 189521
56409 189521 189719 189756 190410 192468 194717 195560 195805 197491 200648 203591 205699 207468 208439 207649 205772 204496
56393 204496 204129 203893 203953 204957 206336 207341 208871 211856 214810 215726 215505 216568 218823 220071 219925 220190
56377 220190 221624 223260 224774 226543 227614 226551 224283 223233 223685 223823 223194 223151 223886 224029 223368 223130
56361 223130 223380 222927 221954 221966 222983 223520 223470 224299 226179 227672 228397 229353 230504 230755 230451 231153 232802 233772
56343 233772 233788 234108 234830 234847 234411 234892 236004 236237 235961 237035 239353 241032 242062 244359 247975 250719 251964
56326 251964 253399 255455 256474 256222 256824 259294 262204 264638 267335 270042 270904 269579 268092 267660 267449
56311 267449 267197 268072 270066 271451 271763 272560 274410 275956 276723 278036 280391 282702 284803 287754 291124
56296 291124 293050 293648 295240 298477 301463 303463 306118 310044 313527 315673 317744 320284 322070 322949 324657
56281 324657 327765 330798 333231 336256 339846 342373 343999 347052 352118 357192 361539 366782 373245 379055
56267 379055 384042 390623 399491 408304 416173 425533 437865 451410 464987 480277 498318 517418 536690
56254 536690 558184 583333 610591 638599 668414 700618 733510 766119 799707 834388 867659
56243 867659 898166 927385 955536 979544 997309 1010471 1020552 1025921 1025135 1019893 1011927 1000155
56231 1000155 983632 964405 944783 924465 902686 880397 858082 834307 808630 783140 759083
56220 759083 734946 709837 685572 663395 641966 620657 601466 585464 570793 556352 543933
56209 543933 534433 525662 516320 508400 503076 497986 491470 485796 483218 482342 481317 481092 482486 483482 482591
56194 482591 481648 482325 483125 482698 482729 484580 486511 487171 488368 491371 494074 494876 495825 498750 501922 503767
56178 503767 506184 510787 515485 518259 520782 524911 529218 532428 536572 543138 549832 554850 560617 569517
56164 569517 579677 588828 598590 610901 623873 635339 647010 661126 676492 691804 709170 730296
56152 730296 753043 775974 802485 836044 875176 917748 966323 1024540 1091924 1167204 1253143
56141 1253143 1352918 1464899 1585713 1714878 1851342 1988769 2119364 2239612 2348014 2441136
56131 2441136 2517134 2579960 2635108 2684142 2727424 2767590 2804869 2832918 2845174 2842273 2828421
56120 2828421 2804593 2770638 2729565 2683090 2626178 2552129 2460235 2353484 2233048 2101224 1965940
56109 1965940 1835672 1712861 1597828 1494970 1408536 1336108 1272992 1219572 1177860 1144672
56099 1144672 1115289 1090389 1072483 1059007 1045990 1035002 1029264 1026378 1022182 1018275 1018289 1020189 1019889
56086 1019889 1019122 1021927 1026674 1029417 1031907 1038260 1046761 1053077 1058607 1067658 1079338 1090211 1101814
56073 1101814 1117427 1134569 1148978 1162720 1180009 1198396 1212778 1224751 1239065 1254218 1265639
56062 1265639 1274858 1286172 1297583 1304622 1309957 1319390 1331467 1340869 1348939 1360754 1374897 1386432
56050 1386432 1397012 1411618 1428286 1441628 1453466 1469246 1486992 1500851 1512509 1527961 1546116
56039 1546116 1562001 1577972 1599981 1625877 1649450 1672840 1702687 1737359 1770696 1804976 1846929
56028 1846929 1894173 1939100 1983056 2032874 2086728 2137688 2187972 2244918 2306009 2363162 2418666
56017 2418666 2481202 2549213 2614443 2678852 2751212 2829878 2906308 2982850 3069216 3163910 3257459
56006 3257459 3351378 3455036 3566440 3675866 3786066 3908508 4041917 4175611 4311808 4462614
55996 4462614 4626848 4792601 4961176 5145180 5344480 5548145 5758705 5989600 6240130
55987 6240130 6498793 6769792 7069276 7397321 7742091 8109591 8518947 8970085 9448188
55978 9448188 9958654 10524110 11148740 11821699 12554304 13375571 14292449 15295611 16403583
55969 16403583 17657729 19075859 20659536 22447138 24509216 26894627 29640890 32840044
55961 32840044 36635552 41160379 46552533 53030444 60868979 70298873 81523129 94836127
55953 94836127 110625870 129267800 151128227 176576723 205665582 237681378 271279310
55946 271279310 305155221 338081168 367737767 389800434 399176625 392934471 372224330
55939 372224330 341434940 305703440 269065681 234083311 202179753 173945392 149404883
55932 149404883 128333290 110439631 95359902 82665230 71967599 62967800 55392150
55925 55392150 48965402 43471531 38774077 34752870 31275162 28241904 25603567 23309387
55917 23309387 21286890 19484350 17886333 16471726 15197504 14036550 12991492 12057562
55909 12057562 11207612 10425415 9718959 9088689 8514376 7984109 7505643 7078481 6683671
55900 6683671 6311526 5972069 5668372 5385646 5115947 4868470 4646266 4436877 4234917
55891 4234917 4050760 3888171 3735583 3587910 3455398 3342539 3239047 3139957 3054316 2985662
55881 2985662 2923560 2862828 2812079 2774407 2737567 2691796 2640367 2584712 2516511 2433316 2345988
55870 2345988 2262028 2176400 2086516 2001075 1925827 1854855 1783982 1719253 1664405 1613094 1561095
55859 1561095 1513577 1473216 1433604 1391535 1353603 1323566 1294902 1262694 1231420 1204344 1176521
55848 1176521 1144936 1114602 1088050 1059538 1026049 993595 966368 939950 911271 884981 863776
55837 863776 842629 818865 798049 783597 770253 754107 739541 729894 720539 707698 695306 686764
55825 686764 678364 667099 656673 649656 641790 629997 618199 609530 600658 589395 579987 575187 570889
55812 570889 564263 559482 559676 560875 559733 559760 563998 568805 570759 572667 576855 579461 577301 573767 572091
55797 572091 569227 562043 553157 545073 535019 521295 508423 500151 493373 484692 477036 473910 472717
55784 472717 469484 464824 459822 451578 438518 425008 415303 407840 400334 395014 393599 392481 388391 383881
55770 383881 381981 380427 376315 371435 367778 362704 353872 344223 336938 330094 321331 312947 307344 302229
55756 302229 295493 290018 288319 287131 282783 277434 274557 272640 268906 264974 263252 261695 257684 253272
55742 253272 251226 249655 245867 241760 240067 238973 235836 232599 232086 232435 230642 228288 228239 228885 227117
55727 227117 224055 222442 221183 217795 213601 211335 210050 207342 204164 202640 201614 199036 196264 195453
55713 195453 195288 193810 192695 194079 195901 195194 193408 193712 195521 196435 197077 199163 201061 200107 197198 194631
55697 194631 191670 186808 182025 180050 179533 177543 174749 173545 173258 171891 170591 171642 173931 175022 175857
55682 175857 178824 183025 186114 188985 193893 199559 202863 204002 205369 206675 205699 202682 199650 196538
55668 196538 192094 187433 184619 182935 180454 177997 177688 179057 180467 182847 187955 194410 199432 203103
55654 203103 206951 209923 209893 207696 205446 202281 196005 187682 180335 174274 167851 161612 157405 154419 150342
55639 150342 145603 142407 140488 137868 134887 133457 133163 132069 130577 130545 131412 131082 129784 129249 128986 127291
55623 127291 125108 124904 126390 127157 126765 126476 125904 123873 121705 121646 122718 122045 119526 117321 115590 112824
55607 112824 109650 108073 107528 105819 103461 102901 103950 104174 103439 103728 104757 104171 102144 101428 102530 102994
55591 102994 101881 101007 101229 101336 101163 102144 104151 105229 105064 105518 107295 109272 111413 115073 120034 124387
55575 124387 127750 131646 136499 141241 145976 151969 158872 164949 170122 175754 181435 185057 186061 185543
55561 185543 183313 178183 171174 165009 160229 155012 148964 143743 139751 135596 131234 128329 127090 125858
55547 125858 124253 123632 124039 123801 122606 121939 122045 121440 119837 118621 118049 116886 115159 114374 114670 114594 113900
55530 113900 113659 113535 112057 109739 108687 108820 107734 104667 101352 98572 95256 91525 89283 88956 88788
55515 88788 88072 88015 88749 88700 87693 87491 88413 88554 87254 86213 86177 85618 83853 82465 82415 82512 81951 81646 81932
55496 81932 81555 80137 79088 79017 78683 77537 76784 76976 77050 76695 77112 78456 79076 78316 77615 77834 77999 77700
55478 77700 78180 79905 81421 81831 82153 83124 83877 83808 83600 83446 82338 80050 77786 76141 74523 73124 73171
55461 73171 74616 75887 76513 77587 79189 79969 79880 80549 82215 83073 82474 81990 82473 82900 83010 84069 85954
55444 85954 86513 85140 83975 84178 84035 82403 81054 81639 82974 83360 83235 83533 83676 83202 83335 84970 86948
55427 86948 88078 89059 90726 92234 92716 92989 94008 95250 96107 97193 98795 99768 99425 98916 99327 100019 100107
55410 100107 99864 99429 97894 95076 92528 91433 91029 90245 89240 88254 86680 84469 82738 81919 81031 79753
55394 79753 79319 80342 81729 82790 84305 86397 87566 87197 86829 87493 87912 86868 85286 84380 83671 82506
55378 82506 81677 81893 82354 82321 82331 82507 81635 79497 78150 79224 81688 83882 85814 87838 89038 88878 88673
55361 88673 89548 90505 90275 89449 89005 88377 86872 85424 85078 85146 84674 84280 84768 85345 85063 84640 85081 85801 85861
55342 85861 85705 85941 85747 84331 82674 82077 82186 82131 82370 83585 84987 85483 85481 85860 86243 85929 85443 85560 85816
55323 85816 85488 84963 84727 84184 83001 82327 83138 84521 85194 85503 86338 87230 87250 86766 86713 87027 87191 87378 87739
55304 87739 87621 86747 86058 86235 86608 86669 87157 88440 89381 89202 88904 89381 89778 89237 88626 88888 89318 89156 89184
55285 89184 89948 90159 88873 87567 87865 88722 88211 86725 86062 86451 86816 86957 87214 86892 85250 83274 82459
55268 82459 82627 82833 83425 85128 87055 87768 87627 88047 89149 90056 90700 91436 91613 90522 89052 88564 88820
55251 88820 88761 88465 88502 88292 87053 85579 85098 85185 84677 83858 83758 84121 84053 83863 84287 84688 84104 83323 83801 85178
55231 85178 85953 86020 86378 86936 86768 86153 86279 87147 87710 87811 88267 89322 90619 92193 93969 94930 94410 93480
55213 93480 93381 93522 92788 91783 91693 91874 90895 89211 88461 88667 88440 87572 87171 87502 87792 87861 87978 87536 85905
55194 85905 84155 83893 84835 85546 85956 86969 88153 88258 87671 87921 88979 89431 89188 89615 90951 91951 92203
55177 92203 92651 93628 94398 94740 95060 94953 93663 91977 91564 92438 93063 93000 93417 94863 96573 98094 99716
55160 99716 101187 101849 102068 102707 103321 102797 101593 101205 101557 101139 99750 98809 98777 98559 97699 96944 96302 94794
55142 94794 92618 91401 91773 92620 93227 94121 95314 95739 95112 94505 94443 94158 93307 92719 92890 93277 93591 94199
55124 94199 94942 95090 94788 94918 95338 94998 93982 93569 94024 94248 93947 94179 95275 96155 96292 96489 97156 97603
55106 97603 97595 97869 98528 98716 98404 98693 99789 100492 100304 100170 100455 100163 99013 98422 99335 100676 101048 100532 99844
55087 99844 99047 98081 97381 97134 96936 96802 97346 98529 99395 99497 99319 98983 97995 96646 96170 96986 98151 98972
55069 98972 99676 100147 99649 98340 97464 97500 97648 97587 98075 99280 100242 100669 101557 103236 104496 104521 104150 104312 104673
55050 104673 104664 104469 104189 103407 102348 102043 102665 103087 102784 102645 103118 103145 101856 99931 98375 97312 96758 97170
55032 97170 98319 99052 99042 99354 100405 100880 99746 97934 96919 96871 97304 98288 99830 101136 101692 102197 103465
55015 103465 105216 106719 107734 108121 107524 106186 105049 104468 103797 102812 102321 102775 103558 104252 105324 106884
54999 106884 108115 108630 109105 109824 110008 109355 108878 109341 110192 110863 111766 113106 114147 114573 115223 116466 117255
54982 117255 116832 116071 116031 116460 116826 117522 118854 119985 120102 119623 119209 118740 118248 118625 120166 121616 121909 121815
54964 121815 122596 123977 124790 124779 124503 124211 123979 124325 125573 127156 128355 129104 129438 129025 127998 127315 127496
54947 127496 127869 127789 127615 127810 128098 128318 129017 130407 131779 132748 133970 135959 138353 141075 144917 150111
54931 150111 155663 160964 166731 173479 180469 187149 194085 201282 207070 210017 210630 209860 207299 202295 195594
54916 195594 188363 180713 172571 164949 158858 153976 149699 146427 144376 142344 139205 135696 133213 131813
54902 131813 130873 130681 131729 133275 134247 134846 135840 136991 137637 138079 139044 140600 142878 146897 153197 160607
54886 160607 167821 175165 183275 191165 197431 202371 206966 210608 211903 211127 209707 207676 203698 197479
54872 197479 190267 182986 175550 168046 161020 154515 148197 142453 138209 135731 134588 134424 134703 134251 132372
54857 132372 129976 128356 127342 125965 124345 123454 123475 123845 124422 125147 125079 123374 120907 119355 118956 118642 117974
54840 117974 117347 116625 115348 114147 114278 115714 117187 118032 118533 118632 117945 117078 117267 118526 119643 120142 120757
54823 120757 121725 122111 121258 119701 118211 116976 116072 115722 115782 115740 115479 115387 115712 116454 117711 119436 121140 122586
54805 122586 124281 126402 127841 127506 126070 125193 125399 126042 126900 128291 129800 130427 130061 129535 129266 129098 129370
54788 129370 130759 133039 135229 137060 139116 141600 144221 147307 151696 157366 163369 169271 175628 183000
54774 183000 191579 201733 213681 226478 238445 248789 257777 265258 270113 271381 269086 263913 256931
54761 256931 249567 242821 236400 229356 221454 213165 204687 196069 188002 181358 176032 171260 166840 163073
54747 163073 159833 156817 154384 152933 151805 150149 148541 148329 149588 151233 153032 155920 160275 165349
54733 165349 170605 176246 182229 188110 193978 200283 206516 211331 214142 215393 215181 212885 208430 202665
54719 202665 196286 189508 182895 177283 172612 168005 163229 158972 155522 152340 149156 146367 144107 141944
54705 141944 139744 137856 136291 134665 133003 131721 130817 130029 129570 129716 129909 129423 128620 128282 128068 127116 125924
54688 125924 125910 127151 128186 128178 127710 127318 126858 126560 127118 128393 129439 130043 130822 131722 131966 131587 131358 131063
54670 131063 129657 127380 125808 125388 124859 123667 122973 123501 124273 124436 124609 125377 126106 126376 127038 128676 130379
54653 130379 131191 131545 132092 132356 131762 130975 130976 131670 132409 133079 133748 134062 133851 133577 133463 133069 132345 132081 132569
54634 132569 132897 132353 131493 131028 130724 130282 130194 130746 131171 130809 130200 130078 130174 130005 129929 130343 130685 130325 129766 129873
54614 129873 130523 131002 131222 131579 132078 132420 132520 132314 131687 131203 132083 134619 137310 138488 138173 137516 137122 136956
54596 136956 137260 138335 139659 140210 139677 138664 137826 137384 137307 137466 137703 137998 138402 138696 138630 138550 139155 140406
54578 140406 141349 141298 140571 139844 139532 139952 141236 142807 143796 144210 144779 145522 145675 145289 145499 146612 147330 146721
54560 146721 145689 145482 145857 145858 145526 145666 146559 147888 149372 150614 150974 150444 150072 150742 152115 153409 154551
54543 154551 155790 156981 158051 159543 161761 163984 165359 166039 166655 167179 167131 166405 165256 163937 162954 163025
54527 163025 164096 165022 164899 164163 163727 163689 163599 163368 163117 162624 161634 160373 159216 158259 157543 157171 156921 156409
54509 156409 155858 155807 155951 155428 154568 154872 156607 157920 157313 155715 154964 155466 156590 158175 160198 161763 161973
54492 161973 161266 160717 160577 160582 161001 162168 163612 164805 166145 168065 169840 170544 170657 171463 173274 175399 177425
54475 177425 179410 181299 183170 185548 188301 189927 189227 187231 186077 186344 186817 186563 185854 185146 184474 183911
54459 183911 183592 183278 182674 181977 181342 180280 178550 177119 177063 177877 178112 177328 176200 174977 173218 171033 169295
54442 169295 168511 168495 169130 170434 171899 172795 173098 173204 172812 171203 168586 166131 164538 163564 163013 163209 164259
54425 164259 165655 166838 167596 167882 167858 168023 168688 169423 169591 169165 168456 167461 166324 165987 167292 169606 171340
54408 171340 171829 171877 172524 174080 176214 178205 179196 178964 178293 177929 177502 176264 174486 173206 172903 173339 174382
54391 174382 175945 177371 177965 177959 178001 177968 177387 176733 176965 177888 178278 177802 177508 178160 179216 179818 179882 179777 179755 180025
54371 180025 180780 181886 183057 184309 185722 186906 187441 187677 188258 188962 188848 187549 185641 183764 182160 180956
54355 180956 180081 179035 177546 176288 176081 176631 177037 177288 178086 179303 179926 179619 179150 179055 179067 179114 179686 180767
54337 180767 181435 181052 180026 178973 177885 176585 175321 174448 174020 173972 174218 174447 174370 174220 174383 174594 174220 173326
54319 173326 172648 172443 172290 172091 172316 172960 173222 172616 171660 171008 170561 169881 168953 168122 167660 167678 168106 168604 168808
54300 168808 168744 168710 168810 168970 169197 169320 168722 167013 164793 163058 161994 161062 160107 159561 159586 159824 160007 160108
54282 160108 159931 159274 158465 158033 157904 157605 157099 156661 156207 155621 155545 156811 159129 161336 162885 164113 165083
54265 165083 165325 164865 164479 164666 165234 166043 167239 168602 169532 169856 169870 169631 169074 168671 168911 169211 168608 167562
54247 167562 167682 169410 171333 172200 172303 172302 172039 171298 170599 170342 170027 169148 168136 167592 167215 166262 164657 163022
54229 163022 161909 161373 160987 160091 158472 156909 156453 157095 157867 158304 158865 159753 160369 160372 160301 160552 160612 159984 159210
54210 159210 159272 160381 161857 162858 162969 162476 162288 163096 164455 165244 165074 164620 164487 164550 164527 164422 164175 163637
54192 163637 163070 162879 162754 161933 160452 159155 158316 157377 156324 156091 157029 158049 157989 157013 156051 155653 155917 156757
54174 156757 157603 157656 156943 156407 156500 156587 156275 156311 157397 158963 159974 160222 160050 159478 158503 157695 157574 157719 157249
54155 157249 155970 154524 153656 153710 154442 154998 154582 153494 152962 153627 154824 155729 156412 157260 158127 158772 159502 160688
54137 160688 162065 163153 163951 164671 165213 165411 165446 165542 165633 165702 166045 166798 167594 167942 167632 166657 165340 164554 165027
54118 165027 166246 166930 166837 167109 168437 169918 170333 169579 168242 166692 165356 165017 165869 166907 167059 166398 165566
54101 165566 164719 163781 163072 162805 162526 161899 161570 162362 163954 165129 165122 164136 162887 162159 162463 163585 164766 165694
54083 165694 166843 168534 170305 171643 172664 173540 173982 173923 174056 174997 176468 177910 179316 180833 182204 183358
54067 183358 185008 187881 191819 196201 200778 205538 210326 215317 221305 228839 237565 246971 257162 268139
54053 268139 278809 287389 292400 292930 288748 280903 271578 262582 254400 247032 240784 235567 230508 225337
54039 225337 221350 219914 220654 222126 223684 225593 227929 230499 233432 236792 239981 242507 244894 247814
54025 247814 250828 253027 254500 256084 258002 259836 261453 262916 263728 263313 262032 260732 259540 258073 256483
54010 256483 255202 253895 251793 248901 245857 242743 239148 235255 231830 229144 226823 224675 222739 220664
53996 220664 218055 215272 212965 210942 208547 206028 204398 203938 203826 203303 202236 200581 198354 196220 195065
53981 195065 194860 194872 195067 196287 198794 201602 203564 204311 203964 202816 201671 201715 203503 206459 209579 212285
53965 212285 214648 217308 221105 226197 231569 235926 238926 240915 241750 240881 238533 235850 233634 231693 229643
53950 229643 227627 226031 225048 224740 225115 226083 227688 230220 233732 237718 241831 246473 252010 257850 263225
53935 263225 268476 274506 281217 287651 293555 299543 305685 311140 315458 319142 322588 325456 327439 328760
53921 328760 329580 329860 330158 331708 335217 340276 346220 352841 359880 366641 372647 378112 383444 388794 394410
53906 394410 400757 407952 415603 423493 431806 440302 447763 452613 453724 450590 443336 432879 420562 407351
53892 407351 393697 380129 367386 355829 345341 335916 327722 320499 313596 306826 300622 295117 289743
53879 289743 284076 278403 273125 268155 263305 258749 254740 251253 248169 245406 242699 239740 236696 234090
53865 234090 231984 229860 227505 225322 223486 221473 218949 216549 215134 214586 213947 212599 210882 209559 208997
53850 208997 208954 208973 208903 208887 208865 208344 207003 205339 204295 204356 205283 206648 208183 209663 210835 211496 211429 210465 208886
53831 208886 207442 206530 205665 204273 202710 201872 202093 203029 204322 205670 206521 206558 206356 206721 207552 208166 208577
53814 208577 209500 211124 212878 214405 215863 217199 218127 218910 220204 222039 223974 226391 230412 236133 242005
53799 242005 246590 250049 253348 256810 260126 263176 266159 269345 272991 277082 280922 283631 285248 286664
53785 286664 288216 289213 289156 288514 287746 286458 284294 281911 280185 278896 277038 274199 270918 267738 264547
53770 264547 260980 257171 253916 251935 250855 249247 246169 242399 239479 237692 235892 233365 230794 229072
53756 229072 228118 227366 226570 225545 223864 221538 219432 218354 218084 217794 217044 215960 214837 214021 213744 213700 213161
53739 213161 211884 210538 209985 210541 212074 214182 216056 216921 217039 217587 219062 220536 221092 221295 222429 224750
53723 224750 227317 229293 230679 231939 233473 235481 237900 240538 243349 246276 248652 249431 248474 247190 247259
53708 247259 249051 251777 254858 258508 263055 268238 273248 277233 279865 281638 283461 285781 288289 290628
53694 290628 293075 296237 300286 304701 308597 311287 312812 313942 315353 316793 317571 317815 318539 320246 322146
53679 322146 323147 323068 322474 321861 321461 321403 321571 321573 321241 320863 320651 320322 319547 318417 317170 315768 314184 312792
53661 312792 312073 312059 312298 312241 311595 310573 309865 310010 310674 310897 310152 308769 307310 305973 304724 303482 302025
53644 302025 300252 298694 298243 299144 300648 301804 302241 302156 302063 302554 303770 305141 306211 307521 309855 312713
53628 312713 314652 315256 315630 316643 317860 318728 319719 321545 324097 326931 330023 333319 336227 338430 340682
53613 340682 344033 348588 353591 358395 362826 366991 371195 375677 380158 384054 387388 390853 394756 398646
53599 398646 402257 405978 409986 413807 417218 420704 424468 427928 430820 433861 437564 441304 444404 447290
53585 447290 450658 454265 457511 460487 463400 465616 466325 465604 463813 460538 455279 448753 442383 436748 431493
53570 431493 426420 421629 416949 412273 408254 405620 403942 402081 399722 397527 395878 394412 392815 391237
53556 391237 389857 388769 388273 388605 389442 390231 390892 391597 392170 392416 392834 394226 396588 399011 400579 400976 400541
53539 400541 400277 401480 404654 409058 413830 419032 424976 431163 436905 442554 449075 456737 465167 474385
53525 474385 484648 495553 506468 517771 530472 544632 559293 574118 589883 607061 624909
53514 624909 642492 659846 677781 697094 718203 740926 764441 788028 811999 837299 864153
53503 864153 891718 919171 946430 973674 1000862 1028056 1055616 1083771 1112315 1140904 1169348
53492 1169348 1197577 1225672 1253893 1282321 1310536 1337994 1364528 1390058 1414152 1436536 1457817
53481 1457817 1478947 1500056 1520484 1539926 1558807 1577502 1595922 1614017 1632046 1650142 1668057
53470 1668057 1685411 1701743 1716264 1728018 1736463 1741674 1744025 1743926 1741570 1736564 1728075 1715796 1700529
53457 1700529 1683375 1664759 1644766 1623927 1602839 1581292 1558621 1534717 1509920 1484154 1457094
53446 1457094 1429102 1401132 1373708 1346728 1320167 1294168 1268499 1242818 1217522 1193508 1171034
53435 1171034 1149637 1129216 1110432 1093940 1079951 1068683 1060423 1054971 1051660 1050085 1050241 1051993 1055097
53422 1055097 1059830 1066841 1076267 1087571 1100302 1114371 1129649 1146070 1164140 1184547 1207137 1230955
53410 1230955 1255377 1280480 1306382 1333113 1361310 1392081 1425844 1461990 1499960 1539968 1582395
53399 1582395 1627223 1674417 1724263 1776959 1832334 1890212 1950578 2013190 2077480 2142961 2209307
53388 2209307 2276056 2342848 2410040 2478435 2548134 2618083 2686865 2753568 2817868 2879790 2939437
53377 2939437 2996619 3050835 3101958 3150578 3197082 3240770 3280584 3316356 3348495 3376744 3400210
53366 3400210 3418362 3430902 3436803 3434631 3423755 3404113 3374889 3334899 3284603 3226509 3163204 3096006
53354 3096006 3025796 2953797 2880918 2807371 2733584 2660579 2588940 2518233 2448018 2378630 2310558
53343 2310558 2243908 2178898 2115875 2054334 1992907 1931013 1869700 1810303 1753182 1698508 1647258
53332 1647258 1600433 1557859 1518677 1482524 1449508 1419515 1392346 1368178 1347139 1328675 1311915
53321 1311915 1296427 1282191 1269142 1257126 1245911 1234974 1223797 1212808 1203468 1196837 1192420 1188856
53309 1188856 1185387 1182320 1180519 1180827 1183529 1188006 1193285 1199171 1206323 1215084 1225068 1236299 1249868 1266718
53295 1266718 1286338 1307387 1329194 1352016 1376230 1401953 1429253 1458150 1488475 1520036 1552758
53284 1552758 1586442 1620651 1654934 1688806 1721421 1751868 1779976 1806324 1831269 1854546 1875928
53273 1875928 1895528 1913178 1928214 1940188 1949064 1954470 1955576 1952166 1945016 1934744 1921040 1903514
53261 1903514 1882492 1858383 1830965 1799913 1765480 1728189 1688553 1647485 1606144 1564810 1522757
53250 1522757 1479776 1436933 1395236 1354603 1314935 1277079 1241599 1207534 1173626 1140037 1107532
53239 1107532 1075635 1043117 1009907 976991 944555 911841 879035 847896 819932 794923 771755
53228 771755 749962 729937 712092 696330 682127 668933 656668 645749 636379 627885 619101 609348
53216 609348 598816 588101 577635 567383 556881 545759 534415 523793 514277 505228 495887 486283
53204 486283 476900 467943 459379 451228 443330 435296 427177 419650 413032 406670 399910 393157 387247 382198
53190 382198 377329 372212 366806 361039 355069 349630 345300 341600 337565 333050 328760 325153 322007 318983
53176 318983 315958 312843 309629 306566 303909 301643 299741 298319 297175 295691 293747 292121 291304 290502 288665
53161 288665 286027 283650 281812 279909 277750 275859 274539 273571 272862 272458 271915 270569 268556 266740 265537
53146 265537 264578 263659 263131 263096 262974 262275 261232 260442 260287 260919 262299 264000 265354 266000 266053 265727 265215 264891
53128 264891 265186 266132 267361 268600 269883 271301 272813 274181 274918 274578 273433 272480 272302 272292 271579 270301
53112 270301 269167 268120 266440 264076 261915 260583 259817 259215 258803 258563 258116 257283 256452 256056 256078 256269 256486
53095 256486 256600 256464 256132 255774 255288 254405 253319 252725 253011 253815 254627 255437 256474 257601 258426 258955 259791 261465
53077 261465 263679 265419 265893 265205 263966 262539 261020 259773 259241 259161 258640 257298 255730 254522 253483 252325
53061 252325 251391 251047 250916 250459 249870 249609 249434 248703 247429 246230 245387 244695 244106 243813 243727 243487 242955 242214
53043 242214 241229 240012 238905 238240 237983 238189 239284 241207 242769 242862 241993 241585 241956 242087 241354 240361 239895
53026 239895 240051 240716 242002 243765 245342 246183 246283 245847 245063 244302 243969 243922 243579 242715 241699 240866 240238 239965
53008 239965 240420 241597 242878 243669 243968 244197 244681 245311 245523 244777 243332 242248 242326 243393 245017 247261 249983
52991 249983 252029 252278 251281 250717 251298 252274 253008 253879 255330 257036 258452 259423 259884 259683 259134 259145 260361
52974 260361 262504 264714 266191 266557 266066 265460 265203 264993 264489 264075 264157 264158 263258 261843 261010 260745 259941 258291
52956 258291 256767 255970 255375 254688 254600 255510 256688 257458 258123 258892 258975 257744 255904 254443 253075 250857 247869
52939 247869 245214 243594 242809 242535 242701 243082 243127 242428 241099 239690 238885 238982 239533 239785 239653 239830 240750 241961
52921 241961 242834 243372 243953 244702 245486 246118 246290 245744 244808 244219 244183 244150 243828 243701 244122 244589 244565 244355 244475 244709
52901 244709 244616 244565 245348 246904 248243 248678 248540 248630 249452 251026 253033 254997 256561 257625 258139 257955 257070
52884 257070 255809 254560 253482 252663 252270 252274 252259 251775 250777 249509 248171 246896 245847 245115 244632 244347 244322 244579
52866 244579 245027 245610 246332 247109 247855 248669 249653 250562 250998 250914 250539 249813 248367 246116 243399 240509 237567
52849 237567 234837 232632 230834 229036 227177 225470 223729 221533 219194 217750 217739 218644 219824 221235 222855
52834 222855 224160 224724 224812 224917 225150 225483 226084 227028 228070 229017 229949 230917 232021 233948 237581 242650 247564
52817 247564 251115 253696 256234 258620 259915 259515 257411 253778 249113 244437 240531 237124 233476 229585
52803 229585 226222 223891 222399 221407 220816 220500 220109 219382 218488 217899 217848 217937 217483 216399 215429 215195 215391 215450
52785 215450 215624 216570 218156 219713 221306 223568 226225 228119 228999 229890 231161 231692 230788 229548 229210 229244
52769 229244 228458 227119 226532 227056 227848 228271 228352 228063 227262 226232 225382 224585 223652 223099 223537 224585 225414 226021
52751 226021 226918 227743 227450 226002 224748 224814 225912 227041 227624 227721 227696 227955 228571 229091 229087 228852 229076 229949 231170
52732 231170 232673 234650 236871 238701 239861 240624 241166 241335 241117 240784 240422 239878 239313 239249 239785 240161 239467
52715 239467 237649 235621 234451 234431 234907 235037 234674 234321 234321 234524 234831 235409 236083 236090 234983 233369 232258 232106
52697 232106 232843 234304 236025 237152 237328 237319 238141 239899 242079 244421 246631 247758 246977 244882 243031 242254
52681 242254 242253 242699 243669 244867 245450 245042 244267 243947 244258 244815 245081 244638 243550 242578 242518 243286 244100 244516 244783
52662 244783 245285 246266 248019 250617 253411 255495 256747 257806 258883 259355 258712 257233 255445 253482 251315
52647 251315 249137 247218 245784 245226 245946 247682 249446 250492 251090 252021 253561 255334 256989 258651 260647
52632 260647 262941 264967 266080 266099 265273 263800 261640 258873 255885 253037 250469 248414 247239 246926 246940 246961
52616 246961 247307 248199 249087 249238 248577 247394 245673 243404 241225 239984 239784 240109 240712 241721 243048 244373
52600 244373 245645 246997 248253 249095 249601 250102 250671 251265 252061 253094 253905 254217 254616 255727 257085 257742 257785
52583 257785 258257 259631 261348 262823 263884 264171 263208 261343 259725 259023 258866 258705 258403 257789 256542 254883
52567 254883 253597 253015 252598 251836 250903 250118 249449 248822 248371 248069 247684 247282 247133 247018 246394 245483 245340 246349
52549 246349 247466 247558 246898 246671 247425 248630 249498 249722 249560 249555 250072 250963 251803 252471 253137 253722 253823 253250 252185
52530 252185 250777 249078 247421 246263 245587 245075 244964 245982 248196 250716 252847 254830 256975 258783 259593
52515 259593 259657 259856 260600 261587 262545 263723 265506 267728 269505 269864 268645 266686 264909 263492 262182 261046
52499 261046 260292 259661 258730 257688 257078 256819 256353 255683 255405 255649 255985 256486 257747 259491 260343 259661 258665 258943
52481 258943 260543 262307 263458 264045 264310 264444 264727 265292 265949 266642 267709 269216 270499 270957 270956 271366 272486
52464 272486 273926 275245 276112 276135 275185 273795 272693 271915 270857 269170 267271 265916 265531 266002 266901 267855
52448 267855 268702 269287 269224 268156 266249 264138 262374 261155 260512 260355 260381 260380 260591 261213 261635 260885 258931 256829
52430 256829 255403 254558 254150 254601 256003 257375 257604 256835 256289 256951 258907 261659 264512 266783 268152 268913
52414 268913 269723 271141 273440 276611 280470 284948 290219 296234 302350 307919 313050 318043 322142 323853
52400 323853 322673 319570 315488 310443 304581 299020 294782 291645 288910 286624 285132 284033 282617 281011
52386 281011 279891 279250 278419 277260 276470 276589 277415 278569 280062 282048 284328 286421 288002 289251 290757
52371 290757 292993 295886 299006 302118 305179 307873 309721 310763 311584 312492 313218 313560 313710 313723 313357 312823
52355 312823 312944 314076 315558 316758 317985 319739 321636 322871 323297 323415 323683 324418 325915 328040 330168
52340 330168 332116 334634 338240 342168 345337 347933 351011 354874 358883 362773 367101 372276 378022 384011
52326 384011 390339 397160 404394 411958 419845 427877 435802 443663 451661 459683 467386 474785 482377 490666
52312 490666 499837 509867 520620 531924 543752 556238 569339 582819 596819 611960 628466 645549
52300 645549 662256 678529 694833 710977 726071 739596 751918 763693 775234 786409 796724
52289 796724 805574 812764 818712 823798 827796 830375 831937 833409 835352 837686 840121 842291 843626 843737
52275 843737 842920 841846 840778 839514 837971 836346 834732 833048 831345 829833 828663 827973 828012 828900 830488
52260 830488 832791 836311 841544 848364 856323 865229 874971 885096 895167 905373 916210 927648 939089
52247 939089 950043 960424 970390 980288 990492 1000760 1009996 1017235 1022636 1027033 1030846 1034013 1036621
52234 1036621 1038780 1040073 1039954 1038640 1036884 1034897 1032224 1028658 1024531 1020033 1014981 1009433 1003842 998365
52220 998365 992555 986042 979200 972912 967842 963925 960372 956315 951672 947180 943401 940152 937262 935218
52206 935218 934364 933994 933228 932450 932919 935146 938623 943005 948372 954191 959188 962713 965401 968079 970724
52191 970724 972848 974182 974585 973903 972368 970658 969175 967593 965446 962761 959907 957215 954871 952805 950557
52176 950557 947669 944324 941104 938070 934697 930893 927372 924700 922543 920265 917798 915426 913146 910777
52162 910777 908542 907054 906698 907167 907637 907433 906675 906186 906517 907216 907439 907145 907088 907637 908268 908418 908198 907889
52144 907889 907260 905940 904189 902780 902160 902110 902272 902694 903636 904911 905773 905752 905510 906396 909011 912651 916416
52127 916416 920386 925192 930887 936945 943138 949722 956872 964628 973409 983801 995665 1008037 1020199
52114 1020199 1032370 1045124 1058570 1072387 1086362 1100578 1115219 1130339 1145806 1161454 1177284
52103 1177284 1193383 1209527 1225099 1239554 1252706 1264469 1274753 1283824 1292239 1300039 1306603 1311773
52091 1311773 1316438 1321274 1325567 1328213 1329428 1330397 1331483 1331863 1330801 1328276 1324364 1319072 1312834 1306229
52077 1306229 1299114 1290923 1281871 1272889 1264293 1255578 1246764 1238915 1232917 1228608 1225504 1223608 1223136 1224180
52063 1224180 1226997 1231871 1238300 1245041 1251374 1257700 1264539 1271615 1278330 1284590 1290697 1296886 1303212 1309497
52049 1309497 1315306 1320528 1325948 1332497 1339827 1346451 1351496 1355483 1359198 1362734 1365943 1368836 1370995 1371458
52035 1371458 1369778 1366528 1362266 1356708 1349368 1340301 1329798 1318096 1305878 1294232 1283545 1273138
52023 1273138 1262563 1252419 1243263 1234513 1225260 1215526 1205911 1196495 1186803 1176358 1164662 1151169 1135987
52010 1135987 1120070 1104057 1087596 1070547 1054048 1039358 1026133 1013001 999501 986300 973660
51999 973660 960888 947450 933562 919377 904423 888332 871557 854865 838419 821693 804180
51988 804180 785936 767403 748857 730231 711622 693733 677383 662660 649084 636645 626107
51977 626107 618082 612354 608338 605595 603612 601782 600051 599036 599018 599354 599284 598715 597656 595514 591662 586342
51961 586342 580332 574066 567592 561063 554690 548595 543240 539591 538177 538332 538960 539797 541382 544151 548176
51946 548176 553444 559699 566231 572465 578548 584825 591037 596596 601392 605639 609185 611578 612659 612487
51932 612487 610948 608017 604171 599830 594592 587721 579321 570403 561904 554199 547332 541099 534953 528541
51918 528541 522374 517521 514721 514127 515598 518610 522174 525567 529043 533173 537726 541974 545865 549945
51904 549945 554091 557401 559678 562249 566888 574475 585003 598258 614007 631905 651621 672724 693980
51891 693980 712845 725971 730465 725108 711027 691469 670474 651075 634403 620244 608174 598087
51879 598087 589884 582983 576391 569305 561497 553000 543670 533530 523356 514288 506673 499909 493621 488291
51865 488291 484306 481120 478053 475353 473699 472984 472367 471273 469588 467075 463380 458629 453296 447516 441156
51850 441156 434578 428605 423622 419290 415315 411938 409468 407814 406787 406508 407227 408900 411143 413534 415906
51835 415906 418424 421305 424405 427200 429267 430569 431208 431270 431079 431180 431700 432108 431962 431540 431303 431160 430710
51818 430710 429807 428296 425655 421649 417111 413271 410385 407761 405029 402682 401275 400780 400871 401313 401893 402447
51802 402447 403021 403682 404160 404126 403798 403821 404441 405223 405689 405910 406364 407400 408783 409610 408862 406347 403024 400163
51784 400163 398397 397665 397669 397995 398298 398910 400912 405001 410558 416347 421766 426775 431027 433942 435525 436270
51768 436270 436251 434977 432152 428013 422967 417455 412043 407046 402203 397319 393057 390360 389220 388646 387808
51753 387808 386621 385411 384702 385106 386677 388558 390047 391679 394330 397587 400267 402401 405289 409344 413343
51738 413343 416320 418968 422393 426460 430182 432983 434798 435567 435436 435054 434999 435233 435525 435934 436400 436397 435568
51721 435568 434336 433372 432785 432377 432325 433045 434547 436448 438509 440833 443649 447156 451401 455951 459739 461438
51705 461438 460146 455984 450389 445627 443346 443396 444461 445809 447771 450354 452228 451754 448604 443837 438705
51690 438705 433845 429385 425219 421116 416904 412687 408813 405673 403484 402104 400998 399545 397394 394474
51676 394474 390902 387275 384802 384546 386437 389452 392754 396254 400128 404391 409004 413834 418348 421874
51662 421874 424247 425706 426220 425655 424716 424875 426943 430282 433815 437151 440396 443531 446621 450068 453871
51647 453871 456880 457393 454549 448810 441302 433045 424692 416625 409184 402797 397764 393975 391165 389491
51633 389491 389444 391131 394049 397653 401680 405764 409212 411430 412168 411238 408489 404329 399758 395507 391500
51618 391500 387396 383224 379213 375457 372175 369905 369027 369293 370180 371434 372994 374700 376460 378529 381278
51603 381278 384841 389211 394576 401314 409648 419348 429763 440225 450458 460285 468723 473998 475139
51590 475139 473290 470697 468649 467269 466983 468799 472967 478732 485929 495648 508445 522840 536479 548209
51576 548209 558321 567456 576072 584341 591616 596383 597701 596565 595304 596023 600168 609089 623924 644915
51562 644915 671318 701797 734452 766991 797789 826744 854388 880276 902882 920893 933796
51551 933796 941166 942120 935793 921986 901283 874876 844332 811142 776418 741067 706037 672113
51539 672113 639763 609596 582664 559765 540569 523932 509018 495784 484563 475659 469210 464907
51527 464907 461776 458662 454976 450805 446437 442129 438162 434676 431514 428526 425898 423766 421674 418948
51513 418948 415613 412473 410174 408558 407086 405551 404169 403130 402243 401095 399563 398150 397652 398378 399883
51498 399883 401493 402930 404344 405994 408039 410391 412569 413883 413886 412483 409672 405604 400960 396742 393415
51483 393415 390622 387884 385077 382093 378757 375458 373161 372196 371562 370124 368033 366243 365022 363784 362132
51468 362132 360213 358084 355547 352769 350416 349009 348583 349016 350172 351703 353237 354984 357702 361895 367374
51453 367374 373749 381017 389430 399095 409991 422225 435806 449991 463016 472960 479226 483052 486281
51440 486281 489745 493189 496395 499470 501845 501874 498098 490513 480195 468225 455525 443158 431946
51427 431946 421935 412854 404964 398788 394090 389769 384938 379701 374832 370998 368326 366510 365264 364661
51413 364661 364835 365344 365381 364886 364924 366457 369174 372064 374810 377963 381955 386548 391222 395590 399503 403206
51397 403206 407368 412588 418971 426403 434949 444594 454914 465566 476927 489766 504463 520992 539463
51384 539463 560216 583605 610102 640380 674742 712673 753426 796689 841949 887381 930137
51373 930137 967860 999476 1024609 1042831 1053525 1056011 1049708 1034450 1010575 978588 939188 894101
51361 894101 846324 798747 752693 708411 666570 628329 594179 563780 537005 514173 495088
51350 495088 478784 464555 452431 442301 433358 424947 417393 411430 407142 403906 401083 398404 395927
51337 395927 393897 392493 391480 390335 388862 387461 386555 385854 384380 381312 376849 372234 368719 366422 364434
51322 364434 362159 360149 359295 359574 360113 360233 359921 359468 359223 359584 360669 361953 362657 362527 361995 361728 362312
51305 362312 364015 366329 368027 368267 367480 366705 366362 366293 366691 368141 370774 374072 377474 380478 382298 382283
51289 382283 380785 378931 377401 376067 374795 373845 373385 373302 373646 374562 375601 375792 374676 372749 370785 369280
51273 369280 368717 369621 371969 374921 377422 378857 379196 378905 378673 378738 378527 377411 375671 374092 372875 371687
51257 371687 370636 370241 370421 370445 370003 369511 369206 368851 368452 368378 368611 368813 369320 370947 373467 375393 375874 375804
51239 375804 376484 378088 380102 382363 384813 386977 388514 389761 391080 392230 393003 393760 394589 394649 393251 390999
51223 390999 388958 387193 385133 383012 381812 381913 382707 383557 384320 384933 385246 385328 385375 385348 385222 385480 386695 388712
51205 388712 390921 393251 396131 399400 402134 403830 405073 406583 408146 409039 409177 409250 409705 410058 409395 407407
51189 407407 404782 402586 401329 400706 400175 399624 399392 399732 400383 400732 400411 399707 399260 399276 399221 398434 396844 394879
51171 394879 392910 391212 390268 390514 391710 393058 394042 394747 395323 395694 395939 396356 396891 397007 396486 395870 395738
51154 395738 395950 396014 395837 395570 395003 393698 391675 389561 387987 387139 386896 387212 388228 390013 392226 394204
51138 394204 395585 396735 398272 400249 402215 403933 405517 406827 407385 407109 406588 406316 406143 405789 405408 405212
51122 405212 404917 404102 402975 402334 402780 404150 405653 406527 406795 407368 409164 412066 415116 417677 419912 422103
51106 422103 424151 426030 428090 430501 432888 434951 436972 439229 441266 442351 442509 442606 443415 444808 445819
51091 445819 445400 443386 440830 439103 438535 438204 437099 435020 432304 429343 426716 425150 424837 425184 425633 426360
51075 426360 427730 429536 431283 432965 435015 437655 440722 443932 446981 449581 451797 454247 457647 462250
51061 462250 467831 473964 480087 485586 490176 494119 498010 502468 508010 514881 522974 532225 542971 555397
51047 555397 568681 581399 592797 602968 611725 618237 622084 623766 623718 621768 618127 613968 610117 605813
51033 605813 599572 590881 580417 569215 558329 548745 540786 533944 527962 523535 521226 520281 519467 518658
51019 518658 518699 520095 522746 526576 531350 536166 540240 544188 549514 556803 565340 574497 584467 595462
51005 595462 607075 618793 630459 641991 653261 664506 676264 688629 701025 712950 724586
50994 724586 736509 749137 762533 776392 790134 803281 815798 827875 839505 850592 861272
50983 861272 871780 882088 891965 901225 909637 917025 923891 931606 941469 953957 969450 989106 1014123
50970 1014123 1044329 1078425 1115546 1155741 1199038 1244933 1292935 1342706 1393376 1443463 1491839
50959 1491839 1538234 1582494 1623801 1660947 1693110 1720170 1742525 1760656 1774708 1784566 1790552 1793754
50947 1793754 1795319 1795758 1795469 1795512 1796925 1799216 1800250 1797724 1790360 1777994 1761446 1742396 1722470 1701987
50933 1701987 1679987 1655522 1628394 1598678 1566354 1531702 1495396 1457844 1418877 1378369 1336797
50922 1336797 1294947 1253511 1213134 1174455 1137860 1103459 1071406 1041967 1015313 991529 970766
50911 970766 952922 937284 922991 909832 898113 887790 878326 869442 861401 854395 848198 842553 837417
50898 837417 832740 828472 824930 822660 821822 822077 823118 824880 827222 829926 833038 836714 840724 844646 848492
50883 848492 852544 856607 860223 863764 868506 875211 883224 891378 899386 907982 918021 929794 943004
50870 943004 957215 972400 989073 1007748 1028469 1051217 1076492 1105055 1137322 1173551 1214335
50859 1214335 1260246 1311229 1367141 1428680 1496950 1572271 1654415 1743750 1840897 1945110 2054351
50848 2054351 2167312 2284088 2404248 2525494 2645096 2761559 2873744 2979084 3073874 3155135
50838 3155135 3221393 3271988 3306623 3325691 3330449 3322725 3304589 3278152 3245515 3209179 3172511 3139117
50826 3139117 3111296 3089443 3073153 3062245 3056290 3053700 3051905 3048079 3039350 3022947 2996956 2960824
50814 2960824 2914705 2858624 2792758 2718175 2636690 2550096 2459946 2367945 2276137 2186716 2101771
50803 2101771 2022973 1951279 1887215 1831485 1784919 1747709 1719266 1699029 1686861 1682403 1684771 1693279
50791 1693279 1707737 1727460 1750601 1775138 1799953 1824255 1846564 1865247 1879749 1890436 1897405
50780 1897405 1900285 1899059 1894187 1885818 1873627 1857598 1838346 1816448 1791841 1764027 1732517 1697074
50768 1697074 1657951 1616023 1572459 1528219 1484090 1441005 1399983 1361772 1326791 1295265 1267049
50757 1267049 1241560 1218462 1198444 1182800 1172047 1165265 1160983 1158487 1158178 1160874 1167034 1176602 1189436
50744 1189436 1205705 1225759 1249731 1277523 1309248 1345429 1386690 1433427 1485800 1543659 1606322
50733 1606322 1672711 1741922 1813359 1886148 1958760 2029488 2097067 2160594 2219132 2271695 2317345
50722 2317345 2354976 2383161 2400535 2406313 2400436 2383589 2357332 2324044 2286556 2247906 2211209 2179030
50710 2179030 2152559 2131766 2116575 2107334 2103869 2104689 2107792 2111886 2116301 2119941 2120879 2116889 2106067
50697 2106067 2087271 2060519 2026982 1988417 1946717 1903994 1862438 1823566 1787929 1755923 1728502
50686 1728502 1706741 1691203 1682287 1680786 1687476 1702503 1725759 1757475 1797789 1846081 1901545 1964233
50674 1964233 2034663 2112324 2195112 2280154 2364561 2445577 2520895 2589138 2649648 2701847 2745366
50663 2745366 2780735 2809195 2831682 2848477 2859800 2866013 2867138 2862871 2853272 2838833 2819617 2795132
50651 2795132 2765577 2732782 2699416 2667639 2638852 2614309 2595162 2581948 2574555 2572904 2577349 2588203
50639 2588203 2604958 2626089 2649642 2673941 2697712 2719778 2739165 2755750 2770366 2783611 2794657
50628 2794657 2801854 2804543 2803320 2797753 2784246 2757258 2713417 2654625 2587329 2519047 2455424 2399595
50616 2399595 2352989 2315998 2288136 2268277 2255147 2247703 2245291 2247596 2254253 2264026 2274374 2282149
50604 2282149 2284816 2280829 2269045 2248379 2218168 2178461 2129865 2073648 2012126 1948250 1884306 1821310
50592 1821310 1759909 1701304 1646820 1597021 1551840 1511318 1475698 1445000 1418964 1397216 1379084
50581 1379084 1363524 1349734 1337699 1327717 1319564 1312613 1306582 1301641 1297866 1295158 1293755 1294471 1298299
50568 1298299 1305892 1317247 1331686 1348506 1367996 1391547 1420399 1454669 1494059 1538956 1590051
50557 1590051 1647140 1709154 1775184 1844560 1915886 1986947 2055858 2121638 2183507 2240464 2292051
50546 2292051 2338985 2382584 2423997 2464298 2504795 2546656 2590387 2636003 2683465 2732671 2783324
50535 2783324 2835321 2889299 2946512 3008206 3075248 3148287 3227951 3314670 3408241 3507617 3611138
50524 3611138 3716956 3823102 3927204 4026443 4118012 4199421 4268251 4321909 4358003 4374821 4371248
50513 4371248 4346608 4301055 4235953 4153396 4055530 3944818 3824710 3699327 3572384 3446984
50503 3446984 3326436 3214454 3114222 3027802 2956696 2902361 2865607 2845887 2841730 2851686 2874441
50492 2874441 2908133 2949999 2996620 3044100 3087903 3122942 3144265 3147939 3131553 3094193 3036234
50481 3036234 2959219 2865821 2759599 2644513 2524470 2403056 2283341 2167708 2057896 1955176
50471 1955176 1860294 1773237 1693424 1620353 1553853 1493633 1439018 1389497 1345235 1306612 1273478
50460 1273478 1245223 1221279 1201081 1183779 1168647 1155735 1145486 1137691 1131455 1126340 1122931 1121926
50448 1121926 1123116 1125642 1128930 1132988 1137914 1143470 1149150 1154460 1159088 1163000 1166493 1170208 1175026 1181783
50434 1181783 1191050 1203234 1218782 1237977 1260513 1285700 1313315 1343862 1377710 1414364 1452968
50423 1452968 1493154 1534901 1577952 1622085 1667864 1716384 1768121 1822542 1878948 1937197 1997408
50412 1997408 2059376 2122496 2185999 2249174 2311526 2372643 2431625 2486754 2536161 2578819 2614497
50401 2614497 2642734 2662311 2671773 2670049 2656462 2630616 2592535 2542752 2482225 2412467 2335786 2254994
50389 2254994 2172716 2091197 2012678 1939439 1873182 1814645 1764065 1721869 1688799 1665462 1651852
50378 1651852 1647196 1650245 1659758 1674657 1693678 1715117 1737054 1757479 1773969 1783666 1784168 1774450 1754696
50365 1754696 1725667 1688629 1645452 1597932 1547138 1493976 1440137 1387580 1337135 1288439 1241329
50354 1241329 1196364 1153805 1113103 1073971 1037241 1004007 974377 947636 923278 901273 881596
50343 881596 864056 848584 835268 824040 814492 806096 798625 792373 787891 785393 784550 785072 787234 791527
50329 791527 798001 806407 816795 829381 843880 859532 875708 891763 906196 916694 921492 920466
50317 920466 914970 907150 899421 893775 891007 890829 892802 896823 902716 910001 918283 927362 936807 945949
50303 945949 954418 962138 968693 973432 976413 978492 980085 980578 979400 976920 973689 969415 963483 956055
50289 956055 947855 939155 929776 920072 911204 904267 899481 896326 894237 893133 893404 895429 899150 904314
50275 904314 910984 919380 929240 939862 950923 962653 974927 986830 997592 1007472 1017185 1026855 1036093
50262 1036093 1044770 1053067 1060891 1067791 1073464 1077956 1081399 1083807 1085132 1085318 1084420 1082871 1081541 1081334 1082829
50247 1082829 1086366 1092287 1100973 1112870 1128555 1148491 1172715 1201175 1234529 1274182 1321320 1376241
50235 1376241 1438734 1508556 1585155 1667277 1753163 1840731 1927317 2009776 2085498 2153386 2213747
50224 2213747 2267521 2315817 2359662 2399662 2435691 2466673 2490124 2501937 2497542 2474001 2430998
50213 2430998 2369977 2293126 2203519 2105331 2003117 1901075 1803092 1712514 1630997 1558135 1492943
50202 1492943 1435188 1384396 1338145 1292670 1245443 1196563 1147730 1100702 1056791 1016950 981708
50191 981708 951117 924902 902489 883070 866010 851268 839192 829904 822958 817479 812594 808073
50179 808073 804588 802854 802361 801625 800032 798644 798627 799648 800641 801494 802882 804876 806986 809456 813269 818636
50163 818636 824527 830051 835471 841492 848314 855863 864295 873674 883531 893211 902375 910843 918218 924104
50149 924104 928615 932377 935994 939531 942473 944327 945475 947404 951766 959252 969551 982205 996991
50136 996991 1013496 1030932 1048776 1067272 1087074 1108593 1132023 1157877 1187123 1220659 1258800
50125 1258800 1301572 1349603 1404529 1468253 1541912 1625975 1721218 1828865 1949389 2081664 2223625
50114 2223625 2373164 2527627 2682884 2833961 2977044 3110714 3235436 3352444 3463085
50105 3463085 3568364 3668338 3761557 3844770 3912888 3959555 3978576 3965551 3918637 3838427 3727716
50094 3727716 3591374 3435737 3267462 3092478 2915544 2740383 2570084 2407367 2254395
50085 2254395 2112479 1982380 1864910 1760674 1669050 1588078 1515911 1451947 1396082 1347413
50075 1347413 1304448 1266326 1233075 1204760 1181052 1161521 1145744 1133110 1123053 1115363 1109667 1104743
50063 1104743 1099054 1092038 1084321 1076662 1069239 1061886 1054242 1045561 1035195 1023635 1012434 1002728 994295
50050 994295 986399 979057 972970 968488 965229 962706 961015 960688 961896 963986 966061 968104 971150 976009
50036 976009 982223 988733 995287 1002551 1010947 1020074 1029264 1038018 1045807 1052199 1057540 1063001 1069453 1076500
50022 1076500 1082880 1087740 1091476 1095527 1101255 1108671 1116318 1122813 1128457 1134909 1143354 1153674 1165457
50009 1165457 1179058 1195295 1214592 1236940 1262408 1291337 1324263 1361919 1405137 1454501 1510224
49998 1510224 1572373 1640941 1715487 1794898 1877525 1961253 2043411 2121082 2191896 2254585 2308979
49987 2308979 2355928 2397273 2435236 2471170 2504709 2533969 2556144 2567717 2564547 2542447 2498262
49976 2498262 2430976 2342308 2236451 2119061 1996177 1873608 1756319 1647518 1548302 1458681
49966 1458681 1378955 1309750 1250999 1201707 1160836 1127689 1101250 1079878 1062106 1047271 1034925
49955 1034925 1024099 1013576 1002664 991216 979111 966111 952168 937547 922581 907328 891376
49944 891376 874079 855256 835754 816947 799578 783278 767290 751329 735700 721037 708096
49933 708096 697385 688656 681044 674010 667911 663410 660541 658663 657166 656018 655702 656790 659485 663439
49919 663439 668045 672881 677754 682561 687457 693051 699957 708089 716905 726300 736607 747474 757490
49906 757490 765441 771496 776663 781449 785505 788152 788583 785821 779354 770018 759655 749590 739653 728853
49892 728853 716690 703645 690623 678280 666891 656626 647638 639802 632532 625166 617574 610225 603601
49879 603601 597797 592754 588584 585391 583000 581205 580225 580604 582590 585867 590024 595125 601649 609893 619556
49864 619556 629961 640601 651408 662514 673825 684828 694797 703135 709574 714093 716724 717570 716958
49851 716958 715234 712223 707171 699683 690580 681341 672671 664173 655478 647045 639558 633115 627523 622959
49837 622959 619797 617984 617088 616782 616998 617894 620014 624080 630110 637087 643985 650888 658592 667420 676970
49822 676970 686623 695608 702843 707640 710576 712977 715528 717981 720025 721564 722079 720649 717021 712081
49808 712081 706935 701937 696848 691488 686001 680770 676235 672548 669428 666591 664198 662461 661063 659509
49794 659509 657886 656652 655841 655143 654675 654949 656078 657737 659851 662589 665747 668938 672421 676837 682091
49779 682091 687471 692951 699346 706880 714613 721606 727611 732175 734168 733037 729723 725560 720901 715418
49765 715418 708997 701503 692301 680943 668114 655209 643218 632494 623124 614895 607196 599625 592432
49752 592432 585984 580197 575006 570900 568264 566493 564557 562339 560756 560512 561223 561855 561689 560895 560446 561452
49736 561452 564333 568645 573677 579028 584582 590390 596831 604537 613825 624327 635276 645835 655121
49723 655121 662335 667152 669783 670713 670687 670736 671425 671939 670578 666365 659674 651351 642111 632962 625127 619014
49707 619014 613998 609629 606258 604134 602813 602080 602461 604081 605909 607076 608226 610600 614365 618761 623409
49692 623409 628514 634158 640308 647216 655034 663311 671573 680050 689132 698514 707626 716502 725449 734229
49678 734229 742325 749622 755945 760352 761835 760545 757481 753249 747946 741931 735700 729091 721574 713308
49664 713308 705163 697708 690819 684028 676629 667820 657632 647502 638970 632038 625679 619630 614536 610486
49650 610486 606715 602919 599733 597631 596281 595249 594417 593476 591897 589778 587934 586803 585917 584657 582831
49635 582831 580321 576990 573220 569819 567043 564392 561672 559476 558180 557189 555756 553980 552437 551227
49621 551227 550009 548730 547864 547958 549159 551083 553058 554639 555881 556928 557553 557515 557236 557504 558473 559535
49605 559535 560201 560563 560765 560671 560267 559906 559907 560294 561011 561985 562944 563672 564562 566322 568965 571668 573772 575406
49587 575406 576919 578331 579700 581507 584199 587636 591283 594658 597414 599331 600546 601612 603140 605532
49573 605532 608986 613442 618503 623874 629864 636999 645113 653387 661458 669895 679318 689455 699336 707938
49559 707938 714388 718062 719010 718076 716202 713702 710368 706074 701093 695983 691341 687520 684407 681574 678660
49544 678660 675500 672077 668652 665844 664175 663538 663479 663944 665297 667631 670582 673970 678248 684144 692177
49529 692177 702542 715043 728997 743618 758586 773901 789099 803007 814446 822976 828936 833174
49517 833174 836828 840992 846301 852758 859788 866314 871077 873246 872512 868441 860336 848374 834370 820552
49503 820552 807879 796267 785918 777085 768784 759393 748896 739236 731893 726333 721458 717379 714782
49490 714782 713500 712782 712378 712339 712317 712099 712435 714268 717307 720330 722814 725363 728419 731432 733604 734876
49474 734876 735799 736774 737759 738598 739400 740536 742204 744029 745271 745541 745005 743798 741615 738274 734315 730555
49458 730555 727049 722925 717340 710391 703027 696219 690254 684796 679644 675260 672283 670502 668743 666005
49444 666005 662503 659427 657932 658546 661208 665389 670295 675342 680517 686085 692038 698085 704144 710453
49430 710453 716998 723148 728359 733189 738955 745854 751769 753798 751156 745939 740784 736522 732682 729474
49416 729474 728165 729616 733382 738400 743882 749486 755247 761561 768803 776880 785568 795137 806109 818471
49402 818471 831701 845476 859714 874048 888065 901993 916209 929961 941616 950505 957554 963647
49390 963647 968263 970366 969875 967527 963907 959347 954293 948993 943064 935955 927665 918644 909318 900147
49376 900147 891789 884769 879229 875338 873537 874001 876286 879905 884760 890522 896119 900560 903913 906751
49362 906751 908914 909547 908203 905159 900739 895130 888946 883237 878558 874511 870590 867142 865085 864804 865680
49347 865680 866748 867518 867950 867833 866624 864107 860790 857242 853196 847878 841263 834519 828979 825046 822259
49332 822259 820146 818701 818216 818791 820002 821127 821907 822891 824652 826844 828593 829737 831000 832872 835024
49317 835024 837055 839185 841780 844748 847879 851431 855894 861351 867411 873662 880007 886706 894207 902849
49303 902849 912737 924011 936924 951264 966041 980349 994364 1008818 1023672 1038127 1051790 1064833
49291 1064833 1076989 1087473 1095995 1102690 1106702 1106051 1099605 1088308 1073991 1057992 1041607 1026648
49279 1026648 1014432 1004791 997040 991296 988016 986927 987426 989585 993708 999189 1004808 1009990 1015045 1020335
49265 1020335 1026026 1032597 1040892 1051618 1064969 1080381 1096337 1110996 1123564 1134400 1143088 1147138
49253 1147138 1143744 1132604 1116126 1097050 1076768 1055799 1034804 1014773 996752 981478 968947
49242 968947 958415 949250 941607 935933 932181 930001 929258 929699 930444 930604 930167 929734 929698 930411 932704 937234
49226 937234 943448 950064 956530 963200 970118 976590 982066 986657 990549 993617 995836 997550 999139 1000895
49212 1000895 1003347 1007191 1012753 1019898 1028506 1038594 1049920 1061988 1074591 1088005 1102509 1117972
49200 1117972 1133947 1149978 1165862 1181769 1197902 1213831 1228464 1241013 1251724 1261371 1270355 1278735
49188 1278735 1286723 1294612 1302476 1310463 1319090 1328776 1339472 1351425 1365944 1384633 1407928 1434997
49176 1434997 1464817 1496617 1529277 1560908 1588978 1610492 1622656 1624545 1618327 1608194 1597807 1588980
49164 1588980 1582286 1577931 1575876 1575796 1577225 1579465 1581570 1582955 1583905 1584936 1585899 1586456 1587307 1590070 1595765
49149 1595765 1604003 1613816 1624715 1636830 1650464 1665666 1681877 1698036 1713413 1728278 1743389 1758968
49137 1758968 1774583 1789754 1804197 1817734 1830535 1843220 1856154 1868823 1880490 1891210 1901688
49126 1901688 1912504 1924121 1937175 1951903 1967583 1983529 2000414 2019682 2041885 2066700 2094515
49115 2094515 2126706 2164086 2206171 2252441 2303463 2359991 2420986 2482641 2539550 2587904 2628633
49104 2628633 2666644 2705020 2739428 2759563 2757132 2732443 2693670 2650790 2609893 2571209 2531002
49093 2531002 2485833 2436099 2385882 2339695 2299863 2266697 2239877 2219033 2203727 2193376 2186878
49082 2186878 2182266 2177524 2172038 2166528 2161372 2155854 2149365 2142400 2135789 2129647 2123666 2117832 2112276 2106872
49068 2106872 2101453 2096045 2090586 2084879 2079105 2073803 2069022 2064065 2058438 2052521 2046952 2041896 2037315 2033377
49054 2033377 2030117 2027122 2024079 2021369 2019785 2019868 2021735 2025208 2029984 2035984 2043665 2053557 2065431 2078331
49040 2078331 2091364 2103829 2114667 2122645 2127443 2129933 2131192 2131869 2132618 2134308 2137437 2141958 2147916 2155531
49026 2155531 2164439 2173699 2182877 2192314 2202012 2211231 2219712 2228329 2237836 2247864 2257925 2268567 2280497
49013 2280497 2293231 2305798 2318453 2332590 2348982 2366999 2385583 2404194 2422637 2440653 2458107
49002 2458107 2475277 2492675 2510625 2529020 2547470 2565702 2583756 2601630 2618845 2634697 2648869
48991 2648869 2661368 2671914 2680027 2685816 2690081 2693369 2695440 2695870 2694660 2691925 2687570 2681611 2674400 2666157
48977 2666157 2656680 2645724 2633345 2619712 2605082 2590110 2575608 2561750 2548101 2534790 2522986
48966 2522986 2513820 2507327 2502886 2500224 2499529 2500933 2504349 2509595 2516359 2524296 2533271 2543197 2553604 2563906
48952 2563906 2574102 2584571 2595042 2604547 2612672 2620166 2628008 2636643 2646528 2658611 2673571 2691122
48940 2691122 2710647 2732135 2756032 2782578 2811705 2843182 2876533 2911231 2947247 2985043 3024937
48929 3024937 3067047 3111813 3159613 3209690 3260501 3311540 3363810 3418050 3473614 3529759 3586868
48918 3586868 3645455 3704970 3764732 3825217 3887263 3950596 4014323 4078355 4143138 4208376 4273211
48907 4273211 4337452 4401497 4465222 4527976 4589591 4650359 4710044 4767912 4823803 4878206 4931206
48896 4931206 4982211 5030917 5077716 5122818 5165692 5205661 5242419 5275623 5304514 5328494 5347786
48885 5347786 5363088 5374689 5382241 5385338 5383893 5377695 5365897 5347525 5322713 5292925 5259549 5222665
48873 5222665 5181799 5137477 5091074 5043266 4993640 4941919 4888548 4833780 4777216 4718685 4658707
48862 4658707 4597690 4535618 4472963 4410889 4349993 4289808 4230212 4172173 4116266 4061570 4007241
48851 4007241 3954275 3904423 3858015 3814167 3772645 3734223 3699452 3668279 3640742 3616949 3596457
48840 3596457 3578587 3563286 3550915 3541399 3534451 3530275 3529200 3530870 3534744 3541112 3550669 3563329 3578470
48827 3578470 3596126 3616777 3640048 3664756 3690323 3717078 3745111 3773913 3803449 3834545 3867715
48816 3867715 3902355 3937495 3972761 4008235 4043862 4079350 4114345 4148573 4182133 4215714 4250171
48805 4250171 4285935 4323103 4361898 4402528 4444708 4487839 4531546 4575564 4619300 4662153 4704219
48794 4704219 4746143 4788243 4830087 4870686 4908648 4942455 4971288 4995449 5015586 5031854 5044437
48783 5044437 5054390 5063008 5070530 5076321 5080208 5082732 5084029 5083343 5079840 5073238 5063538 5050738 5034932 5016186
48769 5016186 4994203 4968575 4939366 4907031 4871877 4834015 4793666 4750927 4705353 4656329 4603708
48758 4603708 4547688 4488371 4426068 4361726 4296306 4229920 4162343 4094199 4026865 3961361 3898091
48747 3898091 3837541 3780349 3726643 3676065 3628385 3583378 3540175 3497583 3455131 3413219 3372369
48736 3372369 3333118 3296419 3263127 3233012 3205255 3180038 3158605 3141507 3127788 3116364 3107367
48725 3107367 3101530 3098903 3098771 3100386 3103250 3107002 3111477 3116681 3122436 3128203 3133516 3138409 3143248 3148271
48711 3148271 3153348 3158106 3162321 3166209 3170266 3174785 3179866 3185914 3193544 3202645 3212164 3221294 3230391 3240034
48697 3240034 3249681 3258082 3264739 3270131 3274683 3278326 3281073 3283339 3285644 3288452 3292218 3297138 3303031 3309813
48683 3309813 3317684 3326386 3334728 3341515 3346608 3350520 3353552 3356049 3358933 3362969 3367811 3372571 3376921 3380782
48669 3380782 3383549 3384721 3384892 3384885 3384158 3381201 3375265 3366528 3354737 3339004 3318920 3294755 3266689 3235036
48655 3235036 3201145 3166823 3132832 3099089 3066055 3034404 3003383 2971217 2937526 2903717 2870548
48644 2870548 2836922 2801850 2766156 2731247 2697331 2663834 2630634 2597802 2564876 2531359 2497489
48633 2497489 2463724 2429893 2395596 2361144 2327489 2295433 2265270 2236957 2210333 2185380 2162522
48622 2162522 2142335 2124886 2109655 2096140 2084187 2073803 2065053 2058056 2052543 2047558 2042105 2035974
48610 2035974 2029403 2022280 2014453 2006553 1999634 1994028 1989330 1985262 1981678 1977960 1973456 1968366 1963185 1957402
48596 1957402 1949931 1940834 1931492 1922970 1915254 1908096 1901457 1895032 1888463 1882204 1877106 1873091 1869349 1865833
48582 1865833 1863328 1861991 1861223 1861220 1863228 1867847 1874362 1882068 1890982 1900909 1911203 1921910 1933728 1946196
48568 1946196 1957253 1965318 1970587 1973549 1973432 1969142 1960798 1949522 1936475 1922774 1909574 1897517 1886577
48555 1886577 1876654 1867518 1857998 1846472 1832574 1817393 1801606 1784737 1766707 1748713 1731714 1715249
48543 1715249 1698592 1682025 1666079 1650601 1635531 1621706 1609876 1599627 1590112 1581181 1573066 1565671
48531 1565671 1558951 1553408 1549473 1547011 1545952 1546764 1549769 1554631 1561041 1569179 1579060 1590081 1601512 1612460
48517 1612460 1620905 1623863 1619457 1608451 1593463 1577372 1562540 1550400 1541037 1533796 1528560 1525676 1524640
48504 1524640 1524126 1523683 1524277 1526857 1531560 1538604 1548518 1560857 1573921 1586117 1596226 1601895 1599671 1587760
48490 1587760 1567724 1542773 1515541 1487980 1461792 1437783 1415896 1396703 1381712 1371439 1364471
48479 1364471 1359282 1355743 1354026 1353405 1353120 1353183 1353518 1353628 1353994 1356368 1361614 1368608 1376152 1384487 1393865 1403316
48463 1403316 1412183 1421311 1431195 1440274 1446665 1450507 1453095 1454810 1455385 1455215 1454860 1453996 1452113 1449414 1445954
48448 1445954 1440905 1433816 1425502 1416556 1406126 1393412 1379202 1364711 1350082 1335254 1320990 1307627
48436 1307627 1294183 1280233 1267413 1257376 1249350 1241404 1233055 1224970 1217126 1209006 1200861 1193121 1185278
48423 1185278 1176759 1168140 1160152 1152399 1144340 1136503 1129338 1121999 1113686 1105132 1097240 1089449 1081018 1072744
48409 1072744 1065747 1059646 1053619 1048142 1043938 1040303 1036334 1032875 1031410 1031788 1032742 1033802 1035118 1036283
48395 1036283 1036890 1037362 1037829 1037259 1035107 1032563 1030707 1028826 1026107 1023377 1021335 1018703 1014187 1008838 1004316
48380 1004316 1000177 995066 989254 983769 978268 971961 965509 959886 954565 948824 943483 939304 935152 929863
48366 929863 924349 919709 915098 909806 905471 903492 902138 899112 895190 892260 889616 885474 880592 876981
48352 876981 874479 871896 870058 870258 871135 870611 869608 870329 872275 873595 874985 878386 883069 886869 890137
48337 890137 894686 900035 904609 909446 916847 926631 937526 950704 967796 987091 1006032 1025631 1047547
48324 1047547 1068587 1083291 1090652 1093304 1091892 1085932 1078704 1075122 1075474 1076873 1079675 1086595 1096815
48311 1096815 1107277 1118858 1135035 1155680 1178494 1204945 1237987 1275692 1314517 1357073 1408871
48300 1408871 1469516 1535594 1610029 1699366 1804313 1923271 2062921 2234641 2443670 2694192
48290 2694192 3001614 3385655 3855111 4415591 5088041 5902055 6878996 8045303 9447287
48281 9447287 11106391 12958781 14893731 16863152 18872199 20792667 22238007 22738487
48273 22738487 22086826 20487435 18373872 16130486 13979947 12030766 10332731 8888360
48265 8888360 7669656 6649650 5809544 5123174 4557251 4088048 3702830 3386154 3118808
48256 3118808 2889563 2695625 2531733 2389028 2263592 2156213 2064182 1981864 1908333 1846106
48246 1846106 1793113 1743601 1696312 1654568 1618872 1586188 1555989 1530472 1509151 1489229 1470998
48235 1470998 1457067 1446547 1435532 1423250 1412541 1404414 1397116 1390504 1386369 1384171 1380992 1376166 1371847
48222 1371847 1368584 1363964 1355809 1343385 1325636 1301804 1273883 1245222 1216740 1187463 1158185 1131097
48210 1131097 1106116 1081138 1055931 1032449 1011232 990753 970525 951754 934626 917906 901545
48199 901545 886940 874272 862136 850087 839113 829445 820325 812043 805755 801067 796185 790632 785614
48186 785614 781591 777772 774114 771454 769435 766597 762892 760002 758772 758296 757769 757331 756839 755754 754570
48171 754570 754507 755509 756236 756160 755961 755845 755337 754774 755105 756029 756269 755790 755826 756475 756383 755195 754298 754497 754815
48152 754815 754286 753233 752147 750876 749683 749567 750781 752342 753592 754959 756581 757561 757313 756447 755676 754897
48136 754897 753937 753153 752713 752258 751725 751580 751828 751825 751448 751434 752100 752786 753056 753430 754392 755588 756641 757899 759773
48117 759773 762003 764217 766684 769927 773947 778249 782364 786214 790263 795352 801996 809824 817966 825836
48103 825836 833229 840182 847334 855881 866329 877691 888798 899894 911951 924940 938091 951494
48091 951494 965893 981032 995748 1009834 1024309 1039523 1054464 1068462 1082224 1096510 1110877
48080 1110877 1124547 1137651 1150887 1164547 1178391 1191962 1204694 1216395 1227980 1240952 1255755
48069 1255755 1271211 1285927 1299541 1312227 1323699 1333353 1340966 1346791 1351193 1354462 1356780 1358187 1358695
48056 1358695 1358219 1356109 1351221 1343157 1333195 1323176 1313666 1304020 1293991 1284089 1274264 1263436 1250766
48043 1250766 1236605 1221804 1206834 1191843 1176893 1161842 1146566 1131434 1116877 1102443 1087104
48032 1087104 1070623 1053766 1036975 1019800 1001928 983843 966043 948478 931226 914889 899774
48021 899774 885400 871339 857852 845170 832855 820513 808564 797676 787848 778635 769931 761997
48009 761997 754957 748676 742884 737213 731465 726065 721761 718620 715777 712560 709390 707179 706277 706392 707148
47994 707148 708270 709476 710580 711557 712319 712720 712925 713393 714243 714957 714997 714416 713727 713404 713627 714183 714512 714172
47976 714172 713292 712186 710632 708109 704768 701478 698770 696380 693966 691490 688724 685259 681442 678446
47962 678446 676808 675640 673999 672356 671836 672471 673227 673531 673826 674576 675586 676556 677754 679762 682823 686652
47946 686652 690744 694768 698729 702802 707043 711479 716478 722670 730236 738532 746718 754565 762373 770350
47932 770350 778425 786526 794622 802477 809693 816045 821567 826265 829965 832568 834256 835325 835812 835391 833756
47917 833756 831060 827839 824398 820413 815385 809411 803225 797455 792077 786611 780599 773859 766584 759359
47903 759359 752917 747731 743861 741088 738957 736836 734359 732005 730873 731621 733789 736323 738641 740980
47889 740980 743828 747276 750969 754586 758229 762295 767008 772241 777897 784227 791574 799810 808209 815880
47875 815880 822342 827843 833206 839098 845292 850811 854939 857788 859703 860588 860271 859135 857735 855908 852886
47860 852886 848361 842966 837567 832464 827257 821174 813570 804472 794660 784910 775329 765784 756769 749151
47846 749151 743026 737492 731801 726256 721694 718419 715975 713793 711852 710730 710978 712424 714276 716069
47832 716069 718213 721326 725385 729981 735106 741036 747667 754574 761682 769320 777748 787164 797945 810206
47818 810206 823320 836732 851103 867678 886477 906071 925311 944248 963132 981575 999184
47807 999184 1015955 1031313 1043610 1051384 1054596 1054021 1050054 1042793 1032695 1020349 1006028 990215 974125
47794 974125 958889 944520 930425 916674 904044 893112 884127 877590 874006 873052 873749 875619 878941
47781 878941 883749 889370 895254 901602 908693 916075 922928 928947 934362 939227 943172 945901 947582 948610
47767 948610 949190 949279 948792 947675 945872 943404 940505 937435 934113 930158 925380 920080 914630 909064 903304
47752 903304 897586 892192 886905 881186 874966 868849 863436 858739 854392 850151 846140 842887 841164 841515
47738 841515 843786 847302 851448 855868 860304 864760 869852 876435 884737 894203 904251 914758 925712
47725 925712 936878 947992 958814 968819 977325 984166 989827 994704 998629 1001305 1002707 1002748 1001066 997500
47711 997500 992410 986185 978769 969966 959847 948607 936359 923400 910298 897472 885070 873454
47699 873454 863296 854838 847636 841393 836517 833414 831848 831525 832731 835734 840118 845457 852162 860761
47685 860761 870687 880791 890915 901979 914482 927834 941276 954575 967541 979639 990537 1000489
47673 1000489 1009797 1018289 1025625 1031718 1036560 1039995 1041992 1042904 1043175 1042912 1041809 1039315 1034905 1028527 1020810
47658 1020810 1012486 1003618 993853 983481 973539 964560 955769 946074 935494 925057 915549 907023 899534
47645 899534 893687 890150 888965 889740 892363 897293 905118 916025 929680 945554 963393 983454 1006273
47632 1006273 1032102 1060584 1091132 1123534 1157889 1193789 1229855 1264344 1296089 1324541 1349100
47621 1349100 1368883 1383167 1391557 1393559 1388465 1376056 1357163 1333236 1305508 1274699 1241181 1205092
47609 1205092 1166596 1126530 1086663 1048849 1013875 981423 951049 922772 896777 873067 851574
47598 851574 832223 814763 798879 784617 772260 761535 751364 740893 730475 721142 713208 706013
47586 706013 699089 692944 688314 685019 682106 678929 675605 672421 669307 666162 663333 661400 660552 660422 660506
47571 660506 660604 660848 661424 662245 662938 663285 663610 664483 665942 667326 668061 668370 668913 669968 671232 672290 672939
47554 672939 673119 672824 672089 670963 669623 668534 668141 668183 667673 665879 663019 659734 656370 653212 650808 649310
47538 649310 647925 645844 643363 641207 639102 636231 632876 630264 628610 626720 623994 621490 620328 620151
47524 620151 620025 619857 619919 619834 619144 618314 618092 618267 618129 617782 617930 618495 618479 617208 614842 611700 607907 603857
47506 603857 600191 597086 594163 591297 589015 587894 587947 588670 589344 589339 588533 587483 586855 586729 586741 586700 586612 586316
47488 586316 585646 584874 584491 584580 584866 585217 585592 585655 585109 584317 583969 584122 584271 584348 584958 586461 588528 590773 593216
47469 593216 595861 598375 600490 602299 603980 605651 607626 610256 613335 616189 618559 620887 623498 626125
47455 626125 628536 631031 633939 637203 640975 646067 653171 661987 671755 682414 694604 708626 723965
47442 723965 739785 755465 770655 785341 799879 814552 828950 842144 853502 863042 870912 876917
47430 876917 880783 882555 882433 880447 876652 871589 866203 861213 856796 852968 849902 847584 845407 842647
47416 842647 839415 836746 835504 835487 835817 835882 835558 834683 832783 829420 824628 819020 813459 808370 803264 797230
47400 797230 790145 783000 776697 770942 764917 758684 753120 748566 744391 740031 735696 731787 728363 725543
47386 725543 723745 723023 722684 722184 722035 723178 725738 729002 732520 736558 741419 746875 752472 758000 763389
47371 763389 768382 772626 776035 778845 781209 782786 782869 781042 777675 773632 769426 764783 759140 752443 745296
47356 745296 738329 731454 723899 715055 705320 695900 687647 680273 672873 665007 656914 648937 641239 634092
47342 634092 627843 622437 617384 612410 607741 603584 599799 596327 593471 591361 589556 587659 585995 585199
47328 585199 585333 585936 586788 588056 589668 591093 591877 592143 592487 593641 596104 599720 603549 606533 608392 609569
47312 609569 610390 610761 610827 611292 612604 614146 614753 613964 612392 610889 609688 608472 606982 605378 604107 603568
47296 603568 603880 604872 606176 607359 608080 608355 608668 609697 611771 614648 617862 621154 624543 628170 632263
47281 632263 637082 642678 648767 655097 661823 669218 677056 684625 691486 697895 704305 710747 716938 722739
47267 722739 728197 733263 737840 742071 746272 750518 754485 757703 759880 761048 761596 762063 762709 763344 763797
47252 763797 764406 765742 767969 770918 774691 779717 786046 793074 800108 806688 811963 814289 812103 805252
47238 805252 795158 783756 772492 762107 752804 744519 737269 731382 727233 724798 723686 723671 724902 727413
47224 727413 730660 733835 736732 740057 744661 750562 756920 763026 768959 775079 781255 786977 791950 796056
47210 796056 798888 800005 799651 798527 796704 793501 788785 783626 779045 774700 769584 763631 757800 752757
47196 752757 748298 744155 740652 738241 736834 735842 734697 733295 732155 732145 733764 736672 740147 743929 748312
47181 748312 753508 759358 765775 773190 782329 793589 806595 820336 833916 847332 861348 876417
47169 876417 892034 907352 922103 936518 950571 963780 975596 985585 993417 999088 1003009 1005540
47157 1005540 1006641 1006331 1005120 1003441 1000999 997293 992501 987081 980842 973400 965410 958244 952248 946366
47143 946366 939869 933511 928438 924708 921524 918344 915200 912405 910422 909624 909747 910067 910512 912005 915145
47128 915145 919113 922691 925957 930072 935522 941447 946838 951627 956288 960886 964946 968003 969883 970525
47114 970525 969780 967513 963786 958866 953014 946336 938839 930545 921519 911937 902275 893168 884826 876765
47100 876765 868394 859720 851075 842353 833086 823260 813505 804350 795776 787602 779850 772598 765918 760101
47086 760101 755548 752318 750193 749165 749307 750151 750905 751465 752475 754156 755864 757245 758996 761921 765837
47071 765837 770041 774236 778358 782027 784970 787580 790353 793091 795307 796986 798235 798643 797876 796632 796030
47056 796030 796195 796358 796313 796796 798282 800351 802519 804961 807973 811399 814948 818629 822520 826576 830943
47041 830943 836072 842162 848831 855652 862665 870062 877662 885050 892015 898558 904651 910375 916131 922357
47027 922357 928946 935267 940887 946143 951882 958585 965882 972927 979226 985036 990946 997198 1003401 1008826
47013 1008826 1013018 1016194 1018945 1021359 1022612 1021792 1019059 1015458 1011557 1006935 1001287 995372 990255 986034
46999 986034 981923 977342 972350 967271 962520 958722 956361 955229 954651 954275 954297 955038 956732 959607 963661
46984 963661 968408 973306 978433 984251 990817 997742 1004897 1012481 1020340 1027860 1034802 1041681 1049075 1057019
46970 1057019 1065294 1073846 1082569 1091016 1098715 1105610 1112027 1118366 1124909 1131669 1138293 1144361 1149798 1154774
46956 1154774 1159252 1163009 1166086 1168739 1170926 1172320 1172912 1173042 1172742 1171698 1170135 1169085 1169368 1170849 1173065
46941 1173065 1176021 1179790 1183820 1187400 1190610 1194160 1198415 1203128 1208071 1213332 1218895 1224436 1229725 1234953
46927 1234953 1240546 1246810 1253760 1261149 1268706 1276470 1284701 1293288 1301498 1308668 1314927 1320817 1326330 1330794
46913 1330794 1333614 1334575 1333439 1329892 1324204 1317437 1310610 1303869 1296764 1289092 1281122 1273231 1265701 1258890
46899 1258890 1253220 1248893 1245811 1243941 1243712 1245913 1251152 1259362 1269844 1281823 1295017 1309626 1325811
46886 1325811 1343271 1361357 1379503 1397436 1414999 1431879 1447583 1461771 1474599 1486586 1497932
46875 1497932 1508037 1515949 1521421 1525256 1528445 1531208 1533217 1534587 1536081 1538224 1540701 1543015 1545497 1549180
46861 1549180 1554732 1561884 1570008 1578865 1588582 1599134 1610199 1621475 1632916 1644588 1656395 1667955
46849 1667955 1678657 1687826 1695005 1700222 1703966 1706740 1708500 1708633 1706620 1702711 1697735 1692254 1686134 1679112
46835 1679112 1671452 1663744 1656231 1648797 1641547 1634978 1629483 1625085 1621803 1619915 1619695 1621252 1624773 1630529
46821 1630529 1638322 1647322 1656924 1667565 1680168 1694847 1710598 1726271 1741443 1756293 1770986 1785369
46809 1785369 1798960 1811047 1820922 1828179 1832787 1834943 1834936 1833035 1829273 1823402 1815363 1805783 1795763 1786054
46795 1786054 1776649 1767171 1757390 1747283 1736950 1726736 1717282 1709201 1702622 1697167 1692296 1687709 1683486
46782 1683486 1679959 1677315 1675294 1673376 1671412 1669948 1669749 1670963 1672869 1674496 1675371 1675618 1675456 1674878 1673885
46767 1673885 1672804 1672117 1671995 1672235 1672673 1673473 1674983 1677510 1681258 1686225 1692062 1698322 1705070 1713014 1722730
46752 1722730 1733850 1745276 1756193 1766695 1777402 1788630 1799984 1810710 1820395 1829254 1837684 1845722
46740 1845722 1853130 1859794 1865627 1870176 1873026 1874733 1876659 1879424 1882073 1883321 1883207 1882942 1883480 1884986 1887423
46725 1887423 1890817 1894882 1899153 1903643 1908847 1914925 1921406 1927853 1934308 1940880 1947283 1953011 1957674 1961089
46711 1961089 1963346 1964773 1965381 1964369 1960711 1954371 1946331 1937250 1926684 1913930 1899047 1882608 1864918
46698 1864918 1846001 1826035 1805331 1784091 1762526 1740958 1719467 1697788 1675953 1654763 1635079
46687 1635079 1616865 1599473 1582726 1567052 1552545 1538571 1524640 1511201 1499178 1488874 1479718
46676 1479718 1471021 1462712 1455197 1448731 1443131 1438138 1433817 1430485 1428323 1427206 1426864 1427086 1427860 1429499 1432521
46661 1432521 1437190 1443243 1450322 1458550 1468285 1479374 1491101 1502907 1514683 1526253 1537140 1547088
46649 1547088 1556316 1564857 1572077 1577291 1580573 1582539 1583602 1583885 1583657 1583367 1583310 1583644 1584605 1586347 1588708 1591581
46633 1591581 1595463 1601210 1609253 1619419 1631520 1645686 1662006 1680186 1699679 1719932 1740454 1760859
46621 1760859 1780884 1800132 1817829 1833093 1845474 1854964 1861500 1864747 1864405 1860435 1852898 1841926 1827986
46608 1827986 1811975 1794835 1777118 1758923 1740078 1720443 1700288 1680385 1661483 1643652 1626476
46597 1626476 1609890 1594436 1580596 1568251 1557034 1546784 1537327 1528126 1518610 1508769 1499120 1490173
46585 1490173 1482190 1475248 1469122 1463154 1456624 1449389 1441943 1434879 1428493 1422841 1417821 1413162 1408634 1404372
46571 1404372 1400720 1397661 1394765 1391822 1389218 1387399 1386145 1384678 1382385 1379349 1376237 1373797 1372321 1371502
46557 1371502 1370904 1370609 1371074 1372310 1373633 1374505 1375234 1376469 1378289 1380335 1382548 1385189 1388301 1391763 1395872
46542 1395872 1401210 1407823 1415145 1422874 1431330 1440730 1450713 1460886 1471332 1482283 1493784 1506064 1519668
46529 1519668 1534743 1550636 1566741 1583390 1601373 1620926 1641717 1663468 1685915 1708469 1730646
46518 1730646 1752730 1775330 1798310 1820799 1842174 1862355 1881121 1897915 1912533 1925352 1936610
46507 1936610 1946014 1953336 1958945 1963346 1966550 1968161 1967870 1965710 1962115 1957877 1953710 1949681 1945324 1940415
46493 1940415 1935304 1930348 1925413 1920147 1914375 1907998 1900729 1892171 1882024 1870141 1856629 1841938 1826565
46480 1826565 1810554 1793542 1775345 1756174 1736216 1715372 1693513 1670699 1647114 1623148 1599548
46469 1599548 1577042 1555695 1535087 1515175 1496513 1479587 1464572 1451827 1441891 1434649 1429288 1425528
46457 1425528 1424214 1426097 1430688 1437042 1445103 1455299 1467087 1478951 1489964 1500562 1511532 1522851
46445 1522851 1533813 1543878 1553003 1561363 1569000 1575742 1581415 1586086 1589984 1593080 1594925 1595077 1593619 1591160
46431 1591160 1588399 1585823 1583623 1581813 1580565 1580390 1581700 1584153 1586899 1589660 1593175 1598355 1605425 1614146
46417 1614146 1624400 1636205 1649560 1664726 1682257 1702326 1724413 1748152 1774044 1802774 1834171
46406 1834171 1867421 1901914 1937245 1972762 2007909 2042712 2077050 2109679 2139017 2164879 2188368
46395 2188368 2209851 2228070 2241683 2250684 2255625 2256277 2252131 2243917 2233651 2222933 2211651 2198592
46383 2198592 2183042 2165624 2147638 2129804 2111820 2093266 2074668 2057314 2042061 2028805 2017203
$$ [...]
##END NTUPLES=NMR SPECTRUM
##END=
