##TITLE=AC1712_14FALM0001_8743523_LyKpv0qBwT
##JCAMPDX= 6.0         $$ Bruker NMR JCAMP-DX V2.0
##DATA TYPE= NMR SPECTRUM
##DATA CLASS= NTUPLES
##ORIGIN= BRUKER
##OWNER= Administrator
$$ 1.72 TOPSPIN		Version 2.1
$$ 2015-08-11 20:29:48.945 -0700  Administrator@X
$$ Compression mode = diff/dup
##.OBSERVE FREQUENCY= 400.02188249412
##.OBSERVE NUCLEUS= ^1H
##.ACQUISITION MODE= SIMULTANEOUS (DQD)
##.ACQUISITION SCHEME= undefined
##.AVERAGES= 8
##.DIGITISER RES= 22
##SPECTROMETER/DATA SYSTEM= spect
##.PULSE SEQUENCE= zg30
##.SOLVENT NAME= COFFEE_meoh
##.SHIFT REFERENCE= INTERNAL, COFFEE_meoh, 1, 14.98509
##AUDIT TRAIL= $$ (NUMBER, WHEN, WHO, WHERE, PROCESS, VERSION, WHAT)
$$ ##TITLE= Audit trail, TOPSPIN		Version 2.1
$$ ##JCAMPDX= 5.01
$$ ##ORIGIN= Bruker BioSpin GmbH
$$ ##OWNER= Administrator
$$ $$ E:\/data/COFFEE/nmr/AC1712_14FALM0001_8743523_LyKpv0qBwT/70/pdata/1/auditp.txt
$$ ##AUDIT TRAIL=  $$ (NUMBER, WHEN, WHO, WHERE, PROCESS, VERSION, WHAT)
(   1,<2015-08-11 20:29:41.523 -0700>,<Administrator>,<X>,<go>,<TOPSPIN 2.1>,
      <created by zg
	started at 2015-08-11 20:28:35.085 -0700,
	POWCHK enabled, PULCHK disabled,
       configuration hash MD5:
       21 0F 79 D6 B3 7B B4 F6 88 20 88 DB 03 48 BD 9F
       data hash MD5: 64K
       87 3A B4 14 F3 4F 62 0B EB F5 D7 50 20 09 60 8A>)
(   2,<2015-08-11 20:29:44.804 -0700>,<Administrator>,<X>,<proc1d>,<TOPSPIN 2.1>,
      <Start of raw data processing
       efp LB = 0 FT_mod = 6 PKNL = 1 PHC0 = 0 PHC1 = 0 SI = 32K 
       data hash MD5: 32K
       1D 98 B6 81 41 9C B7 CE 63 AD 4D 56 E0 5D CA C9>)
(   3,<2015-08-11 20:29:45.101 -0700>,<Administrator>,<X>,<proc1d>,<TOPSPIN 2.1>,
      <pk PHC0 = 86.88538 PHC1 = 0 
       data hash MD5: 32K
       5E 86 73 83 50 DE 96 C2 DD B6 05 87 4D 2A 6D 82>)
(   4,<2015-08-11 20:29:45.226 -0700>,<Administrator>,<X>,<proc1d>,<TOPSPIN 2.1>,
      <abs ABSG = 1 
       data hash MD5: 32K
       7F 16 BD 6B 50 34 BD 9B 27 D5 31 FB 9C BD 8D FB>)
(   5,<2015-08-11 20:29:45.273 -0700>,<Administrator>,<X>,<proc1d>,<TOPSPIN 2.1>,
      <abs ABSG = 2 
       data hash MD5: 32K
       2F 02 E2 5B 06 61 D6 DA 34 D1 CC F9 F1 F3 6A CC>)
(   6,<2015-08-11 20:29:45.335 -0700>,<Administrator>,<X>,<proc1d>,<TOPSPIN 2.1>,
      <abs ABSG = 3 
       data hash MD5: 32K
       F7 D2 91 3B A6 2C 19 58 9B 94 23 44 2B 9B 78 70>)
(   7,<2015-08-11 20:29:45.398 -0700>,<Administrator>,<X>,<proc1d>,<TOPSPIN 2.1>,
      <abs ABSG = 4 
       data hash MD5: 32K
       3D 56 84 DD 1A D8 B3 02 05 0C 01 E3 EC 9D 5C 4C>)
(   8,<2015-08-11 20:29:45.460 -0700>,<Administrator>,<X>,<proc1d>,<TOPSPIN 2.1>,
      <abs ABSG = 5 
       data hash MD5: 32K
       D7 06 33 05 61 A9 23 30 BD 06 72 B0 6E 3C DC 64>)
$$ ##END=
$$ 
$$ $$ hash MD5
$$ $$ 72 19 10 9E D4 D5 6C 3F 3F 75 E0 1F A9 F4 3B 7C
##$RELAX= 
##$RELAX= 
##$RELAX= 
##$RELAX= 
##$RELAX= 
##$RELAX= 
##$RELAX= 
$$ Bruker specific parameters
$$ --------------------------
##$DU= <E:\>
##$EXPNO= 70
##$NAME= <AC1712_14FALM0001_8743523_LyKpv0qBwT>
$$ [...]
150 150 150 150 150 150 150 150
##$TP07= 0
##$TPNAME0= <>
##$TPNAME1= <>
##$TPNAME2= <>
##$TPNAME3= <>
##$TPNAME4= <>
##$TPNAME5= <>
##$TPNAME6= <>
##$TPNAME7= <>
##$TPOAL= (0..7)
0.5 0.5 0.5 0.5 0.5 0.5 0.5 0.5
##$TPOFFS= (0..7)
0 0 0 0 0 0 0 0
##$TUNHIN= 0
##$TUNHOUT= 0
##$TUNXOUT= 0
##$USERA1= <user>
##$USERA2= <user>
##$USERA3= <user>
##$USERA4= <user>
##$USERA5= <user>
##$V9= 5
##$VALIST= <valist>
##$VCLIST= <CCCCCCCCCCCCCCC>
##$VD= 0
##$VDLIST= <DDDDDDDDDDDDDDD>
##$VPLIST= <PPPPPPPPPPPPPPP>
##$VTLIST= <TTTTTTTTTTTTTTT>
##$WBST= 2048
##$WBSW= 25
##$XGAIN= (0..3)
0 0 0 0
##$XL= 0
##$YL= 0
##$YMAX_a= 578859
##$YMIN_a= -505998
##$ZGOPTNS= <>
##$ZL1= 120
##$ZL2= 120
##$ZL3= 120
##$ZL4= 120
##$ABSF1= 14.98509
##$ABSF2= -5.573092
##$ABSG= 5
##$ABSL= 3
##$ALPHA= 0
##$AQORDER= 0
##$ASSFAC= 0
##$ASSFACI= 0
##$ASSFACX= 0
##$ASSWID= 0
##$AUNMP= <proc_prof1d_extract_pilot.lims>
##$AXLEFT= 0
##$AXNAME= <>
##$AXNUC= <1H>
##$AXRIGHT= 0
##$AXTYPE= 0
##$AXUNIT= <>
##$AZFE= 0.1
##$AZFW= 0.1
##$BCFW= 0
##$BC_mod= 0
##$BYTORDP= 0
##$COROFFS= 0
##$CY= 15
##$DATMOD= 1
##$DC= 0
##$DFILT= <>
##$DTYPP= 0
##$F1P= 0
##$F2P= 0
##$FCOR= 0.5
##$FTSIZE= 32768
##$FT_mod= 6
##$GAMMA= 0
##$GB= 0
##$INTBC= 1
##$INTSCL= 1
##$ISEN= 128
##$LB= 0
##$LEV0= 0
##$LPBIN= 0
##$MAXI= 10000
##$MC2= 0
##$MEAN= 0
##$ME_mod= 0
##$MI= 0
##$NCOEF= 0
##$NC_proc= -8
##$NLEV= 6
##$NOISF1= 0
##$NOISF2= 0
##$NSP= 0
##$NTH_PI= 0
##$NZP= 0
##$OFFSET= 14.98509
##$PC= 1
##$PHC0= 86.88538
##$PHC1= 0
##$PH_mod= 1
##$PKNL= yes
##$PPARMOD= 0
##$PPDIAG= 0
##$PPIPTYP= 0
##$PPMPNUM= 2147483647
##$PPRESOL= 1
##$PSCAL= 4
##$PSIGN= 0
##$PYNMP= <proc.py>
##$REVERSE= no
##$SF= 400.02
##$SI= 32768
##$SIGF1= 0
##$SIGF2= 0
##$SINO= 400
##$SIOLD= 32768
##$SPECTYP= <>
##$SREGLST= <1H.CDCl3>
##$SSB= 0
##$STSI= 32768
##$STSR= 0
##$SW_p= 8223.68421052631
##$SYMM= 0
##$S_DEV= 0
##$TDeff= 65536
##$TDoff= 0
##$TI= <>
##$TILT= no
##$TM1= 0
##$TM2= 0
##$TOPLEV= 0
##$USERP1= <user>
##$USERP2= <user>
##$USERP3= <user>
##$USERP4= <user>
##$USERP5= <user>
##$WDW= 1
##$XDIM= 32768
##$YMAX_p= 442617995
##$YMIN_p= -659669
##$CURPLOT= <Network HP LaserJet P1505>
##$CURPRIN= <$Network HP LaserJet P1505>
##$DFORMAT= <normdp>
##$LAYOUT= <+/1D_H.xwp>
##$LFORMAT= <normlp>
##$PFORMAT= <normpl>
##$SURQMSG= 1
$$ End of Bruker specific parameters
$$ ---------------------------------
##NTUPLES= NMR SPECTRUM
##VAR_NAME=  FREQUENCY,     SPECTRUM/REAL,   SPECTRUM/IMAG
##SYMBOL=    X,             R,               I
##VAR_TYPE=  INDEPENDENT,   DEPENDENT,       DEPENDENT
##VAR_FORM=  AFFN,          ASDF,            ASDF
##VAR_DIM=   32768,         32768,           32768
##UNITS=     HZ,            ARBITRARY UNITS, ARBITRARY UNITS
##FACTOR=    0.250966925370066, 1,           1
##FIRST=     8223.43324360094, -66032,       -67268
##LAST=      0,             25112,           -32394
##MIN=       0,             -659669,         0
##MAX=       8223.43324360094, 442617995,    0
$$ Real data points
##PAGE= N=1
##DATA TABLE= (X++(R..R)), XYDATA
$$ [...]
23869 14941 -33926 -86133 -156119 267859 61367 -20035 59336 -121722 205534 -135202 215370
23857 63251 54569 -262044 -468822 -244019 -161184 -124982 -118580 5789 8019 77065 -34289 63120
23844 -184901 19763 179564 133735 195063 -97022 -13246 -114646 171700 -35404 -76805 9452
23832 154679 294350 -44739 -143281 2548 207600 212642 337590 110468 -321153 -147533 -72287
23820 -174478 -56606 -136857 136691 -254018 -16350 -17721 40064 -261869 -235514 -148981 294370
23808 -148807 212572 -4380 325472 81161 139151 -83707 -309766 -9567 -87857 211014 -16794
23796 74290 -427033 -450935 222631 -232273 -194714 9270 38375 -177278 203277 -57507 -52591
23785 -52591 -37614 130155 -49080 29006 -458731 70157 -166991 113220 154631 -229205 220292
23773 73806 -156569 -178370 -31821 -10510 139669 94458 -194306 253034 -301138 126536
23762 298874 33819 -280666 -152230 -18652 -13298 -72258 -2645 -27803 78352 -18418 -263460
23751 -263460 -12619 -97950 -36412 57580 -46145 57070 75861 -186697 -128220 234372 233352
23740 233352 -189515 179674 71108 -80328 -73324 -58168 -26925 10591 42198 242710 -16577
23728 209037 109275 -144903 21687 -70737 35055 -124977 52143 -189247 -153396 -99395 36037
23716 179424 -221010 105362 191415 -94628 92508 -76700 111330 196808 -110040 23001 83795
23705 83795 -305111 -14543 84263 -146878 40334 436703 12580 -14984 97228 268849 -413382
23693 58955 97166 150875 221551 126778 -27170 -221797 -51940 -248150 70780 -46201 107080
23681 121128 -103759 95350 125715 -244635 -6650 -77270 82218 68543 108935 150556 -70310
23669 -93621 -40265 -226232 159160 -150987 -223288 189649 -202242 324275 -112597 81779
23658 -103398 -110361 -225890 63440 164905 -110494 -28574 -264004 -111058 181518 -33562
23647 12581 -69724 76353 132061 8777 70324 -164781 110314 -7723 -177448 125970 -143509
23635 -152184 201293 933 113144 -228297 -109243 136437 51752 -147045 -200014 171628
23624 2241 -241625 220842 176150 -130278 -34201 106610 69255 91272 -46679 128289 -262325
23612 54370 95159 195615 -84955 -38520 -17533 -96892 235 -73060 -51707 -190759 148231
23600 -382587 -164384 -25598 -183729 -67394 -306077 -190941 -355464 -56322 39513 -145372
23589 154372 37321 -114290 136871 -223888 -15449 -261107 16484 26437 125079 393763 -19218
23577 330236 -132394 184142 43809 -46981 -70786 -51336 -56281 25857 158829 63686 -25581
23565 -159455 -19190 100145 -125061 122661 -2671 -91529 -81178 -68660 163412 -220780 -20310
23553 -439144 115686 -125413 -103741 33816 -96401 -295156 262859 192694 -2733 -267771 -15758
23541 -240661 359670 -214014 148121 123939 -317446 -83358 -9151 122700 -166387 -201914
23531 -201914 119177 -78566 -77359 -124831 -217752 -14532 14229 116013 -87219 -1757 -72613
23520 -72613 -188708 -221599 -63666 217771 -189305 -179100 -86143 -67257 1096 -35716 365586
23508 156062 339424 -160550 42011 -27563 104846 6016 -63630 236258 -120789 -35407 -36183
23497 -36183 -629003 81016 -525546 -56334 -177873 71994 -35537 230956 -154588 -299749
23487 -299749 48071 -156474 -197773 -24668 -270463 17542 -79606 -176235 258751 7262 11048
23476 11048 175700 -91148 -172612 -70110 -99283 -50143 200250 -154555 -44391 109593 -23846
23464 292811 148867 16848 32554 142935 -210490 -226367 55484 -160423 -129784 -246360
23454 -246360 144501 -213253 314477 -194249 90354 73315 91903 -215525 156037 -57205
23443 206981 84782 -145573 -112504 -403941 -153593 -31897 183377 -307622 -216768 50227
23432 -177220 -216524 239760 -230943 -262441 -24916 -68074 105901 220566 -165248 -75595
23421 206584 18770 222000 -168821 -48288 -128053 -327255 -338191 -90946 30341 -239114 16461
23409 127243 -191028 112877 -33182 -183535 70526 374974 80921 -36213 195425 -156309
23398 -149407 91825 167585 -156988 -49186 4174 212377 11704 -108811 54351 -112684 72793
23386 121982 -257466 -171159 105635 378261 59915 -170685 -55186 134523 308672 228481
23376 228481 93124 -313 404432 79898 110398 -441432 -156571 -80564 -71035 -49251 424100
23364 26264 -13225 -178844 -353426 164124 -262885 21117 -79978 -60707 73942 -38126 42694
23352 -13035 153360 -19595 -251200 5244 -201243 -144551 -191374 71253 -145882 356720 -123972
23340 -384919 -83409 -172066 -70997 -31905 117285 15137 -1640 90945 91850 161230 -107462 83425
23327 -72671 85042 -220842 205032 122836 16236 -82969 410291 -78317 -302620 29925 230359
23316 230359 -179619 35729 -28832 -137054 -46119 -118660 146713 -55347 -70300 -86571 396626
23304 438 -35146 -26674 -346118 -51771 33755 47491 105347 -78537 12335 51276 134915 -46801
23291 240898 -10962 151372 136396 -210425 -102234 -48377 -124305 30426 94805 -133336 -70255
23280 -70255 -90246 49796 -102337 -23971 168271 -272758 97896 -89922 -137859 126614 -204205
23268 79076 82261 -103977 -50993 91451 -108890 -105318 -383363 -193431 53738 -225779 59429
23256 -98694 80316 -143774 -163686 -41087 79242 3847 -63500 -96683 -17652 -131530 -18283
23244 26675 42243 -136959 89264 87194 -133462 -83333 130310 51031 41148 -88950 -259226
23233 -259226 -200314 -13171 -172831 -29285 201170 181903 -33329 8032 -259650 -240273 -51352
23221 61130 85756 -204520 -107232 -157558 -99748 -347980 199235 -147010 -268300 -61411 -158528
23210 -158528 25054 -17619 -301720 171748 -13269 -102435 37667 42869 -151967 166950 -104792
23198 -218737 -177342 156246 59929 -16287 -302738 -258798 496907 33791 -114400 -51948 -120167
23187 -120167 -202833 -45367 -81168 -222873 -185241 -178912 -141832 46427 -74862 -328811 30538
23175 -63448 -363046 -338720 -114420 1687 164307 -104556 -132969 127041 -300723 -194418
23165 -194418 75401 27043 8197 -212865 135279 -96736 -203173 -178935 -201245 -195441 108530
23153 -135429 316975 -67740 273568 15955 -71363 -16626 315383 47010 -393720 130625
23142 -412683 -124316 106791 -375593 154911 -338779 -236714 153811 49268 209001 103977
23131 147977 -35748 236235 -195569 -125105 142942 94302 225486 92260 87460 35031 -41502
23119 2617 17233 -120143 88366 -53089 41475 73288 130042 -46558 41596 -185409 276679
23107 16730 41915 -78240 51553 127044 65735 89957 -145164 -227939 -210144 -94686 -22356
23095 -196735 221215 231819 356496 93444 28873 163037 171002 55305 -221019 86275 -151357
23083 -73813 -27827 -132910 290962 -130398 -121173 223363 131643 243221 -145408 -396926
23073 -396926 36755 -516609 -243786 -133383 -356197 3584 98530 232110 -221360 -140779
23063 -140779 188375 -152308 3277 -99528 94645 75547 170124 -20715 -298041 -371657 -162933
23051 140916 -43005 150716 -147237 -188875 234437 25536 100232 128577 -94171 -28896 -49791
23040 -49791 228484 -60685 -327262 299486 34829 -110150 -80570 -56952 280065 101125
23029 199554 33055 25353 138346 -261070 -130168 -243651 -138224 130621 130886 163886 -4015
23017 -28259 21861 -222975 20374 -197368 87815 102480 47816 -212062 -564 -131396 -48415
23005 -173318 -224645 -146126 411876 -158064 162376 -151139 253137 104635 286975 -99821
22994 -71800 -154555 -252243 158115 -205095 -228080 50712 -79745 -210251 255717 -42574 73098
22982 -428150 -128187 203354 -79154 -170707 -7066 -55522 116901 382710 -240700 -77869 -93786
22971 -93786 -214205 8030 -150039 -133080 -314161 -71141 76572 111641 235960 29109 232475
22960 232475 266703 -57998 164527 141972 19037 110318 136689 187342 -310364 -51279 140544
22948 -37199 -224246 -20594 -207251 79099 148907 -5809 292235 141209 297883 -252012 85636
22936 53951 -152004 -114652 112706 116755 -22006 183245 39704 164788 37415 -70831 38147
22924 -112829 -330498 123163 -191827 -155149 19441 127679 -200823 67826 -42191 -157735
22914 -157735 -232546 -250609 -46064 216081 -176036 -15734 -245819 -69872 115293 154230 11739
22902 190940 -3528 -248832 95128 -147610 -50269 -121504 40636 -86499 237556 4242 -36525
22890 -63985 -115487 -91664 -152166 -56363 186709 -114969 -2873 43832 60149 -250788 -128279
22879 -128279 -128435 194759 -59372 -76113 5705 -65360 273310 97925 -313174 95573 -95562
22867 -302937 6278 -24947 -238514 -240041 -16367 -43557 -86430 -423125 115657 77291 83175
22856 83175 239922 384119 -290098 46441 39058 -191330 -1210 -940 119121 -400350 -192400
22844 -293405 41910 -351802 -257200 -264635 21003 -122509 48107 -167687 -187265 143624 78283
22833 78283 -61302 214421 5219 138190 -133548 125481 -200623 -136564 -85432 -87840 -72926
22822 -72926 -281091 -255633 244189 23547 2268 101273 -35628 8556 295615 -244565 -4323
22810 -101484 209668 -121569 -12626 151430 -197341 55703 -83618 -131188 -36725 -82220 -164490
22799 -164490 1660 -155673 -96220 115634 -35397 172647 254798 -8686 -79490 169093 -65645
22787 6840 -82956 -24907 -42070 95582 -74770 87804 127617 37392 -159748 -238332 -153941 -165598
22775 -165598 68669 -136020 -76976 -123004 -20432 44047 159706 55918 -96899 -150528 92243
22763 114823 -5362 47743 119972 -406210 9216 -234755 12393 -64428 -304415 183088 228855
22752 228855 4907 -230574 6136 31493 137349 -343007 -200607 146708 -83786 -208024 180459
22740 -124730 -75663 177188 -129254 -99033 181037 -13483 -136342 161252 149409 -162486
22729 -220555 35784 18872 303927 -119979 106258 -425354 233434 141703 -47096 -255946
22719 -255946 -79502 158253 -186518 95155 -158018 157143 -134348 -28106 -144049 33989
22708 -97322 -553096 252458 71420 19190 -12641 -77036 -298210 194772 97468 -269963 223750
22696 -163151 -50916 -262774 299495 -363815 421237 58136 -235174 -163532 -113491 76818
22685 -127561 -117773 -4596 53499 -71220 -117832 213812 84024 -185625 1178 -112655 110802
22673 -36373 -22514 -159579 39241 135866 156356 36656 -225295 -69141 146579 -238905 -29685
22661 248414 -48142 -190104 -189384 43579 -91072 -95885 64112 23037 -174386 -435374 145022
22649 -261661 -143600 114432 4636 460454 -189574 -112477 157195 -168248 193739 -163604
22638 -96625 106715 89456 83768 -68788 -35888 66158 -86330 -96568 -150088 -20756 -102704 142530
22625 -366610 -140041 64487 -73914 200687 -106670 193900 334689 148190 -168361 108104
22614 -118644 146237 -13696 -72197 -84606 96834 314457 45831 -20581 -146963 -499721 230053
22602 -344865 22311 46032 205420 122036 -111364 -90262 -65791 223939 -23307 -25919 70902
22590 -124208 -111788 170220 17804 124704 66054 -156799 246637 44755 31594 -158356
22579 -127908 -140352 43150 -159233 -372298 -69746 -133031 77561 -146721 304231 348518 63392
22567 -86041 -113636 -7805 121247 191461 121975 94651 -83216 -103630 176066 -169740 -339097
22556 -339097 66241 190105 -157547 106043 233751 26081 -196869 -189083 8095 -69589 129063
22544 88354 127590 121411 267122 38011 -216478 -282260 126732 -67791 56678 29652 75373
22533 75373 19788 93172 316909 -178448 -326968 18643 199828 -76428 25315 -201383 -170336
22522 -170336 -152912 -158200 50773 394140 -366190 106287 25145 -58176 55151 -142193 41882
22510 13979 -133393 -57938 108559 -133411 -49232 -160195 -214442 43962 -189279 72945 -220549
22498 -383182 115368 13328 105850 100724 166982 -258295 -272107 104323 339546 -420878 -6845
22486 -121191 -337333 -127498 -66980 -191395 53026 248969 148803 -95971 30479 -197093
22475 -180217 136465 -322659 32248 -192176 69804 45193 -15299 -111803 -301708 -83048 292847
22463 -67320 -308899 -188171 247963 -23779 -158878 -22817 -169775 171049 106806 -128443
22452 -390484 231445 30412 -321997 -84846 -193230 152695 -138899 210535 -170519 30289
22441 31889 -341456 -273317 254813 -272005 -21673 15739 499 15573 -68004 -81024 -99990
22430 -99990 208549 -123227 162406 -43007 190928 -89166 186127 -140610 -158935 -95057
22420 -95057 114482 25466 269531 37025 86355 -143172 -177298 22952 -130667 187457 -108046
22408 -276383 -245379 -111330 -156457 -248022 -223883 -251973 -348003 44135 -17990 57321 -146988
22396 163921 16159 -33487 -35008 -33579 218710 54397 197539 82392 20518 -85623 -164876
22385 -164876 83549 -191730 -104596 58702 -326566 -61913 -180757 -41884 80730 -94532 126007
22373 112228 24347 -46609 18230 -220094 -45790 -75227 403167 110410 -185339 37396 213797
22362 213797 -82096 -95877 -55068 -331415 -39882 -37422 -58437 298844 -25633 -254544 -239535
22351 -239535 -139931 172506 -221203 -401457 21931 -18377 -132584 22555 -128472 2085 16905
22340 16905 -10945 119528 99592 -87536 210375 25360 -134383 262719 -210555 -105438
22330 -105438 -303753 190419 -85086 35009 -137109 198123 22776 235214 -299799 371866
22319 -48174 -362290 -12122 -55195 -279240 -159084 54813 -308972 194493 158758 28413 -31509
22307 111734 -109784 -170992 193169 -386856 -197566 -162493 -166958 -182912 85014 64418 -9366
22295 60739 -92184 52528 -317928 -218899 -42196 -3760 167159 279383 -105807 -310201 -130785
22283 -153924 54108 131104 -125138 -229740 67342 398599 74908 4386 -202603 -51792 185937
22271 -5331 70796 -3668 -74620 -235513 -98569 72084 -120833 -118731 61198 -110404 -524080
22260 -524080 -116177 287901 -145640 -112085 49515 108374 -1616 13998 -230814 273932 226589
22249 226589 -369827 158927 -125938 -87713 267332 -101051 131832 103270 294070 68215
22238 75520 14563 -1572 220751 -43839 123690 -88502 57624 -94451 -225857 214527 161921
22227 161921 -170408 -297564 -156379 13036 -51603 -168683 -36174 -80448 -320942 -7313 164645
22215 -328963 -264316 -209671 173787 519244 -260686 97579 28203 -177922 85169 -47509 -176313
22204 -176313 -89687 80265 -121796 33146 21017 -167091 82461 -85440 -360715 291992 -230794
22192 -223642 -194864 -225746 -258041 145766 -173443 269533 58755 180198 135243 -159250
22181 -231550 165774 -81241 215382 91894 35070 -10271 157545 -23397 -170235 -193801 -148303
22170 -148303 76362 -210506 -87753 259054 227275 -96964 -100214 -181051 19720 142186 -95977
22158 62840 -17663 -28843 -45951 59311 25421 23087 146290 92833 -62366 -357087 -90494
22146 -34155 142127 12310 -180961 -71471 -90274 -66667 -2164 -268194 271702 -158066 -131661
22135 -131661 -39210 -291497 102654 -117793 -198197 58403 185898 -123098 153894 118829
22125 118829 -15979 -27254 -48225 -94020 -23976 2258 156544 104261 -76224 109774 56802
22114 56802 -88703 -143366 -80031 -44677 -27515 -5848 -309859 6405 103998 84775 2931 -129233
22101 87121 218022 -42000 -158590 -161854 -318073 -91181 -33143 -32726 17835 -149117 103289
22089 -29530 -59071 -234724 -296845 116375 -120679 -158978 40985 133171 -23890 24052 58616
22078 58616 -217437 -84222 -120679 -291632 36843 191951 -164341 -35099 -65370 289302 -283849
22066 148889 429005 -180657 -317798 -213891 42452 -562853 80513 307692 141834 -162519
22055 51264 -143565 -254599 -116903 -189558 -296346 -143934 105932 74430 -130952 -345769
22045 -345769 -47346 -141030 -60394 26265 -87690 -142654 -327290 -102651 -70252 -91613 10810
22033 343256 162357 -15795 -346437 -203545 53729 11980 -63112 58746 -293226 -258900 35489
22021 39005 28359 -26746 -168315 162500 -31988 -59131 131194 -74753 144527 -147078 -18252
22009 -74118 236268 -111330 144251 -280415 -231122 -51370 -3275 184199 -58418 -85719 217001
21997 -178170 148389 105793 -108472 -228379 81071 320650 -290505 -129729 -102303 -18318
21986 415129 89054 163757 -175089 -355871 -151938 -4450 -110137 -129325 -127943 64922 -81727
21974 -146868 111926 160985 -12248 -171067 -155799 -239561 -247625 92307 19466 66658 -214535
21962 -27938 81997 -31344 -133334 -272368 57317 -107902 -32279 205463 69095 8880 -433268
21950 13279 145455 -198086 4502 415805 148397 250667 14454 -102983 -182561 150452
21939 -125853 -84790 165511 -91597 437396 304 -214878 -88799 351569 17161 -162223 -128592
21928 -128592 -97189 -157360 273600 -97876 45369 -11191 -64991 349809 39302 -241868 -175686
21917 -175686 -71150 126148 62840 22284 -45685 84829 -71303 213527 -110597 175757 230703
21906 230703 72176 56154 -171232 -115106 -98707 -181252 -215864 -21425 49442 -53006 -2135
21894 38558 -55995 -172196 56102 -64265 83515 -178561 -86496 -74448 -427402 -50789 -336106
21883 -336106 -113120 20151 -149261 -34060 165941 54963 -32651 -36187 34371 -78877 -145284
21872 -145284 -265982 62788 -77563 -135395 42257 30447 -59172 -357138 -214378 -389672 -298948
21861 -298948 195523 -249003 -335367 -24995 9746 50421 146933 -193988 278868 -29193 55102
21849 -321981 41983 -165912 -116657 -236278 35157 -130750 -103543 40180 -16988 389734 -68094
21837 -492293 -53294 133044 22320 6433 8353 -112268 -259429 -237357 416604 2281 99641
21826 99641 43125 309769 -93563 134590 84705 171539 -35254 73352 -213116 63900 -38631
21814 -453511 -103209 -254798 108346 -102831 -121262 -135978 -20949 -462038 151259 23659
21803 -121474 253622 -316283 -5023 -193565 189165 154433 -32368 337466 -103976 -3294 121225
21791 105381 -120764 98299 -138782 138266 99693 191044 -36574 141650 69286 -149043
21780 -4072 -159107 68828 92948 -35545 -109484 -330758 -67159 -219716 5684 -262085 -300283
21769 -300283 212556 -352521 159999 10105 275232 -189700 -91858 -61246 -44313 40816
21758 -302109 192627 -207875 189392 -182260 -220865 42836 273024 116833 -103431 137345
21747 8792 -77044 -238873 -126193 -52948 217694 220339 208431 99476 8417 -48572 137178
21735 -321513 -11582 -12303 -171569 49651 -155808 -216606 183538 -149916 196916 -207698 -39002
21723 -194866 37363 56607 -317249 181135 -69013 105532 165278 -170477 30411 -200168
21712 -125363 -210467 22073 229048 -211124 -170026 -203528 21714 -194477 -137671 -73598 96635
21700 -103192 100975 114438 88615 -433520 -143251 -183012 -142346 -72035 -121339 -287060 25379
21688 83780 -94837 84439 324706 2794 -177301 143437 -114530 -89212 18520 -289198 -174306
21677 -174306 57172 145489 -77541 -16747 -57704 -48701 275249 -52297 3784 -131271 113083
21665 -89739 2185 -186399 177957 -265477 106016 170538 -153234 -240346 -40418 -168168 159548
21653 -128740 -197769 25116 -241464 203809 -63120 -316840 264792 49200 -162144 -90345
21643 -90345 11846 141532 -259612 -48466 5514 153645 54497 -97682 -219554 -336908 156703
21631 -101713 404420 -101952 -326944 -165252 434162 -177623 14693 14822 29248 97817 -266273
21619 68636 280240 -113436 134354 171667 93610 -194199 -301107 -174848 -189596 138104
21608 -116821 191309 17529 -36211 -191850 219602 95458 -72695 -375417 -164101 27455
21597 -57575 94215 198993 29301 3940 -132355 25330 -144326 347649 105589 229080 -92872
21585 -7303 -313480 -207697 -138724 91317 -76640 258382 -27965 -141341 15168 30186 -261979
21573 130861 -486959 -302553 126260 60145 -232517 -65294 -101176 -125970 -79283 -56132 -201332
21562 -201332 127264 -130933 -178778 -31690 -76539 86134 47792 214494 -70872 93991 16079
21550 -48745 -181078 -181191 11783 121882 -23169 -29409 43107 -140475 -90817 -73298 -121434 -243168
21538 -243168 -258304 -90938 -298176 295230 50506 -162222 -31762 -245677 86879 138931 -210428
21526 -147239 -247685 105879 -19968 8921 -242820 50128 -234610 308938 152769 -3075 -87385
21515 -87385 140995 -1612 -111717 -47694 71581 -119674 -29800 -106424 -165417 -65236 -67955
21504 -67955 -109969 57122 222247 97797 -21096 -170353 -71934 183874 -295028 -190466 -61256
21492 -101463 -93595 -188870 -119511 19773 -54112 -182082 -319035 -155972 18887 149987 -137831
21480 149531 181079 -176653 -253054 -88280 15681 95195 203537 2227 -171390 87444 -202429
21468 -125176 -184481 50312 -105387 -442836 -83219 138303 79638 -15162 106754 53837 63365
21457 63365 -303473 -241084 56859 32278 -263372 -249360 136329 -10779 110205 -121312 -106856
21446 -106856 212240 -138020 68792 -29605 438563 -8189 308534 743862 269373 239990
21436 239990 340164 109722 -209107 22066 -218390 -157562 -86667 186331 -10608 86704
21425 -35291 -184861 99079 41034 101785 -306153 37119 -46497 -44676 -102818 10496 259078
21414 259078 -116123 142980 -246292 -110698 -32678 38496 -194677 -112994 208100 -179251
21403 -113622 -144977 -182429 -75969 -59464 -106004 -58202 249920 -129143 196694 -50084 -8554
21391 269586 46076 -247832 32153 -108504 -216271 -168454 60119 -147953 -28370 51578 -142336
21379 57516 206639 -33834 -48458 58674 116654 107226 -36222 -122527 124279 -186737 -112475
21368 -112475 -25606 -34736 154212 -118831 88482 -51220 -393018 19857 278932 79538 74935
21357 74935 -13969 8087 91857 -289528 22049 -197763 29479 -79039 -125464 -2169 19636 -22384
21344 -239623 -79337 -92471 -432491 79355 -166808 191632 172233 201898 -84162 -369894 171760
21332 -149897 -72103 -118346 -117802 -156522 -333638 178116 49047 68598 -100354 65321 430049
21321 430049 -268341 85727 258691 187713 -233769 -176638 -201003 -137149 44536 11938 -531375
21309 90311 -160436 -227394 -357473 118761 -210355 -63045 167529 -175798 93092 84256 -124467
21297 -167084 27405 -382203 -30524 165643 162232 -119363 -19905 62711 -200334 -38996 -289864
21286 -289864 -483 -178662 -159717 116091 140027 -68744 -114435 149010 -291242 -189159 -160239
21275 -160239 -12805 -69809 -273928 29 -19448 -121558 -439641 -118681 -108054 -81227 362586
21263 86886 26106 -186802 -209693 -31962 -286753 -93269 50415 -133317 -74770 144336 64123
21251 -114072 -169358 95903 -220671 -10252 -250278 -173285 123425 74952 337864 93369 144799
21240 144799 157538 53568 -159218 336798 136589 68484 167431 9434 -52152 83364 -36408
21228 23336 -349085 -66260 87722 -211891 -15748 -351987 8080 -323880 119072 60584 -300375
21216 -173571 -279785 96437 -133860 39831 -221044 -89507 -159027 -76435 -15039 -384265 -62408
21204 -41739 -70946 259312 66731 269294 -347531 17619 -158223 109394 -78063 -74938 -317944
21193 -317944 56405 -75833 16109 77622 -7376 64574 -4798 -186290 43419 -190488 7818 58602
21181 58602 186233 -181944 -15811 190411 305331 -76977 -280940 -120894 -86477 -20686
21170 -78341 -100289 158779 -125793 -140653 -367951 -80391 91331 -232315 -153373 -303532 24556
21158 104580 40714 69068 -214117 195229 -84046 -141507 47061 147898 -2187 196611 105993
21147 105993 -623 -221366 -143420 125970 147945 -64323 -41253 45959 1861 -68623 37720 -78070
21134 -217145 113334 -25362 211853 -8527 -112495 49269 190117 -150033 -417721 -116282
21123 -55471 584 -109124 -58141 -8177 -367196 -221822 -67489 -863 61061 -195731 -138423 102554
21110 -161291 81349 -352931 -352150 -279792 40792 -110489 -61408 111380 -37117 105398 187986
21099 187986 143876 -272746 -189142 25862 -148060 -202595 -302579 76380 -278600 -201402 190285
21087 -257554 -431733 95611 37274 -320433 -164449 -491737 -313087 -76024 15426 -108672
21076 -63721 -46425 -184201 -75515 22553 3419 -228759 -13920 64902 -70160 239268 -77336
21064 -248958 -222193 -25103 -22832 -24830 -112075 50411 -251233 -547333 -288968 7668 198350
21053 198350 -61970 -270305 73694 86857 -252930 -226958 -221229 -142825 48724 -201079 122531
21041 263280 -119547 74167 -17685 178661 119163 -51791 -31883 -30622 119458 -264842 157354
21029 -131892 -81910 -121628 -264346 -281389 -55239 -249799 -13594 16873 241958 -168543 -58389
21017 -442821 -232060 -80339 -125179 110245 -154299 31771 65074 -106874 -49927 -9339 150885
21005 -130383 -58462 -151902 72112 -80933 23548 -166894 -79571 -128959 280591 -691 -93255
20994 -93255 -275661 -129471 12290 63192 -31323 -183594 184850 178646 -175430 80363 -116568
20982 370053 158325 -163415 43843 -217587 328953 -123041 -157823 -76884 196099 59222
20971 -243667 -22712 169121 -292790 -108926 -311403 30760 -55702 -2592 15592 -397871 -10386
20959 -65723 -204110 -13827 202022 -114477 23809 351960 -128211 -129255 73821 -250037 -199254
20948 -199254 334693 3566 239810 204535 -310268 -106542 6451 -86911 -39532 -235483 -6496
20936 67668 -118699 -308954 84785 -41079 235871 73664 54700 -204062 -70014 85274 19978
20924 -241433 111815 -115344 -135891 77471 15704 204788 88883 -83373 -429553 -388526 -43238
20912 -133664 -147772 -189900 69906 -237363 33489 38990 -319280 115267 -284968 95392 -120103
20900 -189192 -128011 94138 -164894 -1501 47198 175046 -37513 -361315 747 96010 -92932
20888 99655 -8460 48205 35307 -131222 -285026 -338503 124768 -213339 81955 8084 -248720
20876 -71822 -88567 227004 88215 241049 -436321 151783 -27276 -270080 778 -619 98074
20864 -70772 -5879 73813 -37637 39598 -403830 56403 -117116 -243501 -291766 50706 157261
20853 157261 16703 484238 -74022 -78259 -67343 -469995 -54172 13560 34739 -90259 -114562
20842 -114562 171063 -277684 -40205 -78984 -251067 -347949 -403148 -54076 -128255 -194253 -307647
20831 -307647 89556 88188 -120179 -149954 37327 122977 -24185 -106441 108676 -57343 -4768
20819 -21001 -70234 103255 70939 340989 -139472 -57662 170725 -180309 -69080 -148338 62654
20807 -289166 -73713 -56635 -127820 -123805 -260786 63922 -119158 -266864 -296053 -117801 15809
20795 153996 -80294 -104569 107469 -169927 23037 -10380 -197546 88013 131433 -261338 -253197
20784 -253197 152800 -360766 -181527 34166 -233194 -31091 67530 -19431 -39961 -93410 38559
20772 6838 -141411 681 -195798 -185548 -122627 -106426 -13688 -306626 7089 88457 -79328 67631
20759 59270 47664 -87042 54325 -144506 -245190 -491347 80958 60806 39805 -206853 6007
20747 159224 161391 27578 -159886 87478 255435 -26708 -152032 331232 -247114 -164037 -8972
20735 46389 -21517 -173828 130842 -407933 186698 206591 210245 -418303 -189071 -24011 -172518
20724 -172518 42354 -312429 -153721 139867 -325422 105405 -68209 93203 -25574 -377974
20714 -377974 -96062 -272490 292849 -125885 -26099 -238532 -115908 -555954 -48694 -45900
20704 -45900 13989 -68233 71269 -214818 -128017 -329772 -128339 69131 -50953 -98164 -70029
20693 -70029 -90657 290765 -52485 211040 -128173 122336 68106 103883 99791 -25323 -130800
20682 -130800 -152119 238695 108305 188539 -65316 178018 -74356 -192876 -176359 -89872 -61910
20671 -61910 50508 -69550 -160001 -413382 -165193 -55049 -15167 -80448 -29278 340106 -483481
20659 -313509 39378 173867 -93007 235410 121949 -280970 238661 15727 -350838 -238032
20649 -238032 -165096 -233173 -164143 -53249 221598 176054 -134089 65830 99689 -165405 -248129
20638 -248129 -99153 -8651 -93345 122775 16787 -12499 62213 -238589 52415 35085 -77533
20626 346908 -211015 -169629 -216166 -267092 -63390 171371 21846 -402353 -143082 255291
20615 141226 -134272 -300922 -333372 49526 9812 24845 -272708 -20516 -2348 143768 181611
20604 181611 97624 110211 -60010 -275045 -145695 -230206 -382739 171482 -153842 -264321
20594 -264321 112002 188143 -47165 -130749 -185299 -355548 -77812 331081 -314780 1985 -50757
20582 -148305 -165648 -238782 34648 234645 192930 46812 -71188 -6825 163446 -63522 244876
20570 455273 1487 -213166 -227386 246835 251523 -3010 193057 -150585 90626 132704 -84508
20558 76984 30129 14209 -216810 54111 445265 -155432 520533 318501 -403842 -147209
20547 106529 -29409 120398 39205 -80822 -122782 -145168 -155658 -228141 -130556 74943 153113
20536 153113 -138736 -457691 -8886 -12974 173589 65369 34337 240579 85084 16174 -150143
20524 -12315 132349 -202909 19185 -129656 -208883 98198 -185673 37333 -194135 -252420 -233174
20513 -233174 275101 171404 -32743 176920 106741 -99821 5977 -26658 14795 -328558 -99520
20501 222991 48946 53741 126682 -184530 146901 -385186 229558 -170651 -115726 -337508
20491 -337508 -56853 -104532 113604 -419054 -308153 -427882 -61600 -152106 -107390 33879 200318
20480 200318 279783 191408 223186 -147474 273259 -15548 -82197 -186641 -248622 -156036 -36782
20468 118638 -42821 15349 -152764 -81711 -88472 -220768 -44155 -38317 80817 -452851 -296706
20457 -296706 195355 141172 -215911 -226702 -72855 -91895 -164826 -182357 40298 -392555 250811
20445 17322 -187973 -118084 -108775 49610 274523 -150974 -33357 47288 -151330 366529 168423
20433 -227658 -205105 256541 -92685 -152760 79761 -33689 -272334 8354 -123706 165344 169176
20422 169176 50483 -94196 -92791 13315 41964 -19729 -42409 42447 65615 -271239 118055
20410 300083 -10039 12448 57153 -39796 -199953 -61326 239002 -166905 -62466 -445327 -320970
20399 -320970 -165845 2398 -35428 -233025 -174065 -124697 224942 -154699 -99187 51457 -135581
20387 92941 -39 -286134 -31922 29019 -37465 65541 -361858 -179795 -82166 -212947 131214
20375 -369396 254255 -196203 -174075 -289235 -54939 -75608 123344 238137 -157940 -383592
20365 -383592 124545 -145447 -20492 69992 -240500 -230640 13502 -68332 -140574 -114969 302475
20353 236285 -225048 -303315 40820 -74652 63251 -204991 33556 42151 -54437 -381688 -22475
20341 -145685 -165243 -45461 -40673 -188631 83748 -17730 -168644 44651 34729 56567 -292253
20329 -109403 127725 -3460 -47673 322188 -119586 -388128 -138545 120758 -57327 -430629
20319 -430629 -79656 -179201 -97323 225528 3803 -86810 -218357 182298 -163934 -298783 237116
20307 -127064 -161433 -223427 -260293 -208275 -87578 -147409 -185467 -144102 10727 78102 -365903
20295 -110256 160081 -114352 -86568 34127 -43138 7463 135033 18662 198502 26856 -334646
20283 -87238 -193280 -106343 143594 -160684 -60800 6128 87020 48236 -154456 122073 -48829
20271 -89180 93146 -167667 -231556 83165 -8852 54713 -165951 -203022 -253909 -209527 241861
20259 11252 -288483 -70945 -281952 -138808 -36164 181169 45201 -166322 85757 -4401 -378665
20248 -378665 -4481 32665 -124143 173114 -127121 -202878 87797 -12487 15392 -168650 -55179
20236 -197688 221735 -178018 135481 299936 144688 -148585 -75729 -46737 328698 297253
20226 297253 -78203 -164900 -31167 -177050 268338 58314 -94736 -62757 -2660 -65680 -441945
20215 -441945 -188538 -288227 21369 -47347 -7592 -139768 -210821 152027 -127267 -16810 -287294
20204 -287294 -5347 -203141 -267043 -94952 116847 -208209 65083 -206546 -248001 -41074 1341
20192 -350742 167783 -233656 -210691 -228422 -111269 -27842 -192161 179970 -6231 98370 -57509
20180 -270951 433941 -88840 29758 -184252 203703 -332749 -58930 -140649 -34716 309826
20169 -473248 -106532 327293 137027 -192913 -179346 179009 30940 -193462 122781 80720
20159 80720 86050 -150787 -167300 -6343 -300972 -91707 -28769 66040 86798 -140160 101156
20147 59334 -264485 152559 -186259 178804 132406 8295 -88932 -271131 -243411 40244 129645
20136 129645 -107787 -233753 -137040 136545 -37558 -24584 67261 192440 24818 -101853
20125 -364178 197162 -15851 150400 -157967 -216973 -89138 -332669 157370 -64793 -91109
20115 -91109 54857 -117227 39811 -23851 74934 -4495 -7213 -98368 165188 -16807 230362
20103 148447 232066 176591 -274867 -226645 -129369 81337 -356883 -40243 30489 -5564 -209002
20092 -209002 -164158 136386 70061 -40325 -74921 -216337 -131339 73799 166084 -106434 -207659
20081 -207659 -262805 13383 -50602 -7130 90248 -977 -22918 134599 -79777 10186 -965 -50616
20069 -50616 161368 426811 -413303 -28854 104333 10499 -138853 64914 96007 436672
20059 436672 -43945 -497696 36509 111975 -10093 39969 229772 42733 -69237 -48942 -103120
20048 -103120 -430269 132426 -189442 -138940 -25294 -99400 77672 197199 -45081 -99554 5962
20036 -72336 -70862 207821 105174 -124394 64621 -19156 -225358 -32336 115448 37538 17084
20024 158656 145623 -54756 64318 -32413 97224 132845 -47870 -456091 -58862 -256601 -223972
20013 -223972 -147008 33799 -19097 -57312 -303306 111948 -185752 -369864 110602 -16770
20002 -132689 -147865 90724 -41600 123072 -130763 103631 157518 126579 -204093 -310439
19992 -310439 -88946 -43523 -32517 -274766 122007 -18476 -57849 -179424 -280681 -23281 -171613
19981 -171613 -121317 211918 133304 -59537 100860 -58202 -22150 75324 -6824 22059 -8652
19969 -491754 -260029 24456 -91024 20169 19574 52601 -377731 176343 -309253 -104523 -44008
19957 -296479 -73285 -5079 -314340 139779 147958 64103 47234 -25096 -146319 -253060 -256037
19946 -256037 109406 19553 -46134 193306 56050 -66032 -44124 -95358 -119677 -205271 175076
19934 -324797 333426 56699 -77098 12402 -229950 5023 -180028 -73666 103763 316493 -73148
19922 -430463 -199845 181121 -264332 -193461 110668 -131275 -18863 -121317 -135725 -59994
19911 -184942 -32375 36855 -79091 -80136 -229354 101109 -133488 -13788 171948 -171285 245585
19899 51800 -161136 -423499 -215430 -169277 -101633 -108629 -245675 92837 12653 -204974 -384963
19888 -384963 -145911 44007 167598 -659669 -99988 -124689 -203425 -152629 -148116 90837 -83114
19876 -308283 -81769 -225563 61704 -76850 -35988 12111 -71983 13711 88451 -105924 -62066
19865 -62066 -120602 -202183 -127711 -149563 -172646 162268 59476 237385 -106552 -41437 -71041
19854 -71041 -170610 -39128 -37929 -111474 -344268 -130564 -104758 -95970 152205 26525 -62515
19842 -94858 -115174 130820 165462 -50952 -246089 -223991 157471 -297249 29478 101352 1925
19830 45490 89243 178979 50551 -165745 128308 110169 -30064 34928 195008 -34220 123944
19818 -427245 -228924 -139006 -162266 48476 -209970 -117134 -236740 -259895 -73589 49695 -120713
19806 -224876 -216851 -137762 113952 54789 75956 -318415 -137830 115357 -15025 8206 52493
19795 52493 -42385 196985 4285 3847 -183666 -30523 -43460 -89608 5280 -92547 49601 -103029
19782 -318064 150424 -310745 187551 172410 -195062 -203623 -55329 -33431 71712 -41176 8548
19770 202499 -88959 102342 38006 -120345 -287000 -1003 -275110 -432383 -233135 -63058
19759 130601 -132765 14397 -79257 -202338 -38205 88849 295397 -54258 -56462 -73314 -8147
19747 30896 -184616 19153 -469180 -287241 -196004 217916 304124 -157679 -195648 139440
19736 208307 -151372 -251414 -8605 -288279 -22801 -298642 -245666 -193952 -91558 17109 -197413
19724 -73227 -133359 8148 117043 -34048 -225274 18680 -108090 40368 154065 -207128 26779
19712 -304501 -74599 -43266 -159615 -91192 -54872 66616 -110249 -38025 -181324 -130420 -162927
19701 -162927 -48467 234072 47061 154624 64842 -346749 262285 278680 -245752 -5236 -170888
19690 -170888 367212 100406 -155140 523391 -16635 204873 -35892 -70473 -69524 -136160 -41095
19678 106113 -197679 -258782 -6097 136606 -161734 -138562 137234 232341 130287 120861 -137033
19666 27752 7566 144295 -121720 -264701 139908 -8983 -73599 174935 -128929 342680 -394218
19654 -233869 224527 238531 39771 -391566 24686 -274422 211415 28768 -529646 -127727
19643 9623 -23815 165613 180845 -49339 229836 103655 -120712 -50041 363897 17289 -59173
19631 -116329 9225 -113269 65004 9925 -58564 -338558 -28226 -166380 -173226 116380 -220998
19619 -315197 -130324 302479 -137715 -288774 -164087 164564 88786 -143444 32363 -89221
19608 34795 63424 -275320 -401156 -310232 170569 65850 -155929 -169562 108005 -245192
19597 116204 -188497 8842 48062 -105956 175406 44032 -205261 36654 -154756 -107575 -276763
19586 -276763 169102 154272 -69455 130562 199760 19219 -337152 -262251 -376911 -110493
19575 -238970 -236744 124066 -174016 -129156 -264562 -127954 90655 -14709 36327 132513 -331116
19563 -48080 47210 127905 -242388 -211752 -133529 388364 -33587 -236132 -14846 124699 -296252
19551 72340 228806 -137221 -333214 153498 100161 -41893 -60632 -265808 56765 -132967
19540 -33865 111362 -273136 210012 111836 -323406 155276 -48629 -1958 -27836 -302294 7531
19528 99676 -57324 -65643 57655 6057 3653 -144119 -95659 -180269 -113477 219048 -69148 -267693
19516 -267693 -88582 15303 112613 324191 -142379 -250776 -408582 -13088 -21581 -41641 -385442
19505 -385442 49051 -41881 -160073 -559811 -80302 -456461 53959 -407460 4051 -208110 -309303
19494 -309303 2779 -318648 305252 10405 -163853 -190790 128310 191035 -42161 -128339 19491
19482 -248026 27704 169152 143789 75017 -41601 78160 -101594 -32391 222602 61012 251166
19471 251166 -32172 369908 321964 43249 12164 -167103 166353 49294 -56890 85907 -7388
19459 313717 -126126 -380917 318916 284205 -350255 -36609 10227 -328743 -230979 -164398
19449 -164398 -131791 -57979 -246375 46502 20656 -202539 80528 -56888 -137946 -206224 -127790
19438 -127790 -140364 -393547 -206945 127117 -158878 -198078 -73013 -76554 7641 26576 -50388
19426 151967 -388716 -113764 -125666 -53939 124009 -306726 -111622 -112240 168767 168066 -46599
19414 21539 47875 -84912 -19453 -24515 -347873 -56412 -360761 -39892 -124960 -65983 19059
19402 -85746 -89547 -80386 12331 -169174 -194138 -12065 149547 -57286 -6134 -161310 191055
19390 47302 -183820 90033 -199066 -49069 60478 -50560 -203655 -63478 -150506 187879 151360
19379 151360 -481743 103948 -325839 -92891 -149129 -139414 -48823 -187452 98280 91726 -149211
19367 92083 -384541 23222 -48501 -447426 -48837 34742 45435 -195058 -204668 -183761 64193
19355 102043 -431866 -20650 -267101 -41270 25575 -54325 -93337 43938 -127666 16786 231576
19344 231576 -144201 138845 -131771 -18941 -84261 11163 -91327 -17833 73671 -205032 -151919
19333 -151919 -51220 277105 -143652 -243308 -184465 -195315 -345627 -137222 -51218 -207539
19323 -207539 -63236 468975 261824 -46766 -63867 175529 -258221 -115761 6231 16541 153029
19312 153029 -245441 -83795 100184 79141 67185 -64337 -104883 62869 -99009 -48164 -391138
19301 -391138 -65584 -81070 -230130 -186436 248416 -288739 69827 -20699 -7971 -119270 36988
19289 107529 -86096 215030 53067 -197877 141848 94227 142927 297066 -243410 -1240 -225057
19278 -225057 -172365 -458780 104168 -42265 -456036 -83781 97322 -190187 -263204 2610 184923
19267 184923 -79628 -137515 -136319 -42724 -144934 117016 -20195 148839 -123613 -145406 290807
19255 126835 -201301 -72127 -57013 -75109 -273140 -253838 85058 148360 -42653 -249662 -134779
19244 -134779 5426 26224 153492 -279355 -71574 -51155 -100899 -125285 180899 88402 -221730
19232 -50692 -215235 -92941 -296452 -93739 -191528 -471048 34743 -46038 3912 -224869 -58364
19220 75747 -393564 -17946 50070 -123962 142705 -330494 -93697 -27753 -67566 -547095 210630
19208 80200 167075 72594 -157549 125613 -124617 141700 230794 -386391 -229133 -34215
19197 -149361 -69586 -12880 -10960 -67284 -144249 -130181 -87592 301135 -6017 -210658 -296520
19186 -296520 -160819 -50394 -121695 -130776 -233512 -205489 -302511 -63808 -186743 -216039 159177
19174 -183183 -235157 -71647 114563 -79077 -239231 -168785 6938 -233907 -73365 -9323 -130756
19163 -130756 37589 -346245 28887 -34782 -203111 136358 -64866 -107134 -247172 -48545 145082
19151 310452 -26087 -60228 72818 -185574 -133268 -280063 -38467 144173 79685 -122975 -37261
19139 -118178 -29487 31621 -320898 -245361 136905 -186330 -240739 -218618 -96582 -185793 -187416
19128 -187416 -3691 -122641 -66730 28921 -64218 121608 377864 -139852 -145896 -105583 -521531
19117 -521531 -134512 -107913 -156583 51933 -967 -236781 58577 -294803 -177815 -237453 -65525
19105 -320274 -91281 38654 -42732 -74790 -1880 -152903 377819 -118733 1601 -140528 -218662
19094 -218662 155544 -105492 138807 37992 -98703 -82265 -318563 -265251 17531 -201237
19083 -315985 146351 -169710 337416 115962 175010 80126 62165 80602 179679 5408 -308119
19071 106052 1639 390120 -142228 91195 -162783 17615 -9911 104134 105083 4782 -31621 -182387
19059 -182387 12287 -120217 584 32930 33220 -77160 46765 -177799 -39096 -224563 -346559
19048 -346559 19175 -177769 -6383 -151638 -39245 -296364 -177708 -71948 276434 5496 -78086
19036 158468 6097 93649 241791 140115 -168005 -118274 30857 -91841 1921 102354 -47077
19024 126018 114748 -34196 -147815 240568 -39710 148972 -45174 167718 107024 -53153 143579
19012 -81827 159273 -70316 -138187 87566 -289233 -340002 -23804 -139253 98895 108325 101918
19001 101918 136508 -32543 8956 -37009 -39639 129133 94881 -499058 -227864 -435368 -232552
18990 -232552 -392162 73046 -102291 -686 -5054 -236186 20108 -43306 88780 -176432 150602
18978 110032 113953 -215674 3279 161241 -128559 -248578 -329311 276376 -21899 128373 -240407
18966 -171719 124854 -141686 61410 -287266 -189145 -210223 158641 238813 17750 42683 -89416
18954 -231781 -40637 121117 -179513 -360034 -142500 112656 290023 12758 -9184 48596
18943 -274627 142202 61082 -177779 54804 12725 -123043 140787 -145867 398 -334618 170658
18931 91460 63973 -43923 186813 -58770 20842 37354 -285539 122900 -112674 -258722 -198007
18920 -198007 -205546 -214972 88089 104812 33173 55860 -87573 192892 -200359 236206 -107427
18908 -246695 96498 -79857 -144012 -46760 4990 87101 25394 -1200 -213485 -31066 11760 -194929
18895 219235 256085 -101212 95516 17827 -84780 -110671 -145523 323827 -143784 -402225 269415
18883 -133822 -207512 153852 -258844 94104 25614 107470 -10136 28729 -207557 -59171 -199897
18872 -199897 -231977 -304640 -66852 -22575 165786 -271393 160226 -38850 141602 -29602 116766
18860 143080 -163912 -72385 -163028 2302 -254383 146250 -85847 -402377 -54930 270056 -259901
18848 25299 -326741 84188 28941 72638 -89884 303075 115136 81530 62175 -191001 -30538
18836 -122098 -123252 -41669 27035 -46349 -263508 55738 -112790 -22546 -43628 -31309 -217644
18825 -217644 60461 -225281 -188993 -149117 -59427 286309 -163301 127294 117884 4038 -9148
18813 -105071 306777 274244 153510 282200 152751 -169474 -12118 187077 -234535 -115114
18802 281491 -194456 85739 -59041 -107896 -86303 -26668 -7475 -47844 -206513 28154 117748
18791 117748 182198 -239636 -323267 -247362 42242 -1116 210017 -134194 -83367 56946 -346676
18779 -177196 15220 278628 136321 89895 -58585 -209475 254175 6583 144761 -165908
18768 -163038 -6251 181544 -37950 -171093 -303527 -499671 199149 -149059 -110474 -20912
18757 -152453 142625 -300266 -76911 -368640 -154125 -74000 12278 -191788 -4212 21948 -231523
18745 -75677 -146607 -10895 -73255 -486674 -162734 341735 -211988 -199633 -139817 3070 -324253
18733 46939 -283816 15122 -229765 -102839 -109237 94317 185947 -125035 -153297 -172989 -168523
18722 -168523 -176467 95618 115005 28552 -306804 -225867 211800 -23127 26426 -157969 -23707
18710 92872 -143560 74235 -30871 -279128 -201584 -37767 79079 -79619 -78561 49613 -111581
18698 -54220 -271730 176063 229406 -118512 124914 -143652 -188429 -92643 170475 -14960
18687 -74113 -212066 41100 66876 -80655 -114751 -60990 -90224 74408 -135905 203568 -44471
18675 86932 -193000 -126908 121661 -64365 -100658 -195157 -191472 61121 -145433 -111912 54831
18663 -223072 219288 -382433 3497 104122 -69610 150711 285478 -454372 -170933 -126016
18653 -126016 -105787 -173558 137614 -190801 -137180 98511 53321 -291289 -93496 -231484 200029
18641 -93678 -236914 -192631 -71971 -94144 105723 -139841 -36014 40871 -165146 121035 -115878
18629 69752 195299 121138 -44497 -22846 131942 55263 -454657 100343 -205221 -229927 -133021
18618 -133021 -303591 339343 -265567 8179 251167 -76019 -302021 -124188 91541 -34713
18607 -20485 -88739 126846 -147940 493506 -93782 72652 230731 177100 44018 -478455 -16493
18595 -454583 -101829 335287 21868 143682 -71675 -43130 -82550 -220554 101188 58808
18585 58808 -141874 6146 -64478 71868 -372820 6211 -252891 -183335 -39828 26405 46100
18574 46100 51304 20584 77315 -72385 -99578 351700 86914 -73287 -267782 285983 -37425
18562 120256 -92671 -237145 -143995 -12208 23333 -25852 -333300 -151976 109270 20880 107180
18551 107180 -115504 -33190 46462 -268184 -104326 -46785 -121172 183233 11064 -111361
18540 -49980 120283 -30790 125082 227112 -198290 -58914 151579 129788 101877 -210361
18529 -33062 7213 -128971 -248854 123019 -169533 -95618 -195016 -21851 -99032 -51599 13225
18517 -279791 -50360 -22201 81730 -45401 -147807 -8919 -53411 -187899 72248 -130559 -238718
18506 -238718 -67826 227347 80097 -173782 -104541 46986 -238465 -520426 -179109 368249
18495 -66859 -187859 -214914 204313 -60205 -21051 17334 71535 -293349 91135 13895 119505
18484 119505 19095 84982 -51911 -167046 187132 -79179 214439 309153 138938 -58822 -64495
18473 -64495 80829 -23852 233551 115017 -49775 110172 -93613 -18342 -147422 -43700 -20186
18461 5526 -248499 46971 -195820 -126185 -139226 -157605 -261062 283024 92999 90636 -226419
18449 -238204 -57639 -130318 66828 419338 45013 -323680 89451 -1219 225264 77829 -69081
18437 -26331 268541 4110 47307 -171159 -309526 -82442 -58868 -39650 154452 341721 286369
18426 286369 -66196 -228218 177691 -123752 -183018 45083 -268533 -158582 175660 -417636
18415 -188579 285184 7102 100391 60476 -160622 -283176 265111 -179513 -51897 92154 -136723
18403 100880 65670 -147954 -126340 117278 16892 -256409 12003 -3350 -85175 -266940 -78241
18391 -107136 100061 57804 -4885 18970 -83480 93589 -30096 -221304 -185511 -94012 -397734
18380 -397734 -31680 102715 -137328 -336632 -347103 -265012 192203 -408371 78322 -289664
18369 162102 150969 -24497 -171462 217631 149611 -62241 -133754 -28133 -75386 214740 -110503
18357 -82217 -262643 -135719 -318943 -23423 -159923 -117994 -29673 176296 -71428 -192733
18347 -192733 37052 -7380 -155279 41251 -199989 -132701 128224 -78770 -231512 -166920 -168319
18336 -168319 -48053 -582 3935 -5687 153593 133189 -305428 192449 -45795 -99107 186736
18324 -50099 71141 -190529 -192313 -45313 -134574 -201196 -91335 46588 -249640 155137 -174466
18312 -145307 -566076 -71958 69215 -120442 239010 -184859 -354282 -24403 -67758 147825
18301 117618 -38393 76638 48781 463029 -22673 -29037 -204048 -147341 -156065 -212536 98836
18289 -72537 -19135 116119 40622 -46968 -340882 129331 -17557 72159 -273979 231343 -69253
18277 74306 -43986 -443644 226472 249924 66037 -151759 19964 46184 113985 10665 -177798
18265 -215332 -125752 -2984 121677 -24231 148626 31881 114549 174516 -17204 -3242 233269
18253 -266494 367451 -135430 -314499 -122258 -97828 8478 -345527 21938 -189533 -267721
18243 -267721 -48640 -105258 -126355 -20113 275297 143438 -57102 -161978 -99907 84050 -48062
18231 -271437 -254287 -74352 -168612 -233229 -201162 466155 -229771 -46599 -105311 17223 -269439
18219 62204 -190753 -11873 12515 -215015 -75424 168071 298300 -119589 -125309 104210 163471
18208 163471 131021 26096 -184587 -136399 -165796 252250 -99718 96575 -101171 49509 -159033
18196 213405 -75386 -67691 -53996 38561 -46865 -441765 -108323 -135766 -286878 350475 -126509
18184 -192898 63399 -138546 24062 262317 -359120 14392 -11822 100491 113179 -64366 -48853
18173 -48853 211544 217054 -271551 -30040 220036 44489 427403 -142663 134875 174084 -29545
18161 49146 122197 -7940 -374128 221102 -253178 -136052 89480 396247 -328443 -21110 66031
18149 -105303 331313 31011 175559 161295 205357 -68542 349311 -54183 106596 108693 76651
18138 76651 10089 -200621 -129372 51571 -146257 -132637 -120916 106885 -226486 -148696 -214123
18127 -214123 -52575 95655 -79962 24262 248943 -29682 -237317 -137166 -215062 8924 -248039
18115 -32288 -110499 -59697 -23091 -37009 -313338 153858 -315782 51999 -107005 -87205 149639
18103 -320224 -71152 -238071 69903 -41709 -456462 -117147 -113883 -48079 145204 -115207 -15551
18091 24924 -42629 80407 -162585 -24292 -372359 -169786 -409714 89523 -217039 49219 -29819
18079 -23324 -39901 88258 192556 -37058 84084 -115917 32803 -213318 91162 -51557 129999
18067 134413 -37165 -155579 1613 -101356 8293 -51073 -5235 208325 32588 147432 52571
18055 127931 -119579 -4923 105300 -261215 25514 -19372 -223460 -68976 -168613 -237248 -69536
18043 -104940 20569 -143524 49364 -161281 -234313 -84155 -121481 40170 -171658 77745 263851
18032 263851 277759 23720 -177035 -96370 -436095 -45591 -181882 -216371 52444 -28875 222756
18020 -127731 -130175 -15889 22932 -37504 136578 141876 -37305 105705 -241659 -104934 42914
18008 174700 470494 -158301 -102614 -405690 -56892 -86337 -76423 84089 -149702 -13568 -33900
17997 -33900 -305791 49096 -132061 -96703 -68526 -58488 -119349 -150644 -141488 82643 -57607
17985 -123525 75018 78811 -234128 258851 -342860 -74082 -31151 -68062 -78172 323355 -28233
17973 76806 -223803 61927 107147 26711 -208353 -86762 59262 591046 -134449 -140417 -82791
17962 -82791 -235794 -69041 -162485 87968 -100273 -212831 213830 -84105 -13354 -242320 19598
17950 -88485 184865 -183084 45426 -97449 248867 304451 166921 264425 501349 174289
17939 -145879 -199150 30326 -31377 -23576 12157 -60150 -162055 -217960 -124397 -31452 -60670
17928 -60670 158191 53525 87890 19926 149208 -147155 -119948 -66644 -101010 41901 -282091
17916 211367 -261243 11346 -106171 -237078 147997 -33494 -196198 -61207 176822 -141368
17905 -321808 59803 -291997 41416 83038 -255742 -112168 109928 62163 -68752 -84642 -102609
17894 -102609 -198899 -51494 261783 30609 -42747 75340 -84471 -264592 75060 304197 -4148
17882 -28348 276618 -340603 -233568 254105 -30777 -476232 -94816 64033 -192146 43946
17871 -6019 308931 394503 66135 207321 69311 167523 177850 65003 -137270 28234 -105829
17859 71595 114286 -222180 29362 181093 -29094 -64689 15241 -114520 371732 -111679 137269
17847 1366 -53132 -134744 34093 16657 -56688 48638 -206807 126644 116005 4320 382518
17836 382518 -51394 -38371 198691 -95329 -70667 199358 101444 -47383 -42619 -107707 -204268
17825 -204268 109244 16023 -239273 28231 -304919 -426387 387465 11003 -233098 -79237
17814 122827 -216803 107281 -72421 -234187 242924 -112118 -98750 27896 -2709 -130660
17804 -130660 -85318 60097 -203930 -266563 -4891 -68538 -87370 -108876 -131889 -37935 116418
17792 -22139 44526 -58514 191145 -256380 -86408 -295225 6057 -46517 64803 9501 -14289
17780 235740 20210 -230557 -5656 -58992 -187340 -210204 -49947 106854 68514 -332977 40923
17768 63664 3832 -116770 145264 -211317 64924 -18507 -262268 2510 -66151 161872 -19027
17756 -12797 -52335 64258 201113 122473 119743 123673 -173441 60284 159851 -133258 74137
17744 261975 -29552 -336901 -228647 -37031 37410 -377905 -51600 -54770 -17366 303891 -279801
17732 180662 11137 -224541 274816 -113989 85363 115370 251055 -144530 536926 33447
17721 -196896 -324525 33346 -269080 -40890 -15493 46299 -138999 -331893 217484 -278836
17710 293213 28360 162459 -112544 -45560 -247686 330378 43381 -207841 -173953 206117
17699 114517 96011 230166 22449 157144 6824 -207159 388515 117682 -473622 12609
17688 -78034 39611 287971 6819 92982 100196 188107 238744 107768 57422 -64157 76064 60983
17676 60983 -144745 -19447 -170275 -83766 -41612 38038 3420 -235321 -64900 -342376 -4610
17664 98321 -79912 -159868 190900 90616 -51431 143945 -32134 114991 -2124 -195229 26827
17652 235248 326217 -57935 65672 -64841 206783 -170629 64957 -7113 -35989 -109629 -211810
17641 -211810 150714 -9482 269690 156718 -48737 155230 -183764 -161165 -111040 112865
17630 231073 19168 -138223 135372 172508 160399 -7355 -308744 -1350 58223 151414 54830
17618 3071 -11499 -24256 115400 77110 248155 -61232 105183 327145 138582 111810 206197
17607 206197 -101874 -185992 20611 -85893 -85632 -26419 430057 -101396 -51133 224662 -150455
17595 -25353 105107 -70169 75088 211710 222292 -149360 83359 -208616 5105 -115069 221115
17583 153440 -80178 95325 239160 -227426 159614 -44931 258111 98637 86272 224260
17573 224260 279979 198177 138108 -205868 -70573 26886 120876 132361 375154 -34790 -79848
17562 -79848 35434 -118067 -9422 236891 176904 113952 93258 76441 180335 -64785 -170138
17551 -170138 128818 101994 -84950 -115584 73044 22433 -100725 141598 -68518 136365 47745
17539 361411 191063 292210 -59012 -105061 -17500 33046 625028 568325 -198457 223466
17528 36936 121858 248082 198875 -64469 256012 26916 -70448 9960 29016 -24318 265569
17516 91351 204955 287296 230696 -104021 146302 52818 -101627 218433 70525 125714 293501
17505 293501 197630 -90380 -2501 36886 159834 378764 109473 80356 150544 -152164 362989
17493 -60937 -126480 -53444 -6163 -44764 226017 102959 -99625 157981 219624 49979 65914
17482 65914 300088 -239575 141315 -60560 -178436 289841 239056 85180 109484 64458 144544
17471 144544 44640 150307 262562 65608 345416 104621 30108 79302 140546 435624
17461 435624 -83605 106877 -186504 240170 239473 208064 5302 260026 -405893 -3864 158543
17449 351714 77127 -94403 236698 255733 619584 189891 81647 133866 204962 492421 199696
17437 180036 178598 311499 171106 75091 320334 216546 506616 113309 25039 299315
17427 299315 -26149 523293 371247 95451 300215 436736 166784 256096 78545 380218
17417 380218 168177 540829 275597 294953 696402 86669 -19952 412812 389673 285606
17407 285606 -109489 285002 -140990 10141 332423 171392 -17370 249055 -140569 368177
17396 20024 113790 148993 116155 215258 376074 92865 236022 67382 -75113 4451 137254
17385 137254 465728 245348 200441 65545 624017 317307 143832 111751 37173 -133838
17374 260566 859 256176 294894 56852 145127 56229 -13533 380916 102886 447399 321675
17363 321675 -142470 89757 -48908 -81250 -45177 29582 -30565 221137 278257 -20394 225737
17351 245890 269887 -209311 215398 241929 152160 11707 8735 69939 52477 351926 133592
17339 436824 437367 194887 -49778 3194 3255 379363 -264201 169525 194799 198444 292961 186836
17327 186836 129449 255350 145721 165619 99503 360140 165046 171548 462525 46793 180965
17316 180965 -18660 -24589 111880 89579 238987 275037 58277 -77755 -72861 2664 66249 142399
17304 142399 -265321 43360 142378 -20879 296854 299683 122858 164393 5557 352134 22749
17292 81576 292724 -6427 311883 143553 -109615 210262 195503 194712 -127169 261873 316750
17281 316750 70428 442100 512788 213173 163472 128107 171647 282525 197612 108787 29943
17269 114448 171964 63697 204366 203922 143426 180742 260065 -7934 133460 343345 -61254
17257 134954 278041 389088 192257 308533 169947 265093 125014 186511 147758 258536
17247 258536 156898 258421 325602 -101828 203514 94187 245849 179983 11923 515617
17237 515617 574594 92572 119500 174024 522464 231073 363430 -183717 225374 206803
17227 206803 -128985 -4824 28022 495165 43861 -115741 -105126 252473 343812 -146329 55074
17215 225570 192049 270088 60711 422997 410889 334343 274561 234352 -159666 42293 558861
17204 558861 310143 112476 305891 266084 -48606 233330 342697 131873 240591 12312
17193 210544 238134 268810 143444 297246 235040 282862 -241971 92964 260378 234714 305423
17182 305423 64133 353915 209005 287732 296836 344566 285377 123037 439368 379326 415557
17171 415557 337353 94715 433362 361455 324428 288800 325937 346559 153113 -66226 293972
17159 142038 105228 340937 -105554 615011 89190 227332 614264 150412 322466 319830
17149 319830 264761 466706 259297 144638 171087 154181 380369 275361 340590 249319
17139 249319 528842 294283 489598 150722 356629 190757 345136 300192 522618 300694
17129 300694 356661 18647 563817 400107 260393 387560 459730 219281 466850 463179
17119 463179 371174 488969 67481 317178 420730 207232 -100573 488621 431665 172740
17108 401223 414436 142640 212662 408915 265441 386515 444209 305418 684478 293306
17097 409407 400321 236362 283781 479796 441582 192473 693398 578123 291543 273459
17087 273459 489989 464241 501550 738398 529268 416982 588179 610455 663732 240418
17076 753064 715780 380447 316933 485146 533631 541984 323034 429436 371728 670004 483764
17065 483764 452719 621599 216785 691359 614749 636627 587623 673364 452723 640034
17055 640034 433298 496024 526637 421668 633198 724344 574205 773249 412001 680806
17045 680806 635640 494570 393806 258672 622028 730780 516823 875382 502090 639721
17035 639721 451813 744363 737380 655854 1010768 632414 902985 484741 539523 794505
17025 794505 399467 502114 558748 703559 783108 726926 701071 1084810 740369 727365
17015 727365 778106 693038 881998 717503 951815 614881 777075 859954 826793 968955
17005 968955 752980 839009 656742 531536 679892 653467 1001691 818012 660314 827975
16995 827975 788879 691383 727141 748506 947676 875363 819928 854950 897474 966488 675950
16984 675950 1008910 1084048 791957 970337 1163882 732123 1148794 1056818 1251371 1143943
16974 1143943 1183943 948142 1367066 1287187 1293855 1108767 1141376 992958 1042305 1211212
16964 1211212 1009449 1011324 1099358 1192915 897151 1017878 1111251 1187486 1190179 1412685 1413243
16953 1413243 1019617 953993 1158471 1070739 1359560 1378179 1315357 1394759 1390424 1134990 1101732
16942 1101732 1912631 1533399 1532626 1525435 1433368 1447070 1683120 1203047 1205242 1371823 1667082
16931 1667082 1483805 1742777 1623878 1908594 1348033 1644167 1485158 1624784 1735015
16922 1735015 2079085 1677086 1321853 1489233 1874604 1725501 1924301 1931989 1242715 1931747
16912 1931747 2050777 1565140 1914595 1627120 1790149 1664166 1925710 2269220 2197027 1715212
16902 1715212 2138023 2225926 1902909 1966867 2045938 2354208 2383506 2382674 2447772 2042769 2656764
16891 2656764 2312075 2194079 2304440 2601573 2605492 2781886 2355332 2809194 2916514 2761525
16881 2761525 2693603 2545712 2814110 3097243 2440329 2763538 2801798 3165892 3243332 2967804
16871 2967804 3186437 3146396 3074889 3333332 3325321 3469910 3215237 3346936 3388437 3591374
16861 3591374 3285031 3547998 3459307 3782971 3800924 4164630 3430618 3969858 4085164 4015724
16851 4015724 4236022 4082269 4452453 4051151 4144185 4662412 4745752 4511847 4745441 4627478
16841 4627478 4465031 5018688 5160110 5621256 5319845 5311625 5301347 5590601 5576547 5349389
16831 5349389 5662797 5804613 5989497 5796211 5642832 5985013 6494379 6096377 5935891
16822 5935891 6738439 7004400 6914434 7122654 7205664 7615982 7364941 7650318 7780599 7883757
16812 7883757 8459575 8236932 8708015 8814570 9011182 9147590 9397425 9722718 9761443 9795045
16802 9795045 10389570 10215777 10535793 11178285 11479944 11720460 12006745 11931980 12644316 12818023
16792 12818023 13189697 13615128 13668703 14443156 14554766 14771214 15608687 15774364 16175336
16783 16175336 16831954 17317867 18055107 18162157 18771765 19008157 20115076 20506085 21175703
16774 21175703 22119520 22637996 23430983 24055974 25103213 26083608 26631735 27746393 28873303
16765 28873303 29862214 30982202 31956010 33190431 34695899 35840050 37238026 38419215
16757 38419215 40264459 41973671 43532062 45437148 47826027 49702878 51840925 53940763
16749 53940763 56288583 58683987 61782318 64425372 66850858 70267149 73446598 76618048
16741 76618048 80054388 84137802 87353006 91289211 95047086 99089337 103228869 107264316
16733 107264316 111487171 115267818 119027557 123047814 126425057 129547447 132217985 134950386
16725 134950386 137059144 138577097 139601037 140200353 140606978 139603140 138290040 137014528
16717 137014528 134342130 131765392 128636255 125602693 121802677 118025530 114268576 109930851
16709 109930851 106072546 101415475 97595871 93487928 89414460 85604057 81743729 78011198
16701 78011198 74673292 71523135 68416873 65064988 62400612 59347170 56937218 54390067
16693 54390067 52136986 49850832 47431626 45547042 43534786 41740857 40038477 38364030
16685 38364030 36932788 35268968 34224585 32653061 31644999 30304511 29588060 28128916
16677 28128916 27333195 26032638 25052647 24270407 23087727 22570441 22052082 21416323 20573246
16668 20573246 19766998 19231487 18661412 18399004 17533334 16958303 16457337 15710630 15407771
16659 15407771 15455047 14656551 14118893 13999707 13515850 12952593 13019644 12285524 12063930 11954955
16649 11954955 11589603 11147249 11104786 10867906 10520024 10204306 9959199 9612157 9900061
16640 9900061 9246015 8726396 8957545 8223140 8316071 8256571 8246563 7786438 7501941 7362661
16630 7362661 7342949 7445630 7400787 6661606 6780532 6721010 6887172 6412265 6460531 6321842
16620 6321842 5806324 6125418 5856344 5651798 5623696 5387957 5427098 5658526 4990013 5051158
16610 5051158 5125423 4733384 4814350 4895580 4751889 4614143 4607275 4751089 4288714 4529077
16600 4529077 4451918 4282695 4096075 3894474 3966733 4065734 3559973 4105062 3586935 3817491
16590 3817491 3575682 3575388 3536100 3394693 3353865 3419594 3637943 3303097 3029969 3176852
16580 3176852 3325414 3180976 3047831 2905087 3309300 2904597 2761966 3048847 2764519
16571 2764519 2965257 2579581 3080882 2873677 2780081 2704602 2588273 2297551 2465936 2613352
16561 2613352 2056739 2170226 2351498 2563092 2472209 2171374 2470699 2300061 1913191 2451916
16551 2451916 2309819 2223945 2139561 1918614 2260379 1885361 1735550 2066133 1993758 2180877
16541 2180877 2051757 1862684 1899308 1668239 1634118 1667043 1834735 1819744 1898262 1396797
16531 1396797 1924751 1585566 1816043 1802046 1806428 1624874 2237597 1723808 1464488 1826023
16521 1826023 1695283 1990132 1367075 1473507 1454744 1401545 1615977 1338247 1502606 1375115
16511 1375115 1367935 1467420 1292295 1205132 1489607 1552476 1464198 1318101 1422807 1137579
16501 1137579 1341202 1127448 1415200 1259097 1035769 1526498 1078058 925717 944702 1048317
16491 1048317 1525549 1050546 1280599 1030486 1018103 974335 1379970 1058967 888380 1217947
16481 1217947 1102775 479913 894933 1125677 1173162 1098859 1103479 1020249 668637 975064
16471 975064 828340 850629 1107850 1171452 1156305 1083307 963900 982650 953319 990589 1442598
16460 1442598 735340 662959 779207 1237317 846079 1288334 825601 516370 973846 767665
16450 767665 719143 542216 744532 882440 990886 758246 936517 807267 858904 618525
16440 618525 413494 890025 575080 625022 903850 642477 752571 592208 782524 823756
16430 823756 619239 659018 754459 811211 835221 877592 866043 528158 1062971 604595 694931
16419 694931 329076 441010 563038 878780 1087850 491246 488392 641743 671846 775841
16409 775841 549335 614850 573591 690970 624776 697935 670700 754744 695170 275804 235411
16398 235411 529306 279744 600524 500184 760263 512158 404561 770419 390365 639375
16388 639375 694483 379504 419729 887877 403571 641413 387366 645253 588733 795793
16378 795793 604174 347720 487865 481772 381340 131393 614598 663425 398377 124302
16367 242319 180575 485557 672281 577931 418258 831217 545268 321923 43974 629682
16357 629682 477735 472935 470086 340782 773230 614168 320317 435495 549567 825266
16347 825266 425710 312941 351811 489837 402612 159477 752495 308109 611379 191961
16336 638341 -40368 137694 104389 11614 162644 141936 482148 66946 520813 468815 230987
16324 334176 359873 366466 444276 256027 521502 312255 259042 469202 39203 533096 243053
16312 449552 124211 564842 385243 446396 234923 546280 282038 497803 184620 54310
16301 467737 318898 108218 311837 453849 276372 260671 263725 209540 310648 313838 157560
16290 157560 210114 205716 328584 187507 622373 534295 326952 282694 398505 302534 104329
16278 149669 196333 210025 -8334 410944 254524 318721 500393 282973 270060 450672 252150
16267 252150 311866 204060 565337 -39615 195491 299342 282501 76746 215514 410880
16257 410880 -109426 480467 56327 -76564 -11055 234822 -330410 207669 175873 323648
16247 323648 88258 386340 403854 -152526 391798 395338 254131 320010 327807 190427 319363
16236 319363 297836 184826 218841 17048 122441 94668 336935 -1446 67467 154889 239803
16225 239803 202245 84286 29212 -28564 403284 87230 -74059 -255711 -21675 173565 370313
16214 370313 297734 391334 476503 320013 328992 246202 183061 36106 166770 315266 213540
16203 213540 433879 175293 -222793 376689 342888 207181 304758 342254 -18887 171616
16192 -36532 12262 239660 281718 479998 -196442 -139445 74147 38271 107592 238867 128488
16181 128488 250095 -263207 111689 38580 -26589 -85601 251080 -15922 401403 127155
16170 11425 -127035 191722 140652 208019 -113348 166502 21424 34574 342680 -35991 350660
16158 29656 -103898 50315 214071 11704 340524 168934 176895 527110 273800 -80833 67357
16146 24013 101731 177343 270420 -14683 -78152 431707 -18939 297107 165922 178988 -66902
16134 143229 -255471 225025 216778 228631 -77414 -86649 -33419 236068 58192 440131 124585
16122 127492 386760 -46658 48680 100393 -146415 268290 373446 -114593 -248006 580522
16111 -234182 57872 -175993 99405 -57228 66779 124283 77371 253855 473333 38953 258710
16100 258710 -231208 -9162 -151319 -11291 71214 306784 262274 21687 -20754 -262995 332893
16088 133487 263599 20161 -305404 -40276 -163387 72441 406418 127657 110499 -103257
16077 -6151 -83574 -74460 190864 570751 174691 258185 196219 -27898 111417 -128131 -115702
16066 -115702 58002 437386 -168970 201802 -70197 -41840 -179180 67928 199984 -166089
16055 315243 16244 216787 -32710 167336 131534 -167712 14192 298488 -82073 -46024 -85362
16044 -85362 128634 -87589 -367801 185688 33457 114763 -49353 76446 59136 101223 107072
16033 107072 -2484 33777 -184713 95549 165508 316762 -196091 36115 140533 -286978 -60605
16021 152916 119026 104136 -75417 189250 91661 -22276 -46055 -136191 -283343 -111451 31330
16009 93447 25678 -8321 39520 -333865 -219797 -91233 58946 155128 21337 190906 -44445
15997 -116037 -124902 -32892 -43997 67740 -220770 -168059 -114690 220740 44655 -256917 -181812
15986 -181812 -46845 -48090 -99457 273282 -18351 60923 201750 -76126 -302135 -305244 -24147
15974 6055 -128800 -75519 -105297 36389 15365 22486 1871 69813 31858 104649 -232578 116126
15961 151079 261127 30229 -104199 -86835 12025 -261748 9919 25822 -234156 112933 -13953
15949 66342 29072 -199888 190513 -156409 411232 40028 139498 315662 71947 -74164 -74768
15938 -74768 340933 80013 -76102 55092 -70337 9825 62080 71631 -1857 -317160 -295845 -178309
15926 -178309 -86200 -35565 63551 113437 69145 -41061 -121813 -4943 -11673 -25668 268043 -44960
15913 83852 242703 246429 20395 133111 34290 -26221 -50287 -270999 -113653 51647 -216616
15901 301912 111297 204793 -68960 -261956 -206942 116358 4474 -223639 -195113 -94354 89347
15889 -130404 212552 -124275 -153102 91440 -31924 34128 -128829 302801 154157 -97541
15878 88618 172209 87073 1966 59203 -261823 18391 199879 -305364 -85367 -206105 -218000
15867 -218000 263655 -149747 214338 28405 -111088 -99934 -102815 -160120 -91844 -85754 61439
15855 26175 275610 226471 -78682 231578 -247512 293858 -46260 -148898 -299316 -52630
15844 -206408 -293181 -25174 -36465 360871 382748 107888 -160016 22373 -68492 57722 -132958
15832 240956 -151324 -88541 209147 42088 -72983 -147237 -203955 -115213 -193719 -113877 -147983
15821 -147983 -87080 84665 -182233 75791 22615 170948 -263230 -17090 -258386 300775
15810 196752 -215739 99061 18913 202968 -24710 135753 128081 -124662 130444 43572 -219413
15798 -106680 -169484 179984 -264081 102454 -30090 -268961 -50787 -91993 -359409 277328
15787 63876 -71119 169705 -258802 -316985 97998 -215908 8178 59979 -207745 -195327 -199728
15776 -199728 -266178 53019 57041 -53811 236648 -23410 321575 118683 -184192 87811 6535
15764 -26414 177714 -250325 -104817 -19815 -399912 -132902 123743 -27238 -42964 48466
15753 332808 -76456 249172 14597 -93014 339058 376756 -291183 231896 300513 -35706 -124163
15742 -124163 101318 306648 210499 75920 -35752 -110187 16827 -19088 -258363 -31640 -188092
15731 -188092 237973 -49695 84586 46062 177950 152365 127641 -186765 -122156 -95681 -103436
15720 -103436 78588 -278096 162188 -217934 182050 -108717 -148781 -265587 179824 25915
15709 -98122 -370402 -165911 -25984 109684 -24653 52145 -169954 -199522 20882 157049 -31081
15697 200829 -224780 211205 310927 -59163 -133364 59204 193277 -130689 -37179 31737 -162022
15685 -231250 -368872 -90905 90990 -263658 -19702 327056 -129058 89479 -334964 111989
15674 -93247 -185287 -102771 190656 -87825 264232 -136964 -184341 170272 298213 -234286
15663 -273790 -144865 -65001 -30059 29730 -69793 -405563 -160166 -361251 133697 -183359
15652 -356958 -45826 -119737 -90280 -48455 -252851 153240 -128783 -54395 -150077 -33278 150215
15640 -29446 -135390 -2515 129231 -180467 -93295 155433 106300 222643 75493 -342632 33872
15628 78687 44477 -280651 -91472 86038 95684 -82238 137296 -305127 -194868 -80521 217973
15616 -60223 -155052 -138437 -63063 -76537 -240804 -106051 231834 -30849 -175020 -72040 151233
15604 -179410 31532 339604 -125575 -483412 127520 -42744 -441295 34163 98333 -283504
15593 -92892 -251252 33349 217881 -22410 -378478 23966 -6115 85443 58769 -89456 254424
15581 -184209 138335 262593 -213550 -233315 -253084 -278796 -202725 -277023 407242 -42173 82567
15569 -227935 -157060 264819 -206526 216507 -49679 20875 185339 -199716 -29264 -117573
15559 -117573 -69651 12443 -157260 -247062 72516 -158703 -48704 460249 38155 130231 -73113
15547 -71415 -396925 -368942 -77083 10907 -110202 41584 217607 120420 387005 58742 119737
15536 119737 31801 -59667 -212377 -63271 127523 9817 140478 2415 -79360 -97327 -65094
15525 -65094 126885 164419 133113 373448 161056 -231138 -51695 33835 -56339 -45297 -30939
15514 -30939 35264 161310 -239524 223273 155459 -32781 115762 72526 80814 88671 -42958
15502 -229894 177558 176255 -8742 147831 -83610 -110681 -70642 -147980 -316766 -131936 -64651
15490 -42826 -112485 -94387 228391 -8743 -160887 171622 8151 20402 -169374 352941 131173
15478 -135896 63316 -414013 22986 -25343 -449779 344565 -142899 156930 -41621 107064
15467 125181 477187 32221 85680 59 -39957 -8338 158729 21942 377397 1160 203083 -18695
15454 133099 104131 21217 187427 76500 311930 104263 -59442 -211180 66285 -181945
15443 -175735 83316 -100954 -40826 -182757 -182759 30221 73211 270313 2926 68043 -23565 31534
15430 -179068 167853 -3304 -174460 373948 -24509 -272855 -263726 64951 -174949 110105 -120985
15418 94965 -3815 89624 -368910 -49866 -32741 -42230 84393 118320 29560 46615 10266 13591
15406 13591 64027 193879 90189 -303961 -81071 -84614 120243 -194237 -30901 59120 24065
15394 -64813 68497 -66048 -116739 -73953 -135657 172005 95769 69077 -84794 -241565 -209903
15383 -209903 -153969 -143515 174437 39772 75691 -133327 -56518 79699 332398 28925 32215
15372 32215 211998 30906 58253 -110205 120371 108453 120084 398924 115111 28775 -173316
15360 251817 -76039 -24561 65970 -223085 -245028 214244 -254325 56196 108950 128565 207450
15349 207450 267052 120616 -410052 -78135 -272706 200298 -137862 -363973 -157038 281963
15338 92521 -164368 -75488 74042 10847 51182 220880 13451 -126482 224148 43288 -9763
15326 -5204 -172927 225906 345143 -91264 -83572 79829 -153398 236727 -129477 190224 36035
15314 149677 -133918 -156951 -95721 9020 -237180 326582 129896 -198737 165557 160475 35052
15302 -29114 171810 -409671 -89112 -80626 -102670 159697 -45668 126028 382018 120411 273920
15291 273920 -185474 -258035 239201 -96996 225630 4797 65386 252197 -40888 79837 -74531
15279 154957 7353 354883 239711 208044 56166 300697 -113147 143947 85774 -29057 211170
15267 79135 356035 -149767 199396 48209 109537 99450 198171 7625 -52702 327820 330363
15256 330363 17715 255198 280341 -17090 92239 125839 338086 719509 2239819 1491680
15246 1491680 994454 2172646 929685 127896 69743 397166 280037 7130 78197 159863
15236 159863 19564 -156108 162500 -264593 -109984 -247111 175506 235379 237787 17940
15225 108070 -55400 90594 -121389 215350 -268331 -331447 -144555 -16549 158277 174411
15215 174411 -26044 -180534 301493 88793 200414 -64773 -145420 330237 -200827 -35310
15204 -66216 -72455 13050 -125192 282763 289309 331877 -15489 50140 -24444 151115 -128945
15192 79622 49226 196961 -250737 -32438 -143970 238417 111827 -67120 83177 138108 -158258
15180 223333 -152566 -121941 -133320 269034 216229 30207 130358 -85599 -21534 300081 12577
15168 -190249 -96872 -140103 363402 715 -65941 184395 301531 81973 149277 -4060 91384
15156 -29064 -182329 -7246 50758 -70920 283997 -115823 267311 160319 276828 161465
15146 161465 456389 -83658 208990 96711 125312 64577 542189 286479 -273777 114318
15135 75912 181535 51753 -188910 205452 54785 -15408 -90848 -176595 283660 164811 -326169
15123 -232009 -81340 294642 307337 157711 -52679 114200 345878 199363 197536 358874
15113 358874 24605 89891 53049 135356 174035 61138 99677 125193 175806 105897 -88286
15101 617892 173591 388140 -143396 176778 24912 119114 253149 24975 -120027 283760
15090 415104 -229174 134558 231266 35956 -88392 -162782 -62465 74046 60634 -358246 -431072
15079 -431072 66906 -144825 -168269 188834 -122681 217607 79717 1593 200491 37335 286110
15068 286110 93957 29163 192848 187997 215268 105203 186320 43492 208591 -98253 331989
15056 46552 -86814 98437 355115 356472 270782 47734 -33669 353699 266882 234299 -199969
15044 22513 -159627 214065 -20903 232457 91011 87537 171 239872 219093 297037 -283114
15032 360169 130183 -32043 269139 240273 264231 298189 -12673 -13595 343421 197750 131055
15021 131055 -16420 104468 39813 391863 -5260 161915 150481 190221 183734 356392 136625
15009 -26771 150391 210227 288737 203124 26107 -17723 223622 -314403 18632 244914 265209
14998 265209 275791 160270 158867 845 403459 157422 340342 293198 -142647 255059 296438
14987 296438 66470 142767 74534 -11493 252122 -107255 69478 129874 70947 392758 540434
14976 540434 191102 128701 304669 245948 256727 210643 -106409 152026 -434 200324 24392
14964 30707 89171 274858 259316 148701 66636 546775 352975 363883 285866 429975 288893
14953 288893 248161 417156 229879 108791 71058 -6308 176759 23391 356258 388457 286982
14942 286982 387247 213694 359559 180116 551822 311036 220130 -12950 176476 206308
14932 206308 477890 256661 319024 240420 108427 419542 520414 282466 326882 93321
14921 55419 226899 469784 201149 256141 365448 209047 283907 263032 264505 419813 44376
14909 292574 389766 155358 339404 264733 106543 59902 34111 347096 363752 190435
14899 190435 227839 342466 96085 422677 252389 226567 105588 117528 394970 371397
14889 371397 90317 320016 84578 353225 479338 45186 177171 331783 379116 357438
14879 357438 194728 164039 632982 20921 252282 237248 381965 59886 316823 417243
14869 417243 196709 427550 434945 95579 605661 383458 422557 349012 490332 772840
14859 772840 384059 376348 296820 322253 389604 206079 -62413 184461 388149 455449 809324
14848 809324 459315 352878 563400 557326 236324 492464 286601 355833 196815 128259
14838 128259 479628 568987 120413 420861 479858 404200 311055 286925 579936 247962
14827 237037 608743 305527 307327 348024 626553 498092 217299 194864 523664 260976
14816 662827 267972 410881 424467 246693 144349 348573 268026 383384 505161 555026
14806 555026 375214 393184 412130 491418 626638 360377 726507 514941 621889 499129
14796 499129 447981 349986 353983 430576 194725 241894 507973 537573 718859 439147 130592
14784 848618 686166 309510 508985 279347 315548 385892 352549 466709 404574 640961
14774 640961 633715 446880 425087 687518 653781 651855 822992 926954 332437 414704 577082
14763 577082 400864 421405 849097 618872 329700 449716 602961 351441 694279 403250
14753 403250 610233 466357 594976 627171 526840 742176 788652 678771 540286 653335
14743 653335 668794 452646 786988 584973 495193 391506 622073 455621 540878 689791
14733 689791 528516 562628 638758 734473 695183 417359 801724 735512 586028 825919
14723 825919 615565 833604 530798 519991 623827 337030 603585 652590 802440 424040
14713 424040 766671 528587 1053559 827922 703051 493264 692741 631455 611607 1030974
14703 1030974 596585 761311 771178 663899 1002276 562700 846585 658115 877956 1064074
14693 1064074 693896 1059476 834322 595095 820305 1212657 837191 795696 968474 1009749
14683 1009749 925821 930875 1069976 1074049 1195579 1000823 606445 774162 820217 1261639
14673 1261639 940395 732154 880755 825293 780790 862206 808114 885085 832233 1157122
14663 1157122 1173887 751392 1193661 787816 977818 889762 1027923 827506 979870 1044276
14653 1044276 1238923 921033 1131971 824435 809141 1195532 1107244 1261340 1131425 981777
14643 981777 1468206 938409 1172097 946598 1101551 1209968 1018803 1191162 1184293 1141032
14633 1141032 1267322 1113972 1134109 1412326 1089306 1346980 1319173 1036707 1167576 1553168
14623 1553168 1265464 1079472 1160156 1149621 1196229 1026788 1226858 925943 1374634 1247837
14613 1247837 1111409 1576440 1415700 1416252 1331523 1412815 1290825 1271654 1599969 1613189 1655999
14602 1655999 1502099 1394009 1567486 1616855 1407342 1317448 1542533 1502689 1570288 1605300
14592 1605300 1769020 1509218 1314468 1645444 1707712 1682024 1342059 1722671 1609079 1890082
14582 1890082 1856596 1600366 2009148 2035773 1852991 1865867 1838691 1902462 2057916 1721119
14572 1721119 1879289 2103250 1860693 1806492 2143721 2276575 2158151 2439836 2273621 2222677
14562 2222677 2611488 2632173 2557738 2350837 2726743 2767396 2725148 3382089 3354799 3371791
14552 3371791 3795087 4310432 5213951 7378545 10966601 18951752 39779488 41359666
14544 41359666 17673724 9049340 4104659 2602264 2239542 2119101 1747556 1651564 1733524
14535 1733524 1976483 1988641 1838322 1975412 1987858 1855971 2040601 1718944 2089001 2088946
14525 2088946 2154766 2030331 1976480 2173013 2353995 2285098 2299654 2276897 2423621 2292136
14515 2292136 2717321 2299497 2933202 2557805 2771294 2485164 2617260 2773846 2570243
14506 2570243 2372560 2629868 2716674 3149367 2817807 2911203 2972869 2896130 2914149 2964518
14496 2964518 3273938 3213597 2952650 3205695 2727644 3104998 3079532 3196882 3598616 3401173
14486 3401173 3106958 3304404 3067039 3164603 3483582 3354359 3414610 3457130 3568756 3817473
14476 3817473 3693461 3637315 3858418 3924479 4231766 3826781 3919898 4142206 4076032 3820898
14466 3820898 4235091 4460070 4468750 4223558 4578530 4441488 4637189 4527162 4573646 4489159
14456 4489159 4821591 4647704 4712751 4885746 4776664 4908227 5085079 5067728 5282506 5025263
14446 5025263 5276800 5231234 5574392 5242585 5620178 5680839 5640991 5886698 5860388 6251387
14436 6251387 6096713 6176729 6012492 6306089 6097397 6376083 6525501 6918012 6628054 6571583
14426 6571583 6555808 7102798 6695383 7112361 7574505 7666021 7555378 7865376 7865174 7712631
14416 7712631 8082130 8060685 8195891 8450236 8158602 8411768 8735419 8654998 9091792 9101598
14406 9101598 9103916 9324273 9509740 9550829 9720674 10187340 10128049 9766886 10148716 10525146
14396 10525146 11018811 10951521 11043303 11498062 11660245 11568878 11828905 11974566 12418669 12385412
14386 12385412 12508468 12874067 13089322 13348754 13681641 14153355 14013309 14485762 14457889
14377 14457889 14980348 15646776 15381410 15770064 16150993 16434303 16855981 17474284 17455603
14368 17455603 17599541 18283102 18935746 18909263 19375567 19822137 20509328 20724195 20911417
14359 20911417 21937383 22201477 22732847 23310601 23965757 24277347 25056399 25499201 26292742
14350 26292742 26506085 27318794 28265180 28541351 29285849 30142044 31075292 31766083 32615661
14341 32615661 33296721 34649765 35378270 36422017 37280371 38143889 39214656 40656542 41495652
14332 41495652 43050352 44329732 45679183 47136611 48645602 50232220 51636437 53443150
14324 53443150 55530321 57257055 59110535 61524294 63292292 65461495 67788822 70126523
14316 70126523 72851516 75867186 78744161 81973448 85152126 88631114 92430904 95810620
14308 95810620 100450310 104428563 109313161 113920479 119068569 124467031 129919155 135945688
14300 135945688 142758847 149682599 156840198 164575795 172730415 181302653 190584056 199973304
14292 199973304 210153479 220972353 232261917 244157741 256256751 269279425 282472161
14285 282472161 295862254 310019428 324003175 338367930 352810606 366942426 380920594
14278 380920594 394409903 406692100 418307081 428208098 436280729 441816625 442617995 441703739
14270 441703739 441391589 438681629 432038320 425690517 417072044 406396368 393293739 379225455
14262 379225455 364175391 348566412 332812632 317280734 302104799 287146208 272298438
14255 272298438 258009035 246252710 233724253 221490470 210030781 199126117 188891484
14248 188891484 179378778 170361568 161884359 153733994 146660915 139762230 132990141 126854275
14240 126854275 120683303 115457235 110777992 105646887 101296338 96867573 92589284 88801936
14232 88801936 85214276 82164058 78709315 75731613 72667736 69973184 67499313 64567384
14224 64567384 62445497 60010517 57989985 55971431 54415030 52480194 50441609 48881928
14216 48881928 47598748 45752203 44425854 43330314 41927974 40729289 39312788 38096446
14208 38096446 37246360 36531961 35318789 34244086 33097960 32225021 31053474 30757813 30133658
14199 30133658 29119064 28303204 27424937 26478689 26083153 25614188 25080116 24498248 23644228
14190 23644228 23041054 22672095 22069376 21259559 20796892 20639865 19993408 19774117 19096203
14181 19096203 18661337 18408154 18054144 17550607 17726192 16866613 16656947 16188459 16095953
14172 16095953 16135543 15543425 15084627 14792996 14576522 14352105 13866597 13541803 13486842 13328343
14162 13328343 12951753 12850002 12602872 12485426 12245056 12051856 11973166 11461555 11491126 11084953
14152 11084953 10857885 10870439 10507647 10536279 10434720 10368861 10337005 9599639 9674160 9533013
14142 9533013 9218209 9477769 9021971 9003054 8966770 8993692 8818084 8411930 8487485 8296061
14132 8296061 8201540 8260551 8104775 7669666 7546093 7614079 7422802 7047061 7146906 7202383
14122 7202383 6900174 6724649 7085550 7002432 6854183 6748366 6746589 6380244 6540012 6128225
14112 6128225 6421663 6134258 6324806 5978306 6177910 5712316 5629932 5632406 5718847 5585682
14102 5585682 5540396 5409106 5442993 5489681 4959798 5285786 5269515 4912854 4677140 5050239
14092 5050239 5216145 4847780 4779870 4746173 4984335 4781729 4444292 4581525 4538623 4532051
14082 4532051 4043693 4619332 4287360 4298865 4127911 3877585 4168111 4409380 4320141 4151676
14072 4151676 3678588 3911002 3876641 4024576 3942910 3820609 3733349 3681935 3419489 3524643
14062 3524643 3618587 3566693 4002343 3474543 3415917 3360946 3346819 3245395 3410412 2973408
14052 2973408 3156322 3125838 2902842 3088014 2890496 2952540 2879860 3290480 2933199 3184006
14042 3184006 3096647 2832327 2956743 2951257 2874170 2790640 2621122 2923524 2991778 2708376
14032 2708376 2596671 2863726 2947390 2562176 3039444 2636255 2644978 2526444 2469076 2330877
14022 2330877 2322375 2641800 2212972 2479966 2357863 2140253 2445951 2285071 2343964 2201631
14012 2201631 2338740 2145027 2266007 2439549 2094176 2138855 2331308 1983483 1862460 2054436
14002 2054436 2210350 1997123 2055374 2003646 1860045 1984708 1940547 2134780 1898195 2127696
13992 2127696 2148859 2341196 2877121 3299219 5716459 12320326 29794692 46432132 21159370
13982 11041796 6657393 5254196 4337083 3595335 3330432 2935797 2591093 2795079 2389921
13973 2389921 2305257 2313415 2236980 2387715 2634270 2033189 2272725 2176689 2219320 2110127
13963 2110127 2255981 2037180 2128202 1837718 1713278 1823034 2006779 1686085 2091837 1914641
13953 1914641 2099248 1536273 1802698 1785777 1639413 2154805 1668297 1750750 1804241 1390966
13943 1390966 2006630 1781302 1774640 1860917 1423995 1574828 1797059 1709847 1365470 1462581
13933 1462581 1305290 1464573 1270657 1524220 1618173 1579478 1315339 1239230 1630177 1361004
13923 1361004 1231960 1208326 1374856 1701883 1337623 1254025 1333449 1311060 1484846 1614720
13913 1614720 1275077 1518339 1141204 1392381 1298633 1075552 1219958 1481111 1292773 1387292
13903 1387292 1310767 1221367 1321133 1499792 1400572 898075 1500816 1340524 770402 1493019
13893 1493019 1026169 1254928 1029001 1141781 1202501 1085146 1038594 997764 1222115 1336132
13883 1336132 1014779 1153152 940695 1218900 881090 1057316 1352506 1180327 898523
13874 898523 948513 1116405 832303 978161 988730 895945 946409 1318507 1086426 1018399
13864 1018399 881285 939084 851111 926749 1042678 879956 1100436 870347 1142295 1189173
13854 1189173 923461 961050 1178210 760289 867438 1066612 1366137 844818 556991 978348
13844 978348 1177872 1012199 986159 646194 625825 847654 706425 900207 794678 802888
13834 802888 1041392 788572 719394 899065 978843 705692 979720 996434 825997 1016491
13824 1016491 690635 983144 624436 883992 836814 756224 625778 700363 804717 1044898
13814 1044898 1059624 861122 816119 699474 939788 500219 550216 992816 882012 672587
13804 672587 792576 884228 786436 675781 637782 913237 821944 669243 686852 851352
13794 851352 638451 747658 931448 570334 555076 909455 1049060 845297 744432 783609
13784 783609 685701 621443 832626 987400 593451 504079 430317 653240 582999 626363 864120
13773 864120 610880 742451 415105 588528 479598 661343 658553 787221 504064 513215
13763 513215 788486 583493 949668 452854 491923 609075 480324 588511 469821 546681
13753 546681 697421 1009395 484250 335728 856054 433862 641393 414896 179445 728677
13743 728677 271029 654115 482177 560405 457925 534383 612424 618285 532671 622600 675488
13732 675488 591468 564430 530525 622207 445773 573252 641869 264186 621876 465851
13722 465851 420818 502569 368964 530843 568452 343526 694675 624364 550343 494442 308836
13711 308836 442308 687258 540098 605908 254723 684005 602730 308534 539037 327034
13701 327034 561841 523198 293917 601364 534384 45373 424436 804136 425461 762002
13691 762002 488237 196519 561602 551825 526813 600148 607226 57840 698574 336853 432569
13680 432569 552368 173126 492704 368971 451971 525896 610349 512204 280097 264279
13670 264279 543444 494591 324287 521252 457028 617420 758807 297717 478856 402799
13660 402799 465502 437064 448368 247280 449720 544374 558990 480843 549160 545406 439527
13649 439527 157002 156615 492042 256327 491180 492435 541931 562771 325664 268521 392745
13638 392745 99756 336095 365154 478968 517882 628350 585694 481368 402238 397358 148070
13626 152050 160008 390589 535453 478017 495779 176551 262801 370571 596146 -65269 146012
13614 9244 82281 538845 285045 372785 449612 278705 406704 189355 309751 450905
13604 450905 409779 179645 535339 351997 347398 311658 542774 329742 98862 63802 236937
13593 236937 250918 259670 352936 542896 222749 327871 158643 440943 -101210 633424
13582 446217 86398 139429 228020 252232 442228 500898 391312 177143 461759 246063
13572 246063 355080 111737 460930 138644 463857 677978 319722 254622 147982 85665
13562 85665 537174 -10007 155158 385569 99879 642053 553916 402461 577260 405663
13552 405663 5284 355686 559490 167549 421972 -41538 343870 293940 110781 265041
13542 265041 668759 188735 395447 698275 450622 213301 571238 43705 238419 252025
13532 252025 518444 399624 407133 570870 -39124 169944 444059 196390 396664 48454
13521 279221 229242 455519 158764 216380 6494 -83889 74236 302264 274962 350295 243201
13510 243201 168685 -18968 17223 263456 180253 490600 35849 266850 164296 322061
13500 322061 56526 95196 323196 312054 487301 141591 -76735 284681 234242 324299 49766
13488 157128 154782 427965 168635 514096 45712 399065 229213 159250 256983 185422 562325
13477 562325 157876 68202 443161 231700 88545 355105 280301 177713 235880 228807 388876
13466 388876 -67841 -16521 184266 343958 529295 30474 88363 359572 279741 311509 372309
13455 372309 -37153 233481 84210 109003 -128043 130618 195370 59698 197672 158937 -137884
13443 108872 281075 296134 372295 -115583 112622 204406 360956 311482 248305 278884 -156488
13431 -121216 216184 145906 -79737 114200 188086 431589 384445 -30189 355967 58164 203417
13420 203417 91663 291376 115438 164374 188543 417933 337787 -111936 89045 283533
13410 283533 208644 442230 -2624 188143 358258 365466 238196 83649 168876 82748 403401
13399 403401 40781 -160943 325553 223750 150946 174195 -30119 181490 530206 339069
13389 339069 -57005 -46639 -179366 177218 255416 232110 193277 -250585 184191 351018
13379 351018 93285 234811 159328 108055 206732 169356 11777 159964 438425 75768 205939
13368 205939 407348 292536 309858 142692 388002 446346 315636 490459 162657 229542
13358 229542 378818 294719 71702 169858 213372 398757 83220 66104 154897 -16281 120934
13346 365468 433202 330906 288636 446412 254008 289868 266784 115236 545367 204170
13335 291006 329990 162495 142715 482756 159088 27669 157752 109684 322617 -124787
13324 94481 227305 145878 217536 170633 246371 -62730 117577 196123 347747 343930 257576
13313 257576 -96460 -30897 70462 114437 97341 244267 -39296 113390 215918 248910 340748
13302 340748 215116 -56270 68447 462191 235548 -170362 -54616 190543 -144218 130691
13291 -154856 236770 198284 39707 379712 213438 158534 5677 425815 201504 -68027 108931
13279 -134316 -116047 -61047 69370 211428 291061 277024 527847 58209 -35074 111395 -240240
13267 204626 109510 -49569 359293 95928 -57968 69572 -164898 23748 27570 -43497 -312941
13256 -312941 -138615 32905 257650 226880 334149 291012 16230 225931 -54921 155530
13245 -3397 469257 60968 346674 -65929 10997 242934 -49951 85430 283787 318142 -84375
13233 -26870 206500 -88648 -3765 -72365 7883 302980 113054 121896 260298 -441059 102842
13221 64069 162110 102750 337378 -48957 481352 -81701 -225932 -8785 236494 130354 300230
13210 300230 40097 -43568 73079 182035 -48602 -57947 -163920 -122847 5166 8944 138981
13199 138981 -352688 7031 297922 -65337 54568 269446 45255 -180273 72392 -58063 360876
13187 95940 297963 106468 112641 65845 154655 47987 238921 221911 -241241 193995 21486
13175 379885 138151 -50422 255798 291241 221405 72766 -228296 96350 90359 65697 -4892
13163 -140424 341567 -126306 -18282 -49677 -158828 -52352 264508 99130 -331448 59754
13152 -303047 74516 48998 -38108 -80093 236980 146160 -31709 -133722 159063 148083 -80036
13140 138704 45881 496274 -919 31279 221429 111910 150078 214334 339908 10587 56726
13129 56726 -27067 21602 299307 369658 108950 75334 -47803 333324 -11524 136812 208609
13118 208609 2028 21142 276729 391744 -72695 -106275 180030 100752 335162 86875 -52675
13106 63376 102017 50295 -77302 137237 239702 -7161 61545 110671 -180902 -121330 134569
13094 -8362 33204 319027 -111247 27335 149017 203747 21997 190256 276308 -217930 255781
13082 127685 197336 -179413 118468 52212 119062 317099 475376 258192 123935 -147446
13071 188902 4460 190377 133484 1326 -50017 256090 278575 260970 -129891 272033 343960
13060 343960 61441 -236134 66023 -77259 135580 77114 -42227 332443 105171 -162951
13049 348798 -34301 345551 -11729 97128 1737 33841 27161 152393 57735 236716 -19713
13037 -128410 217522 -72661 -27171 173253 -79958 240612 130720 111974 6623 238425 125987
13026 125987 -89761 173177 85122 176094 70306 18552 68621 175088 59184 135650 -113513
13014 191740 -98956 248636 135599 -202058 73476 179367 112985 211294 -107231 22040
13003 190102 148061 54468 24127 247117 -76266 74641 -26417 177423 -86783 -252456 147940
12991 -83943 343526 -174440 -18063 17137 43035 40561 -156329 180163 35352 267487 -104390
12979 -7904 -450847 236400 215179 -187001 -68520 186936 -47335 -158039 207073 -46510 330701
12967 7112 184820 -200446 240294 -204846 -126873 -18275 267131 116049 23154 308242
12957 308242 35647 177331 66553 40851 -212861 45301 -111527 -175378 -245567 131617 -22500
12945 5581 234594 -79147 110687 -311343 452977 28689 -208657 -111804 -362957 51800 129594
12934 129594 -86785 -68128 110872 -80578 -190240 -217462 -12742 326147 -425809 138305
12923 -289123 163843 -201562 284253 -72565 -12247 388860 -92304 -193569 64130 -71544
12912 289100 -25665 -48790 -190351 40211 129415 -52879 -11695 94105 87661 204639 168415
12901 168415 258545 301515 -167806 -9926 -34377 277835 -136499 113726 59264 -209829 -474355
12890 -474355 185413 109815 -47010 203748 33653 204229 -189648 329196 -107032 -102233
12880 -102233 -177516 97850 174386 -61680 5067 205636 12045 71813 83999 -301036 161280
12868 -120017 -116577 217199 84499 190431 -10238 201213 254108 172854 -124813 62384 44060
12857 44060 2966 -95266 -122271 224168 84272 39780 61758 52662 139706 -3350 -42621 298540
12844 28128 135367 -5420 -336907 283684 -97937 -972 208103 -246499 124399 78245 57700
12833 57700 388459 224904 401094 -3326 -273424 -354549 -317416 -54568 27916 -195099 73914
12821 -123424 229330 223297 -102346 132870 -57489 -48702 191475 -120082 -92149 219416 -200838
12809 152262 -72460 162889 216775 127690 121548 -71001 52268 -14837 156438 32586 244786
12798 244786 268352 -241780 52928 99063 289110 113702 -120921 20296 -93145 282066
12787 75328 -136560 -209473 -54117 237533 -150992 -125709 -14490 -278781 73190 236706 58085
12775 136985 124249 -1886 -9740 -69169 30198 -116856 -104440 -37726 58396 -8605 325165 -96069
12762 -40221 93691 102862 -26187 275482 186604 30042 -60025 -93080 -279549 -126379 206538
12750 36115 -61507 288722 -162403 140065 59133 -109801 133591 352986 -55505 187680
12739 2469 230390 252859 41515 127531 174317 -124121 98819 173049 -1114 298256 41199
12727 -204805 78020 -276991 112994 32780 40528 16444 142027 -196166 -171552 356195 -55230
12715 211285 -109929 284054 54943 124681 233744 135172 -44326 329015 128640 46017
12704 378558 -19977 -31213 -175856 -75883 28554 255214 54024 -92280 352719 8933 112076
12693 112076 120875 67732 429372 170351 -62438 -244532 25394 95950 -245080 -133148 103635
12681 2849 372453 320962 -223132 31240 400320 106438 210292 -52514 115405 -113422
12670 77681 2844 -51709 164666 -150669 160048 358656 186662 154189 -137739 9806 293531
12659 293531 -15780 117993 71081 120958 474364 -43105 110476 -18477 -59017 60996 331155
12648 331155 172423 4214 183657 -45245 184423 -65193 -221882 80309 306701 -50792 253385
12636 110557 -185496 -2522 -116431 494184 -9125 -41365 264630 243290 368927 -76513 91822
12624 103573 -77861 215483 115939 388728 -149422 337839 -74002 -19593 106287 175191
12614 175191 150476 -57443 33181 -360282 244070 15344 -178902 -226613 57000 -46683 -85872
12603 -85872 -8160 165317 167928 19072 248293 48900 42062 -87657 355715 157592 143739
12592 143739 -35216 121990 330350 222515 167868 -227387 -236606 37818 -203902 53711 -63971
12580 -201490 -16625 130501 -46153 -164575 -235719 -259337 -230558 -166923 -82990 77399 192483
12569 192483 217132 42035 12404 -106776 547 -52371 337613 304014 190226 26480 -108933
12557 249689 98849 -66056 118137 499083 -144708 295438 -115340 234626 -15354 -140655
12547 -140655 246059 -89318 -126321 53956 -145431 -192713 -233867 10631 41815 -216176 20326
12535 -195832 -82487 57660 187604 -168390 -68884 -81866 110137 -194826 -222092 162092
12524 112392 393293 96327 76764 54050 31004 -70399 -2697 102420 -86165 175529 -174208
12512 -25873 -43397 37186 110523 -145189 250206 94209 103471 171061 -101936 238077 -41528
12500 113132 42744 -152451 -95122 -261050 356715 246772 22899 196337 -99647 -80117
12490 -80117 -37918 -115434 213801 19635 -95108 -129564 -108630 28278 279283 -135055 87724
12478 -142493 297642 140846 -126071 -132543 -117381 76132 -60999 5815 -131280 222365 -67703
12466 33032 -25479 79368 222628 148246 -16978 46365 83933 -193324 42926 -347239 32509
12454 284025 7179 -137774 255634 119918 14438 288299 -64611 -211602 -151741 116673
12443 -17413 101356 53688 -33904 191443 100725 50945 -28867 82073 32821 204959 221587
12432 221587 26685 45050 -20135 -243440 296362 -231105 -315427 -119487 -15703 -175389
12422 -175389 -74807 122399 -193451 323596 -3206 -160401 215147 -404506 192460 279672
12412 279672 4942 -334685 -218574 20342 232773 114133 101326 -305 93233 291466 83054
12400 235761 -60006 182664 117588 117261 -163135 100514 88480 259945 -185047 -272566 20496
12388 359207 -46165 324007 -176018 -151442 210254 18571 61192 39763 29861 -53537 -140369
12377 -140369 173705 -137272 -95054 -333464 -15242 94990 -141761 -258459 103481 -207647
12366 229696 60558 176436 -276520 141132 42588 65572 271335 -264918 -39980 503757
12355 -101579 -176339 266023 294902 -381122 15 -37665 208886 -231470 -191098 -391464 -130407
12343 -28645 50877 -283470 136213 -225920 -187342 -13503 -69768 5121 -69288 -114670 94721
12331 237912 -70904 -130791 188101 138761 33347 -64600 -56743 -56426 210956 -49549 -368119
12320 -368119 95715 -10151 -145859 108308 315285 -4577 1028 -48657 51145 33631 -213830
12308 35716 129147 186140 -67831 291390 -42300 356626 -121174 -24484 -262546 85217 196509
12297 196509 -137611 85502 150897 -32641 -112237 271033 -136325 281815 244716 240381 45136
12285 141090 147119 191768 237226 240578 -62546 136764 84261 -51105 -8630 51948 -40922 112547
12272 -65176 53412 201759 19179 -125597 59793 212957 -68817 -209809 137940 2919 -162137
12260 135208 86483 93752 -26056 88773 -50281 -147848 122516 91726 -57661 41402 -1207 70729
12247 199503 17760 166820 -26930 -102422 -33373 158685 -236376 48302 -120461 -334186
12237 -334186 -54296 -14765 -153279 124077 185096 179192 135494 99153 161830 445471 374059
12226 374059 316575 37599 159848 262786 70481 316876 147689 190770 410275 142609
12215 251259 353448 133349 133390 -11236 443439 -140737 255135 151891 144514 439458 121861
12203 426601 380887 392040 219365 416222 -43358 140263 535326 765 437431 82592 449421
12192 449421 54520 -30515 81821 177822 132206 -187918 87543 154162 253743 38754 -14188
12180 30405 144753 9685 111659 226273 30489 182879 88252 198059 -43574 142451 -92689
12168 28240 44474 119061 199937 243893 -72886 153003 263512 59645 -52538 300048 135975
12156 350061 -177714 115929 131243 -66914 -19805 -5503 -259587 -64257 -118125 204565 160415
12145 160415 -9045 278383 -130614 142095 94559 23228 86977 25597 -81003 95457 250716
12134 250716 161927 -88714 -121459 580700 114060 -52778 248291 405774 -55277 -50123 59087
12122 37119 -55993 333711 -6175 385415 -86483 80755 156170 -355815 -162691 16965 108863
12111 108863 -82263 247057 28011 7167 -82009 344461 -38412 185705 -78778 132842 -261932
12099 -233392 -336144 -319394 -21621 130537 -120748 -115268 -56859 195083 72770 60421 -111400
12087 190512 33349 -67661 168974 -160558 110732 73581 -326272 157166 -238932 24455
12076 -84851 -127721 -172427 -10193 -101408 126369 234697 462249 2090180 1322819 262661
12065 431562 -16825 -111016 -220215 179336 -82108 64519 246633 38972 -17205 153969 -91618
12053 98515 -3287 92568 -247658 -491727 -302318 -88812 -254804 28272 -178111 -216167 -178841
12042 -178841 302802 -93781 39491 34786 124878 -152940 -163629 -162310 -310217 127253 -92650
12030 -255150 -40686 1261 384115 -148525 45548 204557 -236243 -307601 228360 -115201
12019 19141 8818 71855 -88387 -82588 -30834 50578 -150327 -257129 77653 3732 125749 -171582
12006 136104 193687 -159206 -44911 -168599 -56786 8643 -191609 191484 -193379 -69643 103233
11994 -66590 57571 8962 167368 -103918 -267678 -270601 -311548 -94046 -113212 14859 108618
11983 108618 -182446 -81114 -53447 128150 101758 -165633 -193962 86376 -182436 -31913 59205
11971 -7990 85611 249733 -83588 -264996 31146 -31755 266748 48488 -29847 21803 93029
11960 93029 33355 198214 60706 62837 87167 -152163 -60570 -180596 42656 -116559 -126703
11949 -126703 93142 195944 126567 -154654 152604 44909 -114433 -106870 -309232 193065
11938 -19761 -5727 -21987 147029 -145067 -206447 214390 115592 -170682 72082 -50158 -100418
11927 -100418 -134027 -49402 -68512 -91579 117449 -47266 -3461 -95672 -197507 132823 -111247
11915 279457 -136596 -65756 431693 -131783 85721 119342 78367 -18950 -93027 -5291 144371
11903 184981 -202240 -25216 107750 58260 -242807 -31497 -38257 48154 -57602 1501 -38725
11891 -106906 26813 127646 35706 76392 -37108 -186346 -193760 143001 265523 98662 34896
11879 -568 148697 -205635 -87791 -191166 22713 25178 -65386 -166633 165380 331252 140133
11867 -35617 105557 4051 -160992 63872 179724 191382 62910 -139581 -14962 -210203 -9121
11855 -63002 -350246 124785 41651 -228594 17865 279227 -140580 -237453 -435066 99648
11844 -99295 -94342 -142031 -230958 -267032 147521 173845 -149657 -45691 -646221 -70882 159949
11832 6592 -102800 242441 -160260 -120783 -294020 -33455 70816 77617 73245 -42247 211209
11820 -90153 5519 47224 10412 -349952 109788 28426 -84866 162774 14174 201000 192794
11809 192794 -183606 -92448 170586 -286832 -345152 -183643 81648 236931 206920 -16727
11798 146487 150834 -36382 43513 106693 -468342 194957 -52847 -53344 1877 -134050 109936
11786 -140152 129057 219610 -238068 -29362 -59785 -379081 100046 33752 357626 -52808
11775 243065 312893 61841 -95284 -276110 -12473 250146 -32170 -222460 -359073 -315977 69122
11763 21524 127542 -69653 -44939 -19564 -46604 135001 201271 -170496 103313 139334 -276398
11751 -326122 -166396 -203572 -21612 40516 -40639 -191831 -92356 -123098 82 30754 116409 30093
11738 19238 -420696 253807 212910 181798 133432 -236845 -88939 -319666 -61573 -45256 -278695
11727 -278695 -19363 -209613 28955 -361989 145427 503311 -26477 -23442 130237 19279 6078
11715 -55079 -53574 90028 -14544 -265845 -101018 -122201 115144 -109111 -48364 174846 -64784
11703 188569 122128 398833 -10873 -94475 2951 69383 89419 -4481 99425 -142944 -8204 388172
11690 -75625 181545 267995 -132509 -144569 -71265 -90078 -31344 -177695 75644 -137061 339246
11678 61551 -73794 298552 233334 -58823 371790 -135742 -24165 201442 -124775 -77487 182434
11666 -214136 126733 -82933 -358911 104930 361012 110924 229129 -23465 -51006 142682
11655 156062 -326359 -205708 118545 154196 96052 -220315 204534 79710 -97934 -193583
11645 -193583 299669 68014 -246309 57757 213278 -107066 -13273 142504 -61212 327038
11634 -179513 99960 -169793 -37515 68944 -131483 14363 190637 -182247 131906 155133
11624 155133 30802 236996 -22692 -166355 -67837 -139302 145426 -128573 149270 8646 49890
11613 49890 220842 93391 425046 147073 -197001 -96542 -80344 277794 -168382 151932
11602 365746 -150838 139894 -184689 119152 -69532 32191 303134 137219 66687 140654
11592 140654 -49415 1639 114601 -126745 141273 158121 208730 211321 -97629 -146923 -119672
11581 -119672 230185 -176626 -19098 57193 -152931 -268801 148272 5524 -41599 148060
11570 -40974 281877 162103 470886 -62775 -143432 159542 436369 258713 160863 -155604
11559 86732 103759 167836 28174 -124567 -194323 -149074 328649 -5431 248751 350246 -126321
11547 -16566 145471 146335 30924 135798 -73344 176662 86715 149930 169687 -155620 131141
11535 41754 -57578 -144340 275946 -27532 228480 52263 72478 151000 -75877 129675 78410
11524 78410 -112721 200990 20239 -141166 19701 95675 287718 -120100 560520 -107060
11513 372538 85667 -99847 117740 72768 229367 8498 322 -67859 322494 167100 -18807
11501 -91985 -249122 153903 -66317 380556 87809 210797 15218 221322 92515 53074 185287
11490 185287 282671 21018 136723 72859 80274 28913 261506 556924 -18092 -28664 349065
11478 143632 256033 173382 18006 -5862 143025 -3286 419468 214445 107449 151564 160049
11467 160049 124030 565176 -42877 205518 -205895 160516 208502 176016 49195 216332
11457 216332 -69459 282578 55147 374452 122785 294405 250372 -163020 68171 137291
11447 137291 184182 211221 147143 393945 -66765 166473 124140 -131160 34033 232444 139561
11436 139561 51413 78162 285228 -166699 41019 38763 105952 351584 8513 -99920 -70838
11425 -70838 229465 -184792 -6545 -529849 201522 -121516 -113849 4440 -24246 -271054 29058
11413 -62324 151548 -241407 252283 146661 124682 106151 388561 229509 159619 125382
11403 125382 80903 -11580 219033 228878 221527 47301 12985 -114816 102586 343001 55272
11391 155282 -160394 24220 33090 50863 -254527 100964 92363 -152629 150500 -170883 21616
11379 -289895 371222 -461968 138518 145229 138873 112685 -68393 62279 -439153 18711 -268159
11367 -136051 -46110 -80945 28664 -190483 40230 -269934 108614 -167381 -70694 68860 -73373
11355 47577 -43147 -10191 137359 -151303 -217407 99600 -38487 71869 -515275 58504 128284
11344 128284 133949 -15496 -72135 -60164 215168 102856 -131766 140777 -6900 -111056 -74642
11333 -74642 27844 -81811 -15184 24306 22343 -123152 -306722 102042 77700 492227 -134795
11321 328392 -214525 -184976 185274 40256 315980 172298 -82160 201893 7021 159109
11311 159109 92144 -163363 -61363 -63342 208984 -82179 -263925 -192779 -198415 -12699 324780
11299 178811 -72780 -288493 -229900 96201 -61245 -175244 -216602 -304092 123324 -287863 -114484
11287 -44975 21596 -207481 -147333 -156409 129116 -57074 -47066 95257 148292 -84637 23764
11275 -39169 -142096 -125488 -98891 193710 -223633 -96615 -37178 -209249 -129967 -119370 -3911
11263 49519 -97648 -47889 99143 -54701 -144885 194404 43706 7981 -174884 -94484 -82276
11252 -82276 -101137 70757 313194 108856 29571 -229278 -213406 -178506 -122346 112528 -86983
11240 -41349 -163805 85444 15241 -51346 43904 -254830 175376 -120995 160252 73114 278479
11229 278479 -37507 -102582 329073 -330111 -35511 134687 -272631 -96010 -112984 -428841
11219 -428841 -110900 -129880 -274641 -260553 46456 129696 -135421 222152 -72847 64357 70003
11208 70003 107957 -54370 101242 -103979 257100 -200008 191725 78825 -177549 -200990
11198 -200990 -102054 10645 149331 156586 -165576 48337 -9379 53724 31683 190585 89415
11186 300405 -90807 97982 -124193 7088 -30088 96161 274107 -64341 118512 6924 -153768
11174 -253668 189224 -68713 35880 -265907 -60403 -115760 -199176 199545 177955 -6439 -85408
11163 -85408 -342863 130436 -146184 -17128 -18812 -147532 287320 -194235 -265826 -184653 -91053
11151 213830 -262401 -82965 -27825 -183578 38092 -57366 28456 204435 6293 76114 338958
11140 338958 -283173 -430798 -60595 -162907 78041 66298 -2111 359865 -76307 -72903 97243
11128 155833 55969 -77787 218335 -258967 133668 225554 61369 157953 69315 30745 55677
11117 55677 143137 287853 187242 -205871 23233 208791 77426 162237 166201 414029 496585
11106 496585 121321 288466 106476 341873 53944 323482 -112318 105853 98551 -21967
11095 501149 157595 491486 208293 326964 115205 401384 62944 -43888 345861 416681
11085 416681 414244 296009 76000 119190 465934 351082 186956 320169 617666 -36261
11074 -35790 637596 373523 134125 474220 461933 267217 394751 377076 265732 699748
11064 699748 541024 470567 286038 376537 564849 804840 1064282 608973 584553 735239
11054 735239 303879 857776 919619 898707 974012 672894 713467 706551 1024786 834987 768192
11043 768192 757693 857039 502965 939677 679263 713658 803902 955629 986513 486010
11032 654103 938521 533590 580730 1071414 887153 637209 1005289 438071 822423 790980
11022 790980 1083812 1027373 634955 637352 642393 542142 784301 651704 631822 388261 373436
11011 373436 739075 598459 834528 1003818 620864 748765 379599 747055 416752 668824
11001 668824 835790 518322 161615 412672 931170 794418 481584 668590 714978 895094
10991 895094 820855 642523 787573 796829 897437 913187 1226064 1136437 1164420 1353397 1339507
10980 1339507 1507488 1222912 1765408 1626283 2010455 1856892 2154579 2588057 2980256
10971 2980256 3217442 3421232 3557750 3525784 3187396 3233797 2564610 2274354 2265786 1687482
10961 1687482 2044280 1806376 1684855 1414570 1680205 1497619 1442524 1338666 1271864 1175355
10951 1175355 833673 1059116 900957 818148 407121 512244 574511 148741 281693 175776
10941 175776 470664 405844 66328 77372 62966 270349 438525 -17883 273640 170176
10931 170176 -42380 132562 40209 240137 118649 -39752 197686 146552 111252 -201432
10920 -217392 107705 97675 101632 48641 24594 -29120 -141315 155497 195508 18258 -263870
10908 -283157 46357 -124540 -32406 -103179 36972 -18699 -151833 -184600 259924 -92694 940
10896 -165116 -342178 175950 -33055 15977 59209 8448 50275 148924 7719 -68748 68198
10884 -402859 -217552 370417 -6243 -80048 22779 245764 -160752 44895 -151315 -294200
10874 -294200 99308 -4998 -187887 -254244 -4356 -35888 -142953 -305751 78373 120073 -165324
10862 -377261 -204993 -84076 260827 -43952 -36871 -60129 -90274 -80954 -193556 -59240 17149
10850 276467 78425 -124278 -112009 89103 -2280 192671 99985 -368900 -75420 96531 18535
10838 -23446 -262295 311300 54901 76704 74172 399254 -83219 10647 66110 176312 -358347
10826 -94257 78041 36167 102624 -11769 599 428963 420013 70588 -191669 134516 -18873 -112360
10814 -112360 -338234 20966 -198116 84104 133046 -227469 66198 -159481 -9454 93798 -327500
10802 147003 -52122 53814 -137907 108905 -211725 95545 -53954 -222289 -229688 75066 -313573
10790 -121039 -17732 45446 70347 72047 -106754 301851 -50635 -47712 275519 -179 -239592
10779 -239592 14131 189493 95727 -25558 -160759 -4964 -54670 -78494 -66326 237181 -56882
10767 -78403 242163 33672 19440 -112414 -226856 -288898 46173 13514 -73373 -332536 -45529
10755 -32906 -14468 27501 -91183 -160680 298552 -183789 103968 33116 -12312 141990 229734
10744 229734 76115 174613 225729 209320 114266 -393434 90987 9558 275333 -560090 -119334
10732 -18587 270023 26893 125408 -88608 -312248 105615 127633 167566 -69675 122106 27882
10720 92599 -291760 137712 88538 -23468 -259218 -41882 -103221 67288 -244438 -107300 -5897
10708 -185417 97446 -67428 12711 -289301 -50233 -238215 -230872 -84983 -63571 -452467 294891
10696 191701 -83608 59824 -270528 -212259 272466 -24391 43206 -115506 -103248 -54744 -143624
10685 -143624 -61118 110185 -6948 141486 -100690 -462117 14085 -150830 229514 -112626
10674 124327 -56130 -93795 -423230 -229056 -170677 -337181 -321348 -159755 84900 -69056 -56093
10663 -56093 -208002 -174495 -147619 56874 250029 226432 241978 -101766 99128 26138 -47320
10651 -67227 88028 167790 19599 -150410 162810 -111029 -292489 -351206 -39338 -138184 -343929
10640 -343929 -177969 -55632 -163914 169365 -208553 -367070 -24544 111055 -205435 -339576
10630 -339576 298590 158559 73776 -229333 49403 11124 -242466 25575 -78361 160911
10619 489496 39180 147010 172346 86478 -400115 292503 69851 -61444 -89096 -171134 31514
10607 -18724 32162 26292 -143261 -205654 -111193 -206552 66562 -310573 -382577 -66280 194285
10595 313107 -14950 -349583 -31273 -341241 -112949 99126 47793 -22179 -96212 -57801 95003
10583 -163509 -82813 -218213 -300475 82459 -8700 -54657 -352105 -149822 -183139 189711 134072
10572 134072 -213610 -85014 169506 -154327 162112 -153434 30337 -117898 268248 7850
10561 116461 -193342 40692 2103 -106120 -35097 -26665 170406 -62799 -112878 -455248 261392
10549 -37949 -54786 -197887 42983 -264176 -223041 -68190 -413900 60877 -94134 -70704 238058
10537 -89518 84592 63454 -86114 -159434 22707 -40566 -144771 -18240 185523 138198 129357
10526 129357 -193502 86308 39214 91784 -111990 89206 51655 -67955 -148054 -119695 -22882
10514 -296771 144041 -186667 93639 336386 -93438 -334949 5766 -203457 -49193 -44141 -3606
10502 242578 31686 45980 60341 41147 -96426 -204184 -322953 111345 86769 -144623 -79659
10491 -79659 169278 -187936 196860 -76425 112174 -364400 -53221 250793 -79203 -20004
10480 118232 242341 348058 360443 75704 40620 197868 469177 198266 26026 117481
10470 117481 278637 135266 160665 -123712 -95923 -241462 168805 -20442 453644 36000
10459 -14260 98950 -85880 -7557 -243379 -13602 310060 98671 111458 86319 137491 47401
10447 -354481 616 -10519 31396 162630 63890 -6178 12633 126899 213533 -216885 116980
10435 -368934 -197431 -112616 -143873 -253588 390525 144935 -129918 -6942 98825 130879 -32979
10423 152581 9452 148859 -197707 92552 184021 39451 -347533 -187953 -138235 232151 -60359
10411 70170 42897 -165835 14386 120264 238606 -232070 28782 -214491 62729 163236
10401 163236 -127513 -112586 240585 -56034 11449 -277569 -208610 -22365 103850 12403 418008
10390 418008 -58572 4411 -80416 139306 263246 274095 162747 223518 -183032 102285 37246
10378 76790 463988 352040 329799 347254 331666 -45280 -100352 -150749 162564 331655 281410
10367 281410 509420 482159 579006 196299 533021 2246 -5474 751521 357628 518180 -39219
10355 213967 35760 97755 206368 361663 610336 630202 775547 428709 517556 203789
10344 64876 155598 350423 316522 342429 40312 119082 298392 162659 39857 104082 77170
10333 77170 160328 -82523 133272 86120 275047 234798 30749 -43163 176404 131729 -84356
10321 172731 38905 -2325 303819 86479 104181 113020 -13015 317097 -53526 147936 70460
10309 30475 287520 2345 -9921 32602 -43040 346633 43876 -258594 79426 -156217 -83983
10298 -83983 -40685 232313 79010 15118 118608 69668 -83185 189217 68616 -217811 69078
10286 40016 7629 -266847 34948 -346869 -21001 44370 -152327 19226 330886 -79953 167383
10274 23151 22871 463624 114982 -229926 184586 218023 -114555 -302430 218358 -25222 167115
10262 -182324 7086 -38264 7152 80070 30596 230595 263807 536805 -272778 -84684 135445
10250 -19964 -80706 -96130 310505 -159997 195000 90970 118100 108455 27653 111135 -157253
10238 -104555 -414741 -302671 -22888 -169651 -16858 47673 201397 103345 -372136 111249
10227 -64082 35554 -98246 -104383 -214713 -197408 -130633 -84941 -50126 26276 -211148 -345942
10216 -345942 465 311563 74970 103332 409480 100072 -61632 -121739 -7255 -56139 -205571
10205 -205571 -93674 -87556 48967 -34998 252503 1867 -43912 151036 -66932 102102 42540
10193 260284 -18151 -202672 -26584 134275 -143451 76690 -61400 257767 -124188 146935
10182 -215922 -116305 -29155 67461 -104813 159747 -224213 -39742 -28593 -139578 -264589
10172 -264589 -132677 58733 -337883 -37093 -165169 105239 -191372 40472 -189058 5269
10161 -50211 -356943 -177809 -52391 -130225 -200568 53537 -2384 -81074 -40082 -62342 -457136
10150 -457136 44866 -167714 -176260 -1989 192595 -194028 -523465 -703 96800 -335781 -369660
10139 -369660 -23349 -201134 -212433 -183263 -144506 9831 -92683 110509 127632 47278 -71932
10127 234772 25785 -167796 -35132 -221412 371252 114900 208970 -159820 45707 51023 210049
10116 210049 -38249 -11029 -161838 -547897 -97467 63873 -32600 -46233 -101707 -227771 182163
10104 -114766 -5640 -284974 -257250 -270658 -79591 -20707 -54125 -215831 32947 -188676 33298
10092 -70840 -126272 -119928 -167350 -1711 -72804 -202219 -341798 -141083 -157502 -59995 -160562
10081 -160562 20559 249833 19993 -491065 121531 66452 -178392 -133924 141587 -195834
10070 -98972 -20705 56833 -47444 -195767 -34560 -255605 -143240 144708 -5302 -163863 -261135
10059 -261135 -198118 -11619 -83685 -40800 -196518 298044 -91703 17233 -185557 49466 129709
10048 129709 -59901 61989 50784 -221101 -112315 195829 -257609 -224196 -93052 -263700
10038 -263700 -122922 364014 34122 -262877 -76094 -86326 -394017 -138848 -19151 203514
10027 58655 65013 -225319 -210869 71015 -204659 -87715 327207 -122059 64357 -99532 -185346
10016 -185346 -109286 42302 -5877 -261595 38923 -329611 -95297 -145535 -159593 -67655 269615
10004 46571 105933 -288866 -25125 22810 -191203 -99349 -124115 122131 238474 64464 -84566
9992 112948 -139129 13377 -3178 113246 -33431 -70564 -164359 -412846 -80028 81665 -223805
9980 -60241 -273113 111954 82413 -328345 -122926 -142758 -75846 208781 -255161 263771
9969 -27687 -47572 203987 -103007 -394976 307944 186407 -225225 -160250 -89964 -31989 -151285
9958 -151285 -112522 43332 95256 120196 -212578 -207451 -13532 -1983 -84145 -172380 116930 175681
9946 175681 -66059 -238354 -221303 -48855 -227379 -46647 -180073 -29518 -275681 15746 43410
9935 43410 -120385 -403091 -161963 -248953 -184766 132681 95215 -177299 -112613 18592 222533
9924 222533 -42387 121894 -288068 61688 5507 -157452 -86094 7544 -137849 150249 -216720
9912 103435 19355 -146105 -52796 -213757 -42501 -194760 -183708 -329594 -21953 219213 -139567
9900 203901 20224 -26792 -69438 -243643 -426833 -364157 -206102 -14422 -68360 -86046 -153605
9889 -153605 -192422 -247359 -103927 -510719 -142746 -161619 -311083 211590 -191158 -265439
9879 -265439 71662 -69115 -74193 166809 6711 11928 115080 -287468 -96176 -71883 167332
9867 18802 74820 66935 104301 -50618 -136323 -393221 -46982 -66825 -41021 -358085 103221
9855 -24604 -77549 225507 54629 -82051 148335 206563 257844 -231946 59061 55344 139528
9844 139528 255266 -192523 -216322 -126098 181179 -288501 -185097 -245748 -241192 -281428 -373461
9833 -373461 -372521 -108578 296594 -8342 44463 -204230 -262119 128577 474949 -235871 -79310
9821 -30854 -45722 84003 -216695 -11634 -132981 59695 -237958 154829 -138219 178089 -158148
9809 -66374 -179622 -363561 -58901 -332169 -81372 -218236 202511 136083 6185 -7441 -12451
9798 -12451 -66192 -172205 63398 -163878 -7229 236744 208870 56494 -171642 105221 5934
9786 -90658 -50079 35644 -178027 -15128 -132938 165001 -90167 -502882 -69153 4440 -199961
9774 75628 -72233 103108 -38535 -113747 -81622 166917 -337697 -68533 173874 -291006 -23107
9762 -101473 -309660 45705 -267650 -82745 18695 -241518 -167770 421210 -62200 -88531 -338794
9751 -338794 -40569 89235 136779 191033 86712 -119440 -26948 317370 -19010 -254421 -255209
9740 -255209 -89733 -70751 -183741 66788 -171525 -271188 -59703 -349349 -242396 13245 5398
9728 -148537 -89249 -29801 88994 -262089 -175975 -127879 54148 -160970 -291089 76835 -418541
9716 -93939 -242177 69015 103702 -54381 -309925 68560 5587 96914 -182341 39168 256745
9705 256745 90143 140970 171768 142866 -54591 95828 -95972 165219 -51215 145378 24654
9693 -25344 -148187 17793 -300810 -162249 -91263 -234159 217756 175442 -187670 -89810 21318
9681 72165 -197768 109235 -41163 214521 -218759 -105065 -155562 37450 153657 -368395
9670 100344 225196 27980 5532 -81344 -383763 72325 147795 154150 -131811 201701 -2864
9658 203089 -226220 -163129 -97869 -52853 16232 4258 70115 163343 71210 -70366 -195048
9647 -195048 -220932 -119099 -62437 123626 96474 -36246 -251670 -239084 118853 115944 95256
9636 95256 -153850 158579 -186855 -118087 12870 55262 -168487 -13649 94503 85087 -188069
9624 187947 -118326 -101019 -45234 -51423 7222 104027 172010 64221 132486 -30711 -21305 -283401
9612 -283401 -10389 -246497 -20218 -183384 135050 -225128 12356 35397 -114893 -235331
9602 -235331 -260714 -53291 -322656 -273118 197193 122361 170320 62913 -308149 -276300 -286193
9591 -286193 31558 -53113 142069 -50285 -287176 -36873 211165 -42160 -306999 26089 -204516
9579 -215604 -422004 -94087 -118619 142379 -125784 132868 -366771 -39313 -156045 -251686
9569 -251686 -335266 124705 -117730 -13204 219174 -394406 -33876 -177350 -176218 -162411 -393659
9558 -393659 236046 -153086 -17367 23308 166682 -102499 56767 70837 -104355 120556
9547 242220 -113111 -164587 -131200 -205805 -187002 -160788 26671 -124101 -2702 52814 54454 129135
9535 129135 -122531 239936 -106502 -200017 -73776 154533 -51485 -327565 35131 -231949
9524 -124245 -81520 -210380 -292854 219292 50999 -310308 -113868 -203494 -268557 22428 131985
9513 131985 -10235 -300376 -234620 294405 -236407 -136791 33649 70376 -109858 -141109 34131
9501 62954 -562382 136811 -319254 -53262 -303882 290645 84553 28743 36327 -142076 120984
9489 24634 -268950 -153101 -68899 -236082 146147 -211015 -212810 -76624 -295652 -99425 -218497
9478 -218497 -4757 -272949 80493 -46870 -4192 170674 -17578 -274731 257594 -129247 147380
9466 109074 -170941 -246734 -273979 -6150 13986 -165011 -187996 -90992 -213509 6418 -3581 -57758
9454 -57758 295086 167502 34453 -23203 -149066 -319056 -114230 268385 -75538 -102900 -78533
9443 -78533 10539 -32096 -355486 -194705 -327117 56860 18797 -109969 -88826 -107390 49527
9431 -90926 -140843 -67343 -305294 -108992 64026 457192 143608 -185272 -229087 -202968 -33163
9419 107351 -292690 23058 -457440 203191 -171987 -191622 -288664 -22982 150265 165359 219294
9408 219294 -160049 -247900 -177853 116488 -244416 -430815 412 -33009 56787 135059 68976
9397 68976 59140 49254 -237684 -186780 222715 140 36429 87685 -182061 -100772 -79037 -115596
9385 -115596 155459 -11157 319565 -112364 -231902 125305 -136337 -17704 -330718 -249986
9375 -249986 -187375 -20620 -312766 -207799 -9426 43316 -184158 -235417 54538 36739 -138615
9363 -152353 88433 51587 91998 -20765 -372901 -116635 -406133 4686 14212 -298402 63157
9351 81909 108764 74071 56472 -174636 15618 -252175 -69528 -80686 -34754 31254 230935
9340 230935 -243760 -144995 301241 -211177 -29763 -92078 120728 -56608 -114071 172869 -445704
9328 310255 -43353 -39438 -143300 -71346 -122018 -25557 -225388 -80285 -73786 -98775 -81972 -34219
9315 -145455 242336 77970 -75879 157062 -48346 14891 -349370 -24327 -194381 -204279 -37429
9303 -358612 -128720 10180 -367293 -87519 158110 -79701 -123216 -250230 193312 184112 -219542
9291 29154 -282432 66353 175632 -583101 -162417 67692 -377702 -114771 -28712 -127149 65662
9279 -207031 82687 144923 242627 -122027 83848 -95771 109325 240859 41650 13972 -48238
9267 63749 -16597 -43896 94693 -326075 89923 -221356 -42085 159170 -213186 3367 119959
9256 119959 225490 -940 57776 -166707 -99984 294481 -133673 82087 27380 -28750 24909
9244 12235 -15872 -149064 -191566 -269046 173981 -156594 171963 -9353 479066 32384 -307764
9232 -295480 -79707 140783 -132838 -70170 -169202 103567 -49517 62256 39184 57777 183330
9221 183330 -361951 -178950 -324227 -56754 -260891 175892 7741 -93199 140196 122454 111597
9210 111597 2853 -177112 403562 303928 -153520 -272561 -108929 91455 -189911 85248 -22896
9198 -70437 -265341 6223 -132904 1997 -152117 -188815 -313626 116062 -112533 -233271 -124639
9187 -124639 -253366 -104438 -149873 202200 -140643 -129873 -50307 -339071 -238952 -188071
9177 -188071 24807 -268326 182096 29136 36597 -289380 -351039 67167 -169716 119544 -238739
9165 -9720 -187602 55134 -236390 -184227 -489161 -178428 -198409 -151233 307230 2175 -62845
9153 -168547 -257147 -141020 104058 -127922 45591 40533 38477 -174262 9661 26249 -248934
9141 -126103 -143443 -62706 -218022 144786 245910 85105 192864 113992 -10287 14657 -48462
9129 106033 -10355 -113673 -15532 -433048 40020 -181976 1555 -38765 -259052 -46086 -178253
9118 -178253 -335882 -136963 -1029 -68997 251928 42762 -224977 -86725 11201 14028 95137
9107 95137 -333325 77896 -313818 119982 -412041 39084 192638 -221080 -193981 -85946 -122799
9096 -122799 -200580 -151588 -22380 -371509 -226378 -341005 -87357 -246765 10316 -168559 -147205
9085 -147205 152732 16602 -248463 -68800 -63523 61572 71987 352507 138587 178211 134575
9074 134575 14816 -86766 -174843 2686 106117 -67629 288251 167455 -170167 -103145 204649
9062 -286287 -344578 -65910 -169028 -167837 -182048 258512 -88765 -145331 -335987 -76236 -211513
9051 -211513 -139737 20277 -30353 -168660 254752 -149579 152275 -155316 -214702 -196295 147819
9039 108134 -44936 43889 31851 94018 210552 -323809 -40724 -73804 -125364 -1600 -37516
9028 -37516 -227377 33080 -333084 -184176 -1010 58306 93249 81204 100680 52326 -418043
9016 209914 376189 148932 48459 64061 195490 -243351 -37743 39588 31 -57851 -548126
9005 -548126 -193898 216121 225229 -221232 -211080 -74839 -65970 -301278 -254757 -194350 -124509
8994 -124509 197197 152800 118326 -144793 81380 -77405 -14506 -152065 -140179 270880 168534
8983 168534 289600 -131115 127556 -235870 -163598 75436 273072 -77529 -238043 20413
8972 -122005 -51907 9739 -288761 51104 -88007 323538 -56298 -332541 -60723 -206023 46069
8960 -16451 -408279 -175312 20013 -20032 -302857 257834 89325 -231006 146692 188716 -133681
8948 268872 -172743 -234824 43200 -127041 -74379 14724 -42847 70082 247269 -29541 173091
8936 4124 177149 63796 50512 -298914 215947 -17870 113770 -356025 -54015 -336802 -289090
8925 -289090 152985 268118 278287 840431 4818864 785235 198567 -48461 -265103 -143964
8915 -143964 155185 132354 -345231 -176658 -424 -159032 307610 221168 -98643 -80737 31565
8903 -280120 14602 -46359 -146008 -43536 43008 -225803 -125228 -123377 -180422 208104 134111
8892 134111 -107218 -397230 -3869 97548 -35726 124033 320552 -136582 16918 -191683 214528
8880 -257825 -291307 -24605 -91375 9160 213473 -38885 -30382 9911 -108739 59054 75353 -27644
8867 -283874 -135570 -28014 252513 177552 193706 -302318 -45071 147819 83036 -88135 289396
8855 29962 -37522 -421055 -29727 -223867 -281736 105257 165783 -817 -182519 -180353 157928
8843 129935 104429 -29101 -72746 -252099 -126567 121982 -22447 -240009 -157445 -71465 23172
8831 -358849 -205902 -6795 -71551 -147934 -160003 -57107 160975 -33200 -79329 107067 83854
8820 83854 -69981 -86156 -340718 -491413 183051 40222 6009 304195 -18268 296774 9126
8808 -81359 70292 -12177 -124814 89434 79517 -71877 -139749 234527 -8525 353943 -92614 -129910
8796 -129910 186246 -46305 50540 39223 -456337 -8426 119356 -218478 14778 -202322 294120
8784 -26367 -12678 84914 95816 -74713 75972 -41110 -116810 -172283 30411 -87000 58714 -478449
8771 -56488 74479 -36941 -39478 -1956 129648 -67620 187419 -75604 164220 21455 -141336
8759 -88597 -168636 -203109 -309468 -320488 -189793 76061 -33010 -45591 -189722 192848 -1393
8747 340867 -407057 117111 -5112 304178 -1898 -4713 -192894 -175294 264276 -44953 -111559
8736 -111559 -100348 327662 5486 -67412 119669 310392 20038 3940 -121744 286973 -192527
8724 32355 -188456 -401910 -83550 -159755 -155534 -209898 -28202 81875 -3059 97054 196376 -7772
8711 -42700 150020 78675 50961 -187203 104454 181291 -49383 -155431 -121319 -226044 -87344
8699 -152791 -501192 24707 -262525 -300518 -217538 26367 -51813 -21626 -123389 280402 279714
8688 279714 -327071 462 163208 21586 -114177 72580 -59211 42876 73994 24393 361592
8677 361592 -125220 171939 159504 -110251 -107085 -15673 -345202 28267 48549 -62335 270591
8665 -115547 -42919 -109539 -131858 -285522 122773 31158 -331922 243330 175246 54018 -208610
8653 24636 24678 -89251 -201085 -91482 80665 7879 -152852 -47510 -285561 -18165 -135562 43847
8640 300313 135047 -115450 37162 -102771 144867 -132456 -138299 217711 11628 405250
8630 405250 35118 -90979 -51710 22019 -243953 -13470 444852 -274013 -215563 -16608 -144031
8619 -144031 35169 -195835 -110150 19442 278567 121500 -51777 -169553 5483 128332 29452
8607 51288 -227125 -293932 38113 -211670 130096 -229470 -166403 -142805 -170933 -96440 55818
8595 268943 -248600 -32608 -47609 -185900 343529 -143728 26310 80760 -179115 16863 180674
8584 180674 -110291 192223 -176551 167163 18479 -242533 55168 141015 231732 7439 154449
8573 154449 318612 -103813 -42946 -65588 97627 -314471 47186 -265197 39069 -120111 -459397
8562 -459397 78410 -55321 -70183 -25663 -68753 -567859 5186 -363881 96438 -337115 -228041
8551 -228041 -286793 -88561 -59609 53095 237206 -188900 -181469 233905 -215954 36847 -511415
8539 97100 -234140 -125202 -346894 -142945 -110935 -114057 220748 -97648 -165961 -212244 105980
8527 -85721 -65461 -139292 27408 -171159 -217393 -76217 141037 126043 -86818 243019 84943
8515 65103 -320884 -445056 199396 -317692 167891 -182558 125294 -327488 123145 69628
8505 69628 -62761 -170588 14703 -108521 -128028 198092 -77637 -56822 30705 -123632 -36164
8493 -204113 205654 44615 180110 167694 -51719 77099 47586 102062 237266 -40634 327512
8481 226199 -75573 -251463 285147 -141478 72629 -82299 -281401 -70622 303264 227483 -140897
8469 -80214 137055 150747 -306464 179004 124478 71127 356161 -225808 -203912 252442 131879
8458 131879 -27038 60619 -4752 -102571 -163299 39402 -80513 -65948 41550 -172101 -172445 260141
8445 -39779 15353 -57265 -106412 -196072 -56885 -85479 -202669 -2850 -86860 -296557 -3600 62279
8432 -17637 -168302 -48429 -118134 -259952 -146511 62890 324004 -157741 18462 64490 208070
8421 208070 -215720 -146001 -362162 80997 -18866 266901 -124745 -70820 1933 -154714 -29668
8409 350397 43807 325794 3422 -263396 -372464 8382 -181965 -170771 -113775 -57205 57380
8397 14025 95529 -43604 -262132 -10753 4927 -119998 -166918 1556 16695 131809 173218 -113797
8384 -120042 -42546 90483 20096 128361 -139324 -301496 -8500 -173381 -95330 -275505 -226058
8373 -226058 -16126 358794 -321020 -55099 -177532 -193302 -244162 -91528 -122460 110157 109920
8362 109920 241344 69115 134119 -159873 101541 -42577 -131953 -340290 -168517 -232985 -215711
8351 -215711 -96524 -106396 -409631 249115 -111430 14428 -103690 -325776 90539 -250045 -51696
8339 -164073 72987 -256215 249658 303875 -83901 42721 -190372 -126637 -197657 -95393 -126213
8328 -126213 -59940 -37929 -68278 -69327 -82362 -13860 -165598 -9694 -33639 -29593 1230 106042
8316 106042 -110110 -60405 -77071 -141208 96078 35844 -118156 -295939 9349 -134449 31207
8304 -174715 183251 204700 49740 35728 -137471 179433 80958 300061 -45298 295507 177986
8293 177986 -15481 131644 -329 39005 66903 95937 113600 -175138 -187492 -382091 61372
8281 -299516 76414 139071 -80275 -227754 67894 -367876 -109137 -238426 94046 -35589 -177734
8270 -177734 120118 11894 -264193 123159 -75687 4675 -74015 3521 -237741 59917 -121872
8258 -284020 102734 37332 34625 -451407 82669 234330 277488 72801 4995 216870 -32693
8246 -114786 -103259 9263 -204499 504 -67396 -87723 -527626 -132856 32656 -62837 46197 -1572
8233 -355198 88790 177594 -29221 201617 -280536 236726 -173269 121455 -46332 -103553 -179511
8222 -179511 -82115 -242726 165141 229194 -54372 -27534 128492 -341969 -230819 -151362 -93196
8211 -93196 -137717 53267 -41312 -286061 -397004 114288 -406761 115670 167168 -435494 23837
8199 51751 49625 -210143 -352470 -101222 -297604 -149541 -219412 50747 -52930 11315 -195405
8187 -203449 32273 15234 -72594 213425 127579 -86777 1353 2442 150818 -160983 81283
8175 78371 -362472 -2806 -267035 316075 151108 -62789 269066 104766 73898 159070 -302337
8163 53617 -181005 -63561 192384 -158426 -175600 -168425 -25504 15208 81938 14549 -124229
8151 -134245 122930 275831 83 40024 22973 188765 362165 -153300 41529 177542 125103
8140 125103 -162171 -212974 76512 -11507 78734 -270757 -312308 125450 -49282 -131170 -48752
8128 137601 346086 -26844 111647 66140 19352 -336137 211675 72924 370343 -218411
8117 63054 -306240 35422 -95110 -68052 37481 -46516 -30132 -240764 -134214 -142884 135852
8105 -183391 -150190 -46310 -119906 100532 -16301 -490921 305188 194577 -71311 -110249 -159407
8094 -159407 -20328 -275611 330810 -130744 -124820 -388740 -5042 304639 -200803 55429 -68288
8082 -150872 -188225 -218200 201990 42718 3736 1092 -108118 -199438 -100561 -226861 -16715
8070 -41858 -141777 -40519 -342300 6574 146714 19448 16849 -170677 239386 -177433 114096
8058 -88371 57656 -211223 246906 -449459 -145088 290898 30324 73593 -249837 243392
8047 16025 152949 -154959 -144223 163739 -341613 -88338 19065 50397 -130126 219006 108305
8035 119468 154780 -145777 -204139 80757 79584 -185752 -55881 29302 4753 250883 -161981
8023 -76699 23095 -91739 -112782 -257711 52585 -206463 30315 43749 152258 71437 114817
8012 114817 100564 120269 134045 184098 182301 -86608 -81426 -117644 -105248 -9484 -35140 -59896
8000 -59896 118476 42867 -71434 -40843 -149409 -119542 52141 -160250 132484 182578 -33374
7988 37445 -447385 -57934 -116052 -86398 104563 -288223 -127742 40036 -302851 -73592 -129394
7977 -129394 37506 29723 108310 189915 -214391 150908 -80287 86 -461986 -114460 -263181
7966 -263181 -137467 224851 482299 -33738 -151558 244221 -70762 -76949 -80499 -72287 -153247
7955 -153247 -101981 -281973 -20124 376915 -100221 -79600 -168070 52182 216227 -183116 -410520
7944 -410520 72879 -271455 95800 181954 99309 252835 -16830 159209 -73992 52884 -103315
7932 -37046 98509 -22858 -140062 -237098 -187961 9076 -34962 -195195 -204957 -90816 -46613 234889
7919 -32400 44256 -335226 -147143 -427280 -191687 356584 -129385 -239868 111101 129300
7909 129300 213866 -204683 -26354 103640 43909 -56313 -51704 245176 89299 -46276 146700
7897 9270 55090 -210519 -129315 -4571 -227508 87562 -86825 -89444 -284414 137230 -2967 -184665
7885 -184665 -114125 -181158 25742 23650 -261880 -86000 -198560 27080 -369028 -93394 -386628
7874 -386628 79234 -249131 -161608 -321139 -2173 75984 -251444 -233978 -129367 65709 77144
7863 77144 -224033 -92933 -97816 -291475 -163627 -211608 -27158 177220 117175 -80774 25140
7851 -67450 -48366 132155 -154854 -184120 -24064 110537 153948 -36904 101892 149438 -173802
7839 -165282 28157 279276 -120355 -143403 -100008 -197548 -23273 339286 -191124 -94252 -23258
7827 -59764 -76701 18253 476447 149286 -175101 -158541 29668 118470 -92188 -177258 -149037
7816 -149037 -82275 220511 -15988 -47881 112712 166923 -55700 196786 -22728 -299747 -103660
7804 -245817 173405 -203234 42932 -133719 -20613 -171748 -50096 41472 -63398 161487 -278421
7792 -256122 -130882 -163028 272658 -119336 206051 -68154 5023 -179318 -314070 -204255
7782 -204255 60272 246907 -36942 -376478 43352 -161262 285259 -15908 -33130 312296 344614
7771 344614 313501 -65347 -282771 -60156 -321953 35976 -144762 143902 26091 244399 -169915
7759 63988 -154935 -167009 -43609 -6897 98173 -129557 -301041 -29810 3442 108657 -7039 -245320
7747 -245320 -23453 -41452 93361 -45733 279846 -485129 -156181 89628 -24484 15896 -85410
7735 -2631 -323533 123358 143613 -88775 14919 153680 151928 -188416 -125007 -60062 -246589
7724 -246589 143789 -221166 -17199 12861 52379 -75994 106638 -319727 126472 -198031
7713 152035 43752 -314345 -141235 20275 -123542 118853 -73776 195888 57950 -67154 -120790
7702 -120790 -233118 -117217 195448 -42595 61015 -58756 14904 -9815 212993 -198567 135671
7690 -220786 -352221 66260 -46432 165696 -73463 97654 -2957 41095 28600 -87311 -331243
7679 -331243 -302558 215286 -211999 -108325 -82536 -178867 -72715 54642 -154421 -25826 -33088
7668 -33088 57580 169852 89177 -207482 -78646 22379 -78588 -238396 -26047 -142081 -168774
7657 -168774 57638 -143003 -301087 -41880 44333 -115972 120093 -157071 171662 48358
7646 -168702 -24280 284484 103456 -109363 -107399 -127461 -127021 -73285 207403 -3126 -122808
7635 -122808 18562 -90943 26228 32511 -256005 18987 -6926 -68383 34247 276098 -204482
7623 76508 -18464 -185729 -280375 -97046 46184 24364 361284 65107 -82780 -2775 -61788 41702
7610 53373 -259658 151268 -34546 319152 -140183 -158215 -168132 -116227 -268221 134289 -455942
7598 -23286 315379 -284445 -14931 -61872 288396 -160083 -100643 -76148 -389346 163995 10139
7586 154933 -237508 188141 -250829 100641 -7476 13368 -157528 -109778 260495 -200591
7575 235094 -345578 -70162 106181 105106 156571 -86439 -194479 112501 56352 -199083 -196094
7564 -196094 -80372 -204518 -244954 -149905 239568 69377 -160488 -100698 28524 242707 -28731
7552 145340 -40863 45339 2227 142778 128354 473469 -58341 505 482771 -9078 -249002 86457
7539 -3578 59466 -250149 -133823 55876 -76041 -19515 -39388 -21757 -129799 -210951 -91927
7527 -95030 -393734 -352502 -293376 65474 -133721 -68470 -186322 98245 -38294 -188778 -213150
7516 -213150 -260947 136914 -83315 -29163 233593 -214663 -109322 -82378 -229183 38345 -355195
7504 13942 -106738 -272975 26191 -258143 -45946 64914 -31126 -53481 -114179 -293077 -253171
7493 -253171 13927 55216 69435 69700 -246650 85685 317494 45131 113921 -25388 -6168 -146111
7481 -146111 -250983 119063 -75908 186554 -200096 -271859 103321 270918 -289862 71076
7470 -133042 -112281 83743 -240582 29210 -81354 98967 -40924 -140562 4230 -25867 13099 -170080
7457 -222695 183820 -55950 -108590 -60448 -110045 45957 55997 -16863 -367926 11460 72536
7446 72536 196129 -54113 -86513 33415 -108156 65579 80229 -61970 84624 -35364 134652
7434 30147 -98246 337436 18225 -190849 23896 -262754 10297 -16258 -218310 -18270 -161398
7423 -161398 -271987 -228538 75591 42428 127792 231312 51554 239399 -48269 39865 320067
7412 320067 244008 -265320 38557 211846 -129465 -101527 33972 120031 -53313 -115230 311295
7400 226325 -211458 196414 172351 -102622 -114360 -37749 93190 -20435 11595 -344590 -40519
7388 -30245 -134786 22919 202860 60677 -147769 402801 275372 -104657 -32203 94515 229052
7377 229052 100149 -226021 -6520 109778 15099 -184096 -165687 -9034 46909 -291038 -189479
7366 -189479 160420 -104520 180259 54717 142447 -185363 -23457 -159913 -122762 -167243 315690
7354 -179948 -209789 48750 -44917 -46631 45286 50109 189511 -82872 -83864 -268501 46219 -304068
7341 -215888 -207406 -20467 -120973 256914 -301356 193742 59535 -80906 1588 -112578 -146670
7330 -146670 -63338 -124890 -157762 191237 335103 116423 135232 75019 201002 93613 -239106
7318 -307390 33664 -105989 181405 -153809 352624 -83174 -29419 106443 68821 -29477 -283686
7307 -283686 -10152 252204 207075 -99574 -174165 -62084 35354 34235 -274617 188654 286746
7296 286746 90210 41532 -83870 -75470 -138342 -105956 -97831 -150934 -253106 -72562 135741 9715
7283 -107769 444072 -109866 -45117 -118639 -48794 97582 -75352 23976 -209957 -76450 164778
7271 -94205 -151668 20963 -27299 -132744 44393 20420 204343 -88970 92715 25361 -228182
7259 -342095 -475483 6957 -128347 44484 -36691 -124941 -49985 121874 265436 51179 -75777
7247 -131841 -1332 -95296 97023 -7738 -100312 -238907 37072 -150445 28106 -59199 -2118 -24666
7235 -24666 -269927 -180372 15849 -299842 -320599 94597 -36463 194785 -200122 -5640 107086
7223 -111695 169524 282515 -86224 -100797 95270 -13232 -228459 -121588 39845 -122171 -89032
7212 -89032 126276 -161870 3162 -154449 -96360 -68520 173378 77193 -177758 -19566 -213543
7201 -213543 163626 -127215 -96211 6133 290967 166729 411457 23326 -75426 168306 -194354
7189 -101591 102314 109988 105732 -10444 52537 -133252 -136102 -2701 -161237 -334670 -310416 -70688
7176 -235400 4141 -457463 -128245 173604 67061 187323 -19662 113403 234752 94316 -209889
7164 220430 49751 -67797 -68942 -26448 -146078 -502601 214807 -115427 120850 -52691 68354
7152 -3897 -150039 5050 76556 -71277 -547527 328019 -24640 -28688 -12705 297170 114968
7140 -114981 225438 -118066 -560293 264399 80979 166163 -129389 -247397 -152918 106228
7129 456835 260981 -10346 -296577 88022 60564 -430501 -80099 214498 55888 -219679 -127189
7118 -127189 -115744 20861 189477 -6301 1072 80947 25488 -101908 -304634 -31971 71025
7106 220584 33892 -113954 -232256 -81599 194211 337988 -163519 -191116 -87801 184723
7095 -225390 -247537 -61050 -92938 16975 136295 -378200 -197448 -113424 436258 72627 -94491
7083 124542 -90336 55017 -128718 67312 -90427 204436 -222393 174359 78550 -29575 84217
7071 381041 38186 185793 85226 -211634 -195072 -191858 -15426 -92047 -54116 -17028 -148122
7060 -148122 -133140 28149 -44560 220064 -5417 -141895 171603 -99862 10822 -48343 -44997
7049 -44997 -4156 -124980 61951 -136075 54690 -34209 -66958 -171790 261185 -336561 -118933
7037 56753 195832 -272565 5788 -212123 150156 -112117 122606 159944 -238138 209788
7026 124609 200219 -19378 -161353 -23685 169113 105949 -88791 -27102 -167001 -314641 -153668
7014 51503 -198152 -160780 -64842 -147816 -210057 -230715 -85985 333 -227764 -179825 -32318 34775
7001 108784 65944 332120 110072 110849 -108055 76383 281471 -135698 539916 153142 -348604
6989 103096 -209004 27002 -110678 -60228 191595 202586 -135484 179852 -16873 -176581
6979 -176581 38651 -61882 37705 280259 -109960 88778 -163069 26308 -164851 37709 -329082
6967 -53929 92489 78873 -40151 14851 40398 86673 -41591 -288673 -101337 -276022 180889
6955 -390540 -180559 -45576 321269 230258 -156032 -282642 -99053 -364857 84394 20320 -291416
6943 133435 27960 22096 153138 39795 -38305 100398 37592 -25587 -145854 131466 12004
6931 74884 -267551 67805 22591 -67799 -31906 -86953 -265650 -3159 -16693 272916 428515
6920 428515 74587 94129 752 -214254 -90450 42125 -31702 -30666 72589 71915 -65275 -132379
6908 -132379 -155002 -30847 72959 -419938 268045 -1979 108275 -603 25849 -281791 68127
6896 141513 -127318 -17657 -227305 -236287 68657 -62633 34315 58026 -195037 177001 -326404
6884 -88712 71394 -109811 239653 178035 -189293 155151 173161 16638 79479 161158 -39505
6872 9725 -199966 -144194 161993 352351 -114401 63928 -144211 90499 32508 111517 408588
6861 408588 -186410 -277763 31373 300488 -96838 212986 111209 2086 -96447 -8303 -87556
6850 -87556 -21535 -13983 -195302 -429128 32337 278390 218335 148976 246439 88008 106177
6839 106177 29152 3274 202342 176197 -159603 22892 20611 400296 -121364 102383 -293438
6827 -235216 -118900 -263845 -195892 -86033 87496 65355 105960 -4543 -138018 78167 -215927
6815 -204213 183603 230889 168591 24473 130839 110474 -120505 -12303 -438836 37258 -111081
6803 -176836 -162430 83374 396253 270336 120806 118137 128203 -10540 -161044 -69047 12372
6791 -147505 -362589 -97808 382940 -291382 -336457 -80056 68024 371081 -224276 10987 -259028
6779 -135394 -330288 37292 -264015 214955 23631 18498 -142528 -5753 -56351 122535 -94616
6767 18248 223706 -149474 10535 68437 26586 -30292 -395954 -300650 -390559 61838 -218582
6755 -40307 -179829 -331234 -95794 -117374 -148905 -636 -419445 348384 -113604 133398 139517
6744 139517 -188148 43882 -356610 -180338 -320632 104614 -67732 -293282 115924 144052
6734 144052 182221 -259490 87768 -6824 -230622 67933 126722 -55865 84559 289891 -21836
6722 400225 134442 -158022 99641 -49917 -83971 169279 -66575 -202087 -519639 47685 97919
6711 97919 -61238 -119180 232758 -5194 -161831 -11531 -111022 154749 143992 -197862 246904
6699 -266203 28185 -274551 154725 -193336 20731 -157125 -446648 307424 -1156 129399
6688 -159189 -189805 279825 51339 200101 -304017 -93435 -130750 168818 -10212 -40070 197757
6676 -182729 13681 -39236 212311 135402 110852 127522 -93385 -195625 84503 224393 104597
6664 -135633 -45489 -21787 -59393 18720 76863 -272186 -213302 -99723 -140343 -5758 17832 201134
6652 201134 41951 -147134 -11863 191228 -256941 -298548 -165143 -9967 294852 144353 -98648
6640 51091 -155591 153015 200744 144965 154592 106978 54104 -19053 -309794 -119821 62262
6628 227282 361423 -106855 -412427 -17977 32452 199384 -112462 -369928 89970 -223103
6617 -186806 117047 164347 140455 -8958 -192506 -13392 -120090 202450 252628 114635 -120655
6605 48821 213035 18102 -317228 -33246 138337 194128 -59253 -205260 174370 -32755 35274
6593 -199977 120978 -33660 -23768 -223219 208062 68491 -389739 58830 203090 -338582 -111804
6581 97998 -154796 -123151 17963 -77984 190354 -346960 -51157 193547 -143299 -303555 350396
6569 -245769 -251067 239288 265241 -211228 35701 -11225 -161702 -111807 227531 -45465 -231085
6558 -231085 -64015 -59771 132512 -17360 58110 102447 -22251 -63371 -288892 392554 -371017
6546 111170 223420 -69644 -197718 -289049 -142100 -4749 407978 -256909 -327287 21519 -22234
6534 -122696 81630 56289 -459081 -187224 -49217 327449 104240 175209 24614 -300192 -127810
6522 -153574 262088 317864 192999 -198801 -166793 -27843 -20370 127525 -73268 -185852 -251002
6511 -251002 53961 273987 48263 15059 -330123 -161998 -211354 -239938 187758 63223 -29881
6499 -145019 -112477 184658 -110424 -37899 -237110 -97574 267232 102852 85547 213090
6489 213090 -126381 -112653 177658 91446 -102545 -21565 -101150 330367 340577 -100519 137734
6477 47081 62879 322303 -139654 40413 -334104 -111534 24550 -47823 183943 -312889 -83665
6465 4110 -541611 -208323 -177365 59943 -228891 7031 179841 -248983 -82421 -174463 16684
6453 101985 -64976 -148741 -70688 -57525 9893 127012 -155026 268684 152473 63815 76547
6442 76547 -203504 -67988 -181487 -3729 -46289 -18984 -223780 -241053 45532 100151 324885
6431 324885 3240 -140176 -534194 214385 -535711 -136397 58994 309421 -83646 -264180
6421 -264180 -162316 -2733 -339180 62251 161973 -19106 -221658 -16333 92830 103422 170446
6410 170446 -15920 -113714 -158615 -165053 -106504 52504 181089 -98034 146104 96789 -61363
6398 64688 49721 60231 58717 -23088 -35858 95432 62200 146310 -161136 35670 107613 -3709
6385 -238085 148955 -281121 95447 -131368 -81942 -41472 81571 120871 -51965 -54047 -147836
6374 -147836 287329 -29535 190939 444228 -122224 -303624 -29819 58028 -45964 -156052
6364 -156052 5158 87216 61483 316153 112454 -173701 -264204 -136213 -21733 90940 -33459
6352 -251327 1956 -266836 -148303 131395 62353 -53065 -286412 24195 -94912 -54898 85031
6340 19681 -17108 -91529 148974 -198984 -20656 -188276 259779 -150783 175321 169332 -95718
6328 -147346 281504 -84571 208557 118467 -460010 178279 -40476 -192001 74007 -7504 -22196
6317 -22196 156478 -55973 191115 -239260 201215 -231266 -48257 105926 -167183 44515
6306 160566 -62073 21553 -75617 53475 -243668 -257698 -240964 -399895 241352 208204 106468
6295 106468 -42445 6541 66362 19143 -29061 87729 95193 60245 109000 107987 -154133 -284280
6283 -284280 299543 -55517 6896 -30108 38263 -153269 -9462 -166694 -54184 -298042 228041
6271 -18917 72877 100852 -178352 284480 -254412 -57150 -174037 12384 113048 -69045 175064
6259 169691 63184 9588 -206394 88613 -117161 63437 -137110 -34765 97731 -171174 -93460
6248 -93460 18584 -163080 -329636 -135309 73588 221664 -75183 -85158 -25481 -220487 -157680
6237 -157680 109784 8611 169769 141160 -111694 114051 63001 -113587 132239 162703 73909
6225 220946 36695 -101091 22356 33862 15195 -11014 86424 -76865 -110685 9698 160847
6214 160847 134459 -77040 -252189 86401 109612 -51863 -115136 166299 156682 -227676 17559
6202 -257262 -255011 222965 183697 138440 67905 909 -213621 -38243 88098 262723 -103328
6190 -38544 -249750 -294812 -140304 -106826 -232367 -5567 -66645 160154 42908 60237 152643
6179 152643 -17361 -173060 205241 -3531 9190 -152740 197626 -15006 13138 362166 60947
6167 -9656 -23862 145496 -107312 130531 -68311 -45273 184134 24776 208828 488830 181011
6155 -150571 -230637 109869 217196 172796 206798 -31708 -200092 -8253 10549 148006 -75014
6143 109527 2850 239194 3167 61297 -328875 79031 295055 88471 -199621 -302350 114250
6131 191756 -183379 -10622 48098 -269549 -258739 -206888 -51475 873 -331608 237196 -129639
6119 198714 -79720 134156 39320 -176287 -7147 160167 -128093 -262752 8909 160197 -107750
6107 101555 184199 -122473 -186496 223642 -63996 32114 -4101 -91725 319297 41329 131833
6096 131833 55444 174042 -54907 141717 -86799 308822 -205253 -241954 144786 64502 129696
6085 129696 -272187 -70287 -149217 97238 237382 -140057 -71373 -150328 -9849 91108 39006
6073 113902 -188341 102077 313776 -61023 295592 69026 -37480 -173933 -38647 324680
6062 -475774 -7429 -50847 -157970 -48184 -16416 215121 10971 58510 31932 -118450 -32479
6050 -272944 -181690 -96549 122212 19716 -88659 -257245 136862 -94906 78309 34869 -27465
6038 159983 -101174 -14942 -86122 32647 -220308 -418180 69889 -31702 -58138 -23745 -26097
6027 -26097 -122308 -118945 194488 -88296 -153624 -166310 -48396 -50156 220796 -61336 145265 -315843
6014 -198432 17507 -152158 201126 -77678 -354462 -14284 -227473 120848 -173034 79106
6003 224063 405971 -229835 217680 -254868 -263407 -5548 186406 33350 11942 178772 126997
5992 126997 -224300 106128 22517 48323 84226 176286 36937 28855 61760 -259343 -240426
5981 -240426 80253 96832 -190732 -135726 122055 49073 159076 -147169 -42122 -240946 158959
5969 124564 387096 86337 -100705 -244013 -58879 93730 -303880 167749 -144664 190195
5958 170477 -46438 28471 -205417 101801 177675 -81366 16432 -81759 -14487 -18525 -123293
5947 -123293 -180584 134895 172867 -242758 -126579 4985 38113 139680 -310089 126805 -201687
5935 43651 -29151 12044 -318177 -7396 -103492 54482 146747 -8731 -174648 348128 -434180
5923 12523 -169989 43483 -168265 57677 -29360 46368 8175 121343 -225894 79973 -21162
5911 -131352 160179 274713 -104452 -44481 -271307 223109 -89903 -197150 -223135 -189929
5901 -189929 -328656 189151 76563 120568 -71457 287912 -80103 27413 -88617 -55295 38759
5889 -103954 -110401 98149 -33914 54313 186882 82633 68415 -99102 237580 163635 314712
5878 314712 75141 -365680 -56405 59164 -189278 8943 171470 -157016 -138195 37447 -23341
5866 263529 -382757 68906 -149626 -142488 -157200 -29395 266516 -39502 88535 10492 21730
5855 21730 1836 -289479 -41974 -181548 144386 61024 -97876 -202531 -110654 72411 -52279
5843 -262130 -26994 64748 -106430 -48777 59167 -178050 23739 11374 -52568 192532 -216764
5831 -204311 -19681 -443725 -148504 151353 156223 115099 158820 194671 277914 -91978 -154288
5820 -154288 188631 -135192 76804 59689 -210352 -288980 151859 -139761 67906 277277
5810 277277 -291943 -122628 215785 20946 71437 -141601 282922 -131297 -102057 -179921
5800 -179921 -246056 -5899 32200 -39683 35079 -123927 373992 270700 32715 88306 -91890
5788 -349249 -151317 102954 12120 -168186 -294048 21473 -52564 -118072 -134206 338932 -46650
5776 68625 158162 126677 -101193 89729 363451 -401568 -200044 247435 -249249 33970 39154
5765 39154 32105 3974 161176 226528 44657 -151519 -61069 157080 64350 194661 137583
5754 137583 -193420 -7785 -273886 51319 106641 -39273 -292142 276782 22268 377400 41127
5742 223574 185811 196129 -20059 -231336 82363 204928 165908 215237 46367 251601 161237
5731 161237 -256079 100959 315396 83753 142173 257165 -35022 -266600 -162592 173002
5720 54524 -64312 349857 -46146 129994 -310915 -83075 14116 -123312 -287121 69363 -69285
5708 -180359 -107886 -514843 33743 129232 76358 -514728 -155506 218914 -64415 162913 -26858
5696 -181006 -49676 42770 144675 -115688 -398634 57044 -87302 -404757 -8160 40530 -241003
5684 -55447 350114 314754 41841 -25816 41009 -82061 375957 -147043 254065 20917 177347
5673 177347 -81505 -6557 -67678 -261859 -31489 206944 -79475 388249 -278706 262604 174880
5662 174880 149434 -130603 -2220 -46783 -83734 -143722 14081 108725 -41259 -59654 -261507
5651 -261507 98993 43612 16931 10135 362220 80276 382203 -109315 -400225 -202348 -206635
5640 -206635 -53837 62865 91051 -258632 105205 -160337 72459 -229578 166535 -72982 106841
5628 -220993 326201 -243509 -121208 -119670 -46495 -67831 -84835 180 -94807 -197743 299142
5616 -195555 -210577 -71959 -98542 33922 29788 -306919 83244 351171 175949 31959 183668
5605 183668 82833 -95790 23434 -203936 32386 104574 41650 -349289 -56634 170741 -211900
5593 456013 19896 50380 271759 268073 81882 115778 -192483 -130980 213217 -141244 86266
5581 237062 29334 176199 43535 99432 -82638 -105343 -97925 -9274 12786 -337 -90306 18287
5568 -131027 -27606 136725 -261 157853 -116332 136708 232587 -153815 -133200 12121 187878
5557 187878 -241741 -193200 15761 158030 181081 -295437 124817 107062 99473 -25026 -19766
5546 -19766 -14735 -115883 98055 94073 157643 250528 -105214 280027 112666 -119610 -338802
5535 -338802 -128417 200247 240215 154650 263699 -125625 -45851 -46979 -54610 260509 -91394
5523 166090 67177 59602 145052 -121581 270196 34304 -5579 4236 -43525 145535 -281135
5511 -867 68912 -13701 -224831 -92805 -64590 238936 47085 -197422 32073 -235952 -90458
5499 42130 -166339 -71659 7102 95574 175184 254818 102202 141058 -36298 -103873 -465830
5488 -465830 69028 21594 -257634 69685 -245386 -3373 102108 -116271 45069 -98256 50325
5476 -53787 -247007 -96936 -315326 133580 -177969 56333 269471 15267 383625 98852 45042
5464 183864 148911 27376 161330 -179985 25835 -110410 -76127 -220586 31118 -56429 281306
5452 65956 -130548 19054 435058 -60903 241328 448162 180121 -43947 -195883 -48908 18318
5440 -34370 345009 94358 -130078 74217 105396 -9787 22952 291347 -28822 -264288 -211567
5429 -211567 97585 -22471 -161648 -46031 -247486 188972 -221209 273683 -197850 172682
5418 28665 9491 -26050 205936 -154124 15517 50691 -20569 -63686 -18795 -315914 -246787
5407 -246787 -200891 166975 249962 166711 -9920 106285 23677 74791 -307778 18088 -391427
5395 149795 -58228 94304 -206036 -212547 -81039 18969 36365 -69795 -171940 -307584 370406
5383 -199486 53938 401017 -184248 -318273 -42079 -85032 -96087 52098 26167 10059 163264
5372 163264 142007 -142038 -115892 -199837 -2662 28150 -8712 -40456 -74145 -26764 -142308 120998
5359 -154564 90567 111833 342240 15003 268664 223720 -36789 280586 -223478 199436 60646
5347 135591 537508 -189456 -26797 33613 -152567 55385 36659 -196608 -77069 -2993 11300
5335 -213600 -246161 -132384 -109274 140981 -212230 123089 -108242 -38260 -56073 -21815 47962
5323 -162163 -188419 124416 -299424 230302 43948 69608 -192775 -294860 52530 -73222 134836
5311 -52109 -45526 -118360 -102938 68767 37459 -166505 -65078 -20951 -25948 6924 43713 -164170
5298 -37338 195182 59186 -185492 252053 -13420 -33630 6167 141958 236100 251122 123796
5286 125493 136450 41023 224785 104236 -234569 -95917 -17787 -178499 -62989 -126564 -204478
5275 -204478 -134791 258210 23140 -17989 -172799 181796 163833 69256 178463 42932 -507942
5263 -204610 155440 24666 -183027 -52471 356223 51754 -352716 66762 -53452 105748 243125
5252 243125 81890 47710 8525 222160 102400 -47601 32259 -88992 364500 65450 44493
5241 44493 4673 74470 -236333 78912 -6963 -47868 164627 386958 17225 69847 -123999
5229 -20015 -156964 1353 -119021 -326164 15965 2904 -258051 25873 67374 211478 13657
5217 114458 -271720 -336614 348123 176296 -83813 -158661 80096 50853 3528 14347 27129
5206 27129 104184 13296 217314 -37648 -22028 -112066 -114267 -133144 10182 -219894 48970 -162599
5193 179219 -240558 244706 149439 204863 -53997 23397 -377332 -60510 -128651 436591 77151
5181 -21628 -168192 249614 -36344 46347 -34892 190141 -264125 25319 107740 -108782 -132179
5170 -132179 85613 244101 -61739 96318 -7130 69538 -234450 -13458 -139553 49059 109063
5159 109063 -131875 176382 202276 109329 -216877 7767 137010 -14178 -6507 -124617 -158423
5148 -158423 95277 64922 -176733 280524 -151749 122288 -137571 47904 -226453 -200435
5138 -200435 -75571 24588 -42224 50505 138421 -21080 -42780 248304 -169906 -86590 -49414
5127 -49414 -223372 -333406 -273617 9320 344373 59079 195218 -37168 -232587 24560 -8222
5115 294028 -82386 378425 397657 -181083 -78893 71176 210716 -158765 -181162 375026 250273
5104 250273 -171189 118333 -170401 -188874 495554 178483 126619 13951 -306871 -8264 115739
5092 42859 128913 -147859 7055 3635 -78946 -31044 -67247 64732 241595 15679 -243135 -290650
5080 -290650 -62777 -444966 51178 -327826 -58311 -10894 -219979 -183140 67233 355438 -136556
5068 -181680 139245 -314606 -32327 -123967 76329 242623 99229 -117329 355555 -92094 -336285
5057 -336285 239175 -11820 -23561 49044 -96675 -56461 148991 216516 210555 96282 344179
5046 344179 -115237 -358667 107932 72963 212915 84921 131722 127400 170608 9467 -119988
5034 -196634 -242878 -18033 -13972 -38626 -65928 -4214 -354362 -187776 -16635 -150718 107714
5022 -65335 3743 50012 -78786 98431 -165527 361580 -147831 140291 127622 143738 138505
5011 138505 -16482 -71550 154219 17629 -150342 120924 119594 57200 53479 -120697 123428
4999 152049 -21463 278265 -275757 -290413 81663 -170411 -263092 -62690 -179229 -137154 -219487
4988 -219487 -153486 76935 89213 -87464 178240 -260569 215998 -90493 -58203 199684 -149116
4976 -78151 113084 58859 -110171 -61033 -72239 327507 105364 -175467 7216 -59564 -10067
4964 376230 389986 62000 168944 -49325 -52758 187156 303365 268465 -54303 -212219 -85088
4952 33499 -225374 294778 -49837 -43291 61263 106803 -28306 59829 22102 67664 220409
4941 220409 182001 -42167 53232 -265677 100985 57770 -104565 62308 -217186 2746 -202846
4929 99708 107132 -153142 -384264 -303782 -209098 129732 138536 -40744 -563650 204659 115615
4918 115615 109533 66154 6006 -47004 195698 87600 74306 6476 226001 -118403 60190 11679
4905 371560 254523 -19689 20451 26145 -26727 -22113 -68073 -60197 -31630 189761 -134924 -17181
4892 -91107 25905 -295625 47831 8179 55601 88257 40730 -301118 100566 -71157 14046
4880 -120488 139475 22102 198623 27087 -237620 208677 44128 -245186 9055 -107461 -59807
4869 -59807 18100 2394 5256 207010 -15795 139831 -50381 15576 -259832 -85011 -327200
4858 -327200 -152865 208553 -233462 -59671 3690 215502 -40560 150821 -173721 34894 -945
4846 3689 -127314 -90234 177267 11157 777 -263272 -12583 -191323 -73405 -102733 72885 -235377
4833 -6246 -212452 -119402 -234221 111615 46446 10824 86478 -276916 82214 -189409 -16733
4821 100036 23315 -1489 523391 -293536 -196944 570 67380 -222008 405687 -120212 -231325
4810 -231325 99532 94545 124571 152594 -176314 129018 213393 -32605 38113 -39768 337943
4798 64010 -25940 209949 96434 186925 -138507 67435 75372 -91190 -7914 86020 14752 -7158
4785 317944 12620 404918 39379 38871 -163689 84844 96718 -206748 -153473 -61 37743 -215077
4772 -63759 -53988 112987 36044 -123287 -104883 331515 29703 -5846 16094 -399147 130718
4760 17963 -68087 86711 230538 -100986 71793 76568 10071 -340038 21877 -121775 307571
4748 -126342 -80870 -113665 49280 -3439 167516 70531 147476 -21737 53891 36102 -14 505233
4735 -41035 -42908 -135418 -12205 -265068 162845 244770 -397 375828 88130 -113728 -113055 -200006
4723 -200006 -62002 149428 115860 -184775 779 -99696 -2781 1521 -30119 -29233 52558 -11913
4710 32798 131284 40358 -357122 -277975 -94680 203721 288598 -178016 297364 81947 87842
4699 87842 25497 198178 18413 -35753 73224 -1687 101243 147804 -296427 -282920 67333
4687 64914 -5327 -99841 -14450 247305 -177562 -201274 64171 -265618 177544 -188552 -17160
4675 -198457 -79365 -160689 3957 -8190 -66174 -281035 -171467 356101 167378 165939 112391
4664 112391 -24907 25594 -31565 47735 -71908 483415 202242 -219310 -168137 43094 -74098
4652 -102328 11243 16934 161024 288243 -76184 114941 102884 -166152 -80702 -94990 125897
4640 107567 -105315 43155 111069 60673 82545 202003 -330223 -86364 94971 -109056 125941
4628 128162 -26841 -236749 -168994 -115346 6477 77214 142237 -355107 268749 210295 138586
4617 138586 119566 75142 7548 166672 205487 24105 -123172 46851 -53701 -60173 -40 60711
4604 96116 -71606 -293107 -202859 215999 179449 310744 189710 -57948 47943 216262 145956
4593 145956 196855 -73801 -109950 -107524 -37566 -219009 -225352 22524 -101947 105485 960 -7055
4580 64173 297447 16520 -306023 -197401 12361 -75384 -248263 -188520 -132818 104668 -54132
4568 -17199 336491 -213030 138425 -28742 -53323 -234800 -124890 20494 -13941 -213091 111386
4556 -8328 -40344 40288 148914 204390 -47823 54866 -219338 -23464 -210147 94119 -71203
4544 106199 157653 -131706 -127802 -185129 75984 -142337 -124161 328146 -161832 498202 -166512
4532 -65905 -178596 -396766 -253442 91798 26327 64079 -26819 266573 -189292 94743 -275111
4520 177664 -87983 -160226 215258 -228479 -141831 -137618 80773 -85215 10256 105930 -25113
4508 -27367 89839 -11429 21444 35364 194913 194524 184447 -298564 136417 85528 -89995 -212810
4496 -212810 6313 86231 88932 123100 88517 162596 178687 236406 29551 -344554 396716 78088
$$ [...]
##END NTUPLES=NMR SPECTRUM
##END=
