##TITLE=AC1712_14FALM0001_8743523_LyKpv0qBwT
##JCAMPDX= 6.0         $$ Bruker NMR JCAMP-DX V2.0
##DATA TYPE= NMR SPECTRUM
##DATA CLASS= NTUPLES
##ORIGIN= BRUKER
##OWNER= Administrator
$$ 1.72 TOPSPIN		Version 2.1
$$ 2015-08-11 20:42:53.070 -0700  Administrator@X
$$ Compression mode = diff/dup
##.OBSERVE FREQUENCY= 400.02188249412
##.OBSERVE NUCLEUS= ^1H
##.ACQUISITION MODE= SIMULTANEOUS (DQD)
##.ACQUISITION SCHEME= undefined
##.AVERAGES= 64
##.DIGITISER RES= 22
##SPECTROMETER/DATA SYSTEM= spect
##.PULSE SEQUENCE= noesygpps1d.comp
##.SOLVENT NAME= COFFEE_meoh
##.SHIFT REFERENCE= INTERNAL, COFFEE_meoh, 1, 14.96116
##AUDIT TRAIL= $$ (NUMBER, WHEN, WHO, WHERE, PROCESS, VERSION, WHAT)
$$ ##TITLE= Audit trail, TOPSPIN		Version 2.1
$$ ##JCAMPDX= 5.01
$$ ##ORIGIN= Bruker BioSpin GmbH
$$ ##OWNER= Administrator
$$ $$ E:\/data/COFFEE/nmr/AC1712_14FALM0001_8743523_LyKpv0qBwT/72/pdata/1/auditp.txt
$$ ##AUDIT TRAIL=  $$ (NUMBER, WHEN, WHO, WHERE, PROCESS, VERSION, WHAT)
(   1,<2015-08-11 20:42:47.601 -0700>,<Administrator>,<X>,<go>,<TOPSPIN 2.1>,
      <created by zg
	started at 2015-08-11 20:31:17.476 -0700,
	POWCHK enabled, PULCHK disabled,
       configuration hash MD5:
       21 0F 79 D6 B3 7B B4 F6 88 20 88 DB 03 48 BD 9F
       data hash MD5: 64K
       01 7E 6F BC 76 41 EF 9F 06 B3 AE 5A 5F 3D 60 82>)
(   2,<2015-08-11 20:42:50.976 -0700>,<Administrator>,<X>,<proc1d>,<TOPSPIN 2.1>,
      <Start of raw data processing
       efp LB = 0.3 FT_mod = 6 PKNL = 1 PHC0 = 0 PHC1 = 0 SI = 128K 
       data hash MD5: 128K
       74 D3 B3 BE 5E A6 CF D8 75 95 FE FF E9 C8 88 AC>)
(   3,<2015-08-11 20:42:51.882 -0700>,<Administrator>,<X>,<proc1d>,<TOPSPIN 2.1>,
      <pk PHC0 = 269.6375 PHC1 = 0 
       data hash MD5: 128K
       47 B9 D9 0E 7F 88 AE 69 DC F9 7F 39 0D 68 A8 5C>)
(   4,<2015-08-11 20:42:52.257 -0700>,<Administrator>,<X>,<proc1d>,<TOPSPIN 2.1>,
      <abs ABSG = 1 
       data hash MD5: 128K
       96 82 91 73 CE E4 9E 33 79 4D B9 20 FE 78 69 9D>)
(   5,<2015-08-11 20:42:52.367 -0700>,<Administrator>,<X>,<proc1d>,<TOPSPIN 2.1>,
      <abs ABSG = 2 
       data hash MD5: 128K
       37 04 89 79 3D 90 6A 1B A5 31 0F 08 B2 14 32 F5>)
(   6,<2015-08-11 20:42:52.445 -0700>,<Administrator>,<X>,<proc1d>,<TOPSPIN 2.1>,
      <abs ABSG = 3 
       data hash MD5: 128K
       47 61 FA 93 05 B5 42 1A A6 37 18 12 41 C3 CC 05>)
(   7,<2015-08-11 20:42:52.539 -0700>,<Administrator>,<X>,<proc1d>,<TOPSPIN 2.1>,
      <abs ABSG = 4 
       data hash MD5: 128K
       CA F5 41 4B DD A1 14 16 7C 86 C8 60 60 D8 FF 7E>)
(   8,<2015-08-11 20:42:52.679 -0700>,<Administrator>,<X>,<proc1d>,<TOPSPIN 2.1>,
      <abs ABSG = 5 
       data hash MD5: 128K
       47 5C 31 26 38 03 D4 93 27 F7 48 5F 4F CE 13 38>)
$$ ##END=
$$ 
$$ $$ hash MD5
$$ $$ 3E B5 79 8C 70 26 38 9C BD 15 BA 34 24 DC 28 23
##$RELAX= 
##$RELAX= 
##$RELAX= 
##$RELAX= 
##$RELAX= 
##$RELAX= 
##$RELAX= 
##$RELAX= 
$$ Bruker specific parameters
$$ --------------------------
##$DU= <E:\>
##$EXPNO= 72
$$ [...]
##$TP07= 0
##$TPNAME0= <>
##$TPNAME1= <>
##$TPNAME2= <>
##$TPNAME3= <>
##$TPNAME4= <>
##$TPNAME5= <>
##$TPNAME6= <>
##$TPNAME7= <>
##$TPOAL= (0..7)
0.5 0.5 0.5 0.5 0.5 0.5 0.5 0.5
##$TPOFFS= (0..7)
0 0 0 0 0 0 0 0
##$TUNHIN= 0
##$TUNHOUT= 0
##$TUNXOUT= 0
##$USERA1= <user>
##$USERA2= <user>
##$USERA3= <user>
##$USERA4= <user>
##$USERA5= <user>
##$V9= 5
##$VALIST= <valist>
##$VCLIST= <CCCCCCCCCCCCCCC>
##$VD= 0
##$VDLIST= <DDDDDDDDDDDDDDD>
##$VPLIST= <PPPPPPPPPPPPPPP>
##$VTLIST= <TTTTTTTTTTTTTTT>
##$WBST= 2048
##$WBSW= 25
##$XGAIN= (0..3)
0 0 0 0
##$XL= 0
##$YL= 0
##$YMAX_a= 7162123
##$YMIN_a= -12632215
##$ZGOPTNS= <>
##$ZL1= 120
##$ZL2= 120
##$ZL3= 120
##$ZL4= 120
##$ABSF1= 14.96116
##$ABSF2= -5.597022
##$ABSG= 5
##$ABSL= 3
##$ALPHA= 0
##$AQORDER= 0
##$ASSFAC= 0
##$ASSFACI= 0
##$ASSFACX= 0
##$ASSWID= 0
##$AUNMP= <proc_prof1d_extract.lims>
##$AXLEFT= 0
##$AXNAME= <>
##$AXNUC= <1H>
##$AXRIGHT= 0
##$AXTYPE= 0
##$AXUNIT= <>
##$AZFE= 0.1
##$AZFW= 0.1
##$BCFW= 0
##$BC_mod= 0
##$BYTORDP= 0
##$COROFFS= 0
##$CY= 15
##$DATMOD= 1
##$DC= 0
##$DFILT= <>
##$DTYPP= 0
##$F1P= 0
##$F2P= 0
##$FCOR= 0.5
##$FTSIZE= 131072
##$FT_mod= 6
##$GAMMA= 0
##$GB= 0
##$INTBC= 1
##$INTSCL= 1
##$ISEN= 128
##$LB= 0.3
##$LEV0= 0
##$LPBIN= 0
##$MAXI= 10000
##$MC2= 0
##$MEAN= 0
##$ME_mod= 0
##$MI= 0
##$NCOEF= 0
##$NC_proc= -2
##$NLEV= 6
##$NOISF1= 0
##$NOISF2= 0
##$NSP= 0
##$NTH_PI= 0
##$NZP= 0
##$OFFSET= 14.96116
##$PC= 1
##$PHC0= 269.6375
##$PHC1= 0
##$PH_mod= 1
##$PKNL= yes
##$PPARMOD= 0
##$PPDIAG= 0
##$PPIPTYP= 0
##$PPMPNUM= 2147483647
##$PPRESOL= 1
##$PSCAL= 4
##$PSIGN= 0
##$PYNMP= <proc.py>
##$REVERSE= no
##$SF= 400.020009571051
##$SI= 131072
##$SIGF1= 0
##$SIGF2= 0
##$SINO= 400
##$SIOLD= 131072
##$SPECTYP= <>
##$SREGLST= <1H.CDCl3>
##$SSB= 0
##$STSI= 131072
##$STSR= 0
##$SW_p= 8223.68421052631
##$SYMM= 0
##$S_DEV= 0
##$TDeff= 65536
##$TDoff= 0
##$TI= <>
##$TILT= no
##$TM1= 0
##$TM2= 0
##$TOPLEV= 0
##$USERP1= <user>
##$USERP2= <user>
##$USERP3= <user>
##$USERP4= <user>
##$USERP5= <user>
##$WDW= 1
##$XDIM= 131072
##$YMAX_p= 418601612
##$YMIN_p= -11583
##$CURPLOT= <Network HP LaserJet P1505>
##$CURPRIN= <$Network HP LaserJet P1505>
##$DFORMAT= <normdp>
##$LAYOUT= <+/1D_H.xwp>
##$LFORMAT= <normlp>
##$PFORMAT= <normpl>
##$SURQMSG= 1
$$ End of Bruker specific parameters
$$ ---------------------------------
##NTUPLES= NMR SPECTRUM
##VAR_NAME=  FREQUENCY,     SPECTRUM/REAL,   SPECTRUM/IMAG
##SYMBOL=    X,             R,               I
##VAR_TYPE=  INDEPENDENT,   DEPENDENT,       DEPENDENT
##VAR_FORM=  AFFN,          ASDF,            ASDF
##VAR_DIM=   131072,        131072,          131072
##UNITS=     HZ,            ARBITRARY UNITS, ARBITRARY UNITS
##FACTOR=    0.0627417313425164, 1,          1
##FIRST=     8223.62146879497, 3648,         -61631
##LAST=      0,             5723,            -61717
##MIN=       0,             -11583,          0
##MAX=       8223.62146879497, 418601612,    0
$$ Real data points
##PAGE= N=1
##DATA TABLE= (X++(R..R)), XYDATA
$$ [...]
63892E99683n954n738n519m636k848l44K529N315P538R130J0696J2982J5988J9006
63878F57828K1700K4694K8696L3362L7548M0667M3191M5702M7963M9296M9549
63867A080196M9227M8800M8242M7321M5999M4383M2468M0016L6758L2570K7468
63856A543448K1457J4517O822j193r085j6649k3778l0203l5673m0337m4616m8596
63844A336114n1897n4235n5740n6588n6631n5705n4046n2085m9978m7613m4934
63833G56662m2034l8996l5884l2795k9829k7081k4726k2871k1266j9514j7655
63822D44011j6106j4848j3226j1002r001q134q155q136p751p314o809n954n112
63809C22463n103n835o158n409m281l656l400k951k437k384k766l074l076k919
$$ plain form
63892 599683 593729 587991 582472 577836 574988 574644 577173 582488 590026 599156 609852 622834 638822 657828
63878 657828 679528 704222 732918 766280 803828 844495 887686 933388 981351 1030647 1080196
63867 1080196 1129423 1178223 1226465 1273786 1319785 1364168 1406636 1446652 1483410 1515980 1543448
63856 1543448 1564905 1579422 1586244 1585051 1575966 1559317 1535539 1505336 1469663 1429326 1384710 1336114
63844 1336114 1284217 1229982 1174242 1117654 1061023 1005318 951272 899187 849209 801596 756662
63833 756662 714628 675632 639748 606953 577124 550043 525317 502446 481180 461666 444011
63822 444011 427905 413057 399831 388829 379828 371694 363539 355403 347652 340338 333529 327575 322463
63809 322463 317360 311525 305367 299958 295677 292021 288621 285670 283233 280849 278083 275009 271933 269014
63795B69014k678k407k424k960l589l581k777j749j095j000j262j398r09J18Q50
63780B42153O84J74L43J135J389M49r06j480j105n94o88j373k099k338j998j462
63764B32284j104q37l96M7Jn28q72n56P6M71O75J145J984K742K932K526K007J988
63746B44585K593L174K925J913J059J000J426J748J872J975K020K018K338L176
63732B73822M113M735N267O010O561O471O280O917Q132Q647P965O865N920M600
63718C62305K458J43j496k628l894n230o077o354o351n974m965l739l112l084
63704C12002k687j279N89J884K242K113K086K328K585K542K146J604J021L10m05
63689C29081o02k1P43Q14J67l04j4N71O36J63o2N61J778K870L589M377N572O669
$$ plain form
63795 269014 266336 263929 261505 258545 254956 251375 248598 246849 245754 244754 243492 242094 241185 241303 242153
63780 242153 242837 243011 243354 244489 245878 246327 245421 243941 242836 242242 241554 240181 238082 235744 233746 232284
63764 232284 231180 230343 229947 229994 229995 229467 228595 228039 228115 228586 229261 230406 232390 235132 238064 240590 242597 244585
63746 244585 247178 250352 253277 255190 256249 257249 258675 260423 262295 264270 266290 268308 270646 273822
63732 273822 277935 282670 287937 293947 300508 306979 313259 320176 328308 336955 344920 351785 357705 362305
63718 362305 364763 364906 363410 360782 356888 351658 345581 339227 332876 326902 321937 318198 315086 312002
63704 312002 309315 308036 308625 310509 312751 314864 316950 319278 321863 324405 326551 328155 329176 329486 329081
63689 329081 328479 328458 329201 330015 330182 329878 329864 330435 331071 331234 331172 331733 333511 336381 339970 344347 349919 356588
63671C56588O775N775M518L680K978J892O19l01r28j785l007m284n494o631p241
63656C53154o787n683n072n299n343m292k621j510j361j557j392o56M23J408J955
63641C15367K159K435K865L046K877L028M051N456O298O496O859P835Q934R606
63627C87312J0099J1075J2666J4367J5706J6716J7737J8994K0474K2092K3741
63616E70979K5196K6152K6562K6688K6594K5649K2955J8366J2760P179K069k482
63604G88667o191q603r534r089p450n057k865k051l120n550q428j1305j4291j7370
63590F77763j9936k1241k1169k0254j8873j6852j4135j1389r415q137o749m862
63578E04751k841j007Q57K881M564N324N315N283N803O875Q070Q864R019Q836
$$ plain form
63671 356588 363363 369138 373656 377336 380314 382206 382825 382524 381596 379811 376804 372520 367026 360395 353154
63656 353154 346367 340684 335612 330313 324970 320678 318057 316547 315186 313629 312237 311581 312004 313412 315367
63641 315367 317526 319961 322826 325872 328749 331777 335828 341284 347582 354078 360937 368772 377706 387312
63627 387312 397411 408486 421152 435519 451225 467941 485678 504672 525146 547238 570979
63616 570979 596175 622327 648889 675577 702171 727820 750775 769141 781901 789080 791149 788667
63604 788667 782476 773873 764339 755250 747800 742743 739878 737827 734707 729157 720729 709424 695133 677763
63590 677763 657827 636586 615417 595163 576290 559438 545303 533914 524499 516362 509613 504751
63578 504751 501910 500903 501760 504641 509205 514529 519844 525127 530930 537805 545875 554739 563758 572594
63564E72594Q857R306J0095J1309J3240J5812J8615K1628K5331K9809L4446L8771
63552H09813M2669M4997M2954L4244J9892M014r273j8131k2619k3403k1355j7633
63540H86169j3343r173n500k614o81K16r2j826m915q943j3350j7531k0907k3222
63526G64288k4757k5888k6513k6256k5171k3758k2290k0599j8651j6838j5454
63515E18113j4276j2914j1395j0121r323q778q037o890n633m821m679m839m715
63502D11692m054l073k201j833j989k112j517l16N01L35n8N12K017L241L431L209
63486D07785L652N000O592P659P912P565P064O647O139N245L974K569J122m48
63472D78477k187m134o340q481r696r401q160p120o613o016m957l919l311k742
$$ plain form
63564 572594 581451 590757 600852 612161 625401 641213 659828 681456 706787 736596 771042 809813
63552 809813 852482 897479 940433 974677 994569 998583 989310 971179 948560 925157 903802 886169
63540 886169 872826 863653 858153 855539 854858 855074 854982 853156 848241 839298 825948 808417 787510 764288
63526 764288 739531 713643 687130 660874 635703 611945 589655 569056 550405 533567 518113
63515 518113 503837 490923 479528 469407 460084 451306 443269 436379 430746 425925 421246 416407 411692
63502 411692 407638 404565 402364 400531 398542 396430 394913 394597 395098 395433 395375 395887 397904 401145 404576 407785
63486 407785 411437 416437 423029 430688 438600 446165 453229 459876 466015 471260 475234 477803 478925 478477
63472 478477 476290 472156 465816 457335 447639 438238 430078 422958 416345 410329 405372 401453 398142 395400
63458C95400j679k96Q89J801K731L776M900O299Q147J0082J1466J2328J3603J6247
63444D85694K0341K5296L0653L6185M0976M2906L9787L1375J9956Q708l17o542
63432G75018r958j0645r015n736j199M460J0783J6958K2455K7149L0730L2394
63420H83394L1490K8077K2700J5956Q516J273m875r251j1478j1602j0236q328
63408I35636o597n430n194o223q479j1645j5587k0261k5037k8689l0377l0347
63396G41770k9423k8131k6530k4482k1833j8587j5129j2091r830q175o780n396
63384E35383l866k189o57N26J713L475N684P579Q823R882J1184J2542J3758J5063
63370F18900J6577J7914J8910K0160K2238K4807K7106K8893L0308L1083L0629
$$ plain form
63458 395400 393721 393425 394314 396115 398846 402622 407522 413821 421968 432050 443516 455844 469447 485694
63444 485694 506035 531331 561984 598169 639145 682051 721838 753213 773169 781877 781560 775018
63432 775018 765060 754415 745400 739664 738465 742925 753708 770666 793121 820270 851000 883394
63420 883394 914884 942961 965661 981617 990133 991406 986531 977280 965802 954200 943964 935636
63408 935636 929039 923609 918415 912192 903713 892068 876481 856220 831183 802494 772117 741770
63396 741770 712347 684216 657686 633204 611371 592784 577655 565564 555734 547559 540779 535383
63384 535383 531517 529328 528671 529197 530910 534385 540069 547648 556471 566353 577537 590079 603837 618900
63370 618900 635477 653391 672301 692461 714699 739506 766612 795505 825813 856896 887525
63359H87525K8685K5308K0447J4164P238Q93m123p764j0056j0817j0070q381o651
63346I26398n759o219p858r974j2175j4900j8691k3058k6582k8204k7980k6580
63334G18418k4483k1817j8642j5058j1108o667j530M058Q690R992O183k173j2181
63321F33682k0459k5123k6297k5235k3104k0378j7140j3686j0621q320o679n543
63309D31097n062n286n736n810n424m888m268l402k419j768j646j797j990k250
63295C79351k547k634k351j866j340p15l0K88k25j441k641l157k861k062j120
63280C54649l03J38On95j235j498j329j032r67j290j817k036j460k33Q09J004
63264C42811O40N02P80R34O21J71J03N45J327K133K514K239J806K081L149M120
$$ plain form
63359 887525 916210 941518 961965 976129 983367 984260 980137 972373 962317 951500 941430 933049 926398
63346 926398 920639 914420 906562 896588 884413 869513 850822 827764 801182 772978 744998 718418
63334 718418 693935 672118 653476 638418 627310 620643 619113 623171 631861 641853 648036 645863 633682
63321 633682 613223 588100 561803 536568 513464 493086 475946 462260 451639 443319 436640 431097
63309 431097 426035 420749 415013 409203 403779 398891 394623 391221 388802 387034 385388 383591 381601 379351
63295 379351 376804 374170 371819 369953 368613 367898 367868 368156 367931 366490 363849 360692 357831 355769 354649
63280 354649 354346 354484 354490 353895 352660 351162 349833 348801 347834 346544 344727 342691 341231 340998 341807 342811
63264 342811 343451 343953 344733 345667 346288 346459 346562 347107 348434 350567 353081 355320 357126 359207 362356 366476
63248C66476M332M121M053M091M067M317N155O175O900P686R095J0664J1380J1332
63234D59844J1878J3821J6243J7678J7767J7323J7172J7495J8088J8632J8713
63223F44654J8005J6689J5518J5309J6277J7917J9498K0589K1101K1029K0364
63212H46950J9213J7633J5397J2174P997L266j740o992j2297j7176k1301k4664
63200H38460k7163k8499k8636k7934k6569k4322k1258j8045j5195j2508r698p033
63188E91600m795k677l19J988L773N212O798Q563J0323J2225J4269J5713J5902
63175F78575J5418J5363J5738J5605J4785J4153J4112J3955J3166J2198J1449
63164H34517J0328Q132N123J995j208m937r199j3454j7227k0331k2596k3862k4250
$$ plain form
63248 366476 370808 374929 378982 383073 387140 391457 396612 402787 409687 417373 426468 437132 448512 459844
63234 459844 471722 485543 501786 519464 537231 554554 571726 589221 607309 625941 644654
63223 644654 662659 679348 694866 710175 726452 744369 763867 784456 805557 826586 846950
63212 846950 866163 883796 899193 911367 919364 922630 920890 913898 901601 884425 863124 838460
63200 838460 811297 782798 754162 726228 699659 675337 654079 636034 620839 608331 598633 591600
63188 591600 586805 584128 583809 585797 589570 594782 601580 610143 620466 632691 646960 662673 678575
63175 678575 693993 709356 725094 740699 755484 769637 783749 797704 810870 823068 834517
63164 834517 844845 852977 858100 860095 858887 853950 844751 831297 814070 793739 771143 747281 723031
63151G23031k4115k3768k3259k2360k0671j8069j5092j2598j0881r403p528n282
63139E30005l261k046j750j926j885j386r66j252k010k370k010j521j498j809
63125E04315j989j796j134PJ145J432O04m81p86k74K45J99k20m93l23K09Q04J220
63107E02684J487J712J759J385P54L76M59P05Q93J137J343R88p2j035j008r6Q75
63090E14346J516K080K669K862K380J634J310J602K076K192J785J141O44N16Q33
63075E39586J642K776L674L754L151K807L596N497P721R449J0295J0376J0267
63062F14591J0741J2238J4490J6861J8935K0690K2261K3785K5459K7488K9947
63051H37486L2709L5549L8211M0414M1900M2572M2623M2519M2687M3150M3541
$$ plain form
63151 723031 698916 675148 651889 629529 608858 590789 575697 563099 552218 542815 535287 530005
63139 530005 526744 524698 522948 521022 519137 517751 516785 515533 513523 511153 509143 507622 506124 504315
63125 504315 502326 500530 499396 499403 500548 501980 502584 502103 501317 501043 501288 501487 501267 500774 500451 500660 501464 502684
63107 502684 504171 505883 507642 509027 509781 510157 510616 511321 512214 513351 514694 515682 515610 514575 513567 513471 514346
63090 514346 515862 517942 520611 523473 525853 527487 528797 530399 532475 534667 536452 537593 538237 538753 539586
63075 539586 541228 544004 547678 551432 554583 557390 560986 566483 574204 583653 593948 604324 614591
63062 614591 625332 637570 652060 668921 687856 708546 730807 754592 780051 807539 837486
63051 837486 870195 905744 943955 984369 1026269 1068841 1111464 1153983 1196670 1239820 1283361
63040A283361M3584M3448M3456M3674M3971M4371M5018M5785M6200M5736M3956
63029A772560M0444L4936K7589J8863R205j033j1500k1948l2253m1998n0299n6510
63017A688056o0888o4007o5692o5284o2801n9038n4427m8756m2235l5913l0476
63006A098539k5408j9931j4120q471l040K186O598R628J1914J4862J8883K2796
62994A114436K5182K5886K5916K6261K7040K7705K7821K7530K7195K6757K5774
62983A407503K4079K1920J9314J5745J0841M922j597q831j6929k5197l2462l8212
62971A381096m2862m6792m9705n1106n1035n0009m8468m6432m3752m0541l7197
62960H73197l3999l0854k7751k5182k3639k2725k1457j9608j8008j7158j6287
$$ plain form
63040 1283361 1326945 1370393 1413849 1457523 1501494 1545865 1590883 1636668 1682868 1728604 1772560
63029 1772560 1813004 1847940 1875529 1894392 1903597 1902564 1891064 1869116 1836863 1794865 1744566 1688056
63017 1688056 1627168 1563161 1497469 1432185 1369384 1310346 1255919 1207163 1164928 1129015 1098539
63006 1098539 1073131 1053200 1039080 1030609 1027569 1029755 1036353 1045981 1057895 1072757 1091640 1114436
62994 1114436 1139618 1165504 1191420 1217681 1244721 1272426 1300247 1327777 1354972 1381729 1407503
62983 1407503 1431582 1453502 1472816 1488561 1499402 1504324 1502727 1493896 1476967 1451770 1419308 1381096
62971 1381096 1338234 1291442 1241737 1190631 1139596 1089587 1041119 994687 950935 910394 873197
62960 873197 839198 808344 780593 755411 731772 709047 687590 667982 649974 632816 616529
62949F16529j4489j2167j0564j0169j0406j0693j0941j1007j0482r245p688o271
62937D92407n180m422l792k838j404j74l0q54j555j413p38j16K98L98k15j622
62921D68750l146m048m346m502m573m218l339k257j353q82r75j439j732j519j139
62906D29282j083j128n52P58J962K226J595P21Q8j48Q6P08J268J215N02k52k90
62889D36958O44K116L290L553K986K249J858J710J408Q63K45m38j299k129k523
62874D51491k492k503k679k547j792q98n26o21o05k53R5J05k17o90j002p37K76
62857D34405J541K234K031J353Q48Q23J154J460J491J478J844K417K319J096m21
62842D56073j034o20j4K85M14M10J24r2L74J298J720J390J193J667K132J853J217
$$ plain form
62949 616529 602040 589873 579309 569140 558734 548041 537100 526093 515611 506366 498678 492407
62937 492407 487227 482805 479013 476175 474771 474597 474567 473713 472158 470745 470007 469891 470189 470587 470372 468750
62921 468750 465604 461556 457210 452708 448135 443917 440578 438321 436968 436086 435111 433672 431940 430421 429282
62906 429282 428199 427071 426519 427277 429239 431465 433060 433781 433869 433721 433807 434515 435783 436998 437500 437248 436958
62889 436958 437602 439718 443008 446561 449547 451796 453654 455364 456772 457635 457880 457442 456143 454014 451491
62874 451491 448999 446496 443817 441270 439478 438580 438054 437433 436828 436575 436670 436775 436558 435868 434866 434129 434405
62857 434405 435946 438180 440211 441564 442412 443235 444389 445849 447340 448818 450662 453079 455398 456494 456073
62842 456073 455039 454419 454405 454690 455104 455514 455638 455546 455920 457218 458938 460328 461521 463188 465320 467173 468390
62825D68390R81J142J314J675K551L489L661L018K308J985J866J781J921K468
62811D98550L341M323N092N245M635L613K663J945J499J640K681M336N879O873
62797E52315P493Q236R486J1229J3013J4452J5865J8003K0900K3577K5338K6827
62785G46734K9154L2422L5849L9100M2617M6690N0969N5100N9205O3434O7413
62774A268687P0400P1837P1685P0200O7308O2241N4198M3482L1510J9323O658
62763A837529p052k1205l4310m5357n4268o1226o6311o9715p1589p1720o9985
62752A264791o7033o3847o0681n7046n2769m8341m4171m0158l6223l2613k9461
62741G32448k6517k3582k0814j8395j6238j4175j2166j0265q584p287o398n688
$$ plain form
62825 468390 469371 470513 471827 473502 476053 479542 483203 486221 488529 490514 492380 494161 496082 498550
62811 498550 501891 506214 511306 516551 521186 524799 527462 529407 530906 532546 535227 539563 545442 552315
62797 552315 559808 568044 577530 588759 601772 616224 632089 650092 670992 694569 719907 746734
62785 746734 775888 808310 844159 883259 925876 972566 1023535 1078635 1137840 1201274 1268687
62774 1268687 1339087 1410924 1482609 1552809 1620117 1682358 1736556 1780038 1811548 1830871 1837529
62763 1837529 1830477 1809272 1774962 1729605 1675337 1614111 1547800 1478085 1406496 1334776 1264791
62752 1264791 1197758 1133911 1073230 1016184 963415 915074 870903 830745 794522 761909 732448
62741 732448 705931 682349 661535 643140 626902 612727 600561 590296 581712 574425 568027 562339
62729E62339n007m491m169l633k608j523r35n74K81J677K932L709M317M947N443
62714E62705O026P318R343J1209J2202J2656J3381J4786J6865J9494K2333K4934
62702G33252K7397L0417L4290L8324M1731M4662M7791N1187N4205N6288N7275
62691A216819N6929N4742N0462M4460L7372K9438K0387R930j645j3363k4047l2925
62679A448559l9877m5293m9686n3253n5663n6436n5618n3833n1516m8497m4602
62668H94285m0338l6503l3342l0543k7845k5197k2556k0041j8122j7007j6029
62657F06762j4358j2211j0639j0078r837r199q187p053n775m503l797l871m008
62644E03246l327j878n40pk34p53j144j280j294j410j685j962k024j724j098m84
$$ plain form
62729 562339 557332 552841 548672 545039 542431 540908 539973 539399 539680 541357 544289 547998 552315 557262 562705
62714 562705 568731 576049 585392 596601 608803 621459 634840 649626 666491 685985 708318 733252
62702 733252 760649 791066 825356 863680 905411 950073 997864 1049051 1103256 1159544 1216819
62691 1216819 1273748 1328490 1378952 1423412 1460784 1490222 1510609 1520539 1518894 1505531 1481484 1448559
62679 1448559 1408682 1363389 1313703 1260450 1204787 1148351 1092733 1038900 987384 938887 894285
62668 894285 853947 817444 784102 753559 725714 700517 677961 657920 639798 622791 606762
62657 606762 592404 580193 569554 559476 549639 540440 532253 525200 519425 514922 511125 507254 503246
62644 503246 499919 498041 497501 497494 497260 496507 495363 494083 492789 491379 489694 487732 485708 483984 482886 482402
62628D82402l25o12p36k05P31J519K084K623K928K625J932J520J601J822K011
62613E01920K351K761K899K912L447M710O136P182P878Q387Q748R221J0257J1888
62599E90697J3726J5758J8389K1538K4459K6793K9094L1794L4397L6118L6788
62588H79551L6652L5765L3903L0719K5773J9001J1315L996k698r458j6265k1925
62576A026329k5776k8737l1777l4341l5317l4825l3828l2584l0681k8296k6148
62565F84019k4302k2121j9511j7239j5793j4749j3485j1935j0398r093q086p358
62553E09949o770o136n385m455l279k055j273j177j450j680j851k021j993j699
62539D68725j499j550j287j69J328K209K246K145K526L305M123M785N275N752
$$ plain form
62628 482402 482077 481465 480729 480524 481255 482774 484858 487481 490409 493034 494966 496486 498087 499909 501920
62613 501920 504271 507032 509931 512843 516290 521000 527136 534318 542196 550583 559331 568552 578809 590697
62599 590697 604423 620181 638570 660108 684567 711360 740454 772248 806645 842763 879551
62588 879551 916203 951968 985871 1016590 1042363 1061364 1072679 1076675 1073977 1064519 1048254 1026329
62576 1026329 1000553 971816 940039 905698 870381 835556 801728 769144 738463 710167 684019
62565 684019 659717 637596 618085 600846 585053 570304 556819 544884 534486 525393 517307 509949
62553 509949 503179 497043 491658 487203 483924 481869 480596 479419 477969 476289 474438 472417 470424 468725
62539 468725 467226 465676 464389 464220 465548 467757 470003 472148 474674 477979 482102 486887 492162 497914
62525D97914O475P449Q288Q801R473J0899J3015J5337J7673K0062K2273K4028
62513F61687K5643K7727L0239L2386L3518L3646L3047L1806K9779K6722K2489
62502I88689J7409J2289P727L636k09l517n911p625r136j0337j0753j0360r375
62489I62527p522m445j012Q03k45l480p158j0006j1757j2934j4502j7262k1048
62476H51959k4706k7138k8160k8269k7880k7097k5959k4615k3276k2054k0823
62465E71982j9303j7386j5330j3409j1526r462p366n707m738m302m069l768l255
62452D52361k607k059j645j124m75j06k56m87k55K96O27O61P76J116J422J493
62436D49738J294P29j58r16j153j151j442j924k021j675j482j804k310k519k305
$$ plain form
62525 497914 504389 511838 520126 528927 538400 549299 562314 577651 595324 615386 637659 661687
62513 661687 687330 715057 745296 777682 811200 844846 877893 909699 939478 966200 988689
62502 988689 1006098 1018387 1026114 1029750 1029541 1026024 1020113 1012488 1003352 993015 982262 971902 962527
62489 962527 955005 950560 949548 950351 950106 946626 939468 929462 917705 904771 890269 873007 851959
62476 851959 827253 800115 771955 743686 715806 688709 662750 638135 614859 592805 571982
62465 571982 552679 535293 519963 506554 495028 485566 478200 472493 467755 463453 459384 455616 452361
62452 452361 449754 447695 446050 444926 444451 444345 444089 443602 443347 443643 444270 444931 445707 446823 448245 449738
62436 449738 451032 451761 451603 450687 449534 448383 446941 445017 442996 441321 439839 438035 435725 433206 430901
62421D30901j807j323j264j721k165k043j573j381j509j447j043o02j85M04R67
62406D14209J083R44J184J754J968J726J757K369K987L315L865M806N303M769
62392D52039L914L785M408N210O093P204Q127Q283P845P475P424P476P567P729
62378E44579P711P350P076P364P932Q238Q539R630J1581J3605J5305J7203J9838
62365F85951K2939K5928K8727L1749L5351L9531M3923M7907N0919N2752N3340
62354A119017N2237M8673M2359L4067K5215J6961R717L326k402p421j1750j5936
62342A314063k0789k6373l1643l5544l8189m0387m2127m2481m1098l8969l7137
62331I19326l5372l2857k9716k6981k5214k4056k3156k2605k2162k0948j8558
$$ plain form
62421 430901 429094 427771 426507 424786 422621 420578 419005 417624 416115 414668 413625 413023 412838 413242 414209
62406 414209 415292 416236 417420 419174 421142 422868 424625 426994 429981 433296 437161 441967 447270 452039
62392 452039 455953 459738 464146 469356 475449 482653 490780 499063 506908 514383 521807 529283 536850 544579
62378 544579 552290 559640 566716 574080 582012 590250 598789 608419 620000 633605 648910 666113 685951
62365 685951 708890 734818 763545 795294 830645 870176 914099 962006 1012925 1065677 1119017
62354 1119017 1171254 1219927 1262286 1296353 1321568 1338529 1348246 1351572 1349170 1341749 1329999 1314063
62342 1314063 1293274 1266901 1235258 1199714 1161525 1121138 1079011 1036530 995432 956463 919326
62331 919326 883954 851097 821381 794400 769186 745130 721974 699369 677207 656259 637701
62320F37701j5850j3919j2765j1698j0661j0145r965r182p519n866m984m491l652
62307E17004k533j678j198q68o88o97m93K91J292J862K011K257K710K992K972
62292E25236K881K764K511K344K550K741K247J281Q60J339J899J845J576J833
62278E53907K625L474M173M812N443O184P296Q828J0586J2662J5426J8713K1691
62265F75820K3972K6196K9013L2174L5350L9094M3988M9258N3274N5273N5620
62254A119032N4487N1286M5543L7514K7744J6893O196k798r483j4720j9720k4865
62242A287109k9937l4878l9670m3843m6764m8310m8775m8212m6310m3030l8891
62231H18489l4614l0668k7234k4257k1463j8591j5753j3384j1741j0600r518q222
$$ plain form
62320 637701 621851 607932 595167 583469 572808 562663 552698 543516 535997 530131 525147 520656 517004
62307 517004 514471 512793 511595 510727 510039 509342 508849 509140 510432 512294 514305 516562 519272 522264 525236
62292 525236 528117 530881 533392 535736 538286 541027 543274 544555 545415 546754 548653 550498 552074 553907
62278 553907 556532 560006 564179 568991 574434 580618 587914 596742 607328 619990 635416 654129 675820
62265 675820 699792 725988 755001 787175 822525 861619 905607 954865 1008139 1063412 1119032
62254 1119032 1173519 1224805 1270348 1307862 1335606 1352499 1358695 1355897 1346414 1331694 1311974 1287109
62242 1287109 1257172 1222294 1182624 1138781 1092017 1043707 994932 946720 900410 857380 818489
62231 818489 783875 753207 725973 701716 680253 661662 645909 632525 620784 610184 600666 592444
62219E92444o624m796l127k265k435k922k606j072J102L110M596N614O389P382
62205E94790R087J1364J3337J4354J4758J5202J5564J5172J4016J2981J2727J2884
62193G56236J2648J1744J0501R351Q531Q067P746P238O443N530M566L217J112
62180H52930j638m344o190o663n712l563m43L463P813J2117J6207K0447K5097
62167I09521K9576L2853L4582L5348L5507L4293L0532K4089J6269Q785K618k239
62155A191734o210r645j2866j6400k0717k5619l0166l3440l5255l5902l5528l4129
62143H95857l1992k9592k7058k4141k0772j7346j4418j2306j0959r962q766p234
62131F81311n780m665l502j839Q2J813L636O163R116J1468J2972J4563J6957J9634
$$ plain form
62219 592444 585820 581024 577897 575632 573197 570275 567669 566597 567699 570809 575405 581019 587408 594790
62205 594790 603877 615241 628578 642932 657690 672892 688456 703628 717644 730625 743352 756236
62193 756236 768884 780628 791129 800480 809011 817078 824824 832062 838505 844035 848601 851818 852930
62180 852930 851292 846948 840758 834095 828383 824820 824377 827840 835653 847770 863977 884424 909521
62167 909521 939097 971950 1006532 1041880 1077387 1111680 1142212 1166301 1182570 1191355 1193973 1191734
62155 1191734 1185524 1175879 1163013 1146613 1125896 1100277 1070111 1036671 1001416 965514 929986 895857
62143 895857 863865 834273 807215 783074 762302 744956 730538 718232 707273 697311 688545 681311
62131 681311 675531 670866 667364 665525 665607 667420 671056 677219 686335 697803 710775 725338 742295 761929
62117G61929K1652K2708K2792K1396J7822J2126N378q22m999o521o016m805l779
62104H58861l265l836o257j0144j3540j4636j3390j0910p835m217m38K771N236
62091G78400P434R624J1437J2523J3110J3766J4725J5626J5891J5571J5670J7219
62079I40996J9959K2537K4160K5307K6531K7432K7486K7116K6945K6556K5067
62068A220092K2697K0734J9922J9727J9217J7860J5397J1651O785J297m366r746
62056A361267j4046j6523j7376j7733j8607k0240k2477k5141k7848k9986l1201
62045A120089l1635l1461l0606k9117k7532k6493k6026k5463k4114k2029k0025
62034H25588j8826j8175j7105j5068j2518j0183q249o661n752o008p348r152j0827
$$ plain form
62117 761929 783581 806289 829081 850477 868299 880425 885803 884981 879982 873461 867445 862640 858861
62104 858861 855596 851760 845503 835359 821819 807183 793793 782883 775048 770831 770393 773164 778400
62091 778400 785834 795458 806895 819418 832528 846294 861019 876645 892536 908107 923777 940996
62079 940996 960955 983492 1007652 1032959 1059490 1086922 1114408 1141524 1168469 1195025 1220092
62068 1220092 1242789 1263523 1283445 1303172 1322389 1340249 1355646 1367297 1374082 1375379 1371013 1361267
62056 1361267 1347221 1330698 1313322 1295589 1276982 1256742 1234265 1209124 1181276 1151290 1120089
62045 1120089 1088454 1056993 1026387 997270 969738 943245 917219 891756 867642 845613 825588
62034 825588 806762 788587 771482 756414 743896 733713 725464 718803 713051 707043 699695 690543 679716
62021F79716j1967j2212j1517j0469r802r564r169q149o515m511k518r92K8J204
62007E83563L135N447P265Q419R428J0332J0375R036O746M251J850m91k771m975
61993F51610p067q731r531r552r546j0197j1483j2820j3536j3150j1707r946q780
61980E15564q367q081p377o281m969l483k073j278j270j487j258m58P07K070L358
61965D75317M057L901L365L214L713M532N265N806O397P455R210J1328J3108J4255
61951E70923J5179J6332J7649J8962K0625K3142K6314K9335L1773L3971L6333
61940H40538L8588M0070M0478M0045L9113L7826L6248L4480L2510L0077K6918
61929A236891K3036J8635J3834Q664L287k002p073j1845j5791j7944j7741j5650
$$ plain form
62021 679716 667749 655537 644020 633551 623749 614185 605016 596867 590352 585841 583323 582331 582359 583563
62007 583563 586698 592145 599410 607829 617257 627589 637964 647000 653746 657997 659847 659356 656585 651610
61993 651610 644543 635812 626281 616729 607183 596986 585503 572683 559147 545997 534290 524344 515564
61980 515564 507197 499116 491739 485458 480489 477006 474933 473655 472385 470898 469640 469182 469889 471959 475317
61965 475317 479374 483275 486640 489854 493567 498099 503364 509170 515567 523022 532232 543560 556668 570923
61951 570923 586102 602434 620083 639045 659670 682812 709126 738461 770234 804205 840538
61940 840538 879126 919196 959674 999719 1038832 1076658 1112906 1147386 1179896 1209973 1236891
61929 1236891 1259927 1278562 1292396 1301060 1304347 1302345 1295272 1283427 1267636 1249692 1231951 1216301
61917A216301j2622r040m584R96P339J3724J9575K4619K8666L1374L2165L0540
61905A379053K6526K0680J3535N294l711j2560k0198k6190l0744l4112l6365l7614
61893A243594l8041l7741l6848l5710l4502l2799l0076k6693k3900k2608k2488
61882I02188k2430k1678k0386j9208j8477j7800j6480j4377j1995r627o907l605
61870G19218m38J693K949M317O228Q249J0188J2563J5638J8898K1960K5373K9842
61857H76678L5117M0297M4991M9524N4072N8236O1595O4272O6581O8237O8194
61846A487794O5430N9837N2189M3242L3164K2022J0416p05j0694j9151k5376k8415
61834A689753k7834k4063j7919j0136j447P322J5360K1908K6183K7594K6060K1817
$$ plain form
61917 1216301 1203679 1194639 1190055 1191051 1198390 1212114 1231689 1256308 1284974 1316348 1348513 1379053
61905 1379053 1405579 1426259 1439794 1445088 1441377 1428817 1408619 1382429 1351685 1317573 1281208 1243594
61893 1243594 1205553 1167812 1130964 1095254 1060752 1027953 997877 971184 947284 924676 902188
61882 902188 879758 858080 837694 818486 800009 782209 765729 751352 739357 729730 722823 719218
61870 719218 718780 720473 723422 727739 733967 742216 752404 764967 780605 799503 821463 846836 876678
61857 876678 911795 952092 997083 1046607 1100679 1158915 1220510 1284782 1351363 1419600 1487794
61846 1487794 1553224 1613061 1665250 1708492 1741656 1763678 1774094 1773389 1762695 1743544 1718168 1689753
61834 1689753 1661919 1637856 1619937 1609801 1608354 1615676 1631036 1652944 1679127 1706721 1732781 1754598
61822A754598J4970N654n427j7086k8383l8932m8435n6342o2017o5029o5367o3726
61810A324478o1351n9014n6236n2131m6878m1631l7065l2930k9091k5945k3417
61799H58789k0672j7441j4754j3563j3313j2766j1712j0864j0452r952r162q571
61787G05567q505q581q295p626o767n703m435l382l079l466l804l534l028l084
61773F32278l663l742k753j554j357k034k433k109j713j579j105k3Q15O05j59
61758F09474m51j42O5k68j055k185l512m536m732m185l443k879k533k309j929
61743E75380j059Q6O84L50j44K00J286K223K533K429K118J746J796K668L853M338
61727F00487L859L132K789K832L137L719M368M710M819N127N470N024L548J987
$$ plain form
61822 1754598 1769568 1775222 1769795 1752709 1724326 1685394 1636959 1580617 1518600 1453571 1388204 1324478
61810 1324478 1263127 1204113 1147877 1095746 1048868 1007237 970172 937242 908151 882206 858789
61799 858789 838117 820676 805922 792359 779046 766280 754568 743704 733252 723300 714138 705567
61787 705567 697062 688481 680186 672560 665793 660090 655655 652273 649194 645728 641924 638390 635362 632278
61773 632278 628615 624873 622120 620566 619209 617175 614742 612633 610920 609341 608236 608213 609028 609633 609474
61758 609474 609023 608881 608946 608678 607623 605438 601926 597390 592658 588473 585030 582151 579618 577309 575380
61743 575380 574321 574407 575091 575441 575297 575497 576783 579006 581539 583968 586086 587832 589628 592296 596149 600487
61727 600487 604346 607478 610267 613099 616236 619955 624323 629033 633852 638979 644449 649473 653021 655008
61713F55008J295J135L66j504l876n924p348q296q910r087q637p559o198m954
61699E85511l966l170k610k394k395k327k167k147k253k107j532r36q84j419k002
61684E53202k042j522j163j866l663n345n558m285k841k345k665l012l006k821
61670E11068k683k679k825k976k818k278j685j308r74m96j22j07r2M62J382J966
61654D93835K034K224L020M130N078N856O596P094P142O959O825O528N683M418
61640E67422L139J772j23k514m714o203p033p381p275o913o667o422n569m006
61626E07513k569j965j766j137p2Q50J538K352L147L285K664J891J231J30j883
61611E15209m435o814q692j0030j0671j0481r623q451p363o783o904p275p152
$$ plain form
61713 655008 656303 657438 657804 656300 652424 646500 639152 630856 621946 612859 604222 596663 590465 585511
61699 585511 581545 578375 575765 573371 570976 568649 566482 564335 562082 559975 558443 557507 556623 555204 553202
61684 553202 551160 549638 548475 546609 542946 537601 532043 527758 524917 522572 519907 516895 513889 511068
61670 511068 508385 505706 502881 499905 497087 494809 493124 491816 490842 490346 490224 490117 490025 490487 491869 493835
61654 493835 495869 498093 501113 505243 510321 516177 522773 529867 537009 543968 550793 557321 563004 567422
61640 567422 570561 572333 572210 569696 564982 558779 551746 544365 537090 530177 523510 517088 511519 507513
61626 507513 504944 502979 501213 500076 500004 500854 502392 504744 507891 511176 513840 515731 516962 517092 515209
61611 515209 510774 503960 495268 485238 474567 464086 454463 446012 438649 431866 424962 417687 410535
61598D10535o421n705n331m793l642k374j803j959k225k356k658l209l473k917
61584C61669j671m48O3k81r89j372j124n27q9j12n70j112j215o52R6K88j46n08
61566C51300l95k43n23r03p51j28L51M36M49O70J019J373J697J847J599J045O14
61549C59457N70O45L57l86j070j023r3J180K166K834L565M390M830M608M096L783
61533C89909L636L283K560J569L98q63j997k792l224l439l612l914m279m268l411
61518C69556j868l63N35P95N32j34p54p56k82j95q93j670j707j128n46j75L7j12
61500C60872o93j136q46m3O03R09J037Q13O3o12l24Q14J725J757J357J150J073
61483C68519P27J64j29J91R21J461J360Q12L81K51P7k72l95j51j04o02r50l02
$$ plain form
61598 410535 404114 398409 393078 388285 384643 382269 380466 378507 376282 373926 371268 368059 364586 361669
61584 361669 359998 359550 359613 359332 358343 356971 355847 355320 355231 355119 354549 353437 352222 351570 351666 351954 351808 351300
61566 351300 350905 350662 350139 349236 348485 348357 348708 349144 349593 350263 351282 352655 354352 356199 357798 358843 359457
61549 359457 360027 360672 361029 360643 359573 358550 358457 359637 361803 364637 368202 372592 377422 382030 386126 389909
61533 389909 393545 396828 399388 400957 401355 400492 398495 395703 392479 389040 385428 381514 377235 372967 369556
61518 369556 367688 367325 367860 368655 369187 369053 368299 367543 367261 367066 366173 364503 362796 361668 361122 360947 360984 360872
61500 360872 360179 359043 358197 358154 358757 359666 360703 361516 361579 360967 360643 361457 363182 364939 366296 367446 368519
61483 368519 369246 369410 369281 369472 370393 371854 373214 374026 374407 374658 374735 374463 374068 373917 373813 373211 372261 371959
61465C71959J062K106K385K193J661P26j41k01M51R54R29R04J302J815K017J926
61449C92048J704J449J446K012K906L484L569L595L826M115M552N532O977Q164
61435D45379Q626Q601Q314P614O572N716N234M622L607K773K704L034K988K414
61421E18198J728J093L18o87j732k569l012l089l272m135n460o176n642m572m097
61406D76894m226m003l100k384k646l341l168j735p7N90K71q2K5J15k38n92l70
61389D51933J04J04k76k28M35R10O23Q5J77J115K437L550L966L507K601K078K316
61372D75437K897L233L210L033K881K944L365L923M206M277M695N644O628P333
61358E33706Q161R437J0713J1535J2378J3992J6071J7383J7234J6075J4561J2701
$$ plain form
61465 371959 373021 375127 377512 379705 381366 382092 381951 381750 382201 383155 384084 384988 386290 388105 390122 392048
61449 392048 393752 395201 396647 398659 401565 405049 408618 412213 416039 420154 424706 430238 437215 445379
61435 445379 454005 462606 470920 478534 485106 490822 496056 500678 504285 507058 509762 512796 515784 518198
61421 518198 519926 521019 521337 520650 518918 516349 513337 510248 506976 502841 497381 491205 485563 480991 476894
61406 476894 472668 468665 465565 463181 460535 457194 454026 452291 452214 452804 453075 452993 453018 453133 452895 452303 451933
61389 451933 452037 452141 451865 451637 452072 452982 453605 453690 453867 454982 457419 460969 464935 468442 471043 473121 475437
61372 475437 478334 481567 484777 487810 490691 493635 497000 500923 505129 509406 514101 519745 526373 533706
61358 533706 541867 551304 562017 573552 585930 599922 615993 633376 650610 666685 681246 693947
61346F93947J0318P790N893M958M569M089L197J844k9k452n062p167q325q724
61332G04846q845q964r115r192q861p697n810m075l219k971k575j917j477j371
61318F28757j213r18p72o78o8J226K702M013N327O698P856Q792R776J0422R642
61303F91562P008L458J70k572m857o380o986p299p876q184p334n549l952l089
61289F38120k469j584o08P1M25P35J333K435L915N180N705N643N689O285P238
61274F78113Q035Q327Q200Q132Q533R197R521R453R861J1584J4449J7606K0480
61261H21491K2849K4163K3541K0626J6019J0706N303%m997r216j2251j4226j5740
61248H88268j7158j8109j8030j7038j5819j4677j3290j1524r849q688p923p351
$$ plain form
61346 693947 704265 712055 717948 722906 727475 731564 734761 736605 736576 734124 729062 721895 713570 704846
61332 704846 696001 687037 677922 668730 659869 652172 646362 642287 639068 636097 633522 631605 630128 628757
61318 628757 627544 626626 625854 625176 625108 626334 629036 633049 638376 645074 652930 661722 671498 681920 691562
61303 691562 698570 702028 702198 699626 694769 688389 681403 674104 666228 658044 650710 645161 641209 638120
61289 638120 635651 634067 633459 633530 633955 634690 636023 638458 642373 647553 653258 658901 664590 670875 678113
61274 678113 686148 694475 702675 710807 719340 728537 738058 747511 757372 768956 783405 801011 821491
61261 821491 844340 868503 892044 912670 928689 939395 944698 944698 939701 930485 918234 904008 888268
61248 888268 871110 853001 834971 817933 802114 787437 774147 762623 752774 744086 736163 728812
61236G28812p120p171o799n325l000p02R38J781J804J113J86m46p27r44j154j071
61220G00175m99M23J403K249K951L551L880L565K573J590J395J844K171K311L172
61205G32754N254P805R845J1376J3006J4904J6805J8649K0498K2169K3376K3950
61193I20391K3505K1377J7498J2935R009O131M024K563J691Q87m51k274m086n713
61179A007487p242q546r461j0215j1050j1764j2206j2964j4700j7041j8893j9735
61167H53670j9922j9827j9427j8658j7520j5830j3487j0920q656o592m339k119
61155F96373n42N35K079M570P177Q456P543M657P98k940o075q696j0631j1165
61141F92139j0030q113o486n073l137p23J338K823M531P125J0314J3321J5584
$$ plain form
61236 728812 721692 714521 707722 702397 699397 698695 699633 701414 703218 704331 704517 704071 703344 702400 701246 700175
61220 700175 699676 700099 701502 703751 706702 710253 714133 717698 720271 721861 723256 725100 727271 729582 732754
61205 732754 738008 745813 755658 767034 780040 794944 811749 830398 850896 873065 896441 920391
61193 920391 943896 965273 982771 995706 1004715 1010846 1014870 1017433 1019124 1020011 1019560 1017286 1013200 1007487
61179 1007487 1000245 991699 982238 972023 960973 949209 937003 924039 909339 892298 873405 853670
61167 853670 833748 813921 794494 775836 758316 742486 728999 718079 709423 702831 698492 696373
61155 696373 695831 696366 698445 703015 710192 718648 726191 730848 731646 728706 722631 713935 703304 692139
61141 692139 682109 673996 667510 662437 659300 658577 659915 662738 667269 674394 684708 698029 713613
61128G13613J6887J7407J7801J8678J9977K1170K1990K2443K2409K1805K1012
61117I35192K0437J9851J8806J7487J6381J5319J3776J1962J0592R542P768M756
61105A101869J160k239n440q844j2637j6723k0671k3620k4903k4868k4449k3989
61093I14646k3143k1859k0583j9407j7914j5966j3942j2127j0585r504q911q129
61081G32576o555m746l755l454k783j548o14j94O09K157L586M229M506M927N371
61066G34312N835O673P641Q014Q074R038J1068J2831J3688J4681J6478J8087J8698
61053H85118J9209K0576K2119K2998K3878K5569K7225K7765K7946K9065L0522
61042A161990L0769L0083L0222L1596L2793L2947L2811L3232L4118L5119L6134
$$ plain form
61128 713613 730500 747907 765708 784386 804363 825533 847523 869966 892375 914180 935192
61117 935192 955629 975480 994286 1011773 1028154 1043473 1057249 1069211 1079803 1089345 1097113 1101869
61105 1101869 1103029 1100790 1095350 1086506 1073869 1057146 1036475 1012855 987952 963084 938635 914646
61093 914646 891503 869644 849061 829654 811740 795774 781832 769705 759120 749616 740705 732576
61081 732576 726021 721275 717520 714066 711283 709735 709121 708927 709536 711693 715279 719508 724014 728941 734312
61066 734312 740147 746820 754461 762475 770549 779587 790655 803486 817174 831855 848333 866420 885118
61053 885118 904327 924903 947022 970020 993898 1019467 1046692 1074457 1102403 1131468 1161990
61042 1161990 1192759 1222842 1253064 1284660 1317453 1350400 1383211 1416443 1450561 1485680 1521814
61031A521814L7102L8298M0717M4981N0092N4393N7372N9456O0677O1207O2687
61020B088796O7272P5446Q6278R9397J14858J31450J47186J61596J75884J91469
61010C339632K10602K37799K77707L31686L99406M83381N88059P15010Q64875
61001G448157J045420J271561J555280J901980K313768K769323L171534L325994
60993B4803017L028227K229686J131136Q8457n98646q24267o46735j90301L82054
60984B9402628Q34673Q95195M06919n34363j615907k500487l004296l129230k979003
60975A7776129k670634k298134j927583j595374j311495j072992q75899p16088
60967E307930n86659m80675l94846l27721k76166k36111k04979j81077j61857
$$ plain form
61031 1521814 1558916 1597214 1637931 1682912 1733004 1787397 1844769 1904225 1964902 2026109 2088796
61020 2088796 2156068 2231514 2317792 2417189 2532047 2663497 2810683 2972279 3148163 3339632
61010 3339632 3550234 3788033 4065740 4397426 4796832 5280213 5868272 6583282 7448157
61001 7448157 8493577 9765138 11320418 13222398 15536166 18305489 21477023 24803017
60993 24803017 27831244 30060930 31192066 31280523 30681877 29857610 29210875 29020574 29402628
60984 29402628 30237301 31132496 31539415 31005052 29389145 26888658 23884362 20755132 17776129
60975 17776129 15105495 12807361 10879778 9284404 7972909 6899917 6024018 5307930
60967 5307930 4721271 4240596 3845750 3518029 3241863 3005752 2800773 2619696 2457839
60958B457839j44976j29988j17244j05954r4823q3693p3091o3111n4208m8072
60948A542679m5999m6949m8579m9717n0372n0112m8156m4839m1337l7982l4269
60937A044368l0392k7331k5234k3154k0688j8702j7869j7601j6946j5726j4317
60926H16408j2960j1825j1153j0873j0535r936r428r302r300q945q018o547m713
60913F92873k936j648q32j39M60O43L70M9j31n11j331k221k677k629k311j854
60897F75175j388j139j113q74K3J487K988M131M992N978P420R168J0684J1660
60883G29192J2426J3418J4413J4760J4355J3815J3689J3998J4655J5721J7053
60872H87495J8228J9135K0135K1376K2462K3166K3942K5219K6574K7169K6775
$$ plain form
60958 2457839 2312863 2182875 2065631 1959677 1864854 1781161 1708070 1644959 1590751 1542679
60948 1542679 1496680 1449731 1401152 1351435 1301063 1250951 1202795 1157956 1116619 1078637 1044368
60937 1044368 1013976 986645 961411 938257 917569 898867 880998 863397 846451 830725 816408
60926 816408 803448 791623 780470 769597 759062 749126 739698 730396 721096 712151 704133 697586 692873
60913 692873 689937 688289 687457 687318 687778 688421 688791 688840 688709 688198 686867 684646 681969 679340 677029 675175
60897 675175 673787 672648 671535 670661 670684 672171 675159 679290 684282 690260 697680 706848 717532 729192
60883 729192 741618 755036 769449 784209 798564 812379 826068 840066 854721 870442 887495
60872 887495 905723 924858 944993 966369 988831 1011997 1035939 1061158 1087732 1114901 1141676
60861A141676K5869K4788K3280K0866J7308J2696P281J357m685j0266j4791j8150
60849A227229k0881k3478k5740k7292k8544l0341l2662l4479l5143l5056l4642
60838H98971l3594l1715k9635k7966k6343k4185k1862k0121j8780j6937j4401
60827F33432j1991j0435r632r069q294p029n373l910l082k597j952j364j416j922
60813E55366j989j267l17L91J027J688J939J594J291J688K416K507J670O46K35
60798E68885M32N96L10k23n72p20j077j845k651k991k885k855l339m257n094n281
60782E36433m729m074m169n142o216o646o489o224o042n871n785n854n824n405
60768D57963m680l899l090k300j831j769j587p96K24P22O05M21M42M84N24Q44
$$ plain form
60861 1141676 1167545 1192333 1215613 1236479 1253787 1266483 1273764 1275121 1270436 1260170 1245379 1227229
60849 1227229 1206348 1182870 1157130 1129838 1101294 1070953 1038291 1003812 968669 933613 898971
60838 898971 865377 833662 804027 776061 749718 725533 703671 683550 664770 647833 633432
60827 633432 621441 611006 601374 592305 584011 576982 571609 567699 564617 562020 560068 558704 557288 555366
60813 555366 553377 552110 551793 552184 553211 554899 556838 558432 559723 561411 563827 566334 568004 568650 568885
60798 568885 569317 569913 570223 570000 569428 568708 567631 565786 563135 560144 557259 554404 551065 546808 541714 536433
60782 536433 531704 527630 523461 518319 512103 505457 498968 492744 486702 480831 475046 469192 463368 457963
60768 457963 453283 449384 446294 443994 442163 440394 438807 438011 438235 438957 439562 439983 440425 440909 441433 442277
60752D42277J482K151K681L165L698M359N275O215O393N264L291J354k30j443
60738D85932j824j025J42L84l46q92p76q59j833l150l944m171m319m718n473o475
60722D46653p114o734n646m923m925m902m402m040m325m596m066l101k602k588
60708C82689k349j646r46n81l97k05n2j8j00l14o62j034j305j410j275r37o20
60691C68838m52j40N76J320J549J539K086L139L736L502L228L508L836L747L909
60676D03921N157P077Q437Q637Q006P006N873M765L624K239Q76M25J294K607L176
60661D73120K871K391K114J919J809J829J632Q78r3o45p43q28j015j134j430k400
60645D80275l977n527o662p396p561o853n529m427m025m021l971l786l406k581
$$ plain form
60752 442277 443759 445910 448591 451756 455454 459813 465088 471303 477696 482960 486251 487605 487375 485932
60738 485932 484108 483083 483225 483609 483263 482371 481595 480736 478903 475753 471809 467638 463319 458601 453128 446653
60722 446653 439539 432805 427159 422236 417311 412409 408007 403967 399642 395046 390980 387879 385277 382689
60708 382689 380340 378694 377748 377167 376770 376565 376513 376495 376395 376081 375419 374385 373080 371670 370395 369458 368838
60691 368838 368386 368246 368822 370142 371691 373230 375316 378455 382191 385693 388921 392429 396265 400012 403921
60676 403921 409078 416155 424592 433229 441235 448241 454114 458879 462503 464742 465618 466043 467337 469944 473120
60661 473120 475991 478382 480496 482415 484224 486053 487685 488563 488470 487825 487082 486254 485239 484105 482675 480275
60645 480275 476298 470771 464109 456713 449152 442299 436770 432343 428318 424297 420326 416540 413134 410553
60631D10553j309j53L25K34J72M84Q99R18L50n79j512k173k350j901j001j73K02
60614D02986K59K98L06K09K35M79L90m56j269q57N23J248O11k20j06M78O03N54
60596D06271J086J856J890J246R89J672K791L666L961L504K403J311P92N72M7
60581D34057o53q90o26m15m15k24L30R82J672K595L588M226M586N219O252P271
60565D67555Q189R459J1162J2529J2786J1984J0698R243P547N463K996L41k106
60552E67846l862m596m277l249k142j390o94N96K417L772M038L975M922P311J0502
60537E85169J3742J6631J8893K0296K0754K0076J7920J4339J0025N525P49m210
60525G39909q344j0598j1085j0674r810q515p167o199n350m140k816j882r97N10
$$ plain form
60631 410553 409244 409091 409416 409650 409822 410306 411205 412123 412473 411894 410382 408209 405859 403958 402957 402784 402986
60614 402986 403245 403543 403849 404058 404293 404772 405162 404706 403437 402580 403103 404351 404962 404742 404636 405114 405717 406271
60596 406271 407357 409213 411103 412349 413338 415010 417801 421467 425428 428932 431335 432646 433438 434010 434057
60581 434057 433404 432514 431888 431473 431058 430834 431164 432146 433818 436413 440001 444227 448813 454032 460284 467555
60565 467555 475744 485203 496365 508894 521680 533664 544362 553605 561152 566615 569611 569952 567846
60552 567846 563984 559388 555111 551862 549720 548330 547636 548232 550649 554421 558459 562434 567356 574667 585169
60537 585169 598911 615542 634435 654731 675485 695561 713481 727820 737845 743370 744119 739909
60525 739909 731565 720967 709882 699208 689398 680883 673716 667517 662167 658027 655211 653329 652332 652842
60511F52842K302L355L522L606L948M233M718O210Q540J0455J1547J3103J6401
60498G44782K1163K6330L1426L6420M1037M5003M8380N0999N2099N1012M7637
60487A196288M1918L3517K2597J0212k660j5873k9202m1308n0452n5959n8304
60476A050774n8081n5598n1353m6186m0903l6060l1998k8691k5645k2370j8989
60465F34900j6132j4224j3081j2161j1054r742q469p406o544n916n673n679n347
60452E13472m344l254k996l632m275m224l573k659j543l05O67J007P87L56K4j11
60436D85397k39o96j500k134k153j745j285o21M95J578J751R71J31r2K08P04J177
60419D81947J256O92M0K47J337K294K420K002J399M07j019k238k683k489j954
$$ plain form
60511 652842 655144 658499 662021 665627 669575 673808 678526 684736 693276 703731 715278 728381 744782
60498 744782 765945 792275 823701 860121 901158 946161 994541 1045540 1097639 1148651 1196288
60487 1196288 1238206 1271723 1294320 1304532 1301872 1285999 1256797 1215489 1165037 1109078 1050774
60476 1050774 992693 937095 885742 839556 798653 762593 730595 701904 676259 653889 634900
60465 634900 618768 604544 591463 579302 568248 558506 550037 542631 536087 530171 524498 518819 513472
60452 513472 509128 505874 502878 499246 494971 490747 487174 484515 482972 482667 483334 484341 485128 485484 485508 485397
60436 485397 485158 484462 482962 480828 478675 476930 475645 475024 475519 477097 478848 479819 479950 479858 480066 480770 481947
60419 481947 483203 483895 483935 484182 485519 487813 490233 492235 493634 494041 493022 490784 488101 485612 483658
60404D83658j018L07J524K191K362K190J680J129J142J818K493K688K677K791
60390E07632K844K680K575K595K298J566J104J481K287K785K851K676K239J711
60376E39324J732K506L226L167K749K673K628J883Q10N56J327K033J806R65L54
60361E67739M18J134K131K740K514J913J943K920M175N154O193P789R586J0696
60347F27045J0813J0454J0037R268P690N427K989N19k258n255p760r201r774r905
60333F40089r580q636p378o277n287m110k957k296j965j359m78k9l65j077j760
60318E86535k402k806k480j401k45N31J140J833K469L086M151N829P627R193J0853
60303F23913J2998J5554J8323K1068K2880K2335J8968J3942Q663L297k655q971
$$ plain form
60404 483658 482640 482947 484471 486662 489024 491214 492894 494023 495165 496983 499476 502164 504841 507632
60390 507632 510476 513156 515731 518326 520624 522190 523294 524775 527062 529847 532698 535374 537613 539324
60376 539324 541056 543562 546788 549955 552704 555377 558005 559888 560698 561254 562581 564614 566420 567385 567739
60361 567739 568157 569291 571422 574162 576676 578589 580532 583452 587627 592781 598974 606763 616349 627045
60347 627045 637858 648312 658349 667617 675307 680734 683723 684242 681984 676729 668969 659768 649994 640089
60333 640089 630509 621873 614495 608218 602931 598821 595864 593568 591603 590244 589766 589737 589372 588295 586535
60318 586535 584133 581327 578847 577446 577201 577732 578872 580705 583174 586260 590411 596240 603867 613060 623913
60303 623913 636911 652465 670788 691856 714736 737071 756039 769981 778644 781941 779286 770315
60291G70315j4679j8960k1465k2130k1283j9645j7706j5426j2902j0753r347q214
60279E77805o872n616m912m477l718k691j926j611j580j732j862j438k22J135
60265E40283J751J520J024P36P21Q13O72M9o21n08L09O08l21j554j872j477j361
60248E40772j635j628j256r98p70m5R86J546J633K094L137L816L434K536K044
60233E55666K057K089K005K111K533K919K855K362J880J710J653J435J344J927
60219E84546L010L679L505L151L292L615L463K909K507K380K286K213K235K097
60205F24888J584R81N58pj007j957k225k104k363l009l330l075k761k784k956
60190F00433k894k438j690j039q26p00J61J674K481J738N20L50J030J231P56O29
$$ plain form
60291 770315 755636 736676 715211 693081 671798 652153 634447 619021 606119 595366 586019 577805
60279 577805 570933 565317 560405 555928 552210 549519 547593 545982 544402 542670 540808 539370 539148 540283
60265 540283 542034 543554 544578 545314 546035 546848 547520 547569 546948 546440 546749 547357 547036 545482 543610 542133 540772
60248 540772 539137 537509 536253 535255 534485 534440 535426 536972 538605 540699 543836 547652 551086 553622 555666
60233 555666 557723 559812 561817 563928 566461 569380 572235 574597 576477 578187 579840 581275 582619 584546
60219 584546 587556 591235 594740 597891 601183 604798 608261 611170 613677 616057 618343 620556 622791 624888
60205 624888 626472 627453 628011 628004 626997 625040 622815 620711 618348 615339 612009 608934 606173 603389 600433
60190 600433 597539 595101 593411 592372 591546 590846 591007 592681 595162 596900 597420 597770 598800 600031 600787 601416
60174F01416J142J424J152J130J735K146J743J107R40R70O40J09j89l77q21j415
60158F12852j741j602r88J10J440K423K746K740K866L182L505L801M094M304M372
60143F44104M380M343M129L698L159K576K125K334L642N502O532N888M161K498
60129F99071J220k73k359m499n830o128n944n805n633n086m254l654l556l754
60115F43516l993m170m110l613k878k397k189j756r66l61k14JP13J475J712J651
60099F22421J878K426K953L382L753L927L986M410N300N980N944N532N051M138
60085F81081K788K024K402K771J806L0j185j914l270n173o367o605p004q019q718
60070F44647q410p532o565n426m328l890l979l668k763k176k377k737k838l119
$$ plain form
60174 601416 602558 603982 605134 606264 607999 610145 611888 612995 613935 614905 615545 615654 615465 615088 614267 612852
60158 612852 611111 609509 608521 608631 610071 612494 615240 617980 620846 624028 627533 631334 635428 639732 644104
60143 644104 648484 652827 656956 660654 663813 666389 668514 670848 674490 679992 686524 692412 696573 699071
60129 699071 700291 700018 697659 693160 687330 681202 675258 669453 663820 658734 654480 650826 647270 643516
60115 643516 639523 635353 631243 627630 624752 622355 620166 618410 617444 617083 616869 616870 617583 619058 620770 622421
60099 622421 624299 626725 629678 633060 636813 640740 644726 649136 654436 660416 666360 671892 676943 681081
60085 681081 683869 685893 688295 691066 692872 692902 691717 689803 686533 681360 674993 668388 661384 653365 644647
60070 644647 636237 628705 622140 616714 612386 608496 604517 600849 598086 595910 593533 590796 587958 584839
60056E84839l628l450k151p14j37q0K34O73O77L95M16Q33J237J308Q92r4j410
60039E79840k644l804n201o493o748n771m594m077l927l619l501m164n341o200
60025E13756o376o078n533m915m498m407m381m068l357k280r89J43Q10J228J752
60010D70807K118J887J492J869K888L257K343J069M85N52Q46J430K238K541J986
59995D97808J400J667K347K356J603J053J356K188K804K748K104J362Q74L59o27
59980E21402j711j940j204n68p23r78m16P18J488J535J183P29L38K93P06J257
59964E22109J603J760J840J869K139K963L837L617K073M76K1M04O13L86P2l23
59948E45459r99j703k009j977j928j919j953k228k638k543j718r02p71r42p75
$$ plain form
60056 584839 581211 577761 575610 574896 574759 574679 574913 575586 576263 576658 577074 577907 579144 580452 581344 581250 579840
60039 579840 577196 573392 568191 561698 554950 549179 544585 540508 536581 532962 529461 525297 519956 513756
60025 513756 507380 501302 495769 490854 486356 481949 477568 473500 470143 467863 466874 467017 467827 469055 470807
60010 470807 472925 474812 476304 478173 481061 484318 486661 487730 488215 488767 489613 491043 493281 495822 497808
59995 497808 499208 500875 503222 505578 507181 508234 509590 511778 514582 517330 519434 520796 521670 522029 521402
59980 521402 519691 517751 516547 515979 515256 514278 513862 514580 516068 517603 518786 519515 519853 520146 520852 522109
59964 522109 523712 525472 527312 529181 531320 534283 538120 541737 543810 544286 544307 544711 545324 545710 545782 545459
59948 545459 544460 542757 540748 538771 536843 534924 532971 530743 528105 525562 523844 522942 522171 521229 520454
59933E20454n78r93j697j751r88j28L63O48Q92J035J134J290J328J187J377K381
59917E25954L778M685M950N199N847O712P569Q339Q688Q169O856N353M102L093
59903F09294K171J208m0j658l087l461k589j267m56l82n87n88k43L78J277K433
59887F02403L523L989L636K984K667K702K651K292J716R51J17l78m14p07j887
59872F26245l228l387k344j398j175j013n81n98j320j749j201m49l33l84J36Q76
59856F08097J277J736K702L543L697M060N704P964R470J0556J2690J5616J6919
59843G04031J4864J0240N029N72k435l402k245K08K745M382M377K295j551o164
59829G32946j0563j4176j6612j7566j7075j5467j3115j0578q636p675p106o015
$$ plain form
59933 520454 519876 518883 517186 515435 514447 514319 514682 515330 516222 517257 518391 519681 521009 522196 523573 525954
59917 525954 529732 534417 539367 544566 550413 557125 564694 573033 581721 589890 596746 602099 606201 609294
59903 609294 611465 612673 612633 610975 607888 604427 601838 600571 600115 599733 599146 598558 598315 598693 599970 602403
59887 602403 605926 609915 613551 616535 619202 621904 624555 626847 628563 629514 629631 629253 628839 628132 626245
59872 626245 623017 619630 617286 615888 614713 613700 613119 612521 611201 609452 608251 607802 607469 607085 607221 608097
59856 608097 609374 611110 613812 617355 621052 625112 630816 638780 648250 658806 671496 687112 704031
59843 704031 718895 729135 734164 734736 732301 728899 726654 726862 729607 733989 738366 740661 739110 732946
59829 732946 722383 708207 691595 674029 656954 641487 628372 617794 609158 601483 594377 588362
59817E88362m374l006k446k377k219j820j391j119q84l20P38J760J965J354P65
59802E74988N70J06j089k258k497k201k414l160l541l258k947k988k958k423j521
59787E42409o13L9J95j71o23p27o39p02o28J53J408K177K041J623J675K145K405
59770E52167K017J207P18J096J983K433K109J728J888K115J665P77K88L65M83
59755E73039M67P18J427K280K898L090K861K579K872L721M072L069J368M10O59
59740F05530J343J712J696J460J158J089J375J499Q78j57o26j56O41R69N35m17
59724F18529j293j512j169r82j205j160m08L22K27j87R2R71J583J805K216K811
59708F20640L083L180L703M415M492M016L859M027L583K458J833K247K641J968
$$ plain form
59817 588362 583988 580982 578536 576159 573940 572120 570729 569610 568726 568406 569144 570904 572869 574223 574988
59802 574988 575558 575664 574575 572317 569820 567619 565205 562045 558504 555246 552299 549311 546353 543930 542409
59787 542409 541796 541835 542030 541859 541236 540509 539870 539168 538540 538693 540101 542278 544319 545942 547617 549762 552167
59770 552167 554184 555391 556109 557205 559188 561621 563730 565458 567346 569461 571126 571903 572191 572556 573039
59755 573039 573506 574224 575651 577931 580829 583919 586780 589359 592231 595952 600024 603093 604461 604871 605530
59740 605530 606873 608585 610281 611741 612899 613988 615363 616862 617740 617583 616957 616801 617442 618411 618946 618529
59724 618529 617236 615724 614555 613573 612368 611208 610800 611122 611349 611162 611254 612225 613808 615613 617829 620640
59708 620640 623723 626903 630606 635021 639513 643529 647388 651415 654998 657456 659289 661536 664177 666145
59694F66145O08n94j583k613l349l382l024k780k420j388J01R87M27j412l491
59679F42232m761n033m992n206n374m931m152l856m154m258l667k810k332k365
59665E84341k692l061l077k369j107O0P09R67J082J151J306J637J907J698R41
59650E83493r8j239k359l148l332l145l002k892k522j938j403q85k15M43Q33J029
59634E59620J053M56r40k300k676k391k496l033k967j865n84m1k30o95j237j857
59618E37817k510l095l333k780j434m1P83J371K184K715K209J114O15R07J075
59603E37597O56J32j60m37p31p09m41l36k85K01R92J476J697K235K964L118K647
59586E50616K292K163J557M72m4M27P90r7j981l745m623m506l824l407l835m598
$$ plain form
59694 666145 666753 666159 664576 661963 658614 655232 652208 649428 647008 645620 645721 646708 647135 645723 642232
59679 642232 637471 632438 627446 622240 616866 611935 607783 603927 599773 595515 591848 589038 586706 584341
59665 584341 581649 578588 575511 573142 572035 572095 572804 573771 574853 576004 577310 578947 580854 582552 583493
59650 583493 583395 582156 579797 576649 573317 570172 567170 564278 561756 559818 558415 557530 557315 557758 558591 559620
59634 559620 560673 561129 560189 557889 555213 552822 550326 547293 544326 542461 541877 541836 541606 540911 539674 537817
59618 537817 535307 532212 528879 526099 524665 524624 525407 526778 528962 531677 533886 535000 535615 536522 537597
59603 537597 538253 538385 538225 537788 537057 536348 535907 535571 535286 535487 536479 537955 539652 541887 544851 547969 550616
59586 550616 552908 555071 556628 557100 557056 557483 558273 558176 556195 552450 547827 543321 539497 536090 532255 527657
59570E27657m681l946l148k596j849q57k39j91j41J76L61L12N36J141J500J303
59554E15338J044J164J571K205L205M303M993N405O150P260Q300R442J1294J3802
59540E95476J6465J9282K1858K1873J6744P343j955p611r664r591p721m070J38
59527F58567L459N746P374P993P267N850M428K653J16k515m397n784p350r000
59513F74407j0309j1412j2473j2980j2411j1036r344p433n639m842n241n701n157
59500E60429l935k823j807o67j6n23j710k513k590k222j468l90M05L41l03p28
59484E39480m46O38K358L978M463L770L183L746M977N691N451M634L684K914K481
59469E91002K076J267M27N51J807L210M035M605N323O066O926Q378J0123J1067
$$ plain form
59570 527657 522976 519030 515882 513286 511437 510580 510341 510150 510009 510185 510546 510858 511394 512535 514035 515338
59554 515338 516382 517546 519117 521322 524527 528830 533823 539228 545378 552638 560938 570380 581674 595476
59540 595476 611941 631223 653081 674954 691698 699041 697086 689475 679811 670220 662499 658429 658567
59527 658567 662026 667772 675146 683139 690406 696256 700684 703337 703453 700938 696541 690757 683407 674407
59513 674407 664098 652686 640213 627233 614822 603786 594442 587009 581370 576528 571287 565586 560429
59500 560429 556494 553671 551864 551197 551181 550658 548948 546435 543845 541623 540155 539765 540170 540511 540208 539480
59484 539480 539034 539672 542030 546008 550471 554241 557424 561170 566147 571838 577289 581923 585607 588521 591002
59469 591002 593078 594345 594772 595323 597130 600340 604375 608980 614303 620369 627295 635673 645796 656863
59455F56863J0962J0818J1098J0901R707Q424P658O338L270j106n560r492j2484
59442G07397j3731j3167j2059j1263j0036p752n523m706m806m358k977j214P17
59429F16522K659L934M356N090P116R721J1737J3314J5088J6617J7233J7627J9041
59416G60055K1485K3922K5256K3844J7409N607p996j8381k3240k3471k0620j5754
59404G68116j0046m270J918Q265J1902R282L86j0715j9609k4464k5531k3775k0497
59391F60962j6928j3561j0525q254o915n624l518j202J59P22J530K682L394L583
59377F06505L748L620K587J327J321K722M234N191O174P390P960P251N835M698
59363F70563M371M886N793O332O290O394P081P619P466P715R639J2540J4665J5751
$$ plain form
59455 656863 667825 678643 689741 700642 710349 718773 726431 732769 736039 734933 729373 719881 707397
59442 707397 693666 680499 668440 657177 647141 639389 633866 629160 624354 619996 617019 615805 616522
59429 616522 619181 623115 627471 632561 639677 649398 661135 674449 689537 706154 723387 741014 760055
59416 760055 781540 805462 830718 854562 871971 877578 869582 851201 827961 804490 783870 768116
59404 768116 758070 753800 755718 763983 775885 785167 785553 774838 755229 730765 705234 681459 660962
59391 660962 644034 630473 619948 611694 604779 599155 595637 594435 594594 595316 596846 599528 602922 606505
59377 606505 610253 613873 616460 617787 619108 621830 626064 631255 637429 644819 652779 660030 665865 670563
59363 670563 674934 679820 685613 691945 698235 704629 711710 719329 726795 734510 744149 756689 771354 787105
59349G87105J6851J8042J8237J7230J6034J5015J3331J0488O870K644k274p004
59337I12569j0034j1217j2049j3623j5512j6903j7594j7569j6730j5359j3933
59326G52046j2439j0739r371q821q365o890m735l252k774k485k091k052k229j916
59312F73887j306j305j836j868j218p22m85M04K126L794N101O793R112J1296J3083
59297G16856J5339J8575K1896K3654K2152J6017N506o438j5982k1535k3972k4123
59285G47945k1943j8109j4231j0933p535m017j420K37K378N485Q124R306R911
59272G05198J0804J1247J0525R511R302R357Q378O124L275L39k399m579o225p766
59258G63091r133r726r643r805j0344j0106q465o418n113m375l553k733k181j510
$$ plain form
59349 787105 803956 821998 840235 857465 873499 888514 901845 912333 919203 921847 919573 912569
59337 912569 902535 891318 879269 865646 850134 833231 815637 798068 781338 765979 752046
59326 752046 739607 728868 719497 710676 702311 695421 690686 687434 684660 682175 680084 678032 675803 673887
59312 673887 672581 671276 669440 667572 666354 665632 665147 665551 667677 671471 676572 683365 692477 703773 716856
59297 716856 732195 750770 772666 796320 818472 834489 839995 833557 817575 796040 772068 747945
59285 747945 726002 707893 693662 682729 675194 671177 669757 669994 672372 677857 685981 695287 705198
59272 705198 716002 727249 737774 747285 756587 765944 774322 780446 783721 784060 781661 777082 770857 763091
59258 763091 753958 744232 734589 724784 714440 704334 695869 689451 684338 679963 676410 673677 671496 669986
59244F69986k77J232K561L781N046O182P170Q218Q979Q527O581L979J589l99j928
59229G31227k891l786n443p666r195r364q770p949o639m781l050j886j019l62
59215F58426k04j89N96K015K652J827O02J95M97P49N43l20j788k930k601j190
59199F58880l85o94p81K37J407J662J363J122O64r0j77R03K017K009J432J507
59183F71076K245K739K609K173J762J697K241L069L513L810N025P252R149R859
59169G28219J0098J0589J0793J0180R374Q939Q218O535M498K892J299r84l493
59156H07157n313o473p553q519r008r190r420r543r343r015q667q032p243p019
59142F92819p450p621p023o313n994n498m352l112k276j336R4J334J768J984K777
$$ plain form
59244 669986 669709 670941 673502 677283 682329 688511 695681 703899 712878 721405 727986 731965 733554 733155 731227
59229 731227 728336 724550 719107 711441 702246 692882 684112 676163 669524 664743 661693 659807 658788 658426
59215 658426 658222 658033 658629 660644 663296 665123 665725 665920 666417 667166 667709 667389 665601 662671 660070 658880
59199 658880 658495 657801 657020 657257 658664 660326 661689 662811 663475 663385 663208 664111 666128 668137 669569 671076
59183 671076 673321 676060 678669 680842 682604 684301 686542 689611 693124 696934 701959 709211 718360 728219
59169 728219 738317 748906 759699 769879 779253 788192 796410 802945 807443 810335 811634 810650 807157
59156 807157 801844 795371 787818 779299 770291 761101 751681 742138 732795 723780 715113 707081 699838 692819
59142 692819 685369 677748 670725 664412 658418 652920 648568 645456 643180 641844 641938 643272 645040 647024 649801
59127F49801L901M738N371O165P140Q436J0405J2682J4283J5256J6863J9362K1201
59114G95604K1483K1581K2926K4612K4811K3459K1855K0494J8891J6880J4606
59103A027202J1796Q222M422R08k640o456r733j1574j2028j1356r280o100l367
59090I80016k256k177k142k479l855n721p145q377j0067j1770j2644j2896j3169
59077H85318j3179j2351j1166j0481j0134r475q673q266p992p314o528o255o381
59064G67123o526o800p133o732n289l852l302k976k020j035r71j417j467j324
59050G16279j448j113M53K214K496J430N27K97O6k45P0J036J918K528L357M533
59034G34398N805P288R177J1028J2392J3700J5497J7312J8378J8898J9475J9910
$$ plain form
59127 649801 653702 658440 663811 669976 677116 685552 695957 708639 722922 738178 755041 774403 795604
59114 795604 817087 838668 861594 886206 911017 934476 956331 976825 995716 1012596 1027202
59103 1027202 1038998 1047220 1051642 1052550 1049910 1043454 1033721 1022147 1010119 998763 989483 983383 980016
59090 980016 977760 975583 973441 970962 967107 961386 954241 945864 935797 924027 911383 898487 885318
59077 885318 872139 859788 848622 838141 828007 818532 809859 801593 793601 786287 779759 773504 767123
59064 767123 760597 753797 746664 739932 734643 730791 727489 724513 722493 721458 720487 719070 717603 716279
59050 716279 714831 713718 714171 716385 718881 720311 720838 721135 721201 720956 721026 722062 723980 726508 729865 734398
59034 734398 740203 747491 756668 767696 780088 793788 809285 826597 844975 863873 883348 903258
59022I03258J9569J8295J5945J2013O801K020j071l179n371p101p305o355n199
59009I42320l575q64K165M335N982Q064J0080J0761J0123Q958P076M017Q17j234
58995A009025k937o031j0046j2718j3360j3512j4262j5166j5877j6622j6761j5058
58983H56675j1854r041p382n684l188r08J77P09J808L480M938N704N879N887O197
58968H53397O803P139P021P178Q138R284R904J0290J0623R791O855K875m29l060
58954I45809n927q489r436r257r775j1138j1579j0231q077n877l290n25J110J028
58940H54346J49o83j719l247m868o271p564q537q665p988o990n661l852k349k163
58925G83938k919l263k780k151j608p81P9L18L66J426L630N892P549Q772R484
$$ plain form
59022 903258 922827 941122 957067 969080 975881 977901 976830 973651 968280 961179 953874 947519 942320
59009 942320 938745 937881 940046 944381 950363 958427 968507 979268 989391 998349 1005425 1009442 1010259 1009025
58995 1009025 1006088 1000057 990011 977293 963933 950421 936159 920993 905116 888494 871733 856675
58983 856675 844821 835780 828398 822714 819526 818618 818795 819504 821312 824792 829730 835434 841313 847200 853397
58968 853397 860200 867339 874360 881538 889676 898960 908864 919154 929777 939568 946423 949298 948869 945809
58954 945809 939882 931393 921957 912700 902925 891787 880208 869977 861900 856023 852733 852208 853318 854346
58940 854346 854495 853812 852093 848846 843978 837707 830143 821606 812941 804953 797963 792302 788450 786101 783938
58925 783938 781019 777756 774976 772825 771217 770436 770515 770833 771199 772625 776255 782147 789696 798468 807952
58910H07952R430R178R561J0197J0131R665R894J0632J0591R550Q537P834O676
58897I29828N103M295M775N880P250R255J1867J4489J7002J9382K0464J8852J5085
58884A083527J1135P717L944m11m327p499j0847j4582j7485j8626j8353j7303
58872I96890j5865j4806j4753j4980j4227j2751j1896j1845j1616j1240j1766
58861H51145j3007j3392j2466j1472j1124j0736r968r427r158q456p581p696q665
58848G17997q969q237p782q163q298p674p263p409o864m943k791j570r75l72J43
58833F36830N88J354K083J813P83M49J212J856J708J522J641J277K87k27R8J23
58817F53397p76j641j711j591j841k072k115k506l108k939j997j537j930j977
$$ plain form
58910 807952 817382 826560 836121 846318 856449 866114 876008 886640 897231 906781 915318 923152 929828
58897 929828 934931 939226 944001 949881 957131 966386 978253 992742 1009744 1029126 1049590 1068442 1083527
58884 1083527 1094662 1102379 1106323 1105912 1101585 1094086 1083239 1068657 1051172 1032546 1014193 996890
58872 996890 981025 966219 951466 936486 922259 909508 897612 885767 874151 862911 851145
58861 851145 838138 824746 812280 800808 789684 778948 768980 759553 750395 741939 734358 726662 717997
58848 717997 709028 700791 693009 684846 676548 668874 661611 654202 647338 642395 639604 638034 637059 636687 636830
58833 636830 637418 638772 640855 642668 643451 643900 645112 646968 648676 650198 651839 653116 653403 653176 653274 653397
58817 653397 652621 650980 649269 647678 645837 643765 641650 639144 636036 633097 631100 629563 627633 625656
58803F25656j043j14n7m44p84j234j541j045j79j58q03o47M16Q39L09N27K275
58786F21973M052M639M830N500O058O013O128O855P425P463P636P821O647L822
58772G06862R13j093k946m999o164o064n987o551o588n520m547m303l639k065
58758F47309j001j203j245j97O33K63L4J116K284K230K077L320N168O118O651
58743F73557Q078J0016J1166J1515J1948J2573J3083J3798J5015J6230J7040J7629
58731H31648J7494J5332J1154O802L357p2l895o587p082o521o080n099l050j293
58717H46108j104j744k205k937m283n120m929n198o879q488q685q781j0488j3034
58703G62233j4733j5699j6817j7587j7207j6344j5775j4773j2797j1102j0637
$$ plain form
58803 625656 624613 624499 624442 623998 623214 621980 620439 619394 619215 619057 618254 617607 618023 618862 619171 619698 621973
58786 621973 626025 630664 635494 640994 647052 653065 659193 666048 673473 680936 688572 696393 703040 706862
58772 706862 707775 706682 703736 698737 692573 686509 680522 673971 667383 661863 657316 653013 649374 647309
58758 647309 646308 645105 643860 643663 644296 644559 644593 645709 647993 650223 652300 655620 660788 666906 673557
58743 673557 681635 691651 702817 714332 726280 738853 751936 765734 780749 796979 814019 831648
58731 831648 849142 864474 875628 882430 885787 885715 881820 875233 868151 861630 855550 850451 847401 846108
58717 846108 845004 843260 841055 838118 833835 828715 823786 818588 811709 803221 794536 785755 775267 762233
58703 762233 747500 731801 714984 697397 680190 663846 648071 633298 620501 609399 598762
58692E98762j0014p803n218m204m389m233l774l859l935k972j491n66N7R09J226
58677E48496N08K15J822M409O250P476R124J0936J2231J3589J5665J7565J8356
58664F66642J8591J8409J5997J0302L505j674n524r622j3274j4555j3671j2381
58652F62745j1120r292p392o260n169l167j276r33j365r72j88l29q33l08O43M30
58636F15214n57p41l12p54k000k627k255j486j80J889L473L312K358K339L104
58621F20777L663M641P046R640J0330R376Q589Q093O546L956J666j1j770l452
58607F89090m408n076o047o453n420m022l674l691k838j932k285k825j594R25
58593F39750K782L854N343P045P967Q790J0820J3334J4671J5053J5460J4907J1910
$$ plain form
58692 598762 588748 580945 575727 571523 567134 562901 559127 555268 551333 548361 546870 546304 546361 547270 548496
58677 548496 549004 549219 551041 555450 561700 569176 578300 589236 601467 615056 630721 648286 666642
58664 666642 685233 703642 719639 729941 733446 731772 726248 716626 703352 688797 675126 662745
58652 662745 651625 642333 634941 628681 623512 620345 619069 618136 616771 615799 615611 615282 614449 614141 614784 615214
58636 615214 614657 613916 613604 612850 610850 608223 605968 604482 604302 606191 609664 612976 615334 617673 620777
58621 620777 624440 629081 636127 645767 656097 665473 674062 682155 688701 692657 694323 694312 692542 689090
58607 689090 684682 679606 673559 667106 661686 657664 653990 650299 647461 645529 643244 640419 638825 639750
58593 639750 642532 646386 651729 658774 666741 675531 686351 699685 714356 729409 744869 759776 771686
58580G71686P731M944L616K007K35o7R33J640K231M284P630J0654J3316J6766
58566H47606K0491K2943K4538K6846K9215K9394K7150K4206K1000J6767J2395
58555A102551R821Q677O764L741J195q48m155q928j3236j6103j8396k0533k1877
58542A028673k2496k3034k3052k1791k0068j9032j7849j5241j2347j1135j0984
58531H31644r875p941o572n083j919J796L570L774M768O561P197O846P447Q668
58517H50881Q244O176M655L961K374p6j712k854n277q190q972p844p580q536q354
58502H16896o817o403p521p620n914m612m582l883j741PM90J160K618L638M201
58487G79917N954Q931J1319J3048J5913J9626K1556K1044K0117J9321J6752J2064
$$ plain form
58580 771686 779417 784361 787977 789984 790219 790152 791085 792725 794956 799240 806870 817524 830840 847606
58566 847606 868097 891040 915578 942424 971639 1001033 1028183 1052389 1073389 1090156 1102551
58555 1102551 1112372 1121049 1127813 1131554 1132749 1131901 1127746 1118818 1105582 1089479 1071083 1050550 1028673
58542 1028673 1006177 983143 960091 938300 918232 899200 881351 866110 853763 842628 831644
58531 831644 821769 813828 807256 802173 800254 802050 805620 809394 814162 820723 827920 834766 842213 850881
58517 850881 859125 865301 869956 873917 876291 876215 874503 871649 866372 858182 849210 841366 833786 825250 816896
58502 816896 810079 803676 796155 788535 782621 778009 773427 769544 767803 767810 768300 769460 772078 775716 779917
58487 779917 785871 794802 806121 819169 835082 854708 876264 897308 917425 936746 953498 965562
58475I65562P476L953J66l975o719q127j0374j3493j4812j3620j2371j2230j1380
58462H70056q923o539n009k831M49L038M165N128O181N861M110K503R16k295o321
58447H70489q143p333o525o587n552l013j115m35Q04K697L295K852L784N831O149
58432H57198N013O019R710J2352J2466J3005J5353J6689J5451J4022J3684J2042
58420A003004P991M314K728J005k499n864p613r210j1246j1569r581q067q409
58407I44984q258o115l824k388R1M093O870P275P803R671J0494R067P656P279
58393I94698N606K014k93K34P74m86j203J99J468J227J802M414O315N737M998
58378A027504N809O202M978M375N476N766M112L280M676N596M522M112O005P788
$$ plain form
58475 965562 973038 976991 977157 973182 966463 958336 947962 934469 919657 906037 893666 881436 870056
58462 870056 861133 854594 849585 846754 847203 850241 854406 859534 865715 871576 875686 878189 879105 876810 870489
58447 870489 862346 855013 848488 841901 836349 833336 832221 831786 832590 835287 838582 841434 845218 851049 857198
58432 857198 862211 868230 877940 890292 902758 915763 931116 947805 963256 977278 990962 1003004
58420 1003004 1010995 1015309 1018037 1019042 1016543 1010679 1003066 993856 982610 971041 961460 953393 944984
58407 944984 936726 930611 926787 924399 924490 928583 935453 942728 950531 960202 970696 979763 987419 994698
58393 994698 1000304 1002318 1002025 1002259 1003033 1002547 1001344 1001543 1003011 1004238 1006040 1010454 1016769 1022506 1027504
58378 1027504 1033313 1039515 1044493 1048868 1054344 1060110 1064222 1067502 1072178 1077774 1082296 1086408 1092413 1100201
58364A100201P993Q793J0867J1107Q519O776P663P723M848K356K814L600K481
58351A185741J940L983O142O559P571J0486J2505J2522J4125J8855K2565K2487
58339A325481K1769K2863K2833J9630J6577J5840J3953Q763M458M416N406M073
58327A486062K890M319N378L628K398M443O620O297O726J0383J3507J3100J2799
58314A578550J5786J8518J7733J7013J9807K2648K1970K1101K3551K5937K4526
58303A807140K2395K3031K3276J9805J6237J6563J7913J6921J6579J9655K2156
58292B021671K0758J9677K2711K5688K4598K3684K7321L1390L1156L0171L2654
58281B311479L4824L2741L0989L4270L8146L7655L7173M1953M7953N0158N2757
$$ plain form
58364 1100201 1108194 1116987 1127854 1138961 1147480 1154256 1161919 1169642 1174490 1176846 1179660 1183260 1185741
58351 1185741 1187681 1191664 1197806 1204365 1211936 1222422 1234927 1247449 1261574 1280429 1302994 1325481
58339 1325481 1347250 1370113 1392946 1412576 1429153 1444993 1458946 1467709 1472167 1476583 1481989 1486062
58327 1486062 1488952 1493271 1498649 1502277 1504675 1509118 1515738 1522035 1528761 1539144 1552651 1565751 1578550
58314 1578550 1594336 1612854 1630587 1647600 1667407 1690055 1712025 1733126 1756677 1782614 1807140
58303 1807140 1829535 1852566 1875842 1895647 1911884 1928447 1946360 1963281 1979860 1999515 2021671
58292 2021671 2042429 2062106 2084817 2110505 2135103 2158787 2186108 2217498 2248654 2278825 2311479
58281 2311479 2346303 2379044 2410033 2444303 2482449 2520104 2557277 2599230 2647183 2697341 2750098
58270B750098O0522O8331P0264P0914P6396Q2345Q2424Q0454Q2199Q3512P8878
58259C586337P3345P3369P4288O9740O4920O7159P2144P3111P4754Q3728R4371
58248D407266R8649J01318J10148J20357J24371J27501J37667J49197J53576J56563
58238E686613J67175J79744J85045J89045K01689K17353K26086K33758K50704
58229G537212K71025K84332K96996L19821L46078L64711L83387M14486M50617
58220A0668665M79372N09223N54006O05405O49345O95509P60294Q35405R05680
58211A6662904R82615J085633J206500J329462J469507J650843J865936K099516
58203B8352916K374039K724535L149853L641394M239149N004769N965967P149332
$$ plain form
58270 2750098 2810620 2878951 2949215 3020129 3096525 3178870 3261294 3341748 3423947 3507459 3586337
58259 3586337 3659682 3733051 3807339 3877079 3941999 4009158 4081302 4154413 4229167 4312895 4407266
58248 4407266 4505915 4607233 4717381 4837738 4962109 5089610 5227277 5376474 5530050 5686613
58238 5686613 5853788 6033532 6218577 6407622 6609311 6826664 7052750 7286508 7537212
58229 7537212 7808237 8092569 8389565 8709386 9055464 9420175 9803562 10218048 10668665
58220 10668665 11148037 11657260 12211266 12816671 13466016 14161525 14921819 15757224 16662904
58211 16662904 17645519 18731152 19937652 21267114 22736621 24387464 26253400 28352916
58203 28352916 30726955 33451490 36601343 40242737 44481886 49486655 55452622 62601954
58195F2601954Q635831J0512703J2811681J5582927J8981605K3168508K8158091
58188A80453300L3810547L9688671M4464829M5518824L9914559K6639141Q111741
58181D18601612j0788585k5482460l3860844l6465243l5297732l2530754k9681750
58174B14494244k7286868k5115111k2771704k0163873j7472521j4882856j2489534
58167G4311777j0370958q592043p136084n929977m933758m141160l514630k992369
58159B6700798k549903k194881j910995j661605j439835j264047j129602j010202
58151A3539728r00795q16775p55384o96593o37775n91675n54432n09364m58331
58142G618604m17547l86291l49901l09599k79940k60188k36614k10428j96164
$$ plain form
58195 62601954 71237785 81750488 94562169 110145096 129126701 152295209 180453300
58188 180453300 214263847 253952518 298417347 343936171 383850730 410489871 418601612
58181 418601612 407813027 382330567 348469723 312004480 276706748 244175994 214494244
58174 214494244 187207376 162092265 139320561 119156688 101684167 86801311 74311777
58167 74311777 63940819 55348776 48212692 42282715 37348957 33207797 29693167 26700798
58159 26700798 24150895 21956014 20045019 18383414 16943579 15679532 14549930 13539728
58151 13539728 12638933 11822158 11066774 10370181 9732406 9140731 8586299 8076935 7618604
58142 7618604 7201057 6814766 6464865 6155266 5875326 5615138 5378524 5168096 4971932
58133D971932j94266j90884j83124j80054j80330j72672j57689j46998j41420
58124C424495j31279j17089j09163j07342j01247r0179q3638q2497p8231p0501
58114B453329o7477o8886o6112n9058n6194n7941n6257n0612m8373m9510m6454
58103A826455l9243l5591l5874l2903k6684k4719k7344k7228k3789k3928k7828
58092A501324k7979k3249k0521k1334j9966j5783j4643j6906j6575j3606j4781
58081A295981k0955k5294k5604k6780k9730k9431k5549k3795k5010k3760j9281
58070A020792j7145j8461j7987j4569j3078j4289j3127q828o760q184q039m903
58058H75422l552n500o383m836m876p407q251o688p106j0138j0906q171o689q280
$$ plain form
58133 4971932 4777666 4586782 4403658 4223604 4043274 3870602 3712913 3565915 3424495
58124 3424495 3293216 3176127 3066964 2959622 2858375 2768196 2684558 2602061 2523830 2453329
58114 2453329 2385852 2316966 2250854 2191796 2135602 2077661 2021404 1970792 1922419 1872909 1826455
58103 1826455 1787212 1751621 1715747 1682844 1656160 1631441 1604097 1576869 1553080 1529152 1501324
58092 1501324 1473345 1450096 1429575 1408241 1388275 1372492 1357849 1340943 1324368 1310762 1295981
58081 1295981 1275026 1249732 1224128 1197348 1167618 1138187 1112638 1088843 1063833 1040073 1020792
58070 1020792 1003647 985186 967199 952630 939552 925263 912136 903308 896548 888364 880325 875422
58058 875422 871870 866370 859987 855151 850275 842868 834617 827929 820823 810685 799779 791608 784919 776639
58044G76639q997p368p116r359j0188q350p496q638q062m958l394m526m450k008
58030F81729j131l199m478l559l885o506p559n539m062m853m930l131k637m381
58016F21879m726k338p94j805k177j43J536J298J523L042L073R87J76J725K188
58001F25444L4j596j000p94k288k730p66R53J009J568L243L245Q82o05Ol00k770
57984F23535m341l489l046m680n992n600n724p247p499n481m029m450m218k365
57970E55374j680l096l410j206L79m88j124K47J180J05m99J005K438K501L376
57955E55102N767O618M729L462M739N643M286L680O007Q310P859P028Q641J1002
57941F42873J1718J2184J4128J5621J4694J3250J3423J3559J1644R196Q064O707
$$ plain form
58044 776639 767642 760274 753158 743799 733611 725261 717765 709127 701065 696107 692713 688187 683737 681729
58030 681729 680598 677399 672921 669362 665477 658971 651412 645873 641811 636958 632028 628897 626260 621879
58016 621879 617153 614815 614021 612216 610039 609896 611432 612730 614253 617295 620368 621355 621531 623256 625444
58001 625444 625478 623882 622882 622088 619800 617070 616304 617257 618266 619834 623077 626322 627204 626599 626605 626305 623535
57984 623535 619194 615705 612659 607979 601987 596387 590663 583416 575917 570436 566407 561957 557739 555374
57970 555374 553694 550598 547188 545982 546361 545873 544749 544996 546176 546281 545782 546787 549225 551726 555102
57955 555102 560869 567487 572216 575678 580417 586060 590346 594026 600033 608343 616202 623230 631871 642873
57941 642873 654591 666775 680903 696524 711218 724468 737891 751450 763094 772290 780354 787061
57929G87061L317o65l611o920j1729j5771j7010j7132j8027j8191j6117j3820
57917F51385j3373j3097j0887q213p135o395m128j604o04J06K130L933L597K454
57903E98169K500K724J525K31P30J969K193K338L890N629N829N456O005O401N123
57888F50712L177J959N42j959l816l587l156m655o781p365p214q061r036q580
57874E92180p709p941q121o658m846m556m643l097q31J89O83K428M559N046M402
57859E61085M548N333N383N102N710O575O363N576N187M297K014n5j62L31q63
57844F16424l045l944l631l827m524m378l511l003k564j349l6M29R73K861N179
57829E92054O334O697P359P755P032O261O692P242O329M687L859L415K301J375
$$ plain form
57929 787061 790378 789713 786102 779182 767453 751682 734672 717540 699513 681322 665205 651385
57917 651385 638012 624915 614028 605815 598680 592285 588157 586553 585949 586055 588185 592118 595715 598169
57903 598169 600669 603393 604918 605149 605879 607848 610041 612379 616269 621898 627727 633183 639188 645589 650712
57888 650712 653889 655848 656390 654431 650615 647028 643872 639217 632436 625071 617857 609796 600760 592180
57874 592180 584471 576530 568409 561751 556905 552349 547706 544609 543778 543967 544650 547078 551637 556683 561085
57859 561085 565633 570966 576349 581451 587161 593736 600099 605675 610862 615159 617173 617118 616956 617287 616424
57844 616424 613379 609435 605804 601977 597453 593075 589564 586561 583997 582648 582612 583041 584014 586875 592054
57829 592054 598388 605085 612444 620199 627231 633492 640184 647426 653755 658442 662301 665716 668017 669392
57815F69392J920L135L710M252N451N687L285l92l004m600o130o573m844k765
57801F68524k699l688l388k255k290l018k573j582k079l453l255j430j29K29J182
57786F38096K930M225N181O873Q496Q195O512N801O400O476N451M533L915K508
57772G15592M82p31r98j423k010j900j660k614m191m642m045l883m078l300j935
57757F78664j808k973l649l245k848k756k169j272j057j177m54P13R86P04J240
57742F58899K182J915O97K04L71k89j415j089O09J471Q43L22M83M7j204j630o25
57725F61791M64R10J519K402K517K020K456L917M557L712K873K859K528J339O43
57710F96507J327K255K306J982J989J968J654J763K722L895M772N569O285O443
$$ plain form
57815 669392 671312 674447 678157 682409 687860 693547 696832 696440 693436 688836 682706 676133 671289 668524
57801 668524 665825 662137 658749 656494 654204 651186 648613 647031 644952 641499 638244 636814 636685 636914 638096
57786 638096 641026 645251 650432 657305 665801 673996 680508 686309 692709 699185 704636 709169 713084 715592
57772 715592 716074 715343 714345 712922 710912 709012 707352 704738 700547 695905 691860 687977 683899 680599 678664
57757 678664 676856 673883 670234 666989 664141 661385 659216 657944 656887 655710 655256 655969 656955 657659 658899
57742 658899 661081 662996 663693 663897 664268 663979 662564 661475 662084 663555 664398 664720 665203 665250 664046 662416 661791
57725 661791 662255 663165 664684 667086 669603 671623 674079 677996 682553 686265 689138 691997 694525 695864 696507
57710 696507 697834 700089 702395 704377 706366 708334 709988 711751 714473 718368 723140 728709 734994 741437
57696G41437O099N711M910L035Q34j02K74M25k65q32o80k55L83J822L845N527
57680G72168O939R021J1652J3798J5607J8490K2911K8146L4233M2165N1943O2491
57668A089564P3594Q5385R5179R7002Q5522N9716K3179j7055n2196p5240q4736
57657A379914q4246p8102o8889n8387m8229l8945l0204k2490j6850j3001r688
57646I10883o944n843n920n227l298j710j206o56M76J089P15O53J745L011L489
57631H91257L687M263M789M779M468L968L059K207K323L130L348K723K261K324
57617I38586K331K430L393M654M696L692L507M590N224M515L746L909M181L817
57603I93271L563M030M567M734N164O016O272N449M437L961L758L714M082M226
$$ plain form
57696 741437 747536 753247 758157 761192 762026 761924 762198 762623 762358 761526 760846 760591 760974 762796 766641 772168
57680 772168 779107 788128 799780 813578 829185 847675 870586 898732 932965 975130 1027073 1089564
57668 1089564 1163158 1248543 1343722 1440724 1526246 1585962 1609141 1592086 1539890 1464650 1379914
57657 1379914 1295668 1217566 1148677 1090290 1042061 1003116 972912 950422 933572 920571 910883
57646 910883 903939 898096 892176 886949 883651 881941 880735 880079 880555 881644 882359 883012 884757 887768 891257
57631 891257 894944 899207 903996 908775 913243 917211 920270 922477 924800 927930 931278 934001 936262 938586
57617 938586 940917 943347 946740 951394 956090 959782 963289 967879 973103 977618 981364 985273 989454 993271
57603 993271 996834 1000864 1005431 1010165 1015329 1021345 1027617 1033066 1037503 1041464 1045222 1048936 1053018 1057244
57589A057244L118J445J094K190K900K642K925M274N043M358L656M006M323L632
57575A102850K884L039L445L600M365N983O942O401N774O316P069O837O309O494
57561A178308O791O430O155O781P534P571P632Q509R256Q689P370O576O434O581
57547A280617P325Q645R358Q814Q208Q760R850J0384J0644J1201J1291J0048Q283
57534A403428P409P433P446P247P159P080O968P380Q434R201R052Q596Q392Q091
57520A513316P787Q592J0646J2132J1740J0662J0643J1402J1673J1459J1536J1712
57508A643300J1344J0791J0786J1114J1130J0900J0636J0054R227R085R964J0825
57496A769156J0968J1151J1910J2247J1435J0561J0779J1310J0881R941R769J0409
$$ plain form
57589 1057244 1060362 1061807 1062901 1065091 1067991 1070633 1073558 1077832 1082875 1087233 1090889 1094895 1099218 1102850
57575 1102850 1105734 1108773 1112218 1115818 1120183 1126166 1133108 1139509 1145283 1151599 1158668 1165505 1171814 1178308
57561 1178308 1185099 1191529 1197684 1204465 1211999 1219570 1227202 1235711 1244967 1253656 1261026 1267602 1274036 1280617
57547 1280617 1287942 1296587 1305945 1314759 1322967 1331727 1341577 1351961 1362605 1373806 1385097 1395145 1403428
57534 1403428 1410837 1418270 1425716 1432963 1440122 1447202 1454170 1461550 1469984 1479185 1488237 1496833 1505225 1513316
57520 1513316 1521103 1529695 1540341 1552473 1564213 1574875 1585518 1596920 1608593 1620052 1631588 1643300
57508 1643300 1654644 1665435 1676221 1687335 1698465 1709365 1720001 1730055 1739282 1748367 1758331 1769156
57496 1769156 1780124 1791275 1803185 1815432 1826867 1837428 1848207 1859517 1870398 1880339 1890108 1900517
57484A900517J1080J1643J2205J2306J1809J1602J2125J2423J1955J1859J3000
57473B032524J4316J4707J4967J6030J6831J6067J4679J4388J4890J4800J4319
57462B198518J4609J5399J5464J4903J4782J5075J4966J4700J5066J5688J5682
57451B364852J5503J6182J7242J7364J6657J6368J6784J7230J7633J8335J8789
57440B552939J8354J7838J8459J9737K0261J9957J9762J9648J9018J8545J9413
57429B763931K1021K1578K0812K0109K0148K0371K0621K1295K1952K1717K1030
57418B994585K1128K1854K1921K1289K1212K1910K2266K2015K2192K3029K3357
57407C236758K2697K2158K2598K3380K3608K3355K3106K3082K3544K4688K5992
$$ plain form
57484 1900517 1911597 1923240 1935445 1947751 1959560 1971162 1983287 1995710 2007665 2019524 2032524
57473 2032524 2046840 2061547 2076514 2092544 2109375 2125442 2140121 2154509 2169399 2184199 2198518
57462 2198518 2213127 2228526 2243990 2258893 2273675 2288750 2303716 2318416 2333482 2349170 2364852
57451 2364852 2380355 2396537 2413779 2431143 2447800 2464168 2480952 2498182 2515815 2534150 2552939
57440 2552939 2571293 2589131 2607590 2627327 2647588 2667545 2687307 2706955 2725973 2744518 2763931
57429 2763931 2784952 2806530 2827342 2847451 2867599 2887970 2908591 2929886 2951838 2973555 2994585
57418 2994585 3015713 3037567 3059488 3080777 3101989 3123899 3146165 3168180 3190372 3213401 3236758
57407 3236758 3259455 3281613 3304211 3327591 3351199 3374554 3397660 3420742 3444286 3468974 3494966
57396C494966K6573K6396K6209K6356K6572K6788K7076K7126K6806K6872K7909
57385C789649K9058K9176K8771K9260L0697L1849L2275L2594L2878L2572L2011
57374D130790L2279L3408L4198L4024L3428L2861L2209L1580L1248L0809K9752
57363D486586K8628K8327K8421K7768K6499K5787K5819K5698K5316K5558K6615
57352D781022K7777K8872L0293L1642L2076L1996L2610L3792L4253L3817L3652
57341E131802L4074L4184L3883L4193L5162L5541L5076L5177L6477L7693L7745
57330E521007L7313L7345L7586L7548L7562L7917L8153L7967L7710L7493L6941
57319E934542L6313L6527L7561L8207L7979L7855L8508L9207L9201L8907L8961
$$ plain form
57396 3494966 3521539 3547935 3574144 3600500 3627072 3653860 3680936 3708062 3734868 3761740 3789649
57385 3789649 3818707 3847883 3876654 3905914 3936611 3968460 4000735 4033329 4066207 4098779 4130790
57374 4130790 4163069 4196477 4230675 4264699 4298127 4330988 4363197 4394777 4426025 4456834 4486586
57363 4486586 4515214 4543541 4571962 4599730 4626229 4652016 4677835 4703533 4728849 4754407 4781022
57352 4781022 4808799 4837671 4867964 4899606 4931682 4963678 4996288 5030080 5064333 5098150 5131802
57341 5131802 5165876 5200060 5233943 5268136 5303298 5338839 5373915 5409092 5445569 5483262 5521007
57330 5521007 5558320 5595665 5633251 5670799 5708361 5746278 5784431 5822398 5860108 5897601 5934542
57319 5934542 5970855 6007382 6044943 6083150 6121129 6158984 6197492 6236699 6275900 6314807 6353768
57308F353768L9265L9644M0361M1245M1478M0837M0155M0037M0216M0537M1347
57297F798890M2424M2766M2119M1518M1726M2225M2344M2297M2500M2868M3303
57286G264980M3955M4627M4814M4590M4450M4200M3302M2265M2248M3029M3044
57275G745504M1856M0855M0988M1403M1054M0131L9126L8020L7165L7461L8824
57264H182387L9818L9605L8939L8552L8023L7078L6396L6200L5530L4017L2879
57253H589424L2945L3117L2093L0462K9664K9782K9803K9339K8898K8945K9590
57242H924062L0659L1432L1075K9881K9148K9312K9335K8528K7588K7011K5866
57231I243897K3348K0331J8148J6674J4830J2171Q944N346J699j351l744o297
$$ plain form
57308 6353768 6393033 6432677 6473038 6514283 6555761 6596598 6636753 6676790 6717006 6757543 6798890
57297 6798890 6841314 6884080 6926199 6967717 7009443 7051668 7094012 7136309 7178809 7221677 7264980
57286 7264980 7308935 7353562 7398376 7442966 7487416 7531616 7574918 7617183 7659431 7702460 7745504
57275 7745504 7787360 7828215 7869203 7910606 7951660 7991791 8030917 8068937 8106102 8143563 8182387
57264 8182387 8222205 8261810 8300749 8339301 8377324 8414402 8450798 8486998 8522528 8556545 8589424
57253 8589424 8622369 8655486 8687579 8718041 8747705 8777487 8807290 8836629 8865527 8894472 8924062
57242 8924062 8954721 8986153 9017228 9047109 9076257 9105569 9134904 9163432 9191020 9218031 9243897
57231 9243897 9267245 9287576 9305724 9322398 9337228 9349399 9358343 9363689 9365388 9364037 9360293 9353996
57219I353996r347j1989j3465j4384j5590j6792j7230j6892j6152j5055j3743
57208I193357j2732j1917j0284p435m437k274n53J298K731L069K741K355J558
57195I157477l0j796l225n108q261j1988j5158j7989k1330k4913k7812l0097l2537
57182H957233l5157l7441l9577m2116m4672m6137m6149m5329m4321m3432m2801
57171H490101m2048m0258l7253l4366l2881l2144l0382k6997k3060j9727j7246
57160H153739j5389j3960j2832j2147j2340j3582j5433j7509k0034k3369k7576
57149G969568l2684l8590m4258m8028m9366m9544n0033n1116n2599n4508n6224
57138G442618n6079n3096m8246m3102l8153l3501k9988k8328k7927k7840k8242
$$ plain form
57219 9353996 9344649 9332660 9319195 9304811 9289221 9272429 9255199 9238307 9222155 9207100 9193357
57208 9193357 9180625 9168708 9158424 9150989 9146552 9144278 9143725 9145023 9147754 9150823 9153564 9155919 9157477
57195 9157477 9157447 9155651 9152426 9147318 9139057 9127069 9111911 9093922 9072592 9047679 9019867 8989770 8957233
57182 8957233 8922076 8884635 8845058 8802942 8758270 8712133 8665984 8620655 8576334 8532902 8490101
57171 8490101 8448053 8407795 8370542 8336176 8303295 8271151 8240769 8213772 8190712 8170985 8153739
57160 8153739 8138350 8124390 8111558 8099411 8087071 8073489 8058056 8040547 8020513 7997144 7969568
57149 7969568 7936884 7898294 7854036 7806008 7756642 7707098 7657065 7605949 7553350 7498842 7442618
57138 7442618 7386539 7333443 7285197 7242095 7203942 7170441 7140453 7112125 7084198 7056358 7028116
57127G028116k9728l1906l3749l4705l4454l2375k8352k3268j7641j0735k138
57116F749065O916J5224K3617L3700M5476N7971P1584Q8109J08718J33391J62148
57105G495919J95582K34596K80768L36695M05119M88435N90087P15565Q70882
57096A1613648J061025J290943J566494J892077K267319K686716L140844L615893
57088B9134959M092944M549324M960042N297590N533668N643471N603619N379583
57080G0195200M918506M168443L118512J826420M07753j003965k296741l399142
57072G7934986m278777m930140n361641n588104n629272n510253n260583m912473
57064C6463743m499186m052559l599493l159821k746933k369404k031859j735593
$$ plain form
57127 7028116 6998388 6966482 6932733 6898028 6863574 6831199 6802847 6779579 6761938 6751203 6749065
57116 6749065 6755981 6771205 6794822 6828522 6873998 6931969 7003553 7091662 7200380 7333771 7495919
57105 7495919 7691501 7926097 8206865 8543560 8948679 9437114 10027201 10742766 11613648
57096 11613648 12674673 13965616 15532110 17424187 19691506 22378222 25519066 29134959
57088 29134959 33227903 37777227 42737269 48034859 53568527 59211998 64815617 70195200
57080 70195200 75113706 79282149 82400661 84227081 84634834 83630869 81334128 77934986
57072 77934986 73656209 68726069 63364428 57776324 52147052 46636799 41376216 36463743
57064 36463743 31964557 27911998 24312505 21152684 18405751 16036347 14004488 12268895
57056A2268895j479625j261410j076996r21650p91004o81449n89669n12530m47467
57047D507095l92372l45219l04453k69417k39653k14050j91426j71519j54366
57038B224620j39215j25050j11823j00000q9253p8815o8665n9027m9196l8213
57028A365363k6283j3987o20J5158L3559N4140P6656R8165J09425R8337N9858
57017A869771J811n9757j10043j41169j52559j48821j36525j20819j04297q8425
57007H09167p4593o3327n3966m6003l9692l4842l0414k5949k2244j9823j7965
56996C80349j5945j4144j2996j1994j0632r322q395p022m150P9M648Q912J2859
56983C12247J6418J8929J9031J5218P330k388j0666j5851j8391j8983j7679j5004
$$ plain form
57056 12268895 10789270 9527860 8450864 7529214 6738210 6056761 5467092 4954562 4507095
57047 4507095 4114723 3769504 3465051 3195634 2955981 2741931 2550505 2378986 2224620
57038 2224620 2085405 1960355 1848532 1748532 1659279 1580464 1511799 1452772 1403576 1365363
57028 1365363 1339080 1325093 1324473 1339631 1373190 1427330 1503986 1602151 1711576 1809913 1869771
57017 1869771 1871582 1811825 1701782 1560613 1408054 1259233 1122708 1001889 897592 809167
57007 809167 734574 671247 617281 571278 531586 496744 466330 440381 418137 398314 380349
56996 380349 364404 350260 337264 325270 314638 305316 296921 289899 285749 285828 290476 299388 312247
56983 312247 328665 347594 366625 381843 389173 386785 376119 360268 341877 322894 305215 290211
56971B90211j2344j0468q772o577m127j816M43K602M349O066Q759J2554J6483
56958B97363K0151K4135K7820K8375K3118J2280j278j4192k3843k8881k9784k8352
56946C06912k5874k2387j8018j3818j0521p515m004k36L224O588J0310J4281J8440
56933B57382K3420K9633L6124M0831M1384L5532K2279L662j5460l0494l9665m3363
56921C61265m2416l8040l2409k7674k4396k1675j8526j4769j1030q344p173o608
56909A08205n276l245j951k001k270j684n96K87J079J910K178J631J151J546K441
56894A03405L282M429O310Q484J0625J3448J7582K2218K5954K8107K8214K5182
56882B97240J8310Q708j308r881j5982j8963j8835j6616j3530j0185o899m040
$$ plain form
56971 290211 277867 267399 258627 252050 247923 246107 246550 249152 253501 259567 268326 280880 297363
56958 297363 317514 341649 369469 397844 420962 433242 431964 417772 393929 365048 335264 306912
56946 306912 281038 258651 240633 226815 216294 208779 204775 204539 207763 214351 224661 238942 257382
56933 257382 280802 310435 346559 387390 428774 464306 486585 490247 474787 444293 404628 361265
56921 361265 318849 280809 248400 220726 196330 174655 156129 141360 130330 121986 114813 108205
56909 108205 102929 99684 97733 95732 93462 91778 91182 91469 92548 94458 96636 98267 99418 100964 103405
56894 103405 106687 111116 117426 125910 136535 149983 167565 189783 215737 243844 272058 297240
56882 297240 315550 324258 322950 313069 297087 278124 259289 242673 229143 218958 212059 208019
56870B08019j462J596N419R482J3681J8761K4909L1248L7543M4957N3786O1466
56858E09405O3982N8534M4297K2406l244k6561m2653n0547n1924m8533m1992l4483
56846C98687k7476k0490j2693m817K093Q763J6652K5638L4726M4307N5708O8986
56834E90084Q2810R5478J03568J00545Q0289M3442j347m3019p3896r1010r5154
56823G91790r0092q0684o9995n8510m6374l4881k5130j6574q058O14Q970J7113
56811C88189K5815L5663M6642N8226O9185P6960P7355O5825M0811O701k7425n3409
56799H10538o8561p4695p4227o8619n9604m9525m0057l1674k4459j8366j2784
56788B87967o972j016M523R729J5185K0937K6636L2172L6879L8340L3580K1789
$$ plain form
56870 208019 206557 208153 213572 223054 236735 255496 280405 311653 349196 394153 447939 509405
56858 509405 573387 631921 676218 698624 695380 668819 626166 575619 523695 475162 433170 398687
56846 398687 371211 350721 338028 333211 335304 344067 360719 386357 421083 465390 521098 590084
56834 590084 672894 768372 871940 972485 1052774 1096216 1094869 1051850 977954 886944 791790
56823 791790 701698 621014 551019 492509 446135 411254 386124 369550 361492 362106 371076 388189
56811 388189 414004 449667 496309 554535 623720 700680 778035 843860 884671 891372 863947 810538
56799 810538 741977 667282 593055 524436 464832 415307 375250 343576 319117 300751 287967
56788 287967 280995 279979 284502 294231 309416 330353 356989 389161 426040 464380 497960 519749
56776E19749N122j2947k8990m0048m4652m3944m0650l6594l2064k7306k3124j9808
56764A74744j6786j3718j0941q614o487m682l694l416l197k980l294l964m016
56751H8955l203k477k536k808k375j177J25Q93Q60K65k21j20K94M74L39J8o17
56734G6689j457j736j094m26o19j013m78O19J035Q56J239K166K317J424Q31J313
56718H1666J958J889J534J458J300O86J26J21L68M77O82J201J680J776J597J177
56702I9696K95q32j473j350r73p15l71J06K66p7m37m01j22J16K40J33k74o07l65
56683I2855K91O79N20J02k87m41o4P38J129O05m3J68Q32Q86L53N7m8n93j222r17
56663I5600K04J062J449J977K340J609L53L59J872L145L201L005L253L055J876
$$ plain form
56776 519749 524871 511924 482934 442886 398234 354290 313640 277046 244982 217676 194552 174744
56764 174744 157958 144240 133299 124685 118198 113516 109822 106406 103209 100229 96935 92971 88955
56751 88955 85752 83275 80739 77931 75556 74379 74504 75397 76257 76522 76301 76181 76475 76949 77288 77306 76689
56734 76689 75232 73496 72402 71976 71357 70344 69866 70485 71520 72376 73615 75781 78098 79522 80353 81666
56718 81666 83624 85513 87047 88505 89805 90491 90617 90738 91106 91583 92265 93466 95146 96922 98519 99696
56702 99696 99991 99159 97686 96336 95363 94648 94277 94383 94649 94572 94135 93734 93612 93728 93968 94101 93827 93220 92855
56683 92855 93146 93825 94345 94447 94160 93719 93655 94393 95522 96127 96084 96252 97084 97970 98323 98380 98332 97739 96517 95600
56663 95600 95804 96866 98315 100292 102632 104241 104594 104953 106825 109970 113171 116176 119429 122484 124360
56648A24360Q59J053J870K421K898L544L681K956K205J973J414q8j528j788j402
56633A44428j483j889j856j599j910k684l155l140k980k669k019j351j136j290
56619A15267j432j553j807k042k028j764j200k14Q76J371J113O72M25J35k97n54
56603A06968n73o23n37J39J050J267Q13P25J208J155K2j162j378r18m09K74J195
56586A09216J629J057N4n59n95o0J102K308K498J672J155J674K396K498K398K602
56570A31045K642K090J522J492J699J991K979M724O071O360O555P586Q701Q704
56556A94161P820O999O330N379M391L857L527K936K275J758Q45q36k433k787j937
56541B32285r47p29j618l375n073n683n368n288n779n880n147m542m675m641l623
$$ plain form
56648 124360 125219 126272 128142 130563 133461 137005 140686 143642 145847 147820 149234 149146 147618 145830 144428
56633 144428 142945 141056 139200 137601 135691 133007 129852 126712 123732 121063 119044 117693 116557 115267
56619 115267 113835 112282 110475 108433 106405 104641 103441 103227 104103 105474 106587 107259 107684 107819 107522 106968
56603 106968 106395 105772 105235 105374 106424 107691 108504 109229 110437 111592 111614 110452 109074 108156 107747 108021 109216
56586 109216 110845 111902 111956 111397 110802 110742 111844 114152 116650 118322 119477 121151 123547 126045 128443 131045
56570 131045 133687 135777 137299 138791 140490 142481 145460 150184 156255 162615 169170 176756 185457 194161
56556 194161 201981 208980 215310 220689 225080 228937 232464 235400 237675 239433 240278 239442 237009 234222 232285
56541 232285 231338 230609 228991 225616 220543 214860 209492 204204 198425 192545 187398 182856 178181 173540 169917
56526A69917k333j713j414q17m02q37j572j692j322j082r59p21o63r71j179j090
56510A51150j292j988k426k289k356k926k960j855o49l08k14L98R24O99M11P70
56494A35089J065N75J44P17J579J650J385J649J912J293L07q7k08o57p35L16J508
56477A47502J477P12N86R43O73j43n95p93j408j955j415j35O51P77R67J211R36
56460A49991L33j4k56o64o35K48R95N84k73l56N9J33L32J464K705K647J560P26
56442A59579K79l61p46j15Q25R09N45P50J018L07o73m69M89P39N26J214K415K387
56424A69618J117M26R88J586J445J104Q69M48J75O61J300R69j2m73n28j079j676
56407A76938j135R6M58o5j68K64K44pO83J964K301J663J429J747J546J097J779
$$ plain form
56526 169917 167584 165871 164457 163640 163238 162401 160829 159137 157815 156733 155774 155053 154390 153419 152240 151150
56510 151150 149858 147870 145444 143155 140799 137873 134913 133058 132409 132101 131887 132285 133209 133908 134319 135089
56494 135089 136154 136729 136873 137590 139169 140819 142204 143853 145765 147058 147365 147278 147070 146413 145678 145994 147502
56477 147502 148979 149691 150277 151220 151893 151750 151155 150362 148954 146999 145584 145449 146100 146877 147844 149055 149991
56460 149991 150324 150310 150054 149390 148755 149003 149998 150582 150309 149953 150012 150145 150477 151941 154646 157293 158853 159579
56442 159579 159858 159497 158751 158636 159461 160370 160915 161665 162683 162990 162317 161848 162337 163076 163602 164816 167231 169618
56424 169618 170735 171161 172149 173735 175180 176284 177153 177601 177776 178437 179737 180706 180694 180221 179693 178614 176938
56407 176938 175803 175899 176357 176292 176124 176388 176632 176625 177308 179272 181573 183236 184665 186412 187958 189055 190834
56390A90834L168L229J702O35J034J650J601J625J987J701N75k20k97n33q92j53
56374B07646J537K195R44p61j584j815j776r47M47J093P30O32J237J323L65m11
56358B10855j79K61K75N10J247J513P72p7k24L2L51Q77J212N46p17j074j25R13
56340B16968J183J006O01j72p09k21N99L89l72K5J541K407K195K251K814K578
56324B33083J487J214K151K698K219K002K516K432J308N22O44N12j29K04J791
56309B54654K765K271J900K644L111K194J075J010J448J720K308L154L005J844
56295B85103J555K857L896L276K127J732J540J014J121K259L002K551K253L157
56281C17443M147M070L661L801L924L605L679M395M583L964M055N416O325N703
$$ plain form
56390 190834 194002 197231 198933 199568 200602 202252 203853 205478 207465 209166 209741 209521 209224 208691 207799 207646
56374 207646 209183 211378 212322 211561 209977 208162 206386 205439 205886 206979 207709 208341 209578 210901 211266 210855
56358 210855 210676 210937 211212 211722 212969 214482 215254 215177 214953 214985 215336 216213 217425 217971 217254 216180 216055 216968
56340 216968 218151 219157 219758 219586 218877 218656 219255 219644 219272 219297 220838 223245 225440 227691 230505 233083
56324 233083 234570 235784 237935 240633 242852 244854 247370 249802 251110 251632 252276 252788 252659 252863 254654
56309 254654 257419 259690 261590 264234 267345 269539 270614 271624 273072 274792 277100 280254 283259 285103
56295 285103 286658 289515 293411 296687 298814 300546 302086 303100 304221 306480 309482 312033 314286 317443
56281 317443 321590 325660 329321 333122 337046 340651 344330 348725 353308 357272 361327 366743 373068 378771
56267C78771N067N991P830R473J1084J2700J3402J3385J4440J6966J8941J9383
56255E27433K0176K2746K5668K7472K9161L1846L4352L5414L5930L6854L7053
56244H64105L5393L2840L0516K7730K3775J9429J4910Q782R04o126j0532j3905
56232A027821j8109k2179k4630k6301k8363k9821k9562k8718k8587k8205k6408
56221G36938k4222k2937k1883k0248j8889j8224j6784j4030j2026j1948j1645
56210E44102r243o446n472n411m653m261n608p067o486m873m299m054k286K51
56196D74194J423J186R40Q18M44P45K321L650L425K869L308L604K572J658K317
56181E05474L093K325J455K478M269M722M473N175O102N789N199N913P029P044
$$ plain form
56267 378771 383838 389829 397659 407132 418216 430916 444318 457703 472143 489109 508050 527433
56255 527433 547609 570355 596023 623495 652656 684502 718854 754268 790198 827052 864105
56244 864105 899498 932338 962854 990584 1014359 1033788 1048698 1057480 1058384 1052258 1041726 1027821
56232 1027821 1009712 987533 962903 936602 908239 878418 848856 820138 791551 763346 736938
56221 736938 712716 689779 667896 647648 628759 610535 593751 579721 567695 555747 544102
56210 544102 534859 528413 522941 517530 512877 508616 503008 495941 489455 484582 480283 476229 473943 474194
56196 474194 475617 476803 477743 478561 479005 479750 482071 485721 489146 492015 495323 498927 501499 503157 505474
56181 505474 508567 510892 512347 514825 519094 523816 528289 533464 539566 545355 550554 556467 563496 570540
56167E70540O905Q041R321R202Q926J0280J2209J2890J3149J4571J6295J7004
56155G09333J7944K0564K3428K4834K6248K9594L3570L6352L9604M5898N4481
56144A061850O3517P4179Q8362J04559J20092J35074J49740J60018J60557J50640
56134B268588J33398J11473Q7760O7885N6592N2678N1394M9990M7030L9195K4289
56123B990272N929r641k0227k7392l2071l5443m1959n6054p6755r9573j21726
56112B475360j41211j53489j54811j47270j35755j21731j04682q7118p2511o0233
56102A296549m7856l6551k8942k3720j7866j2188r185p671n011k318j775j436
56090A102030J364M165L375J255K208M906N293M694P134J0970J1385R407J0158
$$ plain form
56167 570540 577445 585486 594807 604009 612935 623215 635424 648314 661463 676034 692329 709333
56155 709333 727277 747841 771269 796103 822351 851945 885515 921867 961471 1007369 1061850
56144 1061850 1125367 1199546 1287908 1392467 1512559 1647633 1797373 1957391 2117948 2268588
56134 2268588 2401986 2513459 2601219 2669104 2725696 2778374 2829768 2879758 2926788 2965983 2990272
56123 2990272 2996201 2986560 2966333 2938941 2906870 2871427 2829468 2773414 2696659 2597086 2475360
56112 2475360 2334149 2180660 2025849 1878579 1742824 1621093 1516411 1429293 1356782 1296549
56102 1296549 1248693 1212142 1183200 1159480 1141614 1129426 1120241 1112570 1107559 1105241 1103466 1102030
56090 1102030 1103394 1107559 1110934 1112189 1114397 1119303 1124596 1129290 1136424 1147394 1158779 1168186 1178344
56077A178344J3561J5064J4458J5625J8381J8859J7514J8516K1523K2048J9793
56066A373686J8709J9088J7513J4319J3271J4095J3173J1206J2209J5447J6449
56055A539165J5460J6619J9473J9883J8639K0337K4199K5173K3575K4434K7598
56044A774555K8165K6430K7549L1222L1784K8866K7928K9742K9512K7097K7873
56033B090723L2596L6434L8800M4045N1753N6599N8362O1796O6354O6804O4142
56022B668408O4700O8284O8877O7035O9231P4755P6279P3938P5504Q1777Q5572
56011C474360Q6176R0582R8952J03604J04135J08671J18134J24510J26859J33290
56001D569273J44610J52195J54867J61349J73012J81008J83777J90167K01975
$$ plain form
56077 1178344 1191905 1206969 1221427 1237052 1255433 1274292 1291806 1310322 1331845 1353893 1373686
56066 1373686 1392395 1411483 1428996 1443315 1456586 1470681 1483854 1495060 1507269 1522716 1539165
56055 1539165 1554625 1571244 1590717 1610600 1629239 1649576 1673775 1698948 1722523 1746957 1774555
56044 1774555 1802720 1829150 1856699 1887921 1919705 1948571 1976499 2006241 2035753 2062850 2090723
56033 2090723 2123319 2159753 2198553 2242598 2294351 2350950 2409312 2471108 2537462 2604266 2668408
56022 2668408 2733108 2801392 2870269 2937304 3006535 3081290 3157569 3231507 3307011 3388788 3474360
56011 3474360 3560536 3651118 3750070 3853674 3957809 4066480 4184614 4309124 4435983 4569273
56001 4569273 4713883 4866078 5020945 5182294 5355306 5536314 5720091 5910258 6112233
55992F112233K11067K16969K28847K46885K60948K70911K88028L12850L33445
55983H482183L49145L73129M07202M38307M64862N01035N49296N95566O37931
55974A2798656O92011P61065Q30529Q99712R87361J097728J214831J339204J494253
55965B2115350J686885J901330K142776K444949K823673L270921L808606M497451
55957D4691941N379852O472325P827191R532866J1641003J4180892J7265842K1079467
55949A38071379K5721444L1144130L7109128M2742203M5872639M3325763L2845745
55942C96832431J5304796n104826k3195863l5563118m1563324m2398171l9803314
55935B24508611l5364021l0309859k5413998k1018749j7231753j4087231j1549840
$$ plain form
55992 6112233 6323300 6540269 6769116 7016001 7276949 7547860 7835888 8148738 8482183
55983 8482183 8831328 9204457 9611659 10049966 10514828 11015863 11565159 12160725 12798656
55974 12798656 13490667 14251732 15082261 15981973 16969334 18067062 19281893 20621097 22115350
55965 22115350 23802235 25703565 27846341 30291290 33114963 36385884 40194490 44691941
55957 44691941 50071793 56544118 64371309 73904175 85545178 99726070 116991912 138071379
55949 138071379 163792823 194936953 232046081 274788284 320660923 363986686 396832431
55942 396832431 412137227 407032401 383836538 348273420 306710096 264311925 224508611
55935 224508611 189144590 158834731 133420733 112401984 95170231 81083000 69533160
55928F9533160r505757p842565o503790n442943m585877l873100l290233k826278
55920B5662617k443439k112447j837090j619348j435388j267025j123232j010188
55912A2814460r10776q12514p26869o62519o06164n46899m94593m57470m24664
55903G171992l86801l52326l28493l06518k79626k56464k43182k30583k11779
55894D576220j94993j86525j78138j63288j49499j42822j35738j22042j08704
55885C194471j01595r3824p9404o4825n6086m7331l3186k0267j6255j8956k5434
55874B637308l9828o2328q1918r0136r1945r4164r3858q7217p9289p5165p0883
55863A770577o2222n3562m9498m6324m0152l4892l4096l3388k8913k5119k6297
$$ plain form
55928 69533160 60027403 52184838 45681048 40238105 35652228 31779128 28488895 25662617
55920 25662617 23219178 21106731 19269641 17650293 16214905 14947880 13824648 12814460
55912 12814460 11903684 11091170 10364301 9701782 9095618 8548719 8054126 7596656 7171992
55903 7171992 6785191 6432865 6104372 5797854 5518228 5261764 5018582 4787999 4576220
55894 4576220 4381227 4194702 4016564 3853276 3703777 3560955 3425217 3303175 3194471
55885 3194471 3092876 2999052 2919648 2854823 2798737 2751406 2718220 2697953 2681698 2662742 2637308
55874 2637308 2597480 2535152 2453234 2363098 2271153 2176989 2083131 1995914 1916625 1841460 1770577
55863 1770577 1708355 1654793 1605295 1558971 1518819 1483927 1449831 1416443 1387530 1362411 1336114
55852A336114k8484k7297k5973k8097l0157k8771k7672l0150l2010k9352k6047
55841A022104k6165k6276k2584j8676j8713j9592j7285j4527j4983j5936j3966
55830H13401j1891j2976j4062j1413p880p420p923o141m414n860q045p814p416
55817G00146r516j1205r267o389n991n812k826M37P94O81L218N692M441J758J557
55802F67718K324P04j947k818l566o887j0889j2655j3702j6195j7623j5083j1071
55789E58310r180p737l740M69O66k256m625o340r176j1626j1153r077p986o917
55775D69632m033j270j226k336k049j806l882o442o801o542q263j0255r755q370
55761C96602q927r828q059n103m191m320k607k98p18l260m835n409o881q327p656
$$ plain form
55852 1336114 1307630 1280333 1254360 1226263 1196106 1167335 1139663 1109513 1077503 1048151 1022104
55841 1022104 995939 969663 947079 928403 909690 890098 872813 858286 843303 827367 813401
55830 813401 801510 788534 774472 763059 755179 747759 739836 733695 729281 723421 715376 707562 700146
55817 700146 690630 679425 670158 663769 657778 651966 649140 649577 650371 651052 654270 659962 664403 666161 667718
55802 667718 670042 670746 668799 665981 662415 655528 644639 631984 618282 602087 584464 569381 558310
55789 558310 549130 541393 537653 538122 538788 536532 531907 525567 516391 504765 493612 484535 476549 469632
55775 469632 465599 464329 463103 460767 458718 456912 453030 446588 439787 433245 424982 414727 404972 396602
55761 396602 387675 377847 369788 364685 360494 356174 353567 353269 352551 349291 344456 339047 332166 323839 316183
55746C16183o131o244o781n081k422k059l484l677k558k329k753j940n40n45j156
55731B68483k34J428J587Q10J053J540L00j765k492k549l683m724l646j812j819
55716B52477k788k216p22n13r20j7J097L12r76j45J603J377Q5N91J993J158j270
55699B51126j882p05q63k577k935j518j019k041k193p21M11N04R66J898J737O11
55683B40799L43J058J198P75J126J887J709J332K281L257J731j396k824j947j030
55668B50299q19p8R64Q18K17J271L405M022K937K202J879J65k490l636l186l434
55652B54536m710n050m354m713o351p158o615o391o792o422n447n485o039m974
55638A74035k701j908k840k883j268j92n89p93j22m4r09j109k94l6n90m21M92
$$ plain form
55746 316183 310052 303808 297027 291946 289524 287465 283981 280304 277746 275417 272664 270724 270184 269639 268483
55731 268483 268249 269677 271264 272074 273127 274667 274967 273202 270710 268161 264478 259754 256108 254296 252477
55716 252477 249689 247473 246751 246238 245318 245301 246398 246710 245734 245589 247192 248569 248654 249245 251238 252396 251126
55699 251126 249244 248539 247676 245099 242164 240646 239627 237586 235393 234672 235083 235587 236553 238451 240188 240799
55683 240799 241142 242200 243398 244173 245299 247186 248895 250227 252508 255765 257496 256100 253276 251329 250299
55668 250299 249480 249402 250366 251184 251401 252672 256077 260099 263036 265238 267117 267282 264792 261156 257970 254536
55652 254536 249826 244776 240422 235709 229358 222200 215585 209194 202402 195980 190533 185048 179009 174035
55638 174035 171334 169426 166586 163703 162435 162243 161654 160861 160739 160695 159786 158677 158383 158347 157757 157336 157828
55621A57828L61q44j069J9M38k89l62N28M17j102j859j017m70j241j857j405r64
55604A47112r09m0J523J738J36j180j101r67j468j272j4M97n53j452r31K2N35
55587A41676J268K295K280R95J59O39J195J016J019J738K371K739L735N171N715
55572A74011N513O154P609Q154P745Q155R120P950M056L42j288k408m496o265
55558B24352o442o232o946p675p228o147n209m176l292l649m818m619k550q17
55544A54552p40q63j6O04N2m33J02N23K3j89N87Q14n61k020k037j533j838k402
55526A44625k404k548l349l633k651j706j904k175j325k13m8l41k83m66j461k308
55510A17810k082j403j019n22J94J63p03q33L77J275P11m4J97M13m29j196o93
$$ plain form
55621 157828 158189 157345 156276 156295 156733 156444 156082 156610 157027 155925 154066 153049 152579 151338 149481 148076 147112
55604 147112 146203 146163 147686 149424 149560 148380 147279 146312 144844 143572 143558 144055 143502 142050 141119 141141 141676
55587 141676 142944 145239 147519 148514 148673 149312 150507 151523 152542 154280 156651 159390 163125 168296 174011
55572 174011 179524 185678 193287 201441 209186 217341 226461 234411 238467 238809 237521 235113 230617 224352
55558 224352 217910 211678 204732 197057 189829 183682 178473 174297 171005 167356 162538 157919 155369 154552
55544 154552 153812 152949 152933 153537 153589 153156 153258 153781 153804 153615 154202 155016 154455 152435 150398 148865 147027 144625
55526 144625 142221 139673 136324 132691 130040 128334 126430 124255 122930 122717 122669 122328 122045 121579 120118 117810
55510 117810 115728 114325 113306 112784 112978 113141 112438 111605 111982 113257 113968 113924 114121 114534 114105 112909 112216
55493A12216K0m53j365j343p71o21m36M76J287R88K29J7o8o54r98m10J62k71q69
55474A07136m69L88O26O08J181J910J918J416R40K51o89r48j67N14K77m2K67M17
55456A15534j09k69N18R28O7o73K6R97O53k14n1N97K18q46j065l16L26N78P85
55437A17684O00k81r84p06k29m61o79P3R52O88j31j09N49P05N16R48J756J940
55419A22831J647J801K340K509K380K510K638K171J378P87J48q07j416j309j484
55404A38124k737m026l944k845j957j498j157j348k203k484j300J19K11m35k75
55389A12245M99N82j0j90J70L90N75J149J463P17l24m57j37o46j750k185j873
55372A10218j681j490n29P32J015K77m41q42j242j109L75K454L407K893K005J349
$$ plain form
55493 112216 112236 111783 110418 109075 108304 107683 107247 107723 109010 109998 110227 110244 110176 109522 108524 108114 108276 108005 107136
55474 107136 106667 107055 107681 108289 109470 111380 113298 114714 115654 115905 115216 114268 114101 114615 114892 114850 115117 115534
55456 115534 115425 115156 115674 116602 116669 115996 116022 117019 117672 117458 117407 118004 118222 117376 116311 115995 116321 116899 117684
55437 117684 118284 118003 117019 116313 116084 115623 114944 115017 115969 116657 116526 116417 116966 117671 118187 119135 120891 122831
55419 122831 124478 126279 128619 131128 133508 136018 138656 140827 142205 142992 143140 142333 140917 139608 138124
55404 138124 135387 131361 127417 124572 122615 121117 119960 118612 116409 113925 112625 112744 112955 112520 112245
55389 112245 112744 113326 113316 113126 113296 113686 114261 115410 116873 117590 117266 116809 116672 116026 114276 112091 110218
55372 110218 108537 107047 106518 107250 108265 108542 108101 107259 106017 104908 105283 107737 111144 114037 116042 117391
55356A17391O69J21J52L17j12o78n04j29p41j945k161j185l48k10M3O88Q52J98
55338A12418l90k87qj60n99r06q88m76J53M55K38R2M05N18j44q98q60m45n04p61
55318A06953m63J18L03M04R69J360P45p6K60J324J439K98q04j204j496j951k029
55301A06150j580j063n32K99J104J293J102J147J185O48p6k73k74p57j223q42
55285A06308j76l15p84k62J074J865J879J945J872O25j396k426j894r61l45M13
55269A07422J328J593J223J201J560J186q8r71q16m93o25o46j95J37J17L82J007
55252A13322J018Oj036j213q09l93J2L48K81n4q6N8l12j003r51k5N70J80l49k00
55232A09364K52L95M15O03O82L67j03m69p51q00m01R8P5l50m89j78K07O82J403
$$ plain form
55356 117391 118060 118181 118333 118650 118538 117860 117356 117227 116486 114541 112380 111195 110847 110637 110680 111368 112220 112418
55338 112418 112028 111741 111733 111573 110974 110068 109180 108704 108857 109312 109550 109642 110047 110565 110421 109523 108663 108218 107714 106953
55318 106953 106490 106608 106911 107315 108284 109644 110389 110313 110573 111897 113336 113634 112830 111626 110130 108179 106150
55301 106150 104570 103507 102975 103274 104378 105671 106773 107920 109105 109753 109677 109404 109130 108373 107150 106308
55285 106308 106132 105817 105033 104771 105845 107710 109589 111534 113406 114031 112635 110209 108315 107354 107009 107422
55269 107422 108750 110343 111566 112767 114327 115513 115425 114454 113638 113145 112520 111874 111679 111816 111933 112315 113322
55252 113322 114340 114346 113310 112097 111288 110895 110907 111255 111536 111482 111396 111454 111142 110139 109188 109163 109733 109913 109564 109364
55232 109364 109616 110011 110426 111029 111711 112078 111975 111506 110755 109955 109554 109652 109727 109377 108888 108710 108917 109599 111002
55213A11002J798J239L89L83P79J38j346j822p51J81j25m28O24K093K110N33j110
55196A15687j693j344p48m70p49j342j668j367m52R24K281K707J840P57P81J554
55180A16698J539M09n16l90J07J97O9l4m09r59q60J07R15P91L30M27R83J363J415
55161A22182J345J162Q38N58M28L60M12O86Q60N02k00p33j143j726k066j500m70
55144A21495j14m96n42M1K98k08o18l26M7j50n46o23n85o33l40N31J382J551J097
55125A21261L56n07j150j050l01K69J78k00l84l20MO45J218J151N53J02j8j52
55107A21655k76o0J85j75q32q44k80k17q91j227n62M11R05R50P16J52k89J51J153
55088A20625J366L75o14n82N5N05P03P29L19l85o65l65k13m87n11K1L31j61q93
$$ plain form
55213 111002 112800 114039 114428 114811 115590 115728 114382 112560 111809 111990 111865 111437 112061 114154 116264 116797 115687
55196 115687 113994 112650 111902 111432 110683 109341 107673 106306 105854 106778 109059 111766 113606 114363 115144 116698
55180 116698 118237 118646 118130 117740 117847 118044 118113 118079 117670 116711 115851 115958 116873 117664 117994 118421 119404 120767 122182
55161 122182 123527 124689 125527 126085 126513 126873 127285 127971 128831 129333 129133 128400 127257 125531 123465 121965 121495
55144 121495 121381 120885 120343 120384 120682 120474 119856 119530 119577 119427 118881 118258 117673 117040 116700 117231 118613 120164 121261
55125 121261 121617 121110 119960 118910 118609 118878 119056 118856 118472 118152 118156 118801 120019 121170 121723 121825 121807 121655
55107 121655 121379 121319 121504 121329 120497 119653 119373 119156 118265 117038 116476 116887 117792 118742 119458 119610 119321 119472 120625
55088 120625 121991 122366 121752 121170 121225 121730 122433 123162 123481 123096 122431 122066 121853 121366 120855 120876 121207 121046 120153
55069A20153j086o42K49J340J860J009o28j456j072p30j128j298m36O50R13O23
55053A18321N42O82P53R26J222J130N25O7Q7P2j95k09O5j04o56m04R61J994J661
55034A27440Q41O20M77l68j255j170n33l61n07k03L34K61m16r84j177j144q01
55017A21054r9M51M43K35L02N27P21J050J367J049J68k01L42P35K20l81j99J13
54999A27897l72j064p82L44J235J434J119L13o43o78O38J957J757M11o16r42j199
54982A30809j388q77K22J084J432J639J741J488J097R75R17N47J26P5Q9k21l26
54965A39429M27J532J916J534J184J102Q48M12K69M16L97J45n6k82p67j193j055
54948A46258n57k82k00J39O42P48L99J60M17J092K001K985L786M293M715N214
$$ plain form
55069 120153 119067 118425 118674 120014 121874 122883 122255 120799 119727 118997 117869 116571 116135 116785 117698 118321
55053 118321 118863 119545 120298 121224 122446 123576 124101 124168 124255 124327 124132 123923 123988 123884 123228 122824 123785 125779 127440
55034 127440 128281 128901 129378 129010 127755 126585 126052 125691 125184 124981 125315 125576 125160 124176 122999 121855 121054
55017 121054 120955 121406 121849 122084 122386 122913 123634 124684 126051 127100 127268 127067 127409 128144 128364 127983 127784 127897
54999 127897 127525 126461 125679 126023 127258 128692 129811 130124 129481 128803 129441 131398 133155 133566 132950 132008 130809
54982 130809 129421 128544 128766 129850 131282 132921 134662 136150 137247 138222 139139 139686 139812 139887 139976 139755 139429
54965 139429 139856 141388 143304 144838 146022 147124 147972 148384 148653 149069 149466 149611 149555 149273 148506 147313 146258
54948 146258 145701 145419 145219 145358 146000 146748 147147 147307 147724 148816 150817 153802 157588 161881 166596 171810
54932A71810N686O138O717P205P192P022P544Q507Q276N856K120j634n149q329
54918B28961j0224j0261r424q908q367o927n020l747l118k410j747j711j885j330
54904A53882k97P1m07p06k06O69J359J654J404P69O01J562L082M053M330M620
54888A76440N266O070O975P923Q374P917O919N732L824P99k367m305n040n560
54874B18967o201o699p301q322q986q148o079m190l179k714k561k701k585j665
54860A47636n44k27m77k46N00Q32N38K37n1q87j983k357k014j977k420k339j382
54843A32839n69o76j181j278q89k84L04M30k38j043q34M73J715K014J596J032
54827A33411O23N85Q71Q43P6o64l91L88K94o96j158m85L24N03N86J084J500J342
$$ plain form
54932 171810 177496 183634 190351 197556 204748 211770 219314 227821 236097 241953 244073 242439 237290 228961
54918 228961 218737 208476 199052 190144 181777 174850 169830 166083 162965 160555 158808 157097 155212 153882
54904 153882 153585 153656 153249 152543 152337 153006 154365 156019 157423 158192 158793 160355 163437 167490 171820 176440
54888 176440 181706 187776 194751 202674 211048 218965 225884 231616 235440 236239 233872 229567 224527 218967
54874 218967 212766 206067 198766 190444 181458 173310 167231 163041 159862 157148 154587 151886 149301 147636
54860 147636 147092 146865 146388 146142 146642 147474 148012 148249 148198 147311 145328 142971 140957 138980 136560 134221 132839
54843 132839 132270 131594 130413 129135 128246 127962 128266 128696 128458 127415 126581 127054 128769 130783 132379 133411
54827 133411 134034 134619 135490 136333 136409 135745 135354 135742 136036 135340 134182 133697 134021 134524 135110 136194 137694 139036
54809A39036R90Q27N08j83o85n02M9M13M58K25k26m04K95J542K225J956J550J637
54791A49711J774J371O93K83J64J61M21J085J898K575L224M127N377O852Q239
54776A87955R207R879J0898J2467J3715J3707J2665J1258R138N467P24l368n781
54763B87931o908p245o708n629n211o294q412j0382j1266j0616q687o528n149
54750A88896m468l775l084k959l155k605j019O22J316R55o1j074j047O33L113
54735A72288M880N660O423P554Q367Q501Q357P911O569M488K577Q71j604m854
54721B37988p386q280q300q253p786o667n701n391m969l883l013l188l631l222
54707A58318k336k052k249j876p24L28O68M85J40j98l99m66o37r90j229j138q62
$$ plain form
54809 139036 140026 140853 141361 141178 140493 139991 140040 140453 140911 141136 140910 140506 140801 142343 144568 146524 148074 149711
54791 149711 151485 152856 153549 153832 153996 154157 154578 155663 157561 160136 163360 167487 172864 179716 187955
54776 187955 197162 207041 217939 230406 244121 257828 270493 281751 290889 296356 297080 293712 287931
54763 287931 281023 273778 267070 261441 256230 249936 241524 231142 219876 209260 200573 194045 188896
54750 188896 184428 180653 177569 174610 171455 168850 167831 168453 169769 170724 170663 169589 168542 169175 172288
54735 172288 177168 182828 189251 196805 205172 213673 222030 229941 236510 240998 243575 244446 242842 237988
54721 237988 230602 222322 214022 205769 197983 191316 185615 180224 175255 171372 168359 165171 161540 158318
54707 158318 155982 153930 151681 149805 149081 149409 150077 150562 150702 150504 150105 149639 149002 148012 146783 145645 144783
54690A44783m35L33J195J388O47k93o57m95k17m8k04q35j366q36N70J310M93p99
54672A44534j061l80L1l02p98r29p55n10m18o75j125j168n41K03M23K45K37N79
54654A37590J017J303J312J041P41P23Q52P16M10M81Q99Q55or43j145p55l48m5
54636A44698L30O87Q70R60J032R36O07J80l19r55j443j431j154j076q95M8J345
54619A44420J673P43j78j32L41N00O45J180J542J120M28K99O07P30O93Q73J102
54602A56586R77O59N22L65k06r37j202r68p79r56j216j085m13L85O31K46P9Q11
54584A53499J771J800J110R84J589J668P33k4K42N63j69j389j853j456q71k88
54568A57909L72P57O76P17J204J337M70n41n06K06K86m03o75J52J363J845J165
$$ plain form
54690 144783 144348 144681 145876 147264 147911 147618 146961 146466 146249 146201 145997 145162 143796 142960 143530 144840 145333 144534
54672 144534 143473 143093 143124 142822 142024 141095 140340 139830 139412 138737 137612 136444 135903 136106 136529 136774 137011 137590
54654 137590 138607 139910 141222 142263 143004 143727 144579 145295 145705 146186 147085 147940 147934 146991 145846 145091 144743 144698
54636 144698 145028 145715 146585 147545 148577 149513 150120 150300 149981 149026 147583 146152 144998 143922 143027 143075 144420
54619 144420 146093 146836 146658 146526 146867 147367 148012 149192 150734 151854 152282 152581 153188 153918 154611 155484 156586
54602 156586 157563 158222 158744 159109 158903 157966 156764 155796 155017 154061 152845 151760 151347 151732 152363 152609 152688 153499
54584 153499 155270 157070 158180 159164 160753 162421 163154 163130 163372 163935 163766 162377 160524 159068 158197 157909
54568 157909 158281 159038 159714 160431 161635 162972 163442 162901 162395 162601 162887 162484 161809 161961 163324 165169 166334
54551A66334j95j149p98N89J696J769J483J702K188K294K127K095J933J195K48
54536A83511j48J41O90J140J073m3j940l179k645r16N95J222J049J26j216j982
54520A77478j569p27m57m92k5O90O99j02q92j188j109p21j53j6o38j192o44P17
54502A69659J703J887J761J585J182O77M19K29k81q11o93R1J001J756K228J958
54486A84351P94l51m12L90R45Q41N38L49K40M31J140J939K288K321K321J951R78
54469B01054K07L61P20K00o98o89j2j04j101j528p80l9k19n90k19N47Q56N94J02
54450A98662m83j043j310j328j415j432q84J6K64n77j698k138j855j324q59o03
54434A81993o38p01l64K68N84L56L5LJ57L76P14J023R61O07M73P16Q87O38J63
$$ plain form
54551 166334 166139 164990 164192 164781 166477 168246 169729 171431 173619 175913 178040 180135 182068 183263 183511
54536 183511 183363 183504 184194 185334 186407 186364 184424 181245 178600 177684 178279 179501 180550 180676 179460 177478
54520 177478 175909 175182 174725 174233 174208 174898 175597 175495 174603 173415 172306 171585 171432 171416 170778 169586 168942 169659
54502 169659 171362 173249 175010 176595 177777 178454 178873 179102 178821 178010 177317 177408 178409 180165 182393 184351
54486 184351 185145 184794 184382 184772 185717 186558 187096 187445 187685 188116 189256 191195 193483 195804 198125 200076 201054
54469 201054 201261 201622 202342 202542 201844 201155 201143 201039 199938 198410 197630 197591 197372 196782 196563 197110 197966 198560 198662
54450 198662 198179 197136 195826 194498 193083 191651 190767 190783 191047 190470 188772 186634 184779 183455 182596 181993
54434 181993 181355 180654 180290 180558 181142 181498 181533 181536 181693 182069 182783 183806 184767 185374 185847 186563 187450 188088 188251
54415A88251k05l63l28j63m2jK53Q65J388J368J115J246J683J808J404P42r2j095
54397A97834j768j521o65j43k93n74n22k13K21P50J092R15M27J94L33M74L68j3
54379A96896p17j526j742j001M1N55O26P23O32k8p44p02j33J96L52Q40J151L05
54361A95724j247j888j092OM31L80J66l66j019j106n59p5J29N16J060J141Q46
54344A93047J007J617J683R61M33N37L99m98j361j529j573k022k274j699p78k18
54328A87732N3J90k03j098j451o53L01J67p69j356j310j183j109p21l4M93O86
54311A79735P36P91Q98J087J131O67r4l38K29Q13N60l61j215j596j406n80O02
54294A81659J411J415R46M71P3j72m6K23Qo44q05j15M72O9q47j281j149r66q20
$$ plain form
54415 188251 188046 187683 187355 187192 187150 187149 187402 188267 189655 191023 192138 193384 195067 196875 198279 199021 198929 197834
54397 197834 196066 194545 193880 193737 193444 192870 192348 192135 192356 193106 194198 195113 195540 195734 196067 196541 196909 196896
54379 196896 196179 194653 192911 191910 191951 192506 193132 193855 194487 194459 193715 193013 192880 193076 193428 194268 195419 195724
54361 195724 194477 192589 191497 191503 191934 192314 192480 192114 191095 189989 189430 189355 189484 190000 191060 192201 193047
54344 193047 194054 195671 197354 198315 198748 199285 199684 199186 197825 196296 194723 192701 190427 188728 187950 187732
54328 187732 187785 187975 187772 186674 185223 184570 184871 185038 184269 182913 181603 180420 179311 178590 178556 179049 179735
54311 179735 180471 181262 182160 183247 184378 185045 184951 184613 184842 185655 186215 185854 184639 183043 181637 181057 181659
54294 181659 183070 184485 185431 185902 185975 185803 185757 185980 185988 185344 184539 184424 184896 184965 184118 182837 181688 180722 179902
54275A79902n44l63m94m42L49J467J949J499O56l2k77J38J133K037K140J429M02
54258A90949n96j398j701j307m84K73P15P89M65l7k14J40N91O21K26k70n82m75
54240A87705Q2N14O6j094j858j664j222j233j241n68L49M85k30q63p58q8P27J383
54222A80492J552J016N1p67j131j127r49q10r62j369j547j086k60K53J65j55j62
54205A73204K72P07N36l32j196j240m14O12J290J533J385R17M22J67j9m00p04
54188A76740n58l91r49j963k342j823j264j062n05O75J403P49n19r64l68K91L68
54171A67518J59J78N13Q28P13J22m41m69j66p6j01K92Q71P21k46q93m62L60N72
54152A69993J24m23o96m39M80J496J621Q22K12L55M93L2l36J20Q86J111Q92P59
$$ plain form
54275 179902 179358 178995 178501 178059 178408 179875 181824 183323 183979 183947 183670 183808 184941 186978 189118 190547 190949
54258 190949 190353 188955 187254 185947 185463 185736 186451 187240 187705 187668 187454 187594 188185 188806 189032 188762 188180 187705
54240 187705 187787 188301 188367 187273 185415 183751 182529 181296 180055 179487 179836 180321 180091 179228 178470 178382 179109 180492
54222 180492 182044 183060 183111 182344 181213 180086 179137 178327 177365 175996 174449 173363 173103 173356 173521 173366 173204
54205 173204 173476 174183 174719 174387 173191 171951 171537 172149 173439 174972 176357 177274 177696 177863 177844 177444 176740
54188 176740 176182 175791 174842 172879 170537 168714 167450 166388 165883 166558 167961 168710 168191 167227 166859 167150 167518
54171 167518 167677 167855 168368 169196 169909 170031 169590 169121 168955 168879 168778 169070 169941 170662 170416 169523 169061 169421 169993
54152 169993 170117 169694 168998 168559 169039 170535 172156 172978 173190 173545 174038 174070 173734 173854 174740 175851 176743 177502
54134A77502P27P61J265K175K461J574M85K42M87M47M11Q82J210N87l82n78k60
54117A89996m67j048r77l08j44p45j144q01k67p0j40m01q70j108o33J33L24N0
54099A81380K49J101J693J412O84J39j10j47jJ28K8j11k8Jl92q27o28N9M98N89
54079A85717Q71J409J644J440J316J519J669J512J290J271J509K110L110M145
54065B10532M836N437O432P752R043J0482J2455J4556J5683J5020J2226P092M8
54052C31594p098j2146j4292j4251j2825j0432p875o196n415m459k764j034o5
54039B32742L46Q89J796K709L095K663J777J451K273L533M035L661L302L343L231
54024B70846K621J978J716J570J188P16M54M20L73M9p47j823k550k506k040j736
$$ plain form
54134 177502 178229 178990 180255 182430 184891 186465 186950 187192 187679 188126 188537 189419 190629 191216 190834 190256 189996
54117 189996 189529 188481 187504 187196 187052 186307 185163 184362 184095 184025 183885 183484 182614 181506 180873 181006 181330 181380
54099 181380 181629 182730 184423 185835 186519 186658 186548 186401 186400 186528 186556 186445 186417 186418 186026 185199 184571 184630 185128 185717
54079 185717 186588 187997 189641 191081 192397 193916 195585 197097 198387 199658 201167 203277 206387 210532
54065 210532 215368 220805 227237 234989 244032 254514 266969 281525 297208 312228 324454 331546 331594
54052 331594 324496 312350 298058 283807 270982 260550 252675 246479 241064 236605 233841 232807 232742
54039 232742 233088 233977 235773 238482 241577 244240 246017 247468 249741 253274 257309 260970 264272 267615 270846
54024 270846 273467 275445 277161 278731 279919 280635 281089 281509 281882 281931 281184 279361 276811 274305 272265 270529
54008B70529j715j903k502l414l822l235k477k597l279l482l210l231l404k810
53994B29448j514o09m49k93O3j13r04j317r23n59p41p69j12N52N09J70K39O44
53976B23322J039J495J998K152K054K593M078N453N603M727L643K548J241o9j085
53961B60792j981k861l235k808k205k167k450k318j659q77r9P28J252J053M49
53946B41614K54Q34J835K775L495M123M881N819O641P048P254P650P940P382O060
53931C15605N072N045N273M906M229L996M068L638K443R68l24j177j153K12K717
53916C55518N418P403Q393Q719Q820Q776Q256P163O209O380P821R792J1745J3550
53902D73963J4432J2630P053j184r493j5767j9253k0096j8909j6629j4148j1931
$$ plain form
54008 270529 268814 266911 264409 260995 257173 253938 251461 248864 245585 242103 238893 235662 232258 229448
53994 229448 227934 227325 226876 226583 226646 226533 225629 224312 223389 222830 222089 221320 221208 221760 222269 222439 222678 223322
53976 223322 224361 225856 227854 230006 232060 234653 238731 244184 249787 254514 258157 260705 261946 261877 260792
53961 260792 258811 255950 252715 249907 247702 245535 243085 240767 239108 238231 238132 238860 240112 241165 241614
53946 241614 241868 242702 244537 247312 250807 254930 259811 265630 272271 279319 286573 294223 302163 309545 315605
53931 315605 320677 325722 330995 335901 340130 344126 348194 351832 354275 355243 354919 353742 352589 352801 355518
53916 355518 360936 368339 376732 385451 394271 403047 411303 418466 424675 431055 438876 448668 460413 473963
53902 473963 488395 501025 508078 506894 497401 481634 462381 442285 423376 406747 392599 380668
53890C80668j0215r217q823q457p751p066o864o935o737o245n838n524m991m315
53876B81690m051m327m410l547k016r76j204k229k910k784k427k483k787k877
53862B42662k787k751k479j613p23q49j892k488j811o55j56k98l52k04l36q07
53846B22461j034n91K47Q52Q29K41m73q55p54l57P2K97J97qJ68P81J126O96J08
53827B24003L00J012J145N41K39O64Q36qj088j222n10P2J50J39K93M18L72K70
53809B27626K53M75J067J881K549L056L789M741N237M872M160L793L762L721L740
53794B74722L975M099L660K810K046J541J232J287J876K657K985K571J561K38
53780C07260j005j667j594j338j625k603l750m405m217l398k735k925l678l937
$$ plain form
53890 380668 370453 361236 352413 343956 336205 329139 322275 315340 308603 302358 296520 290996 286005 281690
53876 281690 277639 273312 268902 265355 263339 262363 261159 258930 256020 253236 250809 248326 245539 242662
53862 242662 239875 237124 234645 233032 232309 231460 229568 227080 225269 224614 224458 224160 223808 223604 223268 222461
53846 222461 221427 220836 221083 221935 222764 223005 222532 221677 220923 220566 220638 220935 221132 221124 221292 222073 223199 223895 224003
53827 224003 224303 225315 226460 227001 227240 227904 228740 228732 227644 226422 225912 225984 226134 226273 226566 226984 227356 227626
53809 227626 227879 228354 229421 231302 233851 236907 240696 245437 250674 255546 259706 263499 267261 270982 274722
53794 274722 278697 282796 286456 289266 291312 292853 294085 295372 297248 299905 302890 305461 307022 307260
53780 307260 306255 304588 302994 301656 300031 297428 293678 289273 285056 281658 278923 275998 272320 268383
53766B68383l211k233j963k445l046l311l113k432j549j087j303j646j474r53
53752B38617p37j053j508j602j117k37M66M88N2n9L75O66K29n34q48n63p5L01
53734B32861M68M64N89J218K084K376J888J472J824K504K754K543K210J669Q12
53719B57736J75K90P68Q60N74M77O48P11O26P07R66J204J536K218L074L741M226
53702B80537M598M474L615K715K714L428L801L475L145L321L570L275K449J489
53688C26606O89L03N78J375K107K300K018J607J188N76m01j576k391k334j463
53673C31182l92L27N92M77L7n15p99p17n39m00j19K52L22K8j54j6jl46m95lN25
53652C29246J36j175k513l121k851j911p42J01M23M56L23j00n37l15N37J043P10
$$ plain form
53766 268383 265172 262939 260976 258531 255485 252174 249061 246629 245080 243993 242690 241044 239570 238617
53752 238617 237880 236827 235319 233717 232600 232363 232829 233317 233369 233310 233685 234351 234580 234046 233198 232635 232560 232861
53734 232861 233329 233793 234382 235600 237684 240060 241948 243420 245244 247748 250502 253045 255255 256924 257736
53719 257736 257911 258201 258969 259829 260403 260880 261528 262239 262865 263572 264538 265742 267278 269496 272570 276311 280537
53702 280537 285135 289609 293224 295939 298653 302081 305882 309357 312502 315823 319393 322668 325117 326606
53688 326606 327295 327598 328176 329551 331658 333958 335976 337583 338771 339347 338946 337370 334979 332645 331182
53673 331182 330790 331117 331709 332186 332223 331708 330909 330192 329653 329253 329134 329386 329708 329736 329582 329566 329565 329219 328724 328721 329246
53652 329246 329382 328207 325694 322573 319722 317811 317069 317170 317593 318049 318372 318272 317735 317420 317957 319000 319710
53635C19710L26O03R54O32J98N76J343J354O51L50Q41J441J803K308L010L423
53619C39523L513L783M130L750K566J732K204L518M396M113K991K012K143L502
53605C83876N101N806N527N065M888M745M346L832L461L305L309L242K796K145
53591D41444K009K732L662M102M296M717M988M592M125M471M978M035J424j216
53577D90359k647l411m504n807o567o528n996n358m994n114n356n050m093l042
53563D21892k244j567j013q80j058r54l66K26M78O53J035J470J763J963K081J955
53547D25434J540R17J38m80j72J346L042L603L143K900L374L919M173M535N006
53532D62418M979M562M876O369P925Q451Q327Q542R295J0264J1481J3088J4724
$$ plain form
53635 319710 320036 320639 321593 322225 322423 322999 324342 325696 326347 326697 327538 328979 330782 333090 336100 339523
53619 339523 343036 346819 350949 354699 357265 358997 361201 364719 369115 373228 376219 378231 380374 383876
53605 383876 388977 394783 400310 405375 410263 415008 419354 423186 426647 429952 433261 436503 439299 441444
53591 441444 443453 446185 449847 453949 458245 462962 467950 472542 476667 481138 486116 490151 491575 490359
53577 490359 487712 484301 479797 473990 467423 460895 454899 449541 444547 439433 434077 429027 424934 421892
53563 421892 419648 418081 417068 416188 415130 414176 413810 414036 414514 415167 416202 417672 419435 421398 423479 425434
53547 425434 426974 427891 428029 427549 427377 428723 431765 435368 438511 441411 444785 448704 452877 457412 462418
53532 462418 467397 471959 476835 483204 491129 499580 507907 516449 525744 536008 547489 560577 575301
53519E75301J5921J6678J7119J7092J6614J6211J6306J6807J7635J9096K1167
53508G65947K3089K4227K4825K5410K6001K6396K6689K6972K7010K6785K6820
53497A050171K7463K8260K8564K8339K7965K7701K7732K8193K8670K8295K6864
53486A358217K5310K4513K4131K3281K1820K0321J9182J8441J8137J8222J8316
53475A589891J8136J7974J8239J8704J8626J7501J5370J2622R816P402N325L131
53463A752737N83k165n099q500j2293j5775j8275j9626j9871j9183j8386j8721
53451A595426k0555k2901k4723k6063k7368k8413k8608k7935k6911k6012k5601
53440A310336k5902k6486k6331k5010k3262k1786k0083j7318j3763j0487q000
$$ plain form
53519 575301 591222 607900 625019 642111 658725 674936 691242 708049 725684 744780 765947
53508 765947 789036 813263 838088 863498 889499 915895 942584 969556 996566 1023351 1050171
53497 1050171 1077634 1105894 1134458 1162797 1190762 1218463 1246195 1274388 1303058 1331353 1358217
53486 1358217 1383527 1408040 1432171 1455452 1477272 1497593 1516775 1535216 1553353 1571575 1589891
53475 1589891 1608027 1626001 1644240 1662944 1681570 1699071 1714441 1727063 1736879 1744281 1749606 1752737
53463 1752737 1753320 1751155 1746056 1737556 1725263 1709488 1691213 1671587 1651716 1632533 1614147 1595426
53451 1595426 1574871 1551970 1527247 1501184 1473816 1445403 1416795 1388860 1361949 1335937 1310336
53440 1310336 1284434 1257948 1231617 1206607 1183345 1161559 1141476 1124158 1110395 1099908 1091908
53429A091908o056m528l515k691j403N86K941N276P366R092J0683J2608J4817
53416A137084J6516J7364J8266K0085K2162K3197K3312K3912K5646K7733K9471
53405A384748L1163L3112L4845L6052L7401L9690M2723M5809M8845N2105N5222
53394A841715N7320N8255N9002O0492O2506O4225O5463O6749O8249O9326O9443
53383B542745O8893O8063O6543O3750O0116N6708N3791N0759M7621M5253M3808
53372C168050M2026L8876L4988L1532K8495K5026K0838J6066J0200K346p523j8537
53360C392383k9957m1293n1548n9578o5276o9437p2346p3583p3444p3371p4281
53349B708269p5357p5196p3482p0908o8015o5053o2653o1614o1899o2443o2215
$$ plain form
53429 1091908 1085852 1081324 1077809 1075118 1073715 1074301 1077242 1082518 1089884 1098976 1109659 1122267 1137084
53416 1137084 1153600 1170964 1189230 1209315 1231477 1254674 1277986 1301898 1327544 1355277 1384748
53405 1384748 1415911 1449023 1483868 1519920 1557321 1597011 1639734 1685543 1734388 1786493 1841715
53394 1841715 1899035 1957290 2016292 2076784 2139290 2203515 2268978 2335727 2403976 2473302 2542745
53383 2542745 2611638 2679701 2746244 2809994 2870110 2926818 2980609 3031368 3078989 3124242 3168050
53372 3168050 3210076 3248952 3283940 3315472 3343967 3368993 3389831 3405897 3416097 3418443 3410920 3392383
53360 3392383 3362426 3321133 3269585 3210007 3144731 3075294 3002948 2929365 2855921 2782550 2708269
53349 2708269 2632912 2557716 2484234 2413326 2345311 2280258 2217605 2155991 2094092 2031649 1969434
53338A969434o1058n9321n7146n4444n1364m8322m5528m2748l9676l6301l2759
53327A440767k9061k5217k1585j8684j6650j5190j4073j3330j2905j2445j1659
53316A249968j0579r391q200p123o252n436m404l191k079j023L51K048L567M718
53302A202974O001P715R337J0302J0986J2230J4227J6465J8509K0215K1426K2184
53290A372571K3117K4979K7724L0506L2598L3851L4386L4299L3724L2737L1213
53279A711705K9132K7030K5645K5141K4922K4206K2484J9552J5630J1455P784
53268A944686M684J602j867n632r501j3489j7620k1721k5707k9710l3726l7209
53256A754790l9375m0047m0083m0708m2286m3894m4372m3554m2095m0295l7852
$$ plain form
53338 1969434 1908376 1849055 1791909 1737465 1686101 1637779 1592251 1549503 1509827 1473526 1440767
53327 1440767 1411706 1386489 1364904 1346220 1329570 1314380 1300307 1286977 1274072 1261627 1249968
53316 1249968 1239389 1229998 1221798 1214675 1208423 1202987 1198583 1195392 1193313 1192290 1192641 1194689 1198256 1202974
53302 1202974 1208975 1216690 1226027 1236329 1247315 1259545 1273772 1290237 1308746 1328961 1350387 1372571
53290 1372571 1395688 1420667 1448391 1478897 1511495 1545346 1579732 1614031 1647755 1680492 1711705
53279 1711705 1740837 1767867 1793512 1818653 1843575 1867781 1890265 1909817 1925447 1936902 1944686
53268 1944686 1949370 1950972 1949105 1943473 1933972 1920483 1902863 1881142 1855435 1825725 1791999 1754790
53256 1754790 1715415 1675368 1635285 1594577 1552291 1508397 1464025 1420471 1378376 1338081 1300229
53245A300229l4865l2315l1034l0750l0706l0750l1236l2129l2862l3058l2832
53234I47692l2409l1793l0867k9542k7846k5914k3820k1337j8263j5010j2445
53223F78446j0937j0056r376q992q946q852q634q884r821j0598j0436r934j0213
53210E52767j1199j1772j1455j0840j0398r921r243q589p988p173o261n788n830
53197D36310n833n608n689o394p224p604p606p434o796n428l892l170l508m181
53183C55943m375l963l374l005k959l116l270l147k490j386l76l8l60q29j150
53168C22105j515j995k232k079k072k684l444l447k614j776j562j786k012k134
53154B90753k188k015j440o15km3p54j635k080k007j918k135k333j975r78L39
$$ plain form
53245 1300229 1265364 1233049 1202015 1171265 1140559 1109809 1078573 1046444 1013582 980524 947692
53234 947692 915283 883490 852623 823081 795235 769321 745501 724164 705901 690891 678446
53223 678446 667509 657453 648077 639085 630139 621287 612653 603769 593948 583350 572914 562980 552767
53210 552767 541568 529796 518341 507501 497103 487182 477939 469350 461362 454189 447928 442140 436310
53197 436310 430477 424869 419180 412786 405562 397958 390352 382918 376122 370694 366802 363632 360124 355943
53183 355943 351568 347605 344231 341226 338267 335151 331881 328734 326244 324858 324482 324444 324084 323255 322105
53168 322105 320590 318595 316363 314284 312212 309528 306084 302637 300023 298247 296685 294899 292887 290753
53154 290753 288565 286550 285110 284495 284493 284450 283696 282061 279981 277974 276056 273921 271588 269613 268635 268974
53138B68974J648K543K498J348k83j456j689j045K13J609K468K506K186K068K034
53123B85622J654J017N98N18N38O02Q07R65P58K59k89r50j823k552k722k563k574
53106B79865k618k156j245n17j93P5L21P3p49j451j462j061r40j296j624j189
53090B63833J59J520J601K40j112j061QO57M47K62P18J398J809K033K126J790
53074B76428R77J73l15o78r86r35m67L3L62O76Q23L28o96j371j223q33q51j092
53056B70353j090r69j138j557j883j930j640r04J34R10J040P91O12N12K25k24
53040B63242n14m31q7K12J52k90p37p64l87J6J78J00j29l08j67J76N0q25j621
53021B57866j415o33m57r71j074l00N06O94O96Q97P61o9p74m43N51J210J356J546
$$ plain form
53138 268974 270622 273165 275663 277011 276728 275272 273583 272538 272751 274360 276828 279334 281520 283588 285622
53123 285622 287276 288293 288891 289409 289947 290549 291356 292321 293079 293338 293049 292099 290276 287724 285002 282439 279865
53106 279865 277247 275091 273846 273329 273136 273211 273532 273605 272856 271405 269943 268882 267942 266646 265022 263833
53090 263833 263992 265512 267113 267353 266241 265180 265188 265845 266292 266554 267272 268670 270479 272512 274638 276428
53074 276428 277405 277578 277263 276585 275599 274664 274197 274230 274592 275268 276091 276419 275723 274352 273129 272296 271445 270353
53056 270353 269263 268294 267156 265599 263716 261786 260146 259242 259376 260286 261326 262117 262729 263241 263466 263242
53040 263242 262728 262297 262210 262422 262574 262284 261547 260783 260396 260412 260590 260690 260561 260253 260086 260262 260312 259487 257866
53021 257866 256451 255818 255361 254390 253316 253016 253522 254216 254912 255809 256570 256501 255727 255284 255835 257045 258401 259947
53003B59947J898J950J489P19k11j207j845j642p18K52P47P58N23K41j8k43l69
52986B62271j85L50Q06O91K06N3M46Q89J085J386J978K411K301J951J772J615
52970B80026J237Q80Q62R66P93L61q4m73p75p69m47k72n97j159j457j315p76J41
52952B77142J120J520J063J89o20j340j927j988j486j136j415j763j402n21J16
52937B67552K79K15r2p12j110o65K53N42j71j095j391j113q68j031j444j633j243
52920B56273m62J20K52L08N60N93m6j002j507j400j071o66k4O89J006R19R68J405
52902B56915J762J505P73K50M72J330K209K569K515K582K933L029K301Q37q33
52887B81149k270l211l453l056k432j887j362q43n85o12m89n6J64j98n64j78P54
$$ plain form
53003 259947 261845 263795 265284 266003 265792 264585 262740 261098 260380 260632 261379 262137 262660 262901 262883 262640 262271
52986 262271 262086 262436 263242 263933 264139 264192 264638 265527 266612 267998 269976 272387 274688 276639 278411 280026
52970 280026 281263 282143 283005 283971 284764 285125 285041 284568 283793 283024 282577 282305 281708 280549 279092 277777 277001 277142
52952 277142 278262 279782 280845 281034 280414 279074 277147 275159 273673 272537 271122 269359 267957 267436 267552
52937 267552 267831 268046 267954 267242 266132 265467 265720 266262 266091 264996 263605 262492 261624 260593 259149 257516 256273
52920 256273 255811 255931 256183 256491 257051 257644 257598 256596 255089 253689 252618 251952 251928 252617 253623 254542 255510 256915
52902 256915 258677 260182 260955 261205 261677 263007 265216 267785 270300 272882 275815 278844 281145 281982 281149
52887 281149 278879 275668 272215 269159 266727 264840 263478 262635 262050 261438 260949 260893 261057 260859 260295 260117 260871
52870B60871J429J616J666J617J147L73j00lL45O06O89M81m4n25o29p07j335k331
52852B65166k923k906k812k850k576j846j256j188j159o52k2M9m42r35j181j396
52836B41071j645j595r95j9R37J576J730J312M12n83j137r17L0J429K984M337
52820B48927N076N110N019N497O310O248M409J217k073m536n910o231n748m992
52806B58323m419l973l378k712k264k003j716j530j727k004j605m08O15M60o57
52791B31002j513j240k25M46K53k36p1R54K060K353J734R21P05J273K077K361
52775B42854J875J081N21K25J0K4M39P74K98q03j495j262o72l03J1L61K06o72
52757B43472j383j048j40K14j31l60p8L09M80N89P43P85O69M42m0p60j040j78
$$ plain form
52870 260871 262300 263916 265582 267199 268346 268719 268619 268616 268961 269567 270256 270737 270693 270168 269539 268832 267497 265166
52852 265166 262243 259337 256525 253675 251099 249253 247997 246809 245650 244998 244976 245025 244583 243648 242467 241071
52836 241071 239426 237831 236836 236817 237754 239330 241060 242372 242784 242201 241064 240147 240177 241606 244590 248927
52820 248927 254003 259113 264132 269629 275939 282187 286596 287813 285740 281204 275294 269063 263315 258323
52806 258323 253904 249931 246553 243841 241577 239574 237858 236328 234601 232597 230992 230584 231199 231659 231002
52791 231002 229489 228249 228024 228470 228723 228487 228416 229370 231430 233783 235517 236438 237143 238416 240493 242854
52775 242854 244729 245810 246331 246556 246566 246590 247029 247803 248101 247298 245803 244541 243869 243566 243577 243938 244144 243472
52757 243472 242089 241041 240901 241115 240984 240624 240546 240855 241335 241924 242667 243452 244121 244563 244523 243763 242723 242545
52739B42545J381K295J931J055P48J169J722J926J784J459R78K47o41j213j017
52724B56369k86K19K13K53P33J086N78m90j147j010n42k06j40m34j034j420j064
52707B51678k29L03K82J43J91K88L76O49J065J256J044O21K00j11j62J15M84P03
52689B58896Q77J103J108O82K33K23L36k2o60q85o41n00n84m66j69k35o92q17
52671B57787k81L58N62N48O29O19K35k81m90k88J25N97J107J744K576L305L268
52654B72120K142N16p72j576k213k581k317j649j178r20l84M16R23J019J097J130
52638B65773O92N0J95J447K971L967M392M180K779J66k546m116m272l460k219
52623B69999j220j089j615j737q89K69Q48Q21N69J16n80j104j005m22K40Q05J113
$$ plain form
52739 242545 243926 246221 248152 249207 249955 251124 252846 254772 256556 258015 258993 259240 258599 257386 256369
52724 256369 256083 256302 256515 256768 257501 258587 259165 258675 257528 256518 255976 255770 255630 255196 254162 252742 251678
52707 251678 251449 251752 252034 252177 252368 252656 253032 253681 254746 256002 257046 257667 257867 257756 257594 257709 258193 258896
52689 258896 259773 260876 261984 262666 262899 263122 263458 263436 262776 261891 261250 260750 260166 259700 259531 259296 258604 257787
52671 257787 257506 257864 258426 258974 259603 260222 260457 260176 259686 259398 259523 260120 261227 262971 265547 268852 272120
52654 272120 274262 274778 274006 272430 270217 267636 265319 263670 262492 261572 261188 261604 262527 263546 264643 265773
52638 265773 266465 266515 266710 268157 271128 275095 279487 283667 286446 286612 284066 279950 275678 272218 269999
52623 269999 268779 267690 266075 264338 263449 263718 264566 265387 265956 266072 265492 264388 263383 262961 263201 264006 265119
52606B65119Q30l2q29r88o55k68Q1M65P72R60J205J515J562J235Q28M80J6m22
52588B71874l07L53P55M68J12L36Q34R67P64N66K90k43p38q73q65r82r41m61N8
52569B71967J42P7L98Q95R23M20j53o56j247j718j582q51j32R7o7k88l17j80k08
52550B67520p03j336j306m48L11J22o38r77o79k95j47mK91N70P06P00M59q7o96
52531B63363r86q33l33L83J023J175R10R32J660K492K575K016J638J738J804J407
52515B80964Q11N44Q04J321J584J225M17k39m22m42p09j225j755k179k304j882
52499B76513j098o00o13n72p0M71N98O54J082J443J107M51M01J054J642J715J452
52482B85630R75K48l85m39n3K06L03O65J216J293O82o7m38l61K78J621L138L708
$$ plain form
52606 265119 265949 265917 265088 264100 263445 263177 263258 263723 264495 265455 266660 268175 269737 270972 271800 272280 272296 271874
52588 271874 271567 271920 272675 273143 273255 273591 274425 275392 276156 276722 277012 276769 276031 275158 274293 273311 272370 271909 271967
52569 271967 272109 272186 272584 273479 274402 274822 274669 274013 272766 271048 269466 268615 268483 268580 268513 268225 267908 267728 267520
52550 267520 266817 265481 264175 263727 264038 264160 263522 262545 261866 261571 261424 261420 261711 262281 262987 263687 264146 264059 263363
52531 263363 262377 261544 261211 261594 262617 263792 264702 265634 267294 269786 272361 274377 276015 277753 279557 280964
52515 280964 281775 282319 283123 284444 286028 287253 287670 287431 287009 286567 285858 284633 282878 280699 278395 276513
52499 276513 275415 274815 274202 273630 273560 274031 274629 275283 276365 277808 278915 279366 279767 280821 282463 284178 285630
52482 285630 286605 286853 286468 286029 285976 286182 286485 287150 288366 289659 290341 290274 289836 289475 289753 291374 294512 298220
52464B98220K821J176k59j222j963k567k877k745k118j164m19l92q16p92J13J256
52448B86252J656J073O0p67j236j484j583j414r43n70q30j591j927j182N4N86
52432B76154L9p99j035n78Q7N50P86R97J257J302Q71L31M91J451K159J690N09
52415B86262j22K19R52J646K517L705M942O053P137Q080Q435P953O683M531J376
52400C50369k252n283p076p772p582o512m964l849l577l439k525r11N36J200J164
52385B97527Q46N68M43M38N49R29J626K282K350J749J023P98J259K215L257L826
52369C21685L495K413J281P46Q85J323J580J377Q26L43K16L51N36P99J132J189
52353C40177P40K12K15O35P57L36n3J68R13J703K140K008J380P40O53J194K004
$$ plain form
52464 298220 301041 302217 301958 300736 298773 296206 293329 290584 288466 287302 286883 286491 285675 284883 284996 286252
52448 286252 287908 288981 289041 288274 287038 285554 283971 282557 281614 281044 280214 278623 276696 275514 275568 276154
52432 276154 276193 275394 274359 273781 273868 274418 275204 276201 277458 278760 279631 279962 280453 281904 284063 285753 286262
52415 286262 286140 286359 287311 288957 291474 295179 300121 306174 313311 321391 329826 337779 344462 348993 350369
52400 350369 348117 342834 335758 327986 320404 313892 308928 305079 301502 298063 295538 294627 295163 296363 297527
52385 297527 298373 298941 299384 299822 300371 301300 302926 305208 307558 309307 310330 311128 312387 314602 317859 321685
52369 321685 325180 327593 328874 329620 330505 331828 333408 334785 335611 335954 336170 336521 337057 337856 338988 340177
52353 340177 340917 341129 341344 341979 342736 343072 343019 343187 344100 345803 347943 349951 351331 352071 352724 353918 355922
52336C55922K895L919M868N256N023M767N084O010P179Q105Q314P655O706O287
52322D37990O459O471N865N112M899N240N710O147O764P718Q919J0107J1002J1516
52308E39919J1887J2411J3017J3459J3860J4664J5928J7104J7656J7517J6820
52297G04242J5590J3962J2352J1203J0664J0623J0769J0591R691Q209O762N855
52285H30513N544N568N520M968L862K722K100J925J768J542J425J230N62m62j327
52270H67460j902k447k871k812k450k346k352j668k78P81J061J603L423N940P784
52255H68926Q602R099R735J0242J0294R905R264Q692Q616R152R818J0105J0029
52242I92479R845R558R141Q857Q796Q433P261N617M301L524K805J767N25o43j554
$$ plain form
52336 355922 358817 362736 367604 372860 377883 382650 387734 393744 400923 409028 417342 424997 431703 437990
52322 437990 444449 450920 456785 461897 466796 472036 477746 483893 490657 498375 507294 517401 528403 539919
52308 539919 551806 564217 577234 590693 604553 619217 635145 652249 669905 687422 704242
52297 704242 719832 733794 746146 757349 768013 778636 789405 799996 809687 817896 824658 830513
52285 830513 836057 841625 847145 852113 855975 858697 860797 862722 864490 866032 867457 868687 869249 868787 867460
52270 867460 865558 863111 860240 857428 854978 852632 850280 848612 848334 849115 850176 851779 855202 861142 868926
52255 868926 877528 886627 896362 906604 916898 926803 936067 944759 953375 962527 972345 982450 992479
52242 992479 1002324 1011882 1021023 1029880 1038676 1047109 1054370 1059987 1064288 1067812 1070617 1072384 1072909 1072266 1070712
52227A070712k147k652l533m866o008o331o055n866n962o097o253o533o524n674
52213I96211m377l827m483n373n348m415l349k504j699q87k22M88J700L347M664
52198I69926N048M705M169L556K719J887J508J511J322P26J49j75o90j683k575
52183I92103k681k326k325k618k340j318n18p00j503k243k926l755m367m200l373
52168I54910k561k107j872j720j634j465j059o76p97j407j883j685r29j28M14
$$ plain form
52227 1070712 1068565 1065913 1062380 1057514 1051506 1045175 1039120 1033254 1027292 1021195 1014942 1008409 1001885 996211
52213 996211 991834 988007 983524 978151 972803 968388 965039 962535 960836 959949 959727 960215 961915 965262 969926
52198 969926 974974 979679 983848 987404 990123 992010 993518 995029 996351 997077 997226 997051 996361 994678 992103
52183 992103 989422 987096 984771 982153 979813 978495 977977 977277 975774 973531 970605 966850 962483 958283 954910
52168 954910 952349 950242 948370 946650 945016 943551 942492 941816 941019 939612 937729 936044 935115 934987 935401
$$ [...]
##END NTUPLES=NMR SPECTRUM
##END=
