##TITLE=AC1713_3097_8749698_3jzR5BpbZs
##JCAMPDX= 6.0         $$ Bruker NMR JCAMP-DX V2.0
##DATA TYPE= NMR SPECTRUM
##DATA CLASS= NTUPLES
##ORIGIN= BRUKER
##OWNER= Administrator
$$ 1.72 TOPSPIN		Version 2.1
$$ 2015-08-07 21:39:31.172 -0700  Administrator@X
$$ Compression mode = diff/dup
##.OBSERVE FREQUENCY= 400.02188249412
##.OBSERVE NUCLEUS= ^1H
##.ACQUISITION MODE= SIMULTANEOUS (DQD)
##.ACQUISITION SCHEME= undefined
##.AVERAGES= 8
##.DIGITISER RES= 22
##SPECTROMETER/DATA SYSTEM= spect
##.PULSE SEQUENCE= zg30
##.SOLVENT NAME= COFFEE_meoh
##.SHIFT REFERENCE= INTERNAL, COFFEE_meoh, 1, 14.98509
##AUDIT TRAIL= $$ (NUMBER, WHEN, WHO, WHERE, PROCESS, VERSION, WHAT)
$$ ##TITLE= Audit trail, TOPSPIN		Version 2.1
$$ ##JCAMPDX= 5.01
$$ ##ORIGIN= Bruker BioSpin GmbH
$$ ##OWNER= Administrator
$$ $$ E:\/data/COFFEE/nmr/AC1713_3097_8749698_3jzR5BpbZs/50/pdata/1/auditp.txt
$$ ##AUDIT TRAIL=  $$ (NUMBER, WHEN, WHO, WHERE, PROCESS, VERSION, WHAT)
(   1,<2015-08-07 21:39:23.781 -0700>,<Administrator>,<X>,<go>,<TOPSPIN 2.1>,
      <created by zg
	started at 2015-08-07 21:38:17.453 -0700,
	POWCHK enabled, PULCHK disabled,
       configuration hash MD5:
       21 0F 79 D6 B3 7B B4 F6 88 20 88 DB 03 48 BD 9F
       data hash MD5: 64K
       99 AD DB C3 EE EA 05 AD 88 02 FF 46 E6 EF DB 8D>)
(   2,<2015-08-07 21:39:27.031 -0700>,<Administrator>,<X>,<proc1d>,<TOPSPIN 2.1>,
      <Start of raw data processing
       efp LB = 0 FT_mod = 6 PKNL = 1 PHC0 = 0 PHC1 = 0 SI = 32K 
       data hash MD5: 32K
       19 F0 22 30 9D 97 92 C0 67 5A 4E 5D E2 36 CF 0C>)
(   3,<2015-08-07 21:39:27.313 -0700>,<Administrator>,<X>,<proc1d>,<TOPSPIN 2.1>,
      <pk PHC0 = 91.99951 PHC1 = 0 
       data hash MD5: 32K
       D0 C6 23 2A FA 49 99 B3 00 DF 6A 4F 47 B2 90 BA>)
(   4,<2015-08-07 21:39:27.422 -0700>,<Administrator>,<X>,<proc1d>,<TOPSPIN 2.1>,
      <abs ABSG = 1 
       data hash MD5: 32K
       1F F3 56 A3 2B 9C 83 0C 60 03 1A 3E BB 85 08 2C>)
(   5,<2015-08-07 21:39:27.484 -0700>,<Administrator>,<X>,<proc1d>,<TOPSPIN 2.1>,
      <abs ABSG = 2 
       data hash MD5: 32K
       06 DB 69 D1 07 AE AE 67 87 EF 0E CA C0 31 37 85>)
(   6,<2015-08-07 21:39:27.547 -0700>,<Administrator>,<X>,<proc1d>,<TOPSPIN 2.1>,
      <abs ABSG = 3 
       data hash MD5: 32K
       0C D0 9E 61 53 71 92 37 07 9C 60 2F C6 88 E8 54>)
(   7,<2015-08-07 21:39:27.594 -0700>,<Administrator>,<X>,<proc1d>,<TOPSPIN 2.1>,
      <abs ABSG = 4 
       data hash MD5: 32K
       20 C0 D7 69 A6 70 F1 2A 34 53 4F 61 73 19 79 A8>)
(   8,<2015-08-07 21:39:27.656 -0700>,<Administrator>,<X>,<proc1d>,<TOPSPIN 2.1>,
      <abs ABSG = 5 
       data hash MD5: 32K
       3C E1 E3 A7 38 74 05 2E 9E FF 2B 2E DA D8 EC 49>)
$$ ##END=
$$ 
$$ $$ hash MD5
$$ $$ 55 7B 6B B1 A4 2A 23 3D C0 84 63 9A 0A 7C E5 02
##$RELAX= 
##$RELAX= 
##$RELAX= 
##$RELAX= 
##$RELAX= 
##$RELAX= 
##$RELAX= 
$$ Bruker specific parameters
$$ --------------------------
##$DU= <E:\>
##$EXPNO= 50
##$NAME= <AC1713_3097_8749698_3jzR5BpbZs>
##$PROCNO= 1
$$ [...]
150 150 150 150 150 150 150 150
##$TP07= 0
##$TPNAME0= <>
##$TPNAME1= <>
##$TPNAME2= <>
##$TPNAME3= <>
##$TPNAME4= <>
##$TPNAME5= <>
##$TPNAME6= <>
##$TPNAME7= <>
##$TPOAL= (0..7)
0.5 0.5 0.5 0.5 0.5 0.5 0.5 0.5
##$TPOFFS= (0..7)
0 0 0 0 0 0 0 0
##$TUNHIN= 0
##$TUNHOUT= 0
##$TUNXOUT= 0
##$USERA1= <user>
##$USERA2= <user>
##$USERA3= <user>
##$USERA4= <user>
##$USERA5= <user>
##$V9= 5
##$VALIST= <valist>
##$VCLIST= <CCCCCCCCCCCCCCC>
##$VD= 0
##$VDLIST= <DDDDDDDDDDDDDDD>
##$VPLIST= <PPPPPPPPPPPPPPP>
##$VTLIST= <TTTTTTTTTTTTTTT>
##$WBST= 2048
##$WBSW= 25
##$XGAIN= (0..3)
0 0 0 0
##$XL= 0
##$YL= 0
##$YMAX_a= 597377
##$YMIN_a= -507939
##$ZGOPTNS= <>
##$ZL1= 120
##$ZL2= 120
##$ZL3= 120
##$ZL4= 120
##$ABSF1= 14.98509
##$ABSF2= -5.573092
##$ABSG= 5
##$ABSL= 3
##$ALPHA= 0
##$AQORDER= 0
##$ASSFAC= 0
##$ASSFACI= 0
##$ASSFACX= 0
##$ASSWID= 0
##$AUNMP= <proc_prof1d_extract_pilot.lims>
##$AXLEFT= 0
##$AXNAME= <>
##$AXNUC= <1H>
##$AXRIGHT= 0
##$AXTYPE= 0
##$AXUNIT= <>
##$AZFE= 0.1
##$AZFW= 0.1
##$BCFW= 0
##$BC_mod= 0
##$BYTORDP= 0
##$COROFFS= 0
##$CY= 15
##$DATMOD= 1
##$DC= 0
##$DFILT= <>
##$DTYPP= 0
##$F1P= 0
##$F2P= 0
##$FCOR= 0.5
##$FTSIZE= 32768
##$FT_mod= 6
##$GAMMA= 0
##$GB= 0
##$INTBC= 1
##$INTSCL= 1
##$ISEN= 128
##$LB= 0
##$LEV0= 0
##$LPBIN= 0
##$MAXI= 10000
##$MC2= 0
##$MEAN= 0
##$ME_mod= 0
##$MI= 0
##$NCOEF= 0
##$NC_proc= -8
##$NLEV= 6
##$NOISF1= 0
##$NOISF2= 0
##$NSP= 0
##$NTH_PI= 0
##$NZP= 0
##$OFFSET= 14.98509
##$PC= 1
##$PHC0= 91.99951
##$PHC1= 0
##$PH_mod= 1
##$PKNL= yes
##$PPARMOD= 0
##$PPDIAG= 0
##$PPIPTYP= 0
##$PPMPNUM= 2147483647
##$PPRESOL= 1
##$PSCAL= 4
##$PSIGN= 0
##$PYNMP= <proc.py>
##$REVERSE= no
##$SF= 400.02
##$SI= 32768
##$SIGF1= 0
##$SIGF2= 0
##$SINO= 400
##$SIOLD= 32768
##$SPECTYP= <>
##$SREGLST= <1H.CDCl3>
##$SSB= 0
##$STSI= 32768
##$STSR= 0
##$SW_p= 8223.68421052631
##$SYMM= 0
##$S_DEV= 0
##$TDeff= 65536
##$TDoff= 0
##$TI= <>
##$TILT= no
##$TM1= 0
##$TM2= 0
##$TOPLEV= 0
##$USERP1= <user>
##$USERP2= <user>
##$USERP3= <user>
##$USERP4= <user>
##$USERP5= <user>
##$WDW= 1
##$XDIM= 32768
##$YMAX_p= 439359383
##$YMIN_p= -685228
##$CURPLOT= <Network HP LaserJet P1505>
##$CURPRIN= <$Network HP LaserJet P1505>
##$DFORMAT= <normdp>
##$LAYOUT= <+/1D_H.xwp>
##$LFORMAT= <normlp>
##$PFORMAT= <normpl>
##$SURQMSG= 1
$$ End of Bruker specific parameters
$$ ---------------------------------
##NTUPLES= NMR SPECTRUM
##VAR_NAME=  FREQUENCY,     SPECTRUM/REAL,   SPECTRUM/IMAG
##SYMBOL=    X,             R,               I
##VAR_TYPE=  INDEPENDENT,   DEPENDENT,       DEPENDENT
##VAR_FORM=  AFFN,          ASDF,            ASDF
##VAR_DIM=   32768,         32768,           32768
##UNITS=     HZ,            ARBITRARY UNITS, ARBITRARY UNITS
##FACTOR=    0.250966925370066, 1,           1
##FIRST=     8223.43324360094, -221328,      -82511
##LAST=      0,             -143209,         -72555
##MIN=       0,             -685228,         0
##MAX=       8223.43324360094, 439359383,    0
$$ Real data points
##PAGE= N=1
##DATA TABLE= (X++(R..R)), XYDATA
$$ [...]
19563g2364D4745M7489j6792a34416A4292a6436j54335j73938a34676F4301b6092
19551A33942B3974a11580F418i2709G7834m350a28849B08448D6916e6868F9417
19539A43975a16155L4852k49103d3269l06102h1871k52196J07812H5824K08984
19529B94808a25880A38068i3599b2907l60804F7227e2785k8743J4654k91413a42056
19517G8840M4513b23704Q724A23592k2014j9116C525a15278j5050F2460b85334
19505i2762B46391a82773K025n2317C0122E044R3157a62035B0736K09036a62357
19493E8597g5585b9823D90640A28321b70037A64545a90348e7292j54544q8521
19483c00357A32248a45539A36193a76846K756L3461A22217L6438a07511J5909
$$ y = [-72364, 44745, 92234, 75442, -134416, 14292, -16436, -170771, -344709, -134676, 64301, -26092, 133942, 23974, -111580, 6418, -92709, 77834, 73484, -128849, 208448, 46916, -56868, 69417, 143975, -116155, -81303, -330406, -43269, -349371, -81871, -334067, -226255, 85824, 294808, -125880, 138068, -93599, -22907, -383711, 67227, -52785, -81528, -66874, -358287, -142056, 78840, 123353, -223704, -214980, 123592, 101578, 82462, 3525, -115278, -130328, 62460, -285334, -92762, 246391, -182773, -180748, -233065, 30122, 5044, 98201, -162035, 20736, 229772, -162357, 58597, -75585, -29823, 490640, 128321, -270037, 164545, -190348, -57292, -211836, -300357, 132248, -145539, 136193, -176846, -174090, -140629, 122217, 158655, -107511, -91602]
19473i1602j38590J13429J0283j37565a9879l5616j2366N684I037b69807B15869
19461a50773a907C5080K34375e35181C675c08942A25144c61534A25159E968a78776
19449a90011p4508B26372G5842k2314K92938F5989c32662e9018j17221J3834O9585
19438i2820n398B16346a50688G5541c09626J06602B4074J8200d91574B46272a53682
19426C10279C2896b22797O3143P5765H7181C6797a69795B45135o1540F3037b88843
19414b08358L286A05956a54731G3645b9554N428k20861j38204C0500k818h9496
19402B03204b24041h4275m78255B7536a28497j78578a6625l2126n7618B04542
19391f0512J2593j42990D7320e3047K2839q9125B8501B882h9797B58492r6062
$$ y = [-91602, -230192, -116763, -106480, -244045, -19879, -55495, -67861, -62177, 9037, -269807, 215869, -150773, -1907, 35080, 269455, -535181, 3675, -308942, 125144, -361534, 125159, 5968, -178776, -190011, -264519, 226372, 75842, 53528, 346466, 65989, -332662, -59018, -176239, -162405, -92820, -98218, 216346, -150688, 75541, -309626, -203024, 24074, 42274, -491574, 246272, -153682, 310279, 32896, -222797, -159654, -83889, 87181, 36797, -169795, 245135, 183595, 63037, -288843, -208358, -205072, 105956, -154731, 73645, -29554, -24126, -244987, -383191, 30500, 27682, -89496, 203204, -224041, -84275, -562530, 27536, -128497, -307075, -16625, -48751, -106369, 204542, -60512, -47919, -190909, 47320, -53047, -30208, -119333, 28501, 2882, -89797, 258492, 162430]
19380A62430b07488E0589j7264H452g0108l66870A7546J9849a32288A45311i0973
19368E7171J28823D246J63270g2512A21855a24940k61318a52272f2983G7770d60525
19356C5903c08522a47293n1344j43500M2618a30151K4048l7665b8284k63645A53017
19344a55818N4347m6522C5347a55022C9953M927K18991c6952l13698a7115A25414
19332a72654m1549f1489k16009A10447b36813C3183h7019A67456J20123a68595
19321c11076A19852f191D5453e1974p5317c0037m9795j94786J6089q9631f22A1227
19308b00876a1156j19468b798B04019G0498a66898g825n6034A54132B6598a59266
19296b31635A66289i3367E9366f0486k5246k76138d4311k6824B91960c08722f4063
$$ y = [162430, -207488, 50589, 33325, 8452, -70108, -436978, 17546, 37395, -132288, 145311, -90973, 57171, 185994, 4246, 167516, -72512, 121855, -124940, -386258, -152272, -62983, 77770, -460525, 35903, -308522, -147293, -198637, -342137, -299519, -130151, -106103, -143768, -28284, -291929, 153017, -155818, -101471, -147993, 35347, -155022, 39953, 44880, 263871, -36952, -350650, -17115, 125414, -172654, -214203, -61489, -277498, 110447, -236813, 33183, -87019, 167456, 287579, -168595, -311076, 119852, -6191, 45453, -51974, -127291, -30037, -79832, -274618, -258529, -348160, -622, 11227, -200876, -11156, -130624, -2798, 204019, 70498, -166898, -7825, -63859, 154132, 26598, -159266, -231635, 166289, -93367, 59366, -60486, -85732, -361870, -44311, -71135, 291960, -308722, -64063]
19284a79714b136l5448E226K19146a34627j2276A43453K2735a0878C5568a44724
19272A5162a03199k71899P3744a13353m57944C2611a9150k34096C3679d8726l82298
19261d31024b09000J0074D35946i5817A19309d5584A01581R4791d32540D757J50166
19250A54923a79972O9316F0130b81337A7510J06671a34597d3200k45225D9488
19239a36768j37691a23957L6942j490o3545f7324r7764m3306j50572I3452l4811
19228E8641K9946J26678b90652H9221L21104a8836k96668a37669j67594E9985
19217i1234j75163A4352b13419B17481a44280B51704b59595a20069n8392K6539
19207a51922j7108A61850b11323M8627D0346i6313j1929A9057a71789n347D8781
$$ y = [-179714, -2136, -37584, 5226, 224372, -134627, -146903, 143453, 166188, -10878, 35568, -144724, 15162, -103199, -375098, -301354, -113353, -571297, 32611, -19150, -253246, 33679, -48726, -431024, -209000, -198926, 435946, -95817, 119309, -45584, 101581, 196372, -432540, 4757, 154923, -179972, -110656, 60130, -281337, 17510, 124181, -134597, -43200, -288425, 49488, -136768, -274459, -123957, -87015, -88505, -152050, -67324, -165088, -208394, -358966, 93452, 58641, 88587, 215265, -290652, 89221, 410325, -18836, -315504, -137669, -305263, 59985, -91234, -266397, 14352, -213419, 217481, -144280, 251704, -259595, -120069, -178461, -151922, -169030, 161850, -211323, -162696, 40346, -96313, -108242, 19057, -171789, -177136, 48781]
19195b67909e0541G8984J13795a15894h511G2630b69922k45997A22639R0844g490
19183a19229B20330g9203K1717D4910a99998L9035e3508j21801J5660O8436k54409
19172c45622B67126b37662f7119j87906G1105B407O0884b85865C641b78664h362
19160B18925e9215L156l2990A96176o7590c76770I0459i13A68475b89458A0924
19148i5425B26192F8025a05899c8r4546A12637b63466I6349b74129a00284b7254
19136D0917J92557F9247b64952a32076D8959b5792l9144j47520l944j6174a066
19124A90096f4166I3903b25818H3855J22394c35097a35102K8123j4064A08186
19113a21367A91358G7764f8348j07640p0730M2797M5512n1001a03531E0048H30
$$ y = [-267909, -50541, 78984, 192779, -115894, -8511, 72630, -269922, -515919, 122639, 213483, -7490, -119229, 220330, -79203, -57486, 44910, -199998, -160963, -53508, -175309, -159649, -91213, -345622, 267126, -237662, -67119, -255025, 71105, 2407, 63291, -285865, 3641, -278664, -8362, 218925, -59215, -56059, -89049, 196176, 128586, -376770, 90459, -913, 168475, -289458, 10924, -95425, 226192, 68025, -105899, -38, -94584, 112637, -263466, 96349, -274129, -100284, -27254, 40917, 233474, 69247, -264952, -132076, 48959, -25792, -64936, -212456, -216400, -232574, -1066, 190096, -64166, 93903, -225818, 83855, 206249, -335097, -135102, -106979, -121043, 108186, -121367, 191358, 77764, -68348, -175988, -246718, -203921, -158409, -209410, -103531, 50048, 830]
19101a15893c7012l9998l5054A49892a40134m5930A75978a48872A21583D06Q931
19090I337b8863A46130g6389j57184B2359f9864o4549d5444E4323a04463C442
19078f3023j4278L585A63905a53071M6567k7640B0889J16093a99127f1802m3305
19067a05107C7005N9256a29856D31916i399B18895b195j70449g9605r5144k71184
19056d45933B28733a33630j6312j77944A30708l0431a21700j6653l70339C2629
19045A05247d2584m23577e5597H0580M6044d78028C4220J9374a22423m4767E7993
19033C01445a85609H2611R9249a20066A20539J02541a92465C07791i82j86222
19023a87204i0163B0851a36488L9831G7376b72675a30903R736E1983j6085b58940
$$ y = [-115893, -37012, -77010, -112064, 149892, -140134, -186064, 175978, -148872, 121583, 406, 9337, -28863, 146130, -76389, -233573, 22359, -69864, -134413, -45444, 54323, -104463, 3442, -63023, -77301, -73716, 163905, -153071, -106504, -134144, 20889, 136982, -199127, -61802, -105107, 37005, 96261, -129856, 431916, -9399, 218895, -2195, -172644, -79605, -174749, -445933, 228733, -133630, -149942, -327886, 130708, 100277, -121700, -138353, -508692, 32629, 105247, -42584, -466161, -55597, 80580, 126624, -478028, 34220, 53594, -122423, -167190, 57993, 301445, -185609, 82611, 181860, -120066, 120539, 223080, -192465, 307791, -982, -187204, -90163, 20851, -136488, -96657, 77376, -272675, -130903, -121167, 51983, 35898, -258940]
19011C4739K2766a56257g0373j13884A33196b12397e8065j5426n378c2734l08170
19000c40904e993A02480a83443l5816H1379k302c79157C3580J95838a95758C4002
18988a49609k02327h888j29557f1959n4404A00233i9662M4461H2703b18726l8889
18977b57615D2136g0038j16556P6827D6100K23641H9428d67269b08583k80385
18967d88968J85540a29088c1489j97443o145e0847A66581i5617j20870B0937L43219
18956C64156a45542B2471b29255j68683h4015o0050q1899K4497B36615G397K1707
18945B9104L4214P9209J52183b5213F7452j1374J04094c15620c6256o5326A91641
18933c705A63928a16135B11371J847a39759A72173p6829h0045B20725a06608j99953
$$ y = [34739, 57505, -156257, -70373, -184257, 133196, -212397, -58065, -73491, -78869, -32734, -340904, -5993, 102480, -183443, -219259, 81379, 79077, -379157, 33580, 229418, -195758, 34002, -149609, -351936, -8888, -138445, -61959, -116363, 100233, -99662, -55201, 82703, -218726, -257615, 42136, -70038, -186594, -109767, 46100, 269741, 89428, -467269, -208583, -488968, -303428, -129088, -31489, -228932, -235077, -50847, 166581, -95617, -216487, 20937, 364156, -145542, 22471, -229255, -397938, -84015, -144065, -225964, -201467, 236615, 7397, 29104, 63318, 142527, 294710, -25213, 67452, 56078, 160172, -315620, -36256, -101582, 191641, -3705, 163928, -116135, 211371, 213218, -139759, 172173, 95344, -80045, 220725, -106608, -306561]
18922c06561A85585a18405A2083a31405f0661A13201C2059b13155B99768C3414
18911f2250j15272l06395c7798o7051a0511l46216D20337b2711k94324e9988b1906
18899a36766j23045D9259a34857A07390a96667C50164b75428i8638j38883a762
18888f46A40984a24606H0300a58068k611r8413B0711L2980a57697D3966j7382
18877B6584J56197a39504A60812C0516b61965M467C871a30962A34804J6103a29369
18865a23659N7097A15537b18788F6663c24148a46911a0901k65210G3039b85549
18854b57473A11678A3747e0136j19879C46475B2185p44b97524a19383J7574A61586
18842B97250j28565a92724o5981b5876C776L1893d3736a8278j62273b1646A07973
$$ y = [-306561, 185585, -118405, 12083, -131405, -60661, 113201, 32059, -213155, 299768, 33414, -62250, -177522, -483917, -37798, -104849, -10511, -356727, 420337, -22711, -317035, -59988, -21906, -136766, -259811, 49259, -134857, 107390, -196667, 350164, -275428, -98638, -237521, -1762, -646, 140984, -124606, 80300, -158068, -160679, -259092, 20711, 53691, -157697, 43966, 26584, 182781, -139504, 160812, 30516, -261965, -257498, 3871, -130962, 134804, 150907, -129369, -123659, -66562, 115537, -218788, 66663, -324148, -146911, -10901, -276111, 73039, -285549, -257473, 111678, 13747, -50136, -170015, 346475, 22185, 21441, -297524, -119383, -101809, 161586, 297250, 168685, -192724, -258705, -25876, 3776, 35669, -43736, -18278, -180551, -21646, 107973]
18830e2343n6610A27108J3122C0725c22406h5617l8144r2332A9791c39970A51415
18818e69213b0014q1977H739J56690d9997A92887n5252o4322E431M13626A96886
18806A11039K32105F8157a53211k82148h5866k14335C4396a48427A1237f5772
18795a54098e5943H1266b73478E25361A25127e0862A08741c30144B40373f8053
18784d8514B07431c40626D6856d8206p984r9752j60124f4306a3716j31256j41665
18773b86637e8459p2965K8503c1050n3688B02537e2705k7172F0334r831d8166
18761I4899R2391f9319A50762a86775k16313I2318c2699k42173H2135J02945c6009
18749b66642c07B37186d6795B44574b65104I32L71236a51775A08894r759C493
$$ y = [-52343, -108953, 127108, 140230, 30725, -322406, -85617, -123761, -216093, 19791, -339970, 151415, -569213, -20014, -101991, 8739, 165429, -49997, 192887, 137635, 73313, 5431, 419057, 196886, 111039, 343144, 68157, -153211, -435359, -85866, -300201, 34396, -148427, 11237, -65772, -154098, -55943, 81266, -273478, 525361, 125127, -50862, 108741, -330144, 240373, -68053, -48514, 207431, -340626, 46856, -48206, -56190, -155942, -316066, -64306, -13716, -144972, -286637, -58459, -131424, -102921, -31050, -84738, 202537, -52705, -79877, 60334, 50503, -48166, 94899, 187290, -69319, 150762, -186775, -403088, 92318, -32699, -274872, 82135, 185080, -36009, -266642, -307, 237186, -46795, 244574, -265104, 932, 372168, -151775, 108894, 99135, 3493]
18737a79413A48325G1053b76728H9432k876P0516d8880D8298I503c69804B39614
18725e57347a35033j80691e6303a8131B39881C6211R0561a09597j26102a9284
18714a56977B32761a26937I3152A398c90412a66888C2346O0591b28227g7683A31236
18702i311k72667J17603l4143a8256D8803b66377C03470b83812m399h7343r2382
18691a79725G2033o564Q8951b51023f5939m8026n4179C283P4720a56464k05987
18680c62451J22478O5199C21449A02829O4888d14448a95798A61240c74686a19138
18669a39072F2525J11610a85888A64428D8761a43653c9942k34173a34128r257
18659a43385O2999o8116G3879b25972R4290A39556C6387M1806a51007k0307E4613
$$ y = [-179413, 148325, 71053, -276728, 89432, 86556, 157072, -48880, 48298, 9503, -369804, 239614, -557347, -135033, -315724, -56303, -18131, 239881, 36211, 126772, -109597, -235699, -19284, -156977, 232761, -126937, 93152, 1398, -390412, -166888, 32346, 92937, -228227, -77683, 131236, -9311, -281978, -164375, -198518, -18256, 48803, -266377, 303470, -283812, -288211, -87343, -179725, 72033, 65469, 154420, -251023, -65939, -113965, -168144, 3283, 78003, -156464, -362451, -239973, -174774, 321449, 102829, 167717, -414448, -195798, 161240, -374686, -119138, -139072, 62525, 174135, -185888, 164428, 48761, -143653, -39942, -274115, -134128, -143385, -80386, -148502, 73879, -225972, -131682, 139556, 36387, 78193, -151007, -171314, 54613]
18647B54155B0150h1899r3074q3110O8716C4156J16785I487K8466l993c05749
18635H354a19052j54794d556l5035j64879I1156L171M1129c50221B38536A3223
18623c1637E4215g9423c3011I8607b40937E3224A9569c94006A7643d5908k44067
18612b89975A61685c20994B75604a04627E7161J20620q3125m4951L0503h9796
18601a87128B09865b64432R2966G2062B585J23779f1855k0644J9933r2325d9732
18589a89105O3873a3441j1831c47k41662J2564A82701h9373k34202a10915j488
18578a12403p1107l4192l0483a08344A04692f04985a86510l2829O3404E9501J7360
18567G6861J2132d80980J51288A87211K21114c53945a53570C6950N4555e80335
$$ y = [254155, 20150, -81899, -174973, -258083, -189367, 34156, 150941, 9487, 37953, 33960, -305749, 8354, -119052, -273846, -4556, -39591, -204470, 91156, 94327, 135456, -350221, 238536, 13223, -31637, 54215, -79423, -33011, 98607, -240937, 53224, 19569, -394006, 17643, -45908, -289975, 161685, -320994, 275604, -104627, 57161, 177781, 94656, 49705, 80208, -89796, -187128, 209865, -264432, -171466, 72062, 2585, 126364, -61855, -82499, -62566, -154891, -49732, -189105, -125232, -13441, -25272, -347, -242009, -229445, 182701, -89373, -323575, -110915, -112403, -183510, -217702, -248185, -108344, 104692, -604985, -186510, -219339, -155935, 59501, 76861, 88993, -480980, -329692, 187211, 408325, -353945, -153570, 36950, 91505, -580335]
18556c96434A9725a08088a1330l91242g9772q4094A05830K17191f5571A2942b46988
18544A69678F3696K5807i552j16212A58673c54142i4672k55928J18448g1695J5430
18533e6265f074k63499C290h9984F0349a29414l44742d6969a2651q2733q7897
18522a83281e0914R436E664h1723I465J33676A4565b04009B56402b6926m62809
18511d89735a58716J6975c8167B26814e535C90006E8893a03027C4493e0091j86303
18500b36394F0530j5718a02542j77737C10119b03738B38729b21184e1516a193
18489c02432E6456j6977J21941b62863B71396E2882J32991k4217i4241q6338A36233
18477b3091j9072D1160N552A2332c42601A99423a00022d7868k58105J49672K6815
$$ y = [-396434, 19725, -108088, -11330, -402572, -79772, -163866, 105830, 323021, -65571, 12942, -246988, 169678, 63696, 89503, -9552, -125764, 158673, -354142, -94672, -350600, -232152, -71695, -56265, -6074, -269573, 3290, -89984, 60349, -129414, -474156, -46969, -12651, -95384, -183281, -50914, -41478, 5664, -81723, 9465, 143141, 14565, -204009, 256402, -26926, -489735, -158716, -141741, -38167, 226814, -5535, 390006, 58893, -103027, 34493, -50091, -236394, 60530, 44812, -102542, -280279, 310119, -203738, 238729, -221184, -51516, -1193, -302432, 56456, 39479, 161420, -262863, 271396, 52882, 185873, 161656, -94241, -180579, 136233, -23091, -42163, 41160, 46712, 12332, -342601, 199423, -100022, -47868, -305973, -156301, -129486]
18466a29486B15346a5345B663a37948h661j78058A54014a17868q2979A61576a54956
18454c2427G2105g5570A15363J6315a46515D0186e45015a20980a0987A12298E0750
18442i2168A2682J3743g2083n7917j81875J34626A84279p5109k4744C4645J6910
18431E1555i8489j96285G4875a99239B00417a96269d7672B50246a00812p1773
18421a72585M4446C08273h8650j07659P4272B05288b54764A8970a29701n5641
18411a85342j54842A8244K5572J13523b3561B81941c8671o8399b245j1321B44145
18399D719c57738i46D33044H3300a0593l46237H2112a39289d1184B69898e3364
18387A24893d5572C24240a3526r3677A81884g9512n6923A30188n0795a95776K4770
$$ y = [-129486, 215346, -15345, 2663, -137948, -8661, -186719, 154014, -117868, -200847, 161576, -154956, -32427, 72105, -75570, 115363, 131678, -146515, 40186, -545015, -120980, -10987, 112298, 50750, -92168, 12682, 26425, -72083, -130000, -311875, -177249, 184279, 109170, 84426, 34645, 51555, -98489, -294774, 74875, -199239, 200417, -196269, -47672, 250246, -100812, -172585, -128139, 308273, -88650, -196309, -122037, 205288, -254764, 18970, -129701, -185342, -340184, 18244, 43816, 157339, -23561, 281941, -38671, -107070, -2245, -13566, 244145, 4719, -357738, -946, 433044, 83300, -10593, -356830, 82112, -139289, -41184, 269898, -53364, 124893, -45572, 324240, -13526, -107203, 181884, -79512, -136435, 130188, 79393, -195776, -171006]
18376a71006f5072D2438J22757a46686j3169l9931D4089M3663i7208m9022A10744
18364b02448a9294A02304a55400E3400c72452h2559A42077D2930O609b8810r1710
18353a20520m9437b978k79636a32517A6649Q5055i1331B14690E8287a5112j53317
18342a68429a283F4917b04686c4380n9035j65866K6204K0802E639J2338f6267
18330H3271a75035N5172A27908j5151E3801i7687B31749r5113g6381l64739a49567
18318b00926k0067f1189I3934f2111l3308j765H085L7376L894a57456h163n8846
18306f7009b5121k4259A11604b05901L5308A84042f1374G2174d2071B5524b95898
18294A60761a1319j55545k07932f1333p1743N8985A71347H4956a42868b7313p2186
$$ y = [-171006, -65072, 42438, 165195, -146686, -159855, -199786, 44089, 87752, -97208, -146230, 110744, -202448, -19294, 102304, -155400, 53400, -372452, -82559, 142077, 42930, 49539, -28810, -120520, -169957, -2978, -282614, -132517, 16649, 101704, -91331, 214690, 58287, -15112, -168429, -1283, 64917, -204686, -34380, -93415, -259281, -233077, -212275, 5639, 17977, -66267, 83271, -175035, -119863, 127908, 112757, 53801, -97687, 231749, 136636, -76381, -441120, -149567, -200926, -220993, -61189, 93934, -62111, -95419, -97184, 8085, 45461, 49355, -157456, -8163, -67009, -25121, -49380, 111604, -205901, -170593, 184042, -61374, 72174, -42071, 25524, -295898, 160761, -11319, -166864, -374796, -61333, -133076, -74091, 171347, 84956, -142868, -27313, -99499]
18283i9499B76388a56205f4746r4810k1228k7792L8042L4970A72133M3114c2076
18271b68973G4666O6446K920J43862e381j17873d9883I2675m2379J24369f9850
18259d28808A06386a1345D0605Q1310B1263b75246A44966h4469m1901A29375a03864
18247f7200A23124r136A9160f9928D5790G724N9309k7938J26585b61653i367l8984
18235d8351l2989i49j90813O3924A84889b45242k7609C7347a16458p1916A0140
18223b1055l1506G7056b05471h1808A15453a17796j05074J04971A86144H6400
18212g7390B23954F6478a72213G7603b2710D8780P4518a63794e8663j02376P5394
18201h5645q9070B6395J04860c48412g6656E2457a57856c8215C5405Q3926l6964
$$ y = [-99499, 276388, -156205, -64746, -159556, -180784, -208576, -170534, -135564, 172133, 215247, -32076, -268973, 74666, 141112, 144032, 287894, -5381, -123254, -49883, 92675, 50296, 174665, -69850, -428808, 106386, -11345, 40605, 121915, 21263, -275246, 144966, -84469, -126370, 129375, -103864, -67200, 123124, 113988, 19160, -69928, 45790, 7724, 67033, 39095, 165680, -261653, -9367, -48351, -81340, -949, -191762, -127838, 184889, -245242, -272851, 37347, -116458, -188374, 10140, -21055, -52561, 77056, -205471, -81808, 115453, -117796, -222870, -117899, 186144, 86400, -77390, 223954, 66478, -172213, 77603, -22710, 48780, 123298, -163794, -58663, -161039, -85645, -174715, 26395, 131255, -348412, -76656, 52457, -157856, -38215, 35405, 119331, 82367]
18190H2367d5119D203J60726b08729H2609O1662C5289m500f3743A43782E0117
18178e9346k0177b6876A27693d779B812d9304K3179j26776N892N2615j94588A4536
18165G9991b95885Q9479A39474d2677j34754k4171M0338q2024g5472l21497D6196
18153f8848k77663e9951o2682F0257d4660A80476d0688H6444O5946a56499K6848
18142a29651b3133B08309A03595a70264O6705A74267e2826j47872P9553b7104
18131a76571e8002B02411a64724I4894b46550a18988A00049a56097l2220D0240
18120C22418a79590O210L837j07140l471n8122P8378j29022J73302b41A78769
18108b2567j19852A13396b78207P922A40341b26667G1640d1123o8842h480A13487
$$ y = [82367, -45119, 4203, 164929, -208729, 82609, 144271, 35289, 30789, -63743, 143782, 50117, -59346, -79523, -26876, 127693, -4779, 2812, -49304, -26125, -152901, -147009, -94394, -288982, 14536, 79991, -295885, -206406, 139474, -42677, -177431, -201602, -161264, -243288, -75472, -396969, 46196, -68848, -346511, -59951, -122633, 60257, -44660, 180476, -40688, 86444, 152390, -156499, -129651, -23133, 208309, 103595, -170264, -103559, 174267, -52826, -200698, -121145, -27104, -176571, -58002, 202411, -164724, 94894, -246550, -118988, 100049, -156097, -188317, 40240, 322418, -179590, -173380, -169543, -276683, -280154, -338276, -259898, -388920, -215618, -241, 178769, -22567, -142419, 113396, -278207, -270285, 140341, -226667, 71640, -41123, -109965, -8480, 113487]
18096E7356a48282j72346F1057K3741a39581H3568c71044a21493A21052a78222
18085B69673a9912k31691J25271l544B88008b40413p375B5473a31725j66088I9351
18073b25226I8617h2912G0331e0757C2958c1622A77416J02348j18813c63582e085
18061A7330a48123g3565A15824b95995J12759c7842k6657j2721o1758p8697A52329
18049C67326d8883j82898j36275E1987f6999B27236b8738j6137A42695R8575e49902
18037h3882G7315A6737f4851A79822b9637q7105K8063A2506h5093H4981a29423
18025F4251j8436e5606J0446A34725a5380p018C9245a85661p5694a03636o2598
18014a66234A23809a942B6111J30369b53592C9905c21212B21549a08319j3428
$$ y = [57356, -148282, -320628, 61057, 84798, -139581, 83568, -371044, -121493, 121052, -178222, 269673, -19912, -251603, -126332, -129876, 288008, -240413, -247788, 25473, -131725, -297813, 99351, -225226, 98617, -82912, 70331, -50757, 32958, -31622, 177416, 279764, 160951, -363582, -5085, 17330, -148123, -73565, 115824, -295995, -183236, -37842, -64499, -77220, -138978, -217675, 152329, 367326, -48883, -231781, -368056, 51987, -66999, 227236, -28738, -44875, 142695, 241270, -549902, -83882, 77315, 16737, -64851, 179822, -29637, -116742, -88679, 12506, -85093, 84981, -129423, 64251, 45815, -55606, -45160, 134725, -15380, -22398, 39245, -185661, -261355, -103636, -166234, 123809, -1942, 26111, 156480, -253592, 39905, -321212, 221549, -108319, -121747]
18004a21747k00883b8942B9548h7590k69026C19813h6748k19942D8006a43073
17993G6212J065h799j14137l04040K01371A16974J52819j28346K64119a10243
17982A31462F2811b65750B08596a40344F4000b22570a5777A81719E2536K52152
17972C04688B5753a45737G1784a50416A15845b68122E0437A8521J69771e951A0278
17960C62394c1283j29328l3848b3754B14668a79339n5722d6628C4291L7270d1998
17948e0331n9806J0391j23484A36961j1537d2771I6639h7154K3175C51440g4639
17936A13350f0462A4695a45482K1875A14672l2076O9327B8929d9226K1723j79051
17925b06554b5269k67778B32023a74150M048A31262a57382c7333j05641B01035
$$ y = [-121747, -322630, -28942, 29548, -87590, -356616, 319813, -86748, -306690, 48006, -143073, 76212, 77277, -8799, -122936, -426976, -225605, 116974, 269793, 141447, 405566, -110243, 131462, 62811, -265750, 208596, -140344, 64000, -222570, -15777, 181719, 52536, 304688, 25753, -145737, 71784, -150416, 115845, -268122, 50437, 18521, 188292, -5951, 10278, 362394, -31283, -160611, -194459, -23754, 214668, -179339, -235061, -46628, 34291, 71561, -41998, -50331, -110137, -99746, -223230, 136961, 125424, -42771, 96639, -87154, -63979, 351440, -74639, 113350, -60462, 14695, -145482, -123607, 114672, 82596, 151923, 28929, -49226, -27503, -206554, -25269, -293047, 232023, -174150, -170102, 131262, -157382, -37333, -142974, 201035]
17914b74452A07050R6999B6692h9218j59454D2797f6590B63160J8636C0792J30401
17903A61193G4585e9498b3786A0539a60009O4172K6579J329A24a41531n2837A42134
17890B3063J3551d06679e3305r4306K5778d3211A92372d8947j66997f0968A55456
17878A63578C6300g5237j00411a5485E2771f2406P452h553I5412D6867j3816a25697
17865b77472J19092A51389J21174a37956H8359a07852A0409a60986n2831a01738
17854b14331j61756A85080p8033i3001L2270B17046h3593A66184a53660C6802
17843f9917o5140a2591E9659b98931h6831a3441j56702F7126e7097j52544B56433
17831C7289J81311c50600e5206j15443B57221a36668A1621a59283A885c48488
$$ y = [-274452, 107050, 204049, 26692, -89218, -248672, 42797, -66590, 263160, 281796, 30792, 161193, 74585, -59498, -23786, 10539, -160009, -95837, -69258, -67929, 124, -141531, -194368, 142134, 23063, 36614, -406679, -53305, -147611, -121833, -43211, 192372, -48947, -215944, -60968, 155456, 163578, 36300, -75237, -175648, -15485, 52771, -62406, -54954, -8553, 95412, 46867, 33051, -125697, -277472, -158380, 151389, 272563, -137956, 88359, -107852, 10409, -160986, -213817, -101738, -214331, -376087, 185080, 107047, -93001, -60731, 217046, -83593, 166184, -153660, 36802, -69917, -135057, -12591, 59659, -298931, -86831, -13441, -170143, 67126, -57097, -209641, 256433, 37289, 218600, -350600, -55206, -170649, 257221, -136668, 11621, -159283, 1885, -348488]
17820a5629l0381j689G7174d14373J72068f5101H592M6082k3288b73013f6982
17808b85941J28687M7483j00778g3611j41457k2974A62233a74185D89438A60785
17797C8518b23028F4371a44025g270A50501a06571B6054J78395C0599c26186d8268
17785a90196P8367I3732M8853J45506a09042j27415e0683A71565g1656A92452
17774A7049a55383B13659R7434o0383j06089A4712R2428N5288n4577m5749h3545
17762I469N995a48072N1254C542J67881A3638J17035P093b369A75080a73203H1425
17749A50856c38853H8068B9127R3964E8159b68689b5431k07596l823A69019b34402
17737a39077m7389j6010j14357J46632o1850O5549E1742P036J77401a92510C78412
$$ y = [-15629, -46010, -47699, 77174, -414373, -242305, -65101, 8592, 54674, 31386, -273013, -66982, -285941, -157254, -109771, -210549, -73611, -215068, -238042, 162233, -174185, 489438, 160785, 38518, -223028, 64371, -144025, -7270, 150501, -106571, 26054, 204449, 30599, -326186, -48268, -190196, -111829, 93732, 142585, 288091, -109042, -236457, -50683, 171565, -71656, 192452, 17049, -155383, 213659, 311093, 250710, 144621, 14712, 107140, 162428, 107851, 62102, -83545, 9469, 15464, -148072, -96818, 3542, 171423, 13638, 130673, 137766, -2369, 175080, -173203, 81425, 150856, -338853, 88068, 29127, 123091, 58159, -268689, -25431, -233027, -236850, 169019, -234402, -139077, -186466, -202476, -316833, -170201, -232051, -166502, 51742, 58778, 236179, -192510, 378412]
17725B8158l738L4664Q1496B3425J20924a70137J0292D09951a20833C4593J37086
17714A71679d6116N629n9887H2296i7301o142n2213N3386j72992A13532D6078
17702b7908B19470p5538B0986b07840c1426p1094q9887A6502E788N4482P2427
17691A32697E323J15164O4656j3390C5677J98503G5197d564D03804b2035A00573
17679A24529A4711l483N2917J95973a28655l4897I7281a97813A56476J15821a51227
17667A72530Q8864H0140p727i2931B5586J46309c89601J42768J04983J0430e4867
17655D4353Q0016d2563j30971E2107g4321A0004J34904n6720f4682j14942B38956
17643F2734c6518j83371E6680a4147B0106P3677J24970c03908c1669j49534I6364
$$ y = [28158, 24420, 59084, 140580, 23425, 144349, -170137, -159845, 409951, -120833, 34593, 171679, -46116, -40487, -100374, 82296, -97301, -103443, -155656, -102270, -275262, 113532, 46078, -27908, 219470, 143932, 20986, -207840, -31426, -102520, -192407, 16502, 5788, 60270, 132697, 5323, 120487, 185143, 171753, 35677, 234180, 75197, -4564, 403804, -22035, 100573, 124529, 14711, 11228, 64145, 260118, -128655, -163552, 97281, -197813, 156476, 272297, -151227, 172530, 261394, 80140, 72413, -92931, 25586, 171895, -389601, -246833, -141850, -131420, -54867, 44353, 124369, -42563, -173534, 52107, -74321, 10004, 144908, 88188, -64682, -179624, 238956, 62734, -36518, -219889, 56680, -14147, 20106, 93783, 218753, -303908, -31669, -181203, 96364]
17631A08532J3514m7195j7172a04812B10505l6456B0542g3656A42196a46502J9442
17620a27060m5900I7122e9773A4042L15165B5185N5923c2141a218A6711K33706
17609B50417j11619b05748O2626I3724C9288b32384B10179Q2513A08188K00774
17599C08962h3896L4390B54634D5598c52148B1575K52900B8291J3194g2927k2340
17588i5267B25779d09545A30381B3295j550a27798n238R085B58534C2078J6299
17577D8377Q2091h4620j32274B04286B3609a55832A2210a21956I5772B4269a46661
17565E5796g1925b8762A23650b32603D9752J15294K6969O292a3909k7886q3394
17554a25189a265B011b6984j8080E1851O1573c3381A69605a57652j81354A39208
$$ y = [108532, 122046, 74851, 57679, -104812, 210505, 174049, 20542, -73656, 142196, -146502, -127060, -172960, 97122, -59773, 14042, 329207, 25185, 81108, -32141, -1218, 16711, 250417, 138798, -205748, -143122, 93724, 39288, -232384, 210179, 292692, 108188, 308962, -83896, -49506, 254634, 45598, -352148, 21575, 274475, 28291, 41485, -72927, -95267, 225779, -409545, 130381, 23295, 21745, -127798, -133036, -123951, 258534, 32078, 48377, 130468, -84620, -216894, 204286, 23609, -155832, 12210, -121956, 95772, 24269, -146661, 55796, -71925, -28762, 123650, -232603, 49752, 165046, 192015, 198307, -13909, -41795, -125189, -1265, 2011, -26984, -45064, 51851, 113424, -33381, 169605, -157652, -339006, 139208]
17542a20409L3066m2151j19144A53146a88332B08299G6836k0490b0179B23605
17531A16731O9784J00091j11916A2165Q8251P5245J78092A22166K47231D1665
17520B75555h6071A07225C0056R4175M9715p3036e9596j14860I7583L0891i7490
17508i2433q0254n3315Q8489A67470a1849r8972A60365B2433a8273p1839B09830
17496i0707A14980D9997J5036K23754a5526k4173k8483A46245a14420G6445e4725
17484A54012M6377b2028B19255A8524K28725b6102A25252i8874A50903M3813n1502
17473A43214L02190m7247j32144p2589E6146L6150a70379B20172K1650A15857
17462A27822b0463A40355m6159a87548C04118p6291J18813g3814A02123J59013
$$ y = [-120409, -87343, -129494, -248638, 153146, -188332, 208299, 76836, 56346, -20179, 223605, 116731, 186515, 286606, 174690, 12165, 100416, 175661, 353753, 122166, 369397, 41665, 275555, -86071, 107225, 30056, 124231, 173946, 100910, -59596, -174456, 97583, 128474, -97490, -92433, -172687, -226002, -137513, 167470, -11849, -110821, 160365, 22433, -18273, -90112, 209830, -90707, 114980, 49997, 65033, 288787, -15526, -39699, -68182, 146245, -114420, 76445, -54725, 154012, 200389, -22028, 219255, 18524, 247249, -26102, 125252, -98874, 150903, 194716, 143214, 445404, 398157, 266013, 193424, 56146, 92296, -170379, 220172, 241822, 115857, 127822, -20463, 140355, 94196, -187548, 304118, 227827, 346640, -73814, 102123, 261136]
17452B61136r6161D7829L79007B8613J87996J08812O6173a7155I8619J93926q0043
17441B12502N1608R40A1856N64035B53938K48418r9469l4205j31314P6505b0421
17429a17691E4562K34511L751i3331m6762A65424Q651N2439j3106H4623J41237
17418B25860P8509J44761j12775J6757j68059J83444K7680e2086B32327r27J31914
17407C63314A76044L2125a2129A16680K77479d1032C05074b676C1457J5328J39031
17396A85816F617K95714C2949a37488j26423C13924A26420J5417J09397b7458
17385A65965G0090k8797n50N7800M5947c482j88876B13130J60065O1966A45860
17373C70356D5326Q1907a4105C95576b9885B68564h0606C42221A05038e0734J7208
$$ y = [261136, 164975, 47829, 426836, 28613, 216609, 325421, 391594, -17155, 98619, 292545, 212502, 264110, 265050, 11856, 575891, 253938, 502356, 402887, 368682, 237368, 313873, -20421, -117691, 54562, 289073, 292824, -93331, -140093, 165424, 174075, 226514, 213408, 84623, 225860, 304369, 449130, 336355, 353112, 185053, 368497, 396177, -52086, 232327, 231400, 363314, 176044, 208169, -12129, 116680, 394159, -41032, 305074, -2676, 31457, 46785, 185816, 6617, 302331, 32949, -137488, -263911, 313924, 126420, 141837, 251234, -27458, 165965, 70090, 41293, 40743, 98543, 144490, -3482, -192358, 213130, 373195, 435161, 145860, 370356, 45326, 127233, -14105, 395576, -29885, 268564, -80606, 342221, 105038, -50734, -33526]
17362c3526D86516k04399j36168a72377D35820a9483G3241M3606M1826d618m3289
17351d7907B4448L85967a6380A7956J8409h2188C43343j61302a47719B55045K1977
17340B77022d8625G9537P926a5313D41196A31401h525B18760a60033D05436A15954
17328B94354A22171J45160j27989b00155A32815a16569H3963J96618H8267K69109
17318C57376g502D09811o2266k9015C5416J72459b49155A10203Q8119J76104p1309
17307C03117j37777J998a45144C2791K71133J1781p9521l0034j4349q861D6984
17295A14238b6488A69868o1374K75098r0121J11876l0356A36101L74897k54321
17285B56677k9116M379p2417E7284h0906A57296K78030h68A82958q0909h2619
$$ y = [-33526, 486516, 282117, 145949, -172377, 435820, -19483, 73241, 116847, 158673, -4618, -47907, 24448, 410415, -16380, 17956, 36365, -82188, 343343, 182041, -147719, 255045, 277022, -48625, 79537, 87463, -15313, 441196, 131401, -8525, 218760, -160033, 405436, 115954, 294354, 122171, 267331, 139342, -200155, 132815, -116569, 83963, 280581, 88267, 357376, -7502, 409811, 347545, 318530, 35416, 207875, -249155, 110203, 198322, 374426, 303117, 165340, 167338, -145144, 32791, 303924, 315705, 236184, 206150, 191801, 182940, 46984, 114238, -26488, 169868, 108494, 383592, 293471, 405347, 374991, 136101, 510998, 256677, 227561, 231940, 159523, 57284, -80906, 157296, 435326, -868, 182958, 102049, -82619]
17273A4557M22854o8360k2050H1622N181K40809q7633K91085p3809A98856p9716
17262A19140m0044g4588C91602j33935J15424j34701o5019J55091r2641Q8427
17252C24248J12429i258j31217E06966G943K05367K13521F9684P9691a29852B83258
17240e5122a5231C32168m6913K9327I4158f3228B10834L1866J54405k3747j65480
17229B07878J07819q3495M8503E6630K54658R5052m4669H7958a5297C20630A34667
17217D61185j03224L8457A18885k1975b8485C60417j76969C8379P6718K16193
17207C31290L2291Q3515a6307F7874B4103J96454O5266N7938J18568J6110k05054
17196B73385L11084A46877a05721m1838g476E19008B46732J61046J01805B42970
$$ y = [14557, 437411, 369051, 347001, 81622, 86803, 327612, 239979, 531064, 457255, 198856, 119140, 79096, -74588, 391602, 257667, 373091, 238390, 173371, 328462, 235821, 324248, 436677, -9258, -140475, 506966, 7943, 213310, 426831, 69684, 149375, -129852, 283258, -55122, -15231, 332168, 285255, 314582, 94158, -63228, 210834, 242700, 397105, 373358, 207878, 315697, 232202, 280705, 56630, 311288, 406340, 361671, 87958, -15297, 320630, 134667, 461185, 357961, 396418, 118885, 96910, -28485, 360417, 183448, 38379, 115097, 331290, 363581, 447096, -16307, 67874, 24103, 220557, 285823, 343761, 462329, 478439, 273385, 584469, 146877, -105721, -147559, -7476, 519008, 246732, 407778, 509583, 242970]
17185B42986J15480O3981j61687a0156C04856q6677N0217q7583m34K77694k13641
17174B44432K10355j55381r0872Q7132b58803B08056q7987L15046A47926J06477
17164B54403o5941M26435B83555h9634A52723L02137A38781K24302J3250n4240
17154C22093O1324A69911J45803r3715E3719R2340K77884K6881A42459Q6127L85395
17143F13981k4702k56768j11005N9376M39828B48917O2824K39398j12361k13555
17133B25223J33017K75996j37073j20336q2012r6374k2682L47690j04064q056
17123D11329r3431i9126C50642P7126j48770K48475e511G89589j41168j22349
17113E26072n5387j5205j82983J19652r524A52857P4179J45724K16863B80438
$$ y = [242986, 358466, 422447, 260760, -10156, 304856, 218179, 268396, 180813, 180379, 458073, 244432, 454787, 299406, 208534, 295666, -258803, 208056, 120069, 435115, 147926, 254403, 188462, 614897, 283555, -89634, 152723, 454860, 138781, 363083, 376333, 322093, 383417, 169911, 315714, 221999, 53719, 146059, 423943, 450824, 142459, 228586, 613981, 589279, 332511, 221506, 280882, 720710, 248917, 311741, 551139, 438778, 225223, 358240, 634236, 497163, 376827, 294815, 198441, 175759, 523449, 419385, 411329, 317898, -99126, 350642, 427768, 278998, 527473, -5511, 789589, 648421, 526072, 470685, 455480, 272497, 392149, 382625, 152857, 227036, 372760, 589623, 280438]
17102E23785j71195J92258j81224p0613K19758m3823A43665e0859F28918B97537
17091E99317k16254A48820j3290P04387C49088p8395J64539J13215p8244A48183
17080H02050r8947B97610M53470j00185j88888K21705k13469j90917K01473m2153
17070D38646O8534J4466J61686k05710J78672j04135l2310j8636r502L28540k17748
17059F02503K23924k56591J89251k72325J71819k92630P1810K15145k30715M56530
17049H78721k36839j67590K34839j81199k3601J54603j42276K09122J44518k94931
17039E75367j13795R3102J56565C54672K17601M3603q4487O0411L33900j81368
17029G44332J9711j02773k19185K58348j25169m7708J19750L15664j84021j16114
$$ y = [523785, 352590, 544848, 363624, 293011, 512769, 468946, 143665, -50859, 628918, 297537, 599317, 383063, 148820, 135530, 839917, 349088, 270693, 435232, 548447, 470203, 148183, 802050, 703103, 297610, 751080, 650895, 462007, 683712, 470243, 279326, 480799, 438646, 507180, 521646, 683332, 477622, 656294, 552159, 519849, 501213, 491711, 820251, 602503, 826427, 569836, 759087, 486762, 658581, 365951, 437761, 652906, 422191, 878721, 641882, 474292, 709131, 527932, 504331, 658934, 516658, 725780, 870298, 575367, 461572, 554674, 711239, 354672, 572273, 615876, 531389, 591800, 925700, 744332, 764043, 661270, 442085, 700433, 575264, 527556, 647306, 962970, 778949, 662835]
17019F62835A09658O98822N9528m21564L23700J31457k31824J92868l36943K25843
17009G51545j34291O4443J01778j2017J28638N1397j70881K55310j253j54810
16999H79859k01773K81938j18619J31329p8660l1494l45135N00497m93209J19671
16989F44404J15361J19965l5194m3441K01845k16611J74320L9687J58274l06807
16979H51803l7558l72191N83494j15097p2286K49546k33065P1598Q1683N5251
16969A063178l53182L22291m28752L13479Q0604K10562j17903K72976n24892k0476
16959H17885M79089j29618J00977m8746k10867N1480k63489K95542J94674j77837
16949A109090R5461J62251r5871K07916l91012L1719k4009L59708l17764L56051
$$ y = [662835, 109658, 808480, 868008, 446444, 770144, 901601, 669777, 862645, 525702, 751545, 617254, 681697, 783475, 771458, 900096, 951493, 780612, 1035922, 1034669, 879859, 678086, 960024, 841405, 972734, 894074, 862580, 517445, 1017942, 524733, 644404, 759765, 879730, 844536, 801095, 1002940, 786329, 960649, 1000336, 1158610, 851803, 814245, 442054, 1025548, 910451, 838165, 1087711, 854646, 926244, 1007927, 1063178, 709996, 1032287, 603535, 917014, 997618, 1208180, 1090277, 1363253, 838361, 817885, 1296974, 1167356, 1268333, 1219587, 1008720, 1060200, 796711, 1092253, 1286927, 1109090, 1204551, 1366802, 1270931, 1478847, 1087835, 1119554, 1095545, 1455253, 1137489, 1493540]
16939A493540Q8776j03021p3058j4885K33682k86804J59395l15204P3636K46204
16929A502261l3512O9066N4002r0520K1771K1944j18948L32652j07725j3108n4334
16918A583549n5575K11886o9905O8800J52379k46913j13261K1451l998J47718
16908A696131K14320k8512l68944K24333J83681j6529r640j6701L20083l67140
16898A831082L27224j89194j98402j28548M39225O8730l31353K99911K15418j5950
16888B318143m94637M53122Q6413l07143L0122K34116R6348J58514K4346m3457
16878B555887r2148Q9008m413K16723l20422L79497N2737j76669J92230K1115
16868B913545M41815k86870j6965j84536l13930M87643j38324K06698J66302j14649
$$ y = [1493540, 1582316, 1479295, 1406237, 1391352, 1625034, 1338230, 1497625, 1182421, 1256057, 1502261, 1468749, 1537815, 1591817, 1501297, 1523068, 1545012, 1426064, 1758716, 1650991, 1637883, 1583549, 1527974, 1739860, 1669955, 1738755, 1891134, 1644221, 1530960, 1552411, 1548413, 1696131, 1910451, 1881939, 1512995, 1737328, 1921009, 1904480, 1894840, 1878139, 2198222, 1831082, 2158306, 1969112, 1770710, 1642162, 2081387, 2150117, 1818764, 2118675, 2334093, 2318143, 1823506, 2276628, 2363041, 2055898, 2086020, 2320136, 2416484, 2574998, 2599344, 2555887, 2463739, 2552747, 2548334, 2765057, 2444635, 2824132, 2876869, 2700200, 2892430, 2913545, 3355360, 3068490, 3051525, 2866989, 2553059, 3040702, 2902378, 3109076, 3275378, 3160729]
16858C160729k54117N47069l6160r8127K2528K8879J44730l003J12427J55038
16848C779993M0799r6300K73490j61368L72245l49418P2063P8281L72226j34173
16838D247838r3850N53374l91069M40885L17402m94413M23113j03949J25111K32619
16828E257061l26902O81627j44466M4600M0362J87636n0808L46574J11200l44431
16818E802453L14165R8525j08761P37362k56627L75585L88217l2425j82945N28081
16808G663630k56775K94498J60742Q1521L54567J79210J75636j86661Q38177l02633
16798I001912J70613l8312P50976K76575j64259L62493J41910N41375L56146K05887
16788A1605316L49858M69064j5968P56673P4048M98834K40778N32595K15165P2273
$$ y = [3160729, 2906612, 3453681, 3417521, 3319394, 3341922, 3370801, 3515531, 3512528, 3624955, 3779993, 3820792, 3724492, 3997982, 3836614, 4208859, 3859441, 3931504, 4009785, 4382011, 4247838, 4153988, 4707362, 4316293, 4757178, 5074580, 4580167, 5003280, 4899331, 5024442, 5257061, 4930159, 5611786, 5467320, 5511920, 5552282, 5739918, 5689110, 6035684, 6146884, 5802453, 6116618, 6215143, 6106382, 6843744, 6587117, 6962702, 7350919, 7318494, 7135549, 7663630, 7406855, 7701353, 7862095, 7943616, 8298183, 8477393, 8653029, 8466368, 9304545, 9001912, 9172525, 9134213, 9885189, 10161764, 9997505, 10359998, 10501908, 11043283, 11399429, 11605316, 11955174, 12424238, 12408270, 13164943, 13238991, 13737825, 13978603, 14511198, 14726363, 14798636]
16778A4798636N70992M07786R78325K68437L57240Q41772K63078M17794J263448
16769B0167508L95228P25876O40093M95727R07893Q27134Q99888R71007O98210
16760B6728564J173893J074635R10843J748226J179325J195601J458629J454606
16752C6924322J407146J805025J755627J525292K201914J855666K395458K527088
16744E2397538K269150K842613K578721L223608L004481L307240L396002L830234
16736G6849587L690739M093366M255667M553838M548084M878419M961675M932791
16728A12764166M861957N191502N080081N107811M258244M613206L824310L288580
16720A48989857L004007K477702J479470Q25829K87839n86638j784479j697196
$$ y = [14798636, 15369628, 15777414, 16755739, 17024176, 17381416, 18223188, 18486266, 18904060, 20167508, 20562736, 21288612, 21928705, 22424432, 23332325, 24159459, 25059347, 26030354, 26728564, 27902457, 28977092, 29887935, 31636161, 32815486, 34011087, 35469716, 36924322, 38331468, 40136493, 41892120, 43417412, 45619326, 47474992, 49870450, 52397538, 54666688, 57509301, 60088022, 63311630, 66316111, 69623351, 73019353, 76849587, 80540326, 84633692, 88889359, 93443197, 97991281, 102869700, 107831375, 112764166, 117626123, 122817625, 127897706, 133005517, 137263761, 141876967, 145701277, 148989857, 151993864, 154471566, 155951036, 156776865, 157064704, 156478066, 154693587, 152996391]
16712A52996391k823895l430428l847278m283610m240369n452702n020641n126990
16704A18770478n208394n008748n399438n076879m594333m949212m029624m547352
16696G9956498l942441l805132l675597l288191l126035k997372l174990k448338
16688E3498402k680854k086975k195463k576279j723138k173084j730234j539904
16680C6792471j555996j521330j391711j329912j320899j054170j384228p83015
16672B6451210r89004r50364j087271q17981q93828q02765n29543o91312j022587
16663A8666555k50232p82018m76388o03706o69620l69514q07296k05151m94790
16654A4007840l44074l87656n34033n68238j49237j5554o04875l16391l14996
$$ y = [152996391, 150172496, 146742068, 142894790, 138611180, 134370811, 128918109, 123897468, 118770478, 113562084, 108553336, 103153898, 98077019, 93482686, 88533474, 84503850, 79956498, 76014057, 72208925, 68533328, 65245137, 62119102, 59121730, 55946740, 53498402, 50817548, 48730573, 46535110, 43958831, 42235693, 40062609, 38332375, 36792471, 35236475, 33715145, 32323434, 30993522, 29672623, 28618453, 27234225, 26451210, 25462206, 24511842, 23424571, 22606590, 21712762, 20909997, 20380454, 19689142, 18666555, 18416323, 17634305, 17157917, 16554211, 15884591, 15515077, 14707781, 14502630, 14007840, 13663766, 13276110, 12742077, 12173839, 12024602, 12009048, 11404173, 11087782, 10772786]
16645A0772786l34441K10364p87866j05128m71153j27570k40311k5954m05956
16636H484771j88386k76217m163m17971O0015n12838J03142k84111p7127L82549
16626G269664n16809m32270J44728l47697L4128l80049J27903k31884j82711l46389
16616E138614r0114P4145k74211q76k98949L29605J50927k14659m33003P835K12884
16605D602198n04089o3239J29462k38718K7841O1441l34670J56187k15636J74597
16595C795374q6732m77601q633M19279j45582j796L6755j12737k99412P3775r6402
16584C096288j55065K28486r1641j49711l00089J96954J41198m11734J90054j60048
16574B584692N02013p14137j79118K80963j7224J50928l54902P3945j16406k8131
$$ y = [10772786, 10438345, 10648709, 9860843, 9755715, 9284562, 9156992, 8916681, 8890727, 8484771, 8296385, 8020168, 8016005, 7598034, 7658049, 7145211, 7248353, 6964242, 6887115, 7269664, 6752855, 6320585, 6465313, 6117616, 6151744, 5771695, 5899598, 5667714, 5485003, 5138614, 5048500, 5122645, 4848434, 4847558, 4548609, 4878214, 5029141, 4814482, 4381479, 4389314, 4602198, 4098109, 4034870, 4164332, 3925614, 3953455, 4014896, 3680226, 3836413, 3620777, 3795374, 3708642, 3231041, 3222408, 3641687, 3496105, 3494309, 3531064, 3418327, 3118915, 3192690, 3096288, 2941223, 3169709, 3078068, 2928357, 2628268, 2825222, 2966420, 2554686, 2744740, 2584692, 3086705, 2372568, 2193450, 2474413, 2457189, 2608117, 2253215, 2327160, 2210754, 2182623]
16564B182623n5773L09046p21107M95910k71886l2325J75103m4645k71601K5683
16554A791028P2038l9637k69388J70104p8988K71361P4962j29873l4635K7757
16544A854729j94796J0706L92397n36532m9122L12231k4046m4773l96349J73590
16534A498035J40598R5715k69111j09746j694n8576L9850k50916L68554K81149
16524A733858j90860M0948l01477J38750o1247k93668K4346K36986O4861j54692
16514A237805o7373K9729j96628J65679L78575n62177n0206j94271N56205n89489
16504G07849N52911q0688p9971J43841r6579j50896J891j24752J5396J27461l95647
16493F20816J77841M74684j83925k12715J06760j73772L12074m2631l47987Q4075
$$ y = [2182623, 2126850, 2435896, 1714789, 2210699, 1938813, 1906488, 2081591, 2036946, 1765345, 1791028, 1863066, 1823429, 1554041, 1724145, 1645157, 1916518, 1991480, 1861607, 1826972, 1854729, 1659933, 1670639, 2063036, 1526504, 1477382, 1789613, 1765567, 1720794, 1324445, 1498035, 1638633, 1734348, 1465237, 1355491, 1353797, 1295221, 1335071, 1084155, 1452709, 1733858, 1542998, 1583946, 1282469, 1421219, 1359972, 1066304, 1090650, 1327636, 1392497, 1237805, 1170432, 1200161, 1003533, 1169212, 1547787, 985610, 935404, 741133, 1297338, 707849, 1260760, 1180072, 1100101, 1243942, 1147363, 996467, 998358, 873606, 889002, 1016463, 620816, 798657, 1273341, 1089416, 876701, 983461, 809689, 1121763, 1079132, 731145, 815220]
16483H15220J0555J58681L9580k78932M6117q0638J89511N23j00571j85959L64672
16472I78759C55403L28325R4178r1206J50131n2049K7514j10282O9450j23080
16462F48384K15171j47175p0733R320q0751j69369m0854K32225J25618N6343k56705
16451E21474J82795L05471m37631K53702j81489P1627k54821Q3950K8558p3739
16441D99897K49074k80097O1717J10875N6441j44522r8518K78925B97519J66244
16431D63763j44662L96662k06017k5708Q3757K90431j07325C54982N79260D31907
16420A77713L78511N1036l7577B57232K16023j70146K30013J9858P1832k74448
16410C50364J81003K00505k48980J22941k57216O5514j23509J28181R536h4356
$$ y = [815220, 825775, 984456, 1024036, 745104, 791221, 710583, 900094, 900617, 800046, 614087, 978759, 355403, 683728, 777906, 686700, 836831, 784782, 812296, 702014, 771464, 648384, 863555, 716380, 645647, 654967, 574216, 404847, 363993, 596218, 721836, 778179, 521474, 704269, 1009740, 572109, 825811, 644322, 715949, 461128, 545078, 573636, 499897, 748971, 468874, 530591, 641466, 697907, 553385, 454867, 733792, 297519, 463763, 319101, 715763, 509746, 484038, 567795, 858226, 750901, 354982, 934242, 431907, 177713, 556224, 607260, 569683, 257232, 473255, 303109, 533122, 552980, 624812, 350364, 531367, 731872, 482892, 605833, 348617, 414131, 290622, 418803, 428339, -84356]
16399E29068j0917j18365Q0331j78295N16295A99489P6092j5702J77338L0308
16389D67525A10285J38093J44925Q479A82389L85817A03422M29656k6855D8616
16378A79115K24056J87032k50010j26838R5487q9711R8366I3356M16944j45632
16368C64668j37722M7730n6592Q3315o2511J05681A21595K90593j76592q2291
16358A53305K78067j00841p630j54120J48238K02357k53468n0667L21346k39100
16348B97487N3791J21497j4102B07563L75212B81369a02578D8940J38007M01583
16338E88530k36501q0696I6939p572K1986a80997I5134K92230j64659l3473L91173
16327E80405k08743n631j29445p4698J59387O2944b7435A22551n4655J86496K84561
$$ y = [529068, 518151, 399786, 480117, 301822, 818117, 199489, 275581, 259879, 437217, 467525, 110285, 248378, 393303, 401782, 182389, 568206, 103422, 533078, 506223, 48616, 179115, 403171, 590203, 340193, 213355, 308842, 219131, 317497, 93356, 510300, 364668, 226946, 274676, 218084, 301399, 238888, 344569, 121595, 412188, 235596, 153305, 431372, 330531, 322901, 168781, 317019, 519376, 265908, 215241, 536587, 297487, 351278, 472775, 458673, 207563, 582775, 281369, -102578, 48940, 186947, 588530, 352029, 271333, 96939, 89367, 111353, -180997, 95134, 387364, 222705, 189232, 580405, 371662, 366031, 236586, 161888, 321275, 384219, -27435, 122551, 67896, 254392, 538953]
16316E38953k17516j19434Q6037n2249k6422F4974J04657Q653j2908E5297J57328
16305B12625r6569J01017O1955K2322j21228C4883c8708B32879E6478N4971E4018
16293D53251a64472B09737G4692J60168J0231j13365M6706A8232K62075j03386
16283A76921J734B5567J02087a49506D61758H1593L08747A25147g6691D1232a8488
16271B070Q713O34313l17948g684B00507e0756B57837o9921H8347c65708A34935
16259I7192b01162C54805d3442B20923l2311E3691K37891A09427a80260Q5245
16249i5015B05961l9320j3244Q0896a26336c7778a3041B70225o1102a5787A51780
16237f8347A09995h4791D3839b14696B97275a0901A15761J76129A22014a91780
$$ y = [538953, 321437, 202003, 288040, 235791, 209369, 64974, 169631, 178284, 165376, 55297, 212625, 116056, 217073, 279028, 301350, 180122, 34883, -38708, 232879, 56478, 111449, 54018, 453251, -164472, 209737, 74692, 234860, 245091, 131726, 178432, 18232, 280307, 176921, 178655, 25567, 127654, -149506, 461758, 81593, 390340, 125147, -76691, 41232, -18488, 2070, 10783, 645096, 327148, -7684, 200507, -50756, 257837, 187916, 88347, -365708, 134935, 97192, -201162, 354805, -43442, 220923, 188612, 53691, 291582, 109427, -180260, -95015, 205961, 166641, 153397, 234293, -126336, -37778, -13041, 270225, 209123, -15787, 151780, -68347, 109995, -84791, 43839, -214696, 297275, -10901, 115761, 291890, 122014, -191780]
16226B12696o9109n1385C8005L42027a39439D8709L16267q7688m7359f3710A09102
16214D5913K56200a49196D7743g3761A20416I154J48427K01129g2186j4397A43723
16202A89180b3163A14981a61730B24810d1444D36410I3452g0819A66396k4452
16192A41944D8537J56996n1677M3118h3247D2240e1978A59943M8849D5739e14219
16180C53034a17092B77062A21832m6737J26125J4650I0360a88448R3126k08908
16170c04230E2644a58468B7769a77033B1172K14788g7690p4731E6139K03789n1648
16159B08280N5544D8935Q8557d4519B32093I1661i4801B38752a12510B45955a20941
16147a66578B00366E47J82502q2604C8537J10331B1072J32073a83020E7202J36936
$$ y = [212696, 143587, 92202, 38005, 380032, -139439, 48709, 364976, 277288, 229929, -63710, 109102, 45913, 302113, -149196, 47743, -73761, 120416, 9154, 157581, 358710, -72186, -86583, 143723, 189180, -23163, 114981, -161730, 224810, -41444, 436410, 93452, -70819, 166396, 141944, 48537, 205533, 153856, 196974, -83247, 42240, -51978, 159943, 208792, 45739, -514219, 353034, -117092, 277062, 121832, 75095, 201220, 215870, 90360, -188448, -95322, -304230, 52644, -158468, 27769, -177033, 21172, 235960, -77690, -152421, 56139, 259928, 208280, 263824, 48935, 137492, -44519, 232093, 91661, -94801, 238752, -112510, 245955, -120941, -166578, 200366, 547, 183049, 100445, 38537, 148868, 21072, 153145, -183020, 57202, 194138]
16136A94138q9773g2779C10493d9176E3776K14819D5918d3235B81799A12389a31040
16124B53161g441j4333D52286b802j54700r9946D49791G7748e0200a991A69556
16112a98439B48266b62973F6566a16409m5965D9957f0934B2393j929a0035A29976
16100h4602B69400A2768O931c5995B05670F3619b7778n7149p5357j0763c5516
16088C37007C4385a33353M2019o1469j84479a29156A20890j8425g8590k28631
16078c07221Q1558a10283n7542q2961p4276C57272A47621a43585f0127A28085
16067A5316f1500C10873D4897J49809o5606e8073A10445J82301H0315a52030l0749
16056a82779B5145J18884a03284j63793B17470b38611A55156h5114C10363c9291
$$ y = [194138, 104365, -72779, 310493, -49176, 53776, 268595, 45918, -43235, 281799, 112389, -131040, 253161, -7441, -21774, 452286, -2802, -157502, -257448, 449791, 77748, -50200, -1991, 169556, -198439, 248266, -262973, 66566, -116409, -162374, 49957, -60934, 22393, 20464, -10035, 129976, -84602, 269400, 12768, 19699, -35995, 205670, 63619, -27778, -84927, -160284, -171047, -35516, 337007, 34385, -133353, -91334, -152803, -337282, -129156, 120890, 102465, -78590, -307221, -225663, -110283, -167825, -250786, -325062, 357272, 147621, -143585, -60127, 128085, 15316, -61500, 310873, 44897, 194706, 129100, -58073, 110445, 292746, 80315, -152030, -182779, 25145, 144029, -103284, -267077, 217470, -238611, 155156, -85114, 310363, -39291]
16045a73883P0255M7041l602A5037a68932B56754I5004a62601C3882J6398e167
16033c8987J2398j29280g4930k32508H0761A8545L5217b2213h420j29025m1688
16022a79133a7898B32704b23746a04843G5386J1638J5753o653f3463G3193Q325
16011H1518P3033G3606g6532l06422A41730E9467b08203A16169a19953d4262j17662
16000a61924B03204a49446m1746O1595A56811a73241A43333B8347P189b87634
15989H4036a81418e0744B11722F3439c32472B46253M44657A47189J3513K9218
15979A89920q1373r127P0033a5323o72k72688e9113l60149A51903L43586a55761
15967D9040a35384I5468K48235I2492L5566n8086L983b52256n6212A62214k5409
$$ y = [-173883, -103628, -56587, -60189, 15037, -168932, 256754, 95004, -162601, 33882, 50280, -5167, -38987, -26589, -155869, -74930, -307438, 80761, 18545, 53762, -22213, -8420, -137445, -179133, -17898, 232704, -223746, -104843, 75386, 87024, 102777, 96124, -63463, 73193, 81518, 154551, 73606, -76532, -382954, 141730, 59467, -208203, 116169, -119953, -44262, -161924, 203204, -149446, -191192, -129597, 156811, -173241, 143333, 28347, 35536, -287634, 84036, -181418, -50744, 211722, 63439, -332472, 246253, 690910, 147189, 160702, 189920, 108547, 99420, 169453, -15323, -15995, -288683, -59113, -419262, 151903, 495489, -155761, 49040, -135384, 95468, 343703, 92492, 128058, 69972, 73955, -252256, -308468, 162214, 136805]
15956A36805m0053a9448j79951C6542d3294B06070A7271c03016i0322B58137F4332
15944e07814A97220h0661j37395Q5991F040J69028F9417h8508f115k89891O5667
15933b30339j2379P9132A04588e2814k03398A2977M9344b7893I5147A6043k513
15922A3530J43984b33510A0281J32917K6424n9384E2249a7433j26544D7407e9621
15910B25665I5130b3648j76724b5766j8808j02956C3562J27101c0231n6290B4175
15898A56215e4091j4981A62666c7834n5936D4666b4740D570J94559b01501c7215
15886b9028C54424A71478E0805a6433F531a11197P472M5267A42134f0177B06789
15874e160A08767k3396b22954A4686J87145A5463Q3620a80690A55041c7749q914
$$ y = [136805, 96752, -19448, -199399, 36542, -43294, 206070, 17271, -303016, -90322, 258137, 64332, -507814, 197220, -80661, -218056, -132065, 6040, 175068, 69417, -88508, -6115, -296006, -230339, -242718, -163586, 104588, -52814, -256212, 12977, 62321, -27893, 95147, 16043, 13530, 157514, -233510, 10281, 143198, 169622, 110238, 52249, -17433, -143977, 47407, -59621, 225665, 95130, -23648, -200372, -25766, -44574, -147530, 33562, 160663, -30231, -86521, 24175, 156215, -54091, -69072, 162666, -37834, -93770, 44666, -24740, 4570, 199129, -201501, -37215, -29028, 354424, 171478, 50805, -16433, 6531, -111197, -103725, -58458, 142134, -60177, 206789, -5160, 108767, 85371, -222954, 14686, 201831, 15463, 99083, -180690, 155041, -37749, -46663]
15863d6663l1197A3346e1914k20935I8136P7140i7055o4031j31375D9658B2041
15851a20347j18251C46954b613A74806q7360J21671a34441c4980B8231Q5909d941
15839A52054a48221b4077j61469l1744a9628B13277a70049j5898B1816b78188
15828h9489j4816a3229l2048R936F4903b04891b9960A95832o4709f3352j25424
15817a88776F5834a18561l2744A67963o4908c30404B3958a50626L734B57515b2727
15805H6853I069L37078d0388C7717b9321l3720k5489k98973a30108k6186f7528
15793G4732K30005C0093K44715a14908B0491Q3844k768c2350I492a18095G0344
15781e1341A28047a23054o0459A2704J40586a26126C6537a20071e5715E0598c5360
$$ y = [-46663, -77860, 13346, -51914, -272849, 98136, 175276, -97055, -161086, -292461, 49658, 22041, -120347, -238598, 346954, -2613, 174806, 87446, 209117, -134441, -34980, 28231, 114140, -4941, 152054, -148221, -24077, -185546, -217290, -19628, 213277, -170049, -185947, 21816, -278188, -89489, -104305, -13229, -45277, -35341, 64903, -204891, -29960, 195832, 131123, -63352, -188776, 65834, -118561, -151305, 167963, 103055, -330404, 23958, -150626, -146892, 257515, -22727, 86853, 9069, 346147, -40388, 37717, -29321, -63041, -88530, -387503, -130108, -156294, -67528, 74732, 304737, 30093, 274808, -114908, 20491, 104335, 101567, -32350, 9492, -118095, 70344, -51341, 128047, -123054, -183513, 12704, 153290, -126126, 36537, -120071, -55715, 50598, -35360]
15769e6543e924l75046b8871F3730L6899a52267D1472b86583i9A91788k9469D9939
15756A5233d69874A22311a16540o3579C10656C0874a04735B87364h5149C4277
15745F0364e5614B5920f651b177k49384i8890F5241e8614A461M9410a29717j6985
15733a46702F457L2180a11108a6603A6169a48197J5172A08044J39313b8471G5492
15721H7987a9370A64517a21729r8499o6337d2669B72780c26380f4462p887D9948
15709g0713n6266F3884h077A57768l1009h2338G8679a29322B86912f0943m28698
15698d89641a21780M7052j69466h1565A52562g9412B80235i268l3164E0880a53939
15686b1486k65241B192K96978a42905A78792F3574b54180P5820g652I1295k3249
$$ y = [-56543, -5924, -380970, -28871, 63730, 100629, -152267, 41472, -286583, -99, 191788, 162319, 49939, 15233, -469874, 122311, -116540, -180119, 310656, 30874, -104735, 287364, -85149, 34277, 60364, -55614, 25920, -6651, -2177, -251561, -98890, 65241, -58614, 1461, 50871, -129717, -146702, 6457, 38637, -111108, -16603, 16169, -148197, -133025, 108044, 247357, -28471, 75492, 87987, -19370, 164517, -121729, -220228, -286565, -42669, 272780, -326380, -64462, -72349, 49948, -70713, -126979, 63884, -8077, 157768, 126759, -82338, 78679, -129322, 286912, -60943, -489641, -121780, -74728, -244194, -81565, 152562, -79412, 280235, -9268, -42432, 50880, -153939, -21486, -286727, 2192, 299170, -142905, 178792, 63574, -254180, -178360, -7652, 91295, 68046]
15675F8046L5314b01771j5466R4133A59924J7142i0463k67311G4871a06005j23171
15664b29176B06602a89951b9076m4464j4273k0104q5722C9383L9394J0786b86655
15652A32186A0063a58318C80993g8273j02881b6421j93413B31386b29258A52217
15641b0315K322D9418b5791F2718b68753H3331c9004H3617d09892B3178J74019
15630A97197m0806c8832j4339A29319d17729b6969N128I6961J52126D082P8907
15619H2989d0209G941c15503a9531j42510F1041J12255F0063c17164R9092O1529
15608a56543A01839a37539D9457a20579B21446b7354A49512J5601B8350e9296
15597a43490B9695a65570A14465J70584l7754c54414A60698o7218a33743C05952
$$ y = [68046, 103360, -201771, -217237, -123104, 159924, 177066, -90463, -357774, 74871, -106005, -229176, 206602, -189951, -29076, -73540, -87813, -107917, -193639, 39383, 78777, 89563, -286655, 132186, 10063, -158318, 380993, -78273, -181154, -26421, -219834, 231386, -229258, 152217, -20315, -17993, 49418, -25791, 62718, -268753, 83331, -39004, 83617, -409892, 23178, 197197, 156391, -38832, -53171, 129319, -417729, -26969, -21841, 96961, 249087, 4082, 82989, -40209, 7941, -315503, -19531, -162041, 61041, 173296, 60063, -317164, -218072, -156543, 101839, -137539, 49457, -120579, 221446, -27354, 149512, 165113, 28350, -59296, -143490, 29695, -165570, 114465, 285049, 247295, -354414, 160698, 93480, -133743, 305952]
15586B1266J21586J03179a21897d6076k08821a20546d4157A29027B3549a39874
15575A98959f0274D7511e1143l58052a36464A87821l1000a51812H7670a24744
15564C1694b26579M9809j1068A59472c3858d612B07072b26627j6021K1282P5715
15553a45651f6709k4562j5517q6294h7702A96937E7070M710J88594f9696m8498
15542a18194o7684K1396A17785f546A07101D6705H699c05497J17856P9106H5013
15530e6708A25020c24723A17677d9211E9205J08865b45201c79A03469b60715D0358
15518B32611g3658j7438B98027c5809A4022c5173k57112f1398B63058c73192a21870
15506B42227B1223K409L540a39721A53727L2703B1251J01083a88497L7325A49741
$$ y = [21266, 142852, 246031, -121897, -46076, -254897, -120546, -44157, 129027, 23549, -139874, 198959, -60274, 47511, -51143, -409195, -136464, 187821, 156821, -151812, 87670, -124744, 31694, -226579, -176770, -187838, 159472, -33858, -4612, 207072, -226627, -242648, -221366, -145651, -66709, -91271, -106788, -193082, -87702, 196937, 57070, 61780, 250374, -69696, -118194, -185878, -164482, 117785, -6546, 107101, 46705, 8699, -305497, -187641, -108535, 85013, -56708, 125020, -324723, 117677, -49211, 59205, 168070, -245201, -379, 103469, -260715, 40358, 232611, -73658, -91096, 298027, -35809, 14022, -35173, -292285, -61398, 263058, -373192, -121870, 242227, 21223, 23632, 27172, -139721, 153727, 186430, 21251, 122334, -188497, -151172, 149741]
15494C2645L42120a4298E0692M25444A45702a10371c6805j71460k34917J83389
15484b59793a20308B62585b50944i3578E1766e8811j25208h3885k55230C12412
15473a50236A41043d3571j47731A06017o19I134Q9579c666k0421A1683J00633
15462A12316J3043m9470J77448H888J12193L16373a82349B55812J65559I454P636
15451A7090d09747E7080g2659n8125D5935J302J53284K46025j06374i6276B35904
15439b0417B1405N9912J5269C8618a2960j92948m6650P0576A2049K00673b6938
15427c7487P376f085B13952K5386f3935l946j3871C61216A10518b70901A1804
15415b80580f0986I8205h4831B38317F6514l208b07133e2031j63994F5823a73092
$$ y = [32645, 374765, -14298, 50692, 476136, 145702, -110371, -36805, -208265, -443182, -259793, -120308, 262585, -250944, -93578, 51766, -58811, -184019, -83885, -339115, 312412, -150236, 141043, -43571, -191302, 106017, 105398, 9134, 98713, -3666, -24087, 11683, 112316, 125359, 75889, 253337, 8888, 121081, 437454, -182349, 255812, 421371, 9454, 17090, -409747, 57080, -72659, -130784, 45935, 47237, 200521, 446546, 340172, -96276, 235904, -20417, 21405, 81317, 96586, 38618, -12960, -205908, -252558, -181982, 12049, 212722, -26938, -37487, -30111, -6085, 213952, 239338, -63935, -67881, -81752, 361216, 110518, -270901, 11804, -280580, -60986, 98205, -84831, 238317, 66514, 63306, -207133, -52031, -216025, 65823, -173092]
15403E6636a86542E8365L0762R0180p0189N481K663g2549k8307j25854f5760o6571
15391a32331A26750l8556O714F253J97179p9808J03263D67c9956m3416c0763l79846
15379d10609K749e283A4941A311L4430K93013a19976A0235M3039J07634a11082
15367d8150B12107a10799j3228A39823K16335a53910A15569a54760B44645a03367
15356E5493b67123A20642D990c06128A0141J53589o5442O6590a11420p1731K4250
15345a58901A7679j604a14253c1872C554K77272r5259b07952A76972a3705F9749
15333A75912O6193I9480a2025F5855J43516c97178G2336b9073p1602j04675B56547
15321g4559m2212a2966m1574C15445I8534a64462F5654J72604a2973A58780a19556
$$ y = [56636, -186542, 58365, 89127, 179307, 109118, 114599, 117262, -72549, -100856, -226710, -65760, -132331, 126750, 88194, 94908, 6253, 203432, 123624, 226887, 467, -39956, -83372, -30763, -410609, -407860, -5283, 14941, 1311, 35741, 328754, -119976, 10235, 53274, 160908, -111082, -48150, 212107, -110799, -124027, 139823, 356158, -153910, 115569, -154760, 244645, -103367, 55493, -267123, 120642, 4990, -306128, 10141, 163730, 98288, 164878, -111420, -183151, -158901, 17679, 16075, -114253, -31872, 3554, 280826, 185567, -207952, 176972, -13705, 69749, 175912, 242105, 99480, -12025, 65855, 209371, -397178, 72336, -29073, -100675, -205350, 256547, -74559, -116771, -12966, -54540, 315445, 98534, -164462, 65654, 238258, -12973, 158780, -119556]
15309b273l1870B95831a33887F6157c744D9395O2352c04817G9061c81109e3403
15297a34456a1222A18777m400a88071k9560A7572K52359E2416h9069A37488M4326
15286A81814J49507j63527o8110J3811h7832a3920j08124A08256d37859i5364
15275I5039a31458j450C0783J68918k887E2275N1741J43128A21687a00964M3957
15264e7007H3758J45972A02320K08932A53595K6507B923J86942j3867h3299B5861
15252A63905F2858L5052J35505K50140m3061R49399l46596J53075J54603F74920
15241A97704G0142a36358A01149J30285J3012C7380J24054G3425b11318B1064
15230b68296F3301O5459D9136h3347q0808d6686k9495q9077K9909E0771K90376
$$ y = [-2273, -34143, 295831, -133887, 66157, -3744, 49395, 111747, -304817, 79061, -381109, -53403, -134456, -11222, 118777, 114377, -188071, -217631, 17572, 269931, 52416, -89069, 137488, 181814, 331321, 167794, 99684, 113495, -87832, -13920, -122044, 108256, -437859, -95364, 95039, -131458, -132908, 30783, 199701, 196814, 52275, 104016, 247144, 121687, -100964, -57007, 83758, 229730, 102320, 311252, 153595, 180102, 2923, 189865, 175998, -83299, 25861, 163905, 62858, 97910, 233415, 483555, 440494, 1389893, 1043297, 1196372, 1350975, 674920, 197704, 70142, -136358, 101149, 231434, 244446, 37380, 161434, 73425, -211318, 21064, -268296, 63301, 128760, 49136, -83347, -164155, -46686, -76181, -165258, -135349, 50771, 341147]
15219C41147j69009c00644B81409q1711b21645a02045K8120j6537A77037A6933
15208h6513B77026I5389a66010L0611b4923C43043A00170k0757c69975b9902r9235
15197a29137D34677c1631A20175a33243N2365p6212B71820q6179a44070A90538
15186G6010M8396k1502J33591B711J88051O7599a2388k15799G0040e2537k41969
15175b94506h1503l42777J79780F1299i0675A21533a97954d1770B06223r8251
15165A07972j2603N0403a39522I9360b535C17823I8783b709H7690a12321N1490
15154f0831E9294l260B0697K33595a72618E4510J53968e8220m4532G0369r47i763
15141a42151A58527L33390j12857b40C59158j61658J43766H8341a7418D9371K0685
$$ y = [341147, 172138, -300644, 281409, 199698, -221645, -102045, -73925, -90462, 177037, 16933, -86513, 277026, 95389, -166010, -135399, -24923, 343043, 100170, 79413, -369975, -29902, -129137, 434677, -31631, 120175, -133243, -80878, -157090, 271820, 185641, -144070, 190538, 76010, 124406, 102904, 236495, 2711, 190762, 258361, -12388, -228187, 70040, -52537, -294506, -81503, -424280, -244500, 61299, -90675, 121533, -197954, -41770, 206223, 107972, 95369, 145772, -139522, 99360, -2535, 317823, 98783, -2709, 87690, -112321, -60831, 59294, 56034, 20697, 254292, -172618, 54510, 208478, -58220, -102752, 70369, 69422, -9763, -142151, 158527, 491917, 379060, -240, 359158, 197500, 341266, 88341, -17418, 49371, 70056]
15130G0056K17075j04152O6348F3183K66862b30654D2447b4337A50115B8599K4234
15119E2833J50226G9177K26127q7928c00499b6469F0249M89961B37349E5122M2171
15108I7293k4888J62169E9639J56650a17783G9610J45125J9038q6394a10033C83395
15096A05995N662e8947C08145b64383A41731i4810F0039a40647H6871a9774G1265
15084D17802d2155A39740J55679j10637l5032J05269a26840B3367K43572p1161
15074A95778f3135m8316d8411B23099e0581B67869i979M87E8346J24042J3688
15063A96076k1461E0413E753K372J08970P6501L378K76542A95331F7049E883K38464
15051B44347B3856a30903C52084c9283F605K34475o7920J05415a36212M3855B57423
$$ y = [70056, 287131, 182979, 249327, 63183, 330045, -230654, 42447, -24337, 150115, 28599, 52833, 203059, 79177, 305304, 217376, -300499, -26469, 60249, 550210, 237349, 55122, 97293, 72405, 234574, 59639, 216289, -117783, 79610, 224735, 243773, 157379, -110033, 383395, 105995, 111657, -58947, 308145, -264383, 141731, -94810, 60039, -140647, 86871, -19774, 71265, 417802, -42155, 139740, 295419, 184782, 149750, 255019, -126840, 23367, 266939, 195778, -63135, -111451, -48411, 223099, -50581, 267869, -9979, -9492, 58346, 182388, 196076, 174615, 50413, 5753, 8125, 117095, 193596, 196974, 473516, 195331, 67049, 5883, 244347, 23856, -130903, 352084, -39283, 6605, 241080, 173160, 278575, -136212, -92357, 257423]
15039C68733E7588J88425A04229j0037K8083a12381D9958K60744A21077L93274
15029E14351o5193j89507A10252O0483O028K93951i9214C21455i8951F4522K50226
15018C14748l9748j25688P2164k840a80199O8931B86850p7215C6789N56334A66313
15006A07471M02210j97881j286O9948p7362g702H2537L07786G2244K87184G4579
14994C87668j31245q7560L95418C1905J58678J47614j36129J28275K4606K6236
14984C81185G1577N37119B72402m777d2106B15596m8226g6459C96487A58185K27600
14973C85785J4755C8273M35427a67847F4740J46545q6062J464J92878c0292k9611
14962e9903F62064C6597N5228L89467H8351b53547B18720L17469B47632P7940
$$ y = [368733, 57588, 246013, 104229, 94192, 122275, -112381, 49958, 310702, 121077, 514351, 449158, 259651, 110252, 170735, 176763, 470714, -99214, 321455, -98951, 64522, 314748, 275000, 149312, 221476, 218636, -180199, -111268, 286850, 209635, 36789, 593123, 166313, 107471, 509681, 311800, 310514, 380462, 303100, -7702, 82537, 390323, 72244, 359428, 74579, 387668, 256423, 168863, 564281, 31905, 190583, 338197, 202068, 330343, 354949, 381185, 71577, 608696, 272402, 267625, -42106, 215596, 167370, -76459, 396487, 158185, 385785, 400540, 38273, 473700, -167847, 64740, 211285, 125223, 126687, 319565, -30292, -59903, 662064, 36597, 91825, 481292, 88351, -253547, 218720, 536189, 247632, 325572]
14952C25572A26395K42795A60139B4350K48474O4903J57968I4313A4720K52685
14942B67405k1670e6388C76981A47378K11138j53911J44653n0606J47209A12504
14931A83032J9989q265J55130j13250j1769K14M9717J03568j07530k3410j673
14920B45753j18380M56423k39951K2673K4310j01679a34958B14212K79378B34065
14909B49280a60534A64532p9455L00130k1217j58811Q1117p6046r7878F797M98255
14898E05052j95268n1608C9048e0227B88864J04771A57485K35958J38326j64211
14888C67558A78042J923o9060L78789k14091P9495j38575r0176L15644k13314
14878B28677b02546B75355J71854k18409J54334M6701j75177E6766K14488q6662
$$ y = [325572, 126395, 369190, 160139, 24350, 272824, 337727, 495695, 94313, 14720, 267405, 245735, -56388, 376981, 147378, 358516, 204605, 349258, 298652, 445861, 112504, 183032, 203021, 194756, 349886, 236636, 224867, 225081, 274798, 378366, 270836, 247426, 245753, 127373, 583796, 343845, 366518, 390828, 289149, -134958, 214212, 493590, 234065, 249280, -160534, 164532, 85077, 385207, 363990, 205179, 286296, 210250, 112372, 6797, 505052, 309784, 258176, 39048, -50227, 288864, 393635, 157485, 393443, 531769, 367558, 178042, 179965, 110905, 489694, 275603, 355098, 216523, 126347, 441991, 228677, -202546, 275355, 447209, 228800, 383134, 429835, 254658, 56766, 271254, 184592]
14868A84592n9239M24382B40431a4953B41020K70419B11682J08305j55730p8654
14858H5603l1803L68151o0175J45355j97511J17650K42790B90599d1956A61240
14847B84229A35878K08969o9136J92088j98937l1228l4270q893J5921M0083A01522
14835C26322r2600K75589B13495N6701J76404q8544I6897J38131L30163A95125
14824B42789K34004k15598K15350J07079q4605J1428j34619Q6762j39565Q4823
14814D07848m3278K67277k41742j76065K29977K30561j20962j36438K52969k09464
14804D60683j40935j19824K65528j04804J06150K37759Q4732A55725N01978D2326
14793E66433j35250Q3963J46174l22938K22785j6198K85127l79890M8749J73524
$$ y = [184592, 125353, 549735, 240431, -14953, 241020, 511439, 211682, 319987, 164257, 85603, 53800, 421951, 361776, 507131, 309620, 427270, 670060, 290599, -41956, 161240, 284229, 135878, 344847, 275711, 467799, 268862, 237634, 203364, 194471, 210392, 250475, 101522, 326322, 233722, 509311, 213495, 270196, 446600, 358056, 96897, 235028, 565191, 195125, 242789, 476793, 261195, 476545, 583624, 499019, 510447, 375828, 462590, 323025, 407848, 364570, 631847, 390105, 214040, 444017, 674578, 553616, 417178, 670147, 460683, 319748, 199924, 465452, 360648, 466798, 704557, 789289, 155725, 657703, 42326, 566433, 431183, 515146, 661320, 338382, 561167, 544969, 830096, 450206, 498955, 672479]
14783F72479P7971l48169M34750m18342o177j8908K10976j98382j35118K62537
14773E33617J7161k48131P2448L79680O0118J8063k72588J35014J2561l39754
14763C68189R2921j42634K75602J89498l83013K46047k28843L47197j62608j46401
14753D55955j36027L34718B67081L73829k6869J62839j3708j39167n6236j38903
14743D28866J19207o3063J41557q922k88296L60001k309j90741J31785m3832K2861
14732F07114m4742j41065J57247B50045K66907K59970j43997K8592k49796L39516
14722G51237j07206j99369L05266J01619k84595J30865J56088k62192k87040L62219
14712F66892k25411K07211r384K26288j76735R8931k02286B58000N23538l8581
$$ y = [672479, 750450, 402281, 837031, 418689, 412512, 393604, 604580, 406198, 271080, 533617, 550778, 302647, 375095, 754775, 814893, 832956, 560368, 695382, 707943, 368189, 461110, 318476, 594078, 783576, 400563, 646610, 417767, 764964, 602356, 455955, 319928, 654646, 267081, 640910, 614041, 776880, 763172, 624005, 567769, 428866, 548073, 485010, 626567, 617645, 329349, 689350, 687041, 496300, 628085, 584253, 607114, 562372, 421307, 578554, 250045, 516952, 776922, 632925, 661517, 411721, 751237, 644031, 444662, 749928, 851547, 566952, 697817, 853905, 591713, 304673, 666892, 441481, 648692, 639308, 865596, 688861, 787792, 585506, 258000, 781538, 742957]
14702G42957L64317D19094K7739R3932M05591j57734j84755J28553J09349j88885
14692F52884K67007J73348D70701N32286k99025N9747N1295j58401K57305k34959
14682F78949M18676n11806K84759Q5981K61655m55915J38919k06473L05247j78081
14672H21911K78450k20892j57227O00388m76868j8771K18232P6452l08097L13947
14662A127525j0388k16501k3185K23162o1527r4581J99375j98065j24940L6479
14652H57354R8157M50608k83991m37966O4861L35600j09237l9919K4051J40392
14642A099910M3325N9357K3113j74484K20391q8971K6478J31960k85639j80906
14632H74534J15485J40701p5259O2029l5030p123J12317j49394J01900O5297N071
$$ y = [742957, 1107274, 419094, 446833, 540765, 946356, 788622, 603867, 732420, 841769, 652884, 919891, 1093239, 470701, 1002987, 703962, 763709, 815004, 656603, 913908, 678949, 1097625, 585819, 870578, 956559, 1218214, 762299, 901218, 694745, 999992, 821911, 1100361, 879469, 722242, 1322630, 845762, 826991, 1045223, 1121675, 813578, 1127525, 1117137, 900636, 877451, 1100613, 1039086, 944505, 1143880, 945815, 820875, 857354, 955511, 1406119, 1122128, 684162, 749023, 1084623, 975386, 935467, 959518, 1099910, 1143235, 1202592, 1225705, 1051221, 1271612, 1182641, 1209119, 1341079, 1055440, 874534, 990019, 1130720, 1055461, 1117490, 1082460, 1075337, 1187654, 1038260, 1140160, 1205457, 1210528]
14621A210528Q4207l14509L40045K0285k68016K58862k86810J35024l02321K70543
14611A147838R8148l9523q2502M51880o58615N77048j30314l55627L83985K72464
14601A664782m73182K95950j71511J553J54237j68318R9410O2964J91000m48713
14591A208172M69509l4648k6835M6702N4165m16291K60871K97334k15538J06860
14581A750301l10687L29425j13718J99932k4689j04710K22501q8102p5208k10621
14571A574424L22205N2325J16819l13806M97027k64541L53208k54607M0594J14344
14561B237992K03171k68595L46973K55578j54811k12315P72623J48118j02168
14552C226566N07166K89473J198830J789207M868671Q177295J9170138J993861
$$ y = [1210528, 1294735, 980226, 1320271, 1340556, 1072540, 1331402, 1044592, 1179616, 877295, 1147838, 1245986, 1206463, 1123961, 1575841, 917226, 1494274, 1363960, 1008333, 1392318, 1664782, 1191600, 1487550, 1316039, 1317592, 1471829, 1303511, 1402921, 1465885, 1656885, 1208172, 1677681, 1643033, 1616198, 1662900, 1717065, 1300774, 1561645, 1858979, 1643441, 1750301, 1439614, 1769039, 1655321, 1855253, 1830564, 1725854, 1948355, 1860253, 1785045, 1574424, 1896629, 1948954, 2065773, 1751967, 2248994, 1984453, 2337661, 2083054, 2123648, 2237992, 2441163, 2172568, 2519541, 2775119, 2620308, 2407993, 3180616, 3328734, 3226566, 3733732, 4023205, 5222035, 7011242, 11879913, 20057208, 39227346, 41221207]
14544D1221207A9235201I484074D491176j786538n24871m72968N0861r1391k84202
14535A382067j3111L10954J43398M8280n6615J01866l0517k05075L57155J64011
14525B202413m38631M43325O8992j59368J48251j681K16846l8315k15901k91229
14515A934702M47319k54628M20550j42332q717J61072L4258k23505J43682m0234
14505B472167J18986R7383K0401j44387K82333j01616K52578N5410l04113j08737
14495B640405K45544j09902J39223L11772j96969j08712L01861j16653k5264J13687
14485C194992N5325L49425j77422K63103l07581j63988N04742N4445N0570k04596
14475C619015k66216L84016M46876n70609l01541O90092j10079p3242l76349O74419
$$ y = [41221207, 19235201, 9484074, 4491176, 2704638, 2179767, 1706799, 1757660, 1666269, 1382067, 1368956, 1679910, 1823308, 1871588, 1814973, 1916839, 1886322, 1681247, 2038402, 2202413, 1763782, 2207107, 2276099, 2116731, 2264982, 2263301, 2480147, 2441832, 2225931, 1934702, 2382021, 2127393, 2547943, 2405611, 2396894, 2557966, 2592224, 2368719, 2512401, 2472167, 2591153, 2688536, 2708937, 2564550, 2846883, 2745267, 2997845, 3053255, 2749142, 2640405, 2885949, 2776047, 2915270, 3227042, 3030073, 2921361, 3223222, 3106569, 3081305, 3194992, 3250317, 3599742, 3422320, 3685423, 3377842, 3213854, 3718596, 3773041, 3823611, 3619015, 3352799, 3736815, 4183691, 3613082, 3311541, 4001633, 3891554, 3818312, 3441963, 4116382]
14465D116382N4661p3613j21568O3014M8084K57418R0091j76481M42344l29088
14455D371244L0255N11031j77758J04107R1238L004J20058q2666J33711K197K91965
14444E398386k55134L6959p5016K12298L0905M09767J09969l78879J52258M42958
14434F084471O7471k28306j04393N23462o5502K9722K04273K2140n0511L08450
14424F791277J84189j09153j89219L53765M3088L77886k65358O41387j38168k65181
14414G424513M99209k58225M55036J93781K25857J9020l3007j19422M57972r8967
14404H765767J13356L93516j13802J70893L66044j23375M93716K29041o9490J47838
14394A0373504J67959L17703K66633l45091M00729L36167j23483O84662J23619
$$ y = [4116382, 4171043, 4097430, 3975862, 4038876, 4086960, 4344378, 4434469, 4257988, 4700332, 4371244, 4401499, 4912530, 4734772, 4838879, 4930117, 4933121, 5053179, 4970513, 5104224, 5106421, 5398386, 5143252, 5180211, 5105195, 5317493, 5348398, 5758165, 5868134, 5489255, 5641513, 6084471, 6151942, 5923636, 5819243, 6342705, 6277203, 6306925, 6511198, 6533338, 6482827, 6791277, 6975466, 6866313, 6677094, 7030859, 7073947, 7451833, 7186475, 7827862, 7689694, 7424513, 7923722, 7665497, 8120533, 8314314, 8540171, 8559191, 8526184, 8406762, 8864734, 8765767, 8879123, 9272639, 9158837, 9329730, 9695774, 9572399, 10066115, 10295156, 10225666, 10373504, 10541463, 10859166, 11125799, 10780708, 11181437, 11517604, 11394121, 12078783, 12202402]
14385A2202402J72968J10745N36697j43164M36829L67315j11950L21400L04785
14376A4198027J1156N07759L33998L2768J066768J34689n352L93760N29177J51517
14366A7354267M86498J40168L58829L23749O11697L07999M66883L03710Q28216
14357B1182016K52472N54636K89275Q71002N19474L78983O98961N30957Q04973
14348B6082749O39630O84023M83824O95509N72474R34793R80279P57340N98773
14339C2429394J074761Q51749R21814R41154Q05094J493684J296976Q59927J343562
14330D2018115Q55839J599361J301001J730691J312130K046282J398132J640681
14322E3902232J953045J662715K588885K080953J869219K470122K625770K664522
$$ y = [12202402, 12375370, 12486115, 13022812, 12879648, 13316477, 13683792, 13571842, 13893242, 14198027, 14209183, 14716942, 15050940, 15083708, 16150476, 16285165, 16279813, 16673573, 17202750, 17354267, 17840765, 17980933, 18339762, 18663511, 19275208, 19583207, 20050090, 20353800, 21182016, 21434488, 21989124, 22278399, 23149401, 23668875, 24047858, 24746819, 25277776, 26082749, 26722379, 27406402, 27890226, 28585735, 29158209, 30093002, 31073281, 31830621, 32429394, 33504155, 34355904, 35277718, 36218872, 37023966, 38517650, 39814626, 40674553, 42018115, 42873954, 44473315, 45774316, 47505007, 48817137, 50863419, 52261551, 53902232, 55855277, 57517992, 60106877, 62187830, 64057049, 66527171, 69152941, 71817463]
14314G1817463K610650L003857L002820L035822L428934M106822L499943M006249
14306I8512560M205005M784037M406911N516112N108098O240509N828788O363920
14298A40965940P077220P498292P539933P981859Q935661R224542R940750J0169820
14290B09334017J1161907J1599509J2023186J2510942J2698716J3515318J4229757
14283B97073352J4034200J5133066J5077016J5110497J4819302J4447828J3925136
14276C99620397J3238012J1612576R361575M220302O26633L16814L63074k83762
14268D39075621j366421l047282m817413q319448j0362919j2323682j4029750
14261C84808706j4703331j5098351j5388381j5444450j5703659j5432047j4740152
$$ y = [71817463, 74428113, 77431970, 80434790, 83470612, 86899546, 91006368, 94506311, 98512560, 102717565, 107501602, 111908513, 117424625, 122532723, 128773232, 134602020, 140965940, 148043160, 155541452, 163081385, 171063244, 179998905, 189223447, 199164197, 209334017, 220495924, 232095433, 244118619, 256629561, 269328277, 282843595, 297073352, 311107552, 326240618, 341317634, 356428131, 371247433, 385695261, 399620397, 412858409, 424470985, 433832560, 438052862, 438679495, 438996309, 439359383, 439075621, 437709200, 434661918, 429844505, 421525057, 411162138, 398838456, 384808706, 370105375, 355007024, 339618643, 324174193, 308470534, 293038487, 278298335]
14254B78298335j3655630j2494908j3439609j2184259j1868774j0882271j0247831
14247A93525053j0250764q750983q689247p741540p383683p770154o490400o453334
14239A29994948o156764n105928n370256m926155n128918m154182m293490l711158
14231I1148097l311882l404365l711567l171402l331809k468916k681034k656285
14223F6410837k389565k318160j982226k037243j953440k094819j877406j580163
14215E0177815j381613j600387j277905j432511j583534j435334j056576j192777
14207C9217178o80462r48992j426871j074646q75734r73288q41866r03588m60792
14198C1030939j138262o11764q74214q00866m70149q21001o39437l91087p81759
$$ y = [278298335, 264642705, 252147797, 238708188, 226523929, 214655155, 203772884, 193525053, 183274289, 174523306, 165834059, 158092519, 150708836, 142938682, 136448282, 129994948, 123838184, 118732256, 113362000, 108435845, 103306927, 99152745, 94859255, 91148097, 87836215, 84431850, 80720283, 77548881, 74217072, 71748156, 69067122, 66410837, 64021272, 61703112, 59720886, 57683643, 55730203, 53635384, 51757978, 50177815, 48796202, 47195815, 45917910, 44485399, 42901865, 41466531, 40409955, 39217178, 38536716, 37587724, 36160853, 35086207, 34210473, 33237185, 32395319, 31491731, 31030939, 29892677, 29280913, 28406699, 27605833, 27135684, 26314683, 25675246, 25284159, 24502400]
14189B4502400q71580n07790j39515q65758l03337p25435m37227m82755L6410
14180B0205413o59563k95154o40317k30695j91782n87220k06770l53690l05735
14171A6734487n29018o18992o6356J38837q35532k31306M185k11029l39321k51487
14161A3794468j75719n23854k9167k71089j10715j89564j43493m39489j47812
14152A1763566k50922k02458l18618J41925l02764l4381l02499m89805K76877
14143A0280921l20102L5172k77376j05343j50839l32575K78545k4832l28992m98466
14133H556113k42142P3905q2141l31701K54468j12509k06362N0692j27670r8159
14123G734494m90719O64827l41476l53124P5764o3716m20097K72918m10567j03532
$$ y = [24502400, 23630820, 23123030, 22983515, 22117757, 21814420, 21088985, 20651758, 20169003, 20205413, 19545850, 19250696, 18610379, 18379684, 18187902, 17600682, 17393912, 17040222, 16734487, 16205469, 15586477, 15520121, 15658958, 14823426, 14592120, 14596305, 14385276, 14045955, 13794468, 13618749, 13094895, 13065728, 12794639, 12683924, 12494360, 12350867, 11911378, 11763566, 11512644, 11310186, 10991568, 11133493, 10830729, 10796348, 10493849, 10004044, 10280921, 9960819, 9995991, 9718615, 9613272, 9462433, 9129858, 9408403, 9383571, 9054579, 8556113, 8313971, 8387876, 8305735, 7974034, 8228502, 8115993, 7909631, 7960323, 7832653, 7734494, 7243775, 7908602, 7567126, 7214002, 7289766, 7226050, 6805953, 7078871, 6668304, 6564772]
14113F564772N8586j05589j11524J90633k07848k32791k94014N90713l56736O1995
14103F158197l75576Q3162j67105J19032r5228j52686O0946j65792m38150J57839
14093E184639o4277q7554n9916j6303j63682R9634m76313N50933j80179r7535
14083D689447R2988k1126k10856l85747K69847K2374k43015K65384M4464j08849
14073D414911m32516L77303j41237j58536j93322J07591k03262J78177j21739
14064C827370q8035J14502K04631k51841K11953k38102k8397K2531k26280J09011
14054C657343N3408k03195J23829J48231m07853J1078k98542L5156o8730k16993
14044B833732L56893J62695l63810l5345J22561k44055J02736J16766n46695K62684
$$ y = [6564772, 6623358, 6517769, 6406245, 6596878, 6389030, 6156239, 5862225, 6452938, 6096202, 6158197, 5782621, 5865783, 5698678, 5817710, 5722482, 5569796, 5630742, 5464950, 5026800, 5184639, 5120362, 5032808, 4972892, 4956589, 4792907, 4892541, 4416228, 4967161, 4786982, 4689447, 4782435, 4761309, 4550453, 4164706, 4434553, 4456927, 4213912, 4479296, 4523760, 4414911, 3982395, 4359698, 4218461, 4059925, 3866603, 3974194, 3770932, 3949109, 3827370, 3739335, 3853837, 4058468, 3806627, 4018580, 3780478, 3752081, 3774612, 3548332, 3657343, 3710751, 3507556, 3631385, 3779616, 3371763, 3382841, 3084299, 3119455, 3050725, 2833732, 3190625, 3353320, 2989510, 2954165, 3076726, 2832671, 2935407, 3052173, 2505478, 2768162]
14034B768162n1680J96579j34292L64553k7938j47806o2293K96781p23414p1930
14024B406722O69476l47662j42742K5407k57573J66189M0753O9930j35821k15287
14014B279392K40532k47310n5755L71758j78401l7142j33036j20848L77806k69014
14004B227982Q1433j93899j32510j44434L13066k93121M41823Q393n28159L66960
13994B147534j52736r4030K99227K8022K31957J051301L023315O920421J8846090
13985C2301101J0836985j8103748A2415314n110357k289795p39188q16150l66437
13977C093387k61252k3582J72724l21285l25342J33996M3048k63138o7972R3609
13967B274193j77221J04138J75557l12724P1542Q6919k76867K46122r5910j99383
$$ y = [2768162, 2716482, 2913061, 2778769, 3143322, 3115384, 2967578, 2905285, 3202066, 2478652, 2406722, 3076198, 2728536, 2585794, 2611201, 2353628, 2519817, 2560570, 2630500, 2494679, 2279392, 2519924, 2272614, 2216859, 2588617, 2410216, 2373074, 2240038, 2119190, 2496996, 2227982, 2309415, 2115516, 1983006, 1838572, 2151638, 1858517, 2300340, 2308733, 1780574, 2147534, 1994798, 1900768, 2199995, 2228017, 2459974, 3511275, 6534590, 13455011, 32301101, 43138086, 25034338, 12415314, 7304957, 5015162, 4275974, 3459824, 3093387, 2832135, 2808553, 2981277, 2659992, 2334650, 2468646, 2511694, 2248556, 2180584, 2274193, 2096972, 2201110, 2376667, 2063943, 2135485, 2222404, 1945537, 2191659, 2095749, 1896366]
13957A896366K08826j39703K66802k21153m14084K8488J39606L29570l88906L57395
13947B063207k57049K43469k39153k72888j20835L71210j10922j47672L85663
13938A915030r6287l58843K83711n4300m0012j3299N1347r326k56669L33243m07545
13927A347050J88514k45038J46631L87240k20054k76645J07899P3585k33862J90215
13917A465535K12383l18709m1231M18099n41368K46894n05l50901L86578r2293
13907A384482p834k13719J52506k20089J69601K03902P1641l27558J03043q3015
13897A232960O1127l1998J26644l26858K78581k90967M74445m13191P4021q4194
13887A100570M9589L6472l1728l21362J71096k05834L71231J96032j47920j00114
$$ y = [1896366, 2105192, 1965489, 2232291, 2011138, 1597054, 1625542, 1765148, 2094718, 1705812, 2063207, 1806158, 2049627, 1810474, 1537586, 1416751, 1787961, 1677039, 1529367, 1915030, 1818743, 1459900, 1743611, 1689311, 1649299, 1636000, 1687347, 1678021, 1421352, 1754595, 1347050, 1535564, 1290526, 1437157, 1824397, 1604343, 1327698, 1435597, 1509182, 1275320, 1465535, 1677918, 1359209, 1317978, 1736077, 1194709, 1441603, 1441098, 1090197, 1476775, 1384482, 1376648, 1162929, 1315435, 1095346, 1264947, 1468849, 1540490, 1212932, 1315975, 1232960, 1294087, 1262089, 1388733, 1061875, 1340456, 1049489, 1523934, 1110743, 1184764, 1100570, 1150159, 1186631, 1154903, 833541, 1004637, 798803, 1170034, 1366066, 1218146, 1118032]
13877A118032n2472l24227K55806K17064J56197j94084k35327O7711j95146O56350
13867A469904o76675R7313k15741K47990k10809J26543J0996R9817j30038L03695
13857A122995O676k07159Q8784J1720K58788R0453n19889J54871O1657k99212
13847G69684L6391K03736l953J63082m49675K07016o9914M09076j04500k18197
13837I42746l11870L65091P0969l0764j33713O1995j89861M0125Q7338j2746K66418
13826A155728j13000r5964j42107j53031L08498j7446k78227J07998p4781J20533
13816H18201o9869K86303m07339J19674k33392M35796j26817K08541j21849j57335
13806G51914L34607k98109K29119l29961N4779O4181L27199k71328M7532k30586
$$ y = [1118032, 1065560, 741333, 997139, 1214203, 1370400, 1176316, 940989, 1008700, 813554, 1469904, 793229, 890542, 674801, 922791, 711982, 838525, 849521, 949338, 819300, 1122995, 1129671, 922512, 1011296, 1023016, 1281804, 1372257, 852368, 1007239, 1068896, 769684, 806075, 1009811, 1005858, 1168940, 719265, 926281, 856367, 1265443, 1160943, 942746, 630876, 995967, 1066936, 1036172, 902459, 964454, 774593, 814718, 902056, 889310, 1155728, 1042728, 946764, 804657, 651626, 960124, 942678, 664451, 772449, 697668, 818201, 748332, 1034635, 627296, 746970, 513578, 949374, 822557, 1031098, 909249, 751914, 1086521, 788412, 1017531, 687570, 742349, 806530, 1133729, 862401, 909933, 679347]
13796F79347M41009D74477L64918D10183P22904j61990k44381J48054j36071j13175
13786F25524L34639l84865O9659J93392k32615J09922J32141n0711K3088j61705
13776F58469K12408m04608L22606J19749l03198K51773l42924L22070j39668n9374
13766F37303N3827M4822j88329J45092N3841J07271l03914K3791J00708o2837
13756F11575J36198P3633L7810l69327j09217L49695l927k25413K090K14142J22731
13745H39990k77502M01861B52275N84790k16406j47565K84861l3004N7497k92265
13735D90183K43457j24901K1218Q7411m7620q8019L6776O8646C03302J52095L01862
13724G57259C55761j52387J16142K62065M3456J16190j79919P7588k37154L65406
$$ y = [679347, 1120356, 474477, 839395, 410183, 1133087, 971097, 726716, 874770, 738699, 625524, 960163, 575298, 644957, 838349, 605734, 715656, 847797, 797086, 820174, 658469, 870877, 466269, 788875, 908624, 605426, 857199, 514275, 836345, 696677, 637303, 691130, 735952, 547623, 692715, 746556, 853827, 549913, 573704, 674412, 611575, 747773, 821406, 859216, 489889, 380672, 730367, 726440, 501027, 503117, 717259, 839990, 562488, 964349, 252275, 837065, 620659, 473094, 757955, 724951, 782448, 490183, 733640, 608739, 629957, 717368, 669748, 581729, 618505, 687151, 303302, 455397, 757259, 355761, 203374, 319516, 581581, 625037, 741227, 561308, 638896, 401742, 767148]
13714G67148m8207K7316B72138M79100j93154k9923j65238K35305k51247K18274
13704E65255j62271B00105M29679k04929k7575L9884A96614O08030l62315q1785
13694C60544M61390C70899K84652j70196k01933M57221L6664l68254K01370j0030
13684F00393k02659K55159j89303R181K37186j71363j32181R7977J02165l1206
13674E75349j1537k47535J04246K61831k53166J00177R9660j76986K627N2373
13664E07039B19922J85475K24166C11716M49688p8345n7231A65725O92512l53529
13654E04708A52932L12331K86973A56704L49878k40984Q6624K60832L3604j88855
13644D57803B15989J61300J61778j62620m8182R2551j31843R8342k0058l1062
$$ y = [767148, 718941, 746257, 272138, 751238, 558084, 528161, 362923, 598228, 346981, 565255, 402984, 200105, 629784, 424855, 397280, 437164, 196614, 804644, 442329, 360544, 821934, 370899, 655551, 485355, 283422, 740643, 777307, 409053, 610423, 600393, 397734, 652893, 463590, 472771, 709957, 538594, 406413, 504390, 606555, 575349, 563812, 316277, 420523, 682354, 429188, 529365, 629025, 452039, 454666, 507039, 219922, 405397, 629563, 311716, 761404, 683059, 625828, 165725, 858237, 504708, 152932, 465263, 752236, 156704, 506582, 265598, 352222, 613054, 646658, 457803, 215989, 377289, 539067, 376447, 328265, 420816, 288973, 387315, 367257, 336195]
13634C36195J50787N7369A1287K61772K44409j30435n2063J19683l9982H3143
13623A19595M99745B70017J27186n2655j24152K337H0275K72252j06349O03563
13613H49741A46766O42737k47973j80381J03281p4819o9750K11234k32012j40877
13603A58206K47302J33543j93233j34485J87764m1997K61743j57376q6356n6095
13593C19016J33884A39417a598D05222p9214J95689B30616N4345J35023C1821
13582C63379D146M46232k20622A5500K37923B3464N2511L61314j32656j15033
13572A89600J23191J7067J83872C1164J75155J87415j85263L15747A47902K52891
13562D00793A89612L36343A32527K89919J10990k34494J90950M0175B58437M4811
$$ y = [336195, 486982, 544351, 11287, 273059, 517468, 387033, 334970, 454653, 414671, 83143, 119595, 619340, 270017, 397203, 344548, 220396, 222733, 80275, 352527, 246178, 849741, 146766, 789503, 541530, 361149, 464430, 389611, 319861, 531095, 299083, 158206, 405508, 539051, 345818, 211333, 399097, 357100, 618843, 461467, 375111, 319016, 452900, 139417, -1598, 405222, 326008, 521697, 230616, 284961, 419984, 31821, 363379, 4146, 450378, 229756, 15500, 253423, 23464, 75975, 437289, 304633, 189600, 312791, 329858, 513730, 31164, 206319, 393734, 208471, 524218, 147902, 400793, 189612, 525955, 132527, 422446, 533436, 298942, 489892, 530067, 258437, 303248]
13552C03248O2520k2248R4104j4277l1495j175N6474A24205O00954A21151L73333
13541D94484A09542J65765K05074A6663M50292j53652I3306L47705A36711J36231
13531B72942K34689A24267K99772n3090E8180L06741Q6111k13999K38473B21616
13520A20741L03196n3092j534K96748A8535K55420L5498j02169R6888K3285j798
13509C25659L49522k76140l8039M1621m1250k3157A61451m7570L10852c2931B56164
13497B09927I6065l2251L33632K8248B07388M8981J30924o5316j15734I8696J91301
13486B89997j19446J03519R4042A02373L9084R6855Q8211O3059J62064J14787
13476F66433B87236h191C10693k389J02928I7785L50367f4655B35765k4031K68662
$$ y = [303248, 365768, 343520, 437624, 423347, 391852, 390677, 447151, 124205, 725159, 121151, 494484, 109542, 275307, 480381, 16663, 466955, 313303, 93306, 441011, 136711, 272942, 507631, 124267, 424039, 370949, 58180, 364921, 451032, 237033, 475506, 221616, 120741, 423937, 370845, 369311, 666059, 18535, 273955, 309453, 207284, 304172, 327457, 325659, 675181, 399041, 361002, 402623, 361373, 338216, 161451, 113881, 424733, -32931, 256164, 209927, 96065, 63814, 397446, 425694, 207388, 256369, 387293, 321977, 206243, 98696, 289997, 170551, 274070, 368112, 102373, 141457, 238312, 326523, 389582, 551646, 666433, 287236, -8191, 310693, 308304, 411232, 97785, 448152, -64655, 235765, 211734, 480396]
13465D80396p0267F5439J13518m9914j828R6778J26484J20892k08023J51945j9999
13454C95292I8509b56009J11684B28162J61959A49172C5306L36360J07462r7119
13444C82009B2877L60784n4036O4068j17612j05267n1136J35583k4070b6504C56266
13432C04347M6166A47144P4818K13122c034D55299L52j20923o3612n4491a58883
13420A41143Q4829d3820B68770J57134k01229K41957B11249R8396A38399K66311
13410D04710A9735M8258J47484j06466L33146Q7173B01179g5000D5822N2789J44286
13399B42897G3382j151a21748D23103N1199q469D4578K45666j44741l9289h5519
13387B57875J75311B11837Q5890Q2399q6969A40232P2554o3377g1301e279G42
$$ y = [480396, 410129, 65439, 178957, 129043, 127215, 223993, 350477, 471369, 263346, 415291, 395292, 98509, -256009, -144325, 228162, 390121, 149172, 35306, 371666, 479128, 382009, 22877, 383661, 329625, 393693, 276081, 170814, 119678, 255261, 231191, -26504, 356266, 304347, 350513, 147144, 221962, 435084, -3034, 455299, 455651, 334728, 271116, 216625, -158883, 141143, 225972, -43820, 268770, 425904, 224675, 466632, 211249, 309645, 138399, 404710, 19735, 67993, 215477, 109011, 442157, 529330, 201179, -75000, 45822, 98611, 242897, 73382, 72231, -121748, 423103, 474302, 465833, 44578, 290244, 145503, 106214, -85519, 257875, 433186, 211837, 297727, 380126, 293157, 140232, 212786, 149409, -71301, -5279, 742]
13375a4773B50052a03698B68700L33538A41491n7955J62187A4607K88336q6169
13365B16774J98980j63409L31210k25109L756k2784F0941N7219O1072J74253j707
13354C51778j48480K37160j31735j01120e5145J703D00444n1748A27289K37072
13344C64361r0953J37996J13539k10527I7904Q0618J70945G2972J55673l960d2155
13332A93637J45755A6019J80073J61917H0562h0281B68362K4240L9156G9427K52788
13321C32215A27815J88412Q3825n4099j49957J21231J32426m7984I5990J77549
13311B73539J85761a57610d6770I7787m7427h7163A03434L2754L39824H9564C9702
13299a1561C87489A73600J17207l4882m4607J86898j57264L7135r7055a98005
$$ y = [-14773, 250052, -103698, 268700, 602238, 141491, 83536, 245723, 14607, 302943, 216774, 415754, 252345, 583555, 358446, 362202, 339418, 60941, 118160, 179232, 353485, 351778, 203298, 440458, 308723, 207603, -55145, -53442, 400444, 348696, 127289, 364361, 273408, 411404, 524943, 314416, 97904, 178522, 349467, 72972, 228645, 224685, -42155, 193637, 339392, 16019, 196092, 358009, 80562, -80281, 268362, 292602, 331758, 79427, 332215, 127815, 316227, 400052, 345953, 195996, 317227, 449653, 401669, 95990, 273539, 459300, -157610, -46770, 97787, 50360, -87163, 103434, 136188, 476012, 89564, 39702, -11561, 387489, 173600, 290807, 255925, 211318, 398216, 240952, 278087, 181032, -198005]
13288A78374J20965a07484D39407a17854A20923J87474K17416e1295A49859J22546
13278B72405c5352B32579h0929F7310M6704g5933C13068I5224L70795F1639d7330
13266B4578K32064r2138m5349K7167K89048A28745j8022K46128a45220A33285
13255B1170L79576I6393J0490b6969B17012n7772J18216q2038J07986j41622A3165
13243f339C22346I5583b51959f2331A17830J04659a54068A46965j3444L9204a32
13231C66062e4837B44723a02043A85074e8145E3132L156L17369A79961L5701I0912
13219B4424K69594j07032B2241R4321M768K32761c0415A59636d7610j06946M3395
13208a11161d3012B8329b29832b4705B04943l1686L5909K04326A67862L6000F6930
$$ y = [178374, 299339, -107484, 439407, -117854, 120923, 308397, 525813, -51295, 149859, 272405, -35352, 232579, -80929, 67310, 114014, -75933, 313068, 95224, 466019, 61639, -47330, 24578, 256642, 164504, 119155, 146322, 435370, 128745, 110723, 356851, -145220, 133285, 21170, 400746, 96393, 106883, -26969, 217012, 159240, 277456, 195418, 303404, 161782, 13165, -6339, 322346, 95583, -251959, -62331, 117830, 222489, -154068, 146965, 133521, 172725, -132, 366062, -54837, 244723, -102043, 185074, -58145, 53132, 56288, 373657, 179961, 215662, 90912, 24424, 294018, 186986, 22241, 116562, 121330, 354091, -30415, 159636, -47610, -154556, -111161, -43012, 28329, -229832, -24705, 204943, 173257, 209166, 413492, 167862, 203862, 66930]
13196C5377O8643J14220p4402G1598M304K84672J93094I2716k6713R1379J284
13185A58666r041R5960A06933L5602c6353J4396C33455n8794K28335I1522J4879
13174A06401R9240H502a22848C20206A48725k7792J47825a96632B72488b5281
13163I9794K03523E4439L6071b29305h3989L2366B25183f8305A15168L9055F1902
13151a31653C6509a70216A23490C4484J63411k4332i9663A72646J73882H2894
13140a84769a3084I4526Q8146m9286K52455j12392j18407a12765C98837A70164
13129B50829H6513a86460k09169G654O4585J03631a9078k2365q4873a5084F92639
13117a88656A58463k5206P9274I7020f3435A52435J17157a44489e9310j8196A41788
$$ y = [35377, 104020, 218240, 143838, 71598, 75902, 360574, 553668, 92716, 66003, 157382, 158666, 149625, 245585, 106933, 142535, -36353, -21957, 333455, 274661, 502996, 91522, 106401, 205641, 8502, -122848, 320206, 148725, 120933, 268758, -196632, 272488, -25281, 99794, 303317, 54439, 90510, -229305, -83989, -51623, 225183, -68305, 115168, 154223, 61902, -131653, 36509, -170216, 123490, 34484, 197895, 173563, -99663, 172646, 346528, 82894, -184769, -13084, 94526, 182672, 133386, 385841, 273449, 155042, -112765, 398837, 170164, 250829, 86513, -186460, -395629, 7654, 72239, 175870, -19078, -41443, -126316, -15084, 692639, -188656, 158463, 133257, 212531, 97020, -63435, 152435, 269592, -144489, -59310, -77506, 141788]
13105I8594J15789m5026e3509A58120a64310I5655e6145B94036A09591K38477
13095C48068I5784N1239n3562l5679O8063K33620A48869b9470A51574k9375A9580
13083A26977C7009a9696k43491E1578R5489A5778i0331D8001a75565B51826e4304
13071B36356h3355c2643B74786A16966M3914c80342J17024h0297G5137K45647
13061C20784j20876b17562E2473J00369b9033B56474c6734C20449j15029L2713
13051B38133C4605J91866j12532J25887c5059A10954m1351J80855j10604J47647
13041B87501b60459D3342J09179J15669I6614L06838a11747j4635I1482R2128
13031A83610p9163J29927I792J16900R8821b2973C77176L0413a58336A60795Q996
$$ y = [98594, 214383, 169357, -53509, 158120, -164310, 95655, -56145, 294036, 109591, 348068, 95784, 147023, 93461, 57782, 125845, 359465, 148869, -29470, 151574, 122199, 19580, 126977, 37009, -19696, -263187, 51578, 147067, 15778, -90331, 48001, -175565, 251826, -54304, 236356, -83355, -32643, 274786, 116966, 160880, -380342, -263318, -80297, 75137, 320784, 199908, -217562, 52473, 152842, -29033, 256474, -36734, 320449, 205420, 238133, 34605, 226471, 113939, 239826, -35059, 110954, 69603, 250458, 139854, 287501, -260459, 43342, 152521, 268190, 96614, 403452, -111747, -126382, 91482, 183610, 104447, 234374, 9792, 126692, 225513, -22973, 377176, 407589, -158336, 160795, 169791]
13020A69791J8917E2375i5790F8292R5853h3007J2460A45081b89336B82830d9634
13008C00834m1483r0409H3777f0942H6055K90186j9993A22915n3262A1831K31164
12997B42995E273K06404H2477a0110C58840G5388c1684j54970A45253i089j74541
12986a83630d7137A92030l5595J11661h8882A10972M5847R5521k2490F973L6468
12975D3441P422M4838D3679c09976f1776A16129m1894c9086H772K10849f3340
12963A45551b6646E6167O9882f5475B63245N1802A01736a2034k89210H2314a78419
12951b7123j0122B05665H6123a13987j73544E9081f4853A15871a11085C3535K03621
12940B37156J18682D1799N9743C4438j6641a8008A97485e2794G8706b72491A52318
$$ y = [169791, 188708, 52375, -95790, 68292, 164145, -83007, -70547, 145081, -289336, 282830, -49634, 300834, 259351, 168942, 83777, -60942, 86055, 376241, 356248, 122915, 69653, 11831, 242995, 5273, 211677, 82477, -10110, 358840, 75388, -31684, -186654, 145253, -9089, -183630, -47137, 192030, 156435, 268096, -88882, 110972, 156819, 252340, 229850, 6973, 43441, 50863, 95701, 43679, -309976, -61776, 116129, 74235, -39086, 8772, 219621, -63340, 145551, -26646, 56167, 126049, -65475, 263245, 315047, 101736, -12034, -301244, 82314, -178419, -27123, -37245, 205665, 86123, -113987, -287531, 59081, -64853, 115871, -111085, 33535, 237156, 355838, 41799, 101542, 34438, 17797, -18008, 197485, -52794, 78706, -272491, 152318]
12928E6381M3762b5252D07069A6099L8609L6808l6446J80043l3629L2433p4743
12917A59174k5386K23501a0066C88635F4669b27566D3492L3835g7152E5459L3114
12906H8573o685J9369h5132M1379A35902i4565B75815a63054r9992A30781E2399
12894C873h9290b2008n7474D6972J64582a2930l8024F6452q361i5551F1401N33046
12882E94447j34327B9268I141O80K300J49266a1485A74374J53666a03094b5509
12870D60607i670A94371O0086j22019a6034j02476A29861J7783B70K09313a1580
12858b17810I9107A6152P6610C448b8351D8866a07241B88145E3342a59930P7890
12847h2040B04158J15640e8451B88771r0025D3002d2932B12153L1153I4488a37320
$$ y = [56381, 100143, -25252, 407069, 16099, 54708, 91516, 55070, 235113, 201484, 233917, 159174, 133788, 357289, -10066, 388635, 64669, -227566, 43492, 77327, -77152, 55459, 88573, 81888, 101257, -85132, -43753, 135902, -94565, 275815, -163054, -263046, 130781, 52399, 3873, -89290, -22008, -79482, 46972, 211554, -12930, -50954, 66452, 58091, -95551, 61401, 594447, 460120, 29268, 9141, 9821, 12121, 161387, -11485, 174374, 328040, -103094, -25509, 460607, -9670, 194371, 254457, 132438, -16034, -118510, 129861, 147644, 270, 209583, -11580, -217810, 99107, 16152, 92762, 3448, -28351, 48866, -107241, 288145, 53342, -159930, -82040, 204158, 319798, -58451, 288771, 198746, 43002, -42932, 212153, 243306, 94488, -137320]
12835C6535J40297a6287k48466f9207q5890K0381E4901B137b5370j5474o1147
12824a01991A44141E2583L63002a1618o0694k21165D4831K27M18851A70419i4814
12812A91171c9588J7394j42131l9408c8049C0977J7345J38740a09098A8237L1464
12801D9701f5665A63942a44354j21925a02830G4351J09217J3744d7225k48932
12791b96157B11015c49668j22456a1532A8754a44288d0111A32179K04587A05823
12780C93785A52172j3225Q889B0419Q9873C097g3134q8434B39845M9736H494d9393
12767b73971G6245J64921A2733d940A41938G423L44055d627A44917k3032K18280
12756C40165b82875G5695J78040q5407Q6784f8569A42727D4282J04213b19052
$$ y = [36535, 176832, -16287, -264753, -69207, -155097, -134716, 54901, 2137, -25370, -40844, -101991, 144141, 52583, 415585, -11618, -72312, -293477, 44831, 45058, 463909, 170419, -94814, 191171, -39588, -22194, -164325, -203733, -38049, 30977, 48322, 187062, -109098, 18237, 49701, -65665, 163942, -144354, -266279, -102830, 74351, 183568, 197312, -47225, -296157, 211015, -349668, -472124, -11532, 18754, -144288, -40111, 132179, 336766, 105823, 393785, 152172, 138947, 147836, 20419, 110292, 3097, -73134, -161568, 239845, 289581, 8494, -49393, -273971, 76245, 241166, 12733, -4940, 141938, 7423, 351478, -4627, 144917, 121885, 340165, -282875, 75695, 253735, 168328, 255112, -68569, 142727, 44282, 148495, -219052]
12745B5604a87A97958m5817j098l5563J48361j1354B4900J15318K2966J36751
12734B99935b4249k04491F8113J73893c6672I9433J42348B0304n578c9879j05456
12723a45335d8244b0509A01987Q3777J93658j08311J11840b13839F81168B7119
12712a00709m4929M8313A81069m3593m5058J20283K2748Q8198q4623p8106J39032
12701B99950p5990l9856O8801A1822J50919J45744A18680M6717e8391E3565A0558
12689b27330B78753F7205P4986a89347E2483j0397J57322Q2886j21643l5322a06168
12677E4926h373E13342a08796A38326C4887J63022D6654c449A22744b4351G4495
12665h2956B44237b07383B88272j20344P2740M2124A10242B0520K01700K02076
$$ y = [25604, -187, 197958, 152141, 151043, 115480, 263841, 252487, 24900, 140218, 163184, 299935, -24249, -228740, 68113, 242006, -36672, 99433, 241781, 20304, 14726, -39879, -145335, -48244, -20509, 101987, 185764, 379422, 271111, 382951, -213839, 681168, 27119, -100709, -145638, -97325, 181069, 137476, 92418, 212701, 235449, 323647, 239024, 160918, 299950, 223960, 184104, 252905, 11822, 162741, 308485, 118680, 165397, -58391, 53565, 10558, -227330, 278753, 67205, 142191, -189347, 52483, 42086, 199408, 282294, 160651, 125329, -106168, 54926, -8373, 513342, -108796, 138326, 34887, 197909, 46654, -3449, 122744, -24351, 74495, -82956, 244237, -207383, 288272, 167928, 240668, 282792, 110242, 20520, 222220, 424296]
12655D24296c869j76134f339B82643G4409c1357B08361a08676A4238O683b53011
12643a89609f4611j15126j73397A11603P7623m420C5152J01903C0578Q8672L3844
12632A53094m2488Q8716m9626k4572L2585b7454B76068F9327f7664c0383C21566
12620A298K16215J619O4611a31652b8683C3073b1772F5787J89369A18775A1506
12608b92990B07765l1278a9860C64789h1452K0136k40156D09608l5727A44798
12597C03518j26942c46358J52268D15162F0822B8251R0591b48696B85139m7616
12587B37523D8976J26909M7029J05026b7957N571A62177a98100f2036D08557A81231
12575A15628c3035A45090c42721C65301E9669b78893J17516B74354e1092k45502
$$ y = [424296, -3869, -180003, -6339, 282643, 74409, -31357, 208361, -108676, 14238, 20921, -253011, -189609, -64611, -179737, -353134, 111603, 189226, 184806, 35152, 137055, 30578, 119250, 153094, 110606, 199322, 149696, 125124, 157709, -27454, 276068, 69327, -67664, -30383, 321566, 1298, 217513, 219132, 283743, -131652, -28683, 33073, -21772, 65787, 255156, 118775, 11506, -292990, 207765, 176487, -19860, 364789, -81452, -61316, -301472, 409608, 373881, 144798, 303518, 176576, -346358, -194090, 415162, 60822, 28251, 118842, -248696, 285139, 237523, 48976, 175885, 222914, 327940, -27957, -22386, 162177, -198100, -62036, 408557, 181231, 115628, -33035, 145090, -342721, 365301, 59669, -278893, -161377, 274354, -51092, -296594]
12565b96594A38699d6789o1104A06694h4503C13801j23940N734c70837D19875
12554B23934G680h0154H9640a4647o9022B0583a0050A75799B1405c03061G7655
12542F2694O318b74848a13118K6575D1774J86942J02663a36693C0745e6781C8898
12530F6956J96777j01116L15090A66375d9884f192I9181b58447A21392b2904B58055
12518C9836b074C58603F4764a10240C83959h9751k42266A75110a07474F367J9227
12507B5594b86244h3592A55988J9218J5604c78735G4305A4134b19k7579D361b36220
12494a89772B92203O713b67443G7029a57383B38729F8325M3621j2016g3309n4539
12483a27848I1912B4073J32165I056R80a07550C62448c0309B99545C1049b96635
$$ y = [-296594, 138699, -46789, -107893, 106694, -84503, 313801, 189861, 195595, -370837, 419875, 223934, 7680, -80154, 89640, -14647, -83669, 20583, -10050, 175799, 21405, -303061, 77655, 62694, 69012, -274848, -113118, -86543, 41774, 228716, 331379, -136693, 30745, -56781, 38898, 66956, 263733, 162617, 477707, 166375, -49884, -6192, 99181, -258447, 121392, -22904, 258055, 39836, -2074, 358603, 64764, -110240, 383959, -89751, -332017, 175110, -107474, 6367, 25594, -286244, -83592, 155988, 175206, 190810, -378735, 74305, 14134, -219, -27798, 4361, -236220, -189772, 292203, 298916, -267443, 77029, -157383, 238729, 68325, 111946, 99930, -73309, -127848, 91912, 24073, 156238, 9056, 10036, -107550, 362448, -30309, 299545, 31049, -296635]
12471c7604k66202a2467H5533b82559A73170c2553A11457a68663A29919g1291
12460a45094H6943K13718a0409B19068M0223A2176Q3554D0630J61302a2030o5404
12449g7434J2139k1394M581G6544J1090c03607a13802N71c28j07284A18261J7574
12437A35835b247o6762A88058f2049A26864a84352A18304J08034a49171a4783
12426i8997j194B57663C4525J12186J85080a33140c4754o515C63480a48113Q470
12415a39643B89159j37401a14346A10783b37772C83819a50396B60099b54709J08561
12405a46148E7492c27816B52684j23597a71898A63966c1527k76177P6249E5717
12394A93127a48467I2875k884C199J01518a97062D9119J3813c77570C4741a47017
$$ y = [-37604, -303806, -12467, 85533, -282559, 173170, -32553, 111457, -168663, 129919, -71291, -145094, 86943, 300661, -10409, 219068, 259291, 12176, 95730, 40630, 201932, -12030, -77434, -65295, -86689, -82108, 76544, 87634, -303607, -113802, -113231, -328, -107612, 118261, 135835, -2247, -69009, 188058, -62049, 126864, -184352, 118304, 226338, -149171, -14783, -98997, -100191, 257663, 34525, 146711, 331791, -133140, -34754, -41269, 363480, -148113, -139643, 289159, 151758, -114346, 110783, -237772, 383819, -150396, 260099, -254709, -146148, 57492, -327816, 252684, 129087, -171898, 163966, -31527, -307704, -231455, 55717, 193127, -148467, 92875, 89991, 3199, 104717, -197062, 49119, 62932, -377570, 34741, -147017]
12382A63242k2243d3257A08885J01000f2447a7541k75794A19530b26633f3114
12371F032J09474d0641H9578j5108L6779m2305b05980A67976G1326K4319b7551
12359a71931A34800J67357m7600F1863e9497r453B00688J61056A55409C9197Q1748
12348A20945k4623j9479K40152b19413B0420Q1968J06610m3588O3509o0600a78725
12336a43286C46539f9106A2222c60902B39398F990J00346b90375J36986B58469
12325a09224a8476j08210p2092O1990j9780b309C78270a4342I9867a15594E3179
12313f0741k73468B14044J1039e8192E5391M8609E1505O2431Q9047i8883j72621
12302b71504c9323B80531C9404b47602H0748J92605b43592P8928A78259a05501
$$ y = [163242, 140999, -43257, 108885, 209885, -62447, -17541, -293335, 119530, -226633, -63114, 6032, 115506, -40641, 89578, 74470, 111249, 68944, -205980, 167976, 71326, 95645, -27551, -171931, 134800, 302157, 254557, 61863, -59497, -68950, 200688, 361744, 155409, 39197, 120945, 96322, 76843, 316995, -219413, 20420, 102388, 208998, 165410, 228919, 168319, -178725, -143286, 346539, -69106, 12222, -360902, 239398, 6990, 107336, -290375, -153389, 258469, -109224, -18476, -126686, -198778, -136788, -156568, -2309, 378270, -14342, 99867, -115594, 53179, -60741, -334209, 214044, 225083, -58192, 55391, 104000, 51505, 113936, 202983, -98883, -271504, -39323, 280531, 39404, -247602, 80748, 273353, -243592, -164664, 178259, -105501]
12291C67282j21559h3471A61813a54554B40856e1317J1968B05722e3597H3196
12280A56602o0605D5430e5959F4031c7948A91675i9010k36951b7037n8211A47011
12268I1172a34244A79419J16181E3639J6238d6264A37859m2000J08056c9794I5429
12256a22405K7510H7946g3410H064L46399I0381b2114B20514r3811a97596j71738
12245c69334A09642h2675A1546K18036E4482a19513B79097o4869K7658g050B61093
12233A95991I7669a27879B78720r0230O7528c31A19604C6101R0357J62660i2997
12221B43765D71M27144P3722n4849r2793J94045G8601B6060L01382A24639M93568
12210F18207d6257F4657K14181j4894l5533A9781N7592P6483J98563j49176O5043
$$ y = [367282, 245723, -83471, 161813, -154554, 240856, -51317, -39349, 205722, -53597, 83196, 156602, 95997, 45430, -55959, 64031, -37948, 191675, -99010, -335961, -27037, -85248, 147011, 91172, -134244, 179419, 295600, 53639, 69877, -46264, 137859, 95859, 203915, -39794, 95429, -122405, -94895, 87946, -73410, 8064, 354463, 90381, -22114, 220514, 126703, -197596, -369334, 109642, -82675, 11546, 229582, 54482, -119513, 279097, 214228, 241886, -7050, 261093, 195991, 97669, -127879, 278720, 188490, 256018, -331, 119604, 36101, 126458, 289118, -92997, 243765, 471, 427615, 501337, 446488, 353695, 547740, 78601, 26060, 327442, 124639, 618207, -46257, 64657, 278838, 263944, 228411, 19781, 77373, 153856, 352419, 203243, 268286]
12199B68286j25523G0397K03764p9869n9017P0884J11387A55587a51181C18917
12188A65646d027B98034A21451A7854J55290a39637C72671A9031L0051K37043
12178B86125a18977B33777D8302Q6695J80124A26886a10561n1435C9584K85761
12168C25345I7086K58169j04697b75582A25380K11862a09150D3541g8030B40678
12157G4691J62837J12505F2498L7740M8274k3964K96810A62583b87879C44501
12146b6710k62996C7232i9373b5595m0537k3757B07002r8862a38291D75442E8688
12134B52419r2535J73167B8638b32184A13270K4073j6551c5352A7381b7626B75788
12122e8789q3464D00263A24452b65213a29326M843d2475m6877k5229D35853i7416
$$ y = [268286, 142763, 70397, 274161, 194292, 135275, 206159, 317546, 155587, -151181, 318917, 165646, -4027, 298034, 121451, 17854, 173144, -139637, 372671, 19031, 49082, 286125, -118977, 233777, 48302, 134997, 315121, 126886, -110561, -161996, 39584, 325345, 97086, 355255, 250558, -275582, 125380, 337242, -109150, 43541, -78030, 240678, 74691, 237528, 350033, 62498, 100238, 148512, 124548, 421358, 162583, -287879, 344501, -26710, -289706, 37232, -99373, -25595, -66132, -89889, 207002, 108140, -138291, 475442, 58688, 252419, 159884, 333051, 28638, -232184, 113270, 137343, 120792, -35352, 17381, -27626, 275788, -58789, -142253, 400263, 124452, -265213, -129326, -124483, -42475, -89352, -114581, 435853, -97416]
12110B2222K30460D7678j6925K36858K6797A5566a93447A101d7736A26034a59636
12098i3518D0647b10323B0801b67639a11694E6333b81906E9156d8471B33132I5974
12086B64989i461j6385j58190E9612h4480D9012K66472e5550I1388L58113F2192
12074D03866K16360N03284J291106A151795l23440A26031J82882j32166a59995
12064E3040L05270B4558I82d0417E9776O5109a47629F2677i6393n3905A8653h5068
12051G1621b51992c287B07164j00735a87437g7159a3629M708E6719J92061b2220
12039a15333A40456b4992C5160e94657a1247D4561J36069a70344a1496A78146
12028A56356h1451G4826k9764b93768f3855A55620i1028A32715a8206o496l76788
$$ y = [22222, 252682, 47678, 30753, 267611, 294408, 15566, -193447, 1101, -47736, 126034, -159636, -93518, 40647, -210323, 20801, -267639, -111694, 56333, -281906, 59156, -48471, 233132, 95974, 264989, -9461, -25846, -184036, 59612, -84480, 49012, 315484, -55550, 91388, 449501, 62192, 403866, 620226, 1123510, 2414616, 1151795, 828355, 126031, 308913, 176747, -159995, 53040, 358310, 24558, 982, -40417, 59776, 124885, -147629, 62677, -96393, -150298, 18653, -85068, 71621, -251992, -3287, 207164, 106429, -187437, -77159, -13629, -8921, 56719, 248780, -22220, -115333, 140456, -24992, 35160, -594657, -11247, 44561, 180630, -170344, -11496, 178146, 156356, -81451, 74826, 45062, -293768, -63855, 155620, -91028, 132715, -18206, -24702, -401490]
12017d01490C01857k8209d8632A76783Q5977k1870j3323d3736C32749A4827a8745
12005A79787l9116M1559a80868A55719d398j36508e6415j1152D1057O981a97236
11993a24963O0431l76760B05509h233j13984D3107f3877k82542a40251B7109h6392
11981B9074P2292J26943b44698j25802d1465B33336r2412g3094B3340O690d9028
11969a34130A08736A4388J15792J38678a48131P2202A12900a53836A65596a57872
11958e2928j65838A58608b7531A8192N1910a26532A78272l7286c1048k5720B74397
11946B371J54900b7933G8616J18492b05134H2072C1012b33996g2875A56024a37219
11934B6608J74979g9245B8430c40486D39188D8945J6153b26584B26680b305F0375
$$ y = [-401490, 301857, 273648, -48632, 176783, 262760, 240890, 227567, -43736, 332749, 14827, -18745, 179787, 140671, 182230, -180868, 155719, -4398, -140906, -56415, -67567, 41057, 48038, -197236, -124963, -64532, -441292, 205509, -8233, -122217, 43107, -63877, -346419, -140251, 27109, -86392, 29074, 101366, 228309, -244698, -370500, -41465, 233336, 140924, -73094, 23340, 30030, -49028, -134130, 108736, 14388, 130180, 268858, -148131, -75929, 112900, -153836, 165596, -157872, -52928, -218766, 158608, -27531, 18192, 70102, -126532, 178272, 140986, -31048, -56768, 274397, 2371, 157271, -27933, 78616, 197108, -205134, 82072, 31012, -233996, -72875, 156024, -137219, 26608, 201587, -79245, 28430, -340486, 439188, 48945, 65098, -226584, 226680, -2305, 60375]
11922F4745a58022k17199H5256C564d82557E3457J76186b12838G2805B6319R0523
11911A16842f0397J961H501J48535j9243r400J1449i2563B10911b93057B36391
11899C18319a4082k02198B7929h8938o8954B28774m2567g660A56929r881m1678
11888A05370N00A2410L9801a37915e3260A65757h3651j91340A23228J0600b12502
11876b04832a8558B5300K4335a35650D2425b1691B4318b10649A59981G2141C4191
11864a65963A70030G8092a04284I7931a38454j67196i2638m5021C08215q2693
11854B25522A2578a52331A7389a26252C38819j68571a8676A82060b64448I406
11843b0198p3248C3678e2722B49602h0549A22675b09130F217N3808h0071n0009
$$ y = [64745, -158022, -375221, 85256, 3564, -482557, 53457, 229643, -212838, 72805, 26319, 116842, -60397, -58436, 8501, 157036, 137793, 128393, 139842, -92563, 210911, -293057, 236391, 318319, -14082, -216280, 27929, -88938, -157892, 228774, 186207, -7660, 156929, 147048, 105370, 105870, 12410, 52211, -137915, -53260, 165757, -83651, -274991, 123228, 133828, -212502, -204832, -18558, 25300, 49635, -135650, 42425, -21691, 24318, -210649, 159981, 72141, 34191, -165963, 170030, 78092, -104284, 97931, -138454, -305650, -92638, -137659, 308215, 225522, 12578, -152331, 17389, -126252, 338819, 170248, -18676, 182060, -264448, 9406, -20198, -93446, 33678, -52722, 249602, -80549, 122675, -209130, 6217, 60025, -80071, -130080]
11832a30080B02521K7707H8465I372h7258A5414K4075L63048a65635q5426A73834
11820C2739J33599c47055B13692A980N0911L02082g0577b9570l4922l0126A53092
11808A12511O6965a71748K7052H0033a68437B30126I4385h317n2178C57981a33819
11796a87984E3646q048i2326A32508j1616a66709G3831J76407a72575B6310a9556
11784b54026A44269b83666j07072h1610A87935n9568b32976D0408K70117A48136
11773f1216p6981a8236k27872B1887c45399A7371c78875J55901g2858a6104l47829
11762c63933A32305E8831c9376A15318n0784d3830G5876P2180C6911e5689B37865
11750a51610r6293C53197H1103b27445O8104a3840p5049A59763a28484A51549
$$ y = [-130080, 202521, 230228, 88465, 9372, -87258, 15414, 39489, 402537, -165635, -251061, 173834, 32739, 166338, -347055, 213692, 1980, 52891, 354973, -70577, -29570, -64492, -94618, 153092, 112511, 179476, -171748, -144696, 80033, -168437, 230126, 94385, -8317, -60495, 357981, -133819, -187984, 53646, 45598, -92326, 132508, 120892, -166709, 73831, 250238, -172575, 26310, -19556, -254026, 144269, -283666, -390738, -81610, 187935, 128367, -232976, 40408, 310525, 148136, -61216, -138197, -18236, -246108, 21887, -345399, 17371, -378875, -222974, -72858, -16104, -363933, 132305, 58831, -39376, 115318, 64534, -43830, 75876, 148056, 36911, -55689, 237865, -151610, -247903, 353197, 81103, -227445, -159341, -13840, -88889, 159763, -128484, 151549]
11739A6870J03697J42927b8373C18160j58939a417A83077R1366c5148E7558e9832
11727B28982a04220j47623I3783k5599L9603J17067c657D32311f8415A57639a91042
11715C78513j88722d0946k47094h0517i988B87102b37161D4935M04194A09749
11704B18276a86888H5479C9711g4495I7743g2722D22712j90044c3730l28850b6773
11692I5363d7841j23110F6764K05274q0306a33307j3565n4994H8087e3986B05382
11680e9840j49151A69387J05413n345G8363b0596A06770A9048i4390B37488i8228
11668F8078d5268D90877a48746B4863K24975B5754f1571B81608j39604d4195J5153
11657b9042I8692a23018B71556n444b04268c0292l05851J67068O4028j57264j0069
$$ y = [16870, 120567, 263494, -28373, 318160, 159221, -1417, 183077, 274443, -35148, 57558, -59832, 228982, -104220, -251843, 93783, 68184, 107787, 224854, -3657, 432311, -68415, 157639, -191042, 378513, 189791, -40946, -288040, -80517, -9988, 287102, -237161, 44935, 449129, 109749, 218276, -186888, 85479, 39711, -74495, 97743, -72722, 422712, 232668, -33730, -362580, -26773, 95363, -47841, -170951, 66764, 272038, 191732, -133307, -146872, -201866, 88087, -53986, 205382, -59840, -208991, 169387, 274800, 269455, 78363, -20596, 106770, 19048, -94390, 237488, -98228, 68078, -45268, 490877, -148746, 24863, 249838, 25754, -61571, 281608, 142004, -44195, -29042, 98692, -123018, 271556, 266112, -204268, -30292, -336143, -169075, -105047, -262311, -272380]
11646b72380G617P0514h5477H0373a85268B66237j14400b00154o8015A27067Q6169
11635B13236A7651P4879q938A4406a00533N0156B86748H3059a9635k29887A37160
11623B6769Q5011J11633H289c2075j87409a5862C02625e6812C26716r7449b39823
11611A38621h0686A89817a34812M1055c6927o4158F8571f1323B84417A28426D1029
11599H2070K18254E5597J04014P5250J71675B01024j3231G9593c46660A63201
11588d4955A44363c08421D0269J16503j806A013a16438A82212J03175A00053R8410
11577A98463l9577l7865a4376D42100j55095m6352H2035d3858k3802A42760C3602
11565B85204j02815d7683C0570L43319A1953f4531B67087b6876l7516F835J39329
$$ y = [-272380, 7617, 78131, -85477, 80373, -185268, 266237, 151837, -200154, -268169, 127067, 213236, 17651, 92530, 83592, 14406, -100533, -50377, 286748, 83059, -19635, -249522, 137160, 26769, 111780, 223413, 8289, -32075, -219484, -15862, 302625, -56812, 326716, 229267, -239823, 138621, -80686, 189817, -134812, -93757, -36927, -101085, 68571, -61323, 284417, 128426, 41029, 82070, 300324, 55597, 159611, 234861, 406536, 201024, 187793, 79593, -346660, 163201, -44955, 144363, -308421, 40269, 156772, 154966, 1013, -116438, 182212, 285387, 100053, 198463, 158886, 121021, -14376, 442100, 287005, 240653, 82035, -43858, -67660, 142760, 33602, 285204, 182389, -47683, 30570, 373889, 11953, -64531, 267087, -26876, -64392, 6835, 146164]
11554A46164a32243K3844C7617J49026r2181m1507k028J90976J97235d4638j348
11543d5986C38109a63981k3545D626K40372d7477D67968j06735a8586j31333B3781
11531G0773J40804a59945F7793K31484A02209i2459B41510b6919B48727c108A16778
11519A13318a79852A61511J32150k3723K7929g3930A70737n0750l2491L393L23167
11508D14056A69563d211A6984K77213F9666J09841F5145B5115L05664j34344m5557
11497A50878c7338A03083K97644j08912I1060a41651C20745m265j25861b22922
11486B21364o0173n1591b64391J19553H9087c3853J4171l87900E41187j70415
11476C70772d6514o6838C54719a13485F297K09623c2410I0344L4381O9743I3433
$$ y = [146164, -132243, -108399, 37617, 186643, 94462, 52955, 50927, 241903, 439138, -44638, -45986, 338109, -163981, -187526, 4626, 244998, -47477, 467968, 361233, -18586, -149919, 23781, 70773, 211577, -159945, 67793, 299277, 102209, -92459, 241510, -26919, 248727, -3108, 116778, 113318, -179852, 161511, 293661, 269938, 297867, -73930, 170737, 119987, 87496, 90889, 414056, 169563, -4211, 16984, 294197, 69666, 179507, 65145, 25115, 330779, 196435, 150878, -37338, 103083, 400727, 291815, 91060, -141651, 320745, 316480, 190619, -222922, 221364, 161191, 109600, -264391, -144838, 89087, -33853, -19682, -407582, 541187, 370772, -46514, -113352, 354719, -113485, 6297, 215920, -32410, 90344, 124725, 194468, 93433]
11464f2816J4519I197K56218B9089L20189b58836A66398r210K3953a87672H9592
11452B62898A12002f9367K7182B19574K2550q7062n4262C4321L05421B0339b43378
11440C50757G0739Q7207N6006a43063B41624b03169G0519M18871A92288D5043
11429A27134K3218E7751A0033i5368A25457i1971A29128K44055a80163d892G273
11417a14408B13088a08341c3499k33673A30206F1247J8138l5882J11336a59616
11406b78722A46816A7238K7595m265J40443i3877A9758e1372A80970B9763a62121
11394C6000P838I578a91519k25604A04209a31597B88732b25600a846k72235h3269
11382A10780b62979j4077D528K96327r2847a20978p9607h0572I9286D1296J29555
$$ y = [-62816, -48297, 9197, 265415, 29089, 349278, -258836, 166398, 157188, 181141, -187672, 89592, 262898, 112002, -69367, -42185, 219574, 242124, 155062, 100800, 34321, 339742, 20339, -243378, 350757, 70739, 157946, 213952, -143063, 241624, -203169, 70519, 489390, 192288, 45043, 127134, 150352, 57751, 10033, -95368, 125457, -91971, 129128, 373183, -180163, -4892, 7273, -114408, 213088, -108341, -33499, -267172, 130206, 61247, 79385, 43503, 154839, -159616, -278722, 146816, 17238, 44833, 40568, 181011, -93877, 19758, -51372, 180970, 29763, -162121, 36000, 43838, 9578, -191519, -417123, 104209, -131597, 288732, -225600, -1846, -274081, -83269, 110780, -262979, -277056, 4528, 300855, 208008, -120978, -200585, -80572, 99286, 41296, 170851]
11371A70851a53131K7609A22517C9183a30757F4964B7371P3815a64339A24346
11360B47441R5860I578J9406h0405j63760D5891a17221l97041a17332r3633o7724
11349b78689a30140m5607A3721a48873I0193K43250a19696E8297A5630K94553
11339C10183A22232A3817d4775A47087p1358j0814J13753i1546I545e0837B7401
11327B6912K94027C0559d5117l00074A29413K4301k8482q840a17151N3801j7494
11316h0844A75974b66819J08318i455A711Q4167k4235j4192J35412m7386B4850
11304a98338B01279a06087F1531J17272b68051b0724j27720o8990f3273C58396
11293a6642k83171a35904o2952D12182d47742g8536j05403P7751j1549o2331A12168
$$ y = [170851, -153131, -125522, 122517, 39183, -130757, 64964, 27371, 101186, -164339, 124346, 247441, 343301, 9578, 28984, -80405, -244165, 45891, -117221, -514262, -117332, -210965, -278689, -130140, -175747, 13721, -148873, 90193, 333443, -119696, 58297, 15630, 310183, 122232, 13817, -44775, 147087, 75729, 64915, 178668, -91546, 9545, -50837, 27401, 26912, 320939, 30559, -45117, -345191, 129413, 153714, 125232, 116392, -117151, -63350, -80844, 175974, -266819, -158501, -9455, 1711, 85878, 61643, 47451, 182863, 135477, 24850, -198338, 201279, -106087, 61531, 178803, -268051, -20724, -148444, -217434, -63273, 358396, -16642, -299813, -135904, -198856, 412182, -447742, -78536, -183939, -106188, -117737, -180068, 112168]
11281c00523J01469A90547b20471j49038d4930p4029D4513J9132K20847b9409
11270A22319a25347A49627b87225A40337c62948f7003B15503J18730a55503I5755
11259B73958c20608G2020O3322K6176a436A67201a82591E7910O0846n6027R01
11248F3630R8624L96323a62063e1146A85235F2237b52514J11470A26256K8507
11238A54763N122j7800a63404D0659c52321B95044r8916C2520a73216A4595a41136
11226B9501a29760E3541N8741L9222a29102A3366a62262A30857b13071H8827b09282
11214b49730F2003J26102E2676m994a49976L7197A12827e2622j08224n5020B2613
11202h3392I4708O6076b1300g599j65635G0165K3778c60945a4769k637B47581
$$ y = [-300523, -199054, 190547, -220471, -369509, -44930, -118959, 44513, 63645, 284492, -29409, 122319, -125347, 149627, -287225, 140337, -362948, -67003, 215503, 334233, -155503, 95755, 273958, -320608, 72020, 135342, 161518, -1436, 167201, -182591, 57910, 118756, 62729, 63630, 162254, 558577, -162063, -51146, 185235, 62237, -252514, -141044, 126256, 154763, 159885, 142085, -163404, 40659, -352321, 295044, 196128, 32520, -173216, 14595, -141136, 29501, -129760, 53541, 112282, 151504, -129102, 13366, -162262, 130857, -213071, 88827, -209282, -249730, 62003, 188105, 52676, 47682, -149976, -112779, 112827, -52622, -160846, -215866, 22613, -83392, 94708, 160784, -21300, -7599, -173234, 70165, 93943, -360945, -14769, -17406, 247581]
11190h9660b6585k07236B69477A0510M6292r229d4829C1777P8479A6257b56350
11178b03526B7987L2711e6797D1908K04628b41008J18924n0207P7783H2239d0824
11166A4525M46566A24691i9640K9423F6692k7743a29252r4137P5590o977q8517
11155b43293A87437a00685B8358a44510b5829H8292N5284a51179k080c3162A78882
11143C2451K19751e5007m1738A9741J36958m9847b31031R5705A38179b44366I4732
11131H949h7371B96186a21560d6549B81756A14693f4734A6454K85802j48372K64945
11120D18829A3163Q8330a91731h7190d1232j95724C24319C5961J08022F7866L845
11109G1711Q3712Q0302j01042d5183A11646l6468H608K62K58546j3491r9244f2592
$$ y = [-89660, -26585, -233821, 269477, 10510, 56802, 47573, -44829, 31777, 110256, 16257, -256350, -203526, 27987, 60698, -56797, 41908, 246536, -241008, -122084, -172291, -94508, 82239, -40824, 14525, 461091, 124691, -99640, -70217, 66692, 38949, -129252, -223389, -147799, -154776, -243293, 187437, -100685, 28358, -144510, -25829, 88292, 143576, -151179, -153259, -33162, 178882, 32451, 252202, -55007, -96745, 19741, 156699, 106852, -231031, -135326, 138179, -244366, 94732, 8949, -87371, 296186, -121560, -46549, 281756, 114693, -64734, 16454, 302256, 153884, 418829, 13163, 101493, -191731, -87190, -41232, -236956, 324319, 35961, 143983, 67866, 71711, 155423, 235725, 134683, -45183, 111646, 75178, 8608, 8870, 267416, 253925, 154681, -62592]
11096A21800K36165j14791J55055o9752j3066q243b3458F8948c5727C69116r6290
11085B72826J29510j64859K26413k29829D2068J60584J65020J57803G8625K06809
11075B85434g0370C82873j8908j44880l9007K54903r2668l7050P5353Q4873B11426
11063E2961N64369j22517Q3949k6197k26253J59667K01198n0164L62661l51173
11053F48501J39967B79422J62337N44601l11854J32715q1962J58118k10900J48364
11043H20841p8796J71059C92101O2311K23873K19137K5673O6536j80968j83390
11033F25273O5028M4621j4591k01392J47602N746K34317j97631j94546L34960
11023H49387r4653j51970k06265L48268L38455l78686p6919j52149A90678N36386
$$ y = [121800, 357965, 243174, 398229, 328477, 315411, 307168, -23458, 68948, -35727, 369116, 272826, 402336, 237477, 463890, 234061, 42068, 202652, 367672, 525475, 78625, 285434, -70370, 382873, 363965, 219085, 180078, 434981, 342313, 305263, 380616, 465489, 211426, 52961, 617330, 494813, 578762, 552565, 326312, 485979, 687177, 637013, 999674, 648501, 788468, 279422, 441759, 986360, 674506, 807221, 725259, 883377, 672477, 820841, 742045, 913104, 392101, 454412, 678285, 897422, 923095, 989631, 808663, 625273, 690301, 734922, 720331, 518939, 666541, 672287, 906604, 708973, 514427, 849387, 754734, 602764, 396499, 744767, 1083222, 704536, 627617, 475468, 190678, 727064]
11013G27064q3356j9597J80840j45645O6288J55668m1932k76093J80709j2370
11003G31576J2653q2898P2008j77322J35027J15817k9629l58788Q7528J71502
10993F77474Q3323K15809l05622M11114l56926K45971l22j77641Q4494J24821
10983A002495n7388j69736M13691O9504R4970k04885J20416J06058L82295K65358
10973B022778L51162k938N90831p4439K9300K43880l53961K27875j42081q05191
10963B087216j45784k45949k00728K86817k0489l08969M84525j77708J96415k83965
10953A671381l53897p7379J76918j83509k84504j43586n923k80788o3636j06487
10943C48590L3756J48642j29532A27187K38151A7450b9754F1100J22706a81661
$$ y = [727064, 643708, 624111, 804951, 659306, 725594, 881262, 839330, 563237, 743946, 731576, 744229, 661331, 733339, 556017, 691044, 806861, 777232, 418444, 505972, 677474, 760797, 976606, 670984, 1082098, 725172, 971143, 970821, 793180, 877674, 1002495, 945107, 775371, 1189062, 1258566, 1353536, 1148651, 1269067, 1375125, 1757420, 2022778, 2373940, 2371002, 2961833, 2887394, 2916694, 3160574, 2806613, 3034488, 2892407, 2087216, 1941432, 1695483, 1494755, 1781572, 1761083, 1452114, 1936639, 1758931, 1955346, 1671381, 1317484, 1240105, 1417023, 1233514, 949010, 805424, 799501, 518713, 455077, 348590, 382346, 530988, 401456, 127187, 365338, 17450, -29754, 61100, 183806, -181661]
10932f4418A64375K1995o0083e3872I6944K12887H5608a14147B14211E2474J37726
10921A90200e9463q481B58884a03635b2068A99825o6972a72353D0445a39177B45776
10909G5183a0437D6552d5114a228B01799a12550G3310p377a11225J7642A09682
10897A03439j5685a61429B33039Q3196I3101O3909J56966b11144f6387k68738
10887c35125J39601c4404A5840J65891j5929H2538A032J63778b666A2505b27471
10875c2814j2121F3021a94164B43400a35033E6230c8266r8740m10a5681l67474
10864c83155A17090E0208f4968A56618F9777J22306q7782d4845A53444C7686b2509
10852a84635m1491e7072A39681F8624a4968F656a09350B1717g9531j43037j64315
$$ y = [-64418, 164375, 186370, 126287, -53872, 96944, 309831, 85608, -114147, 214211, 52474, 190200, -59463, -67944, 258884, -103635, -22068, 199825, 132853, -172353, 40445, -139177, 245776, 75183, -10437, 46552, -45114, -1228, 201799, -112550, 73310, 65933, -111225, -93583, 109682, 103439, 87754, -161429, 233039, 316235, 93101, 157010, 313976, -211144, -66387, -335125, -195524, -34404, 15840, 181731, 165802, 82538, 1032, 164810, -2666, 12505, -227471, -32814, -44935, 63021, -194164, 243400, -135033, 56230, -38266, -137006, -137416, -15681, -383155, 117090, 50208, -64968, 156618, 69777, 192083, 104301, -44845, 153444, 37686, -22509, -184635, -226126, -57072, 139681, 68624, -14968, 6656, -109350, 21717, -79531, -222568, -386883]
10841c86883a71027L7139A39075Q753J23423D7675J59626a39347p7793j6091A32276
10829A49485a1372k563k17079b6379M692B7984L14579h6282k69323B4525b03364
10817a6142I4298a52086J2923E8958d2502A73432e48286F7508a6799H6206G649
10805h9277j71782L9753k5634I8798a13434B38779j07922h1529p9947A51970m7867
10794A04103h1944H5708a71546j30577f9080j13073P3717j10446B47793B003N5981
10783E7984a87812A04409d07643C5716N7946a30427p0649m7872O1230o0129M2893
10772b04954D1205J57954J29438F2171i635k39646G631a25461r717j29461a273
10760a85922O4708e2638D08819G2439J24423i7508c99D31535a65988N5330A55865
$$ y = [-386883, -171027, -133888, 139075, 147828, 271251, 47675, 207301, -139347, -217140, -233231, 132276, 149485, -11372, -13935, -231014, -26379, -21687, 27984, 342563, -86282, -355605, 24525, -203364, -16142, 94298, -152086, -139163, 58958, -42502, 173432, -548286, 67508, -16799, 86206, 7649, -89277, -261059, -221306, -246940, 98798, -113434, 238779, 130857, -81529, -161476, 151970, 104103, -81944, 85708, -171546, -302123, -69080, -182153, -108436, -218882, 247793, 2003, 57984, -187812, 104409, -407643, 35716, 93662, -130427, -201076, -248948, -187718, -247847, -204954, 41205, 199159, 328597, 62171, -9635, -249281, 7631, -125461, -135178, -264639, -1273, -185922, -121214, -52638, 408819, 72439, 196862, -97508, -399, 431535, -165988, -110658, 155865]
10748E4986j713d5520a3598a301n6338J9455a2119B06101a34740q5057i1618m3840
10736a35458D676a79433F2410b32017R215A63585P1448B6157c5735D0656a77893
10724a01321d3821B73909J3086e5162Q597j76716D7330d28835D9609H600d7684
10712c278A62805f6559j16226Q045h5378a7698B53720b21753l9442g0429b8290
10700a5606m9569C64877A32812J0508a3968j13770a6324m4901A27251a04540p1510
10689a76050j63041J34755D04260a48320f855k15152a5461l67428A82153a04374
10678E7166J01961b8819j01673M1931G4177d24170b09961l545d7249j12100B11175
10666b30979a8312l5124F4766b38010C6914P6540b48007H7871a83850q2449H8724
$$ y = [54986, 53273, -45520, -13598, -1301, -57639, -38184, -12119, 206101, -134740, -219797, -91618, -135458, 4676, -179433, 62410, -232017, -222802, 163585, 235033, 26157, -35735, 40656, -177893, -101321, -43821, 273909, 286995, -55162, -46565, -223281, 47330, -428835, 49609, 8600, -47684, -3278, 162805, -66559, -182785, -174740, -85378, -17698, 253720, -221753, -261195, -70429, -28290, -15606, -65175, 364877, 132812, 143320, -13968, -127738, -16324, -61225, 127251, -104540, -176050, -339091, -204336, 404260, -148320, -6855, -222007, -15461, -382889, 182153, -104374, 57166, 159127, -28819, -130492, -88561, 74177, -424170, -209961, -213506, -47249, -159349, 211175, -230979, -18312, -53436, 64766, -238010, 36914, 113454, -248007, 87871, -183850, -266299, 88724]
10654g9955H4550g3347q8491m7608C8607K46947A23658l7419c37085A04654b61611
10642b19305C18414b2713A35893b6567j56505j25116j28152B42668E5506h5937
10631a14994G1777N6488A9425b62869F674J6241a51070C4153J49940d2904l37122
10620c80026E1808b83542A60264k9239a28044q761L2466j48165q0971j9521A2642
10608I5383C4972a87663n0409J05916K9584A62755k9208b84088H7751c2317I7932
10596I6731c6658r4057c5405l92170K10138B93241F43a89899D7193d6658j35106
10585a81764C23495A23237a96328B26006b47933P0963h0874l8033j6209F5456
10574a2363p1553j42988f786j18167F7206A3152d3731n0328k20966A25498D0154
$$ y = [-79955, 84550, -73347, -161838, -209446, 38607, 285554, 123658, 86239, -337085, 104654, -261611, -219305, 318414, -22713, 135893, -26567, -183072, -308188, -436340, 242668, 55506, -85937, -114994, 71777, 128265, 19425, -262869, 6674, 22915, -151070, 34153, 184093, -42904, -380026, 51808, -283542, 160264, 131025, -128044, -136805, -104339, -252504, -333475, -352996, 12642, 95383, 34972, -187663, -238072, -132156, -102572, 162755, 133547, -284088, 87751, -32317, 97932, 96731, -36658, -130715, -35405, -427575, -217437, 293241, 643, -189899, 47193, -46658, -181764, 323495, 123237, -196328, 226006, -247933, -176970, -80874, -118907, -135116, 65456, -12363, -83916, -226904, -6786, -124953, 67206, 13152, -43731, -94059, -315025, 125498, 40154]
10562H0148c68876I7684N1204B2228a26472C2816a09106j17403B14038A01791
10551A1291M8090c0269E1348k2440e2299j58034a1309j78092N152B19323Q4215
10540C03538b23939A38276Q1092a52613f5069A20096E9750J95645p2533g7768
10529b24005H2076k6355N0481e0796D565J58204o437b56286B5434a77132B78657
10517B3171K25353a23590c0001B24540a40983A05120K21492j15922a54520D0677
10506a50059p4118P3869f4926r0132A42448F6443a715j73736G167L3165f7036
10494a49585F3012A3658a67968L2673B26392a46901H7087a83827A04134A7843
10483a19829d3262j69232b1266B2942N70704B41091J3295j9342R3740k0478C7297
$$ y = [80148, -368876, 97684, 148888, 22228, -126472, 32816, -109106, -226509, 214038, 101791, 11291, 59381, -30269, 51348, 28908, -52299, -210333, -11309, -189401, -184249, 219323, 303538, -223939, 138276, 219368, -152613, -65069, 120096, 59750, 255395, 182862, -77768, -224005, 82076, 55721, 106202, -50796, 4565, 162769, 156332, -256286, 25434, -177132, 278657, 23171, 248524, -123590, -30001, 224540, -140983, 105120, 326612, 210690, -154520, 40677, -150059, -224177, -150308, -64926, -155058, 142448, 66443, -1715, -175451, 7167, 40332, -67036, -149585, 63012, 13658, -167968, -135295, 226392, -146901, 87087, -183827, 104134, 17843, -119829, -43262, -212494, -21266, 22942, 593646, 241091, 254386, 235044, 328784, 308306, 37297]
10471A76483b012B95141I2141b36027I6133J2607J27747c1159H4544a7553l19525
10460c37078a38215f6191K5171k891B03383K8430b43825B52669F4479a25322j5558
10449a40880b6824q3001K2138C7034F411J09122J94466K9539b60771D9903N2047
10438A01950L2690K1999A7247a32853A99018C361R6904K444B3267b7380B84196
10426F9266B818K80679F9043K58583j42934h5594E5099c2676D07181a07825C5260
10414B14331a21870j25324L899B91454A3812b6306j79367P0169m7031n6377a14266
10402A7242K9406b01628A79828F3536N0951e2943o9554J5499A32615J05320a96828
10390b58320A53040J63499b3700B03083m3328l8285a23582A53288P5226a0062
$$ y = [176483, -2012, 295141, 92141, -236027, 96133, 108740, 236487, -31159, 84544, -17553, -337078, -138215, -66191, -41020, -43911, 203383, 231813, -243825, 252669, 64479, -125322, -140880, -26824, -109825, -87687, 37034, 6411, 115533, 309999, 339538, -260771, 49903, 101950, 134640, 156639, 17247, -132853, 199018, 3361, 100265, 102709, 23267, -27380, 284196, 69266, 2818, 283497, 69043, 327626, 184692, -85594, 55099, -32676, 407181, -107825, 35260, 214331, -121870, -247194, -243295, 291454, 13812, -26306, -205673, -135504, -182535, -238912, -114266, 17242, 46648, -201628, 179828, 63536, 114487, -52943, -122497, -106998, 132615, 237935, -196828, -258320, 153040, 316539, -23700, 203083, 159755, 121470, -123582, 153288, 228514, -10062]
10379B01486c2364B60843M1605A22868B7195J77750K49066j85127G8235K17658
10369B95893q1655J14434A31384M18067P074A18655K04072J59950a6701A34903
10358A15786O146L67955F2096J53734L2979J94426j63195n0569K09727Q6266K92198
10347H17662A58495m7219J95972R2603m6543n4410O2807P3656L5660j41761b0435
10335D77170j57019B4528J54783k4018K5340e7151E0600K04331E3274N1179N1007
10324A55460P8199E8738a21790A44890R9624a85713B2634P3491O8317a6686A13157
10312B05551F861a29017M0059p0599H2572b9564a2826n228l11697I3346b64823
10300B23067A07511a1696j8449E4481i3270B1982a11035A35907J27979b4986n8925
$$ y = [201486, -32364, 260843, 302448, 122868, 27195, 204945, 454011, 268884, 78235, 295893, 214238, 328672, 131384, 549451, 556525, 118655, 322727, 482677, -16701, 134903, 115786, 121932, 489887, 62096, 215830, 248809, 443235, 280040, 229471, 439198, 525464, 817662, 158495, 111276, 307248, 399851, 353308, 298898, 361705, 435361, 471021, 329260, -20435, 477170, 320151, 24528, 179311, 155293, 180633, -57151, 50600, 254931, 53274, 104453, 155460, 233659, 58738, -121790, 144890, 244514, -185713, 22634, 96125, 164442, -16686, 113157, 205551, 6861, -129017, -88958, -159557, 82572, -29564, -12826, -18054, -329751, 93346, -264823, 223067, 107511, -11696, -30145, 54481, -93270, 21982, -111035, 135907, 263886, -24986, -83911]
10289h3911l2189p3035B23827a66757j4802e8672k33389A45027E9308i9681H8822
10277B30318c83730F6571n392h8168G6807A3745e8652B40372p0415a17242C26652
10265b59327A64474H0162i5849L8641B9119K50358b69821D4234K22941p2679K96704
10254D91200c363C95449o2687a26322G3162e9410G7712e6194H7130c41780f6461
10242a22773M2760C1170C045J16373L2742d8367G8890a1628m17635J45344A18819
10230A78557b45664A67074B1914b88632J0175E7498K51657p8769p0341a59202
10219A45784A9225N1036c3067j64824N4241D4064N6963a41260b649j82882F2096
10207B44502a9445H2244a58231O3251a7253G3528c03533B2648b43672D4904f7360
$$ y = [-83911, -116100, -189135, 223827, -166757, -181559, -58672, -292061, 145027, 59308, -99681, 88822, 230318, -383730, 66571, 61179, -88168, 76807, 13745, -58652, 240372, 169957, -117242, 326652, -259327, 164474, 80162, -95849, -57208, 29119, 279477, -269821, 44234, 267175, 194496, 491200, -3363, 395449, 332762, -126322, 73162, -59410, 77712, -56194, 87130, -341780, -66461, -122773, -80013, 31170, 3045, 119418, 152160, -48367, 78890, -11628, -429263, -283919, 118819, 178557, -245664, 167074, 21914, -288632, -278457, 57498, 309155, 230386, 160045, -159202, 145784, 19225, 70261, -33067, -197891, -143650, 44064, 101027, -141260, -2649, -185531, 62096, 244502, -19445, 82244, -158231, -94980, -17253, 73528, -303533, 22648, -243672, 44904, -67360]
10195B84547F5185a89934e2753j98519O9689A37635b01178E6550M6798J42629
10185B45977l2105P7653f1420A27182f5437A32433o0445a91136i2796q3979A24732
10173E7786K11523d4334A44761c9346k6310l2282l3836G201h4536k5537r0848
10162b00921A05322C2145K2702J81525b94841N7950E6695e136j41954a7173j33059
10151a50232A89555q7213k2712L811a05942e1050j39293A02256d269j66516B54905
10139a69549A18298J88286j04074A0610f6346j02188d1816k21095J17888B41755
10128e937D4229i5234o0255b3019m7345c3281P744A89863q2014I0b83471a3759
10115B16195G4090b5039k51997q8179K9169B85947H0538b78840f7946G1274d62592
$$ y = [284547, 65185, -189934, -52753, -251272, -181583, 137635, -201178, 56550, 103348, 245977, 213872, 291525, -61420, 127182, -65437, 132433, 71988, -191136, -92796, -176775, 124732, 57786, 269309, -44334, 144761, -39346, -65656, -97938, -131774, 7201, -84536, -110073, -200921, 105322, 32145, 54847, 236372, -294841, -236891, 56695, -5136, -147090, -17173, -150232, 189555, 102342, 79630, 83441, -105942, -51050, -190343, 102256, -4269, -170785, 254905, -169549, 118298, 306584, 202510, 10610, -66346, -168534, -41816, -262911, -145023, 241755, -5937, 44229, -95234, -155489, -23019, -70364, -33281, -25537, 189863, 107849, 90, -283471, -13759, 216195, 74090, -25039, -277036, -365215, -336046, 285947, 80538, -278840, -67946, 71274, -462592]
10103h481k3451r2533D7870A069K66495j02884a10060C5548d395q1101j40161
10092b25657H9344f0006k52202A19321a75446L2936n5242g0124B8505a8261l25222
10081c43483A03420d0016j10138a122F1824b35167O5600j45620b2353k44171M6379
10070b20145M3839q4471I5782e142p7472j46407b0097A55576m2369a15156A17877
10058H5793b30117m8179e9455E6868f1731A75533A0070J39245c23627c8868i916
10046a00326a7294A34072a86877j59961M1534J08293a4608p905B3861d0299m1456
10035h1755a3021r2106k9493A89356a63204k7069M1204f8694j47267f0958l4910
10024i5868A18427k5114a80942l0916B36848O5403g0735n0831F5031K70709F451
$$ y = [-8481, -31932, -124465, 47870, 1069, 267564, 164680, -110060, 35548, -4395, -85496, -225657, 89344, -60006, -312208, 119321, -175446, -142510, -197752, -70124, 28505, -18261, -343483, 103420, -40016, -150154, -1122, 61824, -235167, -169567, -315187, -22353, -266524, -220145, -176306, -260777, 95782, -5142, -82614, -229021, -20097, 155576, 113207, -115156, 117877, 85793, -230117, -278296, -59455, 56868, -61731, 175533, 10070, 149315, -323627, -38868, -9916, -100326, -17294, 134072, -186877, -346838, -305304, -197011, -14608, -22513, 23861, -40299, -81755, -13021, -105127, -134620, 189356, -163204, -190273, -149069, -68694, -215961, -60958, -95868, 118427, 93313, -180942, -211858, 236848, 302251, -70735, -121566, 65031, 335740, 6451]
10012A33607D3106e1893b4969p1971A42645c1550A42019b06510f42l6955k39502
10001b77099B09219c6429l5295k32303a22334C4534g478j91059i2460n0423a2718
9989a81770A46089b51266i9590r15p8723j3273C9752R8488e5341l42041a4216
9977d7336H7645k1166a40436e2893k11301d1227b081k7762j48364C5653g6814
9965e9539j21968p981k0797A26527b30760R3847F2116b89637J00337E6307b85694
9953b67353M9174O7369n7184j50623c7367A08765a99578A98369c66378A37651
9942h52B12764c412A52325a23239A65996b0792l27592i7310K4019j17302b6134
9930B40611a05380p9886B7696N6316L4937M2291J37482a42850C2615h1241j55310
$$ y = [133607, 43106, -51893, -24969, -96940, 142645, -31550, 142019, -206510, -642, -37597, -277099, 209219, -36429, -71724, -304027, -122334, 34534, -7478, -198537, -92460, -142883, -12718, -181770, 146089, -251266, -99590, -100505, -179228, -192501, 39752, 138240, -55341, -397382, -14216, -47336, 87645, 66479, -140436, -52893, -264194, -41227, -2081, -29843, -178207, 35653, -76814, -59539, -181507, -189488, -210285, 126527, -230760, -136913, 62116, -289637, -189300, 56307, -285694, -267353, -218179, -150810, -207994, -358617, -37367, 108765, -199578, 198369, -366378, 137651, -852, 212764, -3412, 152325, -123239, 165996, -20792, -348384, -97310, -73291, -190593, -26134, 240611, -105380, -185266, 27696, 84012, 118949, 161240, 298722, -142850, 32615, -81241, -236551]
9919b36551k9385c2692j02531f5219j18056f3662j50896j63333J45283d1701j79069
9908b20770q5384C8500b27042k07222J02585A40471J67619B5089b88930J17875
9898a71055Q3457E3402J27882e5830q2221M0031j12601g7309o9086d1919G5828
9886H9078C5199g1529G4524b98387a29082j42752J1820c0831k5987q380A46569
9874A32065c268m6978k0454D1597J76702C5696N2379l8677J4539L21985b44070
9862D5078J55498a63878m0115J8118a6143F201b20964B04061l502A6751L19170
9851C35921b36551k75681i2220L0130o23138a92309P2859p9130l12985A42026
9840C85634b89806g1219j84992N3489g0618A26546c20137i0831B5582J28819i0400
$$ y = [-236551, -265936, -32692, -135223, -65219, -183275, -63662, -214558, -377891, -232608, -41701, -220770, -306154, 38500, -227042, -434264, -331679, 140471, 308090, 25089, -288930, -171055, -87598, 53402, 181284, -55830, -138051, -98020, -210621, -77309, -146395, -41919, 75828, 89078, 35199, -71529, 74524, -298387, -129082, -271834, -260014, -30831, -56818, -65198, 146569, 132065, -3268, -50246, -70700, 41597, 218299, 35696, 88075, 49398, 63937, 385922, -244070, 45078, 200576, -163878, -203993, -185875, -16143, 6201, -220964, 204061, 200559, 16751, 335921, -236551, -512232, -92220, -62090, -685228, -192309, -119450, -198580, -511565, 142026, 385634, -289806, -71219, -256211, -202722, -70618, 126546, -320137, -90831, 25582, 154401, -90400]
9828b90763E4874K12868a37173k16424A22803o0142k3821d5557C7445J69848b74740
9816b6948H0692c4247j63706g1798M428k33783a44674b4388B59424c6016n79947
9805f15963b13236Q5496A12098N5720a47755b7983k40351h8124k33281F2959J82302
9794B45261a61966F6179a12138j08797i4959A52236b62521A62632a49262g4062
9783B89485f1122p0388a1445k88329B09483B3537b1608k91949A16462c10495e0182
9771A52426K41583h2996A23614b4604A6392c67556J75926H2197b56046A32050
9760f34000b0768p2106p1069j76975a3280j41232G2613l4088a14223a2116A55674
9748a66047B8844f7735j75297f9366B39037a07611G0868b99330d0243j51662A08393
$$ y = [-290763, 54874, 267742, -137173, -353597, 122803, 62661, 38840, -45557, 37445, 207293, -274740, -26948, 80692, -34247, -197953, -71798, -67370, -301153, -144674, -24388, 259424, -36016, -615963, -213236, -127740, 112098, 167818, -147755, -27983, -268334, -88124, -321405, 62959, 245261, -161966, 66179, -112138, -220935, -94959, 152236, -262521, 162632, -149262, -74062, 289485, -61122, -131510, -11445, -299774, 209483, 23537, -21608, -313557, 116462, -310495, -50182, 152426, 394009, -82996, 123614, -24604, 16392, -367556, -191630, 82197, -256046, 132050, -634000, -20768, -92874, -163943, -340918, -13280, -154512, 72613, 38525, -114223, -12116, 155674, -166047, 28844, -67735, -243032, -69366, 239037, -107611, 70868, -299330, -40243, -191905, 108393]
9736c9865J236G6166L7155a05143B91877a0482n38398B36340a49002E7278b70152
9724a14644d4716D5019a85398A63410a32491l22780b6657A50494F6838a33056
9713b45001O2959c4920J3879k4299n8230j57442A10441k1245O6742c0043B08055
9701B31803f4311j11216C49968i9407K6596A60151a46075B5730f0152J8435B63737
9689A13871e1308j01368L9756d4976o3776j88118C9868J21789e9970A47640a2562
9677A3917O9522b9574m5393k65104A4385b3374E2265k0034f6736a1451j3822A93453
9664A30562a93317o4710L1109a686o9141A66643b5288B49627c32526h3125A03996
9652b7665J1920B5165J30666b12196h4031q8945K6347A2137a23516n0082A26938
$$ y = [-39865, -38629, 76166, 113321, -105143, 291877, -10482, -548880, 236340, -149002, 57278, -270152, -114644, -44716, 45019, -185398, 163410, -132491, -455271, -26657, 150494, 66838, -133056, -245001, -182042, -34920, -21041, -45340, -103570, -261012, 110441, 89196, 155938, -30043, 208055, 231803, -64311, -175527, 349968, -99407, -72811, 160151, -146075, 25730, -60152, -41717, 263737, 113871, -51308, -152676, -112920, -44976, -108752, -296870, 39868, 161657, -59970, 147640, -12562, 13917, 83439, -29574, -74967, -340071, 14385, -23374, 52265, 32231, -66736, -11451, -25273, 193453, 130562, -193317, -258027, -226918, -1686, -70827, 166643, -25288, 249627, -332526, -83125, 103996, -27665, -15745, 25165, 155831, -212196, -84031, -172976, -146629, 12137, -123516, -173598, 126938]
9640G224a07693o9077Q7737b0986H9816e714J819j67581l175B02480d9100k46046
9628b95146J34852c8415f582q6671n6708A80916H0637L16099a79791A59999g8776
9616a48799e3707B08550a78778j93337a34431H1129J33772c0081j50398c7927
9605E9427f2770p6282b4418j84002E8940M6202a32599N9034E1202J5141a0091
9593h9814H2921a36180m5083g7762j80754A4670a48293B07566i3556L9489A99658
9581a2281b320j07343B3197b07162f017I6804a05415A39869b59455l471j2726
9570b75652g0255o8812A18732B4284a46595B20939a55518d0808k46937A7049b18107
9558F0108b03921a31A2402c07467J27717C8082a77793Q295c0152k37041q9306
$$ y = [7224, -107693, -176770, -89033, -20986, 89816, -5714, -3895, -171476, -174651, 202480, -49100, -295146, -160294, -38415, -6582, -93253, -149961, 180916, 80637, 396736, -179791, 159999, -78776, -148799, -53707, 208550, -178778, -372115, -134431, 81129, 214901, -30081, -180479, -37927, 59427, -62770, -139052, -24418, -208420, 58940, 105142, -132599, -73565, 51202, 66343, -10091, -89814, 82921, -136180, -181263, -77762, -258516, 14670, -148293, 207566, -93556, -54067, 199658, -12281, -2320, -109663, 23197, -207162, -6017, 96804, -105415, 139869, -259455, -262926, -275652, -70255, -139067, 118732, 24284, -146595, 220939, -155518, -40808, -287745, 17049, -218107, 60108, -203921, -131, 12402, -307467, -179750, 38082, -177793, -169498, -30152, -267193, -356499]
9547c56499G4636a60572J210A36385a51785a7055j04999e7667l0436n6346j98514
9536c42963f4415k740A77963b1602r051a0876F2127b23930i7232j72285a6750
9524G1309b5555C25206i6938J8018J3305n0674N2882j96191o1308B8257a7066
9512b52984C2606b70119m28L6001g6607j6192F2974J24986a81787c2750n1308
9501h4058A87722f4966B2806K6536a44472r6792A32715a38788F972d98257A18929
9489e49222a03273d413H0777F996O3110b02071e8805j09914B04756m815b79440
9477f109j83289O4067A73031k2049J07661r0572a10634k45446C6071d7911H8399
9465a75918A38010O0589r8473m5522c22574a469j25174M8917j4358A75865h0671
$$ y = [-356499, 74636, -160572, -159362, 136385, -151785, -17055, -122054, -57667, -88103, -144449, -342963, -64415, -67155, 177963, -21602, -30653, -10876, 62127, -223930, -97232, -269517, -16750, 71309, -25555, 325206, -96938, -78920, -65615, -116289, -63407, -259598, -320906, 28257, -17066, -252984, 32606, -270119, -270547, -234546, -76607, -92799, 62974, 187960, -181787, -32750, -84058, 187722, -64966, 22806, 49342, -144472, -241264, 132715, -138788, 6972, -498257, 118929, -549222, -103273, -4413, 80777, 6996, 70106, -202071, -58805, -168719, 204756, 199941, -279440, -6109, -189398, -125331, 173031, 150982, 258643, 168071, -110634, -356080, 36071, -47911, 88399, -175918, 138010, 198599, 100126, 54604, -322574, -1469, -126643, -77726, -92084, 175865, -80671]
9453g3341j65662E1211g3846k28660N9228B139f8695G9222b03417r1472E3082
9441g4842k48432E55205c18237B66829H306b06970q9530B56878g7243o3807K2731
9430a18319O391j3819C1327i510B8567c03795B88484c28931h8662E6617a37639
9418a43663I0991a43472l1431P5205L9566b3296l426j25540g0218L0424m6028
9407h5822A19549c91186c1727A67284B3480N6880a63101I6614b16885P8431E3896
9395B0787K0061b42649P2136g7959l786E0451h8728J0790l79100D5978c2403A02090
9382E7992d63044b06826O1878j52698B2481P7718b47956A84872r2117a0324n5738
9371f6062j2629m6224n9679j9833j0593f0794C15066b7449k82525a124m21612
$$ y = [-73341, -239003, 51211, -73846, -302506, -243278, 2139, -68695, 79222, -203417, -294889, 53082, -74842, -323274, 555205, -318237, 266829, 8306, -206970, -296500, 256878, -77243, -141050, -118319, -111928, -125747, 31327, -9510, 28567, -303795, 288484, -328931, -88662, 56617, -137639, -143663, 90991, -143472, -174903, -99698, -60132, -23296, -26722, -152262, -70218, -39794, -85822, 119549, -391186, -31727, 167284, 23480, 80360, -163101, 96614, -216885, -138454, 53896, 20787, 40848, -242649, -170513, -77959, -81745, 50451, -88728, -77938, -457038, 45978, -32403, 102090, 57992, -463044, -206826, -144948, -297646, 22481, 100199, -247956, 184872, 92755, -10324, -66062, -78691, -124915, -184594, -204427, -215020, -60794, 315066, -27449, -309974, -1124, -422736]
9360d22736d9412o4710C0388a0923C7539f427k01494d7386k43807C20327j15895
9349B04432a03028I2229a8313I4208g8166j73254B5319K06795E3113J11281a82058
9337c42265I4600J39887a29466A32551m4155d5795j22999Q0502A85259a55833
9326e22930b26916d8572j83640o8352E3763a05219m3439P4304j10650A59362a49291
9314A16706J3501c30741B86952r7938b83171A8284c42423J59796m4739A86539
9303f7406k7299j10718k44914a42404c5677E5909i1727d4495k54210A3916m195
9292I721b25166e9384A67562b31518R6033a6987l41904A37543l9609a3182A2121
9280A79711a06510c8281k29458C221a64191j02448B16876f7987j81207L1261n1920
$$ y = [-422736, -49412, -114122, 30388, -10923, 37539, -6427, -207921, -47386, -291193, 320327, 204432, -103028, 92229, -18313, 94208, -78166, -251420, 25319, 232114, 53113, 164394, -182058, -342265, 94600, 234487, -129466, 132551, 88396, -45795, -168794, -88292, 185259, -155833, -522930, -226916, -48572, -232212, -300564, 53763, -105219, -148658, -74354, -185004, 159362, -149291, 116706, 130207, -330741, 286952, 189014, -283171, 18284, -342423, -182627, -227366, 186539, -67406, -94705, -205423, -450337, -142404, -35677, 55909, -91727, -44495, -298705, 13916, 9721, -225166, -59384, 167562, -231518, -135485, -16987, -358891, 137543, 97934, -13182, 12121, 179711, -106510, -38281, -267739, 3221, -164191, -266639, 216876, -67987, -249194, -217933, -269853]
9269b69853b3482j3811l7173n7488C56291H1450a4276j55971N0712j03924A34989
9257d8979k10022B68209a30823B3944A659b64239a5784j33417K2973K2100A4620
9245c34955J52686A5455g1585A10598b26566p5830E0376a49263C61288q5727b41120
9233b48274J06896F4567b03879A88981o6185h8112A28296b25778o1543A352d7931
9221d06218B65581A18029N832a21316l8512f2774k23119a23985j03719j26431
9211c54135a76292a2117F0357g0686j86380J04504n4197I3354g4369c0573k80614
9200c11187A65698b9534k83704N0013B79757h3097A53934a44700d8097j47228
9190a95325R3978r4836D3810f3541C13210g7434k84771a11402e3226o3130H2549
$$ y = [-269853, -23482, -37293, -74466, -131954, 356291, 81450, -14276, -170247, -119535, -223459, 134989, -48979, -259001, 268209, -130823, 23944, 1659, -264239, -15784, -149201, -126228, -104128, 14620, -334955, -182269, 15455, -71585, 110598, -226566, -302396, 50376, -149263, 361288, 275561, -241120, -248274, -141378, 64567, -203879, 188981, 122796, -88112, 128296, -225778, -287321, 1352, -47931, -406218, 265581, 118029, 123861, -121316, -159828, -62774, -285893, -123985, -227704, -354135, -176292, -12117, 60357, -70686, -257066, -152562, -206759, 93354, -74369, -30573, -311187, 165698, -29534, -313238, -263225, 279757, -83097, 153934, -144700, -48097, -195325, -101347, -196183, 43810, -63541, 313210, -77434, -362205, -111402, -53226, -116356, 82549]
9178a31988C3378a02318c1243j12502j10493m3658J12292E5277b75384I8285b16302
9166a88083h9339j11882m6648B3191J34965c17967D83328a36622b2257j91281
9156b13538R8609d260m0231L786l08443h056p9570B40058b49622C26852A53492
9144B94398d22600B02070a6909I0248c331k48657O2353J8372k02045C6626k472
9133C4154q090J94348a89268b9147j05176c0263B83942C6485J85425H8085a60900
9121a66016P422j68582a47517D2024J82317h943F2751a516k10455j354F7713K26304
9109B94017B2173a88641a777l1423p4611B18366m2072a59740e4863j0164n06867
9098e71894B6310b50379R7248j07073P9815C5250K8037a96686g9281j28432L0354
$$ y = [-131988, 33378, -102318, -31243, -143745, -254238, -297896, -185604, 55277, -275384, 98285, -216302, -188083, -89339, -201221, -247869, 23191, 158156, -317967, 483328, -136622, -22257, -213538, -114929, -4260, -44491, -40705, -349148, -8056, -87626, 240058, -249622, 326852, 153492, 294398, -422600, 202070, -16909, 90248, -3331, -251988, -189635, -171263, -373308, 36626, 34154, 26064, 220412, -189268, -29147, -134323, -30263, 283942, 36485, 221910, 88085, -160900, -166016, -158594, -327176, -147517, 42024, 224341, -8943, 62751, -1516, -211971, -213325, 67713, 294017, 22173, -188641, -1777, -33200, -107811, 218366, 176294, -159740, -54863, -65027, -571894, 26310, -250379, -153131, -260204, -180389, 35250, 63287, -196686, -79281, -207713, -177359]
9087a77359O8745G6402C5136b36544I9109k5321J43366g8431L8396j06400j9205
9076a65640L8013l0942q3060O1933h9599c666j3846j56940B1670f4027k6221A61086
9063b43583J19877H2552g7053E037K26923b87063F8919j2252A8790a35458K5449
9052a10009k09500A38802a36477l45c5486j48414O357J9919O5640D9531g7898
9040e3465I9957k1271a69142j87710R140a922m2804A59214e7908B88222D2999
9028d12709e2828k47749B88342C7652c26947a56438A8605b94868J26969a8056
9017a18395A09440a52377J2434d0173p0636q6008A47656K95007i8430c3496k20739
9006b54235B52352E4067b25612g4885j4185j51956f9672j981l8820C6841e3721
$$ y = [-177359, -108614, 76402, 35136, -236544, 99109, 73788, 217154, -78431, -40035, -146435, -165640, -127627, -158569, -241629, -179696, -89599, -3666, -17512, -174452, 21670, -64027, -90248, 161086, -243583, -123706, 82552, -77053, 5037, 231960, -287063, 68919, 56667, 18790, -135458, -110009, -319509, 138802, -136477, -136822, -35486, -183900, -177543, -157624, -91984, 49531, -77898, -53465, 99957, 78686, -169142, -356852, -347712, -1922, -44726, 159214, -57908, 288222, 42999, -412709, -52828, -300577, 288342, 37652, -326947, -156438, 18605, -294868, -167899, -18056, -118395, 109440, -152377, -139943, -40173, -110809, -196817, 147656, 442663, -98430, -33496, -254235, 252352, 54067, -225612, -74885, -89070, -241026, -69672, -71653, -110473, 36841, -53721]
8994B04443b54526j4736B8668G246a16951A26606m7605a61876j7047F1972P6943
8983A38915a80348l3426F1480a26576B32744b76930h795E9014K39030j26102d5564
8971b56560C76585b80367A18680e8133J1613j02039A6272b18963b8521k25931
8961b54452a07004J776B64496h2866j32842K4408J2551L8827l7353o1354J5671
8950b22958a0452H8010a84247B50254F3802e5198k82109i7250J2077C07863E5234
8938c71978h1866C2762a13147q5876b2740B97550j23257d942F7876M9847a86104
8926h7194A51511g6664l72644a21360a7805B88676p7129b0749A88645a07163r9453
8915b06616J00620J3420A81833K8900a72962M5511k25392A47001c72425J36549
$$ y = [204443, -254526, -269262, 28668, 7246, -116951, 126606, 79001, -161876, -178923, 61972, 138915, -180348, -213774, 61480, -126576, 232744, -276930, -8795, 59014, 298044, 171942, -45564, -256560, 376585, -280367, 118680, -58133, -46520, -148559, 16272, -218963, -28521, -254452, -107004, -105228, 264496, -82866, -215708, -191300, -178749, -139922, -177275, -238629, -222958, -10452, 88010, -184247, 250254, 63802, -55198, -337307, -97250, -85173, 307863, 55234, -371978, -81866, 32762, -113147, -199023, -22740, 297550, 174293, -4942, 67876, 117723, -186104, -87194, 151511, -76664, -449308, -121360, -17805, 288676, 211547, -20749, 188645, -107163, -206616, -105996, -92576, 181833, 210733, -172962, -127451, -352843, 147001, -372425, -235876]
8905b35876P3745C9029a57638f4361j70907F6993a55741a128H0832k0376L3992
8894I4448c469j93715B3380a57078J4402A24444P852g8350r4120j56611i9623
8882A57208a2888E5028i9036q570B18514b68681L4846A70484E3178J44929o7695
8871A30412c22782a54331G1642c701j15402B2262a34197A54145a17159N2033j14276
8860a79402A75477e6134A39228a14594d9245j17061B42975q7242O6673P1668d4258
8848A89177c69907l446F0490a02382j12814C0453a42477G6956J49633i1346p5935
$$ y = [-235876, -162131, 39029, -157638, -64361, -235268, 66993, -155741, -1128, 80832, 60456, 94448, -3469, -197184, 23380, -157078, -142676, 124444, 132296, -78350, -172470, -329081, -99623, 157208, -12888, 55028, -99036, -107606, 218514, -268681, -233835, 170484, 53178, 198107, 130412, -322782, -154331, 71642, -3701, -119103, 22262, -134197, 154145, -117159, -65126, -179402, 175477, -56134, 139228, -114594, -49245, -166306, 242975, 155733, 222406, 294074, -44258, 189177, -369907, -373353, 60490, -102382, -215196, 30453, -142477, 76956, 226589, -91346, -167281]
$$ [...]
##END NTUPLES=NMR SPECTRUM
##END=
