##TITLE=AC1713_3097_8749698_3jzR5BpbZs
##JCAMPDX= 6.0         $$ Bruker NMR JCAMP-DX V2.0
##DATA TYPE= NMR SPECTRUM
##DATA CLASS= NTUPLES
##ORIGIN= BRUKER
##OWNER= Administrator
$$ 1.72 TOPSPIN		Version 2.1
$$ 2015-08-08 00:41:03.203 -0700  Administrator@X
$$ Compression mode = diff/dup
##.OBSERVE FREQUENCY= 400.02188249412
##.OBSERVE NUCLEUS= ^1H
##.ACQUISITION MODE= SIMULTANEOUS (DQD)
##.ACQUISITION SCHEME= undefined
##.AVERAGES= 8
##.DIGITISER RES= 22
##SPECTROMETER/DATA SYSTEM= spect
##.PULSE SEQUENCE= zg30
##.SOLVENT NAME= COFFEE_meoh
##.SHIFT REFERENCE= INTERNAL, COFFEE_meoh, 1, 14.98509
##AUDIT TRAIL= $$ (NUMBER, WHEN, WHO, WHERE, PROCESS, VERSION, WHAT)
$$ ##TITLE= Audit trail, TOPSPIN		Version 2.1
$$ ##JCAMPDX= 5.01
$$ ##ORIGIN= Bruker BioSpin GmbH
$$ ##OWNER= Administrator
$$ $$ E:\/data/COFFEE/nmr/AC1713_3097_8749698_3jzR5BpbZs/60/pdata/1/auditp.txt
$$ ##AUDIT TRAIL=  $$ (NUMBER, WHEN, WHO, WHERE, PROCESS, VERSION, WHAT)
(   1,<2015-08-08 00:40:55.859 -0700>,<Administrator>,<X>,<go>,<TOPSPIN 2.1>,
      <created by zg
	started at 2015-08-08 00:39:50.078 -0700,
	POWCHK enabled, PULCHK disabled,
       configuration hash MD5:
       21 0F 79 D6 B3 7B B4 F6 88 20 88 DB 03 48 BD 9F
       data hash MD5: 64K
       59 A9 8B 81 C1 80 83 08 C0 4F 44 6A 41 02 89 A9>)
(   2,<2015-08-08 00:40:59.031 -0700>,<Administrator>,<X>,<proc1d>,<TOPSPIN 2.1>,
      <Start of raw data processing
       efp LB = 0 FT_mod = 6 PKNL = 1 PHC0 = 0 PHC1 = 0 SI = 32K 
       data hash MD5: 32K
       23 DA 74 BA D6 97 55 3B 2A 66 BB 96 3A C6 59 4F>)
(   3,<2015-08-08 00:40:59.313 -0700>,<Administrator>,<X>,<proc1d>,<TOPSPIN 2.1>,
      <pk PHC0 = 92.26868 PHC1 = 0 
       data hash MD5: 32K
       46 5F 27 CB 88 07 50 E4 01 B9 61 DA E0 81 5A AD>)
(   4,<2015-08-08 00:40:59.422 -0700>,<Administrator>,<X>,<proc1d>,<TOPSPIN 2.1>,
      <abs ABSG = 1 
       data hash MD5: 32K
       36 FD BE 88 DD 96 A2 C2 44 64 26 E3 30 3D E6 F5>)
(   5,<2015-08-08 00:40:59.484 -0700>,<Administrator>,<X>,<proc1d>,<TOPSPIN 2.1>,
      <abs ABSG = 2 
       data hash MD5: 32K
       E9 55 97 7C 2C 7D BE 10 62 7B 81 91 31 CB 92 76>)
(   6,<2015-08-08 00:40:59.563 -0700>,<Administrator>,<X>,<proc1d>,<TOPSPIN 2.1>,
      <abs ABSG = 3 
       data hash MD5: 32K
       30 60 E3 30 04 1B 19 18 04 39 11 4C 4F EB 4D F6>)
(   7,<2015-08-08 00:40:59.688 -0700>,<Administrator>,<X>,<proc1d>,<TOPSPIN 2.1>,
      <abs ABSG = 4 
       data hash MD5: 32K
       41 39 83 27 12 B8 62 83 9A CD A8 34 E2 1B 74 DD>)
(   8,<2015-08-08 00:40:59.750 -0700>,<Administrator>,<X>,<proc1d>,<TOPSPIN 2.1>,
      <abs ABSG = 5 
       data hash MD5: 32K
       D8 EA FA 83 96 34 3C BC 8F AC 64 84 4D C5 18 A0>)
$$ ##END=
$$ 
$$ $$ hash MD5
$$ $$ 33 0D EC 21 7E 33 39 6C CD 84 3E ED 4B F1 0D 57
##$RELAX= 
##$RELAX= 
##$RELAX= 
##$RELAX= 
##$RELAX= 
##$RELAX= 
##$RELAX= 
$$ Bruker specific parameters
$$ --------------------------
##$DU= <E:\>
##$EXPNO= 60
##$NAME= <AC1713_3097_8749698_3jzR5BpbZs>
##$PROCNO= 1
$$ [...]
150 150 150 150 150 150 150 150
##$TP07= 0
##$TPNAME0= <>
##$TPNAME1= <>
##$TPNAME2= <>
##$TPNAME3= <>
##$TPNAME4= <>
##$TPNAME5= <>
##$TPNAME6= <>
##$TPNAME7= <>
##$TPOAL= (0..7)
0.5 0.5 0.5 0.5 0.5 0.5 0.5 0.5
##$TPOFFS= (0..7)
0 0 0 0 0 0 0 0
##$TUNHIN= 0
##$TUNHOUT= 0
##$TUNXOUT= 0
##$USERA1= <user>
##$USERA2= <user>
##$USERA3= <user>
##$USERA4= <user>
##$USERA5= <user>
##$V9= 5
##$VALIST= <valist>
##$VCLIST= <CCCCCCCCCCCCCCC>
##$VD= 0
##$VDLIST= <DDDDDDDDDDDDDDD>
##$VPLIST= <PPPPPPPPPPPPPPP>
##$VTLIST= <TTTTTTTTTTTTTTT>
##$WBST= 2048
##$WBSW= 25
##$XGAIN= (0..3)
0 0 0 0
##$XL= 0
##$YL= 0
##$YMAX_a= 593422
##$YMIN_a= -503975
##$ZGOPTNS= <>
##$ZL1= 120
##$ZL2= 120
##$ZL3= 120
##$ZL4= 120
##$ABSF1= 14.98509
##$ABSF2= -5.573092
##$ABSG= 5
##$ABSL= 3
##$ALPHA= 0
##$AQORDER= 0
##$ASSFAC= 0
##$ASSFACI= 0
##$ASSFACX= 0
##$ASSWID= 0
##$AUNMP= <proc_prof1d_extract_pilot.lims>
##$AXLEFT= 0
##$AXNAME= <>
##$AXNUC= <1H>
##$AXRIGHT= 0
##$AXTYPE= 0
##$AXUNIT= <>
##$AZFE= 0.1
##$AZFW= 0.1
##$BCFW= 0
##$BC_mod= 0
##$BYTORDP= 0
##$COROFFS= 0
##$CY= 15
##$DATMOD= 1
##$DC= 0
##$DFILT= <>
##$DTYPP= 0
##$F1P= 0
##$F2P= 0
##$FCOR= 0.5
##$FTSIZE= 32768
##$FT_mod= 6
##$GAMMA= 0
##$GB= 0
##$INTBC= 1
##$INTSCL= 1
##$ISEN= 128
##$LB= 0
##$LEV0= 0
##$LPBIN= 0
##$MAXI= 10000
##$MC2= 0
##$MEAN= 0
##$ME_mod= 0
##$MI= 0
##$NCOEF= 0
##$NC_proc= -8
##$NLEV= 6
##$NOISF1= 0
##$NOISF2= 0
##$NSP= 0
##$NTH_PI= 0
##$NZP= 0
##$OFFSET= 14.98509
##$PC= 1
##$PHC0= 92.26868
##$PHC1= 0
##$PH_mod= 1
##$PKNL= yes
##$PPARMOD= 0
##$PPDIAG= 0
##$PPIPTYP= 0
##$PPMPNUM= 2147483647
##$PPRESOL= 1
##$PSCAL= 4
##$PSIGN= 0
##$PYNMP= <proc.py>
##$REVERSE= no
##$SF= 400.02
##$SI= 32768
##$SIGF1= 0
##$SIGF2= 0
##$SINO= 400
##$SIOLD= 32768
##$SPECTYP= <>
##$SREGLST= <1H.CDCl3>
##$SSB= 0
##$STSI= 32768
##$STSR= 0
##$SW_p= 8223.68421052631
##$SYMM= 0
##$S_DEV= 0
##$TDeff= 65536
##$TDoff= 0
##$TI= <>
##$TILT= no
##$TM1= 0
##$TM2= 0
##$TOPLEV= 0
##$USERP1= <user>
##$USERP2= <user>
##$USERP3= <user>
##$USERP4= <user>
##$USERP5= <user>
##$WDW= 1
##$XDIM= 32768
##$YMAX_p= 445680854
##$YMIN_p= -659852
##$CURPLOT= <Network HP LaserJet P1505>
##$CURPRIN= <$Network HP LaserJet P1505>
##$DFORMAT= <normdp>
##$LAYOUT= <+/1D_H.xwp>
##$LFORMAT= <normlp>
##$PFORMAT= <normpl>
##$SURQMSG= 1
$$ End of Bruker specific parameters
$$ ---------------------------------
##NTUPLES= NMR SPECTRUM
##VAR_NAME=  FREQUENCY,     SPECTRUM/REAL,   SPECTRUM/IMAG
##SYMBOL=    X,             R,               I
##VAR_TYPE=  INDEPENDENT,   DEPENDENT,       DEPENDENT
##VAR_FORM=  AFFN,          ASDF,            ASDF
##VAR_DIM=   32768,         32768,           32768
##UNITS=     HZ,            ARBITRARY UNITS, ARBITRARY UNITS
##FACTOR=    0.250966925370066, 1,           1
##FIRST=     8223.43324360094, -196662,      -61769
##LAST=      0,             342593,          111816
##MIN=       0,             -659852,         0
##MAX=       8223.43324360094, 445680854,    0
$$ Real data points
##PAGE= N=1
##DATA TABLE= (X++(R..R)), XYDATA
$$ [...]
19534a70007M3671B93135A4911e328o4378l4071a1502B2875n735c3466A45189
19522a41449j18718A43070d64548I3771i6141I3137P2641a36586j39268A91729
19511A07305C6249a71697B58660E2238b9546j50094m4804M416N688h8362c0364
19499A7584J3512b83606d6872C38877j05298a20127n7769M1905A17549a05443
19488A10632A3734Q2070i0110A4403d947B99999a40671a6443E6723a62533A06791
19476a95295j3813A07657K435J75543b01914A65453J11875c9019j01347p8613
19466b18979a7591k5411B1879b10730a00167j57536g5843j1499k13398a49039
19455h6836A88681M2236a02201n7521b1568j04376l607A73740e2672j57503K0456
$$ plain form
19534 -170007 -126336 293135 14911 -5328 -69706 -103777 -11502 22875 17140 -33466 145189
19522 -141449 -260167 143070 -464548 93771 -96141 93137 165778 -136586 -275854 191729
19511 107305 36249 -171697 258660 52238 -29546 -179640 -224444 -220028 -214340 -88362 -30364
19499 17584 31096 -283606 -46872 338877 233579 -120127 -177896 -135991 117549 -105443
19488 110632 13734 95804 -90110 14403 -4947 299999 -140671 -16443 56723 -162533 106791
19476 -195295 -209108 107657 110092 285635 -201914 165453 277328 -39019 -140366 -218979
19466 -218979 -17591 -43002 21879 -210730 -100167 -257703 -75843 -87342 -300740 -149039
19455 -86836 188681 230917 -102201 -159722 -21568 -125944 -129551 173740 -52672 -210175 -189719
19444a89719C2520J7861P7383b71820A41839J66322a65954B01127e8535G6522
19433b12135A10578c82201A61340a40520b8896q7061F1084c18594G8071b22080
19422b7330F3239h8462r5809J722k1912h4155B5064b67308a8616A09407k0920
19411H8487j496b83950I2818a46894N0227m31956B07016b50199f6125A00583b7237
19399g4494k04200A78535f9877C1402a23821j11393c3702B5270i0027I5066d78992
19387c58006K5534P7508D7336b4398j3537A16795d6264j44280B1020d9840j65294
19376b15134B4286J2088b73347B0188C061c2677m0644o6153B03933F329c3100
19364A8300a64947j6566B1511a10780L4468F697a02179c1524j24516A61299G193
$$ plain form
19444 -189719 32520 50381 127764 -271820 141839 308161 -165954 201127 -58535 76522
19433 -212135 110578 -382201 161340 -140520 -28896 -115957 61084 -318594 78071 -222080
19422 -27330 63239 -88462 -184271 -182549 -204461 -84155 25064 -267308 -18616 109407 88487
19411 88487 86991 -283950 92818 -146894 -96667 -528623 207016 -250199 -66125 100583 -27237
19399 -74494 -278694 178535 -69877 31402 -123821 -235214 -33702 25270 -90027 95066 -478992
19387 -358006 -332472 -254964 47336 -24398 -37935 116795 -46264 -190544 21020 -49840 -215134
19376 -215134 24286 36374 -273347 20188 3061 -32677 -73321 -139474 203933 6329 -33100
19364 18300 -164947 -181513 21511 -110780 -76312 6697 -102179 -31524 -156040 161299 7193
19352f5644m9379N0230r3865D834c23450E4004b13457A02192L7832a96347E8652
19340a12463A07647J361a18358A3353d68027a80530l0757B67526j27344a35883
19329b53549J08550j75641a10744j37944P4299C6869b54480b7388j86898L4656
19319a79630n4636A05980m0483b31714H459a78371p5073e7274j7645n07961a20478
19307c00672d1817j03308O1115k72091J70081B85562A8370J26844c32333a11519
19296a97888c6164A50855a39240A1039a30487B91517e0154j09860A51536a49211
19285b62595K6184M8887B85128c37519B8815a33744C55418b87985J21932f3663
19274C18688c06071A22232a88314c4538h876k56698A46912a8228j06412j60998
$$ plain form
19352 -65644 -115023 -64793 -158658 4834 -323450 54004 -213457 102192 140024 -196347 58652
19340 -112463 107647 109008 -118358 13353 -468027 -180530 -211287 267526 140182 -135883
19329 -253549 -144999 -320640 -110744 -248688 -174389 36869 -254480 -27388 -214286 -179630
19319 -179630 -234266 105980 65497 -231714 8459 -178371 -253444 -57274 -74919 -582880 -120478
19307 -300672 -41817 -145125 -84010 -356101 -186020 285562 18370 145214 -332333 -111519
19296 -197888 -36164 150855 -139240 11039 -130487 291517 -50154 -160014 151536 -149211
19285 -262595 -236411 -187524 285128 -337519 28815 -133744 355418 -287985 -166053 -63663
19274 318688 -306071 122232 -188314 -34538 -8876 -265574 146912 -18228 -124640 -285638
19264b85638i4891k48888a58529E8613A0074P4046R7188h801D800a67750K7946
19253a39804j44353g6742j1620j07005K094b5363A7503e7683A22124b76014i875
19241b91002B77493d4258D49431j40605b07597f7176A25523i8374I4115b59436
19230g6922I4000b37211P1538j91761e1107j91747R1439g4897j40770j84968p511
19219d08146b7487j59783j3907C58280e32688A8403J68481b51536e2246j19082
19209a71328A04889i3524J2547p7117K4143A72225J86090d8971j64118c6733I6516
19197G4712a71844j61211J42081C83763j40134a33463e4358C29920j64122h2419
19186E6533J42801a59529F969Q5330C3341L333a77575O2824M7028k4751B57167
$$ plain form
19264 -285638 -94891 -343779 -158529 58613 10074 84120 181308 -8801 4800 -167750 -139804
19253 -139804 -284157 -76742 -88362 -195367 -193273 -25363 17503 -57683 122124 -276014 -9875
19241 -291002 277493 -44258 449431 308826 -207597 -67176 125523 -98374 94115 -259436
19230 -76922 94000 -237211 -165673 -357434 -51107 -242854 -151415 -74897 -215667 -400635 -408146
19219 -408146 -27487 -187270 -201177 358280 -532688 18403 186884 -251536 -52246 -171328
19209 -171328 104889 -93524 -80977 -158094 -133951 172225 358315 -48971 -213089 -36733 96516
19197 74712 -171844 -333055 -190974 383763 243629 -133463 -54358 329920 165798 -82419
19186 56533 199334 -159529 6969 92299 33341 36674 -177575 -114751 -67723 -92474 257167
19174b83167B67918A2772i0818k29579a25306H3210A1156a94012B94134a44304
19163C93451g1755A36270c78633J41727R9209r6271C214c37780E7448A0442a00234
19151f0990j440A51296a4815G6781a57023D78855c82529h230A8133d40031A50811
19139G1252j0a90758B7139b78505N7464j01859d146A11726g7488j59497A02512
19127e5674A329e7479C74296b28042G3125a35367K8752J507p0918I5615a39064
19115b54157B2991a92510g2559J6041j5166A500b91698c7931A13849c39070J54850
19104a84220m7285j69407J06799A48270a63193r782j6099B13723A5694d1876E2807
19092a09163j3941F1911J05788a16522N419d0202k69459A7636H476c31737g5464
$$ plain form
19174 -283167 267918 12772 -90818 -320397 -125306 83210 11156 -194012 294134 -144304
19163 393451 -71755 136270 -378633 -236906 -137697 -233968 3214 -337780 57448 10442 -100234
19151 -60990 -62430 151296 -14815 76781 -157023 478855 -382529 -8230 18133 -440031 150811
19139 71252 71242 -190758 27139 -278505 -221041 -322900 -4146 111726 -77488 -236985 102512
19127 -55674 1329 -57479 374296 -228042 73125 -135367 -106615 -105108 -176026 95615 -139064
19115 -254157 22991 -192510 -72559 -56518 -71684 1500 -291698 -37931 113849 -339070 -184220
19104 -184220 -231505 -400912 -294113 148270 -163193 -172975 -189074 213723 15694 -41876 52807
19092 -109163 -123104 61911 167699 -116522 -111103 -40202 -309661 17636 8476 -331737 -75464
19080A6828N0329c08177E8545Q1967d2434m96869D4162j2021J49331c64758a16728
19068i0763j9295j46222D3626b69700f5578B5860b46002J04877D790k312b19482
19056h2033B9502J76144h4922a2885q2589K3490Q739A9296M35348A8669b20942
19044a52272d9771o0324d1022J1773B00010E1299a07152D7981a41911a9209m12505
19033d31714h2346B64167a61167A070f7258K4756I1084m3600c5466B42378D8344
19021C57145H0030J71888d5320N199B3975b96705E040a76196B36210h9221m4225
19010a33446A65845A718d532B0582a8903m02249a43061k44212a65388l709m3857
18999b12954j663a5671n0649B696J28798a86891F2501K14851D1018a97514P9092
$$ plain form
19080 16828 67157 -308177 58545 140512 -42434 -539303 44162 32141 181472 -364758 -116728
19068 -90763 -110058 -256280 43626 -269700 -65578 25860 -246002 -141125 4790 2478 -219482
19056 -82033 29502 205646 -84922 -12885 -95474 -71984 -63245 19296 454644 18669 -220942
19044 -152272 -49771 -110095 -41022 -29249 200010 51299 -107152 47981 -141911 -19209 -431714
19033 -431714 -82346 264167 -161167 1070 -67258 -42502 91084 47484 -35466 242378 48344
19021 357145 80030 251918 -45320 -40121 23975 -296705 5040 -176196 236210 -89221 -133446
19010 -133446 165845 1718 -4532 20582 -18903 -421152 -143061 -387273 -165388 -169097 -212954
18999 -212954 -214617 -15671 -66320 2696 131494 -186891 62501 277352 41018 -197514 -118422
18988a18422m8464e6230j46753L8646f3727j02384L3984j73794A52710a11285
18977d4012A36069B9382N6433g0930b9314C75473g442k77495J07040j25148A58865
18965d22349i8004k85752B62643f3248A14138q056h6276d164m16381E7918c43441
18953a00924j72972I3785J17566b224j48750O5509c5309C66987i3851p2022k03773
18942c69646B61380a85074a9804j32383o4367m6099A55839c2348p1044C48472
18931a1478l04665B15287d497E6536J16048a29784m0713A84838c01821d4719j56309
18920b01028g8222B02892b0866F4309a48655j63687J48417r0949K1519B25314
18909A48372f657C1592c83388C1113k265J96471a8803A16367a25967I1864b65237
$$ plain form
18988 -118422 -166886 -56230 -202983 -164337 -63727 -166111 -132127 -305921 152710 -111285
18977 -44012 136069 29382 85815 -70930 -29314 375473 -7442 -284937 -177897 -303045 158865
18965 -422349 -98004 -383756 262643 -63248 114138 106082 -86276 -4164 -420545 57918 -343441
18953 -100924 -273896 93785 211351 -2224 -150974 -85465 -35309 366987 -93851 -165873 -369646
18942 -369646 261380 -185074 -19804 -152187 -216554 -262653 155839 -32348 -103392 348472
18931 -11478 -316143 215287 -4497 56536 172584 -129784 -170497 184838 -301821 -44719 -201028
18920 -201028 -78222 202892 -20866 64309 -148655 -312342 -163925 -254874 -233355 225314
18909 148372 -6657 31592 -383388 31113 28848 225319 -18803 116367 -125967 91864 -265237
18897H254a07001E2621J64524f1871D5872J14514N7345J29336c4917M6B2064g1466
18884i6158r8302A46787h0531L2986j08719N3073G1219a86501Q7936j59035H6015
18872h0662B0448R1864a07421q5969M8779L1098A7623R9760h287l97892R1112
18861c15067Q1324P4902j65432F1924b83489a5881O551F1805a896B20446c08008
18849b2135H5495J44125a62629A69787B2569d6198j56453B89633f362m9888j82524
18838b38774B80298a18355K6758c3770j28087E9760a11195B38279a94748o2469
18828b57217K3292R9681r4724a3529C53450A56247Q4931A01120K65461a74284
18817A43889i5754c4880D09081E8934J37771D4472J56382J14409I1286b98203
$$ plain form
18897 8254 -107001 52621 217145 -61871 45872 160386 217731 347067 -34917 -34871 22064 -71466
18884 -96158 -194460 146787 -80531 -47545 -156264 -103191 71219 -186501 -98565 -257600 86015
18872 -80662 20448 112312 -107421 -193390 -144611 -113513 17623 117383 -8287 -406179 -315067
18861 -315067 -233743 -158841 -324273 61924 -283489 -15881 -9330 61805 -1896 220446 -308008
18849 -22135 85495 229620 -162629 169787 22569 -46198 -202651 289633 -6362 -56250 -238774
18838 -238774 280298 -118355 -91597 -33770 -161857 59760 -111195 238279 -194748 -257217
18828 -257217 -233925 -134244 -228968 -13529 353450 156247 241178 101120 366581 -174284
18817 143889 -95754 -34880 409081 58934 196705 44472 200854 315263 91286 -298203
18806b7277D09427c16873j84073A8009L9697J28784c74549A29178l3323b27835
18795H3643a558j52690A25222e4371G7568i2767A36611a36493A2804b76519a23308
18783B05951i3901k91032a25129j13016r5821J22099j98273A90993b03999j71298
18773c75297a16712r8570C1872a58489a344j66560A42692m5122k9260a23964C8670
18761a60414C312R9988l7800a15324B753L2743A1316b32864A16592a35553q1434
18750b16987J2534B4380b27820J08802l05776a85803L1230j30298H8957f0585
18739f3460n5110e3808K2987j31055B1671a14347k22320J63582G9767b4797j70459
18728a95256C28019a44043k1137c8999A52346a68400P1852A22497J04718b78626
$$ plain form
18806 -27277 409427 -316873 -500946 18009 57706 186490 -374549 129178 95855 -227835
18795 83643 -1558 -154248 125222 -54371 77568 -92767 136611 -136493 12804 -276519 -123308
18783 205951 -93901 -384933 -125129 -238145 -333966 -211867 -410140 190993 -203999 -375297
18773 -375297 -116712 -215282 31872 -158489 -1344 -167904 142692 97570 68310 -123964 38670
18761 -160414 3312 103300 65500 -115324 2753 35496 11316 -232864 116592 -135553 -216987
18750 -216987 -204453 24380 -227820 -119018 -424794 -185803 -154573 -284871 88957 -60585
18739 -63460 -118570 -53808 -30821 -161876 21671 -114347 -336667 -173085 79767 -24797 -195256
18728 -195256 328019 -144043 -165180 -38999 152346 -168400 -96548 122497 227215 -278626
18717b12307d8370F332L05508A18786m2854B8335b6802E9471b31050E3983O3803
18706A17786c23261h8094H4422h0079A41495K5584b38775a01409m7700F6731b61898
18694A8831J16878m6636K58894h2731A6317R2463k2509a42773a4607A35671a61082
18682E8008J02874a03836F0561b6512H1873b99238J45407j21702c3319F2377c7159
18670A93263e9929B01559k6935c73341J45738m5520c8567k21522a1934n3378l740
18659f9052C3206R2245a57741k11638b33l02390B97213d7270m0471K5679j77479
18648b39541N8069a7756H8345g2599K7115j89113A08284b2185G5383a74859G3916
18636a30021j3628j1139J9377A67710b32463c3853J1655B313i5705A0869a39571
$$ plain form
18717 -212307 -48370 6332 311840 118786 75932 28335 -26802 59471 -231050 53983 117786
18706 117786 -323261 -88094 84422 -80079 141495 167079 -238775 -101409 -149109 66731 -261898
18694 18831 135709 89073 347967 -82731 16317 108780 86271 -142773 -14607 135671 -161082
18682 58008 160882 -103836 60561 -26512 81873 -299238 -153831 -275533 -33319 62377 -37159
18670 193263 -59929 201559 174624 -373341 -227603 -273123 -38567 -260089 -11934 -65312 -69052
18659 -69052 33206 125451 -157741 -369379 -233 -302623 297213 -47270 -87741 -62062 -239541
18648 -239541 -181472 -17756 88345 -72599 -45484 -234597 108284 -22185 75383 -174859 73916
18636 -130021 -143649 -154788 -135411 167710 -232463 -33853 -22198 2313 -95705 10869 -139571
18624I8561e2806j6761n0109A01490a6588l57923a01687A26350e2879k35181J43095
18613a44965A28959b49853H0892e2122F2812h0010A62305a17106A55617a46862
18602d3631l25306b0526k11717h7624E66K28503d5657k1557D6581a72079A9676
18590a66627I3353a31417o7102I4917R3174b54223a11100k6362j7045A47390A0117
18578A06479a75524A72203J79933b79186a4480q6565q0325j84713J31988k66643
18568e00738a48485A55117a25111A33750J61214j07379f27720a6726j6282A21292
18557B5323a34028H1511b39685J08725e1045j33132j81564d8907l71129a11526
18546b59927j0331a05153C19820a43409C38346A11062b24843j56995g6014m5907
$$ plain form
18624 98561 -52806 -69567 -119676 101490 -16588 -374511 -101687 126350 -52879 -288060 -144965
18613 -144965 128959 -249853 80892 -52122 62812 -80010 162305 -117106 155617 -146862
18602 -43631 -368937 -20526 -232243 -87624 566 229069 -45657 -67214 46581 -172079 19676
18590 -166627 93353 -131417 -198519 94917 188091 -254223 -111100 -137462 -154507 147390 10117
18578 106479 -175524 172203 352136 -279186 -14480 -101045 -181370 -366083 -234095 -500738
18568 -500738 -148485 155117 -125111 133750 294964 187585 -627720 -16726 -33008 121292
18557 25323 -134028 81511 -239685 -130960 -51045 -184177 -365741 -48907 -420036 -111526
18546 -259927 -270258 -105153 319820 -143409 338346 111062 -224843 -381838 -76014 -121921
18536a21921B25554d37348e8580a6632M821q9949C10447a85070I1745g3108C6160
18524c3045A08473O0727C875c95385C29068d3957m96707J55324g1946j9108a6686
18512B6515J04280E2995b76925e9597A07454B0878K1114K35684a0797j65780A63428
18500A54845h537k51870a0988A40918a49413k29779J41989Q0982b9363E9575i714
18488A64981G5620K39662l1438b51063J19340A57474b17883E3325a9118B47652
18477a75854c3686B18168a70662B789i7202k3144L7660j7341k94429A34822c3954
18465h2222A32459a77176j0930K6765F7052a79242I235J7982a60595P6663b9394
18453c06144B1401J79832l4341a26443A80031a62551B8611a14488C871g2868j76211
$$ plain form
18536 -121921 225554 -437348 -58580 -16632 -11811 -101760 310447 -185070 91745 -73108 36160
18524 -33045 108473 169200 3875 -395385 329068 -43957 -540664 -385340 -71946 -91054 -16686
18512 26515 130795 52995 -276925 -59597 107454 20878 41992 277676 -10797 -176577 163428
18500 154845 -8537 -260407 -10988 140918 -149413 -379192 -237203 -156221 -29363 59575 -9714
18488 164981 75620 315282 283844 -251063 -131723 157474 -217883 53325 -19118 247652
18477 -175854 -33686 218168 -170662 2789 -97202 -120346 -82686 -100027 -394456 134822 -33954
18465 -82222 132459 -177176 -188106 -161341 67052 -179242 9235 27217 -160595 -83932 -29394
18453 -306144 21401 201233 166892 -126443 180031 -162551 28611 -114488 3871 -72868 -249079
18442b49079a08455i288B9524b23581c4936A69946b01842q9749j0490b6014j38644
18431a64658k15802d3374B6253i861r0815A20828i2103D3002A0946M22684a8503
18419A28178B5777a87943C6966d79580a62221B08544B218a68520B59802m2464
18409B17338a14858C40679b7264H7157J50480j11010a37889F7254b85152J38029
18399a47123N8882L3691k57669I4361a38030k58936A07799b24038p471K5478M4046
18388a61985P6793D8756i3825c269k2239h879j93320D4026a70400g7237r8182
18377a75419P1259A78328f7834K7182r8612J1413f0418m6079E7764J03786B6525
18365B64037j03769a7514B11381r9324a03330A46876K470p1469K81299b07202
$$ plain form
18442 -249079 -108455 -9288 29524 -223581 -34936 169946 -201842 -291591 -302081 -26014 -164658
18431 -164658 -380460 -43374 26253 -9861 -100676 120828 -92103 43002 10946 433630 -18503
18419 128178 25777 -187943 36966 -479580 -162221 208544 2218 -168520 259802 217338
18409 217338 -114858 340679 -27264 87157 237637 126627 -137889 67254 -285152 -147123
18399 -147123 -88241 -54550 -312219 94361 -138030 -396966 107799 -224038 -231509 -206031 -161985
18388 -161985 -85192 48756 -93825 -3269 -25508 -8879 -202199 44026 -170400 -77237 -175419
18377 -175419 -104160 178328 -67834 -40652 -139264 -127851 -60418 -106497 57764 161550 26525
18365 264037 160268 -17514 211381 112057 -103330 146876 149346 77877 359176 -207202
18354E7863j8408a86692D6371a45070N8165l8801k07032a09120b7269C4021c43899
18342B51261a17172j52624A5360h1163k94768C8965A3061M1201O0774K06683C6963
18330a67143K270E6111k5630b3639G2425J61946a93062A50580c50063D7940b7210
18318A88299B4213a29376R36A89456j9366a57178R2K2585O3264j40104h3375H9480
18305A62750b0367q6231n9176N8487C547M8955O9330J73285A7342a09124k83534
18294c92658B35340a17531j13631p9074i9570C538b5364q6079I4947c04214a9954
18282c7384M293A01825c073E103j877f7358j83483C69125b15805k4146j53018
18271c92969C5246e5797j09185B27767l9493m3452g5448I9248d5333C01199C9738
$$ plain form
18354 57863 39455 -186692 46371 -145070 -86905 -125706 -332738 -109120 -27269 34021 -343899
18342 251261 -117172 -269796 15360 -81163 -375931 38965 13061 54262 115036 321719 36963
18330 -167143 -164873 56111 30481 -23639 72425 234371 -193062 150580 -350063 47940 -27210
18318 188299 24213 -129376 -128440 189456 170090 -157178 -157086 -134501 -71237 -211341 -83375 89480
18305 162750 -20367 -106598 -165774 -107287 3547 52502 121832 295117 17342 -109124 -392658
18294 -392658 235340 -117531 -231162 -310236 -99570 3538 -25364 -111443 94947 -304214 -19954
18282 -37384 -33091 101825 -3073 5103 3226 -67358 -250841 369125 -215805 -239951 -392969
18271 -392969 35246 -55797 -164982 227767 188274 144822 -75448 99248 -45333 301199 39738
18259f9660C04194b86185e1081j21584j08486a13104A87090A636a16572M2206
18249g4366C051K43493q9866D3258a97886j021j61471f3095a8025A49436b5266
18237i9831A52153J66186j43277c89046E6002b20992C21206i1767j03791a5613
18226c62654a6525A18015D6704d8098b0796A64840J94559a62919a6451C937d7970
18214e21984A72858q724b54937G3522b27730Q3958o7742G6631K5402C9144L93927
18203D33071A1176K25476j00682c7133D7841d11798C47727A25617B8716a68885
18192A06949R3388a62484D6779P1974C766J67956M8743A4052g2203A08411b12569
18180C2774a41843N5643A1102J83372r3951a18699k57875A3040L21153A3704o634
$$ plain form
18259 -69660 304194 -286185 -51081 -172665 -281151 -113104 187090 1636 -116572 -74366
18249 -74366 3051 246544 156678 43258 -197886 -198907 -360378 -63095 -18025 149436 -25266
18237 -99831 152153 318339 175062 -389046 56002 -220992 321206 -91767 -195558 -15613
18226 -362654 -16525 118015 46704 -48098 -20796 164840 359399 -162919 -16451 3937 -47970
18214 -521984 172858 164134 -254937 73522 -227730 -143772 -211514 76631 102033 39144 433071
18203 433071 11176 236652 135970 -37133 47841 -411798 347727 125617 28716 -168885
18192 106949 200337 -162484 46779 118753 3766 171722 220465 14052 -72203 108411 -212569
18180 32774 -141843 -86200 11102 194474 100523 -118699 -376574 13040 334193 13704 7070
18169G070b33611R665h8928B21485b25716B20433b63320M0287B47373j20533b7229
18157a55853P3566b6687j2053n6890m7150j03287R4594C61431a10247B3136b92393
18145B1357J14887L2000b02539O1224b1104j90024m1143A01112A5842Q9332B9377
18133C309e31437b32466B04855I9912c2136j16248P0219G4236a75247b3856C28983
18121a35880A448a51243L6297e5520k12771C4035b65950h9406d2214H6425K578
18110H9003a9593r4776o1249e602l1740A7314b67385A75379a64926g8120J9605
18099e8515j3847J1230k50972B48058b8786l14136R2086b5210F3603i942k17856
18088b27798a08139A27102a50628j29437a7073m8249B09355a16384A3215J29360
$$ plain form
18169 7070 -233611 -223946 -88928 221485 -225716 220433 -263320 -223033 247373 126840 -27229
18157 -155853 -82287 -26687 -38740 -95630 -142780 -246067 -151473 361431 -110247 23136 -292393
18145 21357 136244 168244 -202539 -141315 -21104 -211128 -252271 101112 15842 105174 29377
18133 3309 -531437 -232466 204855 99912 -32136 -148384 -78165 74236 -175247 -23856 328983
18121 -135880 1448 -151243 -114946 -55520 -268291 34035 -265950 -89406 -42214 86425 89003
18110 89003 -19593 -114369 -175618 -5602 -37342 17314 -267385 175379 -164926 -78120 -58515
18099 -58515 -72362 -61132 -312104 248058 -28786 -342922 -250836 -25210 63603 -9942 -227798
18088 -227798 -108139 127102 -150628 -280065 -17073 -65322 209355 -116384 13215 142575
18078A42575c19632a43610L2065k1732C8201b32857H4888b05652e7485F7903A8449
18066B87951D0867Q9825J22344H1301a64645b7354j49248C4492b12444O1251f0136
18054G3916a17187A00132b47023O3438k7691o1831M1037K4401b4687l4464p4646
18043a33797B60497h944k27014Q2032f2579E8239k6536b3593p8883B35604O2088
18032B97692H4131e05043a33294F6461k4417a92918B7811f9922A29298a29410
18021i6885B4670d8867B54193a84073e7886j32428A87868g095n9878B75089A8638
18009A0251M9868M6698A3318J56787e1744F4936i5160f935A45440c4983B2843
17997d3892a0733E2042b7165A80806D8203a15734A00901h6559A84591a61360O2460
$$ plain form
18078 142575 -319632 -143610 -111545 -133277 38201 -232857 84888 -205652 -57485 67903 18449
18066 287951 40867 130692 253036 81301 -164645 -27354 -176602 34492 -212444 -151193 -60136
18054 73916 -117187 100132 -247023 -183585 -211276 -273107 -232070 -207669 -24687 -59151 -133797
18043 -133797 260497 -8944 -235958 -153926 -62579 58239 31703 -23593 -102476 235604 297692
18032 297692 84131 -505043 -133294 66461 42044 -192918 27811 -69922 129298 -129410
18021 -96885 24670 -48867 254193 -184073 -57886 -190314 187868 -7095 -66973 275089 18638
18009 10251 60119 106817 13318 170105 -51744 64936 -95160 -6935 145440 -34983 22843
17997 -43892 -10733 52042 -27165 180806 48203 -115734 100901 -86559 184591 -161360 -98900
17986i8900C2215N9121a20583A64809p2439b00609i4248A54472m4717R0359c0345
17974e3576A4475f2537q7071I2450i3949A4452h725B67866i4267M0261H4085a32623
17961a0001I6208a7235j32426a7044j85692K0445B32111G4517N7073i817j75716
17950a85533B29327a81902B6667b891j93792B14095D9184k074M9370a48096M6591
17939a01505o1766f2779r616G7689B8540a83042B86103B5869A218e3514o9988
17928a23502I521J70437a02229A51167b61257c4107j61337I1798b8174E5285b47971
17916B45071a74653j1329F0408R054a43031k3253E6430a11337A66307B879c19971
17904c5177B59455a50536M84D3191Q1581c27330B20789I2802c6325o6462I9605
$$ plain form
17986 -98900 32215 91336 -120583 164809 92370 -200609 -94248 154472 109755 200114 -30345
17974 -53576 14475 -62537 -149608 92450 -93949 14452 -8725 267866 -94267 -54006 84085 -132623
17961 -10001 96208 -17235 -149661 -17044 -202736 -182291 232111 74517 131590 -9817 -185533
17950 -185533 229327 -181902 26667 -2891 -196683 214095 49184 47110 96480 -148096 -101505
17939 -101505 -163271 -62779 -72395 77689 28540 -183042 286103 25869 1218 -53514 -123502
17928 -123502 9521 179958 -102229 151167 -261257 -34107 -195444 91798 -28174 55285 -247971
17916 245071 -174653 -185982 60408 69462 -143031 -166284 56430 -111337 166307 2879 -319971
17904 -35177 259455 -150536 -150052 43191 124772 -327330 220789 92802 -36325 -102787 99605
17892F7439K94295B5740P1257M7866h4509j5212j41212N3012J0662Q3896h933
17880A60752a95797j7598D1516b07663D9082h0788B19713a41455p379c8479A68888
17868g4307j73817C2338b36638C2099a88502b7131j0410m5695q2918q841q3781
17857b58776C2370J9829e6796H5424g7445L0625A33197b68578B55487g6722k08928
17846b85650B6197a90947k0175B04161B9967J35971b46334J2452B9109b16373
17835a64443j94677c852k84505B54585a10642K1781B29271h9817A3430b86852
17824F7712b05732H3959a64898j81802B1487R1190K9003h4086A06416b05569f4927
17812f2224j18185I249c7249a5633B66270i071A73567b25016j06319J53864f5347
$$ plain form
17892 67439 361734 25740 96997 144863 -84509 -99721 -240933 -187921 -177259 -93363 -8933
17880 160752 -195797 -213395 41516 -207663 49082 -80788 219713 -141455 -148834 -38479 168888
17868 -74307 -248124 32338 -236638 32099 -188502 -27131 -37541 -83236 -166154 -174995 -258776
17857 -258776 32370 52199 -56796 85424 -77445 -46820 133197 -268578 255487 -76722 -285650
17846 -285650 26197 -190947 -211122 204161 29967 165938 -246334 -233882 29109 -216373
17835 -164443 -359120 -3852 -288357 254585 -110642 -88861 229271 -89817 13430 -286852
17824 67712 -205732 83959 -164898 -346700 21487 112677 141680 -84086 106416 -205569 -64927
17812 -62224 -180409 9249 -37249 -15633 266270 -9071 173567 -225016 -331335 -177471 -65347
17800B14957d5898C0709a09141J5534r7500O7934d6900C45506h919n3862o4174
17789a26955j86691H6657b31339K349A61313g054n3090D15425q2836e2997C17235
17777B75256D8392b08913A59820e6482j87487i238m8703G758i3525C5177L7214
17766G2391R0771b05380E3042J34426n1508Q9216a92086A79209H2153d3007I2739
17754B36751F0507J4447a28403A32710g6607E5010i7011B6549a75242H1487a33546
17742b38274J08563d0521C7908d0194k59931F260J36661l4705h9198C36384a80163
17730C58411a45224K2184B61508B972c17569D7323b87367F3707f7118J2442b4300
17718a62074N2935D32732j70777D8947L1677R141P9506a48739C28571A41503L54253
$$ plain form
17800 214957 -45898 30709 -109141 -93607 -191107 -123173 -46900 345506 -8919 -62781 -126955
17789 -126955 -313646 86657 -231339 -228990 161313 -7054 -60144 415425 332589 -52997 317235
17777 275256 48392 -208913 159820 -56482 -243969 -9238 -57941 7758 -93525 35177 72391
17766 72391 163162 -205380 53042 187468 135960 225176 -192086 179209 82153 -43007 92739
17754 236751 60507 74954 -128403 132710 -76607 55010 -97011 26549 -175242 81487 -133546
17742 -238274 -129711 -40521 37908 -40194 -300125 6260 142921 108216 -89198 336384 -180163
17730 358411 -145224 -123040 261508 2972 -317569 47323 -287367 63707 -67118 -54676 -24300
17718 -162074 -109139 432732 261955 48947 80624 89765 169271 -148739 328571 141503 495756
17707D95756F485J5899o850a09168D2207a81421c8065n9803H1967l8696R3368
17696A36639k8156G821J28422a56175A56306a6463A80533H0438e1474q4491f1550
17684h7579B58755o5708h9606j4954C19218J35392A64832b01364B24759d3153
17673B31485G7539a83089B20182j01343c1811F6468A7142K2584M8949C3525f2513
17661A80603b59253e313j06771D6204J10705J28881r3666J02843B4770c1008j44956
17650a75964D2072j7290b15627c2545j34937d9823A6346b08432A34979b40448
17639h2721B65500A7348L04699k5292f0740A74010d6587k934e799o9504A84041
17627B59964a14983M1559F4953J20680b27236f1676k08425C630L59437Q6200b55365
$$ plain form
17707 495756 6485 22384 15534 -109168 42207 -181421 -38065 -97868 81967 43271 136639
17696 136639 108483 7821 136243 -156175 156306 -16463 180533 80438 -51474 -135965 -61550
17684 -87579 258755 193047 -89606 -104560 319218 454610 164832 -201364 224759 -43153
17673 231485 77539 -183089 220182 118839 -31811 66468 17142 39726 88675 33525 -62513
17661 180603 -259253 -5313 -112084 46204 156909 285790 192124 294967 24770 -31008 -175964
17650 -175964 42072 24782 -215627 -32545 -167482 -49823 16346 -208432 134979 -240448
17639 -82721 265500 17348 322047 296755 -60740 174010 -46587 -49521 -5799 -75303 184041
17627 259964 -114983 -73424 64953 185633 -227236 -61676 -270101 3630 363067 449267 -255365
17615h9348A45685a38543C50N1893R1744m4790b91225J04321A47107N4470p8628
17604A22949K52949j36930c18627i5116B80860D8618J3822a37507B18850G7765
17593B37708a82260C7688a37480B8812K47370A05386b27994o7275a01906A33658
17582D1715g6708G9012C0725K91319A28446O2318b40724m7091I1356J01211D9370
17570a19139D03745c1492C26445E8686J37369p1837c0254k00609B75019a74768
17559a68165I8303f2186Q828A16619A0663K11134B6490f2998b5504k1865B27066
17547a9453l2013B5032f0633N757B62921l3716b2248A71796h0063G233K57610
17536B64843Q8673a45164a8027C08241K94734D4728K89541a37335F2791K7583
$$ plain form
17615 -89348 145685 -138543 350 52243 143987 99197 -291225 -186904 147107 201577 122949
17604 122949 375898 238968 -318627 -95116 280860 48618 62440 -137507 218850 77765
17593 237708 -182260 37688 -137480 28812 276182 105386 -227994 -295269 -101906 133658
17582 41715 -76708 79012 30725 322044 128446 190764 -240724 -287815 91356 192567 49370
17570 -119139 403745 -31492 326445 58686 196055 124218 -30254 -230863 275019 -174768
17559 -168165 98303 -62186 -53358 116619 10663 221797 26490 -62998 -25504 -47369 227066
17547 -19453 -51466 25032 -60633 -54876 262921 229205 -22248 171796 -80063 7233 264843
17536 264843 353516 -145164 -18027 308241 602975 44728 334269 -137335 62791 90374
17526I0374b3839B78334c356o7377C40433A27506O1836L5594F0905b5607B18083
17514A44025a8319B1589a03196K8219K6432I5465g5498G9833a76221b4704I5126
17502a46459G5748J04661a68948j28526H563K47396c19116A10386L17248A02777
17491B78819q8544j1308a08431B00538E2932i2990l3621A20765K42500r1413f4259
17479E4151b0514m6807b3436A77664a58439a2988k7302p1509B05992J36105j49012
17468A93085J86515j44133A10574m8700P8214a35358c1550A39068a75413A73928
17457C7317M7338J31067a15776c832q9545A89050O7312L50785B69887A01756L43663
17446D45419l8273n0583e4766E14407j29726A56806L4072a07180B63855o7748
$$ plain form
17526 90374 -23839 278334 -3356 -70733 340433 127506 189342 224936 60905 -25607 218083
17514 144025 -18319 21589 -103196 -74977 -48545 95465 -75498 79833 -176221 -24704 95126
17502 -146459 75748 180409 -168948 -297474 8563 255959 -319116 110386 427634 102777
17491 278819 190275 178967 -108431 200538 52932 -92990 -126611 120765 363265 271852 -64259
17479 54151 -20514 -67321 -23436 177664 -158439 -12988 -40290 -111799 205992 342097 193085
17468 193085 379600 235467 110574 61874 140088 -135358 -31550 139068 -175413 173928
17457 37317 84655 215722 -115776 -3832 -93377 189050 256362 607147 269887 101756 445419
17446 445419 407146 356563 -54766 514407 384681 156806 190878 -107180 263855 196107
17436A96107Q5718p4528J52386N2796A94599O710m3981J82469j02173c63639D4916
17424C48576J7363j27623D9825R7616Q0371j11733J50250O2995a16803C19396
17413B61877j11553J74671a2616B21926R0340p4350r7390B0537K52624g2773C25098
17401B6894c2779C40777a04715B21518a31930A84472H0840g1594C03580B6261
17390A81254N2896r3360d6170A33177f4801B42176h6909G9835b5283D6817J54753
17379B01570a25787A07963J36335h1373D87522k21374d1682A45209l1015K60959
17369C75153j71146p6154e6734C27143k6038K2418a89084B39468A10504l1973
17359G8531M6257a72350A64644o7068K80933j32423q5059n57L7869G2532K2523
$$ plain form
17436 196107 281825 207297 359683 412479 194599 201309 157328 339797 237624 -363639 44916
17424 348576 365939 238316 49825 147441 227812 116079 266329 329324 -116803 319396
17413 261877 150324 324995 -12616 221926 312266 237916 140526 20537 273161 -72773 325098
17401 26894 -32779 340777 -104715 221518 -131930 184472 80840 -71594 303580 26261
17390 181254 234150 140790 -46170 133177 -64801 242176 -86909 79835 -25283 46817 201570
17379 201570 -125787 107963 244298 -81373 487522 266148 -41682 145209 114194 375153
17369 375153 204007 127853 -56734 327143 301105 323523 -189084 239468 110504 78531
17359 78531 124788 -172350 164644 97576 378509 246086 161027 160470 198339 72532 95055
17348I5055K22856A26648M8537P2329a23529A17635C9535A0632M06230b22446
17337B08993b35646d0638F3732L09789j64669H0357M3923D8361M38054D0880K07863
17326B48743j02602J22102J17566k4418A57909m6929a31372i474B76565A0339
17315H4650K78126o2697J03096F4111j9827J74207n696G0405a14419G6855K83584
17304C60439g550B44327R2553D5525K88535p5006n7177K4432P5704I2164L0317
17293A22481L415K15573A0473J75088F1515J29763R531O5575r1106K88938D833
17281C1430O7825b14196D96510j07227j58581J53504A12117J24411a2074p814
17271a9888A62126J17302H8624K2224l9623a92076B15389N0279H7720l8643M7784
$$ plain form
17348 95055 317911 126648 175185 247514 -123529 117635 39535 10632 416862 -222446
17337 208993 -235646 -40638 63732 373521 208852 80357 124280 48361 486415 40880 248743
17326 248743 146141 268243 385809 361391 157909 110980 -131372 -9474 276565 10339
17315 84650 362776 300079 403175 64111 44284 218491 212795 70405 -114419 76855 360439
17304 360439 -7550 244327 336880 45525 334060 259054 201877 226309 302013 92164 122481
17293 122481 125896 341469 10473 185561 61515 191278 200809 266384 175278 464216 4833
17281 31430 99255 -214196 496510 389283 230702 384206 112117 236528 -12074 -19888
17271 -19888 162126 279428 88624 110848 71225 -192076 215389 265668 87720 49077 96861
17260I6861O895K66188g1105p7610B27884K85681A17708L95526j88522g2307j03260
17249a75567D0925K3847L35647p9970e0217B27817D8388A3566K53035N6966F0214
17237B10508J59278q932n8489P5655Q0793A47068L10433B14706h7888E7363R504
17226F6867J89965j10071J48759q1585b51590h6477D19137j16702n6246a3047
17215A36584J24708L3731n8437I6826D5733K7291K04810A18602E5223K28327l4812
17204B48738K49245j69764j11538j00945K3893d8839B91266K3666E3037N00888
17194E53925k5110B05825m4796O5177E7254Q9471K3281K83999A47693J87325K7888
17183C62906N9893j86656K83852j37178M995j18131J63214k6506A17236L23861
$$ plain form
17260 96861 103756 369944 -71105 -148715 227884 513565 117708 513234 324712 -72307 -175567
17249 -175567 40925 64772 400419 320449 -50217 227817 48388 13566 266601 323567 60214
17237 210508 369786 360854 302365 378020 458813 147068 457501 214706 -87888 57363 66867
17226 66867 256832 146761 295520 213935 -251590 -86477 419137 302435 246189 -13047
17215 136584 261292 295023 236586 96826 45733 73024 277834 118602 55223 283550 248738
17204 248738 497983 328219 216681 115736 139629 -48839 291266 314932 53037 553925
17194 553925 528815 205825 161029 226206 57254 146725 170006 454005 147693 335018 362906
17183 362906 422799 236143 519995 382817 387812 269681 432895 406389 117236 441097
17173D41097n335j19592J17415A84412J23966J71162K61071A55682J09625B8883
17162D59868P8587j24216K4008j08396J74268B20208n807K11500j8709l8791A42962
17150b13864B87508J3933Q8513n8217I9228J43622P4740L07665j09542B15651
17139A35476L77695B51907k6157m2481O3094o5461Q8589J94107j48827Q0796j36372
17128B59195L39418j56574K23044k82789p1771J21712J32491N6757l1067J10096
17118G00512C48426j06592J7074K14897j09131n7794j30846O3530L58795q8988
17108E09371j59459l3785J11127L2536k05622M3085K998J74060l5418J661q8183
17097C52371R7131J34647k56976N1850K92269o3316L930B60313K32195j31373
$$ plain form
17173 441097 435762 316170 433585 184412 308378 479540 740611 155682 265307 28883
17162 459868 538455 414239 438247 329851 504119 220208 214401 425901 407192 368401 142962
17150 -213864 287508 301441 389954 331737 99228 242850 317590 625255 515713 215651
17139 135476 513171 251907 225750 183269 246363 180902 269491 463598 314771 395567 259195
17128 259195 598613 442039 665083 382294 310523 432235 564726 621483 590416 700512
17118 700512 348426 241834 258908 473805 364674 306880 176034 239564 598359 509371
17108 509371 349912 316127 427254 459790 254168 297253 300251 474311 438893 440554 352371
17097 352371 449502 584149 327173 379023 671292 607976 611906 260313 492508 361135
17087C61135P2383L1474J3979L63177m16486J32039J10252J35437B09797J79590
17077C89387k745j3338P8771B12519O10900j49163B32607J79178K44176k85144
17067C70817k9303J82910K71761k59920m5806j31532O53778k40838B29231J75228
17057D04459L26305l55976K15377j06408K54304k30714J32186j42179J56605o8911
17047E85048l089r3509M94713j08147j63574K09431l58475J1308J7161j749j27251
17036D61867N4314j87163K32081k46346M48458l64959J68009J50327l00428L43901
17026G60061p6033k43154K32021N4772J82802j90426j88555L32235q8292j23943
17016F51488K48614k28882K04966C51647N66620k67005J87974j95065K14210p0941
$$ plain form
17087 361135 433518 464992 478971 842148 425662 557701 667953 803390 209797 389387
17077 389387 386642 373304 452075 212519 823419 674256 232607 411785 655961 370817
17067 370817 341514 524424 796185 536265 490459 358927 1012705 771867 229231 404459
17057 404459 730764 374788 590165 483757 738061 507347 639533 497354 653959 585048
17047 585048 581959 488450 983163 875016 711442 920873 562398 573706 590867 589118 461867
17036 461867 516181 329018 561099 314753 763211 398252 566261 716588 416160 760061
17026 760061 684028 440874 672895 727667 910469 720043 531488 863723 775431 651488
17016 651488 900102 671220 876186 351647 918267 651262 839236 644171 858381 787440
17006G87440k91969J71765r7222L13007j34781R4213J39296k34842J19044n293
16996H60658k72916o1874K87783o5018R1549l32039O52832j56196J31417j78777
16986I57419Q6584M4550k42827N6041j40422M30505N7236k26212m31195R7978
16976F89657L72127j21654k56899L97840m4919j48523J51395p7399p0817K59845
16966A150653J59239k79867J84335k83924L26943j56294K00997k6747p5789p2962
16956A126584j35886L42017k62916k22809L64094O319k5931P8737N0607r7899
16946A222917k6475J38591k0376k00704K83318J56101j47729j28543r281J53122
16936A420941J05984r9147j45544o9809J36442J15462r9634J53154J80215o2651
$$ plain form
17006 787440 495471 667236 570014 883021 748240 842453 981749 746907 865951 860658
16996 860658 587742 525868 813651 748633 840182 508143 1160975 1004779 1136196 957419
16986 957419 1044003 1088553 845726 901767 761345 1191850 1249086 1022874 591679 689657
16976 689657 1061784 940130 683231 1081071 1036152 887629 1039024 961625 890808 1150653
16966 1150653 1309892 1030025 1214360 930436 1257379 1101085 1302082 1275335 1199546 1126584
16956 1126584 990698 1332715 1069799 846990 1211084 1217403 1191472 1270209 1320816 1222917
16946 1222917 1196442 1335033 1314657 1113953 1397271 1553372 1405643 1277100 1267819 1420941
16936 1420941 1526925 1427778 1282234 1212425 1348867 1464329 1364695 1517849 1698064 1635413
16926A635413l01970K87796l38641M68650M0021l5251j81631j97425J30289L82651
16916A889902j55293q9194n9751j29235K03675r0100O6666n1852J08551K07747
16906A901116k692j32612K3516K96621k20465K91361k97657J79608n3633K08473
16896B193636K5086j08593n4381J15906o3211J62601M971j8646n9815J00977J95819
16885B494350l32030k14913L29144Q1879J25844k13191K52685L49597k97123k36548
16875B339694N14080j25297J04878L3855q4673p9036K60968j13257M00704l10743
16865B941173J55596k60358K45739J77401j32625J42277J6048J34068O2745k23492
16855C258572J00166j23744K38635n0021K38008m5855K64396J56505m07294K55490
$$ plain form
16926 1635413 1333443 1621239 1282598 1751248 1791269 1756018 1574387 1376962 1507251 1889902
16916 1889902 1734609 1645415 1585664 1456429 1660104 1570004 1636670 1584818 1693369 1901116
16906 1901116 1898424 1765812 1789328 2085949 1865484 2156845 1859188 2038796 1985163 2193636
16896 2193636 2218722 2110129 2055748 2171654 2108443 2271044 2276015 2257369 2197554 2298531 2494350
16885 2494350 2162320 1947407 2276551 2358430 2484274 2271083 2523768 2873365 2576242 2339694
16875 2339694 2853774 2728477 2833355 2867210 2782537 2703501 2964469 2851212 3251916 2941173
16865 2941173 3096769 2836411 3082150 3259551 3126926 3269203 3285251 3419319 3482064 3258572
16855 3258572 3358738 3234994 3473629 3423608 3661616 3615761 3880157 4036662 3629368 3884858
16845C884858j78304N03979j6421J55134n3119K72047j47705Q6537n1307n273
16835D450426O8181K24241M07624l44242M30518j98615R0169L72485k31756j05005
16825E164026J88780Q0552M14098l1221K44119l84012J72970M56801k0440K78545
16815F564218K8026l29305R57828m12554l3929O58471m57953N26950L79241J50779
16805H031772L225K53513j00338Q953N56985P4834M5192J46634J20533M57835
16795I599138M44927K68275K43034K15579J87562L39097K29625J90752J63471
16786A1881460N00816N12196K44604K68069K94657M43266L20895L43148N42717
16777A5351828K19321P71821J59422N38338O10170O37504N52993O88665M39235
$$ plain form
16845 3884858 3706554 4210533 4194112 4349246 4296127 4568174 4420469 4507006 4455699 4450426
16835 4450426 4518607 4742848 5150472 4806230 5236748 5038133 5128302 5500787 5269031 5164026
16825 5164026 5352806 5433358 5847456 5816235 6060354 5676342 5849312 6306113 6285673 6564218
16815 6564218 6592244 6262939 7220767 6808213 6774284 7432755 6974802 7501752 7880993 8031772
16805 8031772 8034997 8288510 8188172 8197125 8754110 8828944 8874136 9020770 9141303 9599138
16795 9599138 10044065 10312340 10555374 10770953 10958515 11297612 11527237 11717989 11881460
16786 11881460 12382276 12894472 13139076 13407145 13701802 14145068 14465963 14809111 15351828
16777 15351828 15571149 16342970 16502392 17040730 17650900 18288404 18841397 19530062 19969297
16768A9969297Q02105O83754P06513P46939P44466M94568J234941Q16135R64431
16759B7163149J163682Q89237R50368J070219J414887J082442J725047J396040
16751C6855071J457375J405318J969213J686065J777260K044054K440861K282566
16743E1917783K304671K183284L024661K631282L350824L067801L266280L609481
16735G5356067L722193L955727M344332L946882M685581M298800M915893M724550
16727A09950025M944770N251348M381331M908030M713715M535853M012632L557391
16719A46255095L052665K507259J716277P99965O54092m04402j349832j824416
16711A51406703k355585l656125l662556m125500m350592m918202n165140n291984
$$ plain form
16768 19969297 20771402 21455156 22161669 22908608 23653074 24147642 25382583 26198718 27163149
16759 27163149 28326831 29216068 30166436 31236655 32651542 33733984 35459031 36855071
16751 36855071 38312446 39717764 41686977 43373042 45150302 47194356 49635217 51917783
16743 51917783 54222454 56405738 59430399 62061681 65412505 68480306 71746586 75356067
16735 75356067 79078260 83033987 87378319 91325201 96010782 100309582 105225475 109950025
16727 109950025 114894795 120146143 124527474 129435504 134149219 138685072 142697704 146255095
16719 146255095 149307760 151815019 153531296 154331261 154985353 154580951 153231119 151406703
16711 151406703 149051118 145394993 141732437 137606937 133256345 128338143 123173003 117881019
16703A17881019m586379n218874n177527n138900m364971m876927m333260m190668
16695G9993513l791097l842885l776321l715540k929247l387120k575770k856625
16687E3118908k620502k466138k094420k127650k214921j592943j750701j916623
16679C6335010j537196j221682j580079r22587j720587j081405r48723j135541
16671B6187210j076502j096046p96333o73199r03503q98529m78185r80773o87413
16662A8596727j74718j021766l87309o23924l73439n86208o41193l33312p60016
16653A3694842j94941l11001j06692n34551n67390j48538n71693j09941k98151
16644A0851944n41773j29613r4367n93063K04735o77762k23048J75113j44733
$$ plain form
16703 117881019 113294640 108075766 102898239 97759339 93394368 88517441 84184181 79993513
16695 79993513 76202416 72359531 68583210 64867670 61938423 58551303 55975533 53118908
16687 53118908 50498406 48032268 45937848 43810198 41595277 40002334 38251633 36335010
16679 36335010 34797814 33576132 31996053 31073466 29352879 28271474 27322751 26187210
16671 26187210 25110708 24014662 23218329 22545130 21641627 20743098 20264913 19284140 18596727
16662 18596727 18422009 17400243 17012934 16389010 16015571 15429363 14788170 14454858 13694842
16653 13694842 13499901 13188900 13082208 12547657 11980267 11831729 11260036 11150095 10851944
16644 10851944 10310171 10180558 10086191 9493128 9697863 9020101 8797053 8972166 8827433
16635H827433m55519l10587j67614l64493J15778j29306l67946k59606O2706m78328
16625F472518j2434K0609l0349j37056m91940K03743m96200j3612l1501p7408
16615E406370m9887k30563j70982J45769n19809J53706K67097j2594n94529o6385
16605D328193J70893o5528l44036J96654j76557j28599j06473k32730l0847P9252
16595C690222j09512L3309q51k68495j25545j6540j15682J71585k14760J56639
16585C200370k82149J39361j03083o2840k56713K35575j48858K03761k74217M01086
16575C052293m11956P9096j73020m1265k6328m07394L62570K1205k81304r0218
16565B083679j04360M0258O38561o97100j19603L83024K1708k62155P1258j40400
$$ plain form
16635 8827433 8371914 8061327 7893713 7529220 7644998 7515692 7147746 6888140 6950846 6472518
16625 6472518 6460084 6480693 6450344 6313288 5821348 6025091 5528891 5515279 5483778 5406370
16615 5406370 5356483 5125920 4954938 5100707 4580898 4734604 5001701 4989107 4394578 4328193
16605 4328193 4499086 4433558 4089522 4286176 4109619 3981020 3874547 3641817 3610970 3690222
16595 3690222 3580710 3614019 3613168 3344673 3219128 3202588 3086906 3258491 3043731 3200370
16585 3200370 2918221 3057582 2954499 2891659 2634946 2870521 2721663 2925424 2651207 3052293
16575 3052293 2640337 2719433 2546413 2505148 2478820 2071426 2433996 2455201 2173897 2083679
16565 2083679 1979319 2019577 2658138 1961038 1841435 2224459 2246167 1984012 2055270 1914870
16555A914870q6990K99532k72965j83089R5815Q6107j73517L6431J39288l53213
16545A502269L78227j46125m206k73464L02826K25236j51457l31865K17207k75998
16535A442650N3318J98147k96828K99761k47267p439Q2803J78022r3256n14153
16525A095758N78755l85968l8473L03643k58751k2643r7088Q6903L5M2174Q7182
16514A391527j26895J20398l5975M0443j43878k52163M08109k50678o8444k1683
16504A060761j03908L7021K09028p5085n5270j65132K41277m98409M00262k49603
16494H00942r9589N90710k74930K0979L1202l11079K05543k2093j35750r4142
16484G11793K0513O13424m19218k53128J68399L76188m91663L34089m02141p4076
$$ plain form
16555 1914870 1827880 2127412 1854447 1671358 1767173 1853280 1679763 1716194 1855482 1502269
16545 1502269 1880496 1734371 1730165 1456701 1759527 1984763 1833306 1501441 1718648 1442650
16535 1442650 1495968 1694115 1397287 1697048 1449781 1442342 1525145 1703167 1609911 1095758
16525 1095758 1674513 1288545 1250072 1553715 1294964 1272321 1175233 1262136 1262171 1304345 1391527
16514 1391527 1264632 1385030 1349055 1389498 1245620 993457 1401566 1150888 1082444 1060761
16504 1060761 956853 993874 1202902 1127817 1072547 907415 1148692 650283 1050545 800942
16494 800942 701353 1292063 1017133 1038112 1069314 758235 963778 941685 805935 711793
16484 711793 732306 1345730 926512 673384 841783 1217971 726308 1060397 658256 584180
16474E84180J00835r966j89087K87451l51240M21148j69779L54771l80611J68505
16464H16207P9630l74976J74371l04362M21131k5096O7373o7279N2185k46265
16454E92919k15031K3464M75380o792j29230n7256Q4187A44378N05270J26912
16444G76560C39441K48594k89779J19248J23548L3433j37372K77197C25098J04764
16434D29862r438M36607k23004l5161P3025j79106p5914O3470M22977l14346k47672
16423C41300K73531k52742p4753K55950k45796O2589L39716C31647N9481O7891
16413D59019j12263A24905J56832N33647k54578n6582N9441j55038J861r6847
16403C13641J35821m9322M5303R1959j87037K43936A18846N00598B01114K72563
$$ plain form
16474 584180 685015 675049 485962 773413 422173 843321 673542 1028313 647702 816207
16464 816207 895837 520861 695232 390870 812001 786905 854278 786999 839184 592919
16454 592919 377888 401352 876732 869940 740710 683454 767641 144378 649648 776560
16444 776560 339441 588035 298256 417504 541052 574485 437113 714310 325098 429862
16434 429862 420424 857031 634027 598866 671891 492785 416871 480341 903318 588972 341300
16423 341300 614831 362089 287336 543286 297490 360079 699795 331647 391128 459019
16413 459019 346756 124905 281737 815384 560806 504224 563665 408627 410488 313641
16403 313641 449462 400140 445443 537402 350365 594301 118846 619444 201114 473677
16393D73677P7655k62413r6469K4564J79254j61250K17984R3109B71335L8805
16383C10140j12042P2962K00113k07036Q3929j28218L36719j38016k1904o2950
16373C33697Q7255A88013M4068l9222J11606P6041A15912M00270A93629M30933
16363F24562H6142J25998F0880J58828R6122D716L52257N6864J39086j14491N3163
16352D91595J5684A47270J42280H9858K66148r4790K19994j78068n4151d63C10945
16340C13384j45923M39464B40617K37497B09914M20057B24608J5549o8306J29533
16330C01384J48342c9840D79371A45064F5327J90307l6890J05726j18528J1171
16320B17113l5898L4295L3096o8663j9050d7492A58002e9175A79793J01664G4758
$$ plain form
16393 473677 551332 288919 192450 217014 396268 235018 453002 546111 271335 310140
16383 310140 198098 271060 471173 264137 348066 219848 556567 418551 396647 333697
16373 333697 420952 188013 232081 192859 304465 380506 115912 516182 193629 624562
16363 624562 86142 212140 60880 219708 315830 4716 356973 413837 552923 438432 491595
16352 491595 507279 147270 289550 89858 356006 261216 481210 303142 248991 -463 310945
16340 313384 167461 606925 240617 478114 209914 629971 224608 240157 171851 301384
16330 301384 449726 -39840 479371 145064 65327 255634 218744 324470 205942 217113
16320 217113 181215 215510 248606 179943 160893 -47492 158002 -59175 179793 281457 74758
16308C13211r2161O4111H7921B2270a00795C00002c0473C49950C3091i1611C74576
16296D14J50712a24959A98106Q5323A19518L45779j32220B1990M7016J43163k5520
16285A86649L7801B7477J27933J1705h3855A58741J01950J41319C7184J61791
16275A98975b59906A28878L2320e6884B75962r7473e0027j13715A42168d4045
16264b35936a8570B48983q4321a46661b9948B07280J14506A48511J44583B1837
16253a4952A91980b25021A17086N5465P8868m8137d8302C79888A71585l3148J76288
16242C14725H2646C433L4406L08756j40610J3680F5260L11331A15798J38062C147
16230A52629F9090i9869B73391A14995b15583B60700P9592r3993D3041J66662
$$ plain form
16308 313211 221050 285161 87921 22270 -100795 300002 -30473 349950 33091 -91611 374576
16296 414 151126 -124959 198106 283429 119518 465297 333077 21990 69006 212169 186649
16285 186649 224450 27477 155410 167115 -83855 158741 260691 402010 37184 198975
16275 198975 -259906 128878 161198 -56884 275962 178489 -50027 -163742 142168 -44045
16264 -235936 -18570 248983 164662 -146661 -29948 207280 321786 148511 293094 21837
16253 -14952 191980 -225021 117086 172551 251419 203282 -48302 379888 171585 138437 314725
16242 314725 82646 3433 37839 346595 205985 219665 65260 376591 115798 253860 3147
16230 152629 69090 -99869 273391 114995 -215583 260700 340292 246299 43041 209703
16220B09703H6797a45667G4433K87810A38562a24915B40572o9043K2455n1334
16210A42650L80970D4537b43702A26960A7120N6324J23213E1588b69210A13420
16199A60216d7778j87315K5004Q8200b6458A05615i5874C9317b03456H7551d09721
16187E56887k15730R1631p7959a9591m4499j19377E8020e0634B78131D2838J29159
16176A71997O3035C3469N0150h3845b7074A72968a27804B61897q4912q7808b25585
16164a13706d2511A31263o2977a07752B78632g3185G2304d4410B57234d7740k3614
16153g1354A52545g7232j72485a5513F6974P3602b34041a4237k78065C6267J82065
16142B18332J19091e8323G520J76236D4760k1058R1829b35105A893K70736j33636
$$ plain form
16220 209703 86797 -145667 74433 362243 138562 -124915 240572 171529 193984 142650
16210 142650 523620 44537 -243702 126960 17120 73444 196657 51588 -269210 113420
16199 160216 -47778 -235093 -210089 -121889 -26458 105615 -95874 39317 -203456 87551 -409721
16187 556887 341157 432788 354829 -19591 -64090 -183467 58020 -50634 278131 42838 171997
16176 171997 235032 33469 83619 -83845 -27074 172968 -127804 261897 176985 89177 -225585
16164 -113706 -42511 131263 68286 -107752 278632 -73185 72304 -44410 257234 -47740 -71354
16153 -71354 152545 -77232 -249717 -15513 66974 140576 -234041 -14237 -292302 36267 218332
16142 218332 337423 -58323 7520 183756 44760 23702 115531 -235105 1893 272629 138993
16131A38993b38378n972F0599K05020H664b3913j12772B45974B9443M4177d6694
16119a18192b5444A70245a25324A40738I962e4192j49162I9248P9741D5033h725
16107D1108K4436c07082J5233D08578R2470A60637K15604k4444A08190l1168K86290
16096C63312A61060i4691q217A59835C3456N2172R3111L66682A04657J14171d4774
16084f888B18738r6672P327a18005H4306g4340G6b16478e3269A27735A156a81174
16071a73689C6372a43535b3099j37842C4435M8820A9763L353c62274A27974d84022
16059c80129P1123h3169E427J6033J13698m2552C4887e400A33984a04454C701
16047A50295c3387A32644O2477a4739B07170g2697A40286j109O8893a05259L0039
$$ plain form
16131 138993 -238378 -244350 60599 265619 8664 -23913 -136685 245974 29443 73620 -46694
16119 -118192 -25444 170245 -125324 140738 9962 -54192 -203354 99248 178989 45033 -8725
16107 41108 65544 -307082 -291849 408578 501048 160637 376241 351797 108190 77022 363312
16096 363312 161060 -94691 -102908 159835 33456 85628 178739 545421 104657 218828 -44774
16084 -6888 218738 122066 129393 -118005 84306 -74340 76 -216478 -53269 127735 1156 -181174
16071 -173689 36372 -143535 -23099 -160941 34435 83255 19763 23116 -362274 127974 -484022
16059 -380129 -309006 -83169 5427 21460 135158 92606 34887 -5400 133984 -104454 3701
16047 150295 -33387 132644 195121 -14739 207170 -72697 140286 139177 208070 -105259 -75220
16036g5220j54430l17876a57602A82413c5745B2619A0823e5582A64229F5880N0179
16025A16059B5928J17833a21593B97316c43636e8598I7726b67494H4641i0575
16014B10536a18608g212j01019A00843a80790g6571n9018k46218E1832L0318O8810
16003A50960A7437P6218a88503k23218a04470a4550l2738m1915B16868P3294g3196
15991b08324P0265e6687b917p4197j46248C53712a00959D29278r746A16439J62801
15980B79240A30200J8199b10931B33917J9840e6349j48692m9400B02115J79918
15970C82033b54636e7339A89099H0102c61307A65734a73486A0449K4847M2661
15960G7957K6653A7975J37724I863K61007f255l456G0756J1882L6093J5277B553
$$ plain form
16036 -75220 -229650 -547526 -157602 182413 -35745 22619 10823 -55582 164229 65880 116059
16025 116059 25928 143761 -121593 297316 -343636 -58598 97726 -267494 84641 -90575
16014 210536 -118608 -7212 -108231 100843 -180790 -76571 -135589 -381807 51832 82150 150960
16003 150960 17437 93655 -188503 -411721 -104470 -14550 -47288 -89203 216868 290162 -73196
15991 -208324 -138059 -56687 -2917 -77114 -223362 353712 -100959 429278 419532 116439 279240
15980 279240 130200 148399 -210931 233917 253757 -56349 -205041 -254441 202115 382033
15970 382033 -254636 -57339 189099 80102 -361307 165734 -173486 10449 35296 77957
15960 77957 104610 17975 155699 9863 270870 -6255 -9711 70756 82638 118731 134008 2553
15947D9633J11727d02325g6454m7747B4521K0093J04346F265b9865j78317b384
15935E0982h8296J5925q6698C25888b89346F0998a63158e3902b4507O899j8555
15924c6163j29471I8371d1055p7407A58974A9832i150l1926r5353A86144G8906
15912I8387J20873b83019a3579j78156c3599l53332e2781k54417D58498A9432
15901b93404A67727f0399k76047a16483E1444A6553M6434P6452a92750O2748j31136
15890b61138C6086J54127O5724A01497b17635R2827L5641A80530a43014D8698
15879a94139A01949C5407R2380f7577F8125Q9245b73987J14928c906o2354B8233
15867H846a27039o3714k3576A20138c8844A71529a90356j12548f8784B27474Q836
$$ plain form
15947 49633 161360 -402325 -76454 -124201 24521 44614 148960 6265 -29865 -208182 -2384
15935 50982 -88296 -72371 -159069 325888 -289346 60998 -163158 -53902 -24507 -17608 -36163
15924 -36163 -165634 98371 -41055 -118462 158974 19832 -9150 -41076 -136429 186144 78906
15912 98387 219260 -283019 -13579 -191735 -33599 -386931 -52781 -307198 458498 19432
15901 -293404 167727 -60399 -336446 -116483 51444 16553 62987 139439 -192750 -130002 -261138
15890 -261138 36086 190213 255937 101497 -217635 -124808 -89167 180530 -143014 48698
15879 -194139 101949 35407 127787 -67577 68125 157370 -273987 -159059 -3906 -66260 28233
15867 8846 -127039 -190753 -214329 120138 -38844 171529 -190356 -302904 -68784 227474 236310
15856B36310e4476k48002J12932a1408C20311a15178J4071b725k9155k15857A1997
15844h3604j94851l5994P4734I6582K27926b97661a9740m0989I3444c34317B76403
15832a1463j0517k63834a33800l1605b4179j62072B32922J75896i7177A8812c79135
15820A31146m2652a42791B38214a52261A44180a62808E6827j8693K80810e7020
15809B40598A7633g0341r0837A01641J87802I0107J2384J84111l5956d0354j11470
15798a51824e4043k56120K4205a14640j68526F2386b68107R5395I9540a77782
15787D3265a88329B04336p0774O5663K5471h1118k88870A80040j0785a49452A72171
15775i3169E9337A1675a35891A27500F2547a89120A15057I470b24991G8701K59738
$$ plain form
15856 236310 -54476 -302478 -189546 -11408 320311 -115178 -101107 -2725 -31880 -247737 11997
15844 -83604 -278455 -314449 -239715 96582 324508 -297661 -19740 -60729 93444 -334317 276403
15832 -11463 -21980 -285814 -133800 -165405 -24179 -186251 232922 408818 -97177 18812 -379135
15820 131146 88494 -142791 238214 -152261 144180 -162808 56827 38134 318944 -57020
15809 240598 17633 -70341 -161178 101641 289443 90107 102491 286602 250646 -40354 -151824
15798 -151824 -54043 -310163 -285958 -114640 -283166 62386 -268107 -172712 99540 -177782
15787 43265 -188329 204336 133562 199225 224696 -81118 -369988 180040 169255 -149452 172171
15775 -93169 59337 11675 -135891 127500 62547 -189120 115057 9470 -224991 78701 338439
15764C38439a92812A47804c06031a16113D1863K63687a81546E0773J56373m4413
15754A62733d10713I4519a46469A36610L5049M0958j02641K91066A21072C1812
15743B41539j11439P993C3627J8820a53184A96930a19307A5261a23337F5556e2646
15731A37011E1274a52203e5152C7608g9384b0765A23333H233j688J04765K9241
15720A40551b16614e6642D3356e5047j29791Q0056a4783p4838F8148b10794M94
15709b10300a2843B38105a85344j69144A1757d5278A70638i8196B9845J05096
15699A34941L26173B21191h4117j03356A61446C5911J02577a43714a5540A48443
15688B22448a42357A47892a6392l25608J24784N3716c8846l529l7719A53273F0553
$$ plain form
15764 338439 -192812 147804 -306031 -116113 41863 305550 -181546 50773 207146 162733
15754 162733 -410713 94519 -146469 136610 171659 212617 109976 401042 121072 31812
15743 241539 130100 138093 33627 52447 -153184 196930 -119307 15261 -123337 65556 -52646
15731 137011 51274 -152203 -55152 37608 -79384 -20765 123333 8233 6545 111310 140551
15720 140551 -216614 -56642 43356 -55047 -184838 -104782 -14783 -89621 68148 -210794 -210300
15709 -210300 -12843 238105 -185344 -354488 11757 -45278 170638 -98196 29845 134941
15699 134941 461114 221191 -84117 -187473 161446 35911 138488 -143714 -15540 148443
15688 222448 -142357 147892 -16392 -342000 -217216 -163500 -38846 -42375 -80094 153273 60553
15676A95317k6491F7909e9516I9935J2119a74314B94382A3648M0807j4915A513
15664b07346e4045k38692o8502F3103O4602e4313A31684o5383a08179A46351J97583
15653C43934c40856J58701A70401J18778i6973c2698A00852c2251R856A01189
15642b49392D5128O5959n0838A9748i2201B03589D9181J19993a70140q5603D988
15630b95076A06674J76704f8197j3873b3353j94695j31872r3101g1875L0498p4189
15619a15566A38574F7323B79b76469j74384A87498r0436C5909b01694A44823a65822
15607g1376E6301a13258B24917F2229c29230J28560d7124l4473A08844J8448o3401
15596F3891a46712o5626A78862I915P6230a03319j89962C32292g4425k98252J08806
$$ plain form
15676 195317 168826 67909 -59516 99935 112054 -174314 294382 13648 54455 39540 1513
15664 -207346 -54045 -292737 -361239 63103 127705 -54313 131684 66301 -108179 146351 343934
15653 343934 -340856 -182155 170401 289179 -96973 -32698 100852 -32251 -22395 101189
15642 -249392 45128 111087 60249 19748 -92201 203589 49181 169174 -170140 -255743 4988
15630 -295076 106674 283378 -68197 -82070 -23353 -218048 -349920 -443021 -71875 -41377 -115566
15619 -115566 138574 67323 279 -276469 -450853 187498 97062 35909 -201694 144823 -165822
15607 -71376 56301 -113258 224917 62229 -329230 -200670 -47124 -81597 108844 127292 63891
15596 63891 -146712 -212338 178862 9915 86145 -103319 -293281 332292 -74425 -372677 -263871
15585b63871p245a29306G5273L2116J0932A6392a09396J8935d1981j20626a8211
15573A4933J06487A9359K21475A15921P5064c70502J71314A04291p038m5403K2538
15562G4388Q9041J26533a75431A43671a71266K2593A60989d2249C3770c0846k21839
15551b52685e7896j0807B75317a17639B753K06819f7088j33080H6022b22731A46993
15539F8721a062q7407K4706I6401g5461k3430k9465D8179a99637l2493a1972l0036
15527d2008j13732b1012A6549b12619b3778A42680p1075K49687a12490A48944
15516A4995L34700A03000b86361j92040a64880H776g6888A7109b7253C525J14883
15505A18408a10955n1071r7830j18067I0322h3947j9978j67414a00809o5770B7694
$$ plain form
15585 -263871 -271116 -129306 75273 107389 118321 16392 -109396 -90461 -41981 -162607 -18211
15573 14933 121420 19359 240834 115921 190985 -370502 -199188 104291 97253 51850 74388
15562 74388 163429 289962 -175431 143671 -171266 -148673 160989 -42249 33770 -30846 -252685
15551 -252685 -57896 -68703 275317 -117639 2753 209572 -67088 -200168 86022 -222731 146993
15539 68721 -1062 -88469 -63763 96401 -75461 -98891 -128356 48179 -199637 -232130 -11972 -42008
15527 -42008 -155740 -21012 16549 -212619 -23778 142680 71605 321292 -112490 148944
15516 14995 349695 103000 -286361 -478401 -164880 8776 -76888 17109 -27253 3525 118408
15505 118408 -110955 -162026 -259856 -377923 90322 -83947 -103925 -271339 -100809 -166579 27694
15493B47509k3460a84571A94832h1393k35070B22510b81182d8241j55707p6788
15483b80736i8795d2976a5305A81973b249C14680N6473e1204H613b347j26387
15472a28734A20568d04616h9039B18068a59969o7077A76118h9671j26990D27959
15461B19514b8894G2200O2780E923f4111I1839J02511g249m14101A28371c2506
15449g3896j30774F1786r592b79435B39324q9645O8745a39996f0287A48239g1371
15437a22385A24987j525a91440M4494C8240c70931h1564D36075b45546F7392c5534
15425b00878f14D1587C075h1375N849A44533a0519m4555q9506J6126F4888a10315
15412B15290F5536a57926A14192g6395C55737b04527g6871G4977a18023B891b97701
$$ plain form
15493 247509 224049 -184571 194832 -81393 -316463 222510 -281182 -48241 -203948 -280736
15483 -280736 -98795 -42976 -15305 181973 -2249 314680 371153 -51204 8613 -2347 -128734
15472 -128734 120568 -404616 -89039 218068 -159969 -227046 176118 -89671 -216661 427959
15461 219514 -28894 72200 134980 5923 -64111 91839 194350 -7249 -421350 128371 -32506
15449 -73896 -204670 61786 52194 -279435 239324 149679 218424 -139996 -60287 148239 -71371
15437 -122385 124987 123462 -191440 -146946 38240 -370931 -81564 436075 -245546 67392 -35534
15425 -200878 -614 41587 3075 -81375 -75526 144533 -10519 -55074 -144580 -128454 64888 -110315
15412 215290 65536 -157926 114192 -76395 355737 -204527 -76871 74977 -118023 2891 -297701
15400A89300h8635j0322D50130b88671a01785C5167b4481r2273F6253a5379A3679
15388a33969f815A42136p288o180b28841k8040i2A20019c62844D5438l679Q5791
15376A27550a44695l07610a71916m2884A63353b12424j16204C6342d5674I9830
15365C6560g757D3243L56010A21310A4310c3046k79712B62292a06260C8709J31349
15354A70058l2118J12624b0817A59257D3412e6860G8467a25316d4871D8702J01562
15343A50264K35043a09415H421J58932a28517e1745j20330b5380l9655D6197J26591
15332A72788n2336d17436g3596q5370p3263j38077A63920l5927a61302A12328
15321E3844J56967k7580L3362G1690K05309D8297E626b29612A09675b36380P2606
$$ plain form
15400 189300 -88635 -98957 450130 -288671 -101785 35167 -24481 -116754 66253 -15379 13679
15388 -133969 -6815 142136 134848 128668 -228841 -256881 -92 120019 -362844 45438 41759 127550
15376 127550 -144695 -452305 -171916 -214800 163353 -212424 -328628 36342 -45674 99830
15365 36560 -7757 43243 399253 121310 14310 -33046 -312758 262292 -106260 38709 170058
15354 170058 137940 250564 -20817 159257 43412 -56860 78467 -125316 -44871 48702 150264
15343 150264 385307 -109415 8421 167353 -128517 -51745 -172075 -25380 -65035 46197 172788
15332 172788 120452 -417436 -73596 -158966 -232229 -370306 163920 127993 -161302 112328
15321 53844 210811 183231 216593 71690 276999 48297 5626 -229612 109675 -236380 -163774
15310a63774L838B0043K19784B548J58835J13218A13808N5173k6857J02078p9418
15299A64784B4900f2199C08600L8531K0680A16821J40716j03618n6765g8440g491
15287c03809I9775K69782A43589b7305k44811f9010j3652n5266k98876b3526E1696
15275C62483F7288J01695O8071J41487d9718n5749q2940A31493h4249A22664D086
15263F0350a98222A05864J21994I0619K76859A22645Q1937A00790N8469p8753
15253H0506J23793H6908R2081n3948M3451R33498M81148k89786L14975p80079
15243H28248D09672j93171f0771C71230c7008B57245p8265b95896A57494L2734
15233A90228F4064e057I5360a36703l7200b0369B61438j09662h7190J5177F1890
$$ plain form
15310 -163774 -159936 20043 239827 2548 161383 274601 113808 168981 142124 244202 164784
15299 164784 24900 -62199 308600 347131 367811 116821 257537 153919 97154 -78440 -7491
15287 -303809 99775 369557 143589 -27305 -272116 -69010 -82662 -137928 -436804 -23526 51696
15275 362483 67288 168983 237054 378541 -49718 -105467 -188407 131493 -84249 122664 4086
15263 60350 -198222 105864 227858 90619 367478 122645 204582 100790 159259 80506
15253 80506 204299 86908 178989 125041 168492 1101990 1583138 1293352 1608327 828248
15243 828248 409672 216501 -60771 371230 -37008 257245 178980 -295896 157494 190228
15233 190228 64064 -5057 95360 -136703 -173903 -20369 261438 151776 -87190 -72013 61890
15221a39287K7102D06786A25758Q6868N3303k4070a9337A4600K04906a2158I9131
15209B75533A3315J56890i2767o02k20515B86801j40931J62260j24328E9159a51143
15197B27019K12885B2193K04192c6277C94228H8245h3011r3019B79076A32498
15186i0907D9098a3684C24296e1535D09040p1263A65602a09531h610C4541J00533
15175A35074a40843e2588b4201A44842Q5196r9979H236J33914A4275J86070a48807
15163b24464A0308L29641d3690A1319a04052e0826k6064k52804c8071j36811B11506
15151a60317P2090A63536a81655O9161p18N020B11515G0331L0051J73253C4219
15139B1898b94307c1720B01134H6246g5871E0455J38252j1194b49130B81259G2264
$$ plain form
15221 -139287 -112185 406786 125758 212626 265929 241859 -19337 14600 219506 -12158 99131
15209 275533 13315 170205 -92767 -93369 -313884 286801 145870 308130 183802 59159 -151143
15197 227019 439904 22193 226385 -36277 394228 88245 -83011 -176030 279076 132498
15186 -90907 49098 -13684 324296 -51535 409040 337777 165602 -109531 -8610 34541 135074
15175 135074 -140843 -52588 -24201 144842 230038 130059 8236 142150 14275 200345 -148807
15163 -224464 10308 339949 -43690 11319 -104052 -50826 -76890 -329694 -38071 -174882 211506
15151 -160317 -88227 163536 -181655 -112494 -113212 -108192 211515 70331 100382 273635 34219
15139 21898 -294307 -31720 201134 86246 -75871 50455 188707 177513 -249130 281259 72264
15127C32380H0866g0418G646K02536I5390e520n0859B66465I2430J45144J08679
15116C46253A40013K36520A73534e4743A01265i4456J2520D6690a31019o2514
15106a93533E6487L84341A58247a76901A93763p6638N6750K87817m9342d8596
15095D00643A66323l8329D45J30777J41055h2803B2573J77126c6265C81640a12225
15083h055j9560C48105j2218F9393P6428J05788B9317P3846M6667J26075I0047
15071B09252J6728A00372J95721n0208J3205f6583A64545J58368B6420a9451A04851
15059A17414C2582e8726C6420J19566J5838d6810B76171A0055K08947D0265h1451
15047C09386A52334F3637K02909a53941A76002J29241H7566J82548a51746L2756
$$ plain form
15127 332380 80866 -70418 7646 210182 95390 -5520 -56379 266465 92430 237574 346253
15116 346253 140013 376533 173534 -54743 101265 -94456 -81936 46690 -131019 -193533
15106 -193533 56487 440828 158247 -176901 193763 117125 173875 461692 412350 -48596
15095 400643 166323 127994 445 131222 272277 -82803 22573 199699 -36265 381640 -112225
15083 -8055 -27615 348105 335887 69393 145821 251609 29317 103163 149830 275905 90047
15071 209252 225980 100372 296093 245885 259090 -66583 164545 322913 26420 -19451 104851
15059 117414 32582 -58726 36420 155986 171824 -46810 276171 10055 219002 40265 -81451
15047 309386 152334 63637 266546 -153941 176002 305243 87566 270114 -151746 -118990
15037a18990H2462g4472H3496k907K72847A42444f3273G9953Q5827a9476G8111
15025A19314a16180d6114l6459E82028H184N46512A89969p8251a3851C26741A37881
15013C98090A4210M2540J63875A04244K47432j07542e3661D185L69601A65477
15002B58649L4436n2177g8046E9118K9751J03566l8208L63870G7369c3740G6884
14990C96437j83220J48292A02056D8782L09842A32342R9320H2118L90552j58566
14980C14104p622k7714J71730j73110L69545A48209J57974A27322K0377J95998
14970C43697A29798J15812R9751b4495j47697D2579a5669E16664A70482J20083
14960B90565R3481K3011A44338K23587A1208O9259J28943J81753q3649D9217L08998
$$ plain form
15037 -118990 82462 -74472 83496 80589 353436 142444 -63273 79953 165780 -19476 78111
15025 119314 -116180 -46114 -82573 582028 8184 554696 189969 111718 -13851 326741 137881
15013 398090 14210 56750 220625 104244 351676 244134 -53661 4185 373786 165477
15002 258649 293085 240908 -78046 59118 88869 192435 154227 518097 77369 -33740 76884
14990 396437 213217 361509 102056 48782 358624 132342 231662 82118 472670 314104
14980 314104 306482 278768 450498 277388 646933 148209 306183 127322 147699 343697
14970 343697 129798 245610 345361 -24495 -172192 42579 -15669 516664 170482 290565
14960 290565 384046 407057 144338 367925 11208 80467 209410 391163 307514 49217 358215
14949C58215A69666b14483b8584A20267K11084j34290i4697A78752m7683h348
14938B47992R8327Q7744A84778L4864J4214m6354c46653A57891J23133A16136
14927D9168a88373D53200k3841j77042q8505P4594q6609J31557I593J18676K30729
14916C58998A55003L81913j52690n8408m9708B8525J68362m1457J63097J55457
14906D73984a127C26146j24704J71273J66449A81816J10662L7097H6265M62009
14896E48274j16118k02756K53384k8821N5991E5116M87075j24201j95589J02828
14886C25229J02749p264A85123K51939A63762b186C33497J28235Q5396A32422
14875B19021J25782j22777G3563K72607p5498n492J40142L2952j61680L71204
$$ plain form
14949 358215 169666 -214483 -28584 120267 331351 197061 -94697 178752 131069 -8348
14938 247992 346319 434063 184778 219642 233856 187502 -346653 157891 281024 116136
14927 49168 -188373 453200 429359 252317 163812 238406 151797 283354 9593 128269 358998
14916 358998 155003 536916 384226 325818 276110 28525 196887 155430 318527 473984
14906 473984 -1127 326146 201442 372715 539164 181816 292478 329575 86265 548274
14896 548274 432156 229400 482784 453963 509954 55116 542191 417990 222401 325229
14886 325229 427978 420714 185123 437062 163762 -2186 333497 461732 547128 132422
14875 219021 344803 222026 73563 346170 270672 265180 405322 438274 276594 647798
14865F47798k09435r9890n6549j5507p1737K18704j78206J15949A12373K75748
14855C88121K50334k39322J2509j53871J0444J6314r0765R5397J30523j21509
14845B98175K28819A54970Q4746L8551G8455J16769N476M80314R995G7107M53266
14834E30373C6967J60130J87828o4571M336J82691j06980m1544N0898A93702J65723
14823C59425Q1614j83711l3091O8501K76288J5057o286J4328k40588j42562J16997
14812C25972J02418k0077j34965K49948k44548N19583l08418Q9266B87091q144
14802B78947A2437K33176L91610k0848j58391m381K4747j3164r8470L90571l69641
14791C87646k7214M9604j11089K32204K3582J39403B64656K29022n2596K42155
$$ plain form
14865 647798 438363 338473 281924 266417 194680 413384 235178 351127 112373 388121
14855 388121 638455 399133 411642 257771 268215 284529 193764 289161 419684 298175
14845 298175 526994 154970 239716 278267 78455 195224 200700 681014 691009 77107 530373
14834 530373 36967 197097 384925 320354 324690 507381 400401 358857 409755 193702 359425
14823 359425 441039 257328 224237 292738 569026 584083 577797 592125 351537 208975 325972
14812 325972 428390 408313 273348 523296 278748 798331 489913 579179 287091 278947
14802 278947 12437 245613 637223 616375 457984 453603 478350 465186 366716 757287 387646
14791 387646 360432 410036 298947 531151 554733 694136 264656 493678 441082 683237
14781F83237j30889P4294l8650P1885j7927K31865l99555k09918P2014l9850N22169
14770H18675l6784l31458J54731p0639O5679j33825R5975m375O1703n2516j38060
14759D29106J53388j84398Q4056K18081j90737J03045J38658N1909O1347D10714
14748H40562m15479O09910n15033K71761k40548R8575n9364k9786J39897K2502
14738G22997Q7957n1579l34451P6796J38526J06513k69467q763L99408m26045
14728D41892J81368K58105C71568L53992P2853j50010K95968m33542N78466l72730
14718G16565C45456K92460P620M03797k43149n7113l1458J07261j58747k35234
14708D30893K13017r6313J97749M97301l57888q7847J99759k12614J77283k85565
$$ plain form
14781 683237 552348 626642 587992 659877 641950 873815 474260 264342 336356 296506 818675
14770 818675 781891 450433 605164 534525 600204 466379 562354 557979 619682 567166 429106
14759 429106 582494 398096 482152 700233 509496 612541 751199 803108 864455 410714
14748 840562 425083 1034993 519960 791721 551173 649748 590384 560598 700495 722997
14738 722997 810954 759375 424924 501720 640246 746759 477292 468529 867937 441892
14728 441892 623260 881365 371568 725560 798413 648403 944371 510829 1089295 716565
14718 716565 345456 637916 645536 1049333 806184 749071 717613 824874 666127 430893
14708 430893 643910 547597 745346 1242647 884759 796912 996671 784057 961340 675775
14698F75775l11718K40370J93168K44202j09729j73970l24725K16684J31441K77136
14688A058634k81472m6663j11216J39696L25024o6534k53427q2678M06360q7080
14678A000644R3363j99608J74171k69551L44695j22318k93272K79448r7313J00901
14668A011160N9066J25491j58009j15021J50291l4868M02470E88218N09883k32258
14658H65843L14026j90385m278K23007j52324j40415p7104M94318k36127j74835
14648I21726R1571Q9081j68220L03746m92213L53355J17233j50369Q9020j88346
14638I66584J63838J12928p8882P0094j38774J52269j24392K42584P1287k3443
14628A414093o9564j04998m5342K47538k17955J65680l59725L37750O8460K26694
$$ plain form
14698 675775 364057 604427 797595 1041797 932068 758098 433373 650057 781498 1058634
14688 1058634 777162 730499 619283 758979 1084003 1017469 764042 681364 1087724 1000644
14678 1000644 1094007 894399 1068570 799019 1143714 1021396 728124 1007572 910259 1011160
14668 1011160 1070226 1195717 1037708 922687 1072978 1038110 1440580 588218 1098101 865843
14658 865843 1179869 989484 985206 1208213 1055889 915474 838370 1332688 1096561 921726
14648 921726 1013297 1102378 934158 1237904 745691 1099046 1216279 1065910 1154930 966584
14638 966584 1130422 1243350 1164468 1234562 1095788 1248057 1123665 1366249 1437536 1414093
14628 1414093 1344529 1239531 1194189 1441727 1223772 1389452 1029727 1367477 1435937 1662631
14618A662631k95885R2380j48060J41836n0535j59443J00509J00430J10714m96512
14608A058065K73074k33842M70420j1088J32026l39157L92276m09036K48843P1077
14598A652658k73599j19578L09705J30264p4362m4928j90216J95602M235l4531
14588A555250K17135j93574L36150j08266j69534K57382j57705K37942N3665l35660
14578A692785L44702j37587o5222N5607J79312k52084L3642J96669J31458l91031
14568A788251K15734L92280k33432K13273k69284K30452n6834j36375M01904L19471
14558B865440l01002J00797J35234M59043k97156P10843K74180M30725Q17535
14549E195639J213797L920449Q061065K1659405M403739A7388701G128046C552200
$$ plain form
14618 1662631 1366746 1459126 1311066 1452902 1402367 1242924 1343433 1443863 1554577 1058065
14608 1058065 1331139 1097297 1567717 1556629 1688655 1349498 1741774 1332738 1581581 1652658
14598 1652658 1379059 1259481 1569186 1699450 1625088 1580160 1389944 1585546 1589781 1555250
14588 1555250 1772385 1578811 1914961 1806695 1637161 1894543 1736838 1974780 2028445 1692785
14578 1692785 2037487 1899900 1834678 1890285 2069597 1817513 1851155 2047824 2179282 1788251
14568 1788251 2003985 2396265 2162833 2376106 2106822 2337274 2280440 2144065 2545969 2865440
14558 2865440 2564438 2665235 2800469 3259512 2962356 3673199 3947379 4378104 5195639
14549 5195639 6409436 10329885 18390950 40050355 44454094 17388701 7128046 3552200
14540B238496l85986k25113L74110o20899Q22672k68132k10343J69615J12801
14531B007221q1443K41506j84234j6464M8304M36866l99405j1684n0187K97161
14521B287641K1608j65705K20289Q3536j23347K28357l88791K92573J60114L90279
14511C006554k13623k76530l5060N15006j57068l89399M6841P11280R5112o56880
14501B646233K46740O6352J59303j07447k1819N9018k45155J89966R9827J319
14491C094337j64959K77550o1338L52157k05523q2307N26066m09473N9292O4830
14481C450632j73935O03939p2509j42962j85508K71877j07787M43442k66281n1285
14471C769623J70664K42113k78099q2946K88926L01297j16039J09990l80254J09479
$$ plain form
14540 2238496 1852510 1627397 2001507 1380608 2203280 1935148 1724805 1894420 2007221
14531 2007221 1925778 2167284 1983050 1966586 2014890 2451756 2052351 2040667 1990480 2287641
14521 2287641 2309249 2143544 2363833 2447369 2324022 2552379 2163588 2456161 2616275 3006554
14511 3006554 2792931 2516401 2481341 2996347 2839279 2449880 2496721 3208001 3303113 2646233
14501 2646233 2892973 2959325 3118628 3011181 2989362 3048380 2803225 2993191 3093018 3094337
14491 3094337 2929378 3206928 3145590 3497747 3292224 3209917 3735983 3326510 3385802 3450632
14481 3450632 3276697 3880636 3808127 3665165 3479657 3751534 3643747 4087189 3820908 3769623
14471 3769623 3940287 4182400 3904301 3821355 4110281 4411578 4295539 4405529 4025275 4134754
14461D134754M07638k24073N87129l40511l64836K38272M09624m31753P89283
14452E205527j58080k60393J21837l9351K56459j07246O49139l75979J52668j8540
14442E426041P5327K52001j70714K83709L38967l58188M5154L36786j77011P0960
14432F123032K07475J13767J09550K11153k1039k17901L65145j56389J70264k70006
14422F635051N907J060635j57410J20253Q0672M837j24493O03469j65159R9446
14412H163208q3785L81843J45423j63199P9395K59236M70478n55745P84968o5726
14402I416096p3212K41940L55839O9271k9577J28727J23473M55581L96653J75486
14392A1260277Q4726j34646O13179J06185P7455L77976j10914M79472K07028M47245
$$ plain form
14461 4134754 4542392 4318319 4905448 4564937 4200101 4438373 4847997 4416244 5205527
14452 5205527 5047447 4787054 4908891 4869540 5125999 5018753 5667892 5291913 5444581 5426041
14442 5426041 5501368 5753369 5582655 5866364 6205331 5847143 5892297 6229083 6052072 6123032
14432 6123032 6330507 6444274 6553824 6764977 6743938 6526037 6891182 6734793 6905057 6635051
14422 6635051 6640958 7701593 7544183 7664436 7745108 7749945 7625452 8228921 8063762 8163208
14412 8163208 8079423 8461266 8606689 8443490 8522885 8782121 9252599 8696854 9481822 9416096
14402 9416096 9342884 9584824 9940663 10009934 9980357 10109084 10232557 10688138 11084791 11260277
14392 11260277 11345003 11210357 11823536 11929721 12007176 12385152 12274238 12753710 12960738 13407983
14382A3407983l6K56486L49176L03149J36527J64821K74057L47786m7572N41719
14372A5734096K41155L76584O05028K5948L67082M05921M16675N23854J29592
14363A8825935L08453O86620N17743M76403o9697R00854Q4568O41470N30636O28191
14353B3531176M95793N16276P37614P49855L89238O62456M38198R43116N35994
14344B8999716Q26123N26174J547954N23351O60981J054718Q12176J152108O72338
14335C6775639J008383J651299J131807J005827J048537J041147J660350J389125
14327D6712114J625766J408298J466621J880965J985296J394786K360673J989660
14319F0824179K023982K501334K196829K406159K718812K713171K822747L166879
$$ plain form
14382 13407983 13407947 13664433 14013609 14316758 14453285 14618106 14892163 15239949 15192377 15734096
14372 15734096 15975251 16351835 16956863 16982811 17349893 17755814 18172489 18696343 18825935
14363 18825935 19134388 19821008 20338751 20815154 20745457 21646311 21730879 22372349 22902985 23531176
14353 23531176 24026969 24543245 25280859 26030714 26419952 27082408 27520606 28463722 28999716
14344 28999716 29825839 30352013 31899967 32423318 33084299 34139017 34951193 36103301 36775639
14335 36775639 37784022 39435321 40567128 41572955 42621492 43662639 45322989 46712114
14327 46712114 48337880 49746178 51212799 53093764 55079060 56473846 58834519 60824179
14319 60824179 62848161 65349495 67546324 69952483 72671295 75384466 78207213 81374092
14311H1374092L361745L307995L365421M194278L662912M350027M490067M908084
14303A13014621M875163N456257N922259N586536O639236O747770O940964P660435
14295A62843241Q171065Q248937R159725R663559J0027321J0534482J1366342
14288B30014672J1851042J2389370J2741788J3192437J3611398J4308664J4512802
14281C22622173J4518701J4986685J4884865J4498708J3798368J3109744J1900056
14274D20319300J0528579Q212799L084742J303253J478648P53533m370542l838797
14266D37471515o788309r323711j1695789j2996275j4532607j5196826j5416941
14259C51521057j5888240j5810220j5606036j5358569j4922040j2894638j3581542
$$ plain form
14311 81374092 84735837 88043832 91409253 95603531 99266443 103616470 108106537 113014621
14303 113014621 117889784 123346041 129268300 134854836 141494072 148241842 155182806 162843241
14295 162843241 171014306 179263243 188422968 198086527 208113848 218648330 230014672
14288 230014672 241865714 254255084 266996872 280189309 293800707 308109371 322622173
14281 322622173 337140874 352127559 367012424 381511132 395309500 408419244 420319300
14274 420319300 430847879 439060678 442145420 443448673 444927321 445680854 441310312 437471515
14266 437471515 430683206 421359495 409663706 396667431 382134824 366937998 351521057
14259 351521057 335632817 319822597 304216561 288857992 273935952 261041314 247459772
14252B47459772j2882337j2915819j1260633j0601024j0461797r896090r022615
14245A70419457q526621p753833p750304p129908o820171o005741o214946m742909
14237A15475024n245060n198472m514788m390608m164907l710987k853041l855951
14229H1541210l251153l120674k918227l096921k570216k674670j690927k417742
14221E9800680k107733j660432j929865k207930j298839j829024j684958j387798
14213D5694101j106730j698313j309413j281984j258406p65931n20341j280104
14205C6472879j074112j527498j009193q76891l24473o99888r14227j026980r90778
14196B8028839p23600p54081j49639o68328p55340n09529n65614n95881q70754
$$ plain form
14252 247459772 234577435 221661616 210400983 199799959 189338162 179442072 170419457
14245 170419457 161892836 154139003 146388699 139258791 132438620 126432879 120217933 115475024
14237 115475024 110229964 105031492 100516704 96126096 91961189 88250202 85397161 81541210
14229 81541210 78290057 75169383 72251156 69154235 66584019 63909349 62218422 59800680
14221 59800680 57692947 56032515 54102650 51894720 50595881 48766857 47081899 45694101
14213 45694101 44587371 42889058 41579645 40297661 39039255 38273324 37752983 36472879
14205 36472879 35398767 33871269 32862076 31985185 31660712 30960824 30046597 29019617 28028839
14196 28028839 27305239 26551158 26401519 25733191 24977851 24468322 23902708 23306827 22436073
14187B2436073j19096p06470p03522j61348o18772m82175m20763l93395m47309
14178A8383223o22468k18809l39174n53721k20351j1995n89045k14754k18059
14169A5394847q6602n33222m60654j28911m04768p9911l13314J6722j44218o93326
14159A2566643j5479k29961q1973l90946j67289N9796l33681p9398m07008l50871
14149A0569833j49895m11792L81430j21624m49363P711j83073l17972J42802n86584
14139H881473Q155m2362m3075k5212j86893k19437q152m5359k91993L90369p01424
14128G716090J60693P4033l62441k58319J91946l11820j17131q8324K03579l39361
14118F868945Q3745l81906O38963o46610j17749L569l0728J7577k91111m8881
$$ plain form
14187 22436073 22316977 21610507 20906985 20745637 20126865 19644690 19223927 18830532 18383223
14178 18383223 17760755 17541946 17202772 16649051 16428700 16416705 15827660 15612906 15394847
14169 15394847 15308245 14775023 14314369 14185458 13780690 13700779 13387465 13404187 13259969 12566643
14159 12566643 12551164 12321203 12239230 11848284 11680995 11740791 11407110 11327712 10920704 10569833
14149 10569833 10419938 10008146 10389576 10267952 9818589 9826300 9643227 9325255 9468057 8881473
14139 8881473 8889628 8847266 8804191 8778979 8592086 8372649 8364497 8319138 8027145 8417514 7716090
14128 7716090 7876783 7950816 7588375 7330056 7522002 7210182 7093051 7004727 7208306 6868945
14118 6868945 6952690 6570784 7209747 6563137 6445388 6448957 6418229 6435806 6144695 6095814
14108F095814l90543J80055K00252o42574K37617J14006j92957p8883J58428k74884
14098E406331q7699k36182J70939j74828r6691l62730M24199k33394O5675r924
14088D865696r8244l7199m1830K21352o27051L61928k73800j15378M6574j58792
14078D143256J26029k2738k99597K19274k56267R3936j19516J12709l3189l19505
14068C644392L48813l75904N243j3039J30523M5859j43189j58559J02574r0655
14058C496058J94694L2461m22451K54202o644k93892O6371L740k02498j866n568
14047C114607J8975J8357J19497j49013J35868n47117J52195K7804K43412m35506
14037B699079K70328k48408q3534L06778l8556k24736P4811K1693J491m7772m07288
$$ plain form
14108 6095814 5705271 5885326 6085578 5443004 5680621 5794627 5601670 5522787 5681215 5406331
14098 5406331 5318632 5082450 5253389 5078561 4981870 4619140 5043339 4809945 4875620 4865696
14088 4865696 4767452 4730253 4688423 4909775 4282724 4644652 4370852 4255474 4302048 4143256
14078 4143256 4269285 4246547 3946950 4166224 3909957 4003893 3884377 3997086 3963897 3644392
14068 3644392 3993205 3617301 3622544 3609505 3740028 3785887 3642698 3484139 3586713 3496058
14058 3496058 3690752 3723213 3300762 3554964 3548320 3254428 3320799 3324539 3122041 3120175 3114607
14047 3114607 3133582 3151939 3271436 3122423 3258291 2711174 2863369 2891173 3134585 2699079
14037 2699079 2969407 2720999 2637465 2944243 2905687 2680951 2755762 2777455 2778946 2731174 2323886
14026B323886L52811n246o9170K5421j30570j31705Q1900l5580J15148k4844k37853
14015B264198K87056j13058j73707J01699k79883L43731k35516J96148m13096
14006A977572L14288j49690m6574K05818l10319J16071k36735K02342n4028l07511
13996A711234J06651q1654L98807j15808J20812J66839m7478O39556K416959N707267
13986A1023185J7981649K1411789B2677949A0571653l865892j832333j008252
13979C865176n86241J69816o83375Q4480k34843L5453m6369k97655N5621J77526
13969B539589m76855N31634n28573q1309R1390j71607J21490K57360j81958k41420
13959A859741k00680o9873K12929J4162n4066K21114k45757k82467P95758o02637
$$ plain form
14026 2323886 2676697 2671451 2602281 2627702 2497132 2365427 2447327 2411747 2526895 2502051 2264198
14015 2264198 2551254 2438196 2264489 2366188 2086305 2430036 2194520 2390668 1977572
14006 1977572 2291860 2142170 2095596 2301414 1991095 2107166 1870431 2072773 2018745 1711234
13996 1711234 1817885 1736231 2135038 2019230 2140042 2306881 2259403 2898959 5315918 11023185
13986 11023185 29004834 50416623 22677949 10571653 6705761 4873428 3865176
13979 3865176 3278935 3448751 2765376 2849856 2615013 2650466 2604097 2306442 2362063 2539589
13969 2539589 2062734 2594368 2065795 1984486 2075876 1904269 2025759 2283119 2101161 1859741
13959 1859741 1659061 1589188 1802117 1816279 1762213 1983327 1737570 1455103 2250861 1648224
13949A648224Q4030J19873n2883j82096J86181p530j10029O8565k20454k4204
13939A509677J44299o4225p6120K29008r0883k05158J48425q1753k9631j50881
13929A332758j0816J99711J36199l40553j02193m7585K65326K74682n2113k16106
13919A439310j31846o7013J53338j16272K5703r9169k66996M06991J76947l9538
13909A481455k43547P3852j20798K54081j93849J50872k95337j5630L05367l85090
13899A011376j31421K74019l1575J59312k00815q3772J48734J74324j28849l05694
13889H85639L27853p7536k0421j73219K45575J63461l58061K19362m8853m70958
13879F92842K61556j97607M31985j39288J13607k85267q91K80370j94001K20988
$$ plain form
13949 1648224 1732254 1852127 1799244 1617148 1803329 1795799 1685770 1754335 1533881 1509677
13939 1509677 1653976 1589751 1513631 1742639 1651756 1446598 1595023 1513270 1483639 1332758
13929 1332758 1321942 1521653 1657852 1317299 1215106 1167521 1432847 1707529 1655416 1439310
13919 1439310 1307464 1240451 1393789 1277517 1303220 1204051 937055 1344046 1520993 1481455
13909 1481455 1237908 1311760 1190962 1445043 1251194 1402066 1106729 1091099 1396466 1011376
13899 1011376 879955 1153974 1122399 1281711 1080896 997124 1145858 1320182 1191333 885639
13889 885639 1213492 1135956 1115535 942316 1187891 1351352 993291 1212653 1163800 692842
13879 692842 954398 756791 1188776 1049488 1163095 877828 876937 1157307 963306 1184294
13869A184294J89235k05954l72831N99090m49218J65376Q4720k59609j90776J53495
13859H97822K81083m84951L55106k99617M86329m19190N5415j46006K5901o7015
13849F84877R8561J71938n669J26943J43292k89992j93134K57623j64116J63347
13839I93670k43457K16483j10772m3917k4611j60214J16167M09352l13951p7936
13829G60814J21041R8663m12317L18507Q2888J3871k14386J97466m22552K25238
13819G69233j00473O2183J04965p0117J34846j23025J88525o2921j27115n8253
13809G17848o8141j77665N18910l69641j47777K02958R8579l2171j74877P1187
13799F39210K31893k35574k1572l4637J43016R2199p7930O6577J22921k55984
$$ plain form
13869 1184294 1373529 1167575 794744 1393834 944616 1109992 1194712 935103 744327 897822
13859 897822 1178905 693954 1049060 749443 1235772 816582 871997 725991 751892 684877
13849 684877 783438 955376 949707 1076650 1219942 929950 736816 994439 830323 993670
13839 993670 750213 966696 855924 812007 787396 627182 743349 1152701 838750 760814
13829 760814 881855 980518 568201 886708 969596 983467 769081 966547 543995 769233
13819 769233 668760 730943 835908 765791 900637 777612 966137 903216 776101 717848
13809 717848 649707 472042 990952 621311 473534 676492 775071 742900 568023 639210
13799 639210 871103 635529 613957 579320 722336 814535 736605 803182 926103 670119
13789F70119J66064J11413l29277k39139L78708j00849k1135K68384D27175L05356
13779G32531Q3447k26797K77028l74962P4427Q1538L4675C01952L47059j96756
13769D52255j28566M23432l30575Q1092M7110k24142M66073j54473N2030B50320
13758E05371J12128M743O0497k42162M78096k04078C21298J99437K70466L0207
13748H21408l06526J4287l9184l2164K79556k82959J85876j04977j13307O4993
13738D87003j03672N80555l26550M3261J38367C95115K20225J57826k35438K6690
13728E64418o2732J38209j14740p8045j64197K59158M458q6214j50114K82517
13718E92718l9814n9438P1702p4006k34248N21446k05894j56914j09616K75890
$$ plain form
13789 670119 836183 947596 618319 379180 757888 657039 635904 904288 427175 732531
13779 732531 815978 589181 866209 491247 565674 647212 681887 301952 649011 452255
13769 452255 323689 747121 416546 497638 544748 320606 786679 632206 684236 250320
13758 505371 617499 622242 682739 440577 918673 714595 321298 520735 791201 821408
13748 821408 514882 529169 489985 457821 737377 454418 640294 535317 422010 487003
13738 487003 383331 963886 637336 680597 818964 395115 615340 773166 537728 564418
13728 564418 501686 639895 525155 447110 282913 542071 546529 460315 310201 592718
13718 592718 552904 493466 565168 491162 256914 778360 572466 415552 305936 581826
13708E81826k4661j58091L64016k15661m1076j24186J24655Q5624B78400J36449
13698D14849j07752O1706P2505P902l2138p3787L10721k75546J25965M0598n0847
13687D94176j29151N2493K78243n0437k89540K49087j06750n7031B12742L43588
13677E56330j35493J00947n2756l6728N6303B08556J08308M41388m5078j91898
13667E21276A35460K43654P7045k2653J13594k58996A24956L62189L68796j72198
13657F83743C39404L4533m1167j25357K66166J26522J17246B72401N5154J71693
13647D99248o6973F1863K96079J9381m7687j09249r4537K41790q3033J13534j92258
13636B05883N09830B73349A35286J51106j3088J35492J9744j0283J89192A03919
$$ plain form
13708 581826 557165 399074 763090 547429 506353 382167 506822 592446 278400 414849
13698 414849 307097 368803 441308 449210 417072 343285 654006 378460 504425 545023 494176
13687 494176 365025 417518 695761 645324 355784 604871 498121 441090 212742 556330
13677 556330 420837 521784 469028 432300 488603 208556 316864 758252 713174 521276
13667 521276 135460 379114 456159 433506 547100 288104 124956 487145 855941 683743
13657 683743 339404 373937 332770 207413 473579 600101 717347 272401 327555 499248
13647 499248 432275 61863 357942 377323 329636 220387 125850 367640 284607 398141 205883
13636 205883 715713 273349 135286 286392 273304 408796 428540 418257 607449 103919
13625C04741a20558D50329k01781Q2138J55094A38556J10967k1177R9675J26653
13615D54674r7780r9797p1991H9695K36927J17224o5262e3295C0122J96817j06276
13604A20663J21241J82183O9838q1894A9887L88734A68849c8424B66794F3259
13593B88978k7516R896H230J84992G9007M25043k02561J16874B09041L73984j80880
13582D02145j04734p9289J79174o3981j02660A5998K10018q8193R9259J16422
13572C53504M8805n5800P7386C3700L65007A56569Q8686k4203l6944l890j2837
13561A67381j9168J14612p9578k186L47952j519A63577Q5716J93703A46743b5313
13549B02889q5677M2071J195J65891g585F12831g9606I3826O5049K59398c9887
$$ plain form
13625 304741 -120558 450329 248548 330686 485780 138556 249523 228346 328021 454674
13615 454674 356894 257097 185106 89695 326622 443846 378584 -53295 30122 226939 120663
13604 120663 241904 424087 493925 412031 19887 408621 168849 -38424 266794 63259
13593 288978 261462 271358 8230 193222 79007 504050 301489 418363 209041 583025 402145
13582 402145 297411 218122 397296 333315 230655 15998 226016 137823 237082 353504
13572 353504 402309 346509 423895 33700 398707 156569 245255 221052 184108 180218 167381
13561 167381 148213 262825 183247 181061 529013 527494 163577 249293 442996 146743 -25313
13549 202889 117212 159283 160478 326369 -7585 612831 -79606 93826 158875 418273 -39887
13537C24348N849j27121M8182J18659O4584j73138K50516A5166N46256j53726
13527D07696L47993A35544K18512f1586A09102L10833j85470l5864M4886J07790
13517C51277F7873J80779J18211p867J53540A14157A6165Q1159K74014N8909A3577
13505E33624B40555b7587B28577M25572B13396K73251j95875q0756r7460Q1174
13495A93730J44958D0149N04123b5962B80119q0785M670J10862n1363B5417J4008
13484C9425O2213B7906P4919J08562K8224N8450m654j06644n1467L7163k5420
13473A47039m7241J72374Q5077A67719L6948K7981I8530L84782m4911b4670A38065
13461F6915a07097M7681A66114J49496L662p7121J74604d4873C66575C5793K0464
$$ plain form
13537 324348 330197 203076 251258 369917 434501 261363 511879 15166 561422 407696
13527 407696 755689 135544 354056 -61586 109102 419935 234465 198601 243487 351277
13517 351277 67873 248652 366863 358996 512536 114157 16165 97324 371338 430247 13577
13505 533624 240555 -27587 228577 654149 213396 486647 290772 210016 112556 193730
13495 193730 338688 40149 544272 -25962 280119 199334 204004 314866 263503 25417 39425
13484 39425 101638 27906 102825 211387 239611 298061 293407 186763 135296 172459 147039
13473 147039 99798 272172 357249 167719 204667 232648 98530 483312 438401 -24670 138065
13461 66915 -107097 -59416 166114 315610 319272 242151 416755 -44873 366575 35793 56257
13450E6257J15709B9385K67889r1347r5433R9194K33604r9884a15259A78651k4454
13439A54197J1334J70596A53843R9183a6912E8861J15331J24947K1685m0535M5248
13428C25537f457B28628J76768K34130B08116H3349J39310R7738k871D7777J72359
13417B20136C4927d5339D8901a0583C18823A46689h2921a2834B93655A23172K20490
13406C43662j58915Q8050n2449J7989L04440A81384d3487H9797P8380D2631K51947
13395B94578h7921D0281i1613A49923J31780n1351e0266A63152a87379A8659K35428
13384B54087N5867A32159l2129J7156J06890d4539B28230q1730A140K85782a61243
13372A94778J57236A65755p2549N8754P5013N966o6270f4300D40224G1675B5751
$$ plain form
13450 56257 171966 29385 297274 205927 110494 209688 443292 343408 -115259 178651 154197
13439 154197 165531 336127 153843 253026 -16912 58861 174192 299139 320824 280289 325537
13428 325537 -6457 228628 405396 639526 208116 83349 222659 320397 317526 47777 220136
13417 220136 34927 -45339 48901 -10583 318823 146689 -82921 -12834 293655 123172 343662
13406 343662 184747 272797 220348 238337 542777 181384 -43487 89797 168177 42631 294578
13395 294578 -87921 40281 -91613 149923 281703 230352 -50266 163152 -187379 18659 254087
13384 254087 309954 132159 100030 117186 224076 -44539 228230 146500 1140 286922 -161243
13372 194778 352014 165755 93206 151960 226973 232939 166669 -64300 440224 71675 25751
13360B10477K33859j58117M4974C9003K68778f4582B89543Q0297a84289A62464
13349D61453n6496I1260a46301B67220K53262j33845A50978O4685H3280e2579
13338B75475C9595R3722K25232A27726O984C6002K36768o1582L3256L325b82657
13326C52122j52778K49587j94321j26667M37151B07644L40763H4807K50019k4403
13316C10423j27312K62083A05674O9424N6036B5728J59077o9809b3686n0094C01977
13304C73431j64802J18267n0035b2483B79310K4549K3371j25180K03721A41702
13293c319C54672b36033D74051G6764a7211C27389J12266k00705K19510j5630
13283D42830a38350C44030r7839k1008h5384A33391D3471K48303E2336J58119
$$ plain form
13360 210477 444336 286219 331193 39003 307781 -64582 289543 369840 -184289 162464
13349 461453 404957 91260 -146301 267220 520482 386637 150978 215663 83280 -52579
13338 275475 39595 133317 358549 127726 134710 36002 272770 211188 244444 247769 -282657
13326 352122 199344 448931 254610 127943 565094 207644 548407 84807 334826 310423
13316 310423 183111 445194 105674 175098 231134 25728 184805 114996 -23686 -73780 301977
13304 373431 208629 326896 276861 -22483 279310 303859 327230 202050 405771 141702
13293 -3319 354672 -236033 474051 76764 -17211 327389 439655 238950 458460 442830
13283 442830 -138350 344030 246191 225183 -85384 133391 43471 291774 52336 210455
13273B10455N9531b15130g281B03560b02910o5736c0286A31210J3018J18324K95972
13262E58524E5750c2715C39105j56769o09p5520J26140a6855A41880a45203A08845
13250b53008L6147A98881R5821a31316c8955J4103j2300C02793A16961C71J26552
13239A26923Q6223G7815F459J16925n5983K5453c420j37163D3756J18052j0173
13228A51635a82172B30084m2134d1441a8319j56739A90619M9288H5356a91105
13217C15463J24661b12295A30340K10435i3970A4280O0182d2852l3949A85304
13206e8192a9298H6148a10750C42067a36459A7541h8453A43667d591l8793o3159
13195a06543N1602B11124a82065K392r8019f8522n2034I5349D6311a24204a2350
$$ plain form
13273 210455 269986 -215130 -7281 203560 -202910 -268646 -30286 131210 144228 262552 558524
13262 558524 55750 -32715 339105 182336 181727 106207 232347 -16855 141880 -145203 108845
13250 -253008 -216861 198881 294702 -131316 -38955 -24852 -37152 302793 116961 371 126923
13239 126923 213146 77815 6459 123384 67401 92854 -3420 -140583 43756 161808 151635
13228 151635 -182172 230084 187950 -41441 -18319 -175058 190619 239907 85356 -191105
13217 315463 440124 -212295 130340 340775 -93970 14280 74462 -42852 -76801 185304
13206 -58192 -19298 86148 -110750 342067 -136459 17541 -88453 143667 -4591 -43384 -106543
13195 -106543 -54941 211124 -182065 -179673 -277692 -68522 -120556 95349 46311 -124204 -12350
13183b82744C52186l6204J28192A75485h5832L5679C83789A43500J444N7389L06811
13172E09144A54245E3241J04941J20474a11805C9546n823f2983A51449J4724M4987
13161B11160I9907K2669d1670A41444a29375A07279M8671h2534K6370D19457i5926
13149f6737F1586h3821H3007a4445k18845B93278b35096A24010d1797l2598n2730
13138a27125c2739D4720L6709J67508b25736B62720F1793a04934j0598B88810
13127A31172i7330J9534B59673h1869C6273M9245B5094e9354p3475A44939j1937
13116A33002P870J30917b2294k10101c9788B12887a0538A3282J61938F1863q938
13105E2925C721N6177K80342A58804m0332L8932e1726H3655b05741J7673C50630
$$ plain form
13183 -282744 352186 315982 444174 175485 -85832 -50153 383789 143500 144944 202333 509144
13172 509144 154245 53241 158182 278656 -111805 39546 33723 -62983 151449 166173 211160
13161 211160 99907 122576 -41670 141444 -129375 107279 155950 -82534 -56164 419457 -95926
13149 -66737 61586 -83821 83007 -14445 -233290 293278 -235096 124010 -41797 -74395 -127125
13138 -127125 -32739 44720 81429 248937 -225736 262720 61793 -104934 -115532 288810
13127 131172 -97330 -77796 259673 -81869 36273 85518 25094 -59354 -132829 144939 133002
13116 133002 140872 271789 -22294 -232395 -39788 212887 -10538 13282 175220 61863 52925
13105 52925 3721 59898 340240 158804 118472 157404 -51726 83655 -205741 -188068 350630
13093B84522q5136l9043L2649o2436D742f9490A76818J95538b74442D09621D2535
13081a0697B71330A00057J82555j8654a11717B37229k160J87927c573A83816d3549
13069A62918G6353L21867G7460J29232L4555J33808A08762J14396E7084J57559
13059B14643r2450L5754a59083I8717L0758D9582J63208B4931K35762H986a53365
13047B78660n9819a0071D25528A73007J0059a56758A22756r675J93088H4274I995
13035A47322C9598J07238J75444o8040f495A49081a77296o2093A64542K0093m5026
13024A39609J65677j05437J16720a09806A18135P4390H4338a41878a5870D27954
13013A04562a8337C02306C6348K40144A9567K45056a12588j57496B08743J13950
$$ plain form
13093 284522 199386 160343 192992 130556 4742 -69490 176818 372356 -274442 409621 42535
13081 -10697 271330 100057 282612 263958 -111717 237229 235069 422996 -3573 183816 -43549
13069 162918 76353 398220 77460 206692 241247 375055 108762 223158 57084 214643
13059 214643 122193 157947 -159083 98717 129475 49582 212790 24931 260693 8986 -153365
13047 278660 218841 -10071 425528 173007 183066 -156758 122756 113081 306169 84274 9995
13035 147322 39598 146836 322280 254240 -6495 149081 -177296 -239389 164542 184635 139609
13024 139609 305286 199849 316569 -109806 118135 192525 84338 -141878 -15870 427954
13013 104562 -18337 302306 36348 276492 19567 264623 -112588 -270084 208743 322693
13003C22693K0467n2133M4860b06715B37934g7228a6374B99306b31433A56631
12992g6969k76907a42300a8517A87327M4181a45370C6398B536J01656a28190A13127
12980A81084p4463h8323E0453O3230k0654a29134I857O3683e5222C84060A04481
12968a5587I9751J40672A4051b28182I3289b84326A55838a15689c6284A6713a24426
12956C41556k9259k9015A3961k783J90507a56076A70674c10805b6037A49337B9346
12944a05447E2874J05505b05260A795d3595j14477D99413A60432a41769B60142
12933c3290p3069G9614b52384E1506g3241j23894P2916A11258H162a20766P078
12922a13688j5838A95754E7855L28023I9567k8362J75761m2290g653K387j42194
$$ plain form
13003 322693 343160 291027 335887 -206715 237934 -77228 -16374 299306 -231433 156631
12992 -76969 -353876 -142300 -18517 187327 231508 -145370 36398 2536 104192 -128190 113127
12980 181084 106621 -88323 50453 113683 93029 -129134 9857 73540 -55222 384060 104481
12968 -15587 99751 240423 14051 -228182 93289 -284326 155838 -115689 -36284 16713 -124426
12956 341556 312297 283282 13961 11178 201685 -156076 170674 -310805 -26037 149337 29346
12944 -105447 52874 158379 -205260 1795 -43595 -158072 499413 160432 -141769 260142
12933 -33290 -106359 79614 -252384 51506 -73241 -197135 -124219 111258 8162 -120766 -113688
12922 -113688 -129526 195754 57855 385878 99567 71205 246966 204676 -7653 -5266 -147460
12911a47460O7174b6432A09126b41232B79111A15243A0364b73727f9667k9205
12901i8872n4926n4833P1078A26055D0381K829J95272B695h5895l0299k3900D02648
12888A14521K58008a17625j11A10286a26973k1238c4361B213O6278b3257l6764
12877f0021D28269B12172L7136g8869K9824A36668b5987j17679K0839A35504N9120
12866A94624j7035A8697J28647r203C6901a18330A8872h6873a6805B27601J08114
12855C35715A51289f1448k2611c4588k13563h571m1268J2836B22172c35950A6478
12843A08117C9828J12134a60011A62209K29058A9576K03028a6725E0317J2598
12833F2915c06445A66534e7165C85544d299A24689b91105J44279A03021m0323
$$ plain form
12911 -147460 -80286 -26432 109126 -241232 279111 115243 10364 -273727 -69667 -98872
12901 -98872 -153798 -208631 -137553 126055 40381 43210 238482 2695 -85895 -116194 -140094 402648
12888 114521 372529 -117625 -117736 110286 -126973 -148211 -34361 2213 68491 -23257 -60021
12877 -60021 428269 212172 249308 -78869 -49045 136668 -25987 -143666 -122827 135504 194624
12866 194624 177589 18697 147344 138141 36901 -118330 18872 -86873 -16805 227601 335715
12855 335715 151289 -61448 -84059 -34588 -248151 -8571 -49839 -37003 222172 -335950 16478
12843 108117 39828 151962 -160011 162209 391267 19576 222604 -16725 50317 62915
12833 62915 -306445 166534 -57165 385544 -4299 124689 -291105 -146826 103021 62698
12823F2698J71349k7225g2363A24249K5086l285F4562a57142A06438b9994f957
12811A01620e5752B53722a8861j46833C17743l8137o619A4050K31280a23307B42122
12799i1557A55745d4189a2625A2001J6852c84603a77099d4303A09388B8505c4614
12787B05970F554a81373j53548f8885A30655b82831B19676D1698a8162C22756
12776E4345N8718i5856k79996A25243l110L6789C6278J4078L38322a3115j75819
12765a88934i2517H6331K07432d2374C00058G5351K04410H7040i3913q611e698
12753a04049B075i0370a3335H7119J40735p7325a77065e2605F3185A6995e01275
12741G5973K19598a38924B25268n9384L1005a47651b0218A25834J60681q8175
$$ plain form
12823 62698 234047 206822 -72363 124249 149335 146050 64562 -157142 106438 -29994 -6957
12811 101620 -55752 253722 -18861 -165694 317743 279606 272987 14050 245330 -123307 242122
12799 -91557 155745 -44189 -12625 12001 28853 -384603 -177099 -44303 109388 28505 -34614
12787 205970 6554 -181373 -334921 -68885 130655 -282831 219676 41698 -18162 322756
12776 54345 113063 -95856 -375852 125243 122133 158922 36278 50356 388678 -13115 -188934
12765 -188934 -92517 86331 293763 -42374 300058 75351 279761 87040 -93913 -102524 -5698
12753 -104049 2075 -90370 -13335 87119 227854 150529 -177065 -52605 63185 16995 -501275
12741 75973 295571 -138924 225268 165884 196889 -147651 -20218 125834 286515 198340
12731A98340a16539l1625B50074j17777J31700a82218A60473i4527B66521A22317
12720a23963M0432n342b0679A17319i3588J4035q1255f2788G9205j1503K75618
12709C43320A00229Q8882J1807J64342A27844K4465l6985A9709J25528M9292G0749
12697C09318Q353a7925A30924L2408L5807L1779A05179a91193a0902E8031K6199
12686H4230N9070a15432B56647P2896i7755m7505F0845a9490l7162B22052c7356
12674A38099K50342A77122m7926c5351F6660P2361J14607H3328M9245k0144M5554
12663A57983K41885j52824h981j65965j2923A58871a12853C3288J41530D0174
12652b3053j25176B71771a12943j05548i1879a8008B4643Q5777c7442j36128i308
$$ plain form
12731 198340 -116539 -148164 250074 132297 263997 -182218 160473 -94527 266521 122317
12720 -123963 -83531 -88873 -20679 117319 -93588 -79553 -160808 -62788 79205 67702 343320
12709 343320 100229 189111 200918 365260 127844 152309 115324 19709 145237 194529 70749
12697 309318 317671 -17925 130924 163332 199139 230918 105179 -191193 -10902 58031 84230
12686 84230 143300 -115432 256647 329543 -97755 -145260 60845 -19490 -56652 222052 -37356
12674 138099 388441 177122 129196 -35351 66660 139021 253628 83328 132573 112429 157983
12663 157983 399868 247044 -8981 -174946 -187869 158871 -112853 33288 174818 40174
12652 -23053 -148229 271771 -112943 -218491 -91879 -18008 24643 110420 -37442 -173570 -9308
12640F4569j8178J65315b41071C2514O8190K3655a66710A91600r5471a1810j06275
12629a18085C93648G5666L66477a47541A00461P2785L19239j74998g5038A42580
12618G5997e0985K2509C4232b39075e4225C1280a79687B78560c19523d8524E2023
12606b69893C1595B689M1876K36207d5251l79757A94626b45605L4797H0000h160
12594C05774a14256q9386B22207a30927a4759j89169e3980F9827b54887A8408
12583C13663a31179l1515B36972I4202d5089O283A43030P9158A8720g0427a7672
12571A20610m2031g2637A0689K23362A04845a2373j20573b7704n2354D7270K60607
12560C07877r9346l5662G4347h0282A85644a87233B44277h6808B61424o2494e8577
$$ plain form
12640 64569 46391 211706 -241071 32514 100704 124359 -166710 191600 96129 -11810 -118085
12629 -118085 393648 75666 442143 -147541 100461 173246 492485 317487 -75038 142580
12618 75997 -50985 -28476 34232 -239075 -54225 31280 -179687 278560 -319523 -48524 52023
12606 -269893 31595 2689 44565 280772 -45251 -425008 194626 -245605 -210808 80000 -8160
12594 305774 -114256 -203642 222207 -130927 -14759 -203928 -53980 69827 -254887 18408
12583 313663 -131179 -162694 236972 94202 -45089 -38806 143030 222188 18720 -70427 -17672
12571 120610 78579 -72637 10689 234051 104845 -12373 -132946 -27704 -80058 47270 307877
12560 307877 208531 172869 74347 -80282 185644 -187233 244277 -86808 261424 198930 -58577
12548A28266K831g5997B99643A45345a34333D701M9842O1242A0067N0971b47545
12536h5233b6133I2349a03369A9872f1364A58693M6589K56577B05621l438a27861
12524b9350j3297A34822d1136j15225E4933j5001j2739J25910b1009A28281b42301
12512a58441A30198a08840n1699A14606B6880e8255n7577C75630i6740M6891G9573
12500I3801P0524n6104e9600A34552R8371a8080H9556O8444N0492g7961n1768
12489a29729C3247J39620a42771N2157k1586A18263b02900C2626K6910b09765
12478A28750a10479l6513H178d4615l1539C0460A3378b36094a6744j69086O6370
12467a19460p0399Q5535n444E3741b65733C6989J54129a20683G812K68544d5007
$$ plain form
12548 128266 131097 -75997 299643 145345 -134333 4701 54543 115785 10067 61038 -247545
12536 -85233 -26133 92349 -103369 19872 -61364 158693 205282 461859 205621 202183 -127861
12524 -29350 -42647 134822 -41136 -156361 54933 39932 27193 153103 -21009 128281 -242301
12512 -158441 130198 -108840 -160539 114606 26880 -58255 -115832 375630 -96740 -49849 79573
12500 93801 164325 108221 -59600 134552 232923 -18080 89556 158000 208492 -77961 -129729
12489 -129729 33247 172867 -142771 -90614 -112200 118263 -202900 32626 59536 -209765
12478 128750 -110479 -146992 8178 -44615 -76154 30460 13378 -236094 -16744 -185830 -119460
12467 -119460 -189859 -104324 -109768 53741 -265733 36989 191118 -120683 7812 276356 -45007
12455A3152b45667a07651B4276a72016B07394d736k60258p9953g310n2354l5827
12444i5491m5950J5789k7461I056a5396B44471a14008A42186m6764C773f8607
12432g7634C73598F4037b5282Q222j40272G7210a8984D51169a03366C85527E6314
12420g4299H1910C4066K29791o6056i8888A50338m8273b05695J5981c2397r0820
12409a23217D1329Q8366b9113k36209B8370b47697b6196H03K39460o2836i1146
12397b02741L6264E291i2407B6033a3851r9406e3521B22091a19429B68640G8174
12385c23048A19115P0009K6441k1178a7039C72463d5302B8771K3109a995k65398
12374b67393F4125J47091C7342K4023a07547k35825a40351f9186A67331q3205
$$ plain form
12455 13152 -245667 -107651 24276 -172016 207394 -4736 -264994 -344947 -7310 -59664 -95491
12444 -95491 -141441 -125652 -153113 9056 -15396 244471 -114008 142186 95422 3773 -68607
12432 -77634 373598 64037 -25282 -17060 -157332 77210 -18984 451169 -103366 385527 56314
12420 -74299 81910 34066 263857 197801 -98888 150338 102065 -205695 -189714 -32397 -123217
12409 -123217 41329 129695 -29113 -265322 28370 -247697 -26196 803 240263 177427 -91146
12397 -202741 -166477 5291 -92407 26033 -13851 -113257 -53521 222091 -119429 268640 78174
12385 -323048 119115 189124 215565 194387 -17039 372463 -45302 28771 51880 -1995 -267393
12374 -267393 64125 211216 37342 61365 -107547 -343372 -140351 -69186 167331 84126
12364H4126a74282E4625J96977d2085A56181c20935G676a27439G7173h8832H5605
12352C13940A18133k36b5123B18975c19884R3804F707L03311r2201a78939j4709
12341a93648C45134j28562E5795i7788M0475A99955A8045J531b08227r6679G6784
12329B00217c02769A1335a47852J2994A95951M8554A6204c75279a67408f9755
12318h1538a4727m40447a31670n2537B30175d468A06819e898j56327A83373k6464
12307A56909l2383D5369A5772K74183f9525p3066L5192d1089p8842j29653K0391
12296b29193a6524j56734b7446C17581g8527A59547J44654r5318l1609g6423L4521
12285d1902A28617M0848M9139p3905d8000A12397J86527G5995b7685B52415J33404
$$ plain form
12364 84126 -174282 54625 251602 -42085 156181 -320935 7676 -127439 77173 -88832 85605
12352 313940 118133 117897 -25123 218975 -319884 -226080 6707 310018 217817 -178939 -193648
12341 -193648 345134 216572 55795 -97788 -57313 199955 18045 19576 -208227 -304906 76784
12329 200217 -302769 11335 -147852 -134858 195951 244505 16204 -375279 -167408 -69755
12318 -81538 -14727 -455174 -131670 -184207 230175 -4468 106819 -5898 -162225 183373 156909
12307 156909 124526 45369 15772 289955 -69525 -142591 -107399 -41089 -119931 -249584 -229193
12296 -229193 -16524 -173258 -27446 317581 -78527 159547 304201 208883 177274 -76423 -41902
12285 -41902 128617 169465 218604 144699 -48000 112397 298924 75995 -27685 252415 385819
12274C85819b25323A50754F9184K24320D4249K39115H4541L58660A07603J1005
12264A18608R9251A2234R0546J55656D2068K49667m5488b9343A01236J3548J17834
12253B32618J76486c10116D3355j1131O1386K9508j9139O4039F0819a8312C12770
12241F2221c871n5347j38558O7698m7874g2758j30456B8949a7225A09404a01935
12229C13514R4358a11284B5606K96933A33969a2539A92350J78082j74030N2899
12219B49301G1860a8444Q874F98925B63339b1653h79C58530j02865i6951B01525
12207A39355K0849J18573J47539A92556K6137E9257c8373A60958K43442H1044
12196E14449I0547L27206j42140L57325A68804E6084J22944J38447d0892B8266
$$ plain form
12274 385819 -225323 150754 69184 293504 44249 283364 84541 443201 107603 118608
12264 118608 217859 12234 102780 258436 42068 291735 246247 -29343 101236 114784 232618
12253 232618 409104 -310116 43355 32224 93610 123118 103979 168018 60819 -18312 312770
12241 62221 -3871 -59218 -197776 -130078 -177952 -72758 -203214 28949 -17225 109404 -101935
12229 313514 407872 -111284 25606 322539 133969 -12539 192350 370432 196402 249301
12219 249301 71860 -18444 -9570 698925 263339 -21653 -879 358530 255665 -96951 201525
12207 139355 160204 278777 426316 192556 218693 59257 -38373 160958 404400 81044
12196 514449 90547 417753 275613 632938 168804 56084 179028 317475 -40892 28266
12185i5317C67657j27952m3497q4014a94259A93011o5158E8097G640J30292o6947
12174G0985P7409F8510P3365J0572K83656e3359l2617K1081a4284C42358J68767
12163E11125b30319A38389k2808K31758I0370J14851F2929K58850j37887q4146
12153I9746c1402A82439A7383J24959B9993j4107K52677D2182L74758c11250A12450
12141A18189Q0485c5033j15843a4718G1028b073E1304d4608A36024L6666j7850
12130A54840J7592P2090e8489C24726d90033B8285O2260p029c33925O0622A19305
12118B24270J9152B8093B714J7267b70760d9442p3174A47827A5479a14621l3619
12107a48240a5365B48976O3160a403D901N9130a3667j02341A07277D0263e0184
$$ plain form
12185 -95317 367657 239705 196208 112194 -194259 193011 127853 58097 7640 137932 70985
12174 70985 148394 68510 141875 152447 436103 -53359 -85976 -64895 -14284 342358 511125
12163 511125 -230319 138389 115581 347339 90370 205221 62929 321779 183892 99746
12153 99746 -31402 182439 17383 142342 29993 15886 268563 42182 416940 -311250 112450
12141 118189 198674 -35033 -150876 -14718 71028 -2073 51304 -44608 136024 172690 154840
12130 154840 172432 244522 -58489 324726 -490033 28285 90545 83516 -333925 -273303 119305
12118 224270 243422 28093 2714 19981 -270760 -49442 -122616 147827 15479 -114621 -148240
12107 -148240 -15365 248976 312136 -1403 4901 64031 -13667 -116008 107277 40263 -50184
12095A46178B8343J70631K32840D6702A6536I01a55545j18816L2013E1574a11430
12083C7903b02019e6400D0470a11325l959B25152a06301A24108a92234G1967J078519
12072A150486J563493A184976E41544A23514a85536L8644B16752E1035L87141
12063D38176C7828b0559r4472k03394a6785A42832n2066c4476O432H1442k6160
12052E5282J91966f1455j64309J05547d1687r4448A5934b08559Q3300n6813O4500
12041a17572F8883b01854r7393A25404J57757F0990a3933k23308B7542J61246
12031A88788h6973j55516A41019a50922A7614L4484J98171a33318r609A1258i6751
12019D0987C350J84232E8400M7349L93008d5754l6389m0997d3776b1691k69891
$$ plain form
12095 146178 28343 198974 431814 46702 16536 901 -155545 -274361 -242348 51574 -111430
12083 37903 -202019 -56400 40470 -111325 -115284 225152 -106301 124108 -192234 71967 1150486
12072 1150486 2713979 1184976 541544 123514 -185536 -146892 216752 51035 438176
12063 438176 37828 -20559 -115031 -318425 -16785 142832 90766 -34476 -28044 81442 55282
12052 55282 247248 -61455 -225764 -120217 -41687 -136135 15934 -208559 -125259 -182072 -117572
12041 -117572 68883 -201854 -299247 125404 283161 60990 -13933 -237241 27542 188788
12031 188788 -86973 -242489 141019 -150922 17614 52098 250269 -133318 -142927 11258 -96751
12019 40987 3350 187582 58400 105749 498757 -45754 -82143 -123140 -43776 -21691 -291582
12008b91582e8852j13883F2075e127H2406K05539a36353E44369j68621E1053a296
11996C53657B3194e3580r7647B58972A7109R2988A9453a03846B01802p4379C2400
11984H9178O2657n5458P8089b785E5644M810J06905h7475L1079A31988a65514
11972g6487A43809a48329B19383e6343E646j877K81556a42905H9987a20294l07560
11961d27854C09048a42369D2828L6346b08578I4568i4153F5467L48037A97112
11950F5734k7387Q225b66088D1525p350a61294p588g6242E1934b05255A52206
11938A11687b37777J15538e6913r4653A03770i9692r9775B18931a03020B37431
11927a97482G1537k756b90270H1183J13810A8255a34354e0249j04047M4877A89978
$$ plain form
12008 -291582 -58852 -172735 62075 -5127 82406 287945 -136353 544369 375748 51053 -1296
11996 353657 23194 -53580 -151227 258972 17109 110097 19453 -103846 201802 127423 32400
11984 89178 151835 96377 174466 -2785 55644 60454 167359 -87475 -56396 131988 -165514
11972 -76487 143809 -148329 219383 -56343 5646 3769 285325 -142905 89987 -120294 -427854
11961 -427854 309048 -142369 42828 79174 -208578 94568 -94153 65467 413504 197112
11950 65734 38347 46572 -266088 41525 34175 -161294 -168882 -76242 51934 -205255 152206
11938 111687 -237777 -122239 -56913 -151566 103770 -99692 -199467 218931 -103020 237431
11927 -197482 71537 68781 -290270 81183 194993 18255 -134354 -50249 -154296 -109419 189978
11915c43304A13197b40416B13608q8659B7386a52099C4925d9604A01915J58035
11905B59950a9855G7515M3090a63324k7553A06004b27007A4071f8496j81761J20021
11894a30236A60130B7478b174B3805a421A08396b78496a8486j13448F2353g3113
11882B46133Q8143a71692M3203A20387L39975B6005O2390k5368N3448K0448a26539
11870a54006B11105b7857k12506D1362c5784n2105B02a91380n5025b2110H3367
11858C20612h121C7668J74960j03147I183a99746A30325Q290a73350g1477B68319
11846I6902a23387A00566c0806r6608p4908H5357J29988b35324B09264a7416j44625
11835a62041p6036r473Q524B59763c6719j29559j76400b4569o3990j92226h1350
$$ plain form
11915 -343304 113197 -240416 213608 124949 27386 -152099 34925 -49604 101915 259950
11905 259950 -19855 77515 120605 -163324 -190877 106004 -227007 14071 -68496 -250257 -130236
11894 -130236 160130 27478 -2174 23805 -1421 108396 -278496 -18486 -131934 62353 -73113
11882 246133 334276 -171692 -128489 120387 460362 26005 88395 63027 116475 136923 -126539
11870 -154006 211105 -27857 -240363 41362 -35784 -87889 202 -191380 -246405 -22110 83367
11858 320612 -8121 37668 212628 109481 9183 -199746 130325 138615 -173350 -71477 268319
11846 96902 -123387 100566 -30806 -127414 -202322 85357 215345 -235324 209264 -17416 -162041
11835 -162041 -238077 -247550 -239026 259763 -36719 -166278 -342678 -24569 -88559 -280785 -81350
11823a42484K5303A47037C8203b6248B80818a67534M8460c4246k90087H928N5831
11812F4759a17459I7646b66384a01444j53716F124f1696A71754a85609J8665L6448
11801a30496D4860a78010K0181H0120b0187h182k50115d3617A03784c00419A27539
11789a24379B37003a78339C07841a11130j13891A94669E2956a03306B58339a74540
11778c02105A04004C8659j6395a7951m2100A26994E2489a19263o0884h9003b2692
11766g135m222k46047K3046F5054L6245a04949c2334C07947j18385a13117A47159
11754A01223N557g6551l78946i4525k1932B63175a81910f6400r90F8353b31171
11742I4998b42903g6554k0897M5599A64433p5257h6501C08965m9444F1124i521
$$ plain form
11823 -142484 -117181 147037 38203 -26248 280818 -167534 -119074 -34246 -324333 8928 64759
11812 64759 -117459 97646 -266384 -101444 -255160 6124 -61696 171754 -185609 -166944 -130496
11801 -130496 44860 -178010 -157829 80120 -20187 -8182 -258297 -43617 103784 -300419 127539
11789 -124379 237003 -178339 307841 -111130 -225021 194669 52956 -103306 258339 -174540
11778 -302105 104004 38659 22264 -17951 -60051 126994 52489 -119263 -180147 -89003 -22692
11766 -7135 -11357 -257404 -234358 65054 101299 -104949 -32334 307947 189562 -113117 147159
11754 101223 106780 -76551 -455497 -94525 -116457 263175 -181910 -66400 -67390 68353 -231171
11742 94998 -242903 -76554 -97451 -51852 164433 89176 -86501 308965 259521 61124 -9521
11730a674r203C2142J95742a67510N6087j46344J26312N4825C93053b85703A43742
11718d1859A63745i9562A83023J8327j0790D5771Q3906a57519A47731e8368I0954
11706A5775h8884q4649g6253A00280d7136B18824k3826p540l1105F717J98207
11695B04924B0959a61137C27067C0205Q4557b62554F1061K46066c45903B76145
11684i2013j55275C24075F6184J72724J17523R5016A63778K86174j59303J8656
11674C09305E2413M7099k8138C4288a80162N2410q2048g6504D0202b8014H2033
11662A2213J4510d49716A20012a144B4168K52284j10190A5399L49723a72012A25058
11650a91290a5305D3976b2261j49779n7418b7326A6842Q5546i3106a1754q9137
$$ plain form
11730 -1674 -10877 32142 227884 -167510 -111423 -257767 -131455 -76630 393053 -285703 143742
11718 -41859 163745 -99562 183023 201350 190560 45771 129677 -157519 147731 -58368 90954
11706 15775 -88884 -173533 -76253 100280 -47136 218824 194998 187458 156353 6717 204924
11695 204924 20959 -161137 327067 30205 114762 -262554 61061 307127 -345903 276145
11684 -92013 -247288 324075 66184 238908 356431 451447 163778 449952 290649 309305
11674 309305 52413 99512 71374 34288 -180162 -127752 -209800 -76504 40202 -28014 82033
11662 12213 26723 -449716 120012 -1144 24168 276452 166262 15399 365122 -172012 125058
11650 -191290 -15305 43976 -22261 -172040 -229458 -27326 16842 102388 -93106 -11754 -100891
11639a00891M8645k11528D642L8354h0462A19751h5367C1468C204e466A40710
11627a28327B23224p5615b28836J14091C1387N8222h978C46769c0015B1357R6491
11616A17848l8790o818g4003A76887K9014a35997j7525m1289A69669b02249e6200
11604A24802B1428K49243e9838A5808c8526r2263b5640j55469B28116q6858E665
11592c1767j6068q2735F2108g2577c4487B27856o7593K2755K86041F7994J47066
11581B15060a0051A78255a45874b7810k0784c690C13278c0147o520A26158J0724
11570A36882K1352J08498A18855D6456k3146M8780a43877E7592L85259K2934b8766
11558g7451d484A73839N7147a74314A17513a57820b6272B14434F6146P674B838
$$ plain form
11639 -100891 -52246 -263774 4642 42996 -80462 119751 -85367 31468 3204 -5466 140710
11627 -128327 223224 147609 -228836 -114745 31387 89609 -8978 346769 -30015 21357 117848
11616 117848 79058 72240 -74003 176887 205901 -135997 -153522 -194811 169669 -202249 -56200
11604 124802 21428 270671 -59838 15808 -38526 -130789 -25640 -181109 228116 141258 5665
11592 -31767 -47835 -130570 62108 -72577 -34487 227856 160263 183018 469059 67994 215060
11581 215060 -10051 178255 -145874 -27810 -48594 -3690 313278 -30147 -36667 126158 136882
11570 136882 158234 266732 118855 46456 23310 72090 -143877 57592 442851 465785 -28766
11558 -77451 -4484 173839 230986 -174314 117513 -157820 -26272 214434 66146 73820 2838
11546D23757b08669B16611B6784L1801c7101l27988A25905K6446a41880A44471
11535b4514E2297J52718c3715l9850C65384j14486L5157A00229d0352C50347A70078
11523e7013E6863c20590A76418C1138J47681F1031d171l4857k65985B93957n4823
11512B39134a70057E847Q8311B7361R8373J21812a667j58505B29024O9890E4118
11500b71397D22979B00769j9139J71292F6812J09352C8837J63319J93714A85127
11489A2419M79989B28614n2191m9940L1496L927C2799J35858B054J0083a84569
11477E8559g572F0680K05249n8887J04063J6261R1878k06600J91752j33645C7211
11465A59633b33760A17147b1774O641B40525A2246K71992K3395a75027B96847
$$ plain form
11546 423757 -208669 216611 26784 58585 -37101 -365089 125905 152351 -141880 144471
11535 -24514 52297 205015 -33715 -73565 365384 250898 286055 100229 -40352 350347 170078
11523 -57013 56863 -320590 176418 31138 178819 61031 -4171 -39028 -305013 293957 239134
11512 239134 -170057 5847 94158 27361 125734 247546 -1667 -160172 229024 298914 54118
11500 -271397 422979 200769 181630 352922 66812 176164 38837 202156 395870 185127
11489 12419 492408 228614 176423 126483 157979 161906 32799 168657 2054 12137 -184569
11477 58559 -7572 60680 265929 207042 311105 327366 419244 212644 404396 270751 37211
11465 159633 -233760 117147 -21774 -15133 240525 12246 284238 307633 -175027 296847
11454B0646K59135b67664A0450g0476C13396A30752i6753B14434J902J54166A35655
11442B21520B7725c36783D2925K43423b10873C44384G8546Q6815h5544B08109
11431A44694b14816B79294C0189K2428a65613b164B68694a73379C3657L5987a29766
11419a3368k1177p0799D8823a01993I5930q012l2945K4821j0215J35524G3357
11407I2966g4136q0361b6406j14375O0126A68232E4797J24020f877D14301h7337
11395C47245a14287A44698R334d5468A57215J74913c90124D79176a13232l32247
11385d45479B48869b77713D4149N4749l5791H878b21892B58061G8154a28104A40694
11373g2800k89465F0973a10464C7291O2985m278a09343B52643j21097J2356l6274
$$ plain form
11454 20646 279781 -267664 10450 -70476 313396 130752 -96753 214434 216336 370502 135655
11442 221520 27725 -336783 42925 286348 -210873 344384 78546 165361 -85544 208109
11431 144694 -214816 279294 30189 52617 -165613 -2164 268694 -173379 33657 69644 -129766
11419 -13368 -34545 -105344 48823 -101993 95930 87918 54973 79794 69579 205103 73357
11407 92966 -74136 -154497 -26406 -140781 -80655 168232 54797 178817 -6877 414301 -87337
11395 347245 -114287 144698 154032 -45468 157215 332128 -390124 479176 -113232 -445479
11385 -445479 248869 -277713 44149 98898 63107 8878 -221892 258061 78154 -128104 140694
11373 -72800 -362265 60973 -110464 37291 100276 95998 -109343 252643 131546 143902 107628
11362A07628b43912O1782A89568e3766A26507b54216g7842G3470J28377g1753
11351B50756j04814a91296j5202B48451a76481j88302J57627K1090A47523a13604
11340E181c6677I0665G104a51368o8407J06144A34463D8893k1750P5164b06708
11328a04227B35403a39197P966D00102c6963l8243a8104E8633R324a83072G8348
11316D9079J16552a50046B50891C3025J80612a41557n8473g8354G8065b09133
11305b7611n8717B14642K11974a33041c2680p105F6040H923K5479J56730F242
11293B81002G9392j2653J16732h3779p3106A06351K74582A74301K1485b05502
11282a46937d5773H6062B4853b31763h4053G8225G151R7402N3804a48140B4411
$$ plain form
11362 107628 -243912 -182130 189568 -53766 126507 -254216 -77842 73470 201847 -71753
11351 250756 145942 -191296 -206498 248451 -176481 -364783 -207156 -186066 147523 -113604
11340 5181 -36677 90665 7104 -151368 -219775 -113631 134463 48893 27143 102307 -206708
11328 -104227 235403 -139197 -131231 400102 -36963 -75206 -18104 58633 67957 -183072 78348
11316 49079 165631 -150046 250891 33025 213637 -141557 -200030 -78354 78065 -209133
11305 -27611 -86328 214642 426616 -133041 -32680 -39785 66040 8923 34402 191132 6242
11293 281002 79392 66739 183471 -83779 -156885 106351 380933 174301 195786 -205502
11282 -146937 -45773 86062 24853 -231763 -84053 78225 7151 104553 158357 -148140 24411
11270g0650H579a95768A46312d0371H3933a09888a2208k3048j01598D3129a44877
11258A18421a21742A05323c82665J37025n3968g00C0946K0409b0991l93850I5808
11246B924a05972j82298a05926J0296l27955b10549A79775d4691j5538b3523A72128
11234B48565j15426h8203j78392p0765J08755f2906j1575A55108b17076B95105
11223e0761G1416c084j85322j9668i8580j934B8897a93249A90033a16646O38M8770
11211f7238j18206r1761a30150A21920b45075A9514c02575A03737a68564A95592
11200e3728J0850k8790m5784J5651k7716a6513B5827f7513G5753b37763Q6033
11189a51730C9804h9240I7803J92307i2059l40692A02980Q2615B8455P2084K7165
$$ plain form
11270 -70650 8579 -195768 146312 -40371 83933 -109888 -12208 -35256 -136854 43129 -144877
11258 118421 -121742 105323 -382665 -245640 -299608 -700 30946 51355 -20991 -414841 95808
11246 2924 -105972 -288270 -105926 -95630 -423585 -210549 179775 -44691 -60229 -23523 172128
11234 248565 133139 -88203 -266595 -337360 -228605 -62906 -74481 155108 -217076 295105
11223 -50761 71416 -3084 -188406 -208074 -98580 -100514 28897 -193249 190033 -116646 -116008 -67238
11211 -67238 -185444 -277205 -130150 121920 -245075 19514 -302575 103737 -168564 195592
11200 -53728 -42878 -71668 -117452 -101801 -129517 -16513 25827 -67513 75753 -237763 -151730
11189 -151730 39804 -89240 97803 290110 -92059 -432751 102980 185595 28455 100539 127704
11178A27704J44409I87a46361k3445h4092k4998F9328k7962b49582A36662n137
11167A31525m441i8864B35921A05339K07541A46158C3444J18469J25370j06421
11157A70862a28650K2792D1492Q9437f6780A5102J74227i2857A2999L8642h290
11145B19106L7076E6489F389f9787J832r9211B39434K0361I6426b80055J05081
11134a74974C08123a693j32465j34491C9631P0127a5308B37307j05281D169N2336
11123E6505J0963K28783A434J03450L4538i3839F0508j6003O5344H674i5115A92076
11110b1226E6320b729D7093K13567M9832o0275a2969A76543M2732k4634b5876
11098B88205NJ09262k4339j53851n3375a52371B31561J90263d4374B73100D2915
$$ plain form
11178 127704 272113 987 -146361 -169806 -84092 -109090 69328 41366 -249582 136662 131525
11167 131525 127084 -98864 235921 105339 312880 146158 33444 151913 277283 170862
11157 170862 -128650 -105858 41492 130929 -66780 15102 189329 -92857 12999 51641 -8290
11145 219106 256182 56489 6389 -69787 -67955 -167166 239434 259795 96426 -280055 -174974
11134 -174974 308123 -1693 -134158 -268649 39631 109758 -15308 237307 132026 4169 56505
11123 56505 67468 296251 1434 104884 139422 -93839 60508 44505 109849 8674 -95115 192076
11110 -21226 56320 -2729 47093 260660 310492 250217 -12969 176543 219275 194641 -25876
11098 288205 288210 397472 373133 219282 165907 -152371 231561 421824 -44374 273100 42915
11086B64134e0844B35417E9173d3644A79062A6759N2850J48756l7077R726K2609
11075B13623a1730B71427l4442m9268J22889p2763l5266k899M34246B80692L5651
11064C16343K02520Q2511k69608r6758M0701K62445E5115O93983C67672K28886
11054E96558K8906k80585N44096m30435J54582J30243j43439J71802j51733K0565
11044F40560J89071K28431m23621J34725m2852o3401J61482j28680K23732l15518
11034F03929r7217K41599l06479L66610j81420R7866k17248L80638j4391k74230
11024E99657Q984J9599n8128j68328J07033M69323m77168J34507J50494j36250
11014F49723J5815R1530k65189Q5851j74453L21153j70387k37098M22307k21350
$$ plain form
11086 264134 -50844 235417 59173 -43644 179062 16759 69609 218365 181288 191014 213623
11075 213623 -11730 271427 236985 187717 310606 237843 202577 199678 633924 280692 316343
11064 316343 518863 601374 331766 235008 275709 538154 55115 749098 367672 596558
11054 596558 625464 344879 888975 458540 613122 743365 599926 771728 619995 640560
11044 640560 829631 1058062 634441 769166 726314 662913 824395 695715 919447 603929
11034 603929 506712 748311 441832 808442 627022 724888 507640 888278 873887 599657
11024 599657 608641 628240 570112 401784 508817 978140 500972 635479 785973 649723
11014 649723 665538 757068 491879 577730 403277 724430 554043 316945 739252 517902
11004E17902K03005j96358J7574K76157k18624O6106K12310C27426J19261M98040
10994I44727m66219M7760L79380k10059P5028l31404N02742k75829L02394r8138
10984H70382N1969L699M16364l24406K26898J65430K55129m64839K71363K62551
10974A734540M55465K34347L24472m1396R8490J67756L18573l21629j85000l9448
10964B746170r10250J37880k43426o3763N817J99190l89826n3852L7369L09460
10954A774769n00167P5464j05357N117l74688M604D15994m1146K35540j39518
10944D70870j98752o9876L8282l5261q2375K82556j76368r3254j8022P8902K9455
10933B26157a23960c5756J0337D07997j12446g7637B68111a32824A96227b4671
$$ plain form
11004 517902 720907 524549 542123 818280 599656 665762 878072 327426 446687 944727
10994 944727 478508 526268 905648 695589 770617 439213 941955 666126 968520 870382
10984 870382 922351 926050 1342414 1018008 1244906 1410336 1665465 1200626 1471989 1734540
10974 1734540 2190005 2424352 2748824 2707428 2805918 2973674 3292247 2970618 2785618 2746170
10964 2746170 1835920 1973800 1730374 1666611 1672428 1871618 1481792 1427940 1465309 1774769
10954 1774769 1274602 1350066 1244709 1249826 875138 879742 415994 374848 610388 470870
10944 470870 272118 202242 240524 205263 122888 405444 229076 135822 117800 196702 226157
10933 226157 -123960 -35756 -25419 407997 295551 -77637 268111 -132824 196227 -24671
10922B42780l0945b50294A74866b03041g7495H4781j9136O2394a6973g111A45266
10910A46006f6486B5358J06247A0469K70136J64639a11903H2275b01600R7451
10900a04149I4533O7799h510I4634b41786J01037c1909j08026M2471A40441m1252
10889I9189b13120q186C24124j13385C8778k762i0323L7172C2975f318l37367
10878c43685B76971e9381G3738b80177A50225J44573j02473n4940b94933C25323
10867B84303c40225A06752K58196G1637b30099i1585F6466k353a62581r5d7432
10855e2617j67018F5416d60708C9005Q4742A6006a56432A10239A595a7943j01875
10844a19818E7960d54025B19288b10731b1799A06687a04257k16340g6580a5996
$$ plain form
10922 242780 211835 -250294 174866 -203041 -77495 84781 65645 128039 -16973 -7111 145266
10910 146006 -66486 25358 131605 10469 280605 445244 -111903 82275 -201600 -104149
10900 -104149 94533 162332 -8510 94634 -241786 -140749 -31909 -139935 -97464 140441 99189
10889 99189 -213120 -221306 324124 210739 38778 36016 -90323 -53151 32975 -6318 -343685
10878 -343685 276971 -59381 73738 -280177 150225 294798 192325 137385 -294933 325323
10867 284303 -340225 106752 364948 71637 -230099 -91585 66466 64113 -162581 -162676 -47432
10855 -52617 -219635 65416 -460708 39005 123747 16006 -156432 110239 1595 -17943 -119818
10844 -119818 57960 -454025 219288 -210731 -21799 106687 -104257 -320597 -76580 -15996
10833D8550L8651l6230b79412d3071m3528B53682c00155I8251e879j45329c4440
10821h9764l374k26026R5364d6430O305o9491m152K9894B4427b20695b1715k3272
10809d4987D0912J4082I284b2702c630B30510i1800C3399e2635A01845d20566
10797d3958A03463D221b43323f4848a0902j98657B25005e2899p0433H3321a21243
10785b40908g6339D56440B26946a65974e1520k57011g0119A40232i2106n7575
10775a49681P2415c0455A45506b71362H455b4565A32529b36073J02301L5614A04736
10763a9851k7418j69057K8561a2250A2766Q290c83960a9601j1414C3900a45332
10751A84121a41251O6061j62441I4561d6787A43788Q0043J04922H8555b67601
$$ plain form
10833 48550 87201 50971 -279412 -43071 -86599 253682 -300155 98251 -5879 -151208 -34440
10821 -89764 -93138 -319164 -223800 -46430 -40125 -109616 -113768 -83874 24427 -220695 -21715 -44987
10809 -44987 40912 54994 9284 -22702 -3630 230510 -91800 33399 -52635 101845 -420566
10797 -43958 103463 4221 -243323 -64848 -10902 -209559 225005 -52899 -123332 83321 -121243
10785 -240908 -76339 456440 226946 -165974 -51520 -308531 -70119 140232 -92106 -149681
10775 -149681 -77266 -30455 145506 -271362 8455 -24565 132529 -236073 -133772 -98158 104736
10763 -19851 -47269 -216326 -187765 -12250 12766 21056 -383960 -19601 -31015 33900 -145332
10751 184121 -141251 -75190 -237631 94561 -46787 143788 223831 328753 88555 -267601
10740d6463j33812H2157N1935a98628L5801B40425b63072o4890A24227e783B45739
10728G9113b17440b5232j6722j78795C3595J5797h5288c1302a3507r3521k84197
10717c91225h6251D8071K53394b45343B8835b35043D1387i6094M336j88913C08003
10705B1034L368b94269N7669a14714k3256N8129j54814g7905J6260B15018b57378
10693c3737D1287O2687b00869B13665n6447B5807b52548k2028C7472N1959Q9230
10682A78661b11426A14903n7072J27267H8859a75102m5846o749N5016K192A82449
10670H2774k4481O0445d4783l062n4074B23419c35629D1106J93893a21395B09710
10658a09396j39803A45710d8918o127A07774M5350f9750A90530b08409i2115j41148
$$ plain form
10740 -46463 -180275 82157 134092 -198628 -162827 240425 -263072 -327962 124227 -5783 245739
10728 79113 -217440 -25232 -41954 -220749 33595 49392 -85288 -31302 -13507 -107028 -391225
10717 -391225 -86251 48071 301465 -245343 28835 -235043 41387 -96094 -91758 -280671 308003
10705 21034 24402 -294269 -236600 -114714 -137970 -79841 -234655 -77905 -61645 215018 -257378
10693 -33737 41287 103974 -200869 213665 157218 25807 -252548 -274576 37472 89431 178661
10682 178661 -211426 114903 57831 185098 88859 -175102 -220948 -227697 -172681 -170489 182449
10670 82774 58293 118738 -44783 -47845 -101919 223419 -335629 41106 234999 -121395 209710
10658 -109396 -249199 145710 -48918 -55045 107774 153124 -69750 190530 -208409 -92115 -233263
10647b33263F6685J40214J52714b55429b1749F2863b28212H450K63372b5530H3957
10635G3830a09438b6190l6632k23261A27166c6669B10893b8465n9591j06451L2967
10624a61540l06557a1299l81099J02529R5385d3455C55296C8693j0976P5835b84879
10612a33068f578I8888j5426L05565a6906k61282A23794k6069a35392N0235j03825
10601a88982C4350P5184f481I0048a10821k69173a47749A16279l7933c25876I1501
10589f5208E3618L58875b82643O4148e626j80469f9081A53628p6257b3039j13393
10578a36432D2161Q840L4429a33448E4512d5385j71893a3993j44551l9843j38622
10567c37009G3961b18438B289c5688a7600Q504l48208J31744M7147P7330d2248
$$ plain form
10647 -233263 66685 206899 359613 -255429 -21749 62863 -228212 8450 271822 -25530 83957
10635 73830 -109438 -26190 -62822 -286083 127166 -36669 210893 -28465 -88056 -194507 -161540
10624 -161540 -468097 -11299 -392398 -289869 -194484 -43455 355296 38693 27717 103552 -284879
10612 -133068 -6578 98888 83462 389027 -16906 -278188 123794 97725 -135392 -85157 -188982
10601 -188982 34350 109534 -6481 90048 -110821 -379994 -147749 116279 78346 -325876 91501
10589 -65208 53618 412493 -282643 -218495 -5626 -186095 -69081 153628 77371 -23039 -136432
10578 -136432 42161 51001 85430 -133448 54512 -45385 -217278 -13993 -158544 -198387 -337009
10567 -337009 73961 -218438 2289 -35688 -17600 -9096 -357304 -225560 -178413 -101083 -42248
10555E1243g0289j61854G88b59376D8964e3978j39156A3878a98751B33098a61960
10543F9050J5952a65214A79922J12286b63028b8491J1183k70160F8172b97303
10532i8481A41648C9340O686A1132h7394j73675R6091A30471a51790j1399A6897
10520A74834c47576a35096A24838a61983I9569a9930j84487D6086d3916A51207
10509a29472B70439E507c3658A30393a78790e0450m732A75207h0032k12137B82039
10497A33315C3407Q7480M4727c91830H7467a10709m87071A66257J0754a89845
10486d0952o2850j71671J08214l051D9400N20373k76424l2499L26115B82689k4833
10475B57856H7175J92619C1792K9639b11760N5622l13886B40948a29748j36336
$$ plain form
10555 51243 -70289 -232143 788 -259376 48964 -53978 -193134 13878 -198751 233098 -161960
10543 69050 85002 -165214 179922 292208 -263028 -28491 -17308 -287468 68172 -297303
10532 -98481 141648 39340 46026 11132 -87394 -261069 -164978 130471 -151790 -163189 16897
10520 174834 -347576 -135096 124838 -161983 99569 -19930 -204417 46086 -43916 151207
10509 -129472 270439 5507 -33658 130393 -178790 -50450 -55182 175207 -80032 -292169 282039
10497 133315 33407 120887 165614 -391830 87467 -110709 -597780 166257 177011 -189845
10486 -40952 -103802 -275473 -167259 -170310 49400 569773 293349 260850 586965 282689 257856
10475 257856 87175 279794 31792 61431 -211760 -156138 -470024 240948 -129748 -266084
10465b66084G2376e791k8129N999l51139D1011j2132J82979H0257e4743G6212
10453c50776a57284C1874p333a40301L3106A40119l1546k44D1895b5999A00849
10441d3117A48768a9925k5666A32103i3985A9856K47452A7465a16077H2276J10871
10430A93147b70986k9509C15178h9508j361A65228f0135q650r218C3472J56860
10419A90332b11750c425j80085f7215j12920d5748E5548j8801J37064C7035a94677
10407B6421M3351a18978a6299r6695F1547c0162q5370B92190j10770O0842q3517
10396A58745f533A77866b19919C56462A8801N6470K7035O1813p7918K84605p2699
10385B98107A9611J06780n8470f5041B17074n2441C8858K00805R3149r2579J26815
$$ plain form
10465 -266084 72376 -5791 -33920 -27921 -379060 41011 28879 211858 80257 -54743 76212
10453 -350776 -157284 31874 24541 -140301 -107195 140119 108573 108329 41895 -25999 100849
10441 -43117 148768 -19925 -45591 132103 -93985 19856 267308 17465 -116077 82276 193147
10430 193147 -270986 -300495 315178 -89508 -90869 165228 -60135 -68785 -78003 33472 190332
10419 190332 -211750 -3425 -183510 -67215 -180135 -45748 55548 36747 173811 37035 -194677
10407 26421 69772 -118978 -16299 -112994 61547 -30162 -115532 292190 181420 242262 158745
10396 158745 -6533 177866 -219919 356462 18801 75271 102306 164119 86201 370806 298107
10385 298107 19611 126391 67921 -65041 217074 164633 38858 239663 332812 240233 367048
10374C67048b43538D57020I475N4760g8676D66537k3743J41743k17428A76434
10363E01686j52604O9992n2806r6695L2496L3442A57700k931d4783A77143R2246
10352B69389R7520J51820J85198o5184k5084k51244R07O7120r0066J16871j02124
10341C55123J33j05845d0217D93826a23814A60463K75678H9166k0322J27968a05207
10329a9437F5916a95547R6467B04236G2702a65607D02714I2585J49917j2471c8064
10317C58979P2139A50386l0431f011F12673B71314d0434k16361I2427Q8666f5072
10305b52409c4380H1064c92223a1694k9121B49590G7048i3435A16816a05658c9811
10293F8416O8147O1543r7818b71873k10763J83418R9766f3959j27019B01139E7055
$$ plain form
10374 367048 -243538 457020 9475 64235 -78676 466537 442794 584537 367109 176434
10363 501686 349082 419074 366268 269573 302069 335511 157700 154769 -44783 177143 269389
10352 269389 366909 518729 703927 638743 613659 362415 363322 430442 340376 457247 355123
10341 355123 355256 249411 -40217 493826 -123814 160463 436141 89166 68844 196812 -105207
10329 -19437 65916 -195547 -99080 204236 72702 -165607 402714 92585 242502 230031 -38064
10317 358979 431118 150386 119955 -6011 612673 271314 -40434 -256795 92427 181093 -65072
10305 -252409 -34380 81064 -392223 -11694 -40815 249590 77048 -93435 116816 -105658 -39811
10293 68416 136563 198106 100288 -271873 -482636 -299218 -199452 -63959 -190978 201139 57055
10281b16950n7000C0877J740a8000d829A03140J89442c6015j48498a9491G3061
10269E3890h5318k11292m2535a2662k43316d6945m6868g191C53918a98556D08693
10257E2266J93133o8132M7269C0627A0311a58209c446I0651L8714R5196A814R0018
10245I1832e1909k35245G3128l2764a18385F7547a81533B18661b14004F2890a5945
10233F9540e01908K18229A95788a53021k7218A28302f8027q6273k5180F8265g5990
10221A73467D7637J74312D6815a84493H646g362m7643B44513c189A38680C6096
10209b9444B08389d7685E1493e4462F2410e2603j33139B1033j0379h9655A18208
10197b01074k29438e4391j74770m3621F730c1896r6431B9371n531K8315b28980
$$ plain form
10281 -216950 -273950 30877 32617 -18000 -4829 103140 292582 -36015 -184513 -19491 73061
10269 53890 -85318 -296610 -339145 -12662 -255978 -46945 -93813 -7191 353918 -198556 408693
10257 52266 245399 177267 224536 30627 10311 -158209 -3446 90651 129365 224561 1814 91832
10245 91832 -51909 -287154 73128 40364 -118385 67547 -181533 218661 -214004 62890 -15945
10233 69540 -501908 -283679 195788 -153021 -180239 128302 -68027 -154300 -179480 68265 -75990
10221 173467 47637 221949 46815 -184493 8646 -7362 -55005 244513 -3189 138680 36096
10209 -29444 208389 -47685 51493 -54462 62410 -52603 -185742 21033 10654 -89655 118208
10197 -201074 -430512 -54391 -229161 -272782 6730 -31896 -128327 29371 23840 52155 -228980
10185A88707a03584j22915Q4022N7978c2745b421l84397J25520j04976a0818q3770
10174i4588j54385J01170J5380C42718b05074f4316A03509a67022e3515K1595
10164c1920A2921c4821C6780J4872b87278N1971A94926B2162f8872D5954J21546
10153A67500l6811g7196C02750e2782h818B75922a40998A82178d7610k0535n5525
10142a23670f31j54958C2769a71930M354d5432k78638P5508c8814C14536a10060
10130E794b23618A39564b91087M2634A58482b443B9780f525j30962I7054a53686
10118A99473b44346B5376a57143j76754b757C14457a32908j62679b2841q867R782
10107b1926F0524M9420K365a03355E8589g2292r1818A04502L8890B2919e8933
$$ plain form
10185 188707 -103584 -226499 -142477 -84499 -32745 -2421 -386818 -261298 -366274 -10818 -94588
10174 -94588 -248973 -147803 -132423 342718 -205074 -64316 103509 -167022 -53515 -31920
10164 -31920 12921 -34821 36780 51652 -287278 -235307 194926 22162 -68872 45954 167500
10153 167500 130689 -77196 302750 -52782 -8818 275922 -140998 182178 -47610 -68145 -123670
10142 -123670 -631 -155589 32769 -171930 -167576 -45432 -324070 -248562 -38814 314536 -110060
10130 5794 -223618 139564 -291087 -248453 158482 -2443 29780 -6525 -137487 97054 -153686
10118 199473 -244346 25376 -157143 -333897 -2757 314457 -132908 -295587 -22841 -31708 -21926
10107 -21926 60524 109944 112309 -103355 58589 -72292 -164110 104502 143392 22919 -58933
10095c929o0159A46534B6160O5244b59469d8542j32009I9197M3501c91271J54181
10084b37090m0756J32455K6927d2813j32392N2821J4397F7389b16774c5038n8949
10073i3987E684b50432R4153N7246a6664m74632a12830A62206g4379B78675c5102
10061b56081a26788E6141d3039j20336e1324N709j8544p7546B6735i3062j02250
10050a95312A570a59693a151A71062a25102H5897P4128A5739a24145A58252D5723
10038a37686A73766b46042a1615o1963L2073A08311c49159A99283J1921p6181
10028A35023a3164C1791b71738A28795b28383C6031b28110H0584a83438M795b1237
10016b89359P3502p8781A33091E8937L1658a52776K0467A18977A9344b0870B89970
$$ plain form
10095 -3929 -64088 146534 26160 91404 -259469 -48542 -180551 99197 142698 -391271 -237090
10084 -237090 -277846 -145391 -118464 -42813 -175205 -122384 -107987 67389 -216774 -35038 -93987
10073 -93987 5684 -250432 -156279 -99033 -16664 -491296 -112830 162206 -74379 278675 -35102
10061 -256081 -126788 56141 -43039 -163375 -51324 -45615 -64159 -141705 26735 -93062 -195312
10050 -195312 1570 -159693 -1151 171062 -125102 85897 160025 15739 -124145 158252 45723
10038 -137686 173766 -246042 -11615 -73578 -41505 108311 -349159 199283 211204 135023
10028 135023 -13164 31791 -271738 128795 -228383 36031 -228110 80584 -183438 -178643 -21237
10016 -289359 -215857 -294638 133091 58937 90595 -152776 -132309 118977 19344 -20870 289970
10004b37383F0538f0331E7448g6126C54337b34014A07010b08772j30457D4367
9993C4621K18519E2689b62125D168K14517b11546D0421i2295B27782f1382A65212
9981a43370N5094j60038L2680i8325n1412n9797H4535f7558A64242a86467q8670
9970b75137h5359k08974C7607M8042a24714A6051J22950C1050J37637a5902A26203
9958b0079C90063G6832b19855D1371a70243d7174A56454b75038A02804b73730
9947b20141A59703a61139K5215J9652C8681d76622K01383g9144k48335J39501
9937a87978A05879a1680l18082d2678A7246g1775D0497c6665k50401h2178j61027
9926b43205K5676c9569B9847c25763f3101j7752m1739J4933l31803b9103G4207
$$ plain form
10004 -237383 60538 -60331 57448 -76126 354337 -234014 107010 -208772 -339229 44367
9993 34621 253140 52689 -262125 4168 218685 -211546 40421 -92295 227782 -61382 165212
9981 -143370 -88276 -248314 -215634 -98325 -149737 -209534 84535 -67558 164242 -186467 -275137
9970 -275137 -85359 -294333 37607 85649 -124714 16051 139001 31050 168687 -15902 126203
9958 -20079 390063 76832 -219855 41371 -170243 -47174 156454 -275038 102804 -273730
9947 -220141 159703 -161139 -135924 -116272 38681 -476622 -275239 -79144 -327479 -187978
9937 -187978 105879 -11680 -329762 -42678 17246 -71775 40497 -36665 -287066 -82178 -243205
9926 -243205 -217529 -39569 29847 -325763 -63101 -80853 -122592 -107659 -439462 -29103 74207
9914a76841f8334j10583o1235c3457H6643P570a63266f5801l11781P2125j4049
9903c19506e441p7491A74451k4a36597A32628c50525A52706a93558i724p79j29279
9891a39782B25415c531o1816j52111h4319k45352B34555c03160F4736h1413A1135
9879a51758I3115a16708m2236H8737b11450c4585R278B1343a70167m4468H511
9867e54379d3321k4726K0005B65516r3374C6561h6324B38729a04107C99407a43651
9855h4232A04719a90732A47619n3962L6109a95224h7442o2785I8237c82879F3781
9843c6549k46740A58259a47423k17574c5088j19575J631L8288M1321j10131A02587
9831D1323b96670j04654a13153p6424j34552h4212J9947a9359j24839C3540b26843
$$ plain form
9914 -176841 -68334 -178917 -240152 -33457 86643 94213 -163266 -65801 -377582 -305457 -319506
9903 -319506 -5441 -82932 174451 174427 -136597 132628 -350525 152706 -193558 -9724 -10503 -139782
9891 -139782 225415 -3531 -65347 -217458 -84319 -329671 234555 -303160 64736 -81413 11135
9879 -151758 93115 -116708 -158944 88737 -211450 -34585 -25307 21343 -170167 -214635 8511
9867 -554379 -43321 -68047 -48042 265516 172142 36561 -86324 238729 -104107 399407 -143651
9855 -84232 104719 -190732 147619 93657 129766 -195224 -87442 -150227 98237 -382879 63781
9843 -36549 -283289 158259 -147423 -364997 -35088 -154663 -153032 -114744 -73423 -183554 102587
9831 41323 -296670 -401324 -113153 -189577 -324129 -84212 -64265 -19359 -144198 33540 -226843
9819i2700k6456n1162k9842k5002B79733A28383a80112N4789j66547A28075a13951
9807b89837p4938J02695A32147D1527h0809B48607a51115l4590c8045o2799n4419
9796a55263M3169J7339B87700c13732B03972a86329A51430D9402a11558k9822
9786a41380k8692O344l9370A29206K2623b4521R573m47406K22856G6088J69169
9775B45257G980h489A9897J49620q28I553a55108j97546a9249o8394c7044A77254
9762B90518A1382b25386k23951A0709Q8006g4874B12675O9875B6196a93629c4703
9750a06682m4558j13568J07162i744B7335a15304l4855e0889j39368A55016b5081
9738A26599c69774A62571b45072A72447a37937M289c724j7749r38A44508l7992
$$ plain form
9819 -92700 -119156 -170318 -200160 -225162 279733 128383 -180112 -125323 -291870 128075 -113951
9807 -289837 -364775 -262080 132147 41527 -80809 248607 -151115 -185705 -38045 -100844 -155263
9796 -155263 -112094 -94755 287700 -313732 203972 -186329 151430 49402 -111558 -141380
9786 -141380 -170072 -163728 -203098 129206 151829 -24521 -14948 -462354 -239498 76088 245257
9775 245257 7980 -8489 19897 169517 168689 9553 -155108 -352654 -19249 -87643 -37044 177254
9762 290518 11382 -225386 -449337 10709 98715 -74874 212675 282550 26196 -193629 -34703
9750 -106682 -151240 -264808 -157646 -9744 27335 -115304 -150159 -50889 -190257 155016 -25081
9738 126599 -369774 162571 -245072 172447 -137937 -133648 -3724 -21473 -22411 144508 106516
9727A06516b7138B96778b5607l96029a74812j2026J6814k46073h7557q3466P7272
9716i3751j43458h453k34940R0033j73607C1895f4266L470m75298b10321c9278
9704a02121j1249j09941j38828A18919c9790p9355m4170r0574A33399d39558b2739
9692a03462L0506j0622A8905a22637a6629l07469F090e0899D1476b48492k90252
9681e38744E2518i4149G5122c5098B05197h030q1698C6661O743c5918l17134J10479
9669b42573J02791c6019r6433H9032b70958j667b0874k22244d9770k04010a01822
9657a7067l21390J9439B40876c41439E6232j9922a96680Q8220k03061A3161a33358
9645B38150r7988D9015M1475M045b51544b3272k9133k7510B1791Q5132g4271k08727
$$ plain form
9727 106516 -27138 296778 -25607 -421636 -174812 -186838 -170024 -416097 -87557 -171023 -93751
9716 -93751 -237209 -8453 -243393 -153360 -326967 31895 -64266 -60796 -536094 -210321 -39278
9704 -102121 -113370 -223311 -362139 118919 -39790 -119145 -163315 -253889 133399 -439558 -22739
9692 -103462 -72956 -83578 18905 -122637 -16629 -324098 6090 -50899 41476 -248492 -538744
9681 -538744 52518 -94149 75122 -35098 205197 -8030 -89728 36661 43404 -35918 -353052 -242573
9669 -242573 -139782 -36019 -132452 89032 -270958 -272625 -20874 -243118 -49770 -253780 -101822
9657 -17067 -338457 -319018 240876 -341439 56232 36310 -196680 -108460 -311521 13161 -133358
9645 238150 140162 49015 90490 94535 -251544 -23272 -52405 -79915 21791 106923 -74271 -282998
9633b82998a12181A57005b05847c2804n8369k1228p534G1524J55184b25506G347
9621c2063l3636B5765f0276A67684h6287A86878F3059a02148j32065M1857K0397
9610a71959c1785o9221B88099D86g5362j37143a6507B43271g8860b4745C38626
9598B09170b66884c8877B13389b58956A08096a60619g481k88248H4409c36375
9587c32622a47725i076k8623l9678E8472g9268A6646c6724o603l6793c6092I1048
9574A01039b77986m131E3113c15802a13832j45837D3259i4187m1411l08161a62555
9562c10724I0205J33674F7553f5150m7671l30194E8852e2986r1227B38294G860
9550a93084B05674b05370B2984a51416o4630A21643j7760b3195j07473b4041H6138
$$ plain form
9633 -282998 -112181 157005 -205847 -32804 -91173 -112401 -119935 71524 226708 -225506 7347
9621 -32063 -65699 25765 -60276 167684 -86287 186878 63059 -102148 -234213 -192356 -171959
9610 -171959 -31785 -101006 288099 486 -75362 -212505 -16507 243271 -78860 -24745 338626
9598 209170 -266884 -38877 213389 -258956 108096 -160619 -7481 -295729 84409 -336375
9587 -332622 -147725 -9076 -37699 -77377 58472 -79268 16646 -36724 -43327 -80120 -36092 91048
9574 101039 -277986 -282117 53113 -315802 -113832 -259669 43259 -94187 -135598 -443759 -162555
9562 -310724 90205 223879 67553 -65150 -112821 -443015 58852 -52986 -144213 238294 7860
9550 -193084 205674 -205370 22984 -151416 -216046 121643 103883 -23195 -130668 -24041 86138
9538b5933k92381I4060a77956B1265b79088A04302J45969l8978a23213j25536
9528b48749A20207D2133g3703n6830J489A16997a88696R2022j62130a08996r9385
9517b08381A38665c42685J58580j22019B44048a857r315k68659f6541j44367J8559
9506a92349k30323b07048f7058A02395C4680d904H8988c9291H4871d3223f760
9494b21143A06453b89233J22308D2936K31746a4166l8650A81820m9340B0444J59404
9483A79848b02392A43235M0425h8775j42074A20514l9415a04489k78649d8801
9472b81354A36357b3344B23384A07172d1393j98421B2854J54392b08483C4510
9461a9206H9117R5293c28246e7308j5068C53749b23095k494i8200j47049A14215
$$ plain form
9538 -25933 -318314 94060 -177956 21265 -279088 104302 250271 211293 -123213 -248749
9528 -248749 120207 42133 -73703 -130533 -129044 116997 -188696 -96674 -258804 -108996 -208381
9517 -208381 138665 -342685 -184105 -306124 244048 -1857 -11172 -279831 -66541 -210908 -192349
9506 -192349 -422672 -207048 -67058 102395 34680 -4904 88988 -39291 84871 -43223 -6760
9494 -221143 106453 -289233 -166925 42936 274682 -14166 -52816 181820 132480 20444 179848
9483 179848 -202392 143235 183660 -88775 -230849 120514 81099 -104489 -383138 -48801
9472 -281354 136357 -23344 223384 107172 -41393 -239814 22854 177246 -208483 34510
9461 -19206 89117 184410 -328246 -57308 -72376 353749 -223095 -225589 -98200 -245249 114215
9449C9987i1645D7556d4265j09127D1436J0855c66257g2328H2303J07983c50326
9437A38577d3051k20696A19903f6042c33A10501J117f2995A03245g6302j39586
9426b15888J6205A36463D0269a9489l5466B67907E6425P6752h9950j07355l0099
9415b27404R378L4791B33982a81314D5727J48400a34861j074k22155g8463r61
9404g9424o1499O7394p3614m6644j16586A04858b51946O891J19590J7429n0761
9393a58797L7807c4733H8370B2392J82312a2726k44539k3776J06528l37481A13190
9381A03818g1583D5622b78817B8547a26474B3306K0033n439a73067k26343D354
9369b3935H6835d6592j32426j26837J28207C941R333K25887i3564A10620a75039
$$ plain form
9449 39987 -91645 47556 -44265 -153392 41436 52291 -366257 -72328 82303 190286 -350326
9437 138577 -43051 -263747 119903 -66042 -333 110501 111618 -62995 103245 -76302 -215888
9426 -215888 -199683 136463 40269 -19489 -54955 267907 56425 133177 -89950 -197305 -227404
9415 -227404 -218026 -183235 233982 -181314 45727 194127 -134861 -135935 -358090 -78463 -79424
9404 -79424 -140923 -73529 -147143 -193787 -310373 104858 -251946 -245055 -125465 -108036 -158797
9393 -158797 -120990 -34733 88370 22392 204704 -12726 -257265 -281041 -174513 -511994 113190
9381 103818 -71583 45622 -278817 28547 -126474 23306 43339 37900 -173067 -399410 4354
9369 -23935 86835 -46592 -179018 -305855 -177648 3941 13274 239161 -93564 110620 -175039
9357a9536k46348H8930A8790J08018d8833b3366k33578A4734J04832G780c25867
9345a47232A53078i5554k2381k1709k30049A25423h6390a0089k56303d4388p7459
9334a21847o0918g2747A82072d4234j07667I3235b85107d8531j23241h511p9840
9323h8351B10856a98148C804b00392E280b09054I4062D3672b04450C7240c13163
9311a39828j86689B2114M7002b116A37170n2729K8245g3895n1745A29794B7812
9299e1685A77513a54166A33734D0643c5763j25295j90022a19969p573M3558j24565
9288b08549j5988B68928b71439l309f4160j2747k58607B56665G999M84450b26468
9276C37805a62276m7887e6059l9963C8829O6333i5102A16538a81930P9129K7703
$$ plain form
9357 -19536 -265884 88930 18790 126808 -48833 -23366 -256944 14734 119566 7780 -325867
9345 -147232 153078 -95554 -117935 -139644 -369693 125423 -86390 -10089 -266392 -44388 -121847
9334 -121847 -182765 -72747 182072 -44234 -151901 93235 -285107 -48531 -171772 -8511 -88351
9323 -88351 210856 -198148 3804 -200392 5280 -209054 94062 43672 -204450 37240 -313163
9311 -139828 -326517 22114 69116 -2116 137170 84441 112686 -73895 -125640 129794 27812
9299 -51685 177513 -154166 133734 40643 -35763 -161058 -351080 -119969 -127542 -83984 -208549
9288 -208549 -224537 268928 -271439 -274748 -64160 -76907 -335514 256665 7999 492449 -226468
9276 337805 -162276 -210163 -56059 -96022 38829 105162 -95102 116538 -181930 -102801 -75098
9265g5098E4391d3889m8459C0232N4245B116a00298g457j73035P6402k59895C9202
9252c63845A48978N0297F7606J04208j6105g9541C54442f6529D2453K20839F9419
9240b3932j36583D21028i3817j6966k146j29857i0639j8750K6054B11496b36520
9228C0024K34891h8845l9307j55300H475d7481j61178I6526N939a19496c3978
9216E9189a19339A66351Q6679j20630a76305P690P0489r9377M26n0379A21887
9204A42628n5099a13415b2330k65905J23778e4209A87076a06536H14J41750a90236
9192F357a58095A60636a3748j54128k7539i380j09489k00996a44226K1414c4567
9180A2814N3085i651l1395k09026B27742a73334m6514j24791I9362Q6323p6131
$$ plain form
9265 -75098 54391 -43889 -92348 30232 84477 2116 -100298 -7457 -180492 -104090 -363985 39202
9252 -363845 148978 199275 67606 171814 155709 -79541 354442 -66529 42453 263292 69419
9240 -23932 -160515 421028 -93817 -110783 -112929 -242786 -90639 -109389 -83335 211496 -236520
9228 30024 264915 -88845 -128152 -283452 8475 -47481 -208659 96526 102465 -119496 -33978
9216 59189 -119339 166351 253030 132400 -176305 -168615 -98126 -197503 -197077 -247456 121887
9204 142628 87529 -113415 -22330 -288235 -164457 -54209 187076 -106536 814 142564 -190236
9192 6357 -158095 160636 -13748 -167876 -195415 -9380 -118869 -319865 -144226 -122812 -34567
9180 12814 65899 -9651 -41046 -250072 227742 -173334 -219848 -344639 99362 185685 109554
9169A09554a36820j89775e1398q7915k47271a56332M9411k26461a32842j13862
9159b46704a4205j06946e1636k90013b5741A04942C2488h4215a5694m6462q7511
9148a49667K1853K0975H183K41416D9080a10489B67026K872a72103I3174a08006
9136d1999b0184A4058K04984b05263h8543j63628I0396a26366p3917b5741A3044
9124a68977o2357R5242A03606B577a99264H3211a37856e5713A1116e7417C2688
9112b22980P0213L8052l10402a87585A00903h2134q972B28132a2190p2594K0889
9101f3895j5123K0774m9175P116A43306C7531A467b01406M7098C1539a75673G3604
9088a60657j73276g1679A53070a61032L5362j9988A75511A1002f5284j76422g4533
$$ plain form
9169 109554 -136820 -326595 -51398 -139313 -386584 -156332 -106921 -333382 -132842 -246704
9159 -246704 -14205 -121151 -51636 -341649 -25741 104942 32488 -84215 -15694 -62156 -149667
9148 -149667 -127814 -106839 8183 249599 49080 -110489 267026 269898 -172103 93174 -108006
9136 -41999 -20184 14058 219042 -205263 -88543 -252171 90396 -126366 -200283 -25741 13044
9124 -168977 -231334 -136092 103606 2577 -199264 83211 -137856 -55713 11116 -57417 32688
9112 -222980 -152767 -114715 -425117 -187585 100903 -82134 -91106 228132 -12190 -84784 -63895
9101 -63895 -79018 -58244 -107419 -100303 143306 37531 1467 -201406 -154308 31539 -175673 73604
9088 -160657 -333933 -71679 153070 -161032 -125670 -145658 175511 11002 -65284 -241706 -74533
9076c33988D5188R3170a14228j0627B13864P2052p3386a45685D7316f8272k08468
9065b76740f2270k36967h4249l6094C71406a37136A19546f8504j98424F2145c49145
9053C0952K08104c44779C9579M3257a16445G7772e044j7185a0429l510A08675
9041a03877A98414I4528c9205E7295b17739B03917b2477j41445A99269b57810
9030D0601b33048d7303B09099c03172A99899k3281l5909P6413a10099j46162g1096
9018A5683k061R2728a61215j62985J38870k0701e5382l10514a62094k87431a8364
9006A51295D5763c22452K6632A92630a47601O056d1210B64044a27076A58811b05501
8994b4158A20735f5579A51562J79024P9772b47406A9841d5838I5589d1131B7715
$$ plain form
9076 -333988 45188 138358 -114228 -124855 213864 285916 212530 -145685 47316 -68272 -276740
9065 -276740 -62270 -299237 -84249 -120343 371406 -137136 119546 -68504 -266928 62145 -349145
9053 30952 239056 -344779 39579 82836 -116445 77772 -5044 -22229 -10429 -13939 108675
9041 -103877 198414 94528 -39205 57295 -217739 203917 -22477 -163922 199269 -257810
9030 40601 -233048 -47303 209099 -303172 199899 176618 140709 217122 -110099 -256261 -71096
9018 15683 13622 106350 -161215 -324200 -185330 -206031 -55382 -365896 -162094 -449525 -18364
9006 151295 45763 -322452 -295820 192630 -147601 -141545 -41210 264044 -127076 158811 -205501
8994 -24158 120735 -65579 151562 330586 410358 -247406 19841 -45838 95589 -41131 27715
8982h6912j34107j11735J45771B23452A06924J4414g5345A13383b75403O7128
8972b08275j35903B1963a5464k59808H0237g4563D614b5863E0295K30216D1339
8960a84560l7656G1719a42724k769L8655m0854d4774n1199l2102A85947a7269
8948c558F7946h4412m00890A79496f360l6853n9761A07935a7706A8603h2031A73532
8935a52379j833E5345a32156L4201B66137b23686I806c14422A80449p7833F413
8923h197A08363i1199D95574F5510b56116A49676e42A34722g7339j05389A25782
8911a07462j12565a6513A02268a17730B8924P17J002a12502k50077C3499J24311
8900A57810a12056l12177b7562H4939c3935j44270m7759k27326G5056M1386h7391
$$ plain form
8982 -86912 -221019 -332754 -186983 223452 106924 121338 -75345 113383 -275403 -208275
8972 -208275 -344178 21963 -15464 -275272 80237 -74563 4614 -25863 50295 280511 41339
8960 -184560 -222216 71719 -142724 -145493 -106838 -147692 -44774 -95973 -128075 185947 -17269
8948 -3558 67946 -84412 -485302 179496 -6360 -43213 -102974 107935 -17706 18603 -82031 173532
8935 -152379 -154212 55345 -132156 -97955 266137 -223686 9806 -314422 180449 102616 6413
8923 -8197 108363 -91199 495574 65510 -256116 149676 -542 134722 -77339 -182728 125782
8911 -107462 -220027 -16513 102268 -117730 28924 29641 30643 -112502 -362579 33499 157810
8900 157810 -112056 -424233 -27562 84939 -33935 -178205 -225964 -453290 75056 116442 -87391
8888B93205b17286q5155A30584j6689a26507H497b27323c1799j76606E8854L5582
8877I4436l9059c08925J30187Q0204O117A8373J14134b6169k37643Q8405b5341
8865a9983C7530J87498G9009K37149E5882a61466j2091D471e2237n7516M3444
8854f6309l76613f0989j89968j2612B07011a30730k16266a06579C6006O5392b7694
8842H0353g4258j27827A80344P229o87a50619A25069n7548Q2838a49779j52004
$$ plain form
8888 293205 -217286 -302441 130584 113895 -126507 8497 -227323 -31799 -208405 58854 94436
8877 94436 55377 -308925 -178738 -98534 -92417 18373 132507 -26169 -263812 -175407 -25341
8865 -19983 37530 225028 79009 316158 55882 -161466 -173557 4471 -52237 -109753 -66309
8854 -66309 -442922 -60989 -250957 -263569 207011 -130730 -346996 -106579 36006 101398 -27694
8842 80353 -74258 -202085 180344 187573 186886 -150619 125069 67521 150359 -149779 -301783
$$ [...]
##END NTUPLES=NMR SPECTRUM
##END=
