##TITLE=AC1713_3097_8749698_3jzR5BpbZs
##JCAMPDX= 6.0         $$ Bruker NMR JCAMP-DX V2.0
##DATA TYPE= NMR SPECTRUM
##DATA CLASS= NTUPLES
##ORIGIN= BRUKER
##OWNER= Administrator
$$ 1.72 TOPSPIN		Version 2.1
$$ 2015-08-08 04:20:11.609 -0700  Administrator@X
$$ Compression mode = diff/dup
##.OBSERVE FREQUENCY= 400.02188249412
##.OBSERVE NUCLEUS= ^1H
##.ACQUISITION MODE= SIMULTANEOUS (DQD)
##.ACQUISITION SCHEME= undefined
##.AVERAGES= 8
##.DIGITISER RES= 22
##SPECTROMETER/DATA SYSTEM= spect
##.PULSE SEQUENCE= zg30
##.SOLVENT NAME= COFFEE_meoh
##.SHIFT REFERENCE= INTERNAL, COFFEE_meoh, 1, 14.98509
##AUDIT TRAIL= $$ (NUMBER, WHEN, WHO, WHERE, PROCESS, VERSION, WHAT)
$$ ##TITLE= Audit trail, TOPSPIN		Version 2.1
$$ ##JCAMPDX= 5.01
$$ ##ORIGIN= Bruker BioSpin GmbH
$$ ##OWNER= Administrator
$$ $$ E:\/data/COFFEE/nmr/AC1713_3097_8749698_3jzR5BpbZs/40/pdata/1/auditp.txt
$$ ##AUDIT TRAIL=  $$ (NUMBER, WHEN, WHO, WHERE, PROCESS, VERSION, WHAT)
(   1,<2015-08-08 04:20:04.313 -0700>,<Administrator>,<X>,<go>,<TOPSPIN 2.1>,
      <created by zg
	started at 2015-08-08 04:18:58.297 -0700,
	POWCHK enabled, PULCHK disabled,
       configuration hash MD5:
       21 0F 79 D6 B3 7B B4 F6 88 20 88 DB 03 48 BD 9F
       data hash MD5: 64K
       06 91 FC 00 AF EE 02 47 FB A0 37 24 8A FA B2 E4>)
(   2,<2015-08-08 04:20:07.438 -0700>,<Administrator>,<X>,<proc1d>,<TOPSPIN 2.1>,
      <Start of raw data processing
       efp LB = 0 FT_mod = 6 PKNL = 1 PHC0 = 0 PHC1 = 0 SI = 32K 
       data hash MD5: 32K
       8D AE 7F 20 BD 71 F7 53 63 B7 46 9C 9C 38 2F FC>)
(   3,<2015-08-08 04:20:07.750 -0700>,<Administrator>,<X>,<proc1d>,<TOPSPIN 2.1>,
      <pk PHC0 = 93.5376 PHC1 = 0 
       data hash MD5: 32K
       BC 29 F8 75 9E 3F FF BC 96 03 9D 85 D2 1D 9B FC>)
(   4,<2015-08-08 04:20:07.859 -0700>,<Administrator>,<X>,<proc1d>,<TOPSPIN 2.1>,
      <abs ABSG = 1 
       data hash MD5: 32K
       18 B7 CD BE 6F 0D D1 BA 5A 65 A9 53 90 4E 63 8D>)
(   5,<2015-08-08 04:20:07.922 -0700>,<Administrator>,<X>,<proc1d>,<TOPSPIN 2.1>,
      <abs ABSG = 2 
       data hash MD5: 32K
       C1 7B B6 0B 1F 3B 58 89 BF 4F 44 D4 69 62 DF ED>)
(   6,<2015-08-08 04:20:07.984 -0700>,<Administrator>,<X>,<proc1d>,<TOPSPIN 2.1>,
      <abs ABSG = 3 
       data hash MD5: 32K
       FA 2D 72 49 5E AA F9 F8 6B 8E B9 4B A7 31 99 B7>)
(   7,<2015-08-08 04:20:08.047 -0700>,<Administrator>,<X>,<proc1d>,<TOPSPIN 2.1>,
      <abs ABSG = 4 
       data hash MD5: 32K
       66 D5 9F 67 0A AE 98 5C 4D 3F 0D 88 C0 C5 A4 22>)
(   8,<2015-08-08 04:20:08.109 -0700>,<Administrator>,<X>,<proc1d>,<TOPSPIN 2.1>,
      <abs ABSG = 5 
       data hash MD5: 32K
       94 9C 54 B6 3D F8 B8 C8 B0 BE 13 DF 6C 33 89 C7>)
$$ ##END=
$$ 
$$ $$ hash MD5
$$ $$ DB AD 4D 34 8D CD 11 86 83 1F 6A 07 14 14 C8 D2
##$RELAX= 
##$RELAX= 
##$RELAX= 
##$RELAX= 
##$RELAX= 
##$RELAX= 
##$RELAX= 
$$ Bruker specific parameters
$$ --------------------------
##$DU= <E:\>
##$EXPNO= 40
##$NAME= <AC1713_3097_8749698_3jzR5BpbZs>
##$PROCNO= 1
$$ [...]
150 150 150 150 150 150 150 150
##$TP07= 0
##$TPNAME0= <>
##$TPNAME1= <>
##$TPNAME2= <>
##$TPNAME3= <>
##$TPNAME4= <>
##$TPNAME5= <>
##$TPNAME6= <>
##$TPNAME7= <>
##$TPOAL= (0..7)
0.5 0.5 0.5 0.5 0.5 0.5 0.5 0.5
##$TPOFFS= (0..7)
0 0 0 0 0 0 0 0
##$TUNHIN= 0
##$TUNHOUT= 0
##$TUNXOUT= 0
##$USERA1= <user>
##$USERA2= <user>
##$USERA3= <user>
##$USERA4= <user>
##$USERA5= <user>
##$V9= 5
##$VALIST= <valist>
##$VCLIST= <CCCCCCCCCCCCCCC>
##$VD= 0
##$VDLIST= <DDDDDDDDDDDDDDD>
##$VPLIST= <PPPPPPPPPPPPPPP>
##$VTLIST= <TTTTTTTTTTTTTTT>
##$WBST= 2048
##$WBSW= 25
##$XGAIN= (0..3)
0 0 0 0
##$XL= 0
##$YL= 0
##$YMAX_a= 605414
##$YMIN_a= -510977
##$ZGOPTNS= <>
##$ZL1= 120
##$ZL2= 120
##$ZL3= 120
##$ZL4= 120
##$ABSF1= 14.98509
##$ABSF2= -5.573092
##$ABSG= 5
##$ABSL= 3
##$ALPHA= 0
##$AQORDER= 0
##$ASSFAC= 0
##$ASSFACI= 0
##$ASSFACX= 0
##$ASSWID= 0
##$AUNMP= <proc_prof1d_extract_pilot.lims>
##$AXLEFT= 0
##$AXNAME= <>
##$AXNUC= <1H>
##$AXRIGHT= 0
##$AXTYPE= 0
##$AXUNIT= <>
##$AZFE= 0.1
##$AZFW= 0.1
##$BCFW= 0
##$BC_mod= 0
##$BYTORDP= 0
##$COROFFS= 0
##$CY= 15
##$DATMOD= 1
##$DC= 0
##$DFILT= <>
##$DTYPP= 0
##$F1P= 0
##$F2P= 0
##$FCOR= 0.5
##$FTSIZE= 32768
##$FT_mod= 6
##$GAMMA= 0
##$GB= 0
##$INTBC= 1
##$INTSCL= 1
##$ISEN= 128
##$LB= 0
##$LEV0= 0
##$LPBIN= 0
##$MAXI= 10000
##$MC2= 0
##$MEAN= 0
##$ME_mod= 0
##$MI= 0
##$NCOEF= 0
##$NC_proc= -8
##$NLEV= 6
##$NOISF1= 0
##$NOISF2= 0
##$NSP= 0
##$NTH_PI= 0
##$NZP= 0
##$OFFSET= 14.98509
##$PC= 1
##$PHC0= 93.5376
##$PHC1= 0
##$PH_mod= 1
##$PKNL= yes
##$PPARMOD= 0
##$PPDIAG= 0
##$PPIPTYP= 0
##$PPMPNUM= 2147483647
##$PPRESOL= 1
##$PSCAL= 4
##$PSIGN= 0
##$PYNMP= <proc.py>
##$REVERSE= no
##$SF= 400.02
##$SI= 32768
##$SIGF1= 0
##$SIGF2= 0
##$SINO= 400
##$SIOLD= 32768
##$SPECTYP= <>
##$SREGLST= <1H.CDCl3>
##$SSB= 0
##$STSI= 32768
##$STSR= 0
##$SW_p= 8223.68421052631
##$SYMM= 0
##$S_DEV= 0
##$TDeff= 65536
##$TDoff= 0
##$TI= <>
##$TILT= no
##$TM1= 0
##$TM2= 0
##$TOPLEV= 0
##$USERP1= <user>
##$USERP2= <user>
##$USERP3= <user>
##$USERP4= <user>
##$USERP5= <user>
##$WDW= 1
##$XDIM= 32768
##$YMAX_p= 442657431
##$YMIN_p= -670925
##$CURPLOT= <Network HP LaserJet P1505>
##$CURPRIN= <$Network HP LaserJet P1505>
##$DFORMAT= <normdp>
##$LAYOUT= <+/1D_H.xwp>
##$LFORMAT= <normlp>
##$PFORMAT= <normpl>
##$SURQMSG= 1
$$ End of Bruker specific parameters
$$ ---------------------------------
##NTUPLES= NMR SPECTRUM
##VAR_NAME=  FREQUENCY,     SPECTRUM/REAL,   SPECTRUM/IMAG
##SYMBOL=    X,             R,               I
##VAR_TYPE=  INDEPENDENT,   DEPENDENT,       DEPENDENT
##VAR_FORM=  AFFN,          ASDF,            ASDF
##VAR_DIM=   32768,         32768,           32768
##UNITS=     HZ,            ARBITRARY UNITS, ARBITRARY UNITS
##FACTOR=    0.250966925370066, 1,           1
##FIRST=     8223.43324360094, 81245,        -129865
##LAST=      0,             -111073,         -275964
##MIN=       0,             -670925,         0
##MAX=       8223.43324360094, 442657431,    0
$$ Real data points
##PAGE= N=1
##DATA TABLE= (X++(R..R)), XYDATA
$$ [...]
$$ plain form
19553 -236286 141038 -149373 -21569 5412 15695 188324 118789 250973 125884 30542 61237
19542 61237 8059 181436 125147 -101605 -279125 60950 59990 132496 94398 -10060 38620 -55450
19529 15525 -271888 -285748 -93418 92355 -90992 144725 -198421 -135721 -138962 -149025 -34805
19517 17726 -14309 -322420 -24301 72842 -148510 -43307 -12770 -159560 -143228 -219331 -102065
19505 52593 15215 -119429 -71785 -52497 -211745 -92917 -65385 -172622 -227632 -11189 81198
19493 -64907 -62989 -145369 94309 55936 -212194 -64957 -49940 -113949 -113801 -179665 -285393 -133811
19480 -222487 -289436 -279173 -5142 -352146 57756 -172204 12176 -140698 37947 187324 -35561
19468 -195863 -209208 73505 -59504 -163793 -105632 -152064 -19658 226533 72901 -173353 -127744
$$ packed form
19553b36286A41038a49373b1569E412J0283J72629o9535J32184j25089C0542L0695
19542F1237H059J73377n6289a01605j77520F0950r60P2506l8098a0060C8620e5450
19529A5525b71888j3860i3418I2355i0992A44725a98421O2700l241j0063c4805
19517A7726a4309l08111b4301G2842a48510d3307a2770j46790J6332p6103a02065
19505E2593A5215a19429M7644J9288j59248i2917K7532j07237n5010a1189H1198
19493f4907J918q2380I4309l8373b12194f4957J5017o4009J48o5864j05728a33811
19480b22487o6949J0263e142l47004E7756a72204A2176a40698C7947J49377c5561
19468a95863j3345G3505e9504j04289N8161m6432a9658B26533G2901a73353M5609
$$ plain form
19457 -127744 -28180 -243289 -201413 141234 -138088 104944 69845 -70254 -322935 18934
19446 -246197 56917 -25423 -25977 141109 -123846 -368374 -317735 -242777 -35400 -155191 114189
19434 -320380 -312547 72936 69667 -131195 -32049 43844 -1373 -202599 -181218 -203314 -339126
19423 -339126 46695 -250084 289568 -88157 -392520 -209703 9563 132688 -160061 -64930
19412 -143599 35403 -179418 52702 93009 -163548 -15044 47825 40471 -150577 -11042 214560
19400 -52228 -342072 -147448 -27452 -212814 55561 122611 -220641 31071 -42906 -97269 -276497
19389 -276497 -549011 -32499 -49916 -43639 -146592 -112999 -112689 108167 -171290 -10740 82981
19377 -377528 -250068 -82222 -130440 -133937 158096 34673 -157218 -33791 119939 -76867 -62198
$$ packed form
19457a27744b8180k15109M1876A41234a38088A04944l5099g0254k52681A8934
19446b46197E6917b5423n54A41109a23846k44528N0639P4958c5400j19791A14189
19434c20380P833G2936l269a31195c2049D3844a373k01226K1381k2096j35812
19423c39126D6695b50084B89568h8157l04363J82817I563J23125a60061f4930
19412a43599C5403a79418E2702M0307a63548a5044D7825p354a50577a1042B14560
19400e2228k89844a47448b7452j85362E5561O7050b20641C1071d2906n4363j79228
19389b76497k72514c2499j7417O277j02953L3593L10A08167a71290a0740H2981
19377c77528J27460h2222m8218l497A58096C4673a57218c3791A19939g6867J4669
$$ plain form
19366 -62198 -252007 178086 264715 15071 153029 90765 3052 19063 240416 -130038 -36236
19354 -288271 -30275 163406 -292058 164402 112215 236085 -238679 -100700 120968 -100373
19343 -266953 -173534 26485 -164981 78994 118555 -491015 -162811 -82492 69019 -97698 -64505
19332 -64505 72825 381998 33405 2072 -187916 -42276 42188 264615 -101278 -129901 -170043
19321 -170043 86433 359147 29393 -53740 235724 -31191 -80296 201779 -103687 -39210 -123769
19310 -123769 -143160 -118737 -124037 326631 -56173 101913 53344 -374104 68076 59514 458525
19299 458525 -160579 202125 152183 -260997 -119340 -201805 -40880 19397 -39679 -222543
19289 -222543 363019 -229537 -67186 97906 -195897 169310 -154809 -10815 -193221 -80563
$$ packed form
19366f2198j89809A78086Q6629A5071J37958o2264C052J6011K21353a30038c6236
19354b88271c0275A63406b92058A64402n2187J23870b38679a00700A20968a00373
19343b66953R3419B6485a64981G8994L9561d91015a62811Q0319F9019i7698L3193
19332f4505G2825L09173C3405B072a87916d2276D2188K22427a01278k8623m0142
19321a70043H6433K72714B9393e3740B35724c1191m9105B01779a03687c9210q4559
19310a23769j9391K4423n300C26631e6173A01913m8569c74104F8076q562L99011
19299D58525a60579B02125m9942b60997a19340q2465d0880A9397c9679j82864
19289b22543C63019b29537f7186I7906a95897A69310a54809a0815j82406h0563
$$ plain form
19278 -162301 -170412 230028 -84635 -223105 13173 -117917 -79370 -216891 -4204 168265 -15230
19266 -107738 302501 -27789 -250881 40260 11297 -76372 -364728 -45727 53998 -352949 38174
19254 -75371 -286906 78751 -68293 -63890 76114 -72786 86196 51019 63675 232574 173567
19243 173567 -100215 -273010 -21838 -151058 -311819 -56310 71998 -79477 16617 123729
19233 123729 -194414 -209076 -287 -347340 103342 175573 173928 -7841 91605 -225482 -47683
19221 164671 129094 -105421 -92866 32129 -209748 61901 153860 32671 36820 61907 98994
19210 98994 28624 178833 -541038 -337992 -344804 122117 -379546 30571 -17744 -98518 -61102
19199 -61102 -334335 158321 -252182 -111855 89658 -48114 -86054 -243129 -87285 -32955 -144102
$$ packed form
19278a62301q111B30028h4635j38470A3173a17917L8547j37521d204A68265a5230
19266a07738C02501b7789k23092D0260A1297g6372k88356d5727E3998c52949C8174
19254g5371k11535G8751f8293M403G6114g2786H6196l5177J2656J68899n9007
19243A73567a00215j72795b1838j29220j60761e6310G1998g9477A6617J07112
19233A23729a94414j4662b87l47053A03342P2231j645g841I1605b25482d7683
19221A64671l5577a05421J2555C2129b09748F1901R1959C2671M149K5087L7087
19210I8994B8624J50209e41038K03046o812A22117c79546C0571a7744q0774L7416
19199f1102k73233A58321b52182a11855H9658d8114l7940j57075h7285c2955j11147
$$ plain form
19188 -144102 -67105 -58885 127402 -148067 -156512 -5895 3708 9714 -194479 74314 -250508 69214
19175 106647 -16921 481205 -126349 -145477 -173253 45099 -43681 -96926 11300 40568 -140929
19163 24160 -170259 -58502 -358761 -222841 -352508 178963 87860 175788 179474 -79562 195648
19151 146193 -7815 48142 99829 -247981 106 58381 -129727 -174788 54504 -47971 -49568 -52156
19139 -52156 -200635 -187308 -119561 -188690 -30065 110227 -253672 130608 -130373 -187954 -141560
19128 -141560 -245606 -86856 -114976 247379 -207790 -306235 -21224 125704 -137312 -183943
19118 -183943 -211768 106194 -219207 -426710 20490 180101 -140785 215768 -165648 288977
19107 -6106 -98847 86761 52451 393531 -170202 201366 -274541 132823 -134996 -59022 -60016
$$ packed form
19188a44102f7105Q220A27402a48067q445e895C708O006a94479G4314b50508F9214
19175A06647a6921D81205a26349j9128k7776D5099d3681n3245A1300K9268a40929
19163B4160a70259e8502l00259J35920j29667A78963H7860Q7928L686g9562A95648
19151A46193g815D8142N1687b47981A06N8275a29727m5061E4504d7971j597k588
19139e2156j48479J3327O7747o9129c0065A10227b53672A30608a30373n7581M6394
19128a41560j04046h6856k8120B47379b07790r8445b1224A25704a37312m6631
19118a83943k7825A06194b19207k07503B0490J59611a40785B15768a65648B88977
19107f106r2741H6761l4310L41080a70202B01366b74541A32823a34996e9022r94
$$ plain form
19096 -60016 -201255 -315528 362115 193513 -244032 -149193 -19185 367872 -90731 101031
19085 105221 7892 -153633 -59192 -196117 -215350 -325943 -112954 28549 -259000 -44661 142609
19073 -121137 33744 -51822 -125615 7021 38197 -193066 -237128 -62157 177575 -45585 121390
19061 -275280 -116192 16872 84700 -97565 -190990 25543 -397040 132670 150813 29224 113710
19050 113710 -19808 -98571 -304087 -12991 -201772 -52755 -128593 286109 -224411 95483 52796
19039 52796 -91826 -170106 113506 163107 -243034 191414 -205914 174372 -3234 122363 -272302
19027 192854 72476 323139 95874 28855 -314209 191305 -363380 117538 270908 -257084
19016 253649 -281877 -237188 -100758 202703 99331 -21977 295341 -45497 -111897 -377301
$$ packed form
19096f0016j41239j14273C62115j68602b44032R4839a9185C67872i0731A01031
19085A05221G892a53633e9192j36925j9233j10593a12954B8549b59000d4661A42609
19073a21137C3744e1822p3793G021L1176a93066m4062f2157A77575d5585A21390
19061b75280a16192A6872O7828i7565r3425B5543c97040A32670J8143B9224Q4486
19050A13710a9808p8763k05516a2991j88781e2755p5838B86109b24411I5483m2687
19039E2796i1826p8280A13506M9601b43034A91414b05914A74372c234A22363b72302
19027A92854G2476K50663I5874B8855c14209A91305c63380A17538J53370b57084
19016B53649b81877M4689a00758B02703I9331b1977B95341d5497o6400k65404
$$ plain form
19006 -377301 163967 51333 -13424 -219319 244012 -251705 -246336 -353054 -196584 190135
18995 373619 -8769 48256 206529 55198 -75126 -114582 -177363 -21873 161280 -59930 174962
18983 -449168 -4632 -268835 -278632 122819 -193098 -128710 -71722 64785 -172186 -66199 -45260
18972 -45260 -83911 -25092 -136972 114336 -158582 -256975 -484402 131587 -118367 -306793
18962 -306793 231346 92039 37089 106365 -58636 1686 -64775 111725 -2274 133886 -168504
18950 96958 -77612 -181117 -23222 -142693 -71246 -161414 44005 -202351 326949 302460 158251
18939 158251 -95191 63336 -261432 -61508 -126251 301430 -8042 24468 -140999 -157247 -116963
18928 -116963 346274 -76642 -191208 -55186 81523 1996 -205728 67288 -239263 -85959 -220784
$$ packed form
19006c77301A63967E1333a3424k05895B44012b51705N369j06718J56470A90135
18995C73619h769D8256J58273E5198g5126l9456o2781b1873A61280e9930A74962
18983d49168d632k64203r797A22819a93098O4388N6988F4785a72186f6199K0939
18972d5260l8651b5092j11880A14336a58582r8393k27427A31587a18367j88426
18962c06793B31346I2039C7089O9276e8636A686f4775A11725b274A33886a68504
18950I6958g7612j03505b3222j19471g1246r0168D4005b02351C26949k4489j44209
18939A58251i5191F3336b61432f1508o4743C01430h042B4468a40999j6248M0284
18928a16963C46274g6642j14566e5186H1523A996b05728F7288b39263h5959j34825
$$ plain form
18917 -220784 -49117 -77443 -27286 -179539 106815 -202991 -96068 -205191 268318 -8213 126718
18905 55452 243042 -184514 130450 14894 -292842 59062 -246006 -140422 -69286 -147343
18895 -147343 -108502 46883 103940 -66954 -259077 -204161 -128088 40342 -38385 95384 -8927
18883 7360 -48753 -139996 -229586 107127 -251302 -53835 130556 -58389 -255464 -210909 70372
18871 -23661 -92250 -172039 -285523 -103121 -247591 21212 -35806 -219884 -284177 -149798 50165
18859 44069 -428161 -189744 57821 59710 180429 -48928 -91264 -128869 -119770 -163648 -2358 123568
18846 76577 423 55499 63124 -124035 2531 355943 120883 -94433 82606 36557 8659 -42616
18833 -70347 307504 -447691 5578 -82485 -247666 178031 210231 137471 -22623 -74211 -260112
$$ packed form
18917b20784d9117k8326b7286j52253A06815b02991i6068j09123B68318h213A26718
18905E5452J87590a84514A30450A4894b92842E9062b46006J05584f9286p8057
18895a47343L8841D6883N7057f6954j92123N4916P6073D0342c8385I5384h927
18883G360d8753r1243q9590A07127b51302e3835A30556e8389j97075M4555G0372
18871b3661o8589p9789j13484a03121j44470B1212c5806j84078o4293J34379E0165
18859D4069d28161a89744E7821J889J20719d8928m2336l7605R099m3878b358A23568
18846G6577D23N5076P625a24035B531L53412A20883i4433H2606C6557H659d2616
18833g0347C07504d47691E578h2485j65181A78031L2200p2760b2623n1588j85901
$$ plain form
18822 -260112 49201 -134978 173830 -14013 180563 119588 241375 -393920 -9826 162399
18811 243457 12590 118749 97060 66084 -374921 -68636 -221978 -334227 16485 3370 57108
18800 57108 103332 129347 -91751 85241 -406784 -130020 -86606 -129660 -192652 -30142 -13950
18788 -236710 -271833 -277476 454422 -443530 62066 87487 -75387 142281 123852 -333928 -209167
18777 -209167 97666 -58525 -12281 37557 -228809 279208 -227831 -282416 118090 -13605 -120366
18766 -120366 -203552 -130551 156099 4776 -325081 70447 -197713 19441 -222031 -231171 -18361
18754 -168410 -246353 -301987 -48960 161255 -11371 -93217 10834 -119586 -190920 198480 -314374
18742 84519 -69074 -125863 9163 143688 -42665 -250461 108435 -180099 -188726 151332 129646
$$ packed form
18822b60112D9201a34978A73830a4013A80563o0975J21787c93920i826A62399
18811B43457A2590J06159k1689l0976c74921f8636j53342j12249A6485C370N3738
18800E7108M6224K6015i1751H5241d06784a30020M3414m3054o2992c0142a3950
18788b36710l5123n643D54422d43530F2066K5421g5387A42281j8429c33928J24761
18777b09167I7666e8525a2281C7557b28809B79208b27831n4585A18090a3605j06761
18766a20366q3186P3001A56099D776c25081G0447a97713A9441b22031r140a8361
18754a68410p7943n5634d8960A61255a1371q1846A0834a19586p1334A98480c14374
18742H4519f9074n6789I163J34525d2665k07796A08435a80099q627A51332k1686
$$ plain form
18731 129646 -40314 124569 308349 -69020 -177448 -147194 -131442 4913 119478 40004 -146561
18719 59738 -86460 123704 -162029 -146958 4414 -1651 -91342 91520 50607 -312060 84615
18707 140860 -174272 186905 -21150 -9390 19818 -24558 2798 61921 35303 -7344 -218274
18696 -218274 64413 -105896 -144434 -124713 51252 -340074 -140118 61884 -58566 131841 -69403
18684 -50349 337444 -158091 -11504 270025 -210091 -124337 -184109 151050 -164009 -19932
18673 -288859 35351 -121592 -224039 73461 20766 -215555 -27611 -148614 -122652 34200 -141505
18661 42950 55790 -255113 -231570 -141746 183682 101977 -133329 -261576 -56239 33440 163121
18650 163121 68884 60711 190555 379491 -125846 -295919 -19234 51197 -34685 -65273 112014
$$ packed form
18731A29646d0314A24569J83780f9020j08428L0254J5752D913J14565D0004a46561
18719E9738h6460A23704a62029J5071D414a651q9691I1520m0913c12060H4615
18707A40860a74272A86905b1150i390A9818b4558B798N9123k6618g344k10930
18696b18274F4413a05896l8538J9721E1252c40074a40118F1884e8566A31841f9403
18684e0349C37444a58091a1504B70025b10091Q5754n9772A51050a64009a9932
18673b88859C5351a21592j02447G3461B0766b15555b7611j21003K5962C4200a41505
18661D2950J2840b55113K3543Q9824A83682q1705a33329j28247e6239C3440J29681
18650A63121F8884q173J29844J88936a25846j70073a9234E1197c4685l0588A12014
$$ plain form
18638 -161349 -170042 -141936 -345412 -129108 129875 -136794 -300895 94965 -170170 -27438
18627 -54969 200743 -30905 -423703 -126263 -39960 53714 -466133 -237490 -384197 408435
18616 -18591 -59004 -442815 -378152 109488 -139107 -63271 -397080 -49397 -336362 -142548
18605 -54976 -162145 -260340 -153610 184905 -81085 -67736 6730 180964 19180 50481 112530
18594 112530 222677 115875 -79908 -118638 -56479 8841 378295 -2784 -550387 -134382 -199324
18583 -199324 -78349 10747 34276 -251537 121638 -285684 -290787 -217999 -192496 111162 -177909
18571 -19205 62031 -75413 -12154 -172893 -4531 -27541 -379323 -33259 37640 -322371 -253073
18560 -253073 -220751 -242099 -111462 62676 -7656 -102709 -184840 -85268 -316013 225137 -251929
$$ packed form
18638a61349q693K8106k03476a29108A29875a36794j64101I4965a70170b7438
18627e4969B00743c0905l92798a26263c9960E3714d66133K28643j46707D08435
18616a8591m0413l83811O4663A09488a39107f3271l33809d9397k86965a42548
18605e4976j07169r8195J06730A84905h1085J3349F730J74234A9180L1301O2049
18594A12530J10147j06802g9908l8730e6479H841L69454b784n47603a34382o4942
18583a99324g8349A0747K3529b51537A21638b85684n103P2788K5503A11162a77909
18571a9205F2031g5413a2154j60739d531k3010l51782c3259C7640c22371O9298
18560b53073L2322k1348a11462F2676g656r5053q2131h5268k30745B25137b51929
$$ plain form
18548 45030 -169960 167777 -22165 -140410 63508 -270886 -137091 60128 93058 -196597
18537 -188103 10653 -235503 -277194 34031 -167874 178555 33626 -164879 206314 5258 -255821
18525 9832 31741 -110627 118139 -137203 -74766 -68884 -261398 54302 186680 -215857 110951
18513 -303785 297997 -131837 74536 -4163 -122574 -11684 233876 -176593 -46331 -87639 11859
18501 34112 95590 -461524 -309065 -22870 -58891 16114 -199974 -198090 246023 -37762 132519
18489 -155163 -113438 -168226 -141049 -134794 -13447 -66422 -284090 -169836 -149609 -109921 -262792
18478 -262792 31413 -223264 -84482 99107 -352948 -220323 -63567 -22687 -72746 156097 12869
18466 -278098 -48702 153165 -264675 -26256 -18342 -122360 -35349 -136725 185542 41197 113859
$$ packed form
18548D5030a69960A67777b2165j18245F3508b70886J33795F0128L2930a96597
18537a88103A0653b35503m1691C4031a67874A78555C3626a64879B06314E258b55821
18525I832K1909a10627A18139a37203O2437N882j92514E4302J32378b15857A10951
18513c03785B97997a31837G4536d163j18411a1684B33876a76593d6331m1308A1859
18501C4112O1478d61524J52459b2870l6021A6114a99974J884B46023c7762A32519
18489a55163M1725n4788K7177O255a3447n2975k17668J14254K0227L9688j52871
18478b62792C1413b23264h4482I9107c52948J32625f3567b2687n0059A56097A2869
18466b78098d8702A53165b64675b6256P914j04018c5349j01376A85542D1197P2662
$$ plain form
18455 113859 50433 -152311 -13158 -44977 -199443 -101058 61033 -94033 -210372 102269 -79787
18443 -307877 -371626 -295568 125733 -70048 -184029 -148443 154977 16723 48228 -16328 -68391
18432 -68391 -150864 -6538 108751 -18929 94136 -66414 -291489 27593 -203971 -18658 -220988
18421 -220988 -24080 -102372 -21154 37315 -133795 -392023 -149810 -100679 130304 -283027
18410 -216116 -86123 -94514 -37677 -37998 -210848 129747 34367 -101808 188859 -26188 65719
18398 -9570 -129579 -30717 61730 -103457 -131277 -33138 -25770 34625 -33155 -13825 87122 189234
18386 189234 191149 247348 -126325 -264331 -365159 -461709 -174113 -130326 62273 -297353 -342115
18375 -342115 162764 -246338 78354 -27442 70153 -24428 191068 -77959 87096 107914 173473
$$ packed form
18455A13859E0433a52311a3158l1819j54466R8385F1033i4033j16339A02269g9787
18443c07877o3749P6058A25733g0048j13981L5586A54977A6723L1505a6328n2063
18432f8391q2473f538A08751a8929I4136f6414k25075B7593b03971a8658k02330
18421b20988b4080p8292b1154C7315a33795k58228a49810M9131A30304b83027
18410b16116h6123q391c7677l21j72850A29747C4367a01808A88859b6188F5719
18398i570j20009c0717F1730a03457k7820c3138P368C4625c3155a3825H7122J02112
18386A89234J915N6199a26325j38006j00828r6550a74113M3787F2273b97353m4762
18375c42115A62764b46338G8354b7442G0153b4428A91068g7959H7096K0818O5559
$$ plain form
18364 173473 -30338 -112688 91909 -77463 -318767 128835 -85199 25228 73922 -27309 -137012
18353 -137012 -56364 198432 168320 25538 -248695 -105958 139214 22655 -157932 104651
18342 78281 141692 -250194 -261985 -257134 -348260 145923 -71049 -81383 -330187 63171 119875
18331 119875 -164777 340294 276200 -233739 -19900 -163565 247352 220273 -146560 -75014
18321 -75014 95540 -77921 181458 173494 -89238 -82808 -82952 296444 82357 147718 -137277 195590
18308 50169 -111564 211425 368215 96190 -26235 -66891 -41085 89221 -50093 -144559 -322021
18297 -322021 -203282 -80075 42407 -50299 -160235 -308499 -65493 333715 -58106 -29937 23917
18285 227616 -39628 73960 -198384 241231 -204250 60926 -148995 -170299 42193 -174342
$$ packed form
18364A73473c0338q2350I1909g7463k41304A28835h5199B5228M8694b7309j09703
18353a37012e6364A98432l0112B5538b48695a05958A39214B2655a57932A04651
18342G8281O3411b50194j1791M851r1126A45923g1049j0334k48804F3171N6704
18331A19875a64777C40294o4094b33739a9900j43665B47352k7079a46560P1546
18321g5014I5540g7921A81458p964h9238O430j44B96444H2357O5361a37277A95590
18308E0169a11564B11425J56790I6190b6235m0656K5806H9221e0093r4466j77462
18297c22021J18739h0075D2407e0299j09936j48264f5493C33715e8106K8169B3917
18285B27616c9628G3960a98384B41231b04250F0926a48995k1304D2193a74342
$$ plain form
18274 -84034 228967 81770 -224774 87527 -82207 89474 -36193 8056 -172063 -97707 -8126
18262 -168672 -172357 -305535 220221 -123179 -168822 200257 -376151 19008 -109347 330047
18251 18332 186765 71331 -28389 200424 164048 102426 233292 -337390 115903 -104208
18240 -50013 -24207 -214214 85002 -234301 -298609 -9771 -160880 -44190 -116372 39878 4741
18228 -129354 123323 -980 -135847 116254 17562 -212291 134702 -189145 -207184 892 -91133
18216 166337 -165841 4611 69359 -69818 -65597 -247754 -368919 -140385 -341664 -129307 -290811
18205 -290811 215189 -28600 18095 39207 110794 -111383 -167425 81177 291961 91630 15342
18193 -64248 -44812 214201 -261634 -218072 96786 -56747 -276970 160819 -181064 45286 -91800
$$ packed form
18274h4034B28967H1770b24774H7527h2207H9474c6193H056a72063P4356h126
18262a68672l685j33178B20221a23179m5643B00257c76151A9008a09347C30047
18251A8332J68433G1331b8389B00424l6376o1622J30866c37390A15903a04208
18240e0013b4207j90007H5002b34301o4308i771j51109d4190p2182C9878D741
18228a29354A23323i80j34867A16254A7562b12291A34702a89145j8039H92i1133
18216A66337a65841D611O4748f9818M221j82157j21165a40385k01279a29307j61504
18205b90811B15189b8600A8095K1112P1587a11383n6042H1177K10784I1630A5342
18193f4248J9436B14201b61634M3562I6786e6747k20223A60819a81064D5286i1800
$$ plain form
18181 -5151 45777 -205161 49613 -145614 -84581 -440683 39524 26524 96338 224501 38278
18169 341161 -50095 -17802 269009 122660 -69662 -7756 103862 19675 188207 88642 58080
18158 58080 -138095 54661 -130537 -61608 -91784 4652 51791 168956 112142 -64997 135994
18146 172170 -518183 34655 -100461 -208691 -252436 -122027 104352 116729 -537940 -99234
18135 6762 165573 282299 20840 91082 91593 78050 242232 103761 8551 -35278 -165531
18124 -165531 162514 -146770 -67684 191271 110519 128060 -264256 -45711 264079 96903
18113 -266436 -190232 -207228 -257733 115151 138223 74920 42257 144141 87687 285192 -374127
18101 47443 54316 -1942 -154403 -126917 -49496 124708 -181678 -263550 -106820 -529277 82809
$$ packed form
18181e151D5777b05161D9613a45614O1033l56102C9524j3000O9814J28163C8278
18169C41161e0095a7802B69009A22660f9662g756A03862A9675J68532H8642l0562
18158E8080a38095E4661a30537f1608l0176D652M7139J17165n6814f4997A35994
18146A72170e18183C4655a00461j08230m3745a22027A04352J2377e37940i9234
18135F762J58811J16726B0840P0242N11j3543J64182A03761H551c5278j30253
18124a65531A62514a46770f7684A91271q0752J7541b64256d5711B64079I6903
18113b66436P6204j6996n0505A15151K3072o3303l2663J01884n6454J97505c74127
18101D7443O873a942j52461K7486d9496A24708a81678q1872a06820m22457H2809
$$ plain form
18089 395178 -62161 80949 -141527 -173622 -140843 -94364 -200801 -23278 -168346 -118063 -238166
18078 -238166 -114232 -11452 337130 1433 -82876 -188622 -29350 -213527 208463 102111
18067 -137086 -325730 143618 -184056 -160702 1172 246259 -175021 -23296 -160054 24058
18056 -227676 12199 11948 -18469 212230 76610 87816 96288 106861 222798 307211 157351
18045 157351 -274208 -131335 -47552 262149 58223 349592 -86345 206670 120497 -12697
18034 -230980 184505 42937 -167389 42042 -300600 -27245 222401 -153297 -61558 138698
18023 5759 84022 -328876 42944 23717 285611 -231300 146454 50543 296272 -286745 75271
18011 251400 -151467 131637 -178218 -289685 -278864 253374 -85890 -146615 183437 -15826
$$ packed form
18089C95178f2161H0949a41527l2095L2779M6479j06437b3278j45068N0283j20103
18078b38166a14232a1452C37130A433h2876j05746b9350j84177B08463A02111
18067a37086j88644A43618a84056K3354A172K45087a75021b3296j36758B4058
18056b27676A2199k51a8469B12230G6610J1206Q472J0573J15937Q4413j49860
18045A57351b74208a31335d7552B62149E8223K91369h6345B06670q6173a2697
18034b30980A84505D2937a67389D2042c00600b7245B22401a53297f1558A38698
18023E759P8263c28876D2944j9227K61894b31300A46454E0543K45729b86745G5271
18011B51400a51467A31637a78218j11467J0821B53374h5890o0725A83437a5826
$$ plain form
18000 -129795 166285 -237807 -100741 -122445 -307457 -194795 177668 51282 63625 -236001
17989 -20311 331995 19296 179642 329930 243339 105822 188576 -180982 -167759 -172937 33587
17977 129091 79973 1487 -292733 -177324 23118 -374277 -63082 355709 182824 104521 75955
17966 75955 -61714 -133001 -166324 132874 -239180 111645 75978 71807 -290420 145692 265059
17955 265059 -59722 -136137 -193080 -303420 -19930 63253 -18011 72015 -34016 46983 -8075
17943 369453 33166 -95665 111717 30688 -195521 -272494 187631 118305 64269 -156024 -68352
17931 47502 186801 -334494 211904 -208077 -151549 -110666 143034 -31787 -14180 66471 21696
17919 70696 224940 -23679 57375 95102 155068 337649 176827 -281566 -51657 176611 119174
$$ packed form
18000a29795A66285b37807a00741k1704j85012J12662A77668E1282J2343b36001
17989b0311C31995A9296J60346J50288q6591A05822Q2754a80982J3223n178C3587
17977A29091m9118A487b92733J15409B3118c74277f3082C55709j72885p8303k8566
17966G5955f1714p1287l3323A32874b39180A11645l5667m171b90420A45692J19367
17955B65059e9722p6415n6943j10340a9930F3253a8011G2015c4016D6983h075
17943C69453C3166i5665A11717C0688a95521p6973A87631o9326n4036a56024f8352
17931D7502J39299c34494B11904b08077N6528M0883A43034c1787a4180F6471B1696
17919G0696J54244b3679E7375L7727N9966J82581j60822b81566e1657A76611n7437
$$ plain form
17908 119174 -117035 -127356 375346 -100205 -15035 187153 5418 -192733 -79529 191310
17897 -115098 -64704 -242319 -243525 388869 148249 76764 210580 -228560 -72022 -49874 -266989
17886 -266989 54256 -120196 241525 -243528 19676 -181012 -1064 17178 -341158 -336737 86734
17874 -246188 -158191 128894 -302557 160797 -16946 -168281 -48550 25628 231055 -89319
17863 -408 -84124 57156 -237851 73979 76929 54771 308621 19180 -174295 16984 -158227
17851 101571 -124475 191095 -112301 45647 -59768 -200628 -36289 -94778 55609 130086 22780
17839 -92875 157826 -179769 234356 166600 -145215 -15174 68594 300578 -93706 -100920 -174947
17828 -174947 1159 8288 201689 -229070 261089 120252 -245211 29628 -78169 -18899 144173
$$ packed form
17908A19174a17035j0321C75346a00205a5035A87153E418a92733g9529A91310
17897a15098N0394j77615j206C88869A48249p1485J33816b28560g2022K2148k17115
17886b66989E4256a20196B41525b43528A9676a81012a064A7178c41158M421H6734
17874b46188Q7997A28894c02557A60797a6946j51335d8550B5628K05427h9319
17863d08q3716E7156b37851G3979K950k2158K53850A9180a74295A6984a58227
17851A01571a24475A91095a12301D5647e9768j40860c6289n8489E5609P4477B2780
17839i2875A57826a79769B34356o7756a45215a5174F8594K31984i3706p214p4027
17828a74947A159P129J93401b29070B61089A20252b45211B9628g8169a8899A44173
$$ plain form
17816 38382 -140165 -230001 86704 -26341 -53183 168837 79063 239349 -224263 22174 31093
17805 31093 256266 -104144 31016 206519 397 193442 -236453 182396 24938 283586 228931
17794 228931 214687 279440 -269136 28644 197070 9510 -162733 142056 205147 -4184 -168265
17783 -168265 69782 527264 69923 -222500 -29037 -93694 -259054 -115565 211841 -40782
17772 -86446 -238500 -73579 -57488 -137185 104763 40411 258610 -254744 -77555 82297 -108431
17760 124482 -119107 9969 195554 131194 -321791 -106978 -8752 -120311 -219838 -38925 -257010
17749 -257010 182959 22613 284888 -44999 231843 -121556 231060 45888 292196 -145505
17738 -353768 -201652 -112777 238709 26336 87551 190160 281558 141712 174943 -17681 -66673
$$ packed form
17816C8382a40165q9836H6704b6341k6842A68837G9063J60286b24263B2174Q919
17805C1093K25173a04144C1016J75503C97J93045b36453A82396B4938K58648n4655
17794B28931j4244O4753b69136B8644J68426I510a62733A42056O3091d184j64081
17783a68265F9782M57482F9923b22500b9037o4657j65360a15565B11841d0782
17772h6446j52054g3579J6091p9697A04763D0411K18199b54744g7555H2297a08431
17760A24482a19107I969J85585o4360c21791a06978h752j11559r9527c8925k18085
17749b57010A82959B2613K62275d4999B31843a21556B31060D5888K46308a45505
17738c53768J52116Q8875B38709B6336O1215J02609R1398j39846L3231a7681m8992
$$ plain form
17727 -66673 -41241 -55043 -30028 32609 281313 -151528 -21742 -328591 82634 267524 -5471
17715 40157 12118 139391 89208 -36579 13600 305829 12290 -104904 63343 66115 -77249
17703 190901 27140 -47295 -7151 -82153 185839 113462 172313 -258299 317435 -7602 -99982
17692 -99982 -60516 157250 -7234 -14105 -167624 128676 -57568 227650 -89236 -7678 38612
17680 -181178 -13402 278420 -46964 19033 -146959 -211234 -65438 125874 88868 -90506 -158591
17669 -158591 468435 137085 12879 -148725 123662 195482 -260159 61761 468528 223032
17658 170111 104945 22390 27294 -3928 54527 -16976 -221432 -215455 316539 325403 -81284 -34026
17645 -47459 330624 159816 -32911 253328 147966 -65184 205680 -54007 302117 -1570 393131
$$ packed form
17727f6673K5432j3802K5015C2609K48704a51528b1742l06849H2634J84890e471
17715D0157A2118J27273n0183c6579A3600K92229A2290a04904F3343K772g7249
17703A90901B7140d7295g151p5002A85839p2377N8851b58299C17435g602r2380
17692i9982L9466A57250g234o871j53519A28676e7568B27650h9236g678C8612
17680a81178a3402B78420d6964A9033a46959o4275f5438A25874l7006i0506o8085
17669a58591D68435A37085A2879a48725A23662P1820b60159F1761M06767B23032
17658A70111o5166B2390M904c928E4527a6976k04456N977C16539Q864h1284c4026
17645d7459C30624A59816c2911B53328j05362f5184B05680e4007C02117a570C93131
$$ plain form
17633 -167524 -271331 -72147 199321 -40757 -27055 -165733 108188 -134892 238184 107520
17622 -71322 130871 -315538 -85012 246895 345458 -163821 -36885 -191639 -28209 -107524 149616
17610 58544 -156020 63800 -44739 142196 -234566 153581 457896 -198756 -43502 292456
17599 -48684 232564 31548 239211 252517 126415 509449 158945 128988 -116887 30067
17588 62152 129552 45898 217300 -21454 251958 243874 -13612 79214 -227147 92526 -248071
17576 460896 -91152 -15444 111688 72333 81039 -56018 257490 7762 424432 114822 -232064
17564 -10219 75727 99927 -135884 103393 -10904 -13749 29971 -35358 -99681 -253379 17943
17552 -170994 89587 -108216 -3326 406438 -324857 -37251 219269 -81265 478475 11266 143435
$$ packed form
17633a67524j03807g2147A99321d0757J3702j38678A08188a34892B38184A07520
17622g1322A30871c15538h5012B46895R8563a63821c6885j54754b8209p9315A49616
17610E8544a56020F3800d4739A42196b34566A53581L04315a98756d3502B92456
17599d8684B32564C1548K07663J3306j26102L83034A58945k9957a16887C0067
17588F2152O7400D5898J71402b1454B51958q084a3612G9214b27147I2526b48071
17576D60896i1152a5444A11688l9355Q706e6018B57490G762M16670A14822b32064
17564a0219G5727K4200a35884A03393a0904k845B9971c5358o4323j53698A7943
17552a70994H9587a08216c326D06438c24857c7251B19269h1265D78475A1266J32169
$$ plain form
17541 143435 394638 -42585 100796 -14984 323872 12622 103232 236087 131674 -20865
17530 19747 221225 114845 22377 38319 215423 25624 -37692 140791 303503 332525 135174
17518 265325 350370 390320 209488 24705 105193 -39928 41083 207876 -43453 515758 222428
17506 47770 448729 28795 87007 262908 213880 169342 87538 474310 -190502 446273 101211
17494 -144001 19755 59918 288075 111095 148327 103008 97282 225881 62378 -230745 131293
17482 61955 -33775 -3747 -246429 233651 241202 257110 590009 84329 408670 104748 -91418
17470 397627 166067 60537 152075 553175 -88515 -24820 90703 6615 326635 321542 358204
17459 358204 43625 118978 267243 -102967 -106274 163340 166816 171982 -75243 187887 492746
$$ packed form
17541A43435K51203d2585A00796a4984C23872A2622R0610J32855j04413b0865
17530A9747K01478j06380B2377J5942J77104B5624c7692A40791J62712K9022A35174
17518B65325Q5045L9950j80832B4705Q0488c9928D1083J66793d3453E15758B22428
17506D7770M00959B8795N8212J75901m9028m4538q1804L86772a90502D46273A01211
17494a44001A9755M0163K28157A11095L7232m5319n726J28599F2378b30745A31293
17482F1955c3775c747k42682B33651P551J5908L32899H4329L24341A04748i1418
17470C97627A66067F0537R1538M01100h8515b4820I0703F615L20020n093L6662
17459C58204D3625P5353J48265a02967l307A63340L476N166g5243A87887L04859
$$ plain form
17448 492746 21255 136869 763452 272026 -26403 190499 -42346 277752 357116 342075
17438 342075 649855 -7220 392703 -151670 284395 286721 211460 275864 -32928 349805 185195
17427 185195 312286 327458 178570 172472 50972 141730 485383 6243 7566 484538 275262
17416 275262 330962 604287 147960 142698 102813 496074 89914 84270 -70358 -229778 8638
17404 285089 192014 125293 143316 249489 400991 106614 346205 308448 123826 277362
17394 277362 300851 156174 350309 139970 167733 170939 403857 200356 98180 178839 202036
17383 202036 39193 -12396 370639 158439 310047 131532 138972 143020 207346 461218 104089
17371 191598 194056 407929 55824 81065 149704 93597 258859 -36086 272683 303386 15333
$$ packed form
17448D92746B1255J15614O26583B72026b6403A90499d2346B77752P9364j5041
17438C42075L07780g220C92703a51670B84395K326p5261O4404c2928C49805j64610
17427A85195J27091J5172j48888o098E0972R0758L43653F243J323M76972k09276
17416B75262N5700K73325A47960n262l9885L93261H9914n644g0358j59420H638
17404B85089r3075o6721J8023J06173J51502A06614K39591l7757A23826J53536
17394B77362K3489j44677J94135A39970K7763L206K32918B00356I8180Q0659K3197
17383B02036C9193a2396C70639A58439J51608A31532P440M048O4326K53872A04089
17371A91598K458K13873E5824K5241O8639n6107J65262c6086B72683L0703A5333
$$ plain form
17359 446165 -114920 369522 295866 346791 341125 74456 -152594 277010 267320 139879 129734
17348 129734 -7757 391254 76430 35901 353789 132608 146891 58217 230045 104114 175383
17337 175383 166174 243236 159142 336838 168796 206038 352290 82801 217368 313472 366032
17326 366032 357433 108896 223878 164251 31795 275424 176946 125841 399953 386037 -68373
17314 325010 21177 164263 348461 207942 394720 228159 110650 176500 62029 109966
17304 109966 209324 56310 88410 179406 189512 377701 280812 100328 248127 -144494 249214
17292 161031 77331 198050 247340 277485 36484 204933 172531 226812 260277 376927 62499
17280 62553 -4494 292052 298693 137385 434972 56744 8355 112248 222705 158955 656720
$$ packed form
17359D46165a14920C69522p3656N0925n666G4456a52594B77010r690j27441j0145
17348A29734g757C91254G6430C5901L17888A32608J4283E8217J71828A04114P1269
17337A75383r209P7062q4094J77696j68042L7242J46252H2801J34567R6104N2560
17326C66032q599A08896J14982n9627C1795K43629r8478n1105K74112j3916f8373
17314C25010B1177J43086J84198j40519J86778j66561A10650O5850F2029M7937
17304A09966R9358E6310L2100R0996J0106J88189r6889A00328J47799a44494B49214
17292A61031G7331J20719M9290L0145C6484J68449l2402N4281L3465J16650F2499
17280F2553d494B92052O641A37385K97587E6744H355J03893J10457o3750M97765
$$ plain form
17269 656720 -146814 252813 173281 97074 265453 -123841 92807 296653 146704 186996
17259 186996 45236 283430 433473 -21637 -9246 367057 545002 -25863 151727 -70502 281511
17247 274454 127167 83431 -244807 79172 436851 109534 362697 -233459 95722 12391
17236 264607 289124 374935 350001 281337 280803 256350 250156 203967 4097 220219 213036 133702
17224 133702 553035 305232 156874 646492 308496 328741 280369 139511 -51642 303916
17213 153025 -13813 330149 410777 463966 414255 539241 193039 67483 149768 110873 254146
17202 254146 183259 467566 309518 352617 255874 357072 166569 554141 188444 381029
17192 381029 406113 401928 28091 640132 354531 543316 189760 461855 439454 -59743 372363
$$ packed form
17269F56720a46814B52813p9532p6207J68379a23841I2807K03846A46704M0292
17259A86996D5236K38194J50043b1637i246C67057J77945b5863A51727g0502B81511
17247B74454A27167m3736b44807G9172L57679A09534K53163b33459I5722A2391
17236B64607K4517Q5811k4934o8664n34k4453o194m6189D097K16122p183p9334
17224A33702M19333k47803j48358M89618C08496K0245m8372A39511e1642C03916
17213A53025a3813C30149Q0628N3189m9711J24986A93039F7483Q2285l8895J43273
17202B54146p0887K84307j58048M3099r6743J01198A66569L87572A88444J92585
17192C81029K5084m185B8091O12041k85601J88785A89760K72095k2401e9743C72363
$$ plain form
17180 262712 321613 433087 385529 289743 232667 222411 297358 258504 692962 208706 496266
17169 496266 473924 239040 490287 453636 223136 230277 268607 337337 545165 318691 221105
17158 221105 419911 422219 161798 32983 304381 662105 573639 236089 271250 267709 247361
17147 247361 407176 410898 166224 623856 484375 252663 395775 307855 250260 410174
17137 410174 134936 337775 640642 4514 552333 284071 261093 683460 336753 537842
17127 537842 479753 536271 347461 169608 299154 521385 727233 488744 79836 474423
17117 474423 408870 523172 319703 594143 391226 555882 137854 199473 402138 351229
17107 351229 768691 590611 586513 453945 708983 233454 595422 491256 280039 579275
$$ packed form
17180B62712N8901J11474m7558r5786n7076j0256P4947l8854M34458B08706K87560
17169D96266k2342k34884K51247l6651B23136P141L8330O8730K07828k26474r7586
17158B21105J98806K308A61798C2983K71398L57724q8466B36089L5161l541k0348
17147B47361J59815L722A66224M57632j39481k31712J43112q7920n7595J59914
17137D10174A34936K02839L02867D514N47819k68262k2978M22367C36753K01089
17127E37842n8089N6518j88810A69608J29546K22231K05848k38489G9836L94587
17117D74423o5553J14302k03469K74440k02917J64656A37854O1619K02665n0909
17107C51229M17462j78080m098j32568K55038B33454L61968j04166k11217K99236
$$ plain form
17097 579275 470033 558365 454923 515267 206641 820488 552154 419663 353881 254018
17087 254018 582821 578615 308469 215917 458492 617313 510995 549659 428808 443203
17077 443203 659332 243545 444332 481902 512212 772896 850113 551342 471350 464050 835011
17066 835011 460094 795613 652012 781114 573738 663652 708567 890679 440755 638971
17056 638971 331998 403096 809550 585109 590912 640419 683028 539294 770012 482376
17046 482376 816353 953662 760802 647236 466407 712079 765309 1103753 644277 620631
17036 620631 808756 734491 921297 498863 690741 780959 573214 375010 462548 822866
17026 822866 705700 763805 671054 951161 693239 937613 725989 544615 824070 801442
$$ packed form
17097E79275j09242Q8332j03442O0344B06641O13847k68334j32491o5782r9863
17087B54018L28803m206k70146r2552K42575J58821j06318L8664j20851J4395
17077D43203K16129B43545K00787L7570L0310K60684P7217k98771p9992p300L70961
17066H35011l74917L35519j43601J29102k07376Q9914M4915J82112D40755J98216
17056F38971l06973P1098M06454k24441N803M9507M2609j43734K30718k87636
17046D82376L33977J37309j92860j13566j80829K45672N3230L38444m59476k3646
17036F20631J88125p4265J86806m22434J91878R0218k07745j98204Q7538L60318
17026H22866j17166N8105r2751K80107k57922K44374k11624j81374K79455k2628
$$ plain form
17016 801442 965678 588331 775472 997080 810300 659390 669092 955394 824618 672518
17006 672518 1017349 756463 887791 844706 852731 1002734 1195324 790545 627699 832095
16996 832095 737896 1330210 679319 1096880 672205 1107249 1074302 944513 1023698 528190
16986 528190 1411252 1270096 1115651 1194585 940562 990208 1207240 876485 724764 1045830
16976 1045830 1127364 823596 1154198 1046155 1314356 982833 1399999 1154098 1148830 1348290
16966 1348290 1038826 1161413 1202406 1344921 1245862 1219296 1330107 1168817 1251359 1360539
16956 1360539 1388414 915380 1117596 1315771 1438464 1273471 1137204 1481355 1486223 1454133
16946 1454133 1336377 1422409 1435560 1219790 1420729 1420821 1437066 1322738 1478053 1573716 1708256
$$ packed form
17016H01442J64236l77347J87141K21608j86780j50910R702K86302j30776j52100
17006F72518L44831k60886J31328m3085Q025J50003J92590m04779j62846K04396
16996H32095r4199N92314o50891M17561m24675M35044l2947j29789P9185m95508
16986E28190Q83062j41156j54445P8934k54023M9646K17032l30755j51721L21066
16976A045830Q1534l03768L30602j08043K68201l31523M17166k45901n268J99460
16966A348290l09464J22587M0993J42515r9059k6566J10811j61290Q2542J09180
16956A360539K7875m73034K02216J98175J22693j64993j36267L44151M868l2090
16946A454133j17756Q6032J3151k15770K00939R2J6245j14328J55315R5663J34540
$$ plain form
16935 1708256 1584624 1510850 1631052 1361295 1198295 1494825 1370519 1391724 1947356 1760934
16925 1760934 1856663 1262405 1638225 2101485 1636799 1586548 1533683 1719568 1667316 1837577
16915 1837577 1580177 1719898 1861689 1922274 1586313 1985900 1896170 2206547 2154254 1819975
16905 1819975 1703469 2204588 2237543 2262839 2090876 1852140 2049454 1742871 2174364 1913345
16895 1913345 2134695 2027961 2369876 2366644 2419602 2526688 2359439 2280147 2476986 2461997
16885 2461997 2402045 2348941 2553025 2519861 2675696 2490800 2757074 2776563 2772248 2909161
16875 2909161 2769335 3041601 2813681 2793599 3050279 3083771 3040587 3201058 3097255 3138621
16865 3138621 3273608 3121888 3244474 3278166 3623105 3270246 3328944 3417167 3629513 3270288
$$ packed form
16935A708256j23632p3774J20202k69757j63000K96530j24306K1205N55632j86422
16925A760934R5729n94258L75820M63260m64686n0251n2865J85885n2252J70261
16915A837577k57400J39721J41791O0585l35961L99587q9730L10377n2293l34279
16905A819975j16506N01119L2955K5296j71963k38736J97314l06583M31493k61019
16895A913345K21350j06734L41915l232N2958J07086j67249p9292J96839j4989
16885B461997n9952n3104K04084l3164J55835j84896K66274J9489m315J36913
16875B909161j39826K72266k27920k0082K56680L3492m3184J60471j03803M1366
16865C138621J34987j51720J22586L3692L44939l52859N8698Q8223K12346l59225
$$ plain form
16855 3270288 3607350 3132378 3898343 3940526 3984402 4050230 3871921 4059451 4322698 4298470
16845 4298470 4386690 4196445 4454927 4295288 4180510 4508508 4757153 4682696 4585748 4733976
16835 4733976 4909507 5197003 4863054 5291637 4972316 5241758 5366117 5402986 5429102 5379451
16825 5379451 5795658 5826129 5931914 6166335 6169303 6067092 6588406 6831198 6620799 6806487
16815 6806487 7086613 6985109 7121210 7182562 7397295 7666898 7809647 7461579 7963824 8310065
16805 8310065 8493790 8471947 8465315 8834115 9177909 9379541 9721929 9519443 9958241 10229638
16795 10229638 10318859 10733906 10984155 11067488 11221210 11666599 12131501 12146516 12551313 12758295
16785 12758295 13545332 13647494 13817713 14333553 14726260 15111722 15549359 15820566 16055811
$$ packed form
16855C270288L37062m74972P65965M2183M3876O5828j78309J87530K63247k4228
16845D298470Q8220j90245K58482j59639j14778L27998K48645p4457r6948J48228
16835D733976J75531K87496l33949M28583l19321K69442J24359L6869K6116m9651
16825E379451M16207L0471J05785K34421K968j02211N21314K42792k10399J85688
16815F806487K80126j01504J36101O1352K14733K69603J42749l48068N02245L46241
16805H310065J83725k1843o632L68800L43794K01632L42388k02486M38798K71397
16795A0229638Q9221M15047K50249Q3333J53722M45389M64902J5015M04797K06982
16785A2758295P87037J02162J70219N15840L92707L85462M37637K71207K35245
$$ plain form
16776 16055811 16665040 17333335 17806774 18670612 19006734 19415392 19964734 20795234 21298644
16767 21298644 22310553 22623448 23611564 24493036 25382159 26193405 27080471 28010395 29020456
16758 29020456 30031812 31363323 32442301 34206026 35332505 36667246 37917290 39543795
16750 39543795 41257761 43369880 45176187 47218075 48897147 51108797 53624718 56247300
16742 56247300 58898445 61701365 64828707 67704867 71213545 74478141 78346667 82232995
16734 82232995 86269818 90543300 95139903 99713585 104081854 108972265 114019588 118929174
16726 118929174 124007488 128816285 133840002 137909751 142427261 145914076 149349190 151884865
16718 151884865 153875034 155336333 156034034 156081939 154958861 153561659 151285541 148504103
$$ packed form
16776A6055811O09229O68295M73439Q63838L36122M08658N49342Q30500N03410
16767B1298644J011909L12895R88116Q81472Q89123Q11246Q87066R29924J010061
16758B9020456J011356J331511J078978J763725J126479J334741J250044J626505
16750C9543795J713966K112119J806307K041888J679072K211650K515921K622582
16742E6247300K651145K802920L127342K876160L508678L264596L868526L886328
16734H2232995M036823M273482M596603M573682M368269M890411N047323M909586
16726A18929174N078314M808797N023717M069749M517510L486815L435114K535675
16718A51884865J990169J461299O97701M7905j123078j397202k276118k781438
$$ plain form
16710 148504103 145122595 141083307 136765497 132128865 127228364 122292166 117452498 112078337
16702 112078337 107018581 101972308 96992590 92246968 87788759 83434221 79468700 75239443
16694 75239443 71355938 67763988 64303111 61121200 58439426 55332458 52684247 50357163
16686 50357163 48317039 45963107 43552403 41735792 39747326 37922134 36234360 34544472
16678 34544472 33384338 31897733 30218389 29305928 28156174 26963164 26092936 24875312
16670 24875312 24118161 23162609 22202179 21380329 20626961 20007287 19096674 18767865 18019744
16661 18019744 17076967 17038576 16141180 15442951 15130814 14413158 14481555 13898801 13191859 13132223
16651 13132223 12678237 12186641 11728631 11465924 11227646 10767552 10634170 10058657 10243176
$$ packed form
16710A48504103l381508m039288m317810m636632m900501m936198m839668n374161
16702A12078337n059756n046273m979718m745622m458209m354538l965521m229257
16694G5239443l883505l591950l460877l181911k681774l106968k648211k327084
16686E0357163k040124k353932k410704j816611j988466j825192j687774j689888
16678C4544472j160134j486605j679344r12461j149754j193010q70228j217624
16670B4875312p57151r55552r60430q21850p53368o19674r10613l28809p48121
16661A8019744r42777l8391q97396o98229l12137p17656O8397n82754p06942n9636
16651A3132223m53986m91596m58010k62707k38278m60094j33382n75513J84519
$$ plain form
16642 10243176 10032721 9727722 9314690 9120725 9010342 8476476 8450353 8124095 8011312
16633 8011312 7762286 7569433 7740631 7378987 7216184 7108500 6424264 6933520 6417436
16624 6417436 6241358 6003595 5858518 5933872 6069296 5471886 5809419 5569754 5221151 5191084
16614 5191084 5200336 4991122 5084592 4927719 4578654 4946661 4415665 4326337 4139355 4459438
16604 4459438 4137404 3772149 3977554 4061537 3874413 4189957 3818251 3706074 3705968 3522417
16594 3522417 3636775 3476108 3421599 3224567 3236846 3289512 2848648 3025995 2891715 3140288
16584 3140288 3184958 2875792 2799413 3031682 2713340 2578103 2588243 2704341 2599421 2466198
16574 2466198 2847869 2708806 2321082 2892169 2606872 2527465 2177252 2497076 2240771 2031839
$$ packed form
16642A0243176k10455l04999m13032j93965j10383n33866k6123l26258j12783
16633H011312k49026j92853J71198l61644j62803j07684o84236N09256n16084
16624F417436j76078k37763j45077P5354J35424n97410L37533k39665l48603l0067
16614E191084R252k09214R3470j56873l49065L68007n30996q9328j86982L20083
16604D459438l22034l65255K05405Q3983j87124L15544l71706j12177j06j83551
16594C522417J14358j60667n4509j97032J2279N2666m40864J77347j34280K48573
16584C140288M4670l09166p6379K32269l18342j35237J0140J16098j04920j33223
16574B466198L81671j39063l87724N71087k85297p9407l50213L19824k56305k08932
$$ plain form
16564 2031839 2413368 2479809 2045216 1837281 2085550 2038402 2123088 2010879 2050552 2379767
16554 2379767 2069899 1798328 1924153 1708326 1786804 2027933 1736245 1271131 1533016 1933896
16544 1933896 1757478 2214159 1655375 1496485 1870797 1586096 1353377 1287058 1575370 1272627
16534 1272627 1570604 1881951 1396057 1288111 1667187 1225410 1708226 1326257 1288519 1274989
16524 1274989 1410819 1621898 1244526 1278608 1232877 1282968 1165058 1431307 984702 1207455
16514 1207455 1273367 1123720 1039201 1203807 1111028 1163286 1164453 1103638 1102017 985968 984498
16503 984498 972468 1384880 1008911 1194037 1171096 1063620 840497 878772 802599 1076706
16493 1076706 740522 771203 680041 867272 822072 985341 975441 932833 577985 861233
$$ packed form
16564B031839L81529O6441m34593k07935K48269m7148Q4686j12209L9673L29215
16554B379767l09868k71571J25825k15827P8478K41129k91688m65114K61885M00880
16544A933896j76418M56681n58784j58890L74312k84701k32719o6319K88312l02743
16534A272627K97977L11347m85894j07946L79076m41777M82816l81969l7738j3530
16524A274989J35830K11079l77372L4082m5731N0091j17910K66249m46605K22753
16514A207455O5912j49647q4519J64606r2779N2258J167o0815j621j16049j470
16503I84498j2030M12412l75969J85126k2941j07476k23123L8275p6173K74107
16493A076706l36184L0681r1162J87231m5200J63269r900m2608l54848K83248
$$ plain form
16483 861233 767819 1027443 498379 603850 752098 836380 779977 666534 919802 781440
16473 781440 967123 763265 660560 615078 619687 820481 764541 720528 897643 881031 692177
16462 692177 948171 813182 647740 670136 668160 410023 495753 804841 543919 544505 896891
16451 896891 649772 786051 564331 455833 627042 776952 674045 677116 712438 848546
16441 848546 701051 704913 355418 656035 459558 424241 536103 558976 467215 437934 304725
16430 304725 320379 148916 549022 423310 629203 202656 446500 686459 488238 166090
16419 358798 353439 388950 707797 210937 662764 577271 250377 518452 -67058 516690
16408 191709 405991 255639 650405 318515 553218 357060 396539 190223 237051 515768
$$ packed form
16483H61233r3414K59624D98379J05471J48248Q4282n6403j13443K53268j38362
16473G81440J85683k03858j02705m5482M609K00794n5940m4013J77115j6612j88854
16462F92177K55994j34989j65442K2396j976k58137Q5730L09088k60922N86L52386
16451H96891k47119J36279k21720j08498J71209J49910j02907L071L5322J36108
16441H48546j47495L862l49495L00617j96477l5317J11862K2873r1761k9281j33209
16430C04725J5654A48916M00106j25712K05893B02656K43844K39959j98221A66090
16419C58798n359L5511L18847B10937M51827q5493B50377K68075f7058E16690
16408A91709K14282j50352L94766C18515K34703j96158L9479A90223M6828K78717
$$ plain form
16398 515768 206190 819411 503500 401723 483293 423791 268572 267728 223010 556412 721153
16387 721153 226023 304336 310324 160951 228835 423610 419732 95917 466960 105363 147239
16376 147239 251316 678697 628053 75840 198138 159934 446507 426037 339346 270379 336000
16365 336000 476740 188210 83860 150152 403555 259790 233454 274364 112904 352081
16355 352081 204814 142752 261464 359773 265192 367610 327404 44200 134054 35371 432210
16344 432210 181326 302769 315757 350744 103431 247207 301149 419189 240061 408250
16334 408250 272480 435397 -63161 516703 87346 438554 282914 -38420 209478 109353
16324 109353 483218 -5606 -36414 167179 297960 361194 161540 80908 343678 409358 -114626
$$ packed form
16398E15768B06190O13221l15911j01777Q1570n9502j55219q44m4718L33402J64741
16387G21153B26023P8313N988j49373O7884J94775l878I5917L71043A05363M1876
16376A47239J04077M27381n0644G5840J22298l8204K86573k0470q6691o8967O5621
16365C36000J40740A88210H3860O6292K53403j43765k6336M0910A12904K39177
16355C52081j47267o2062J18712R8309r4581J02418m0206D4200Q9854C5371L96839
16344D32210A81326J21443J2988L4987A03431J43776N3942J18040j79128J68189
16334D08250j35770J62917f3161E16703H7346L51208j55640c8420B09478j00125
16324A09353L73865e606l0808A67179J30781O3234A61540q0632K62770O5680a14626
$$ plain form
16312 158787 373634 250344 27652 120657 491031 292013 294126 102224 161573 223653 229895
16301 229895 149186 59742 328616 264614 -86146 253852 124321 27735 -115724 201315
16290 417868 251268 -98613 343291 52313 -28228 65332 -22037 59095 396319 42713 281283
16279 281283 220680 581619 309625 221753 273347 185979 103895 228846 315157 37618 377533
16268 377533 187230 155839 901 94633 216432 -80091 556008 425204 -46212 187054 181061
16257 181061 85757 -74707 238958 -125790 223771 463222 66617 -216511 59924 292422
16247 292422 33457 -53808 180490 78684 117808 256078 459177 108452 341375 240292
16237 240292 -94545 140053 203694 -87718 119519 175212 -227249 222229 -38040 266896
$$ packed form
16312A58787K14847j23290B7652R3005L70374j99018K113A02224N9349O2080O242
16301B29895q0709E9742K68874o4002h6146B53852A24321B7735a15724B01315
16290D17868j66600i8613C43291E2313b8228F5332b2037E9095L37224D2713K38570
16279B81283o0603L60939k71994q7872N1594q7368q2084J24951Q6311C7618L39915
16268C77533A87230l1391I01R3732J21799h0091E56008j30804d6212A87054n993
16257A81061H5757g4707B38958a25790B23771K39451F6617b16511E9924K32498
16247B92422C3457e3808A80490G8684L9124J38270K03099A08452K32923j01083
16237B40292i4545A40053O3641h7718A19519N5693b27249B22229c8040B66896
$$ plain form
16226 239387 33551 581986 500375 151855 156392 216018 -68725 -120833 160484 -1145 237997
16214 -68988 -72739 -78941 24667 -203602 49072 311849 55683 297500 98301 117237 66893
16203 66893 61151 71026 -173636 -86568 21742 -172440 -21338 -91551 3357 37961 322118 27263
16190 -6213 -388416 67375 274455 -302904 185430 73324 132296 350772 487087 158924
16179 -234839 -96408 218135 154143 -58843 -47033 -109049 389460 241064 -109111 72809 -355669
16167 -314948 -54760 170243 -82552 -50796 117756 116733 121015 23846 -33386 53458 -133978
16155 172806 44924 14988 208968 -116264 -161515 -118820 -158803 -97173 149456 -151499 -182112
16144 -182112 -77082 -96091 -213538 147697 53581 29420 347364 45577 -28856 63656 154833
$$ packed form
16226B39387C3551N48435q1611A51855M537N9626f8725n2108A60484a145B37997
16214f8988l751o202B4667b03602D9072K62777E5683K41817I8301J8936n0344
16203F6893n742R875a73636h6568B1742a72440b1338p0213C357L4604K84157B7263
16190f213l82203F7375K07080c02904A85430G3324N8972K18476J36315A58924
16179b34839i6408B18135o3992e8843J1810o2016C89460j48396a09111G2809c55669
16167c14948e4760A70243h2552L1756A17756j023M282B3846c3386E3458a33978
16155A72806D4924A4988J93980a16264m5251M2695l9983O1630A49456a51499l0613
16144a82112g7082j9009j17447A47697E3581k4161L17944D5577b8856F3656R1177
$$ plain form
16133 154833 -27661 -29544 -109587 -50531 -15728 -88990 295667 -266781 -73309 -40199 -234595
16122 -234595 -25952 -107621 9302 408379 229720 265537 -123037 -92853 -341340 238143 -26344
16110 197291 -117263 88524 301473 146150 172815 -190401 94735 205321 -126426 352493
16099 60808 160521 139954 -37702 -124295 151234 201207 -18864 116086 302283 191329 206955
16088 206955 -2927 109552 197093 113542 185904 36228 295246 -119569 -102091 -124665 3253
16076 80475 -48357 84213 238460 -69236 116514 -161427 99928 -157046 153857 -26953 -44077
16065 -44077 110208 248136 -137444 105408 104254 36041 51163 355842 -60512 312168 -155031
16053 265194 28320 165419 -75444 57310 254687 414784 -126958 -80411 20392 -194798
$$ packed form
16133A54833b7661j883q0043e0531a5728p3262B95667b66781g3309L3110j94396
16122b34595b5952q1669I302L99077j78659L5817a23037L0184k48487B38143b6344
16110A97291a17263H8524K12949A46150K6665a90401I4735J10586a26426C52493
16099F0808R9713k0567c7702q6593A51234M9973a8864A16086J86197j10954J5626
16088B06955b927A09552Q7541q3551P2362C6228K59018a19569J7478k2574C253
16076H0475d8357H4213J54247f9236A16514a61427I9928a57046A53857b6953j7124
16065d4077A10208J37928a37444A05408j154C6041J5122L04679f0512C12168a55031
16053B65194B8320J37099g5444E7310J97377J60097a26958M6547B0392a94798
$$ plain form
16042 301961 4532 137276 347655 227972 -18026 71527 -54889 -191758 47841 171741 -62809
16030 -97400 -262999 163150 26410 166036 -52049 53529 77085 69939 71952 63222 -284200
16018 129592 -233235 196522 -341619 -40403 -117384 119185 -51820 51926 -106259 -85966
16008 -85966 6306 -6707 -20672 -145083 -202938 23758 36255 -367143 -75555 -150866 160307
15996 -179434 -52946 137331 -34591 -204159 -148940 -392645 -73212 -12758 339105 135147
15985 19502 -179280 24997 415623 308250 320387 484317 185395 44323 53844 -79273 99561
15973 67268 86202 26050 130121 -675 92401 216374 -219257 -133610 137894 308113 -25554
15961 296970 -131890 214237 227066 -25080 -78085 -80759 15621 -63816 62260 -313134 -329432
$$ packed form
16042C01961D532J32744K10379j19683a8026G1527e4889j36869D7841J23900f2809
16030i7400j65599A63150B6410J39626e2049E3529K3556p146K013q730b84200
16018A29592b33235A96522c41619d0403p6981A19185e1820E1926a06259K0293
16008h5966F306f707j3965j24411n7855B3758J2497c67143g5555p5311A60307
15996a79434e2946A37331c4591j69568N5219k43705g3212a2758C39105A35147
15985A9502a79280B4997L90626j07373J2137J63930A85395D4323R521g9273I9561
15973F7268J8934B6050J04071f75I2401J23973b19257Q5647A37894J70219b5554
15961B96970a31890B14237J2829b5080n3005k674A5621f3816F2260c13134j6298
$$ plain form
15950 -329432 6127 -137175 206932 191348 219389 -345213 -111327 -94384 41094 -5344 -335959
15939 -335959 -183872 69699 -266457 15621 -308722 -26147 -164417 64694 181795 -227461
15928 -149092 -194966 33697 -17466 162211 69342 253825 34517 21319 -43829 272843 -27838
15916 -229599 -28126 117838 -272678 -287575 287632 -22375 149286 284796 134191 -141744
15905 -518325 196700 25848 -36960 -196740 -37769 -325605 -159101 184164 -228680 -240635
15895 -240635 17379 -125547 51596 135274 -202902 -360413 135755 71559 344706 -20073
15884 385809 26745 -208125 -126891 -86882 -159688 -30299 -96251 -40293 -15440 -135367 285768
15872 70343 -103902 -100749 -23662 -86255 -107400 -152587 -101403 311495 -134714 132126 -216927
$$ packed form
15950c29432F127a37175B06932j5584K8041c45213a11327J6943D1094e344l30615
15939c35959J52087F9699b66457A5621c08722b6147j38270F4694J17101b27461
15928a49092m5874C3697a7466A62211F9342J84483C4517j3198d3829B72843b7838
15916b29599b8126A17838b72678j4897B87632b2375A49286J35510A34191a41744
15905e18325A96700B5848c6960j59780c7769k87836a59101A84164b28680j1955
15895b40635A7379a25547E1596Q3678b02902j57511A35755o4196K73147b0073
15884C85809B6745b08125Q1234M0009p2806c0299o5952d0293a5440j19927B85768
15872G0343a03902L153b3662o2593k1145m5187N1184C11495a34714A32126b16927
$$ plain form
15860 146224 148631 -139339 -38396 177737 -59469 87730 -141843 -148961 1514 -138045 -18032
15848 -106019 -90392 77563 18035 -425498 -65975 -154855 120556 66843 9360 293180 -198054
15836 -36995 81218 19708 211656 159905 173357 22813 -198002 82436 159348 91718 28713
15824 -271821 -104283 241739 136270 67820 4600 -263909 -60862 -276256 -82445 4842 -51497
15812 -266482 -159614 -209434 27666 41617 -80132 21662 -153750 51845 152936 16809 -225040
15800 195908 -79291 -240919 -16660 171939 178377 101296 -126322 7509 226928 -62067 21923
15788 25658 -31773 37794 -334236 125474 -73105 113047 -143576 196416 20140 -345766
15777 1739 -421596 -230703 -166875 -49385 13664 -18341 -49312 79965 -433863 -18024 44936
$$ packed form
15860A46224K407a39339c8396A77737e9469H7730a41843p118A514a38045a8032
15848a06019J5627G7563A8035d25498f5975q8880A20556n3713I360K83820a98054
15836c6995H1218A9708J91948n1751J3452B2813a98002H2436P6912o7630B8713
15824b71821a04283B41739j05469F7820D600b63909f0862k15394h2445D842e1497
15812b66482J06868m9820B7666J3951h0132B1662a53750E1845J01091A6809b25040
15800A95908g9291j61628a6660A71939O438p7081a26322G509K19419f2067B1923
15788B5658c1773C7794c34236A25474g3105A13047a43576A96416B0140c45766
15777A739d21596J90893O3828d9385A3664a8341l0971G9965d33863a8024D4936
$$ plain form
15765 -169837 -196417 315632 120571 106338 -52604 9784 11887 48372 407099 -179581 -97354
15754 -97354 126387 77368 -20791 140468 -47801 4672 230550 -232348 195111 -141022 7132
15742 58931 -69628 203244 81949 -227620 39596 -210060 109591 -225011 365328 -9611 -232977
15731 -232977 58992 -9379 -47467 -66397 -144719 79873 53239 -88587 243946 -244007 -5166
15719 -36562 -114991 136867 -176140 -325410 226240 3426 129673 294164 88193 -136097
15708 -103038 -37060 233798 -32761 88088 171652 112879 80963 -50730 180020 -142791 244936
15696 -53651 -130719 203568 51743 -45765 17439 368599 68059 -29378 50842 -212766 -153730
15685 -153730 -267543 253298 248069 -58568 255641 -130337 21922 -115634 51041 68302 129603
$$ packed form
15765a69837k6580C15632A20571j4233e2604I784K103L6485L58727a79581Q2227
15754i7354A26387m9019b0791A40468d7801D672K25878b32348A95111a41022G132
15742E8931f9628B03244H1949b27620C9596b10060A09591b25011C65328i611k23366
15731b32977E8992i379l8088j8930p8322G9873k6634h8587B43946b44007e166
15719c6562p8429A36867a76140j49270B26240C426J26247J64491H8193a36097
15708a03038c7060B33798c2761H8088Q3564n8773l1916e0730A80020a42791B44936
15696e3651p7068B03568E1743d5765A7439L51160F8059b9378E0842b12766N9036
15685a53730j13813B53298n229e8568B55641a30337B1922a15634E1041J7261O1301
$$ plain form
15674 129603 -135118 96863 -226846 1750 301944 72096 69823 -164746 126675 -350740 -22069
15662 -213454 123749 -27510 -124242 -38987 -153021 -165432 -11965 -217754 -65356 -410435 -244268
15651 -244268 63500 -202631 163478 -60426 -96730 37065 -266168 -363965 38806 -24339 205764
15639 -29019 -66277 -444648 -103116 77489 284623 -83286 -205307 -267394 -135202 -201777 51028
15627 -268826 197319 48071 209498 -4148 -71239 231273 143496 -162001 132287 226090 -154819
15615 -100085 -33773 -136797 58067 138543 -85637 -76855 -49373 324561 132699 67671 -123887
15603 101829 -139252 -269139 -293099 -6737 -213816 157465 15725 120308 -144045 13419
15592 -2129 -278882 62905 -128781 22032 -129751 17522 70435 126507 227608 -70985 2661
$$ packed form
15674A29603a35118I6863b26846A750L00194G2096k273a64746A26675c50740b2069
15662b13454A23749b7510r6732c8987j14034j2411a1965k05789f5356l45079J66167
15651b44268F3500b02631A63478f0426l6304C7065b66168r7797C8806b4339B05764
15639b9019l7258l78371a03116G7489K07134h3286j22021o2087J32192o6575E1028
15627b68826A97319D8071J61427d148o7091B31273q7777a62001A32287R3803a54819
15615a00085c3773j03024E8067Q0476h5637Q782K7482C24561A32699o5028a23887
15603A01829a39252j29887k3960f737k07079A57465A5725J04583a44045A3419
15592b129k76753F2905a28781B2032a29751A7522N2913N6072J01101g0985B661
$$ plain form
15580 59171 -79403 224426 -68119 3111 -143572 29152 -185436 11027 228799 -118318 -308418
15569 -308418 -46435 28257 -51786 16479 -94659 4000 188222 -97692 -306791 72470 68884
15558 68884 -164281 -169663 -154081 307856 -150001 -73095 281668 -179893 -203318 -43405 57801
15546 -321830 -28824 -6427 252128 -166650 16256 57080 171040 95529 -34495 -87623 17130
15534 -21998 156702 -274385 -75911 80285 106188 -23986 59467 -206494 127539 -173847 -426522
15523 -426522 -23638 -112951 -128284 -85912 -105066 111529 32795 60034 -131206 268534 23088
15511 163416 24925 44881 160987 135502 32809 -2940 -61667 12175 1463 34270 23604 217692
15499 217692 -167402 -31159 -7807 39733 43016 -140636 100485 169695 -89119 117728 -99356
$$ packed form
15580E9171g9403B24426f8119C111a43572B9152a85436A1027K17772a18318j90100
15569c08418d6435B8257e1786A6479i4659D000J84222i7692k09099G2470l586
15558F8884a64281n382J5582C07856a50001g3095B81668a79893k3425d3405E7801
15546c21830b8824f427B52128a66650A6256M0824J13960p5511c4495n3128A7130
15534b1998A56702b74385g5911H0285K5903b3986E9467b06494A27539a73847k52675
15523d26522b3638q9313j5333M2372j9154A11529C2795K7239a31206B68534B3088
15511A63416B4925J9956J16106k5485C2809b940n8727A2175A463L2807j0666J94088
15499B17692a67402c1159g807C9733L283a40636A00485O9210h9119A17728i9356
$$ plain form
15487 -274632 200913 -164347 -27347 310710 60803 196520 -97462 106795 301755 94745
15476 -144724 -160242 129575 75463 -24944 168352 377801 -94443 295466 220095 -15235 209590
15464 -163390 140420 299409 199570 338107 50480 320252 262291 12257 -129406 233076
15453 -93704 -136323 -142012 -58331 -13267 20171 -77436 57272 -176052 -121483 -133626 113545
15441 34285 185640 -12430 -42144 -232882 -50356 190031 -116813 -47681 -147810 415136
15430 153422 -79950 -236627 -963 1034 -31634 113135 270174 6442 -17114 90514 -3099 -211894
15418 -211894 -297171 247094 81869 136266 53493 -144423 -53507 41124 56274 51978 131338
15407 131338 93407 417180 148845 75826 20284 -17189 272496 -99212 255393 202732 41756
$$ packed form
15487b74632B00913a64347b7347C10710F0803J35717i7462A06795J94960I4745
15476a44724j5518A29575n4112b4944A68352K09449i4443B95466p5371a5235B09590
15464a63390A40420J58989r9839J38537E0480K69772n7961A2257a29406B33076
15453i3704m2619n689e8331a3267B0171g7436E7272a76052N4569j2143A13545
15441C4285J51355a2430k9714j90738e0356A90031a16813d7681j00129D15136
15430A53422g9950j56677i63A034c1634A13135J57039F442a7114I0514c099k08795
15418b11894q5277B47094H1869N4397E3493a44423e3507D1124J5150m296P9360
15407A31338l7931L23773A48845p3019B0284a7189B72496i9212B55393n2661D1756
$$ plain form
15395 -177176 206475 -68986 -77350 -96221 -56739 -148733 341230 189469 171896 -46162 180651
15383 -109097 -36353 90098 -23970 -100906 189243 59872 -66546 -234801 -268225 -13323 -92093
15372 -92093 -211989 -45890 123060 201167 -376662 256274 215994 246429 25104 -231193 109189
15360 -7291 -122440 25917 -44715 131718 6667 -10767 104147 -49298 71224 -136711 -15977
15348 53075 -25473 97530 -264483 -269584 -41551 -63626 -205376 -103787 -12926 -143270 154576
15336 -150501 153191 144975 240658 29110 -193810 134791 -206813 -40682 235317 42186 -41808
15324 76689 275499 -262618 73529 171068 -230851 -105329 84363 279732 -303546 -35060
15313 421930 43458 -5096 -25939 -108840 -161329 80918 -79609 185625 -12823 32469 -223805
$$ packed form
15395a77176B06475f8986q364j8871L9482r1994C41230j51761j7573d6162A80651
15383a09097c6353I0098b3970p6936A89243E9872f6546j68255l3424a3323p8770
15372i2093j19896d5890A23060P8107c76662B56274m0280L0435B5104b31193A09189
15360g291j15149B5917d4715A31718F667a0767A04147d9298G1224a36711a5977
15348E3075b5473I7530b64483n101d1551k2075j41750J01589a2926j30344A54576
15336a50501A53191q216R5683B9110a93810A34791b06813d0682B35317D2186d1808
15324G6689J98810b62618G3529R7539b30851a05329H4363J95369c03546c5060
15313D21930D3458e096k0843q2901n2489H0918g9609A85625a2823C2469b23805
$$ plain form
15301 -313295 -274443 118756 128951 75638 -58116 -20224 -99833 102147 -294376 -66280 108309
15289 -44289 426992 -48139 155731 -341226 -286072 148016 163807 -156617 64659 113930 139661
15278 139661 222652 19815 509110 36903 84612 17747 209859 -21862 273989 63433 89871
15267 89871 -304558 -203855 -25932 -184715 437090 165865 -191929 -153151 109933 134721
15257 134721 340336 -3943 -82855 239084 -341590 177191 49876 147213 322818 1220366
15247 1220366 1735927 1438652 1462748 1073386 772979 270599 78980 281734 103948 -35027
15236 87428 -143779 526210 344707 142943 149308 381751 351241 278168 27623 254640 88412
15224 -113305 234766 183957 106928 -181312 83372 314837 207125 -290736 -24041 65378
$$ packed form
15301c13295L8852A18756J0195n3313e8116b0224p9609A02147b94376f6280A08309
15289d4289D26992d8139A55731c41226N5154A48016J5791a56617F4659M9271K5731
15278A39661Q2991A9815M89295C6903M7709A7747J92112b1862B73989F3433K6438
15267H9871c04558J00703b5932j58783D37090A65865a91929L8778A09933K4788
15257A34721K05615c943p8912B39084c41590A77191D9876R7337J75605Q97548
15247A220366N15561k97275K4096l89362l00407B70599G8980K02754A03948c5027
15236H7428a43779E26210j81503A42943O365K32443l0510p3073B7623K27017H8412
15224a13305B34766n0809p7029a81312H3372K31465j07712b90736b4041F5378
$$ plain form
15213 -96832 -47106 124887 83999 64762 47088 68551 -65478 116363 17915 202897 96817
15201 167817 4198 354930 293503 134535 60440 85815 -398183 43061 269574 -179460 172754
15189 375128 280353 194895 -153944 316593 131816 -49591 -15759 -15929 239031 240165 99562
15177 80547 -19078 92446 347492 68394 86989 66787 242471 231615 -44112 258082 -28520
15165 287414 338513 -48946 361309 59341 388453 -127185 93895 92647 306174 -41378 182804
15153 38287 115811 -106342 329961 419987 -137574 105288 229519 217303 162953 305212
15143 305212 83136 -159363 214322 262079 161620 428289 71205 389174 493151 1549
15132 84267 43654 -99366 33125 44190 230974 190197 285618 315258 113739 153512 575 4186
$$ packed form
15213i6832d7106A24887m0888j9237j7674K1463f5478A16363A7915J84982I6817
15201A67817D198L50732o1427A34535F0440K5375c98183D3061K26513a79460A72754
15189C75128r4775q5458a53944C16593A31816d9591a5759j70B39031J134I9562
15177H0547a9078I2446K55046F8394J8595k0202J75684j0856d4112B58082b8520
15165B87414N1099d8946C61309E9341L29112a27185I3895j248K13527d1378A82804
15153C8287P7524a06342C29961R0026a37574A05288J24231j2216n4350J42259
15143C05212H3136a59363B14322M7757j00459K66669G1205L17969J03977A549
15132H4267m0613i9366C3125J1065J86784m0777R5421K9640A13739L9773E75L611
$$ plain form
15120 4186 238137 -1095 99185 80915 290542 368016 -44580 224298 259843 114387 -138146
15108 55549 -9923 294787 183366 53810 -142351 42239 -196202 314973 61048 267042 225066
15097 225066 300663 -9530 385113 419541 161593 11486 504499 254266 63936 -43605 -127823
15086 -127823 -91574 155685 198711 111457 155595 372828 -127398 220282 67433 210040
15076 210040 133483 61791 80101 343224 117008 -241830 346698 375738 432812 478422 47308
15064 -74440 243137 375352 215347 266880 338289 237816 275089 -12004 287698 605405
15054 605405 63245 431579 223838 493749 212767 82885 309863 -626291 407379 296770
15044 296770 -45817 245274 -43033 -59901 76426 586361 50454 300350 159689 267342
$$ packed form
15120D186K33951a095I9185j8270K09627P7474d4580B24298L5545A14387a38146
15108E5549i923B94787j11421E3810a42351D2239a96202C14973F1048K05994m1976
15097B25066P5597i530C85113L4428A61593A1486M93013k50233F3936d3605q4218
15086a27823L6249A55685M3026q7254M4138K17233a27398B20282F7433J42607
15076B10040p6557F1791J8310K63123A17008b41830C46698K9040N7074M5610D7308
15064g4440B43137J32215j60005N1533P1409j00473L7273a2004B87698L17707
15054F05405F3245L68334k07741K69911B12767H2885K26978f26291D07379j10609
15044B96770d5817B45274d3033j6868G6426N09935E0454K49896j40661J07653
$$ plain form
15034 267342 49243 -149305 462371 122498 268974 101013 420150 352296 59636 137022
15024 137022 185565 17493 207089 43046 215196 193839 74356 -297916 62736 155460 -50962
15012 163358 367444 182514 151325 142960 312077 315060 113439 432695 331437 -19510 153320
15000 552435 146018 438952 194798 702410 387333 427071 379435 92614 81613 129924
14990 129924 165692 100934 234740 414033 224291 186846 336044 274869 292328 81408 392212
14979 392212 157817 300950 191756 164950 231848 152152 214923 204286 120560 381925 484381
14968 484381 202132 -71928 7802 454287 -49595 23445 254339 393542 7780 39950 43670
14957 43670 167120 264151 267664 50721 428603 84536 324203 520216 267745 449738 38562
$$ packed form
15034B67342D9243a49305D62371A22498J46476A01013L19137o7854E9636P7386
15024A37022M8543A7493J89596D3046J72150k1357G4356b97916F2736R2724e0962
15012A63358K04086A82514l1189q365J69117K983A13439L19256j01258a9510A53320
15000E52435A46018K92934A94798N07612l15077L9738m7636I2614j1001M8311
14990A29924L5768o4758J33806J79293j89742l7445J49198o1175J7459H1408L10804
14979C92212A57817J43133j09194k6806O6898p9696O2771j0637q3726K61365J02456
14968D84381B02132g1928G802M46485d9595B3445K30894J39203G780L2170L720
14957D3670J23450R7031L513E0721L77882H4536K39667J96013k52471J81993C8562
$$ plain form
14945 -25329 430517 264465 213099 338757 510231 135632 192905 435280 306957 304158
14935 304158 38517 497100 270480 286436 29290 150160 311428 323314 348583 275798 255804
14924 255804 305003 248434 305827 329512 74440 336440 173626 246203 136347 295736 232423
14913 232423 364336 636377 167099 173185 220531 383563 -25587 76833 268288 170 222072
14902 222072 379026 117259 59946 311917 276573 193228 321230 338593 175834 241629
14892 241629 180502 562779 523099 218145 353483 254487 143533 522541 303155 476461
14882 476461 -56958 170048 508531 112255 411703 168352 303439 118332 219334 400465
14872 400465 498859 402393 197310 646325 308055 492338 475504 396858 105821 518978
$$ packed form
14945b5329D30517j66052n1366J25658J71474A35632N7273K42375j28323k799
14935C04158C8517M58583k26620J5956B9290J20870J61268J1886K5269p2785j9994
14924B55804M9199n6569N7393K3685G4440K62000j62814P2577j09856J59389o3313
14913B32423J31913K72041A67099O086M7346J63032b5587G6833J91455A70K21902
14902B22072J56954A17259n7313K51971l5344q3345J28002J7363j62759O5795
14892B41629o1127L82277l9680B18145J35338r8996j10954L79008k19386J73306
14882D76461e6958A70048L38483A12255K99448A68352J35087A18332J01002J81131
14872D00465R8394r6466A97310M49015C08055J84283j6834p8646A05821M13157
$$ plain form
14862 518978 39684 670467 387417 351101 585470 334390 323485 493425 629437 700231
14852 700231 582156 551424 132454 404231 296708 459815 368178 260251 358985 400340
14842 400340 306154 510889 731052 -160954 349527 500292 761325 681509 387895 698214
14832 698214 329157 433199 265947 57229 368958 361364 618663 419257 242376 523916
14822 523916 205218 198047 282854 424355 689627 360245 796669 107212 643539 657944
14812 657944 708197 562349 630742 740358 477524 257808 499782 681142 229804 312445
14802 312445 755601 784287 282328 436814 284681 295075 338021 206344 727466 442341
14792 442341 497363 460418 724199 742295 483764 620756 406040 627946 646020 491107
$$ packed form
14862E18978C9684O30783k83050l6316K34369k51080j0905J69940J36012P0794
14852G00231j18075l0732A32454K71777j07523J63107r1637j07927R8734M1355
14842D00340r4186K04735K20163a60954C49527J50765K61033p9816k93614L10319
14832F98214C29157J04042j67252E7229L11729p594K57299j99406j76881K81540
14822E23916B05218p171Q4807J41501K65272l29382M36424A07212N36327J4405
14812F57944N0253j45848O8393J09616k62834k19716K41974J81360B29804Q2641
14802C12445M43156K8686B82328J54486j52133J0394M2946j31677N21122k85125
14792D42341N5022l6945K63781J8096k58531J36992k14716K21906J8074j54913
$$ plain form
14782 491107 431545 483142 786382 347581 456668 443116 669180 592386 244882 742424
14772 742424 703150 684397 940598 639651 646740 284553 599759 638696 755082 661578 570477
14761 570477 783246 552370 723697 631129 727911 953459 635424 617770 442694 752627
14751 752627 851389 664814 646316 701481 843961 684090 465532 641426 989173 776622
14741 776622 512899 636031 729247 646010 709050 810580 565698 1085216 992111 608281
14731 608281 938104 843835 976639 1045239 448684 449443 487613 705175 660175 975153 1169367
14720 1169367 545402 1048363 964977 1043808 926663 646930 794868 653453 671644 897108
14710 897108 499468 799391 848560 671754 955407 539747 822284 1070373 1100764 744815
$$ packed form
14782D91107n9562N1597L03240C47581J09087j3552K26064p6794B44882M97542
14772G42424l9274j8753K56201l00947P089B84553L15206L8937J16386r3504r1101
14761E70477K12769k30876J71327r2568R6782K25548l18035j7654j75076L09933
14751G52627R8762j86575j8498N5165J42480j59871k18558J75894L47747k12551
14741G76622k63723J23132R3216q3237O3040J01530k44882N19518r3105l83830
14731F08281L29823r4269J32804O8600D48684P59L8170K17562m5000L14978J94214
14720A169367E45402N02961q3386P8831j17145k79733J47938j41415J8191K25464
14710H97108l97640K99923M9169j76806K83653m15660K82537K48089L0391l55949
$$ plain form
14700 744815 754045 895985 1072483 796242 1032609 753359 925460 821556 727023 883619
14690 883619 757316 1027063 986863 871645 1071669 915679 840844 840036 930819 997159 648692
14679 648692 1216625 964949 1102541 1023002 824009 795436 785903 770307 1323480 834441
14669 834441 852616 1009690 1027370 1299583 975665 1043369 985451 723660 977834 855222
14659 855222 797370 1195919 1181349 1127326 1397923 1213617 1060655 1065960 988366 1333978 854408
14648 854408 1332680 1042955 1008727 1326371 1101179 1493310 1216653 999578 1212600 1283045
14638 1283045 1117461 1188037 975786 1400689 1047342 1393105 1286020 1296183 1142603 1244808
14628 1244808 1336739 1403307 1103495 1598201 1415152 1539811 1392940 1302237 1433057 1447664
$$ packed form
14700G44815R230J41940J76498k76241K36367k79250J72101j03904r4533J56596
14690H83619j26303K69747m0200j15218K00024j55990p4835q08R0783O6340l48467
14679F48692N67933k51676J37592p9539j98993k8573r533j5596N53173m89039
14669H34441J8175J57074J7680K72213l23918O7704n7918k61791K54174j22612
14659H55222n7852L98549j4570n4023K70597j84306j52962N305p7594L45612m79570
14648H54408M78272k89725l4228L17644k25192L92131k76657k17075K13022P0445
14638A283045j65584P0576k12251M24903l53347L45763j07085J0163j53580J02205
14628A244808R1931O6568k99812M94706j83049J24659j46871r0703J30820J4607
$$ plain form
14618 1447664 1611823 1268266 1292342 1173524 1402804 1363068 1645718 1723785 1622196 1161012
14608 1161012 1762313 1284715 1374264 1397197 1701893 1793541 1721337 1629135 1700400 1773236 1322545
14597 1322545 1727685 1712286 1493854 1829095 1784294 1870264 1716244 1653504 2064141 1953604
14587 1953604 1924403 1551628 1944526 1796274 1803561 1786409 1942867 1932743 1892750 1757399
14577 1757399 2192918 1791065 2101786 2021151 2042488 1735432 2338045 2153607 2126221 2187183
14567 2187183 2636837 2381748 2566024 2578840 2566487 2648008 2596397 2682319 2800441 2996443
14557 2996443 2787456 2971339 3192514 3810919 3476315 3872592 4572252 5224816 7089326
14548 7089326 11735053 20637803 35394071 42499114 19874189 9689688 4712497 3216601
$$ packed form
14618A447664J64159l43557K4076j18818K29280l9736K82650P8067j01589m61184
14608A161012O01301m77598Q9549K2933L04696R1648p2204r2202P1265P2836m50691
14597A322545M05140j5399k18432L35241m4801Q5970j54020o2740M10637j10537
14587A953604k9201l72775L92898j48252P287j7152J56458j0124l9993j35351
14577A757399M35519m01853L10721q0635K1337l07056O02613j84438k7386O0962
14567B187183M49654k55089J84276J2816j2353Q1521n1611Q5922J18122J96002
14557B996443k08987J83883K21175O18405l34604L96277O99660O52564J864510
14548G089326M645727Q902750J4756268P105043A9874189I689688D712497j495896
$$ plain form
14540 3216601 2744249 2484976 1982960 2061135 2161403 2638192 2013597 2170992 1943729 2094916
14530 2094916 2207139 2166800 2365870 2134585 2447985 2274557 2159341 2468232 2504193 2447535
14520 2447535 2423292 2502450 2443151 2688588 2476782 2512259 2464331 2804689 2834729 2868525 3157115
14509 3157115 2584214 2991500 2717062 2732362 3085377 3069972 3021916 3194882 3432572 2861220
14499 2861220 3292232 3119831 3519789 3178884 3308096 3208236 3584391 3511870 3556531 3665869
14489 3665869 3392293 3704793 3593743 3462189 3398360 3545719 4006813 3419868 3784885 3987350
14479 3987350 3780724 3787872 3833551 3869695 4046354 3936819 4359183 4258366 4018641 4282680
14469 4282680 4297432 4989666 4153467 4174088 4330391 4897093 4689798 4749854 4790430 4708898
$$ packed form
14540C216601m72352k59273n02016P8175J00268M76789o24595J57395k27263J51187
14530B094916J12223m0339J99070k31285L13400j73428j15216L08891L5961n6658
14520B447535k4243P9158n9299K45437k11806L5477m7928L40358L0040L3796K88590
14509C157115n72901M07286k74438J5300L53015j5405m8056J72966K37690n71352
14499B861220M31012j72401L99958l40905J29212r9860L76155p2521M4661J09338
14489C665869k73576L12500j11050j31554o3829J47359M61094n86945L65017K02465
14479C987350k06626P148M5679L6144J76659j09535M22364j00817k39725K64039
14469D282680J4752O92234q36199K0621J56303N66702k07295O0056M0576q1532
$$ plain form
14459 4708898 4579549 4593004 5065132 5033446 5062498 5027378 5123050 5137067 5404731 5140157
14449 5140157 5404637 5691203 5453253 5470335 5717520 5775836 5850120 5697517 5783738 5888846
14439 5888846 5883153 6063699 6109795 6367567 6394769 6373142 6491440 6797673 6534305 6995107
14429 6995107 6781759 6815912 6932892 7420485 7089695 7527130 7628343 7699726 7658781 7778648
14419 7778648 7835163 7855822 8133863 8318539 8492586 8550389 8516840 8657065 9051147 9082349
14409 9082349 9134616 9484457 9347595 9540730 9788676 9971895 9848497 10292117 9923582 10383416
14399 10383416 10683721 10276264 11092517 10813237 11272757 11602653 11765223 11816835 11878775 12333519
14389 12333519 12619747 12652730 12497583 13170654 13418655 13185039 13770493 14124776 14097781 14539797
$$ packed form
14459D708898j29349J3455M72128l1686K9052l5120R5672J4017K67664k64574
14449E140157K64480K86566k37950J7082K47185N8316P4284j52603Q6221J05108
14439E888846n693J80546M6096K57772K7202k1627J18298L06233k63368M60802
14429F995107k13348L4153J16980M87593l30790M37435J01213P1383m0945J19867
14419G778648N6515K0659K78041J84676J74047N7803l3549J40225L94082L1202
14409I082349N2267L49841j36862J93135K47946J83219j23398M43620l68535M59834
14399A0383416L00305m07457Q16253k79280M59520L29896J62570N1612O1940M54744
14389A2333519K86228L2983j55147O73071K48001k33616N85454L54283k6995M42016
$$ plain form
14379 14539797 14331267 14757897 15168795 15594937 16042044 16420390 16334683 16695947 17151133
14370 17151133 17224497 17586060 17726363 18233485 18870452 19318243 19872155 20012571 20409750
14361 20409750 20646179 21200756 21882544 22169144 22703663 22977844 23629162 24124647 24701539
14352 24701539 25304702 26097300 26360955 27008899 27894429 28660470 29237549 30212069 30565385
14343 30565385 31423912 32490220 32971173 34160784 35054078 35783487 36744930 37939671 38744819
14334 38744819 39752487 41020417 42537852 43627397 44530966 45977898 47674296 48955632
14326 48955632 50323910 52124545 53880198 55631611 57002660 59351110 61197750 63065580
14318 63065580 65223309 67773664 69976606 72409461 75297231 78283240 81249783 84165792
$$ packed form
14379A4539797k08530M26630M10898M26142M47107L78346q5707L61264M55186
14370A7151133P3364L61563J40303N07122O36967M47791N53912J40416L97179
14361B0409750K36429N54577O81788K86600N34519K74181O51318M95485N76892
14352B4701539O03163P92598K63655O47944Q85530P66041N77079R74520L53316
14343C0565385Q58527J066308M80953J189611Q93294P29409R61443J194741Q05148
14334C8744819J007668J267930J517435J089545R03569J446932J696398J281336
14326D8955632J368278J800635J755653J751413J371049K348450J846640J867830
14318F3065580K157729K550355K202942K432855K887770K986009K966543K916009
$$ plain form
14310 84165792 87418704 91192366 94749393 98899478 102959425 107251668 112008061 117013076
14302 117013076 122259868 127790155 133557261 140071868 146183420 154120325 161481066 169028108
14294 169028108 177541381 186476080 195889580 205875436 216364695 227562841 239279260
14287 239279260 251341162 264164921 277284501 291168023 305157483 319827535 334806431
14280 334806431 349733533 364697803 379431177 393686923 407206069 419463866 430025226
14273 430025226 436651135 438116237 438374918 438434653 442657431 439705577 436579111 429990186
14265 429990186 422035361 412809495 402173499 390408621 377262702 362560679 347005249
14258 347005249 331577394 315639287 300439986 285134720 270946515 257806744 244355258
$$ packed form
14310H4165792L252912L773662L557027M150085M059947M292243M756393N005015
14302A17013076N246792N530287N767106O514607O111552P936905P360741P547042
14294A69028108Q513273Q934699R413500R985856J0489259J1198146J1716419
14287B39279260J2061902J2823759J3119580J3883522J3989460J4670052J4978896
14280C34806431J4927102J4964270J4733374J4255746J3519146J2257797J0561360
14273D30025226O625909J465102K58681N9735M222778k951854l126466o588925
14265D29990186p954825r225866j0635996j1764878j3145919j4702023j5555430
14258C47005249j5427855j5938107j5199301j5305266j4188205j3139771j3451486
$$ plain form
14251 244355258 231398932 219687137 208103264 197693810 187528002 177971067 168929738
14244 168929738 160975047 153412677 145380459 138664914 132118098 125511095 120748052 115217890
14236 115217890 109804952 104672580 100393168 95860054 92058377 88875112 85098548 81403172
14228 81403172 78117721 74921511 72082125 69234369 67015313 64398716 62090303 59750905
14220 59750905 57813903 55818354 53674456 52155159 50293272 48649264 47009741 46060308
14212 46060308 44609722 42727582 41823273 40295453 38929362 38367431 37338786 35979862
14204 35979862 34840064 34003788 32838181 32309551 31607310 30560592 29525164 28965710 27796516
14195 27796516 27193539 26823530 26473596 25383411 24923930 24114511 23515759 22855112 22489231
$$ packed form
14251B44355258j2956326j1711795j1583873j0409454j0165808r556935r041329
14244A68929738p954691p562370q032218o715545o546816o607003m763043n530162
14236A15217890n412938n132372m279412m533114l801677l183265l776564l695376
14228H1403172l285451l196210k839386k847756k219056k616597k308413k339398
14220E9750905j937002j995549k143898j519297j861887j644008j639523r49433
14212D6060308j450586j882140r04309j527820j366091n61931j028645j358924
14204C5979862j139798q36276j165607n28630p02241j046718j035428n59454j169194
14195B7796516o02977l70009l49934j090185m59481q09419n98752o60647l65881
$$ plain form
14186 22489231 22199559 21793079 21242272 20507538 20416608 19331418 19109282 18689635 18561411
14177 18561411 18383015 17866517 17545423 16965421 16653071 16409550 15912068 15686251 15474403
14168 15474403 15252497 14983829 14563604 14339770 14179316 13758794 13411958 13436062 13182857
14159 13182857 12942430 12716933 12677136 12375923 12230716 12086769 11392228 11265814 11042185
14150 11042185 10716829 10913697 10500453 10298699 10145025 9998531 10200953 9913120 9866544
14141 9866544 9416815 9188540 9340562 9024604 8720554 8668327 8619065 8605045 8421498 8292891
14131 8292891 8265777 8303257 7965230 7472313 7905130 7709613 7600069 7409323 7176275 7415596
14121 7415596 7140820 6919395 6952089 6869808 6849289 6382372 6670933 6462706 6832472 6447848
$$ packed form
14186B2489231k89672m06480n50807p34734r0930j085190k22136m19647j28224
14177A8561411j78396n16498l21094n80002l12350k43521m97482k25817k11848
14168A5474403k21906k68668m20225k23834j60454m20522l46836K4104k53205
14159A3182857k40427k25497l9797l01213j45207j43947o94541j26414k23629
14150A1042185l25356J96868m13244k01754j53674j46494K02422k87833m6576
14141I866544m49729k28275J52022l15958l04050n2227m9262j4020j83547j28607
14131H292891k7114L7480l38027m92917M32817j95517j09544j90746k33048K39321
14121G415596k74776k21425L2694q2281k0519m66917K88561k08227L69766l84624
$$ plain form
14111 6447848 6224759 6210233 6318732 6227142 6138735 5641423 5833943 6361121 5780916 5920635
14101 5920635 5485447 5538566 5619038 5519408 5588367 5255702 5038598 5160671 5003846 4886595
14091 4886595 4901822 4926456 5012481 4788912 4781180 4869917 4436752 4161158 4649559 4424041
14081 4424041 4593570 4406875 4363517 4347788 4184888 4076669 3854157 4227108 4182212 4140955
14071 4140955 3909618 3722463 3696471 3849532 3876219 3563706 3843954 3417312 3689617 3512578
14061 3512578 3786290 4377076 3882593 3378514 3351141 3799732 3291533 3409404 3020065 3056602
14051 3056602 3286387 3432534 3075691 2988403 3049523 3077146 3710971 3166461 3037086 3071662
14041 3071662 2934053 2951026 2902448 2750006 2879156 2930603 2607063 2766701 2870653 3039577
$$ packed form
14111F447848k23089j4526J08499r1590q8407m97312J92520N27178n80205J39719
14101E920635m35188N3119Q0472r9630O8959l32665k17104J22073j56825j17251
14091D886595J5227K4634Q6025k23569p732Q8737m33165k75594M88401k25518
14081D424041J69529j86695m3358j5729j62900j08219k22512L72951m4896m1257
14071D140955k31337j87155k5992J53061K6687l12513K80248m26642K72305j77039
14061C512578K73712N90786m94483n04079k7373M48591n08199J17871l89339L6537
14051C056602K29785J46147l56843q7288O1120K7623O33825n44510j29375L4576
14041C071662j37609J6973m8578j52442J29150N1447l23540J59638J03952J68924
$$ plain form
14031 3039577 2934581 2918585 2989448 2636395 2802094 2350651 2559070 2597075 2617813 2378306
14021 2378306 2426978 2334464 2334156 2201173 2502238 2253768 2155939 2031049 2097709 2141234 2258510
14010 2258510 2326082 2130233 2157118 2048365 2317386 1912977 2029553 2019640 1895926 1775332
14000 1775332 1788710 1961662 1507690 1795740 1990784 1625418 1651880 2068517 1792033 2255721
13990 2255721 1963764 3207968 6381040 13399072 28368401 43910513 25102270 11979081
13981 7474586 5234383 4519175 4094945 3497883 2873551 2448612 2611074 2680427 2521600
13972 2521600 2354965 2210087 2332233 2499673 2294344 2179569 2284148 2159465 2018517
13963 2018517 2026843 2140294 1675454 2104858 1404967 1699609 1681597 1748951 1769906 1915657
$$ packed form
14031C039577j04996j5996P0863l53053J65699m51443K08419L8005K0738k39507
14021B378306M8672r2514l08j32983L01065k48470r7829j24890O6660M3525J17276
14010B258510O7572j95849K6885j08753K69021m04409J16576r913j23714j20594
14000A775332J3378J72952m53972K88050J95044l65366K6462M16637k76484M63688
13990B255721k91957J244204L173072P018032J4969329J5542112j8808243A1979081
13981G474586k240203p15208m24230n97062o24332m24939J62462O9353j58827
13972B521600j66635j44878J22146J67440k05329j14775J04579j24683j40948
13963B018517Q326J13451m64840M29404o99891K94642j8012O7354K0955J45751
$$ plain form
13953 1915657 1852121 1645458 1716005 1583033 1478453 1746767 1865615 1389023 1500480 1483354
13943 1483354 1717441 1463042 1747643 1828330 1727183 1666972 1393370 1534025 1570056 1404680
13933 1404680 1476891 1551040 1488439 1617898 1311908 1471214 1398032 1561996 1506562 1503671 1378900
13922 1378900 1363489 1484498 1215348 1411766 1401564 1191809 1131723 1655939 1494080 1463251
13912 1463251 1650765 1519472 1411223 1104655 1257808 1448227 1023626 1208072 752136
13903 752136 1238060 1312161 1580967 1220178 1198959 1218152 1224802 1266942 1323771 1294395 1000779
13892 1000779 1332134 1402958 1004209 783283 781703 1413483 1254120 1332903 1385530 1189726
13882 1189726 1073628 1340729 1121208 1086582 1155244 1093687 985280 937033 848569 1208551
$$ packed form
13953A915657o3536k06663P0547j32972j04580K68314J18848m76592J11457j7126
13943A483354K34087k54399K84601Q0687j01147o0211k73602J40655L6031j65376
13933A404680P2211P4149o2601J29459l05990J59306p3182J63964n5434k891j24771
13922A378900j5411J21009k69150J96418j0202k09755o0086N24216j61859l0829
13912A463251J87514j31293j08249l06568J53153J90419m24601J84446m55936
13903G52136M85924P4101K68806l60789k1219J9193O650M2140N6829k9376k93616
13892A000779L31355P0824l98749k20926j580O31780j59363P8783N2627j95804
13882A189726j16098K67101k19521l4626O8662o1557j08407m8247q8464L59982
$$ plain form
13872 1208551 1017603 962271 1120067 1093991 861691 779264 1055571 911582 1119620 1103580
13862 1103580 1021500 1009403 1104265 770174 829179 970915 1139893 580071 853359 1064087
13852 1064087 843907 871906 1048498 1125221 896672 786219 1117122 747907 1328527 820374
13842 820374 931054 764381 901004 953884 981547 716339 710545 710366 913485 824594 825150
13831 825150 907247 832578 799424 949811 1051105 806679 523460 967490 899991 563473
13821 563473 871824 736471 697905 612744 1034885 768942 665795 760150 531825 1144291
13811 1144291 887449 826176 799169 849137 660544 669446 784749 649178 773461 958541
13801 958541 855334 764218 744431 587089 783472 844512 713352 378798 839655 694812
$$ packed form
13872A208551j90948n5332J57796k6076k32300q2427K76307j43989K08038j6040
13862A103580q2080j2097R4862l34091N9005J41736J68978n59822K73288K10728
13852A064087k20180K7999J76592P6723k28549j10453L30903l69215N80620n08153
13842H20374J10680j66673J36623N2880K7663k65208n794j79K03119q8891N56
13831H25150Q2097p4669l3154J50387J01294k44426k83219M44030o7499l36518
13821E63473L08351j35353l8566q5161M22141k65943j03147R4355k28325O12466
13811A144291k56842o1273k7007M9968j88593Q902J15303j35571J24283J85080
13801I58541j03207r1116j9787j57342J96383O1040j31160l34554M60857j44843
$$ plain form
13791 694812 795974 451540 459345 660046 634376 699219 313564 657724 826171 697361
13781 697361 965342 825136 603043 666622 646340 508061 695664 639113 417267 724989
13771 724989 456807 551129 1073215 321347 655422 599193 483883 573794 736963 607594
13761 607594 467104 333547 679400 595201 618790 375063 320713 549434 667878 386425
13751 386425 631246 300816 414036 737218 683878 992671 442587 611261 393943 429703
13741 429703 749606 549091 453015 696714 765098 546407 476829 592492 868235 317050
13730 610182 385352 388939 376345 436221 325887 468879 416982 423467 563117 591333 114310
13718 309024 353812 575965 561423 400995 670746 359837 671777 427418 771691 571269
$$ packed form
13791F94812J01162l44434P805K00701k5670O4843C13564L44160J68447j28810
13781F97361K67981j40206k22093O3579k0282j38279J87603n6551k21846L07722
13771G24989k68182R4322N22086C21347L34075n6229j15310Q9911J63169j29369
13761F07594j40490j33557L45853q4199K3589k43727n4350K28721J18444k81453
13751C86425K44821C00816J13220L23182n3340L08793D42587J68674k17318L5760
13741D29703L19903k00515r6076K43699O8384k18691o9578J15663K75743C17050
13730F10182k24830L587j2594N9876j10334J42992n1897O485J39650K8216A14310
13718C09024M4788K22153j4542j60428K69751l10909L11940k44359L44273k00422
$$ plain form
13708 571269 479500 514024 298957 331713 582970 617241 444402 441886 356889 409107 552239
13697 552239 365142 86775 495816 270828 119325 282406 30134 625796 272242 471267
13687 471267 188107 268095 629814 666870 697457 408779 317312 484864 428989 521637 372522
13676 372522 609558 281670 491926 587582 543012 240526 627558 488300 374202 391847
13666 391847 365971 286568 538945 604386 185142 523192 454322 26135 260981 413630
13656 413630 699992 195498 376039 302764 266139 242179 390432 445497 356942 318747 253345
13645 253345 236187 197549 298463 707949 578599 594809 44481 364905 598957 555242
13635 555242 131740 460211 556583 377890 457353 359198 121736 270898 319965 499267
$$ packed form
13708E71269r1769L4524k15067L2756K51257L4271j72839k516q4997N2218J43132
13697E52239j87097H6775M09041k24988A19325J63081C0134N95662B72242J99025
13687D71267A88107P9988L61719L7056L0587k88678r1467J67552n5875R2648j49115
13676C72522K37036B81670K10256R5656m4570B40526L87032j39258j14098J7645
13666C91847k5876p9403K52377O5441A85142L38050o8870B6135K34846J52649
13656D13630K86362A95498J80541p3275l6625k3960J48253N5065q8555l8195o5402
13645B53345j7158l8638J00914M09486j29350J6210D4481L20424K34052m3715
13635E55242A31740L28471R6372j78693P9463r8155A21736J49162M9067J79302
$$ plain form
13625 499267 478155 -10794 185709 291607 405498 357391 224072 144220 512663 266334
13615 266334 291614 58175 121375 251334 554909 321390 260585 315134 96361 160061 582785
13604 582785 335705 383560 643375 344557 222324 194911 515753 141050 -23090 333235
13593 307024 291233 273674 433301 386395 440059 255921 596398 247704 350347 22554
13582 301437 94990 386262 484193 677219 382218 250938 292070 175576 237674 609419
13572 609419 270279 169107 341647 388760 415103 159839 574878 -114337 467989 357338
13562 357338 201009 290010 -78351 185537 111788 307228 355887 163241 630582 450540
13552 450540 389775 141446 238130 452890 19573 326103 136572 342705 270944 236675
$$ packed form
13625D99267k1112a0794A85709J05898J13891m8107j33319p9852L68443k46329
13615B66334K5280E8175O3200J29959L03575k33519o0805N4549I6361O3700M22724
13604E82785k47080M7855K59815k98818j22233k7413L20842A41050b3090C33235
13593C07024j5791j7559J59627m6906N3664j84138L40477B47704J02643B2554
13582C01437I4990K91272R7931J93026k95001j31280M1132j16494O2098L71745
13572F09419B70279j01172J72540M7113K6343A59839M15039a14337D67989j10651
13562C57338j56329Q9001g8351A85537p3749J95440M8659A63241M67341j80042
13552D50540o0765A41446R6684K14760A9573L06530A36572K06133p1761l4269
$$ plain form
13542 236675 141410 113990 74074 149521 -5869 391706 62640 -120845 268856 46795 260463
13531 260463 88957 351695 18730 64887 56103 349250 465265 393092 417234 290014 515447
13520 515447 390690 -35314 396134 -86235 629077 -102275 279628 216801 391859 180909
13509 -92436 334236 218384 265132 455810 26733 544258 390057 450324 -135554 235895
13498 330389 156496 362580 78136 473053 -28942 304077 170372 48697 142829 126895
13488 126895 13878 102333 244909 121741 272400 309229 465120 434198 127782 236842
13478 236842 345227 -36524 481158 359952 199064 -68706 308834 63093 -73434 335915
13467 154074 198563 406932 453022 690996 206685 275994 125762 396346 26196 150312
$$ packed form
13542B36675r5265k7420l9916P5447e869C91706F2640a20845B68856D6795K13668
13531B60463H8957K62738A8730M6157q784K93147J16015p2173K4142j27220K25433
13520E15447j24757c5314C96134h6235F29077a02275B79628o2827J75058A80909
13509i2436C34236j15852M6748J90678B6733N17525j54201O0267a35554B35895
13498C30389A56496K06084G8136L94917b8942C04077j33705D8697R4132j5934
13488A26895A3878Q8455J42576A21741J50659L6829J55891l0922A27782J09060
13478B36842J08385c6524D81158j21206j60888f8706C08834F3093g3434C35915
13467A54074M4489K08369M6090K37974B06685O9309A25762K70584B6196J24116
$$ plain form
13457 150312 87068 -169300 173771 394131 257978 216467 120986 188275 52244 27506 84864
13446 84864 35608 168702 73349 314165 200806 303674 253132 58017 121666 174919 47137
13434 185057 207249 156484 53493 130539 74874 175199 101601 187906 192215 142451 213220
13423 213220 -72932 158140 398230 312634 -117213 337746 284278 207704 412008 -203386
13412 234482 179422 120844 41546 208399 55568 120977 176347 296526 330743 5256 -16924
13400 80271 323671 113134 305712 335822 267546 249815 -7953 -80787 360248 70532 273306
13389 273306 223892 111749 34207 -242847 282760 201138 -8137 188131 196251 -213530 309436
13377 157050 127461 355930 524234 194186 266053 280614 173562 177141 268436 132691 171788
$$ packed form
13457A50312o3244a69300A73771K20360j36153m1511r5481O7289E2244k4738N7358
13446H4864C5608J33094G3349K40816j13359J02868n0542E8017O3649N3253D7137
13434A85057K2192n0765E3493P7046n5665J00325p3598Q6305M309m9764P0769
13423B13220g2932A58140K40090q5596a17213C37746n3468p6574K04304b03386
13412B34482n5060n8578D1546J66853E5568O5409N5370J20179L4217E256a6924
13400H0271K43400A13134J92578L0110o8276j7731g953p2834C60248G0532K02774
13389B73306m9414A11749C4207b42847B82760q1622h137A88131Q120b13530C09436
13377A57050k9589K28469J68304A94186P1867J4561j07052L579R1295A32691L9097
$$ plain form
13366 171788 231962 506390 232315 -69429 107859 67418 206971 -8965 -105652 41690 70076
13355 70076 230500 561268 -76239 -58951 105374 374881 530715 128975 246605 62502
13344 4305 268814 255679 362695 94469 143145 341854 180409 53949 429738 225219 -20317
13332 222466 345637 490224 107191 109229 -11631 -256832 62851 -72768 96508 100058 242834
13321 242834 407962 131106 338761 167728 175783 249409 351114 95635 150709 107876 101212
13310 101212 194434 49029 2740 190187 -266036 114566 105658 212651 541655 60544 180167
13299 180167 72534 19352 -12662 137728 181717 42222 -42932 -196370 -61151 320494 231065
13288 231065 215579 177954 10017 -96156 113625 -92222 401970 1670 209070 -83799 -213059
$$ packed form
13366A71788O0174K74428B32315f9429A07859m0441J39553h965r6687D1690K8386
13355G0076J60424L30768g6239J7288A05374K69507J55834A28975J17630F2502
13344D305K64509j3135J07016I4469M8676J98709j61445E3949L75789k04519b0317
13332B22466J23171J44587A07191K038a1631k45201F2851g2768I6508L550J42776
13321B42834J65128A31106K07655A67728Q055P3626J01705I5635N5074m2833o664
13310A01212R3222D9029B740J87447b66036A14566q908J06993L29004F0544J19623
13299A80167G2534A9352a2662A37728M3989D2222d2932j53438f1151C20494q9429
13288B31065j5486l7625A0017i6156A13625i2222D01970A670K07400h3799j29260
$$ plain form
13277 -213059 156150 161033 125986 -272273 -137405 106749 420245 105350 328296 142415
13266 247707 322806 36121 89603 110958 239572 -106968 83867 56870 362823 73436 -44708
13254 -159080 254037 -115975 89992 -143998 8381 102779 80173 8969 72238 200999 -41682
13242 362651 90185 -237626 442103 -11285 117316 117853 249750 -143988 117656 46564 150473
13231 150473 17735 16210 -52661 12081 246029 439740 270756 -341957 -46727 -13732 176079
13219 -267689 -87132 275546 35027 502651 474524 161791 459958 105196 325489 -186727
13208 57514 144956 57880 61771 319574 -94333 127807 250220 -121605 328679 62502 -97222
13196 96255 229015 246970 160777 168331 -215324 242325 453821 -247300 36803 276742 197550
$$ packed form
13277b13059A56150M883l5047b72273J34868A06749L13496A05350K22946A42415
13266B47707P5099C6121N3482K1355J28614a06968H3867k6997L05953G3436d4708
13254a59080B54037a15975H9992a43998H381R4398k2606H969O3269J28761d1682
13242C62651I0185b37626D42103a1285A17316N37J31897a43988A17656D6564J03909
13231A50473A7735j525e2661A2081K33948J93711j68984c41957d6727a3732A76079
13219b67689h7132B75546C5027M67624k8127A61791K98167A05196K20293a86727
13208E7514Q7442E7880L891K57803i4333A27807J22413a21605C28679F2502i7222
13196I6255J32760J7955q6193P554b15324B42325K11496b47300C6803K39939p9192
$$ plain form
13185 197550 89341 -118704 139205 302146 501755 120749 -100697 -265696 639892 149801
13174 216409 92580 29108 -81176 -41978 -144984 135538 81029 110911 166380 259122 91668
13162 14581 101526 30780 -196162 211275 -276475 329090 -74534 122377 -194969 263890
13151 42030 42923 -168607 -125431 5150 -331007 -65907 -336138 -193515 312181 -50855 -1766
13139 170398 -49791 219253 107534 -119961 -171293 339784 278700 -140420 103312 -234667
13128 71855 173037 147852 152634 200839 119165 -30058 75602 250034 -9878 158482 -75471
13116 64594 44491 167707 128659 111593 34900 -58447 139368 -257118 87033 206725 -185150
13104 -149108 -210181 58748 142996 -22910 165647 -169113 -125677 113968 31025 85292 -344299
$$ packed form
13185A97550H9341a18704A39205J62941J99609A20749a00697j64999F39892A49801
13174B16409I2580B9108h1176L9198j03006A35538n4509K9882N5469R2742I1668
13162A4581Q6945C0780a96162B11275b76475C29090g4534A22377a94969B63890
13151D2030Q93a68607M3176E150c31007f5907k70231J42623C12181e0855a766
13139A70398d9791B19253A07534a19961n1332C39784o1084a40420A03312b34667
13128G1855J01182k5185M782M8205q1674c0058G5602J74432i878A58482g5471
13116F4594k0103J23216l9048j7066C4900e8447A39368b57118H7033J19692a85150
13104a49108o1073E8748Q4248b2910A65647a69113M3436A13968C1025N4267c44299
$$ plain form
13092 73986 51219 -66820 244416 163010 115160 -79791 -241601 53279 268224 -83756 144782
13080 -115488 -111639 -113847 -107425 -83709 -34328 224703 30706 -139543 245295 379373 256159
13069 256159 -263980 234147 314163 247787 207713 26336 -141951 573744 83905 178479 335152
13058 335152 227389 160612 72656 88846 196443 198243 254816 24972 233576 69612 65130
13047 65130 122742 93600 241544 -115458 10292 -114431 -75730 -89824 267410 17276 33690
13036 33690 -234567 60409 -111509 240807 84965 343329 298838 408799 194573 15240
13025 -103933 -34673 250118 -103197 -131116 196875 247007 -109389 163928 131574 282152
13015 282152 337100 96690 -267187 -16421 27270 -128772 269831 -274455 69284 180395
$$ packed form
13092G3986k2767f6820B44416q1406m7850g9791j61810E3279K14945h3756A44782
13080a15488L849k208O422K3716c4328B24703C0706a39543B45295J34078j23214
13069B56159b63980B34147Q0016o6376m0074B6336a41951E73744H3905R4574J56673
13058C35152j07763o6777G2656J6190J07597J800N6573B4972K08604F9612m482
13047F5130N7612k9142J47944a15458A0292a14431L8701j4094B67410A7276J6414
13036C3690b34567F0409a11509B40807H4965K58364m4491J09961A94573A5240
13025a03933c4673B50118a03197k7919A96875N0132a09389A63928l2354J50578
13015B82152N4948I6690b67187a6421B7270a28772B69831b74455F9284J11111
$$ plain form
13005 180395 197547 62066 29498 -86534 142172 77965 -123778 -278302 262294 -55845 104311
12993 -63505 -77245 121802 86518 -189098 -99673 100234 64896 32558 -34076 -215294 -20169
12981 -49737 -67504 224054 -65533 249454 -8023 -62390 -191128 -61805 -128094 53607 186765
12970 186765 22157 -225427 -77645 16088 184805 64765 -146729 98256 225198 24216 177443
12959 177443 -136946 43391 95948 204176 203272 -96437 -37050 -249340 -101768 402041 78597
12947 83324 168763 -66930 485310 -10914 39698 -317868 248487 -61549 288217 110351 67664
12936 67664 -171748 230194 241393 -51380 218505 -57551 -49384 -177057 182642 -171905 -135744
12925 -135744 276567 -154948 9981 41260 -28677 136988 232275 -128752 121170 -313816
$$ packed form
13005A80395J7152F2066B9498h6534A42172o4207a23778j54524B62294e5845A04311
12993f3505j3740A21802l5284a89098Q9425A00234l5338l2338c4076j81218b0169
12981d9737j7767B24054f5533B49454h023n4367j28738f1805o6289E3607J33158
12970A86765B2157b25427g7645A6088J68717F4765a46729I8256J26942B4216J53227
12959A77443a36946D3391N2557J08228r04i6437c7050k12290a01768D02041G8597
12947H3324Q5439f6930D85310a0914C9698c17868B48487f1549B88217A10351m2687
12936F7664a71748B30194J1199e1380B18505e7551Q167j27673A82642a71905L6161
12925a35744B76567a54948I981L1279b8677A36988R5287a28752A21170c13816
$$ plain form
12914 32266 200425 41426 241326 15020 330458 26087 6069 -130797 226052 211456 74651
12902 207409 -98277 314149 -154140 -142628 22309 13042 -301224 -120076 83480 -174751 119112
12890 115990 72683 83740 169408 -208923 318189 -77126 -206238 -65289 75693 473792 -228383
12878 -84076 51570 -184052 280220 287406 75217 -256990 85802 -68267 47332 -329102 87796
12866 201096 -192529 80328 157687 -6670 74814 119380 -8254 218373 -107307 130040 -78074
12854 -249959 18067 -208189 -129172 -260841 -53376 -194316 127297 11892 233111 -36371
12843 -185188 71415 393504 -274689 -33243 38652 256295 205086 -95945 -115428 60929 74586
12832 74586 138511 96774 241099 -141936 -327862 -314675 115103 -157435 86601 112521 289040
$$ packed form
12914C2266J68159D1426J99900A5020L15438B6087F069a30797B26052j4596G4651
12902B07409i8277C14149a54140J1512B2309r267c01224a20076H3480a74751A19112
12890A15990m3307J1057Q5668b08923C18189g7126j29112f5289G5693L98099b28383
12878h4076E1570a84052B80220P186G5217b56990H5802f8267D7332c29102H7796
12866B01096a92529H0328P7359f670G4814M4566h254B18373a07307A30040g8074
12854b49959A8067b08189P9017j31669e3376j40940A27297A1892K21219c6371
12843a85188G1415L22089b74689c3243C8652K17643n1209i5945j9483F0929J3657
12832G4586O3925m1737J44325a41936j85926J3187A15103a57435H6601K5920J76519
$$ plain form
12821 289040 73774 124610 -186919 17981 57617 125682 187336 -109879 130992 226344 38416
12809 40211 58168 25966 129345 123014 21655 -163175 -47762 -10313 -189470 -61522 17353
12797 358035 -50230 -128368 243042 115974 469662 -200574 16344 332113 16454 -140435
12786 -176699 -475409 -23257 134269 154765 203133 -42092 -78080 154798 119667 167951 187253
12775 187253 -163585 124730 -758 73205 -227494 -204123 159313 -82874 231668 54519 437782
12764 437782 64138 80555 221149 -63201 32993 -494371 -134837 -273255 -190105 432932
12753 -464569 486984 -177141 -469789 4426 -201314 -131580 -265938 123171 -117932 -89792
12743 -89792 -196274 204826 -179434 205995 105453 504 -138015 147619 192573 -47601 -141674
$$ packed form
12821B89040G3774N0836a86919A7981L9636O8065O1654a09879A30992R5352C8416
12809D0211J7957B5966J03379o331B1655a63175d7762a0313j79157f1522A7353
12797C58035e0230p8138B43042A15974L53688b00574A6344L15769A6454a40435
12786a76699k98710b3257A34269K0496M8368d2092l5988A54798l5131M8284J9302
12775A87253a63585A24730g58G3205b27494K3371A59313h2874B31668E4519L83263
12764D37782F4138J6417J40594f3201C2993d94371a34837j38418Q3150D32932
12753d64569D86984a77141k92648D426b01314O9734j34358A23171a17932K8140
12743h9792j06482B04826a79434B05995j00542E04a38015A47619M4954d7601r4073
$$ plain form
12732 -141674 405438 187027 -23570 -73102 31454 -254162 23799 469618 64411 -13523 56671
12720 8018 -337115 43658 -82641 55001 -288056 -217512 -11862 -10888 95030 57394 282351 -46826
12707 265700 430230 451179 312934 194606 16910 245559 194725 124708 25307 -94264 -102115
12696 -102115 -50652 -112093 323772 198566 -9945 6139 -8379 154949 -71380 -40056 34583
12684 44391 -4086 17081 257801 159157 37901 -138220 71308 158796 378506 -32488 -33311 394493
12671 49417 187481 -75537 -213595 82251 52688 157304 7282 198524 28596 -53161 -234698
12660 -234698 27205 49527 249883 -198534 -187360 234462 180601 -37047 -218493 22561 476951
12649 476951 -57172 272701 64691 344342 271434 -12381 -55101 242474 -46358 -107373 -126002
$$ packed form
12732a41674D05438A87027b3570m9532C1454b54162B3799M45819F4411a3523E6671
12720H018c37115D3658h2641E5001b88056P0544a1862R74I5030l7636K24957d6826
12707B65700J64530K0949j38245j18328A6910K28649n0834p0017B5307i4264p851
12696a02115e0652o1441C23772j25206i945F139h379A54949g1380L1324C4583
12684D4391d086A7081K40720r8644C7901a38220G1308Q7488K19710c2488q23C94493
12671D9417J38064g5537j38058H2251k9563J04616G282J91242B8596e3161j81537
12660b34698B7205K2322K00356a98534J1174B34462n3861c7047j81446B2561M54390
12649D76951e7172B72701F4691K79651p2908a2381m2720B42474d6358o1015j8629
$$ plain form
12638 -126002 -348241 -299791 -36079 -152635 -209007 -21142 -373591 95395 296072 -11658 66739
12626 232659 156197 145391 62873 253262 105409 57396 -10138 84093 423926 -236983 -232252
12615 -232252 -53120 233556 284190 -61990 179638 -49969 180466 162391 42701 159276 53822
12603 73697 40778 28245 -228814 -15414 138097 -78215 -146116 -166508 -174867 -63572 -80840
12592 -80840 58213 570984 -207196 -169635 -13327 -10837 43816 -71602 261289 217362 -21395
12580 -111769 -84353 205331 82296 347540 -7384 -289759 -327504 34958 -98701 -145378 53235
12568 -61930 -135366 168924 236955 -54423 -30754 134335 -163621 -45179 -208025 10127 226804
12557 226804 39919 156097 195766 145181 -161489 264185 -97997 -353141 -68650 282725
$$ packed form
12638a26002k22239M8450c6079j16556n6372b1142l52449I5395K00677a1658F6739
12626B32659p6462j0806F2873J90389A05409m8013a0138H4093L39833b36983M731
12615b32252e3120B33556N0634f1990A79638d9969A80466j8075D2701J16575E3822
12603G3697l2919j2533b28814a5414A38097g8215o7901k0392q359f3572j7268
12592h0840E8213N12771b07196L7561a3327K490D3816g1602B61289m3927b1395
12580a11769K7416B05331H2296K65244g384k82375l7745C4958i8701m6677E3235
12568f1930p3436A68924O8031e4423K3669A34335a63621d5179j62846A0127K16677
12557B26804C9919J16178L9669n0585a61489B64185i7997k55144f8650B82725
$$ plain form
12546 -51070 -26597 235678 194561 277688 -255885 191882 -30400 -135764 -153339 208001 -304055
12534 107879 -20007 103598 10224 -110550 -4033 -195724 -71290 60233 35963 -179905 245079
12522 -134604 317810 -71399 98891 -110403 72595 268944 152883 106494 35131 198723
12512 198723 -113785 196622 457203 8384 63799 123661 -101755 -119831 520198 -334129
12501 -214909 -97885 45515 96053 199102 146105 -85394 253933 -267645 -61878 -60417 -303129
12490 -303129 333258 -21351 -21945 -65433 190790 -115157 221461 -97381 24885 14462 -94584
12478 237514 172001 8283 -222759 -90145 -353925 -127398 -240427 -123502 69976 -76361 54471
12466 -66201 -3664 -75221 76936 19753 -224174 27757 26191 -43350 296941 -140265 -251351
$$ packed form
12546e1070K4473B35678m1117Q3127b55885A91882c0400j05364j7575B08001c04055
12534A07879b0007A03598A0224a10550d033j91691g1290F0233k4270a79905B45079
12522a34604C17810g1399I8891a10403G2595J96349j16061m6389C5131J63592
12512A98723a13785A96622K60581H384N5415N9862a01755j8076E20198c34129
12501b14909i7885D5515N0538J03049n2997h5394B53933b67645f1878J461k42712
12490c03129C33258b1351n94m3488A90790a15157B21461i7381B4885j0423i4584
12478B37514o5513H283b22759i0145k63780a27398j13029J16925F9976g6361E4471
12466f6201c664p1557G6936A9753b24174B7757j566d3350B96941a40265j11086
$$ plain form
12455 -251351 -131376 -167746 153152 -233606 -43681 -320622 130176 -125929 -142 -62746 -11725
12443 -240656 98535 -181171 135925 -137916 25428 -426196 220196 -159262 111520 -275800
12432 -245340 -82789 100282 -105788 -311541 -314538 114156 11838 -110072 -183732 112862
12421 214176 -67693 -2999 -109286 43591 103295 -496292 56339 247637 342835 163455 -91023
12409 -1980 -96644 -214198 -79567 240658 29590 43181 307583 187913 -69738 -107321 -205343
12398 -205343 52241 -312531 142290 -123681 133068 250930 217528 -114168 60056 173842
12388 173842 124647 48255 -94421 -104649 78016 -126869 442179 79932 284937 -89805 41725
12376 172499 -146694 1535 8167 -227229 -11356 294985 -214474 23719 -230931 166019 -43045
$$ packed form
12455b51351J19975l6370A53152b33606d3681k76941A30176a25929a42o2604a1725
12443b40656I8535a81171A35925a37916B5428d26196B20196a59262A11520b75800
12432b45340h2789A00282a05788k05753k997A14156A1838a10072p3660A12862
12421B14176f7693b999j06287D3591N9704d96292E6339J91298R5198A63455i1023
12409a980r4664j17554g9567B40658B9590J3591K64402j19670f9738l7583r8022
12398b05343E2241c12531A42290a23681A33068J17862l3402a14168F0056J13786
12388A73842m9195D8255i4421j0228G8016a26869D42179G9932K05005h9805D1725
12376A72499a46694A535O632b27229a1356B94985b14474B3719b30931A66019d3045
$$ plain form
12364 153401 -273643 263047 -182960 17435 874 71259 -100912 37153 -62871 376101 -118155
12352 40939 -174158 -38811 296251 -340720 81942 225192 281006 -240342 121308 -466 -69187
12341 -69187 157041 -295564 -79748 130564 87546 260706 4472 -2654 -201253 310231 220114
12330 220114 425845 -117685 231220 -45570 -290337 19789 -10788 106362 -2856 50347 -93954
12318 262252 78125 -43078 -128915 -5357 200252 5981 116872 467881 -75775 -243977 210404
12306 -85754 -211438 -115689 -110887 -134661 71285 122260 -23120 12759 -85577 -138274 22292 -209437
12293 -141741 214822 -2622 146551 96135 -281481 86988 127800 -224665 116147 -9645 8346
12281 229994 -17244 199307 -117589 -18123 71886 32842 292288 230599 -56352 -93651 106169
$$ packed form
12364A53401b73643B63047a82960A7435H74P0385a00912C7153f2871C76101a18155
12352D0939a74158c8811B96251c40720H1942J43250N5814b40342A21308d66o8721
12341f9187A57041b95564g9748A30564m3018J73160D472b654j98599C10231r0117
12330B20114K05731a17685B31220d5570k44767A9789a0788A06362b856E0347i3954
12318B62252G8125d3078q5837e357B00252E981J10891L51009g5775j68202B10404
12306h5754j25684R5749M802k3774G1285N0975b3120A2759h5577n2697B2292b09437
12293a41741B14822b622A46551n0416b81481H6988M0812b24665A16147i645H346
12281B29994a7244A99307a17589a8123G1886C2842K59446o1689e6352l7299A06169
$$ plain form
12269 153574 193210 61136 144688 -11786 -139687 416819 124622 27293 -69637 145070 34156
12257 97064 592181 131175 273639 -145019 -49138 135709 -41522 100023 144967 480082
12247 480082 -502489 -132182 -282530 126994 100445 88836 -142726 -53227 -31715 282186
12236 -23936 152941 191467 79747 424927 61793 109654 298601 358288 -31747 159790 282097
12225 282097 59675 90228 265111 -32926 161644 320104 304462 374682 -179993 350500
12214 420425 11639 42655 -19315 194895 96575 -159293 119630 156986 409505 -190506
12203 295444 -170988 261895 78980 302325 368981 325419 560499 -122687 167970 -32914
12192 472657 72564 196617 98220 247324 377077 193659 -40894 -42495 -58297 97565 27908
$$ packed form
12269A53574L9636F1136Q3552a1786j27901D16819A24622B7293f9637A45070C4156
12257I7064M95117A31175J42464a45019d9138A35709d1522A00023M4944L35115
12247D80082e02489a32182j50348A26994k6549j1609a42726e3227K1512B82186
12236b3936A52941L8526G9747L45180F1793M7861J88947N9687c1747A59790J22307
12225B82097E9675L0553J74883c2926A61644J58460j5642P0220a79993C50500
12214D20425A1639L1016a9315A94895I6575a59293A19630L7356K52519a90506
12203B95444a70988B61895G8980K23345O6656m3562K35080a22687A67970c2914
12192D72657G2564J24053I8220J49104J29753j83418d0894j601j5802I7565B7908
$$ plain form
12180 177479 -8194 -44764 167791 159383 65198 311787 22310 438228 210140 67739 -211546
12168 381658 135253 -104151 250619 267921 33049 143022 38593 96079 189492 -267292
12157 414086 216856 180413 -178339 -70705 146645 84083 85673 -59959 111142 79993 196263
12146 196263 -439212 -278223 -158621 -196881 135658 178225 -291859 110982 86203 82857
12136 82857 198399 21865 -9220 7070 259881 150617 516768 -319316 183943 -39334 179010
12124 125218 -71702 -184198 54071 181476 -184331 -8302 -36111 318292 -10796 191476 -41839
12112 388094 -37778 71021 14222 -278954 -225450 -182199 79505 -196478 157541 79557 136723
12101 136723 21794 60055 -173014 49221 22569 31338 -163847 -143783 -99980 -170475 -60612
$$ packed form
12180A77479h194l6570A67791q408F5198K46589B2310M15918B10140F7739b11546
12168C81658A35253a04151B50619J7302C3049J09973C8593N7486R3413b67292
12157D14086j97230l6443a78339g0705A46645o2562J590e9959A11142l1149J16270
12146A96263d39212J60989J19602l8260A35658M2567b91859A10982k4779l346
12136H2857J15542B1865i220G070K52811j09264L66151c19316A83943c9334A79010
12124A25218g1702j12496E4071J27405a84331h302k7809C18292a0796A91476d1839
12112C88094c7778G1021A4222b78954N3504M3251G9505a96478A57541p7984N7166
12101A36723B1794L8261a73014D9221B2569Q769a63847K0064M3803p0495f0612
$$ plain form
12089 56304 91509 17273 95701 274963 -65810 123060 -82163 -48513 55628 -72153 74191
12077 124293 -163275 114874 63221 273190 1084971 2445363 1282008 169463 371687
12068 371687 51130 368107 69057 -95307 15063 -120484 106226 96090 89303 156859 -210396
12056 257699 260121 70945 -169500 191085 -456748 -61166 3630 279060 -253330 118704 -50651
12044 29008 -65106 -71903 441088 103882 -241503 -173710 -91395 -392816 -193418 99209 -20342
12032 -18239 93361 15856 -97221 -6049 -197785 -374916 -192243 -476198 162698 -59046 -20350
12020 65808 -51065 73095 369526 -23840 76678 303116 -313931 -225569 107170 -13779 166691
12008 36339 107338 -269998 -103573 -182472 148101 -383844 99063 269473 204103 178583 -374135
$$ packed form
12089E6304L5205A7273P8428J79262f5810A23060h2163L3650E5628g2153G4191
12077A24293a63275A14874n1653K09969Q11781J360392j163355A69463K02224
12068C71687E1130L16977F9057i5307A5063a20484A06226j0136o787O7556b10396
12056B57699K422G0945a69500A91085d56748f1166C630K75430b53330A18704e0651
12044B9008f5106o797D41088A03882b41503O7793Q2315l01421a93418I9209b0342
12032a8239I3361A5856i7221f049j91736j77131J82673k83955A62698e9046b0350
12020F5808e1065G3095K96431b3840G6678K26438c13931Q8362A07170a3779A66691
12008C6339P0999b69998a03573p8899A48101c83844I9063J70410o5370k5520c74135
$$ plain form
11996 149116 -252551 -12250 -16161 -57641 130983 187646 -117279 -26450 -161169 -435113 89091
11984 -179784 233675 -145636 -187754 -10434 -15028 115184 197276 -191606 176335 125811 57543
11972 -114122 35436 -187157 -489373 189218 -43934 -150633 -186126 -175595 37715 -166329
11961 -91024 -185983 -48084 51656 -44960 79805 190846 57229 -120602 -107055 109553 -179424
11949 -32280 -128331 243394 63919 -78709 -234865 221968 4415 -94235 -200338 153817 264680
11938 264680 -66316 -99993 92112 11908 -215507 153798 25218 -88041 -24774 95267 141287
11927 141287 -28226 -48588 161551 270923 -92151 264813 -254225 -109798 -19631 -143487
11917 -143487 -155823 143823 -63088 135290 151053 73510 130892 16624 -166998 88759 136405
$$ packed form
11996A49116b52551a2250l911m1480A30983N6663a17279b6450j34719k73944H9091
11984a79784B33675a45636m2118a0434m594A15184Q2092a91606A76335n0524E7543
11972a14122C5436a87157l02216A89218d3934j06699l5493J0531C7715a66329
11961i1024r4959d8084E1656d4960G9805J11041E7229a20602J3547A09553a79424
11949c2280r6051B43394F3919g8709j56156B21968D415i4235j06103A53817J10863
11938B64680f6316l3677I2112A1908b15507A53798B5218h8041b4774I5267M6020
11927A41287b8226k0362A61551J09372i2151B64813b54225a09798a9631j23856
11917a43487j2336A43823f3088A35290J5763G3510N7382A6624a66998H8759M7646
$$ plain form
11906 136405 -114643 -238825 -38108 125191 -255294 -51774 -222063 213463 -17188 184597
11895 177810 180863 -197386 165858 101489 -45762 -121439 42658 57345 21220 -89326 -320701
11884 -320701 105309 24675 34780 -60570 143335 -90745 -68211 20170 -360220 85743 -268944
11872 -66847 52581 38233 -254732 -269672 -94593 41337 -82153 -259379 92788 -163691 -46435
11860 -14122 9077 -89252 192960 111507 157430 208620 -59736 -246473 -45941 79020 271265
11849 271265 184624 117356 -99018 -30140 165166 -93150 -7784 -263246 -222950 392138 -58161
11837 216185 -145221 166819 -57176 -72653 -531823 -225917 -17293 361397 39484 289543
11827 289543 142215 -133601 22461 -48963 -48853 25613 -152644 -48664 28783 29859 -132975
$$ packed form
11906A36405a14643j24182c8108A25191b55294e1774j70289B13463a7188A84597
11895A77810L053a97386A65858o4369d5762p5677D2658J4687B1220h9326k31375
11884c20701A05309B4675J0105f0570A43335i0745K2534B0170c60220H5743b68944
11872f6847E2581j4348b54732j4940i4593D1337h2153j77226I2788a63691d6435
11860a4122I077h9252A92960q1453M5923N1190e9736j86737d5941G9020J92245
11849B71265q6641o7268i9018c0140A65166i3150g784k55462M0296C92138e8161
11837B16185a45221A66819e7176j5477m59170b25917a7293C61397C9484K50059
11827B89543A42215a33601B2461d8963J10B5613a52644d8664B8783J076a32975
$$ plain form
11815 -17404 177575 164332 78970 166843 -134135 -88284 102698 -170695 1085 11843 -58849
11803 84296 -84355 -189126 -86650 -88034 -55823 69499 161371 13476 -178237 203725 -350960
11791 44616 -90796 -114180 -115677 -192606 -86716 34079 32392 313711 26199 328798 -138643
11779 -26984 -89449 298661 -328288 51233 62479 -9566 3555 -17911 187083 -17551 233941
11767 190071 -81474 -296355 73697 -236615 13461 -74546 -201374 -221866 60693 -46619 -11170
11755 -73835 -117821 134282 -34144 -355278 17426 94792 107087 78365 150135 -77455 78638
11743 -38390 -123695 -99562 -194193 -15155 11528 -211656 -170274 89728 25761 80407 -263801
11731 -71897 -251217 74105 3174 -132754 18503 -13698 -81331 -152070 200116 -168193 -311012
$$ packed form
11815a7404A77575j3243G8970Q7873a34135M5851A02698a70695A085J0758e8849
11803H4296h4355j04771h6650j384L2211F9499R1872A3476a78237B03725c50960
11791D4616i0796k3384j497p6929h6716C4079j687K81319B6199L02599a38643
11779b6984o2465B98661c28288E1233J1246i566C555a7911A87083a7551B33941
11767A90071h1474k14881G3697b36615A3461g4546j26828k0492F0693d6619a1170
11755g3835m3986A34282c4144l21134A7426P7366J2295k8722P1770g7455G8638
11743c8390q5305K4133r4631a5155A1528b11656M1382H9728B5761N4646b63801
11731g1897j79320G4105C174a32754A8503a3698o7633p0739B00116a68193j42819
$$ plain form
11720 -311012 44660 -64127 -296709 195963 29098 -31123 201037 141040 -85609 366636 42279
11708 178703 -79310 -19971 261265 269740 59512 -111562 -92516 -103083 104534 -152128 167494
11696 -432725 -261932 -57158 -235615 27153 171871 -52433 -58582 -22546 59751 -140285 -187641
11685 -187641 -117438 167903 182230 32077 149072 -60970 -681 42032 -177983 293679 -150999
11673 165355 470386 193288 -114412 100688 68352 -251510 470552 -62053 -138697 48875
11662 -278823 91119 3281 -190795 -72107 186698 391763 69350 -65896 66658 292161 32907
11650 248907 -52576 136008 228349 -49407 464853 169356 -421139 -121917 125334 179209
11640 179209 -3898 -258999 -289098 361273 46745 190559 58757 95973 481795 -36280 -14250
$$ packed form
11720c11012D4660f4127k32582A95963B9098c1123B01037n9997h5609C66636D2279
11708A78703g9310a9971B61265Q475E9512a11562J9046j0567A04534a52128A67494
11696d32725J70793e7158j78457B7153J44718e2433o149b2546E9751a40285m7356
11685a87641P0203A67903J4327C2077J16995f0970f81D2032a77983B93679a50999
11673A65355L05031A93288a14412A00688l2336b51510D70552f2053p6644D8875
11662b78823I1119C281a90795g2107A86698K05065F9350f5896F6658K25503C2907
11650B48907e2576A36008R2341d9407D64853A69356d21139a21917A25334N3875
11640A79209c898k55101l0099C61273D6745J43814E8757L7216L85822c6280a4250
$$ plain form
11628 -101652 597824 209652 -68682 144911 -133876 -18665 -118475 93118 32111 -20590 183951
11616 227231 -164552 263528 220570 -96705 13530 434177 -190507 -121564 -62283 -85208 173966
11604 166636 84548 -10838 8062 -230183 305035 99819 63668 136769 -101227 25321 -1575
11592 335924 241239 91274 199630 -30233 185702 -70705 51796 -146185 250414 345642 154826
11580 -132605 -37337 -124445 43455 29560 1654 164655 229725 -22956 151701 116392 67339
11569 67339 352688 228961 63345 -5269 202609 291693 -67394 330893 123469 65841 109379
11558 109379 237590 21709 373468 -13248 391437 -15770 143819 54262 -154368 -138845
11548 -138845 184300 -56729 -211905 -20136 73443 56883 63264 258845 12771 266019 45154
$$ packed form
11628a01652E97824B09652f8682A44911a33876a8665r9810I3118C2111b0590A83951
11616B27231a64552B63528m2958i6705A3530M20647a90507O8943N9281k2925A73966
11604A66636q2088a0838H062b30183C05035I9819l6151P3101a01227B5321a575
11592C35924r4685I1274J08356c0233A85702g0705E1796a46185B50414R5228A54826
11580a32605c7337q7108D3455j3895A654J63001O5070b2956A51701l5309m9053
11569F7339K85349j23727F3345e269B02609Q9084f7394C30893A23469n7628M3538
11558A09379J28211B1709L51759a3248C91437a5770A43819E4262a54368J5523
11548a38845A84300e6729j55176b0136G3443j6560O381J95581A2771K53248D5154
$$ plain form
11536 -229553 217479 -102571 357304 -22599 206107 -62070 -127423 259155 -155445 -33910
11525 203188 85194 124077 -92929 204223 -11681 154169 129079 40826 -32383 -171959 182179
11513 -14773 58152 54077 41164 -11727 53999 128592 -93565 108522 149013 -37691 68069 -11112
11500 -144517 105272 258903 77930 72213 112237 184866 75383 210169 222698 -111618 -64710
11489 -64710 -24657 53264 123947 -193017 237842 282190 240553 28482 243336 331395 257091
11478 257091 -63830 86679 185596 -61788 48245 -187757 167069 -38732 226696 92788 226109
11467 226109 -75462 -56284 245142 216393 332685 -101061 231018 342308 53542 169034
11457 169034 476057 55340 -86665 -77599 -38095 204008 -67095 262106 35793 171004 -13316
$$ packed form
11536b29553B17479a02571C57304b2599B06107f2070o5353B59155a55445c3910
11525B03188H5194L8883i2929B04223a1681A54169k5090D0826c2383j39576A82179
11513a4773E8152m075j2913a1727E3999P4593i3565A08522M0491c7691F8069a1112
11500a44517A05272J53631G7930n717M0024P2629G5383J34786J2529a11618M6908
11489f4710b4657E3264P0683a93017B37842M4348m1637B8482K14854Q8059p4304
11478B57091f3830H6679R8917f1788D8245a87757A67069c8732B26696I2788J33321
11467B26109g5462J9178B45142k8749J16292a01061B31018J11290E3542J15492
11457A69034L07023E5340h6665R066c8095B04008f7095B62106C5793J35211a3316
$$ plain form
11445 18413 -297104 -113824 -54195 47326 359445 168291 470865 -69963 152716 119125
11435 119125 106167 83606 63969 -229775 383417 111394 -181612 252886 -239503 -155724
11425 -155724 21652 -68163 -29232 -8916 143831 -223883 -96988 -64356 91060 -300320 -34173
11413 45291 -252981 -155276 -143842 176202 121749 99610 331155 98911 -29721 106497 114093
11402 114093 127595 116470 -622 217420 138838 -177451 114164 120103 66782 19569 -31130
11390 269009 510 147629 -260478 130461 162973 -270400 -97195 -10954 -65657 383334 53911
11378 -136849 -25531 43675 -57769 -55066 -46873 483281 202195 58579 381689 207411 -207624
11366 -307341 71080 -147847 -192606 101397 -198264 -49267 -163283 20168 -23595 -225145
$$ packed form
11445A8413b97104a13824e4195D7326L12119A68291L02574f9963A52716l3591
11435A19125j2958k2561j9637b29775C83417A11394a81612B52886b39503Q3779
11425a55724B1652f8163b9232h916A43831b23883i6988L2632I1060c00320c4173
11413D5291b52981R7705J1434A76202n4453k2139K31545I8911b9721A06497P596
11402A14093J3502j1125f22B17420p8582a77451A14164N939n3321A9569c1130
11390B69009E10J47119b60478A30461L2512b70400i7195a0954n4703C83334E3911
11378a36849b5531D3675e7769K703Q193D83281B02195E8579L23110j74278b07624
11366c07341G1080a47847m4759A01397a98264d9267j14016B0168b3595k01550
$$ plain form
11356 -225145 204428 28423 43612 -443493 -47709 79768 107367 247699 -116813 -211863 -69019
11344 -198954 -387231 51007 86266 159967 58805 -42401 14014 116702 -22434 -61561 -155202
11333 -155202 19918 -188431 -157669 -227046 57055 -9615 -271280 218158 -3227 417881 130211
11321 -49940 -43864 -311596 -94530 233270 167496 37880 -200451 -3228 37503 39541 -174740
11309 324782 -124920 184060 -320931 348592 -176923 -61051 -193932 142854 -112735 -76821
11299 -76821 -274151 -197304 -167553 16050 -301462 2140 16163 53905 95395 -52283 -271670
11288 -271670 -159654 -1385 -205178 -125637 23434 -275834 -327298 -147209 -104156 54053 32411
11277 32411 234834 -125651 -18212 107052 -285378 -12824 -231795 -58293 3581 -80304 128467
$$ packed form
11356b25145B04428B8423J5189d43493d7709G9768K7599J40332a16813r5050f9019
11344a98954j88277E1007L5259P3701E8805d2401A4014J02688b2434l9127r3641
11333a55202A9918a88431L0762o9377E7055i615k61665B18158c227D17881A30211
11321d9940O076k67732i4530B33270o5774C7880b00451c228C7503K038a74740
11309C24782a24920A84060c20931C48592a76923f1051j32881A42854a12735L5914
11299g6821j97330P6847K9751A6050c01462B140J4023L7742M1490e2283k19387
11288b71670J12016a385k03793P9541B3434b75834n1464a47209M3053E4053k1642
11277C2411K02423a25651a8212A07052b85378a2824k18971e8293C581h0304A28467
$$ plain form
11265 -60517 -106213 79616 -181530 -45991 -547715 26759 -182133 -283136 36843 -139980 -32062
11253 -3177 -123885 166476 -93912 14131 163111 47230 83181 -116709 28573 -69655 599679
11241 151393 -286978 173656 35275 -20114 204608 -214125 25224 -143269 -62639 8735 -147763
11229 -154840 122062 -70396 96448 -35748 -324678 181456 -209851 -60403 -85023 -82213 -101613
11218 -101613 -70212 -134935 57963 153067 70103 43598 70706 -232277 -614790 -100197 -241913
11207 -241913 18435 91231 -47080 -435678 171075 419367 2229 -317027 91664 -79960 78754
11195 -52167 -64467 44187 -6230 250669 -237184 8007 -57691 -78204 -22301 -28736 -111998 -44969
11182 317565 -314251 -39512 175676 140218 -78835 212169 30054 -113403 -120606 -415516 -142154
$$ packed form
11265f0517m5696G9616a81530d5991n01724B6759a82133j01003C6843a39980c2062
11253c177j20708A66476i3912A4131J48980D7230L5951a16709B8573f9655E99679
11241A51393b86978A73656C5275b0114B04608b14125B5224a43269f2639H735a47763
11229a54840A22062g0396I6448c5748k88930A81456b09851f0403k4620K810j9400
11218a01613L1401o4723E7963R5104G0103k6505K7108b32277l82513a00197j41716
11207b41913A8435P2796d7080l88598A71075K48292B229c17027I1664g9960G8754
11195e2167j2300D4187f230B50669b37184H007e7691k0513b2301o435q3262d4969
11182C17565c14251c9512A75676l5458g8835B12169C0054a13403p203k94910a42154
$$ plain form
11170 -55255 -60691 44835 332775 521381 -148668 -147025 -87981 -151058 97985 175261 3802 26693
11158 26693 37603 -12335 -347738 390742 -18819 128277 -58245 77210 292389 216442 227560
11147 227560 127131 -96945 254377 102718 98365 47315 -164952 -232742 -157916 24432 171525
11136 171525 44914 70038 404425 -555437 -94519 195780 95986 40565 237997 -144341
11125 337520 68079 136619 -229164 276628 4913 33974 -107514 -29014 -128596 269933 -104244
11113 202492 -304869 -127092 -397466 24899 -122538 132124 -11826 -111495 -25682 405622
11102 -162235 18124 215890 179938 1957 26713 156165 550636 66699 259417 65964 100027
11091 100027 410966 229749 280907 137824 -47033 178920 233264 188917 26177 72519 138258
$$ packed form
11170e5255n436D4835K87940J88606a48668J643N9044o3077I7985P7276C802K2891
11158B6693J0910a2335l35403C90742a8819A28277e8245G7210K15179p5947J1118
11147B27560j00429i6945B54377A02718m353D7315a64952o7790P4826B4432J47093
11136A71525D4914K5124L34387e55437i4519A95780I5986D0565J97432a44341
11125C37520F8079O8540b29164B76628D913K9061a07514b9014r9582B69933a04244
11113B02492c04869a27092k70374B4899a22538A32124a1826r9669b5682D05622
11102a62235A8124J97766l5952A957K4756J29452L94471F6699J92718F5964L4063
11091A00027L10939j81217N1158A37824d7033A78920N4344m4347B6177M6342O5739
$$ plain form
11080 138258 168853 -135607 231357 238879 269586 337138 52994 207338 166781 239628 183465
11069 183465 146742 337694 295007 350828 766217 566762 274644 503431 538462 386385
11059 386385 609054 752139 395551 517301 747850 856610 529707 563051 808501 418863
11049 418863 752446 608919 787952 719904 824700 776903 884398 617289 584879 828785
11039 828785 1023296 510832 958474 682675 713182 981989 1005616 498850 643792 593000
11029 593000 810819 856186 702940 869987 697976 853807 974376 901383 701865 443751
11019 443751 560434 597831 565858 684856 808033 734728 488193 914201 553942 561008
11009 561008 575060 924829 490323 788996 549941 757924 444272 765815 633260 865243
$$ packed form
11080A38258L0595a35607B31357P522L0707O7552E2994J54344m0557P2847n6163
11069A83465l6723J90952m2687N5821M15389j99455B74644K28787L5031j52077
11059C86385K22669J43085l56588J21750K30549J08760l26903L3344K45450l89638
11049D18863L33583j43527J79033o8048J04796m7797J07495k67109l2410K43906
11039H28785J94511E10832M47642k75799L0507K68807K3627D98850J44942n0792
11029E93000K17819M5367j53246J67047j72011J55831J20569p2993j99518k58114
11019D43751J16683L7397l1973J18998J23177p3305k46535M26008l60259P066
11009E61008J4052L49769m34506K98673k39055K07983l13652L21543j32555K31983
$$ plain form
10999 865243 673512 498317 767650 767830 674466 751680 453688 787273 444728 606450
10989 606450 858462 999439 492731 521503 891728 797841 1070878 887574 1232814 1068028
10979 1068028 1281401 1467823 1334764 1710554 1670344 2178531 2287021 2606048 2657689 2678085
10969 2678085 3193355 2839864 3063804 2843558 2475657 2578738 1955594 1771418 1758423 1913856
10959 1913856 1769643 1639218 1624342 1773861 1463348 1608576 1453999 1552822 1132088 1200655
10949 1200655 955108 957439 692657 824828 520544 448891 112554 225211 405838 241769
10939 241769 67099 34689 88831 129035 168975 -219129 -101254 104785 208524 -110113
10928 82897 168623 141976 -250938 -118426 161472 -218223 -69006 223644 -158426 -165271 52842
$$ packed form
10999H65243j91731j75195K69333J80r3364P7214k97992L33585l42545J61722
10989F06450K52012J40977D92731K8772L70225r3887K73037j83304L45240j64786
10979A068028K13373J86422j33059L75790m0210N08187J08490L19027N1641K0396
10969B678085N15270l53491K23940k20246l67901J03081o23144j84176j2995J55433
10959A913856j44213j30425j4876J49519l10513J45228j54577R8823m20734O8567
10949A200655k45547K331k64782J32171l04284p1653A12554J12657J80627j64069
10939B41769F7099l2410N4142M0204L9940b19129a01254A04785J03739a10113
10928H2897Q5726k6647b50938a18426A61472b18223f9006B23644a58426o845E2842
$$ plain form
10916 215470 -92142 -201565 -87743 210362 -82134 160917 152930 -263742 -339380 3324 -2284
10904 -323417 -222626 -185710 -294830 -269393 392641 -227501 122260 -102988 -200516 255630
10893 41672 2463 -218054 -88296 -30267 53225 -105348 -149357 15170 13643 135566 45865
10881 -155104 79525 -16337 135396 111417 -43809 -189889 -242984 -123623 -76603 -149378 297145
10869 59454 67651 -360728 9859 117467 -148064 -39098 -102439 -19358 202921 159937 -290798
10857 229487 137760 60699 11594 -101589 109282 -50702 72083 -124942 -188263 138383 143995
10846 143995 24561 142962 258724 -57745 -173188 -120281 -182497 51579 221165 168537 66643
10834 -230307 59174 34480 -144786 55955 -141529 9725 -103449 -168331 -370187 34008 -32687
$$ packed form
10916B15470i2142j09423h7743B10362h2134A60917p987b63742p5638C324b284
10904c23417J00791L6916j09120K5437C92641b27501A22260a02988r7528B55630
10893D1672B463b18054h8296c0267E3225a05348m4009A5170j527J21923D5865
10881a55104G9525a6337A35396k3979d3809j46080n3095J19361M7020p2775B97145
10869E9454Q197c60728I859J07608a48064c9098o3341a9358B02921m2984b90798
10857B29487r1727F0699A1594a01589A09282e0702G2083a24942o3321A38383N612
10846A43995B4561J18401J15762e7745j15443N2907o2216E1579J69586n2628F6643
10834b30307E9174k4694a44786E5955a41529I725a03449o4882k01856C4008c2687
$$ plain form
10822 108580 142124 -353444 19652 95749 -269312 330640 -160994 -264624 -12707 -150892
10812 -150892 14005 -266937 -10925 -365290 -283518 -109602 -152736 8549 -102158 107265 -81920
10800 14146 -266400 86725 -26461 112243 175168 -176037 -171238 27481 -5288 201838 -94430
10788 -60202 49203 -31183 -178711 -245608 -184289 -51427 3760 -45931 73343 -404793 2306 -76988
10775 -43551 53548 -141422 53161 89415 -193221 191305 -24166 72239 -140611 134170 -37596
10763 -101530 319036 237176 5240 78579 -119275 -125226 -289569 275810 -169006 255143 -211863
10751 125018 102790 -89814 150699 -198794 -140518 -311098 182144 127108 -32876 -26841 -33593
10740 -33593 199034 18231 -50198 121590 103878 131264 177870 -83069 95855 72800 -92271
$$ packed form
10822A08580L3544c53444A9652P6097b69312C30640a60994j03630a2707j38185
10812a50892A4005b66937a0925l54365Q1772a09602m3134H549a02158A07265h1920
10800A4146b66400H6725b6461A12243O2925a76037M799B7481e288B01838i4430
10788f0202D9203c1183j47528o6897O1319e1427C760d5931G3343d04793B306g6988
10775d3551E3548a41422E3161L6254a93221A91305b4166G2239a40611A34170c7596
10763a01530C19036q1860E240P3339a19275n951j64343B75810a69006B55143b11863
10751A25018k2228h9814A50699a98794N8276j70580A82144n5036c2876O035o752
10740c3593A99034A8231e0198A21590j7712K7386M6606h3069I5855k3055i2271
$$ plain form
10728 55192 -292436 -137517 37337 -341249 15189 22613 -117811 -337150 -91488 91582 25542
10716 -68852 -62091 -260654 33918 -205534 88107 -117895 119048 377723 132405 116868 120874
10705 120874 -178090 -202758 -186273 -145611 -205864 -46791 -318271 177729 86842 -69806 -34927
10694 -34927 -179581 44266 -16944 -136143 22118 25549 -177753 -183950 34043 93227 288297
10683 288297 -136389 -3339 24855 10886 -120405 131371 -373486 168980 777 137874 -82285
10671 12826 11275 -263124 24409 -42625 -316462 202709 92741 30976 208776 43041 37675
10660 37675 -60888 210555 130491 172769 -187583 123074 -15221 6282 -58495 -274840 -26453
10648 72491 395457 -186775 -2826 294369 262888 48761 -24609 -75590 -82174 139400 52022
$$ packed form
10728E5192b92436a37517C7337c41249A5189P424a17811k19339i1488I1582B5542
10716f8852O761j98563C3918b05534H8107a17895A19048K58675A32405j5537M006
10705A20874a78090k4668J6485M0662o0253d6791k71480A77729H6842f9806L4879
10694c4927j44654D4266a6944j19199B2118L431a77753o197C4043N9184J95070
10683B88297a36389c339B4855A0886a20405A31371c73486A68980G77J37097h2285
10671A2826j551b63124B4409d2625k73837B02709I2741C0976J77800D3041n366
10660C7675f0888B10555q0064M2278a87583A23074a5221F282e8495k16345b6453
10648G2491L22966a86775b826B94369l1481D8761b4609n0981o584A39400E2022
$$ plain form
10636 -12539 -192871 21890 -54843 -158060 31003 -108507 -271685 -244601 -50772 126706 -105138
10624 145830 324005 95546 -213982 -2844 138523 -220280 15711 103952 250121 -337265
10613 -160314 -306770 -203618 -319934 -200498 -151137 -138100 154368 -210983 136421 -60189
10602 -318592 -173786 70050 -58750 -295743 -97267 -147844 -169853 -314129 -173166 175878
10591 -96840 -16810 -329121 -104508 -174919 55325 59109 -47790 -12853 -125079 -248886 103457
10579 -154904 28514 -197217 215471 36803 -42215 -37840 69779 -236246 185198 215707 -24032
10567 96668 99615 -39388 -85575 -79671 72424 306224 -263475 -271774 -127576 -236276 125205
10555 -145201 202104 -299032 -194667 -118857 129577 -191870 -16232 -71964 -183552 -225277
$$ packed form
10636a2539j80332B1890e4843j03217C1003a08507j63178K7084e0772A26706a05138
10624A45830J78175I5546b13982b844A38523b20280A5711Q8241J46169c37265
10613a60314j46456J03152j16316J19436M9361J3037A54368b10983A36421f0189
10602c18592J44806G0050e8750k36993i7267n0577k2009j44276J40963A75878
10591i6840a6810l12311a04508p0411E5325L784d7790a2853j12226j23807A03457
10579a54904B8514a97217B15471C6803d2215M375F9779b36246A85198L0509b4032
10567I6668K947c9388m6187N904G2424K33800b63475q299a27576j08700A25205
10555a45201B02104b99032J04365P5810A29577a91870a6232n5732j11588m1725
$$ plain form
10545 -225277 171775 -2673 36831 -122451 26240 -286902 -134773 75176 -143673 -6048 -313922
10534 -313922 237048 61943 -164647 -228038 296997 -12838 61846 55479 160536 108996 307229
10523 307229 -78965 379699 -20142 74310 247602 -172916 -205725 -267343 -25835 -370690 -236689
10512 -236689 300060 5380 -278116 -397141 -165388 -25223 -35770 -73904 -86597 718 145809
10501 145809 -197829 54233 -108193 -239890 -47742 1814 -44881 -20858 -40680 -81708 -270319
10490 -270319 17568 -129617 83651 -38288 -55701 -20687 5402 305852 271454 -7048 87397
10478 145738 439560 323536 409765 333580 -145451 -18460 483947 162668 105883 -38947
10467 -107288 463252 -206141 15461 110307 177201 -297169 -335132 272934 -213646 -290092
$$ packed form
10545b25277A71775b673C6831a22451B6240b86902a34773G5176a43673f048l07874
10534c13922B37048F1943a64647o3391B96997a2838F1846o367J05057n1540J98233
10523C07229g8965C79699b0142G4310J73292a72916l2809o1618b5835l44855J34001
10512b36689C00060E380b78116j19025a65388b5223j0547l8134j2693G18J45091
10501A45809a97829E4233a08193j31697d7742A814d4881b0858j9822m1028j88611
10490b70319A7568a29617H3651c8288j7413b0687E402L00450l4398g048H7397
10478A45738K93822j16024Q6229p6185a45451a8460D83947A62668n6785c8947
10467a07288D63252b06141A5461R4846O6894b97169l7963B72934b13646p6446
$$ plain form
10457 -290092 -283818 464048 -246866 -15486 167611 -113735 29775 -120629 228405 -96943
10446 19966 283272 213892 34323 -52530 -225079 9619 86182 -50661 -79349 17292 -232102
10434 -109668 139003 16426 -25119 114080 222780 -105578 -31213 -284431 210277 -232780
10423 18226 361309 -16193 -54757 253536 371071 24013 -97984 288541 251025 -36850 -87484
10412 -87484 229317 203841 -240138 97733 58228 236397 39209 -66859 144549 53934 -30059
10400 -352595 -143158 45350 258563 -56471 -71990 -78983 123301 39638 40522 71148 79239 64190
10388 64190 -66378 162215 201250 -44526 -210999 197845 189834 230515 22117 104806 252950
10377 252950 412055 -12251 318286 610683 -53995 259341 403175 333759 425541 296758
$$ packed form
10457b90092O274D64048b46866a5486A67611a13735B9775a20629B28405i6943
10446A9966K63306o9380C4323e2530j72549I619P6563e0661k8688A7292b32102
10434a09668A39003A6426b5119A14080J08700a05578c1213k53218B10277b32780
10423A8226L43083a6193l8564B53536J17535B4013i7984B88541l7516c6850n0634
10412h7484B29317k5476b40138I7733l9505J78169C9209f6859A44549E3934c0059
10400c52595a43158D5350K13213e6471j5519o993A23301C9638Q84L0626Q091j5049
10388F4190f6378A62215L9035d4526j66473A97845q011M0681B2117Q2689J48144
10377B52950J59105a2251C18286K92397e3995B59341J43834o9416R1782j28783
$$ plain form
10367 296758 343471 538263 321134 599515 270709 -7601 374855 147014 183736 333865
10357 333865 442670 271759 220879 184501 122425 263310 488473 557642 715125 471134
10347 471134 344625 380416 151741 365241 699030 518613 401099 57128 95573 41179
10336 138873 280178 -26067 99348 198183 144733 398628 130880 150555 167625 -232327 219536
10324 128833 243453 -143791 438050 234200 257507 -6802 67071 49080 244218 369987
10314 369987 215924 170832 100420 -41348 -7069 312847 -113182 104605 293411 -186128
10303 -31090 396846 42584 -35531 -22214 -34357 -81654 -176199 -48328 -232288 176602 35889
10291 -118657 31747 -366289 -487913 -475202 -59545 -15367 72549 55980 -321157 94698 -171169
$$ packed form
10367B96758M6713J94792k17129K78381B70709g601C74855A47014L6722J50129
10357C33865J08805j70911n0880l6378o2076J40885K25163O9169J57483k43991
10347D71134j26509L5791A51741K13500L33789j80417j17514E7128L8445D1179
10336A38873J41305b6067I9348R8835n3450K53895A30880J9675J7070b32327B19536
10324A28833J14620a43791D38050k03850K3307f802F7071j7991J95138J25769
10314C69987j54063m5092p0412d1348g069C12847a13182A04605J88806a86128
10303c1090C96846D2584c5531J3317j2143m7297r4545d8328j83960A76602C5889
10291a18657C1747c66289j21624J2711e9545a5367G2549j6569c21157I4698a71169
$$ plain form
10279 -25222 469649 -224046 -134989 -182424 -182990 159200 -95488 86899 49872 -94352 129101
10267 -157780 -193877 34888 -43329 183125 140625 193364 285048 -226876 347597 456674 -42511
10255 8986 323425 180432 -97004 -46703 -69347 -174232 4468 16683 -384431 13234 -99785
10243 -237067 47477 -115667 -53480 33767 -92344 17734 58361 -73717 29026 -57155 -323971
10232 -323971 30169 280554 124003 129919 -4111 -12790 211444 144956 36215 -33695 -99270
10221 -99270 -20790 162562 296426 116855 44809 3786 186176 -242031 84394 63666 -230699
10209 -151819 -52792 -31869 37805 -38576 -126480 -143581 -162549 -26338 48014 -238843 -284988
10198 -284988 37859 -33218 -163998 135316 -682 -232393 30093 -154805 64640 -9460 184404
$$ packed form
10279b5222D69649b24046Q9057m7435n66A59200i5488H6899l7027i4352A29101
10267a57780l6097C4888d3329A83125m2500N2739R1684b26876C47597J09077d2511
10255H986L14439j42993i7004d6703k2644j04885D468J2215c84431A3234i9785
10243b37067D7477a15667e3480C3767i2344A7734M0627g3717B9026e7155k66816
10232c23971C0169K50385A24003N916d111q679B11444o6488C6215c3695o5575
10221i9270b0790A62562J33864A16855D4809C786J82390b42031H4394k0728b30699
10209a51819e2792K0923C7805c8576q7904j7101j8968b6338D8014b38843m6145
10198b84988C7859c3218j30780A35316f82k31711C0093a54805F4640i460A84404
$$ plain form
10186 164385 83088 67018 -145875 -430307 -220023 -108677 -7192 -254005 -87465 -120100 46740
10174 15163 -179196 261080 -137050 -132579 -98784 -354695 -115122 39168 89170 -118745 -193814
10163 -193814 455373 1835 74260 24388 -194927 200507 -190433 14369 -50576 92572 -347053
10151 -13078 71366 -46597 243847 28544 226024 114911 89004 309239 -334068 82027 -1849
10139 -74357 105612 -325732 -313555 -248899 144532 -192177 75415 -195876 -33649 73272 1019
10127 -200831 -135882 -59931 36910 -42149 -321696 -21675 -273456 -282954 69618 48812 -226660
10115 21959 -219078 178234 -92493 238825 -146558 -151095 134625 -146093 -244536 26949 76785
10104 76785 -106422 -49891 -27110 -36484 67271 -89306 -127029 270993 -203033 -36826 67289
$$ packed form
10186A64385q1297j6070a45875k84432K10284a08677g192k46813h7465l2635D6740
10174A5163a79196B61080a37050M471L3795k55911a15122C9168N0002a18745p5069
10163a93814D55373A835P2425B4388a94927B00507a90433A4369e0576I2572c47053
10151a3078G1366d6597B43847B8544J97480j11113k5907K20235c34068H2027a849
10139g4357A05612c25732J2177O4656A44532a92177G5415a95876c3649G3272A019
10127b00831O4949e9931C6910d2149k79547b1675k51781r498F9618k0806b26660
10115B1959b19078A78234i2493B38825a46558m537A34625a46093r8443B6949M9836
10104G6785a06422d9891K2781r374F7271h9306l7723B70993b03033c6826F7289
$$ plain form
10092 -178063 -100286 -59127 -51365 -209945 -20121 52325 -244481 -11755 -221016 -343637 235887
10080 -148999 80194 -371804 -130147 -220510 -258332 -138319 -133401 -140344 -152556 107390 -78348
10068 -115370 258455 -18334 -235662 -30000 -333661 275640 169247 107611 23905 -118773
10057 -132976 -292294 -446437 44919 121644 3639 -208246 1678 -59961 -379971 -29467 -8893
10045 231472 -169967 -73967 162018 -170337 -178240 -279399 10388 -113044 -119750 -162770 -185873
10034 -185873 -10874 125454 179167 163360 159430 13172 -92652 -135485 -79006 238828 -34905
10022 -222184 -78243 23980 25258 -36375 -212734 92911 243104 -257497 -326187 -408614 -194749
10010 -227681 36794 -149824 -105158 164599 -325674 -265375 -327020 37129 37920 -63877 -63940 -284352
$$ packed form
10092a78063P7777M1159P762j58580b0121E2325b44481a1755k09261j22621B35887
10080a48999H0194c71804a30147r0363l7822J20013M918o943j2212A07390g8348
10068a15370B58455a8334k17328c0000l03661B75640j06393o1636B3905a18773
10057a32976j59318j54143D4919P6725C639b08246A678e9961l20010b9467h893
10045B31472a69967g3967A62018a70337p903j01159A0388a13044o706m3020k3103
10034a85873a0874A25454N3713j5807l930A3172i2652m2833N6479B38828c4905
10022b22184g8243B3980J278c6375j76359I2911J50193b57497o8690q2427a94749
10010b27681C6794a49824M4666A64599c25674O0299o1645C7129P91f3877o3k20412
$$ plain form
9998 -284352 -164792 -146020 -21969 -305171 -27230 130217 -280338 -60461 175672 164192 122128
9987 122128 58256 -112807 -138649 -179129 35046 -24974 -295154 5532 179661 -108863 -139761
9976 -139761 -15263 -320361 -79201 -5863 -270087 95751 137800 -163132 26127 161752 77326
9964 1670 32479 -124478 246804 -172134 28826 236757 -41593 389076 39115 -313904 -326172
9953 -326172 195894 -222589 -20613 -292667 -58106 -206675 -102064 -130510 -101296 19900 98822
9942 98822 -19136 -169006 87598 500 -10964 245193 -99416 -216740 -150621 162620 -90725
9930 14861 -388080 21744 -89563 289782 -28474 -196972 10367 175239 -193728 -220218 147529
9918 176772 -163048 49763 -536909 17361 -308678 60408 -203748 -197626 -179840 -179255 -139415
$$ packed form
9998b84352J19560J8772b1969k83202b7230A30217b80338f0461A75672j1480m2064
9987A22128E8256a12807k5842m0480C5046b4974k70180E532J74129a08863l0898
9976a39761a5263l05098g9201e863k64224I5751M2049a63132B6127J35625G7326
9964A670L0809a24478B46804a72134B8826K07931d1593C89076C9115c13904j2268
9953c26172A95894b22589b0613k72054e8106j48569a02064k8446K9214A9900P8922
9942I8822a9136j49870H7598E00a0964B45193i9416j17324O6119A62620i0725
9930A4861c88080B1744h9563B89782b8474j68498A0367J64872a93728k6490A47529
9918A76772a63048D9763e36909A7361c08678F0408b03748O122J7786N85L9840
$$ plain form
9907 -139415 132390 -175006 221894 -261543 -37524 115345 36987 -119758 55840 -126749
9896 113720 -50111 -59364 -56931 76749 -228153 -111263 -234039 -63352 195643 136842 -218283
9884 -205783 13107 -147395 125929 100754 195572 -285725 -87366 145397 -232747 -115967
9873 143856 -11632 -70598 -69379 137054 -82239 -6678 -63655 -26786 -109297 -43956 -56721 -232181
9861 -232181 -39040 -419558 -253450 -197316 -83320 430732 -296220 55392 38716 -173088 -190325
9850 -190325 -225144 39084 89497 -163222 60650 78723 240751 32749 -204774 -56375 58185
9838 -142424 -30598 -63378 33815 78094 -205896 93679 -483026 -454134 128444 43828 -141282
9826 -292827 -357793 17956 -58557 76184 -37738 105051 -186120 56059 18387 -35420 -265633
$$ packed form
9907a39415A32390a75006B21894b61543c7524A15345C6987a19758E5840a26749
9896A13720e0111r253K433G6749b28153a11263j22776f3352A95643n8801b18283
9884b05783A3107a47395A25929k5175R4818b85725h7366A45397b32747a15967
9873A43856a1632n8966J219A37054h2239f678n6977b6786q2511d3956j2765j75460
9861b32181c9040l80518J66108N6134h3320D30732b96220E5392j6676a73088j7237
9850a90325l4819C9084N0413a63222F0650J8073J62028C2749b04774e6375E8185
9838a42424c0598l2780C3815M4279b05896I3679d83026K8892A28444D3828a41282
9826b92827o4966A7956e8557G6184c7738A05051a86120E6059A8387c5420k30213
$$ plain form
9815 -265633 139471 -41142 -205863 -244979 -426272 -192685 -51709 123592 -17189 -52283 -56375
9804 -56375 -100318 -82609 172497 -413621 -152388 311346 -380180 -210973 -189326 -313345
9794 -313345 98952 111301 17522 -172283 -1585 56602 -54064 84114 -120572 -236237 -83029
9782 -160677 50327 194288 -296128 40454 289442 -32154 -90193 -267095 20776 -156687 -253224
9771 -253224 46650 -298099 313494 -233394 -162738 -196834 169310 -148275 -119809 -82966 -342599
9760 -342599 1093 -37394 -103657 -37654 -115856 -294006 150541 -105526 213504 55389 261859
9749 261859 325086 -243569 357175 -32839 -131412 34812 163270 214692 56828 140887 -358046
9737 -178347 -267526 298719 -354541 -47961 -140979 -223068 -85227 -190359 32874 41957 188036
$$ packed form
9815b65633A39471d1142j64721l9116j81293a92685e1709A23592a7189l5094m092
9804e6375m3943J7709A72497d13621a52388C11346c80180J69207K1647j24019
9794c13345I8952J2349A7522a72283a585E6602e4064H4114a20572j15665h3029
9782a60677E0327J43961b96128D0454K48988c2154n8039j76902B0776a56687r6537
9771b53224D6650b98099C13494b33394P0656l4096A69310a48275K8466L6843k59633
9760c42599A093c7394o6263c7654p8202j78150A50541a05526B13504E5389K06470
9749B61859O3227b43569C57175c2839r8573C4812J28458N1422E6828Q4059c58046
9737a78347q9179B98719c54541d7961r3018q2089h5227j05132C2874R083J46079
$$ plain form
9726 188036 -457909 -76036 8355 -163864 -33737 -260809 -77325 -153882 -23123 -85408 -147198
9715 -147198 130670 -231230 -20908 -160956 37643 -446900 -446580 -48298 -279376 7191 -12150
9703 -16237 -166502 131533 -44958 -9195 75221 56459 -118260 -142600 -19820 -196768 -362425
9692 -362425 -17022 -169684 -271240 79071 -310002 -19944 -39924 -114752 23461 23624 -174132
9680 254483 -270368 -54879 -52632 -139627 108236 268228 84977 -211341 52470 -127775 -84827
9669 -84827 -21838 130450 45206 169342 109521 101896 -120644 -259438 117418 -180756 -14964
9657 83049 33863 305012 -80180 133514 -12085 66046 -24361 116315 45451 40465 -135717
9645 34011 158011 8197 -203027 -3631 -160265 -90860 48324 -207275 203328 -24190 -20189
$$ packed form
9726A88036d57909g6036H355a63864c3737k27072g7325p6557b3123o2285o1790
9715a47198A30670b31230b0908j40048C7643d46900L20d8298k31078G191a2150
9703a6237j50265A31533d4958i195G5221j8762a18260k4340a9820j76948j65657
9692c62425a7022j52662j01556G9071c10002a9944j9980p4828B3461J63a74132
9680B54483b70368e4879K247q6995A08236J59992H4977b11341E2470a27775M2948
9669h4827b1838A30450D5206J24136n9821p625a20644j38794A17418a80756a4964
9657H3049C3863K71149h0180A33514a2085F6046b4361A16315D5451m986a35717
9645C4011J24000H197b03027c631j56634O9405D8324b07275B03328b4190M001
$$ plain form
9634 -20189 74908 -106132 -210461 -21620 -365665 166620 -48375 -273758 -14454 -215914 203586
9622 -247133 -288193 -550917 249681 -49222 -496636 -328 141230 -372183 -178553 135201 -204184
9610 116450 -317835 291871 -109350 -45200 -305682 138957 -183666 133580 -165365 181510
9599 -59304 54693 -85482 -90037 12938 197924 -108359 83467 -341388 -218903 -155009 135852
9587 -184334 144989 -149031 -145967 114984 -360441 -83152 -349244 250148 55742 178013
9577 178013 -24358 -113272 105372 -30717 -43389 -259106 -259960 325235 9467 -117654 -34175
9565 83511 -138993 -146121 11975 -241348 313881 -212444 146369 -60880 -127386 360669 -252159
9553 -182531 -274476 118961 48739 143419 -56299 19230 182300 -339335 62291 -68657 -19349
$$ packed form
9634b0189G4908a06132j04329b1620l44045A66620d8375k25383a4454k01460B03586
9622b47133m1060k62724B49681d9222m47414c28A41230c72183a78553A35201b04184
9610A16450c17835B91871a09350d5200k60482A38957a83666A33580a65365A81510
9599e9304E4693h5482m555A2938J84986a08359H3467c41388J22485O3894A35852
9587a84334A44989a49031L064A14984c60441h3152k66092B50148E5742J22271
9577A78013b4358q8914A05372c0717j2672k15717q54C25235I467a17654c4175
9565H3511a38993p128A1975b41348C13881b12444A46369f0880o6506C60669b52159
9553a82531r1945A18961D8739R4680e6299A9230J63070c39335F2291f8657a9349
$$ plain form
9541 214250 -158112 -146936 217413 -220397 71950 265073 19377 -177251 48185 -302073
9530 228476 -6002 -243802 -162912 -54912 -73656 -216583 -81868 133726 -9318 4730 -155414
9518 -230441 -159566 263826 -45612 -160475 83004 249102 11313 -378251 -71704 186648 -118060
9506 -121861 141362 -302718 -181378 -116583 3609 -164979 -156753 9083 107083 -107651 -72954
9495 -72954 389003 166306 -90453 -205797 -70851 6321 -124272 -118217 9783 92793 106270 26659
9482 -391334 285837 12455 -321671 213653 43587 -37464 78156 -144318 -22482 -116604 -267267
9471 -267267 224238 51930 -75471 -120432 349944 -344223 -159645 41802 -215507 -132073 -252513
9460 -252513 -90300 -19087 -166296 -41742 -76228 34180 -33986 -78807 15423 -68973 99301
$$ packed form
9541B14250a58112J1176B17413b20397G1950J93123A9377a77251D8185c02073
9530B28476f002k37800Q0890e4912j8744j42927h1868A33726i318D730a55414
9518b30441P0875B63826d5612j14863H3004J66098A1313c78251g1704A86648a18060
9506a21861A41362c02718J21340O4795C609a64979Q226I083R8000a07651L4697
9495g2954C89003A66306i0453j15344g0851F321a24272O055I783Q3010J3477B6659
9482c91334B85837A2455c21671B13653D3587c7464G8156a44318b2482r4122j50663
9471b67267B24238E1930g5471m4961C49944c44223a59645D1802b15507Q3434j20440
9460b52513i0300a9087j47209d1742l4486C4180c3986m4821A5423f8973I9301
$$ plain form
9448 22900 -171947 86724 384148 -310651 50171 203918 -183224 -148605 -272199 161492
9437 -101453 -58302 -4143 -281119 38576 7320 42223 66033 -72174 -204164 -406367 -292055
9426 -292055 264870 -6232 -177562 -133560 -43352 -211383 -341440 120217 34040 -198670 -339018
9415 -339018 95466 -104614 263589 -35333 83895 205307 -51657 47040 -18024 -22038 -218614
9404 -218614 -636684 -304873 89171 -81027 74803 -280703 -158984 -68092 180657 -35126 -346770
9393 -346770 260389 -187748 114296 -139406 -3457 -85498 316384 80866 -115006 -168227 80813
9381 -201691 21389 -208206 -115461 291913 46060 60115 -157436 96544 -63348 -181099 -81920
9369 205221 -266465 -52166 -54520 131178 416633 116846 283149 16948 -60674 26688 -104329
$$ packed form
9448B2900a71947H6724K97424c10651E0171J53747a83224L4619j23594A61492
9437a01453M3151d143k76976C8576G320L4903K3810g2174j31990k02203J14312
9426b92055B64870f232j71330M4002d3352j68031j30057A20217C4040a98670j40348
9415c39018I5466a04614B63589c5333H3895J21412e1657D7040a8024m014j96576
9404b18614m18070c04873H9171h1027G4803b80703J21719f8092A80657c5126l11644
9393c46770B60389a87748A14296a39406c457q2041C16384H0866a15006n3221H0813
9381b01691B1389b08206R2745B91913D6060J4055a57436I6544f3348j17751h1920
9369B05221b66465e2166k354A31178K85455A16846J66303A6948f0674B6688a04329
$$ plain form
9357 -415962 -5930 217722 -106608 -186124 -42119 108381 68133 210970 -62608 -238220 -256304
9346 -256304 -111880 -125195 -125889 207101 -358998 39830 94952 -177171 -305083 -39757 69530
9334 -110544 98324 -376064 -231964 -89311 -198753 32424 -19843 103513 79418 -52390 -32687
9323 -32687 73795 -276074 -195011 62166 -19945 -235169 19924 122923 24621 -107825 -361313
9312 -361313 -353477 -622678 -264721 -260194 -42694 -8647 91017 -82792 199457 -124550 125064
9300 -52717 -41067 -344414 131058 62513 -266020 -270257 -57501 164129 -162470 -63609 37691
9288 -2770 -202230 -91457 329576 85580 202025 -375596 173150 191374 -298792 75889 179511
9277 179511 138745 204403 -61256 -120267 129135 122511 147764 -129967 -89867 -204490 2169
$$ packed form
9357d15962e930B17722a06608p9516d2119A08381m0248J42837f2608j75612j8084
9346b56304a11880j3315o94B07101c58998C9830N5122a77171j27912c9757F9530
9334a10544I8324c76064J44100h9311j09442C2424a9843A03513k4095e2390J9703
9323c2687G3795b76074Q1063F2166a9945k15224A9924J02999B4621a07825k53488
9312c61313P836k69201b64721M527d2694h647I1017h2792A99457a24550A25064
9300e2717J1650l03347A31058F2513b66020m237e7501A64129a62470f3609C7691
9288b770j99460i1457C29576H5580J16445c75596A73150J8224b98792G5889J03622
9277A79511m0766O5658f1256n9011A29135o624K5253a29967M0100j14623B169
$$ plain form
9265 -548526 130697 -110935 -237266 -72072 -168163 -243708 -112183 114847 -34276 -354858
9255 -354858 -120547 -204413 61963 26385 -184662 -206539 177147 -14249 -19485 -408466 -388068
9244 -388068 -302971 -142750 -118128 73743 -120214 -96269 131504 -111376 20997 215368 -6139
9232 16824 39589 219438 20551 -76520 -147603 39912 -179328 151413 -55299 -113637 -164957
9221 -164957 -191288 134432 -54618 -278806 -120157 93899 -94000 -78907 -161170 -352257 26315
9209 -65809 -114444 51164 -179023 -216052 -65427 -56327 -256842 -151926 -185709 157598 -304834
9197 -281822 122150 146351 79432 -438952 -40541 -79256 -42468 15213 12317 -146255 -81799
9186 -81799 269026 12740 21353 76751 -100521 -334945 -77719 -297204 22522 134290 -126054
$$ packed form
9265e48526A30697a10935j26331g2072r6091p5545a12183A14847c4276l20582
9255c54858a20547q3866F1963B6385a84662k1877A77147a4249n236l88981K0398
9244c88068Q5097a42750K4622G3743a20214K3945A31504a11376B0997J94371f139
9232A6824K2765J79849B0551g6520p1083C9912a79328A51413e5299n8338n1320
9221a64957k6331A34432e4618k24188a20157I3899i4000J5093q2263j91087B6315
9209f5809m8635E1164a79023l7029f5427R100k00515J04916l3783A57598c04834
9197b81822A22150K4201o6919d38952d0541l8715L6788A5213k896a46255O4456
9186h1799B69026A2740Q613N5398a00521k34424g7719k19485B2522J11768a26054
$$ plain form
9174 -136558 -89422 -283279 -202341 -151622 195324 -285902 -306352 105245 -399273 -64022 139066
9162 -312606 16014 118760 -172668 256763 56737 174829 97473 -272186 58734 -229511
9151 -62656 -57184 -67900 -43906 -151073 61295 -39325 153677 167948 29706 -33255 259068
9139 63490 415710 -103939 10684 70638 -158815 116596 187609 -25485 -214204 -10736 196566
9127 111240 -124255 -207439 -124662 37983 -264510 -197897 -74396 25747 -281689 21635 -242290
9115 -59898 -350050 -80103 149221 -231978 6176 42709 44559 -115166 77199 278052 86592
9103 -116546 -150918 -316586 -310267 207391 -61642 94933 -63966 73138 101005 48961 -93202
9091 -242019 15351 -154292 128610 13189 -184006 -285755 -404689 -185875 96349 -54269
$$ packed form
9174a36558M7136j93857Q0938N0719A95324b85902k0450A05245c99273f4022A39066
9162c12606A6014J02746a72668B56763E6737J18092p7356b72186E8734b29511
9151f2656N472j0716K3994j07167F1295c9325A53677J4271B9706c3255B59068
9139F3490L52220a03939A0684N9954a58815A16596P1013b5485j88719a0736A96566
9127A11240a24255q3184Q2777C7983b64510O6613g4396B5747b81689B1635b42290
9115e9898k90152h0103A49221b31978F176L6533J850a15166G7199K00853H6592
9103a16546l4372j65668O319B07391f1642I4933f3966G3138K7867D8961i3202
9091b42019A5351a54292A28610A3189a84006j01749j18934a85875I6349e4269
$$ plain form
9080 -183603 -299224 27232 55212 -59772 -45005 -7598 34228 -105661 -329897 -199098 -24271
9068 369047 -175576 30410 170874 -168154 -27380 88566 -387245 44854 238299 199778 -252397
9056 -243873 -183177 -99797 -7791 6856 -264212 36206 -324943 -178758 -80368 74987 61961
9045 61961 -248925 -80553 -373639 38696 64216 -136243 -136119 254694 -442482 -234832 -18952
9033 -145235 -183921 5517 98604 120456 125246 22724 -248012 -250978 40807 197535 -408293 153861
9020 -49127 174721 238705 295726 -192937 226472 -393318 -62304 -108027 -25961 -198538 186390
9008 -138437 -149383 -304512 -99331 -81663 -198515 -201119 12686 -97214 30761 18739 -43491
8996 -133852 -33059 -39287 -187505 -135023 74822 -238046 158847 -303536 -130218 -146089 9873
$$ packed form
9080a83603j15621B7232K7980e9772J4767g598C4228a05661k24236J30799b4271
9068C69047a75576C0410J40464a68154b7380H8566c87245D4854J93445l8521b52397
9056b43873O0696Q3380g791F856b64212C6206c24943J46185h0368G4987j3026
9045F1961b48925h0553k93086C8696K5520a36243J24B54694d42482K07650a8952
9033a45235l8686E517R3087K1852M790B2724b48012k966D0807J56728d08293A53861
9020d9127A74721O3984N7021a92937B26472c93318f2304m5723b5961j72577A86390
9008a38437j0946j55129i9331J7668j16852k604A2686i7214C0761j2022d3491
8996a33852c3059o228j48218N2482G4822b38046A58847c03536a30218j5871I873
$$ plain form
8984 -306109 19622 -69000 142303 219655 6944 96288 -372958 -274334 237826 -96420 97836
8972 4402 -265096 -142976 -25979 123772 -143650 11210 -304338 -188263 -73273 -14078 -381134
8961 -381134 -305467 115917 -800 85372 -296582 8863 -137368 124070 40263 -61386 -166935
8950 -166935 11670 128741 187392 14446 94675 -234703 -256788 -143507 249726 -95615 -166734
8939 -166734 -72845 163098 -74835 -27990 121261 -181493 -15382 23800 87754 -153764 -244983
8928 -244983 117050 -455448 -13881 -57135 -21618 -50812 57168 224344 153116 -50769 -48138
8917 -48138 -49905 2532 221046 -108454 -351288 4126 -146794 -70621 -138935 233939 -92373
8905 -199901 -26708 -297990 11744 19306 162886 20607 -349827 -478243 -281156 207147 -213267
$$ packed form
8984c06109A9622f9000A42303P7352F944Q9344c72958R8624B37826i6420I7836
8972D402b65096J22120b5979A23772a43650A1210c04338J16075g3273a4078l67056
8961c81134P5667A15917h00H5372b96582H863a37368A24070D0263f1386j05549
8950a66935A1670J17071N8651A4446Q0229b34703k2085J13281B49726i5615p1119
8939a66734g2845A63098g4835b7990A21261a81493a5382B3800O3954a53764r1219
8928b44983A17050d55448a3881m3254b1618k9194E7168J67176p1228e0769K631
8917d8138j767B532K18514a08454k42834D126a46794g0621o8314B33939i2373
8905a99901b6708k71282A1744P562J43580B0607c49827j28416J97087B07147b13267
$$ plain form
8893 3532 -81610 104079 -300255 -151770 32769 228564 -84795 -105090 -204924 -190463 -91776
8881 -198097 -41346 161530 53349 -298638 24098 -323440 -32151 -1382 -245379 -251351 -134403
8870 -134403 -28279 -275805 33025 156850 -195468 74756 -331001 -271925 99654 65189 -3352
8858 -39441 356569 145677 -161380 335453 -15014 -41411 -12800 219974 -215869 75070 167022
$$ packed form
8893C532h1610A04079c00255J48485C2769J95795h4795k0295r9834J4461i1776
8881a98097d1346A61530E3349b98638B4098c23440c2151a382k43997n972J16948
8870a34403b8279k47526C3025J23825a95468G4756c31001N9076I9654l4465c352
8858c9441C56569A45677a61380C35453a5014k6397a2800B19974b15869G5070R1952
$$ [...]
##END NTUPLES=NMR SPECTRUM
##END=
