##TITLE=AC1713_3097_8749698_3jzR5BpbZs
##JCAMPDX= 6.0         $$ Bruker NMR JCAMP-DX V2.0
##DATA TYPE= NMR SPECTRUM
##DATA CLASS= NTUPLES
##ORIGIN= BRUKER
##OWNER= Administrator
$$ 1.72 TOPSPIN		Version 2.1
$$ 2015-08-11 18:04:49.164 -0700  Administrator@X
$$ Compression mode = diff/dup
##.OBSERVE FREQUENCY= 400.02188249412
##.OBSERVE NUCLEUS= ^1H
##.ACQUISITION MODE= SIMULTANEOUS (DQD)
##.ACQUISITION SCHEME= undefined
##.AVERAGES= 8
##.DIGITISER RES= 22
##SPECTROMETER/DATA SYSTEM= spect
##.PULSE SEQUENCE= zg30
##.SOLVENT NAME= COFFEE_meoh
##.SHIFT REFERENCE= INTERNAL, COFFEE_meoh, 1, 14.98509
##AUDIT TRAIL= $$ (NUMBER, WHEN, WHO, WHERE, PROCESS, VERSION, WHAT)
$$ ##TITLE= Audit trail, TOPSPIN		Version 2.1
$$ ##JCAMPDX= 5.01
$$ ##ORIGIN= Bruker BioSpin GmbH
$$ ##OWNER= Administrator
$$ $$ E:\/data/COFFEE/nmr/AC1713_3097_8749698_3jzR5BpbZs/70/pdata/1/auditp.txt
$$ ##AUDIT TRAIL=  $$ (NUMBER, WHEN, WHO, WHERE, PROCESS, VERSION, WHAT)
(   1,<2015-08-11 18:04:41.695 -0700>,<Administrator>,<X>,<go>,<TOPSPIN 2.1>,
      <created by zg
	started at 2015-08-11 18:03:35.898 -0700,
	POWCHK enabled, PULCHK disabled,
       configuration hash MD5:
       21 0F 79 D6 B3 7B B4 F6 88 20 88 DB 03 48 BD 9F
       data hash MD5: 64K
       9F BD 1A AF 92 87 35 C8 84 9E F2 E7 83 99 C9 62>)
(   2,<2015-08-11 18:04:45.039 -0700>,<Administrator>,<X>,<proc1d>,<TOPSPIN 2.1>,
      <Start of raw data processing
       efp LB = 0 FT_mod = 6 PKNL = 1 PHC0 = 0 PHC1 = 0 SI = 32K 
       data hash MD5: 32K
       55 C0 85 00 8A 40 A1 F0 4A E9 49 4C 2B 77 E1 05>)
(   3,<2015-08-11 18:04:45.320 -0700>,<Administrator>,<X>,<proc1d>,<TOPSPIN 2.1>,
      <pk PHC0 = 86.74805 PHC1 = 0 
       data hash MD5: 32K
       BB 29 F8 66 12 F4 22 2A 94 DC F6 EB 82 C8 04 6C>)
(   4,<2015-08-11 18:04:45.445 -0700>,<Administrator>,<X>,<proc1d>,<TOPSPIN 2.1>,
      <abs ABSG = 1 
       data hash MD5: 32K
       C0 9E 2E 70 27 4B 45 69 98 13 4A 5D D8 0F 1D 47>)
(   5,<2015-08-11 18:04:45.507 -0700>,<Administrator>,<X>,<proc1d>,<TOPSPIN 2.1>,
      <abs ABSG = 2 
       data hash MD5: 32K
       73 D7 CC 28 67 08 C8 7E 93 4D 39 33 F9 10 5C 91>)
(   6,<2015-08-11 18:04:45.554 -0700>,<Administrator>,<X>,<proc1d>,<TOPSPIN 2.1>,
      <abs ABSG = 3 
       data hash MD5: 32K
       9F C1 DA BB 8A 54 9A B0 B8 BF 1A 5F 3F 84 A1 F4>)
(   7,<2015-08-11 18:04:45.617 -0700>,<Administrator>,<X>,<proc1d>,<TOPSPIN 2.1>,
      <abs ABSG = 4 
       data hash MD5: 32K
       36 65 FE 38 F2 5F 1D D8 80 56 B4 90 01 18 26 CB>)
(   8,<2015-08-11 18:04:45.679 -0700>,<Administrator>,<X>,<proc1d>,<TOPSPIN 2.1>,
      <abs ABSG = 5 
       data hash MD5: 32K
       41 D2 C4 94 BC A2 75 5E 5F 88 70 E2 AB 8E 44 AB>)
$$ ##END=
$$ 
$$ $$ hash MD5
$$ $$ 82 2D DC D7 F6 1B EE 6C 1E 9E 9C 1F 64 FE 38 68
##$RELAX= 
##$RELAX= 
##$RELAX= 
##$RELAX= 
##$RELAX= 
##$RELAX= 
##$RELAX= 
$$ Bruker specific parameters
$$ --------------------------
##$DU= <E:\>
##$EXPNO= 70
##$NAME= <AC1713_3097_8749698_3jzR5BpbZs>
##$PROCNO= 1
$$ [...]
150 150 150 150 150 150 150 150
##$TP07= 0
##$TPNAME0= <>
##$TPNAME1= <>
##$TPNAME2= <>
##$TPNAME3= <>
##$TPNAME4= <>
##$TPNAME5= <>
##$TPNAME6= <>
##$TPNAME7= <>
##$TPOAL= (0..7)
0.5 0.5 0.5 0.5 0.5 0.5 0.5 0.5
##$TPOFFS= (0..7)
0 0 0 0 0 0 0 0
##$TUNHIN= 0
##$TUNHOUT= 0
##$TUNXOUT= 0
##$USERA1= <user>
##$USERA2= <user>
##$USERA3= <user>
##$USERA4= <user>
##$USERA5= <user>
##$V9= 5
##$VALIST= <valist>
##$VCLIST= <CCCCCCCCCCCCCCC>
##$VD= 0
##$VDLIST= <DDDDDDDDDDDDDDD>
##$VPLIST= <PPPPPPPPPPPPPPP>
##$VTLIST= <TTTTTTTTTTTTTTT>
##$WBST= 2048
##$WBSW= 25
##$XGAIN= (0..3)
0 0 0 0
##$XL= 0
##$YL= 0
##$YMAX_a= 553466
##$YMIN_a= -490843
##$ZGOPTNS= <>
##$ZL1= 120
##$ZL2= 120
##$ZL3= 120
##$ZL4= 120
##$ABSF1= 14.98509
##$ABSF2= -5.573092
##$ABSG= 5
##$ABSL= 3
##$ALPHA= 0
##$AQORDER= 0
##$ASSFAC= 0
##$ASSFACI= 0
##$ASSFACX= 0
##$ASSWID= 0
##$AUNMP= <proc_prof1d_extract_pilot.lims>
##$AXLEFT= 0
##$AXNAME= <>
##$AXNUC= <1H>
##$AXRIGHT= 0
##$AXTYPE= 0
##$AXUNIT= <>
##$AZFE= 0.1
##$AZFW= 0.1
##$BCFW= 0
##$BC_mod= 0
##$BYTORDP= 0
##$COROFFS= 0
##$CY= 15
##$DATMOD= 1
##$DC= 0
##$DFILT= <>
##$DTYPP= 0
##$F1P= 0
##$F2P= 0
##$FCOR= 0.5
##$FTSIZE= 32768
##$FT_mod= 6
##$GAMMA= 0
##$GB= 0
##$INTBC= 1
##$INTSCL= 1
##$ISEN= 128
##$LB= 0
##$LEV0= 0
##$LPBIN= 0
##$MAXI= 10000
##$MC2= 0
##$MEAN= 0
##$ME_mod= 0
##$MI= 0
##$NCOEF= 0
##$NC_proc= -8
##$NLEV= 6
##$NOISF1= 0
##$NOISF2= 0
##$NSP= 0
##$NTH_PI= 0
##$NZP= 0
##$OFFSET= 14.98509
##$PC= 1
##$PHC0= 86.74805
##$PHC1= 0
##$PH_mod= 1
##$PKNL= yes
##$PPARMOD= 0
##$PPDIAG= 0
##$PPIPTYP= 0
##$PPMPNUM= 2147483647
##$PPRESOL= 1
##$PSCAL= 4
##$PSIGN= 0
##$PYNMP= <proc.py>
##$REVERSE= no
##$SF= 400.02
##$SI= 32768
##$SIGF1= 0
##$SIGF2= 0
##$SINO= 400
##$SIOLD= 32768
##$SPECTYP= <>
##$SREGLST= <1H.CDCl3>
##$SSB= 0
##$STSI= 32768
##$STSR= 0
##$SW_p= 8223.68421052631
##$SYMM= 0
##$S_DEV= 0
##$TDeff= 65536
##$TDoff= 0
##$TI= <>
##$TILT= no
##$TM1= 0
##$TM2= 0
##$TOPLEV= 0
##$USERP1= <user>
##$USERP2= <user>
##$USERP3= <user>
##$USERP4= <user>
##$USERP5= <user>
##$WDW= 1
##$XDIM= 32768
##$YMAX_p= 449457553
##$YMIN_p= -759624
##$CURPLOT= <Network HP LaserJet P1505>
##$CURPRIN= <$Network HP LaserJet P1505>
##$DFORMAT= <normdp>
##$LAYOUT= <+/1D_H.xwp>
##$LFORMAT= <normlp>
##$PFORMAT= <normpl>
##$SURQMSG= 1
$$ End of Bruker specific parameters
$$ ---------------------------------
##NTUPLES= NMR SPECTRUM
##VAR_NAME=  FREQUENCY,     SPECTRUM/REAL,   SPECTRUM/IMAG
##SYMBOL=    X,             R,               I
##VAR_TYPE=  INDEPENDENT,   DEPENDENT,       DEPENDENT
##VAR_FORM=  AFFN,          ASDF,            ASDF
##VAR_DIM=   32768,         32768,           32768
##UNITS=     HZ,            ARBITRARY UNITS, ARBITRARY UNITS
##FACTOR=    0.250966925370066, 1,           1
##FIRST=     8223.43324360094, -5117,        104985
##LAST=      0,             68065,           -45124
##MIN=       0,             -759624,         0
##MAX=       8223.43324360094, 449457553,    0
$$ Real data points
##PAGE= N=1
##DATA TABLE= (X++(R..R)), XYDATA
$$ [...]
23897 -131782 131051 86774 -54393 -258529 -99170 -34881 51078 -246074 -75317 -249815 49063
23885 103390 -46805 -326761 254381 -178392 -176564 -93449 -53851 -117166 189187 133415 -874
23873 93010 116921 -154774 -148190 80306 113259 -81743 -123986 -140350 145480 -52467 198915
23861 -345715 -112184 86703 -108108 93764 3777 -14476 -84472 159252 -245478 118659 105065
23850 105065 311975 230366 -186213 87601 -626 27042 356268 -32328 227826 404515 -240276
23838 14877 100319 -10878 -55982 181026 -169930 40065 -212976 140721 -124247 142041
23827 -160020 -1455 -327466 -22998 166154 271137 24686 -172088 -111571 -15960 5470 -252326
23815 119407 46483 -245178 -131444 -135763 396554 -51405 -5792 -104983 -96210 52121 244711
23804 244711 27544 -266682 -109847 -26869 230555 52287 245148 -183549 -115981 81618
23793 91297 -43505 389992 -68332 554893 389528 -209666 466605 172397 79866 -330854
23782 -148512 -121886 -285779 114338 72109 -363579 -39543 24205 -45151 161798 48301 -13238
23770 78872 36393 64754 -126005 201357 -130442 189650 -40985 225538 83993 -208013
23759 79330 -164167 -72603 211463 115303 240459 -45047 -276080 -337639 270674 72594 -96512
23747 -123129 -259834 -76932 -185964 73202 92224 34097 -23411 -69426 -94689 281664 177198
23736 177198 -102847 -37103 -299321 -74915 135620 378665 109317 97453 -108631 88204
23725 -256417 -92525 -282188 -37280 323610 -89022 -12753 -218308 -168949 -61150 43066 -100854
23713 145147 233572 31241 106252 -162201 -90942 -47327 -196213 170219 -174659 223897
23702 -208669 -61968 -9754 -7298 10604 247684 215513 -236946 45709 66836 111619 -281544
23690 144627 -14650 68115 -227102 -111706 122595 -274386 -239392 -32502 -271544 6204 90937
23679 90937 -52657 40477 166481 276686 -341527 48979 74427 -98697 125929 132093 -31126
23667 -136567 194624 -30818 -157953 -103401 -124276 92548 -77557 193681 29208 -11795 47303
23655 12746 46728 -184708 267263 -52866 -39407 -119580 -16228 -120114 -73052 -33288 105353
23643 159878 100979 -220139 -279728 70657 276 327182 44317 -71914 -1846 84336 163794 38440
23630 236456 160275 115437 -78948 -144375 -232227 -51366 -108925 -138293 22217 -197022 -56201
23618 -149490 -27180 71187 93115 -135572 71822 -173602 -75803 -54920 -46951 86577 -92492
23606 29824 53612 -371836 38752 101776 109823 -6217 -258707 310330 311014 -30585 98336 -77494
23593 165990 -125327 63881 -142105 -271786 -57566 -40424 -109422 -101266 163559 -54922 136121
23581 32266 336296 -77139 -152990 227272 26919 80744 -14930 -226023 139590 257663 -139338
23569 100608 63624 -29965 280409 22504 66126 77498 -107763 -22469 -41104 -104310 -71536
23558 -71536 -118483 77343 -285458 1665 -143082 420 -110480 30460 -45436 -120517 97633 58937
23546 58937 92290 -160001 -204359 -78196 -116538 239718 -93441 -188413 95818 -137021 -556938
23535 -556938 -144101 -317474 457627 -24061 -177724 -182113 -172386 -89826 -55807 211842 -131099
23523 -42433 -111311 420497 110177 -71153 -26241 -182962 -182025 -23059 -43147 -87828 -130380
23512 -130380 168595 67259 159848 105525 -139846 -205423 158113 -107250 7505 44149 -162883
23500 148960 204032 -59632 16158 3552 -160514 -20324 293870 -5610 187409 44470 -136550
23488 -118850 72982 430888 -27823 -120260 -151433 -88172 133182 -399728 89918 -67977 137654
23476 -71828 -86452 -42776 -130561 -58472 -68920 71698 -43996 314093 -14198 61084 112268
23465 112268 134903 198332 94859 -207415 63830 289141 220382 58893 255191 145930 -70994
23453 121556 -110766 -235225 261506 87497 -245982 -55810 -91153 353864 70286 46528
23443 46528 -95886 118027 -152207 -43795 -211124 -92371 -113647 30922 32802 103965 89220
23432 89220 62804 -43737 189721 -204541 35610 -7897 -40537 -105244 -328782 11855 -70520
23420 -25320 47931 -23013 74943 -27646 254765 -167165 -12371 -133397 262871 57010 37993
23409 37993 -314223 -260445 -56012 207502 -72389 -71807 201992 -203564 -78984 262220 -225758
23397 -62032 -88664 -189908 -702 -170604 141459 -258888 -356662 -510860 -73474 497162 -135399
23385 -54824 164512 -258337 4363 -311217 -162344 45227 12552 2818 53945 347288 267018
23374 267018 280040 -188720 126734 -243166 9653 327352 -90522 -83610 -119707 -84244 3956
23362 -11192 -319729 -117375 40896 90185 -216763 -26645 -321433 -78483 129319 -176529
23351 55702 -384248 -216685 -80044 -1459 33210 -92756 -218559 -120410 -330096 -128164 129156
23339 -382529 10563 -209888 276080 -285424 242463 12298 6786 270109 -47883 -82166 143904
23327 122958 192890 180545 -46381 328357 -210223 -315460 -78504 101862 -195009 -347473
23317 -347473 -22920 -32172 -203630 -41238 -100507 -354438 -11752 -100812 -190999 -315309 34847
23305 -92030 15745 -43831 -227083 -179690 156640 -10202 39708 83298 133702 82703 -7684
23293 41885 -90640 406280 164639 136840 -200704 -65158 -32401 -77622 104512 -40860 261147
23281 244010 71605 86424 -141440 106585 34617 -137390 -84377 -132176 150 -232377 106109
23269 -270948 165567 -76223 -238280 -235033 433612 192147 173825 73555 25440 -174636 -152688
23258 -152688 -46346 159197 192238 280492 -129245 -244634 -176610 -290586 -35194 -224889
23248 -224889 -100304 193061 227221 241973 -94170 65120 56797 -177546 169602 22862 73339
23237 73339 -264812 369724 170310 151558 -70449 -16812 -95093 276686 -245728 89444 -352254
23225 135988 212054 166038 -181315 -67120 38952 -78096 -228508 64309 -136151 77108 -221939
23213 269107 -78257 -45635 -231995 -52686 -63748 74401 -71074 -441985 -187299 110440 -134784
23201 27383 -2797 227994 16972 -89090 -25504 -45123 134109 -61521 -274451 74852 -63405
23189 -104110 104894 -43660 -182948 187848 229081 143072 34010 138159 -93014 -150490 -53783
23177 -46328 16254 315233 465571 -2177 41244 -159297 -22345 -65793 -220550 -205645 81720
23165 102124 -153022 10497 -224339 321532 222425 -210807 180931 -116032 -15408 45029
23154 90094 -145889 155221 -38277 47873 -363062 52499 -168377 -36510 127961 -373879
23143 167899 224516 90063 -61894 -190866 -178519 -3619 4557 124586 268223 392615 -353801
23131 -90137 74104 74131 37672 130198 17273 275586 -35205 -69876 -52223 67652 161250 28878
23118 -147237 -188726 -17515 -350626 -95795 -217463 -87955 4685 69177 -375334 -69022 13181
23106 -82606 -131906 163775 82377 -3383 126193 17037 -41425 136666 -71192 -13311 -156323
23095 -156323 50685 -191540 241830 224839 -167712 -201534 -182625 -191483 -31069 -174293 -212373
23084 -212373 -123759 -82156 -74644 21458 -220022 -313617 42385 -29017 -298278 313114 -234765
23072 267683 -162160 3375 -79203 -90717 -15894 -141044 6126 -420181 41897 99409 -191162
23060 68978 -89786 -72459 123822 -19397 64606 346759 -161419 -95150 -233055 150340 -177909
23048 -108399 209930 -109647 49195 -16875 -92123 -103722 -175254 126211 -53729 -33439 -282047
23037 -282047 -218230 144037 139239 54983 -141733 -78247 -226433 -174849 26528 260712 42478
23025 -110033 -169026 -105218 131853 118933 -93105 177948 68274 143808 86556 41266 -221292
23013 -9252 -81976 47090 -342727 -132981 47688 -183110 -276949 217213 14777 88460 160179
23002 160179 -39368 45362 40699 -23950 -216416 -201281 195404 -9762 -47369 38961 114857
22991 114857 21874 124771 23382 155417 191154 128190 -112069 -217968 156495 -28816
22980 -213910 -88006 236509 139110 -165803 194229 -194599 -123992 -147454 -49755 -184420
22970 -184420 -116568 -184969 -314907 -141218 -254796 -189969 -23688 -125966 -143758 -250461
22960 -250461 -189370 -55322 -18545 57629 -230871 -886 301030 210838 -108074 7528 81104
22949 81104 42863 -179907 156592 -163764 -102748 -51804 -93004 -37742 -52036 -76917 74200
22937 102226 71489 -236547 105998 -87190 4467 -162760 325827 -122200 -234781 -105677
22926 287415 330005 -7882 117926 64475 -90880 192312 -51113 -296514 -57164 -149664 172454
22914 258706 197985 -89601 129610 -74526 -46561 -14202 -289456 -130615 -26872 34560 274812
22903 274812 265784 -216986 159180 -168962 66983 23366 -241206 150563 -318490 -128767
22892 -226171 -408939 58134 -29550 25601 -190984 303235 204067 -86165 -278359 131045
22881 154850 52691 -131879 -115774 -210897 -73941 -72260 139002 374203 -16401 19997 -64704
22869 10725 35164 -121703 -21807 -114353 -129484 -154380 -166126 343137 -178615 -145307 -330758
22858 -330758 -199887 260372 -196257 71168 111781 -79971 183902 130166 47733 -417817
22847 -37610 153040 33932 94984 27903 286743 148665 141962 293651 85147 -148204 150794
22835 -71084 195768 167748 -258803 175894 113520 257527 -10838 -102622 -260883 174930
22824 95897 30178 414322 113249 -99067 -199828 -77936 -395697 -23882 122814 -161224
22813 -23556 72301 -44881 -91983 141775 -76827 -6707 46211 232550 167129 -171302 247429
22801 -280790 -183970 -23149 53362 22431 -289270 -111228 -159941 -5802 -99966 -228562 -102235
22789 -137585 -68346 -122076 24954 320484 436796 147948 30889 71159 -63056 -118130 32178
22777 131012 -290512 -201035 135207 -25488 -53656 132520 -42121 -123927 205254 -59107 16316
22765 -84155 -387256 -240896 172981 -148682 -155186 -93554 46246 151434 148870 -199547 252491
22753 -32736 166556 72489 -101520 -74346 -161231 275655 208308 -34510 -74788 -221406 -34424
22741 192293 -41457 -124200 -363261 -274632 244893 -42805 -52119 -96471 217508 31397 -60631
22729 -75865 22076 124479 197978 -31561 -333169 -2688 -30485 -261788 121531 -257512 -275480
22718 -275480 44051 -292315 174759 298745 337530 -116702 -11950 -27690 152455 -16551
22707 -58813 76814 -203669 -176655 -300092 13614 224047 -219999 111059 -86897 -332619
22697 -332619 -120523 -38100 119918 -300564 -115495 -43391 90725 26779 239815 74258
22686 193883 227903 -53871 65139 4324 -126902 -74573 -48776 57517 -152272 82985 -19515
22674 81716 -31706 193139 -67577 275380 -36774 -184057 151099 -89972 34175 -410485 -88497
22662 -365973 158506 -142483 36517 146350 -99597 -23044 -22427 19132 -244905 130604 -42058
22650 -94342 209106 37643 263551 149625 -144566 -118728 -26705 -233316 299007 -90881
22639 -4858 360137 -254218 -11107 170163 -399201 65063 28755 -9336 240892 108873 -197168
22627 133318 -124714 -41341 -96517 -21297 154469 -297483 -169848 -70444 -120147 33325 170913
22616 170913 -71800 -159437 -29097 10689 36345 -104687 -193777 67283 181996 89277 -158510
22604 312434 -165266 281771 -223076 -129141 -64255 -18480 -174856 222637 -28428 176345
22593 58775 398185 -88532 324536 17707 -24956 23608 88161 237435 -167351 -69732 316147
22581 158942 32234 -314254 -242027 -33253 -392610 -22212 -162933 30315 -47487 -207128 -172756
22570 -172756 -1209 -133617 -53483 -181991 128690 -85664 38528 -114897 201109 -64416 -310623
22559 -310623 15396 90128 93636 -54129 130496 60319 131951 -178559 -19000 25941 47668
22548 47668 -186143 56736 38458 4701 -49835 -17251 92975 -22595 356431 37287 -272702
22536 -61850 163529 -142526 -53005 -160012 26266 -126422 173433 -264022 -101569 -88331
22526 -88331 58604 -82008 62121 -146897 -257384 178998 -239749 30771 -150327 159686
22515 -276646 -146695 -220848 -184945 43821 -133721 92562 -279399 -131265 -206639 -267715 2641
22503 -7676 -283159 -86716 308625 -150125 276043 -271012 -146045 -231415 -70571 -74527 -259224
22492 -259224 145644 132814 -377904 -354845 -92089 459742 -150592 172035 -99373 20613
22481 -134325 154183 -287933 114208 -38736 -152563 -76037 -339380 -210179 45095 88312
22471 88312 -365446 -52142 153053 85675 -60982 -219809 195572 334461 18728 84652 283844
22460 283844 -32547 137397 -151568 97577 -147671 -123258 -25413 -49054 118110 -232705
22449 414980 -46236 -305756 -15217 -138024 172078 -90634 737 -89408 -82197 236268 29101
22437 -195348 174935 -106940 -87321 97368 150529 -251522 192315 188264 91749 81766 -94174
22425 -236158 -105563 -114069 -48643 -75602 44817 -107465 184953 -268949 -162909 -117706 148421
22413 -222174 139135 -147708 -19950 143716 95604 157418 49085 -300305 122911 -146367
22402 -133709 84411 -114007 51153 213921 135448 68930 -132245 -360230 -126279 -122926 -47691
22390 151329 -144654 71963 -117140 -348324 73009 -231319 -27056 73178 5407 133738 89393
22379 89393 489020 -189129 217444 -33045 78285 -334763 112125 -39661 206599 83267
22368 73574 -154 -17918 -128133 -51325 240236 -114789 55696 -194396 124274 -103033 89229
22356 -145077 -281844 92823 -183289 198278 31436 211437 -287663 -92539 -9165 75917 -179590
22344 -236553 -227712 63791 -151370 -256430 -112627 -296030 48962 -26971 -261013 153685
22333 130542 68791 65100 -166565 -129900 37021 6585 -80658 -56629 230924 -126679 -144362
22322 -144362 -138594 -98402 -171502 208530 175010 151491 -324780 -246470 -341293 -12863 245328
22310 -7374 138111 -244000 41615 54254 -184281 99311 -31951 250098 47915 -33719 192593
22298 -162091 -14659 -196728 135164 -176149 86932 339746 49125 -261161 22685 117300
22288 117300 -49299 -89278 126173 210742 -199866 -31544 90828 -380159 -382116 -64870 97202
22276 111056 197551 -4883 -242403 -189517 -128389 -181543 118522 95007 -210521 130269 87894
22265 87894 -179787 124402 -123300 14335 -210511 -111329 127202 74046 57359 -226237
22254 -261667 84205 -194819 86049 -189558 193227 -11217 -32794 336053 -103249 66115
22243 -26114 -202040 -181044 -568297 148577 -35008 -94873 -362392 60395 -254067 -77217 128305
22231 9312 44833 289123 149229 -240171 33321 3453 169450 -76552 -16190 -72990 -117960
22220 -117960 180475 358 -229387 -149989 75114 -36856 25986 153101 21514 -124920 -261980
22209 -261980 107658 -233248 9202 142967 168061 22378 140942 -169669 -223896 117797
22198 -5977 -609094 -436328 -241010 -299181 218514 87949 -43687 -27702 180807 -198198 -33054
22186 -34736 -63780 35195 -122701 -460191 340996 -134304 109321 -95026 -264919 -81766
22175 24321 176507 29005 -411170 222448 29752 -80827 -215355 104338 134906 118912 -1158
22163 251071 -375731 3822 -34744 284138 -253135 74825 49252 -114031 -23359 -228370 -226080
22152 -226080 -322762 -173632 -121068 -104181 104713 -201027 -3031 -49957 -264676 452783 -44993
22140 113687 83613 -76599 -89373 37579 157475 -5785 33732 -127713 38555 -48728 77202
22128 -293165 61400 -123910 181925 -184038 -290925 -58777 125470 -3908 -162049 -113930
22118 -113930 -116697 -67587 16760 319200 45844 63266 -51863 -204532 -189754 74699 -266977
22106 10529 185618 263210 66997 -85383 173452 54303 181594 -43391 31919 -195923 -56399
22094 -176545 -75116 228144 -127281 -270424 25014 -102381 315550 -6589 -227979 -132416
22084 -132416 -117518 198525 7711 -432157 -24224 137266 90129 18551 -217062 263618 85178
22072 322300 -153449 291289 -53242 -133619 -125389 -174812 26171 -197326 36035 57720 -221852
22060 -200820 -42296 172964 -112292 -468974 -58230 25330 169342 -80139 235172 62547
22049 156936 51526 -104498 197628 100386 -6875 -433223 46854 153808 255046 -195075
22038 -42554 -55565 -208150 -34503 -52534 -157850 -88456 -298428 272420 -200083 143213
22027 -4865 48856 -196509 -35743 234440 155281 -135593 341538 322115 -74869 33875 -37688
22015 -16447 -162584 106918 18226 109558 -119622 47201 -194599 -245406 -22777 193417 -56999
22003 -294715 340149 51090 9307 29889 61898 -24693 -168091 -28407 -76862 -12607 291493
21991 -289770 86436 -42464 -147814 -82598 40821 -340657 -333201 30286 197607 186424 -265683
21979 45127 -29134 72399 38929 -307571 -24235 -115237 29864 -116411 129943 141881 208698
21968 208698 -38962 224900 -82517 190143 273132 -124587 149075 181146 -168098 48384
21957 -35114 114711 2486 234182 81508 -100107 -50996 -139768 2664 -145220 -48319 -321716
21946 -321716 -406454 55264 208169 -52188 101488 74918 229033 -196678 245733 -41043
21935 -181555 14461 137179 -205965 -55029 -348942 -81393 -27368 92368 133304 -150157 -38385
21923 115167 188163 35073 -141239 -243305 -1335 -55545 -114878 26827 295186 -158645 150960
21911 -331288 -320097 -91771 -339314 -334546 -382062 4386 215989 -327258 -88993 -365349 -264548
21900 -264548 145580 -86082 -250879 28788 -122188 -256413 -116638 197221 -238090 -281407
21890 -281407 10740 -40595 165370 60941 -535964 -421836 -455108 86929 122631 -55739 255891
21878 68811 -3086 -195594 157630 144663 -187477 -275411 -136577 -37501 -73818 215207 -399028
21866 76201 211625 -138509 117834 -69149 184279 -115426 -74600 -74657 79401 -479504 104402
21854 96875 52577 -56611 -49835 -69467 -92408 220323 11748 -306451 -117280 -51985 -47038
21843 -47038 148685 21827 -301865 -160265 -63547 337026 3038 221615 -289852 45728 -364620
21831 5537 -219312 -16835 -50212 159652 168716 -159614 149722 -136888 -33550 97727 9558
21819 -165144 -141751 -55021 26409 -124423 59913 44258 -60517 -143545 -395465 247112 87559
21807 124167 -35510 33361 116505 -238464 -87712 -78100 -46431 86497 68980 29249 249269
21796 249269 -73415 -135686 92010 -73923 -53612 -12141 -189610 431968 45422 -190221 -57441
21784 -41636 204734 263962 -21101 -230752 -101856 103506 -97438 66366 102200 -397414 51440
21772 -19198 -332345 -299897 -399066 -328196 -236675 123933 60502 -205528 107339 -129175 -210991
21761 -210991 -164492 62926 -45835 -286713 -347490 -49483 12756 -97747 156866 -79607 27928
21749 -111883 -135581 -177693 -24422 -300672 -280689 -43276 248096 14436 -87887 22939 -28091
21737 -143418 57839 -279974 -162967 -377818 190893 93698 144622 239422 -122643 -123438 46324
21725 -166353 -370080 81234 -508084 84373 275332 89244 254536 -152643 297883 195151
21715 195151 -40564 114040 9947 -145576 -384644 170653 70787 -282599 -105030 202466
21704 -99891 -101762 40159 -235990 -64186 116826 -11431 -181768 -150972 181918 -172904 -82486
21692 -25498 -70667 147911 77280 139200 8454 35208 -8173 208027 -97807 -37092 231230
21680 -2101 -45404 131698 -2803 -42221 -45251 -256440 -291824 -171532 22106 202383 -41693
21668 -211277 -25370 -219567 -145434 163690 101259 86096 -30839 40717 260170 342786 -5867
21656 -228020 -299866 75769 -30837 39757 195265 -282813 -431355 -114406 -36984 60867 190980
21645 190980 109477 -130633 -130472 -129985 51412 174481 -36998 -123669 -93105 58928 18959 182215
21633 182215 -141557 -100228 -258665 -208952 -43511 -364017 252808 -54722 46473 71338 63414
21622 63414 -212717 -57324 247856 -269679 -142986 35828 153138 6701 -125845 -136922 98280
21610 -59660 4596 -109541 -32206 -237690 -53724 167879 72532 69781 301469 -66519 277081
21598 32260 -125047 -378566 -229040 -74686 -364364 -146650 -90374 -536575 -114331 -152641
21588 -152641 13835 22261 73188 59631 -138945 323174 -179853 -97574 65456 -243914 338074
21576 -132967 186323 -219027 110300 492 43068 -8861 -164442 -69687 -252194 258158 108401
21564 101499 -19802 70592 30423 131750 -58723 45151 37171 206570 126689 -90137 -162896
21553 -162896 -294291 157879 -80802 -34387 -167728 -385308 -104107 40794 37324 2768 -16336
21541 -61823 -291559 42638 -5486 -137285 -134820 206943 -100526 -130207 -64109 -33059 6434
21529 79121 350762 -97817 206065 215689 6731 438686 -89266 -6433 -21413 163552 -61342
21517 183320 -232574 -258284 -27216 292636 -192853 -130343 117939 219227 -16344 -161799
21507 -161799 -278091 -100519 -131848 -95081 5866 -208891 134889 -79297 -378034 -73789 -30772
21495 -148286 8224 -326030 105418 -158762 -259514 -103455 -97576 -238420 150251 -267691
21484 -72038 46291 -344383 -475901 -178672 -215292 7279 102308 -300108 -66392 65598 -223455
21472 -167528 33708 -435206 -159791 -322047 -100041 -21084 56334 157137 -66556 -136043
21462 -136043 179102 -275276 -77343 -156655 36158 -104696 -174341 177383 122637 278931
21452 278931 -494180 -129115 -10350 -76379 -63737 -88111 -114459 -16002 -47710 22677 21739
21441 21739 205162 -27689 369017 255893 266664 286312 74559 392243 211142 116382 -62745
21429 131001 87127 -364968 -34856 -71659 -100842 199970 -199675 105679 195280 -230256
21418 -538454 -65179 6410 -119339 208329 8802 207810 -125588 -44636 48221 296817 39823
21406 205395 -152780 49917 31327 54162 -257176 -38509 -113276 73445 147378 -176514 239266
21394 -57795 10066 -148568 101541 -42763 -319038 177826 -97211 -29621 -405856 -46462 -282788
21383 -282788 -259632 133321 -385697 -178697 -115655 -102048 83889 11140 -235791 -164852 -75721
21371 55597 -66464 -114098 -277427 -235143 -379059 -83118 4162 -306497 92200 208376 -94304
21359 -73033 46821 45855 188327 -5859 489835 -114553 -43809 76323 -84896 -86560 -80777 34486
21346 42798 -31140 -9701 -176763 -17420 -219445 -18729 -9589 -269354 -162183 20337 -123 156246
21333 -71557 -149101 23837 -62168 209209 34764 50804 78844 -43951 -153805 -259620 -156682
21322 -156682 -8498 2130 -68640 -4888 26379 72963 87786 393799 -291571 -232902 -93891 329825
21309 410590 -117880 166986 -182832 -181689 191410 44577 388590 -176451 -65476 -60370 -76268
21298 -76268 131689 -151095 -70845 -116309 204617 -73538 293507 -96058 256802 113626
21287 -301626 -241756 -91944 -83434 190053 -34199 -22348 200342 -93675 253629 -80960 -102339
21276 -102339 -7024 -378816 -75611 -457597 -258823 2456 142240 184852 -317882 141128 23412
21264 278283 -119309 -141589 -14530 -84413 95558 -87214 -127432 212721 200502 81542 291242
21253 291242 93727 -42424 -172621 -112905 239064 -19367 -14565 -210497 -149479 -2096 -235716
21242 -235716 302622 248132 -1726 -254744 3518 -58946 -134426 65331 180279 94391 128458
21231 128458 -171425 -251793 -105430 -80013 -226632 -58462 -51556 -79412 48196 119507 26900
21219 -99729 86637 -227612 -298443 8360 -427107 -122563 -171074 50305 252595 104584 -147330
21207 -225398 -195563 131430 -294023 -210047 -275206 172508 -78340 -170205 -59054 -158800 -334100
21196 -334100 -189940 -207932 -148650 -262028 221032 -114598 -13052 12809 48395 112759 -169393
21184 -129653 -116330 220861 131894 70090 -37952 -115826 246424 104411 -38977 -375328 -176103
21172 -193321 -112374 72908 -81471 45482 130576 -296769 24287 442 168219 -95670 55088
21160 245081 -543036 -272974 29054 132139 -133129 153991 38650 -283358 26478 -197993
21149 -147498 100708 -130954 -155153 174366 57234 -2752 -378071 -75617 21989 117915 -25798
21137 -56756 -9348 -102994 164239 -161248 -321218 -130731 137246 -228249 -401169 -582578
21127 -582578 -81195 -223588 -150559 -119082 -240431 105605 -272404 110328 192065 -75457
21116 22846 214805 38818 154037 -101763 -467706 -74241 115024 142376 82577 290947
21106 290947 -239863 -68613 -1357 -132005 -108638 -45823 -141541 -109658 -267232 -101007 34864
21094 126127 139266 -82786 14928 -73418 -124735 35691 63524 -198182 -297514 -573606 -137751
21082 -88222 -87368 119512 12566 42737 112465 106237 -364046 -103313 -233420 7652 -161433
21070 -308807 293680 -211407 -7065 -251582 147971 117135 65008 -207882 -144588 21693 72797
21059 72797 -22573 -181880 -167874 192708 179193 -31821 -30364 -19578 -139701 -211049 -204695
21048 -204695 -186911 -98189 -245694 24029 -8415 185987 -158601 -69432 135952 -24461 129824
21036 221942 -68654 18513 -303968 -125682 -910 -161878 -27989 34426 -68448 -184847 -301509
21025 -301509 -304360 49252 -407853 -191903 87965 -160092 203426 -108853 -53104 81957 181863
21014 181863 -99888 -192782 2275 177315 59747 -37324 -269027 140910 -40352 -30690 -150679
21003 -150679 77745 -39479 -199255 81050 -332135 -148351 99020 263299 14563 -383197
20992 -167576 -186895 -46402 68710 32672 86538 -37036 267837 -84506 -176363 221830 -246024
20980 -458320 139807 -126221 138632 -48005 1416 18540 26493 93695 135627 -19842 307612
20968 208909 -90088 136652 50916 -291507 -37913 -320256 253636 61900 -103437 171551
20957 62631 -97168 -274610 441647 52112 12084 -341895 -86139 -80210 163986 222301 19133
20945 -250521 -44957 -47568 57883 20411 -173738 -144865 -73652 54122 60175 18009 182996
20934 182996 50268 104248 -142430 33764 185078 -162040 121842 -44553 -46334 42101 133482
20923 133482 81641 59184 -214303 -256440 141040 -71169 -190243 106749 -190678 -293603
20913 -293603 61659 -171946 -339285 -120019 -246514 -101613 -147061 -140941 172006 175814 -75740
20901 -303641 -208522 -36042 -201772 62424 -111111 -117956 -373544 -759624 -13628 81852 -42665
20889 143571 -189480 109997 230753 11258 -257006 -19939 188505 -237735 -155231 92780
20878 -106655 -122562 44502 68202 -270918 1566 -343910 56525 79179 -78247 122196 -320738
20866 58176 -246277 -176197 -105051 127902 -193810 -360157 -165850 11272 -185356 -413144
20856 -413144 -215350 -199640 96455 -518279 74630 394416 -189895 -103503 -263954 -38227
20845 -22958 -184270 220603 -149902 -105798 -53193 148155 -171604 411206 191955 153224
20835 153224 100370 228291 3303 14199 -165637 -168576 -43006 -74034 -135418 -134071 53203 -164530
20822 -2605 99731 173650 -131671 -103189 61367 83289 338953 -123988 -106460 -67086 209671
20810 -104911 -221214 -82276 10213 30648 -106338 -316103 127857 333805 31500 127105
20800 127105 -89896 -159468 -123237 27744 -104040 21319 -90900 203998 52381 62327 -29685
20788 -32364 -173210 -241161 67462 164463 95530 5819 20325 112037 -205402 -324081 99618
20776 -481309 -301260 3408 -78950 128749 136511 -206762 -27433 -388930 -19216 94170 -139630
20764 -133561 53791 -156913 147070 -345340 180235 322117 96599 95758 -64746 -46618 -112836
20753 -112836 -95604 -100851 -48246 -22335 -18476 97331 -19350 -29838 -192652 -33438 -96270 -81083
20741 -81083 -88527 5756 10018 349126 18008 57642 -326477 163382 -212419 -20124 -112519
20730 -112519 -88607 -82028 -373644 -242390 -83199 112711 -106240 -250388 50542 -176022
20719 -103420 -146673 -107898 -54016 14921 -301713 -59256 -63158 -309735 -44276 -58056 -53842
20708 -53842 -79746 297448 92991 -1527 -144938 -215436 5707 -229671 -138252 46447 51248 200457
20696 200457 148144 450839 70993 -236727 -50728 12082 -102268 207284 -160956 233563
20685 -52191 272936 -179263 22732 -93652 102913 -120389 138435 65443 65978 -154171 -10633
20673 -104607 106845 -16336 -181321 292694 132236 215738 176504 -95029 -298419 153200
20662 -390398 76651 9989 17142 -162839 -119745 -218345 -98649 -81046 -177317 -175559 -74644 -353738
20650 -353738 240282 -27891 -60662 -124365 -66539 78820 23896 -204177 -343990 -66663 -96413
20639 -96413 -191238 -282121 140506 -235257 10806 -65380 -208135 227499 58977 239285 -120294
20627 -150342 -188265 -122094 -78660 -373519 -217034 -302125 42104 -153739 139382 -208855
20616 55067 -75252 -267616 -443815 -71735 94408 28841 -72688 98881 26456 70350 -110233
20604 -377027 -202623 -252080 100267 -87984 -66525 -66869 -43929 108859 120670 -58174 -26715
20592 -177475 -45991 10090 316429 210199 -378570 43006 -31221 -319687 29602 68282 -308135
20580 -91231 270327 169701 157921 -211518 215083 216089 244397 -131921 -93945 218481 -342529
20568 31559 -236527 -19602 -218563 -330736 188045 -203422 -206253 -148043 48738 -33314 455747
20556 203297 189496 -182355 91209 374003 200471 -124661 -65378 -241033 15105 171334
20546 171334 133965 141132 -54889 -176760 -619 -205286 7615 214284 122522 -140582 -307646
20535 -307646 -51093 7631 -394401 -323707 -59283 -16847 195863 -266594 -421576 126813 -60948
20523 -202283 34138 47090 -60957 -211010 170039 70533 242060 -189391 -315119 -51234
20512 -407552 21555 168096 11661 -145633 -15713 63381 -97998 -60428 -265110 -288531 -366616
20501 -366616 -65641 263813 195535 -71030 -262612 79380 -73166 29888 -138216 100717 -24073
20489 132905 -109663 -94833 143167 150659 97 69675 -95264 -287942 -36051 -240325 34707
20477 -208564 183178 -316743 22593 427074 10394 -60823 -98295 -28500 -83418 -70317 -114930
20466 -114930 144269 -116389 11688 -88712 125978 73006 259520 137621 331089 -55981
20455 48461 159005 222746 -238762 -168375 237261 -278175 -117219 136221 -69487 114626
20444 92137 -53747 -148672 118272 56935 60900 -53664 48382 23787 -216373 34128 -193038
20432 64242 -52103 -183239 52577 -338068 -227100 80763 333268 -165958 36228 -121331
20421 -44140 -45900 -69061 93604 -177310 111275 31999 66580 -271847 -170903 -215554 -155709
20410 -155709 -358307 8624 74262 -239428 19741 120583 110314 -180089 -296324 26574 -26701
20398 21301 35358 -30094 -316820 45691 178083 260168 -125693 -512980 51745 -32856 241093
20386 68861 -166534 -115224 -338028 -2650 -251589 212269 103479 -182436 -19356 -233854
20376 -233854 -75695 -169205 99145 -200512 -141046 51299 -16782 -6267 262921 -12035 -127422
20365 -127422 206434 380869 91401 -217055 -285906 -268835 -171987 105006 -66630 -188632
20355 -188632 240570 372604 -41938 -94641 118397 -141371 -115402 -254176 -189626 -243540
20345 -243540 93222 -111749 -36591 82383 -560086 137792 85928 -201471 -105828 28628 122212
20334 122212 24844 -12074 -55633 -107503 -288266 20195 -264818 -436223 195382 -29036 333666
20322 -25105 -108402 -6696 -95630 -196596 -169818 -119313 -30169 -118108 -195341 -161086 174243
20310 -195268 90428 -136576 -88048 19994 87427 85390 -46889 128379 -128376 78915 151772
20299 151772 -308723 -209370 -177139 -252240 -106486 -202121 55430 -53912 -4020 484864 -94455
20287 124379 -70113 -59011 -221512 114146 -226480 -116876 -313576 47585 -86459 -236267
20277 -236267 193415 -36598 -183971 -119583 -37444 -140256 192462 51190 172885 -462086
20266 205592 235859 -47339 -115480 -135189 -182795 -81158 -67360 -261860 -128676 17340 35966
20255 35966 -413763 -131754 -37424 -315309 -425869 -111882 -104474 -358028 179914 -169591
20244 256277 -85897 -206679 108517 -175349 -262988 -48693 -123258 307597 207750 211238 -403924
20232 -446594 74120 45093 -150379 164109 -17320 140231 -7702 -240000 -356821 -320819 1363
20220 -181852 95577 -21966 8103 -4770 -166494 -77552 -57656 223598 -166271 67350 -51390
20208 -159848 33505 23945 -32424 -212100 -180956 -88879 64938 -218541 -119168 -189310 -33915
20196 -137052 80885 -286941 -212269 -328640 59572 -98605 -226761 54826 -16912 -464776 -142133
20184 320967 -66972 -92097 31337 270278 -9591 -231147 -206119 270160 155133 169029 211457
20173 211457 -242765 145996 -133602 82986 -456142 -153342 -137326 181785 222328 231999
20163 231999 -24704 138878 -218479 -462995 -309089 70108 -6587 -98353 235372 -233189
20152 -90264 -144537 -9748 392854 -49077 -166989 -244571 51618 28299 222178 358467 6293
20140 145182 129147 203270 185268 -4220 196762 -33349 63125 -108837 161680 -161444 -108465
20129 -108465 -30793 37957 -275288 -131219 -162108 49523 -41146 -126193 -245049 -398885 -66920
20117 -45058 159085 3655 -244786 243162 7174 26128 -277066 -110508 -153985 -38072 48691
20105 45077 -94127 -249881 -247595 -366637 -156744 -197311 -243028 -478191 -196574 -65478 168149
20093 106795 -216338 -163108 22293 -44602 -96210 7231 108252 -14442 -144767 -115334 27310
20081 50782 75856 -167539 -206968 60119 -32074 -106996 -239527 -123121 127658 570135 85205
20069 -190970 25817 -125217 329365 -16950 68578 37733 -217426 -442452 -135050 114176
20058 -185114 -62864 -253771 -108432 -31119 132601 -30897 -62633 -106934 11106 131748 -20298
20046 -43173 -99338 -281703 -142432 -15237 44378 40971 435666 -324075 -217910 -18021 -176416
20035 -176416 -16097 -44783 -186656 -115290 -55348 -3824 49493 -186148 135731 -3490 -190830
20024 -190830 -98547 50277 43077 85555 -177214 43809 -136067 -105305 -2823 -186083 66919
20012 -113458 -311009 174215 -44704 -375890 148996 31181 169964 49187 -96613 -142333
20002 -142333 46711 -83622 320055 89254 160714 87368 -13714 -248896 196492 -104990 -164694
19991 -164694 -112648 -207108 182997 -112213 275347 23840 225495 61005 227426 -53693
19980 14676 -127333 27116 -135520 -102033 -47039 104652 -417628 272374 -116202 163061
19969 158560 49069 -157903 90602 -1939 -88344 19482 6790 -9029 -129738 -335330 18638
19957 64580 -124713 -111185 -175624 181158 -28650 48991 -2172 15856 124481 -244696 -184210
19946 -184210 -109911 27463 123199 -116190 -173831 77623 155007 -474907 -503186 154475 238757
19935 238757 94339 -260469 119603 -120310 43886 102989 64330 -27075 -78823 -222655 -73050
19923 -203526 -8630 -43432 -153053 -113801 -69094 -102062 -385778 22950 -141762 75994 349063
19912 349063 -93171 16793 330053 -303215 114317 -200665 -156393 263166 -34994 -68723
19902 -68723 -214389 434876 -85173 -302 -211171 -6361 15204 -243018 -233697 85168 123162 -208233
19889 -287233 185078 82619 137707 35583 118846 -122372 -83287 -89097 -187770 81710 -225764
19877 -273768 -89439 -29600 69085 -43841 -184448 -36179 162338 -83869 -173086 -90014 -54923
19866 -54923 7019 -263668 35695 -289075 -21365 -72098 -229223 -34301 -297989 93896 97393
19855 97393 -277289 -249197 7283 -62216 195526 -149174 -46438 114435 -412535 105310 -30037
19843 -82004 -81099 -324838 21599 -355644 -85389 -36116 -117501 -63732 -120578 -239385 13250
19831 38168 -214551 -291563 503267 89502 -143446 -113608 -140836 -20465 -306575 -388772 -70557
19819 260109 3074 9983 -104586 165523 -217735 144862 263161 -38324 24152 -140066 -110558
19808 -110558 80064 -112654 78140 -118530 -42027 -383583 327549 11481 65668 30073 -204820
19796 -139195 111818 275084 -361226 -114582 -211616 -165811 123838 -251138 -148052 117898
19785 -37209 -32421 155965 101491 -110942 -64213 60287 -4384 364001 -104734 -267575 99190
19773 57525 -144692 18203 -200138 188685 -28285 -352539 -140628 -170813 -291422 183873
19762 94885 51486 26912 28180 44817 -135300 -112142 -156063 -234389 4271 -89114 -45147 -32931
19750 -32931 -405662 -381204 -134965 -328450 92492 36685 -367300 171992 -289133 98242
19739 246935 131047 -402277 -53727 1427 -255446 41421 56050 30472 -19018 -111483 -407823
19728 -407823 -57188 245912 7601 -8815 -15693 -146213 -112228 79226 -110915 75786 -143503
19716 20666 -415614 -105212 196711 -231393 104181 -134189 -52745 -327307 -3899 -287657
19706 -287657 55257 -123883 -11428 -133311 -491250 -309197 179299 -37574 213192 5912
19695 181226 203376 126421 136942 -221209 78075 -162703 -2889 -54550 114724 -83509 -130941
19684 -130941 251228 -41601 -67477 -271448 -268116 146683 -196128 -54704 -206287 -293172 -244376
19673 -244376 -191673 -198870 194453 50042 176165 -105264 -323362 69211 -318651 236874
19662 -170072 -10969 -2741 -380843 -14835 -182294 -66017 -253070 -433350 -21135 170305 -471009
19650 54827 -142199 -10243 -188602 -112658 180481 -304434 51996 76790 46990 -190668 -179972
19639 -179972 20565 155327 -164733 130908 24394 121604 271468 183268 41406 -36122 -292653
19628 -292653 18769 -180213 221234 49035 114450 -241764 -126547 -7472 -41416 173506 -330215
19616 -6415 261313 -119126 108482 89846 79328 216243 37549 -273491 -49637 -189407 -149433
19605 -149433 -21927 -99745 94011 -31228 -175737 20857 -42120 -12406 45763 245278 -168094
19593 243780 254448 -63250 -5247 -116545 197172 233671 260922 9021 -70983 -160498 170916
19581 -53201 107837 -201408 -256325 -158574 -6685 -236547 421863 154430 32536 137905 274991
19570 274991 -49033 -42418 54581 -340413 -68241 -309337 -12099 81633 58424 16697 -972 261389
19557 31822 104087 -176169 49058 -276855 -267275 -43460 -220321 234907 -197718 -218999 -263815
19546 -263815 67746 -95932 -103618 248708 -119352 -122778 71908 -81942 -347282 -233036 60202
19534 6532 -38787 -335178 -100564 -232669 174139 -162903 -115699 -179527 265776 -27242 199390
19522 -22368 -21371 14205 141057 -215785 -104901 -84871 -65116 -51183 170661 -262665 -172669
19511 -172669 -226827 20397 -335937 -306632 -59386 -137317 -191884 -208002 192359 -494946 212
19499 142049 -211832 31419 49413 -84831 -183147 176144 -361202 -179893 119324 -13181
19488 140183 -188513 -78797 -90765 150119 -97392 -256771 -27310 248062 95929 -43768 -169799
19477 -169799 -40411 -129814 35109 -46854 -229791 -181956 81695 31141 -358724 84767 -105671
19465 -194102 -116867 47952 116167 50567 -142194 -118086 -104479 -115075 34254 46533 92611
19454 92611 -178621 -94936 -60374 -330120 198053 -66826 -191605 -29307 57764 -117414 -308058
19443 -308058 28847 5162 -280815 -268164 54473 177175 -165266 151896 -117810 166497
19432 -461429 -225476 -230093 207135 -213300 -258509 73522 -248999 31688 135486 -181109
19421 21054 84679 -88217 18475 -175525 2307 -110010 -39168 -120763 -116342 -400218 12375
19409 -110898 74936 -260966 210893 -116920 -91644 -317998 184589 49129 122402 -103321
19398 -151986 -9613 108075 -325251 -85218 77414 -163128 22170 167255 -149654 -339976
19388 -339976 -93173 40163 133553 14137 74057 -51784 144443 40211 274014 -153691 24954
19376 -93997 153982 73960 -3065 -302974 -158176 -197156 -355307 -199205 292735 42873 -191000
19364 -144439 157085 224030 -107175 -21834 -422700 23852 28268 -264031 53599 -368873 -140777
19352 434335 -278971 290833 -56146 179312 -152317 -169527 -126381 -282264 -350304 -409285
19342 -409285 -272604 -245115 111624 142440 -28926 -100940 -45120 24440 161214 27615 112022
19331 112022 -55336 250924 273484 87540 -59401 290300 -228965 16393 -8179 -19170 -484971
19320 -484971 -396503 -238078 -76496 -245339 -202470 37719 112971 330859 -201278 192411
19309 109782 287653 -354236 248448 -177040 -168232 -108794 -453901 79384 -325577 -124016
19298 166385 340330 334056 61290 -52028 116661 -77417 50205 -206784 -27383 148221 -94498
19286 75790 -309405 -182279 92874 113843 -175924 -26921 3325 -342696 -35958 -297782 117052
19274 157818 309860 -175722 152279 -160492 -103410 -148227 -34456 -447453 -120753 55902
19263 -67951 497155 -303653 79099 -147773 -4329 215422 -131559 -146736 195886 155241 -7034
19251 163524 66815 283471 -63752 125924 -68738 68846 115744 205464 31717 -178066 -264932
19240 -264932 99531 -96938 -139619 -9151 56968 -128279 -106798 115880 177366 -181439 -58523
19228 -524789 -25576 -202900 -100307 199187 40238 166049 -27576 75801 75316 -54878 -170749
19217 -170749 -61969 -261409 54871 -349997 61801 -35048 -104243 23715 -155559 -157688 247006
19205 132909 -6960 -242252 176456 -536038 -149876 86384 -73319 3103 -6733 -418068 -225321
19194 -225321 64116 -31835 75359 -22170 -151035 -192445 -358214 -170747 -234423 98915 -96209
19182 -54886 -126196 -98609 -359818 -9869 16675 -109224 -74555 97062 -160713 -75048 -195428
19171 -195428 -133972 170921 -218942 124946 22037 -145373 -165496 -162576 -66934 -446504 -149924
19159 58070 -319377 -229286 189691 49457 121457 -244167 166021 287194 33611 -293181
19148 52812 -27831 -78440 61476 -307161 160704 22933 -305092 83061 185272 -2151 -8461
19137 -8461 -231783 5239 -53015 99966 -116899 -106900 149793 -30309 -143151 47398 -316338
19125 -69831 92577 -218163 121066 -75267 68512 -262801 -236657 -163051 34966 -140965 -78534
19114 -78534 21747 -109316 -88454 -94384 -349205 11387 -140806 83388 -138426 -324341 137115
19102 109058 58046 -135063 49704 -302902 -5100 168049 -9068 -129385 -406301 -36364 -140424
19091 -140424 34700 -167300 -268094 -207724 -144793 85805 54723 124247 261749 -68365 -54029
19080 -54029 -141636 33065 -106970 -78219 95079 -101589 -118384 206109 -107658 -379406 -80156
19068 8934 146722 -119690 -155546 -134775 -115340 -70344 46026 226717 148011 -144675 -33973
19056 41227 24080 -166656 -199427 -145891 -128705 -40305 -180448 -19880 -154171 -62165 -127440
19045 -127440 303840 69181 146323 -24650 -12861 -400058 -291107 -105774 85634 -292607
19034 -8144 24818 -290992 -94438 204964 142524 -36781 -226635 34260 210556 -21035 -28046
19023 -28046 31038 329586 -5245 -31806 -169665 169425 23720 -220432 5135 -11880 22737
19011 132622 81901 -247427 -23091 -143561 -12878 -415781 -283321 -213929 -15202 79863 -148696
18999 -202897 -419297 -144153 97714 36966 37754 -52360 68206 -88093 64557 152950 -158703
18987 -480640 -67395 -79622 144123 -85800 -450349 91072 -406642 108958 276366 -140745
18976 -67106 75435 -6577 13260 164037 -279 -217731 133491 -269080 -315198 -162461 -186935
18965 -186935 -73935 95954 267276 301 -161918 -39990 -236808 55553 -44374 271943 94866
18953 -82136 133829 -277638 57722 -10875 85631 103713 -68613 -279892 -273784 107935 210919
18942 210919 -553966 160303 -39270 -147526 -297077 266095 -231115 -190516 -166326 217492
18931 -7086 245459 5806 -83611 -35950 -86074 -2833 -148838 -53616 -184623 -82009 72580 -101675
18918 252325 -4007 98497 -242385 -101512 -173537 -100310 -18924 -8794 107072 197815 -323456
18906 21159 -114231 -231306 -40550 171388 320577 -67745 -120919 28543 224170 -139625
18895 228597 233382 -180883 154553 -253899 -48810 465 81129 -12418 -3112 -134882 -185920
18884 -185920 -146 -243823 -133463 88018 -348165 -135776 -256637 -322718 -162849 231030
18873 -201599 -195870 8745 63517 15775 205456 -172567 -174078 -79852 139919 -62745 -416876
18862 -416876 -139709 -9250 -93541 -214997 -60475 -177137 -35694 -155675 -12955 88919 146753
18851 146753 87226 240554 35562 78978 -110674 -213652 36051 110424 -78081 -120870 136595
18839 1530 -164481 -16379 -37501 157010 192840 246140 169486 -59393 158293 -184008 117623
18827 -60219 146900 -109643 134278 -405799 -128898 13240 -199497 -60570 157200 -172698
18816 340217 31766 265209 -76223 143447 88758 65417 -183193 169556 19731 126362
18806 126362 33275 -117870 -307705 9440 -179911 -435571 -195362 234813 9043 5826 -21558
18794 72738 103402 -86942 81470 -159981 -53713 81680 83372 8682 -143290 185892 12462
18782 149633 -15702 -27293 205861 -251035 147568 186929 -244232 -69168 271680 45301
18771 -13965 -81684 -207364 73278 -192036 45626 192473 -12208 -50220 -164483 -162736 -89531
18760 -89531 -178248 -127860 39521 -188075 -162818 31275 -169540 -223110 -43021 -50928 -196732
18749 -196732 -442668 -169192 214835 -322596 85863 -109965 -202787 161305 -131 -113203
18739 -113203 -50314 -393255 -99865 170092 105111 27217 -117608 -47592 -102008 -164402 122404
18727 42105 2718 1612 -142162 -4053 -93941 20269 224982 38655 -47572 -85624 -146186 -31564
18714 -235137 13490 181504 -441669 -196505 8971 101880 -45392 25825 -688960 -188771 51535
18702 -165366 -344625 -121676 -16380 -106564 -57649 -57759 -201558 167960 -206203 160921 153148
18691 153148 21887 -15554 129348 -176710 -168822 57702 -174475 -156809 -339324 -340418 25548
18679 -149215 -294119 -17611 -206100 39123 268920 117298 -42366 45966 44514 -279024 -158743
18668 -158743 -47526 76473 39197 79339 -27567 -261845 10014 228621 -24289 210375 -8976
18656 -1667 -332428 -125026 -130777 -67868 -287295 -158715 -5517 -24862 121935 -139595 -180847
18645 -180847 -169836 -77064 -59728 -55499 -23633 -10842 -214908 -156252 18119 -98986 -72040
18634 -72040 -172433 217102 -57386 -16521 -39403 -180881 351736 -236250 -219245 312170
18623 235339 -210413 -150022 -283913 -97605 28849 -11853 -132581 252278 -35296 53634 -146127
18611 -232934 -162229 224588 226458 -23690 431863 63038 122489 -168100 12354 173416 183951
18600 183951 357605 80559 -207933 185103 -224790 88962 -48844 71474 -153492 -349930
18590 -349930 -16156 -225905 -248489 82184 -45640 -161401 2200 -413113 -98621 127196 -192950
18578 35899 129509 -109402 -275475 51987 106617 -70333 -112711 53397 -288192 -147278 -21818
18566 -339641 -238244 294001 10741 -25278 -149138 -239403 161863 134495 -134104 -151834
18556 -151834 135054 28054 221175 6600 1240 -207973 -102871 -103955 62336 67237 -328016
18544 246375 15544 326906 143616 -504152 -224899 -191592 108444 408590 -125784 -95678
18534 -95678 225475 -305901 53296 -246243 100108 109197 -99492 -118761 -129546 32073 156615
18523 156615 -128553 292001 -80910 -168473 -40231 91332 -65344 -111689 -48602 -207072 -163207
18512 -163207 36478 88859 -61247 -149643 -281495 -9259 -268843 -334879 -239294 -258403 -151696
18501 -151696 -21090 -251210 51959 -169062 -20101 -83068 -249442 -111887 66351 -167029
18490 -48801 -427565 -111174 73064 -35942 57004 61810 -40060 -3952 -131548 -31117 15399
18478 -220286 -77981 66023 -126872 -145592 71642 4092 -35792 -165526 -55215 42263 -91292
18466 423963 272789 -125406 -182985 192286 -113727 -107980 77086 20538 -78268 121344 -250065
18454 -191373 115871 239187 181194 -44581 -281748 59271 -187958 -106525 -327243 -187498
18444 -187498 -53518 -42529 -304754 -278693 29926 -175948 -14117 -267288 -211763 33427 -38084
18432 1310 -10764 56134 -145368 203160 -89070 -181265 66804 -82483 183212 -450217 71981
18420 -182007 172418 140204 -140900 -169017 -39218 -60710 -15558 191719 20651 255622 -92601
18408 -54818 191964 208911 150390 -44074 -185438 -212192 -196355 29857 66767 -54803 70240
18396 72461 -202297 -184869 -36848 97388 -412953 186535 -84738 -300155 126045 -141651
18385 535347 -290962 -319328 123545 -136352 -241913 187665 -348164 348425 -16906 65428
18374 -171231 -231181 -66053 -73794 -74366 37905 -59180 124891 142803 108344 47824 -1858 35851
18361 142883 323093 163282 32327 175862 231797 -351251 -284874 -189826 -99756 -30792 -429474
18350 -429474 -126036 -102071 2051 424467 -165785 7932 40254 15910 57499 -136039 -240192
18339 -240192 -28217 -22904 -36822 13802 201042 82539 -118875 -170651 -41917 40785 155295
18328 155295 104932 17202 -178974 -54894 -303528 3385 -111359 -179319 155610 -48647 312481
18316 -84016 -173901 82841 121032 -34627 -266336 -85921 116749 -128262 -53301 -291326 978
18304 -87010 -58687 -453913 -104091 -117905 -27159 -94929 203024 -91921 -238670 -79145 -114791
18293 -114791 -236928 67211 5182 -17678 93455 18877 -43673 250805 52344 164886 161719
18282 161719 -184381 123335 221707 -73168 -6201 157327 -128400 150048 45556 -31752 -174684
18271 -174684 -293406 -43307 9571 -161722 222783 -30234 261564 -103334 -139121 169835
18260 -87134 -142687 -263368 -45263 129271 38996 -120041 -167064 -109379 -5183 -96671 -276778
18249 -276778 -84266 -154025 -184744 -96366 -307023 105018 -348593 80515 -126870 -172284 130407
18237 -46853 201808 132647 253043 113880 46620 -221384 269610 -153950 114230 -225542
18226 68156 106471 -240925 -178715 179408 -37916 288370 353397 -129230 -110404 244528 187222
18215 187222 122139 -210552 -109294 101512 -196595 24263 -247703 -67577 365152 -19836
18204 85218 169435 -163823 -63023 -309965 -121939 10667 -271373 171340 -64149 27294 98372
18193 98372 -100807 96417 51406 -260336 -175090 -291760 142067 -10850 -210276 52508 -202921
18181 -71128 -64751 13825 -31763 -27859 75046 41036 49609 -89774 259476 -187746 -39332 -41262
18169 -41262 -48733 94147 -18405 -65373 178666 -277599 -186464 -127660 4966 -67598 -57346 -203096
18157 -203096 -12243 -136422 142696 198115 -290408 -436187 -31361 8546 22168 -286010 -14857
18145 -137567 360504 -211986 -389917 17296 119491 -178674 -82768 -216893 27379 -53083
18134 -381164 -284348 -287350 76256 52916 -6260 105086 65991 -31123 -161502 -313403 -307134
18123 -307134 -82523 52102 -179474 66378 116068 -213726 -13234 -126218 234330 -88930 35447
18111 -200532 -190845 -211628 -23012 194176 -86753 100253 317651 -92294 102930 -203211 -61590
18099 -232853 -96955 -144667 235389 -42710 -147486 95215 -306105 -210936 -161812 -166253 -90424
18088 -90424 -81727 37102 -25217 95138 -165931 -185220 -65093 106384 40862 125879 315691
18077 315691 77342 -103067 -66714 4370 4991 41378 265545 71069 148948 -230549 5603 8891
18065 8891 324002 87046 -94319 -373090 -274068 -35025 -70523 -176874 -83548 83286 -106038
18053 -67796 -98708 191188 -89133 187577 -34537 -76588 -190653 -18731 108379 228963 6529
18041 161420 -345046 -102038 -71862 4861 -198299 -85653 96395 149082 191012 -3123 94217
18029 -275821 -55028 -82721 -180742 258308 -28105 -303489 121335 299878 -244158 -181053
18019 -181053 -671748 110985 31575 86586 94663 -456912 38966 79829 -332651 -33515 -4139
18007 133214 -183822 -93955 84519 43282 -4901 41401 54087 -82 -76304 -16290 -448247 -21598
17994 53267 186806 268974 -156229 -228363 -316200 212703 365772 60677 -20025 -32361 103423
17982 131374 32534 -54933 -33749 90540 263728 60540 159428 1081 141791 -29314 57696
17970 -223374 186582 -6043 181846 48498 -36338 209923 32431 20351 -84330 98385 3682
17958 -70194 -7663 -96255 -292888 -415319 63948 -124876 -146985 -295516 -183412 -275205 38451
17946 -108485 72878 -295439 -110632 -91558 -58717 -52071 10003 -16401 -70268 149351 -219381
17934 -96601 73071 79328 -65096 408235 -221540 272199 89666 -72233 -171018 -11807 -267667
17923 -267667 57381 -157813 169017 -184794 -174975 -97145 -172289 -136864 -151985 147324 -89269
17911 -5371 120938 -84770 -2208 70530 -67793 -41290 -52909 -374739 -190791 137235 -237406
17899 -54218 210911 18108 -131302 -128466 -314235 74398 -110488 -204371 -169460 289297 136172
17887 -63767 128855 -94900 123162 -86856 -21112 55841 185481 -48247 -53917 203682 93435
17875 132377 -128519 -174679 -133945 157695 83396 -99343 -117846 73330 -105336 -59835 -211015
17864 -211015 -163208 -101538 50948 192414 201785 -85792 -235610 5500 190058 142135 8197
17852 -304746 -222241 -139617 -200705 202915 210309 23851 41274 71356 -238498 196342 -327876
17840 -80469 -97293 15408 222505 -148720 -48230 -45144 215744 -216469 82277 -75944 55522
17828 -433731 274992 19196 57808 1444 -1961 53711 -141714 -37725 -215357 -192910 76941
17816 262126 133512 -249637 5820 -174313 309768 -383618 -162368 324809 -324206 151710
17805 -16425 333706 155249 207201 49774 199506 -285934 119634 -202078 -20885 29995
17794 228623 89712 -43826 28155 347147 -110411 128159 222242 -218002 130966 20889
17783 179912 -21584 -10684 -80813 85883 21031 -135522 26562 1436 -175166 157803 -134635
17771 -104380 176192 -191224 -23568 -169011 -43619 64457 25637 -314907 -130515 -29500
17760 181427 -11612 48205 -73205 -27783 123677 146584 356675 -56947 30811 141724 66161
17748 -117950 172300 -198389 108472 195826 134754 -139853 -262663 -55511 -11489 66788
17737 -78558 271866 141020 58987 -21608 114168 -95204 -59697 129755 185910 26642 145880
17726 145880 -231937 -293715 45769 -73038 -317805 -250448 -16323 -68574 121624 -42177 -66321
17715 -66321 -246900 36323 34703 309157 260202 55875 219814 143070 272030 79802 22111
17703 114670 -56020 538 162307 25038 272816 -192500 -70832 -62298 -110253 -128849 -74943
17692 -74943 -6813 -256027 -172531 -79992 -1313 148539 172889 216188 173407 314714 -249685
17680 -31371 27743 -114538 -65146 -170961 -195868 2850 -304061 210164 164054 -129046 -28940
17668 -62322 -188865 -76171 -42071 368515 -135304 46484 165082 -112078 -25510 45572 -231647
17656 -68447 -253578 -89357 -136111 47638 -71744 -60972 -268283 178590 229091 87642 -1415
17644 -2778 -104547 66422 -19963 -93967 203620 -229892 38502 -144274 3519 -28969 -254429
17633 -254429 52879 -45793 -15039 79084 93198 49113 -82093 208937 27212 -67517 67456
17621 -48885 151234 387565 62370 65877 28112 -35469 176160 135465 346251 187847 -59632
17609 -46941 -269455 -118524 37063 324146 -37635 27169 275322 150993 -24675 51368 -99761
17597 -338135 200169 169709 8195 15145 424094 -48144 -36190 164539 -127449 -239870 -174837
17586 -174837 -10822 138541 169222 70086 -132396 -23649 -186302 102332 198566 163102 -59654
17574 368032 77809 182128 236030 -320254 156013 -108008 -280659 18171 267173 -35096
17563 -310943 -80794 46358 -45023 70799 71987 83540 -9830 28757 -222782 106563 -217780
17551 97747 299279 -108539 13245 136215 -197506 130535 19877 378609 -128993 137190
17540 167013 165316 49961 208981 16626 249678 92374 76798 -145826 99577 158753 -112803
17528 203302 221245 26718 35450 -155856 -31757 202451 171292 151595 183747 -215022 -45519
17516 31709 172381 80356 -226925 419749 147714 61135 -60954 81836 -195388 -29016 185872
17504 -141585 301408 168197 -115328 118773 -500440 23858 -151477 264984 -255522 422577
17493 75494 189833 -47251 -82783 140673 -56878 -43667 -134537 -162077 407538 125236 -68596
17481 -68393 150319 -318674 96887 294209 -42082 23948 369870 421179 545477 209103
17470 -68002 -172616 165648 -80561 -228630 202319 146632 -51420 -4596 85566 160220 133980
17459 133980 110746 54887 -73236 213019 42482 16812 215552 287288 -166196 264638 15860
17447 -16225 494706 242520 450308 -9459 78949 100123 399604 114467 326962 261197 -92559
17435 258015 114995 15229 351001 81141 393891 170771 -78972 98135 135628 211780 54801
17423 158200 419931 12171 367041 655023 225735 422238 -31486 438004 185438 246305
17413 246305 306680 -197412 133249 287660 74264 -88232 318528 -5695 264863 94177 368117
17402 368117 120911 -51486 -217241 188703 -468476 -298686 626701 100308 -45993 -40321
17392 -40321 322613 -126139 -223322 -115145 285643 125276 270752 -3042 272138 117944
17381 112134 -20412 63290 27458 138926 176821 174746 266845 20645 55062 165821 -217507
17369 262758 23265 207778 311268 199405 -182614 -23508 67936 -62109 115591 -109890
17358 277499 252241 -391 79179 74692 23744 173753 114916 -119738 166640 42560 299869
17347 299869 320981 -24962 -90388 -39278 7115 -272911 298195 -3168 58010 119480 12467
17335 235409 -108049 57624 33886 -11957 17794 187754 219298 4242 271887 11754 129907
17324 129907 76658 191348 33415 252601 133919 164478 84010 213382 451412 370383
17314 370383 217931 188133 271194 58379 66343 50644 -18662 -205385 96464 290624 -137096
17302 -188242 21228 223328 -110507 393620 221916 117106 101055 27873 -73724 61980
17291 371170 74901 9112 200089 -7331 94401 242171 299558 6436 309324 158523 231639
17280 231639 112916 136182 76676 -181937 393220 -100689 -96994 228823 316113 -142302
17269 221648 455416 152061 27468 -30082 151310 165159 550575 250287 -128087 170533
17258 161550 369165 283048 -127337 373346 170739 -269839 105258 122188 -137739 -4968
17247 419951 193724 -247866 261863 384684 437296 172623 -349970 417112 115608 -52206
17236 47452 208615 -44236 259781 -88222 306721 253306 464989 206479 10372 65176 77626
17225 77626 34876 102753 128890 165422 156368 48144 375722 552312 226316 51191 -12898
17213 448469 158107 -80311 216955 454792 277665 146252 294021 274529 201526 271912
17203 271912 78080 112739 123573 183191 146364 393778 133186 314649 384903 -106941 544685
17191 52996 214765 338425 245883 76569 -260797 258960 131566 -410 -292961 58244 103652
17180 103652 -76039 192964 167952 29965 136397 72448 474545 155274 170643 326869
17170 326869 296117 299815 151067 107043 268754 392101 213184 459322 -62219 -110721 213568
17158 452160 -76713 189645 301167 194402 434879 148591 296844 360787 10391 482321
17148 482321 100327 199583 189451 381811 338008 437666 68559 390816 473121 429319 85152
17136 34208 149124 360733 133909 252210 211228 421841 203496 247534 45898 316704
17126 316704 298230 236089 321057 64105 371955 416620 522888 244806 409879 67376 427782
17115 427782 284852 493706 378455 160628 142216 331212 292540 428823 334589 279572
17105 279572 583065 168478 -79834 529197 -112719 242295 5742 98462 87650 476335
17095 476335 281230 300477 226745 392586 69409 296842 444164 302815 416419 571966
17085 571966 368270 89391 355850 361660 673341 647240 602424 192084 328064 429686
17075 429686 275487 207094 494345 412059 401246 504447 368394 -34332 364187 550032
17065 550032 155066 594666 292980 376834 407346 279642 147829 377333 551211 448441
17055 448441 258406 424606 612969 446830 561081 599639 330538 388705 800981 686776
17045 686776 390094 514576 562560 80616 762853 239163 558705 744561 212400 397895
17035 397895 457413 303177 387997 389023 499468 464954 475559 252066 642141 1018537 833739
17024 833739 693336 674444 456226 570373 469454 759416 238802 917482 556266 309888
17014 309888 378302 611304 675565 571477 636927 525158 730383 422633 688501 380268
17004 380268 741645 494388 603381 612087 894127 791423 701787 531768 560766 540848
16994 540848 390989 622677 840349 840224 332758 603845 634829 380317 848311 363276
16983 534169 590375 830822 981054 732762 514585 545057 548675 742088 1009209 736291
16973 736291 389533 894275 617504 780514 910900 797044 1154818 837717 992195 909977
16963 909977 708082 714522 858344 1186153 816697 996005 802367 1018159 576534 789504
16953 789504 815452 1053414 770258 645483 837585 976197 995783 1028553 870709 1020410
16943 1020410 1084798 1154374 1065577 1003369 1193340 1041345 1240016 1316115 1157143 1339716
16933 1339716 1184110 1161041 1509685 945524 1195083 973433 1023211 1434870 1367272 1227077
16923 1227077 1171284 1301840 1031065 953917 1122606 1328836 902032 1645288 1142460 1114540
16913 1114540 1224258 1303335 1352454 1465476 1491349 1550189 1204489 1359378 1119969 1613031
16903 1613031 1438354 1552595 1612430 1445991 1779778 1024375 1558325 1530543 1508571 1359187
16893 1359187 1665464 1350217 1578902 1733881 1809273 1715130 1819804 1905523 1852212 1856427
16883 1856427 2042851 2113760 1979523 1968539 1961058 2147889 1893423 1957547 2064578 1896486
16873 1896486 2267217 2089256 1826393 2180869 1921683 2397324 2356765 2171750 2424313 2314343
16863 2314343 2133935 2460802 2166689 2553461 2202689 2429622 2745291 2085668 2327900
16854 2327900 2792846 2711716 2500850 2660367 2913539 2488441 2977517 3112000 3043818 3160395
16844 3160395 3109546 2840584 3178219 3207591 3142299 3285054 3549511 3515951 3512337 3325351
16834 3325351 3806155 3900208 3922622 3705030 3856043 3894098 4178831 4254358 4111254 4185281
16824 4185281 4197279 4479240 4605475 4777989 4769317 4985822 4818640 4765428 5116634 5350626
16814 5350626 5395310 5429068 5472413 5505445 5858399 6042913 6186044 6130935 6227485 6040906
16804 6040906 6627408 6663537 7125739 7205350 7229301 7162588 7726608 7489689 7715899 8273266
16794 8273266 8199179 8549517 8546838 8942410 9265898 9058856 9768854 9652667 10014306 10585851
16784 10585851 10721418 10875556 11683430 11664823 12183244 12470173 12950940 13373683 14046592
16775 14046592 14379429 14824624 15104948 15926265 16280419 16997287 17574644 18162275 18756345
16766 18756345 19580653 20508112 21137688 21911616 23004227 23743466 24678922 25857637 27115700
16757 27115700 28249267 29440085 31369832 32370320 34076799 35836710 37579895 39302124
16749 39302124 41693286 43740190 46065056 49017158 51593617 54656992 57775522 61386173
16741 61386173 65051210 68927821 73450312 77892039 82746517 88090156 93838258 99858816
16733 99858816 106134726 112859206 119861592 127122819 134288336 141608158 148892380 155986977
16725 155986977 162347503 168302679 173548746 177516694 180505134 181892413 182875175 181653933
16717 181653933 179055397 175519160 171056251 165362827 159295593 152011538 145206649 137452525
16709 137452525 130047398 122628041 115312080 108415831 102237008 95848028 89678855 84094396
16701 84094396 78952379 74147041 69344035 65326581 61441444 58056318 54746303 51251574
16693 51251574 48575731 45784073 43047532 40941269 38930424 36728216 35038115 33157411
16685 33157411 31642229 30427137 28822949 27831339 26276672 25227766 23890550 23092323
16677 23092323 21880812 21051535 20167994 19350358 18770642 17851735 17168865 16767273 15769720
16668 15769720 14855794 15056329 14199544 13675669 13283955 12896171 12101139 11898973 11614084
16659 11614084 11530563 10954880 10508546 10488937 9835178 9866419 9408058 8826342 8768102 8403447
16649 8403447 8244814 7694335 8056373 7734305 7222894 7214905 6990657 6892211 6558340 6561018
16639 6561018 6298415 6228234 5732526 6115138 5471404 5884810 5345540 5167182 5157679 4876589
16629 4876589 4989234 4589770 5060412 4664240 4382118 4290805 4748957 4252663 4120984 4148751
16619 4148751 4073241 3728605 3908684 3746429 3943948 3631565 3445231 3588806 3357159 3112293
16609 3112293 3456104 2892437 3307949 3037424 3276032 3022203 2980372 2885029 3099761 2716245
16599 2716245 2650022 2763183 2894974 2590708 2514500 2502604 2576223 2662624 2293457 2395574
16589 2395574 2248159 2465029 2010497 2210643 2084007 2100862 2054896 1752368 2233142 1927426
16579 1927426 2036199 1967032 1889241 1760264 1775880 1855333 1790699 1736987 1833842 1710733 1500328
16568 1500328 1668362 1617601 1537548 1756642 1455658 1567057 1633944 1667695 1640132 1618919
16558 1618919 1426883 1421880 1319958 1321665 1206278 1450916 1382548 1432271 1180504 1242254 1549249
16547 1549249 1274238 1127635 1044015 1125773 1090191 778821 1377643 1076627 1405556 1079537
16537 1079537 915028 1014246 1329920 1181874 1369824 1040405 802436 983071 847085 891568
16527 891568 1098498 999474 1104925 888958 1058971 1004669 1101249 738946 815755 793657
16517 793657 870931 944742 952675 758953 750301 980674 762674 691020 675481 679265 874467
16506 874467 879040 774667 783594 1001681 527145 484680 848452 487200 752675 644988
16496 644988 613798 662842 647666 621024 788129 457436 617945 1183966 421982 695812
16486 695812 444304 527397 762953 517519 669899 493991 516012 698330 717681 426531
16476 426531 523941 535460 666603 779388 594575 614872 588795 382118 583034 640235
16466 640235 859314 733008 483980 820564 452015 367712 726186 458684 448815 493079
16456 493079 488545 452188 384109 457328 310719 220510 770761 185451 193424 247363 221561
16445 221561 391620 653847 631663 464074 467641 420186 520260 414511 701353 525500
16435 525500 358884 232154 577205 564705 300439 485473 329481 496191 46061 282560
16425 282560 606225 298733 322788 467603 205724 277463 726299 635356 524620 627671
16415 627671 97522 374754 371944 543863 292987 257008 631845 -90941 397002 410266 168479
16403 88630 146860 154561 328041 378899 669328 55260 5724 258224 197458 -48108 244694
16391 106531 395847 55880 241737 151185 92457 359361 385705 95323 207127 182480 151239
16380 151239 -163706 84836 267262 546366 -10130 390275 74635 255152 333153 191365
16370 191365 85734 397363 288082 101824 -36590 213095 526505 114881 74431 438170
16360 438170 165173 367796 119120 397153 346103 130454 195612 -33054 309265 -178390
16349 112551 165707 66333 -187269 -56774 96888 297168 77720 32124 130482 185161 -165105
16337 219441 321813 487141 -62078 178571 83195 185143 -198262 -64100 224548 14392
16326 -65525 121844 56427 -117509 63078 -257074 203034 376524 161057 130506 35574
16315 146407 247158 -90833 92541 99784 266479 50063 190944 183055 165239 244733 8144
16303 356397 377678 83565 214328 -249380 269361 170583 76688 -75786 -91276 -33632 -97421
16292 -97421 70387 30337 85361 143011 111179 -14374 223693 89162 123480 378331 -6921
16280 649367 154780 -123504 -21854 -23950 176298 272803 -30328 351576 -39294 95556 217843
16269 217843 95493 63757 66156 182623 54879 126196 -218260 182103 59635 50061 195812
16258 195812 -6729 64323 -113508 -224894 -85155 -79049 687 203340 -10042 155205 -204519
16246 -91547 -176661 -122333 209334 144863 10725 468373 185233 -247862 -142242 61269 65800
16235 65800 -173118 291279 -203930 16911 38671 -176922 15997 354567 -52804 -119256 311117
16223 223810 27308 -57444 236520 136618 184433 -182955 -109123 343776 248364 170225 -120716
16211 48296 9832 290413 73366 -155608 313914 84131 155907 -99376 30641 102576 -195519
16199 -25329 -69104 -73876 -172388 22445 253948 115897 230167 22078 351290 356766 207404
16188 207404 98605 -23374 264536 -83260 174890 -135404 47250 9975 -26611 147231 -426970
16176 149184 30778 -103679 234217 131150 -146643 113097 43504 57075 -381094 37738
16165 302381 43271 90868 -131928 125801 265617 157765 -315694 156015 156783 -92747 48861
16153 1651 256485 -571 268401 43263 173322 -41616 10092 -237463 97038 19044 122203
16142 122203 -105159 293506 -166609 65385 -228060 -123650 209260 -193546 87218 119163
16132 119163 -103735 -115000 178555 -186130 200487 -25921 -140260 -164119 -26045 -90666
16122 -90666 195896 -173405 -208091 206575 -212016 132021 163177 -20826 -55971 -135782 122557
16110 -42380 -88528 43872 78533 -128347 243433 -177723 145156 62849 -218734 -96969 272762
16098 171535 17636 5020 65467 119499 48054 -239450 -100691 166636 -310893 -192205 -82197
16086 195027 -251861 -48467 -67707 -182983 308232 96566 -164920 -242117 69714 182280
16076 182280 -10463 -234645 -31539 1659 -210417 -118784 -81450 -55632 -71977 72750 140872
16065 140872 179207 -29967 -253346 -34753 -203903 -19204 51391 66725 -19 283080 81341
16053 267098 276853 -197712 129387 152757 -55502 -469980 -98214 249875 133077 -213675
16042 -115582 222079 -470480 -167215 154029 105338 -123107 -89478 -274905 -178433 -55711
16031 -96496 137786 -79129 278190 35409 -2975 -86126 -348235 -126471 -416613 127307 -332108
16019 -352838 -340553 323636 -309166 313668 -321349 -31374 503579 -33645 -24740 -490682
16009 -490682 -293367 -164719 276453 235762 -82 -83922 178701 257931 -30947 58807 23602
15997 -58647 -8302 -177553 268789 -54417 -156212 -67887 1478 -20514 -162136 -35013 -119894
15986 -119894 65672 132056 169552 -25814 435883 343132 99286 -222495 49882 134654 -155808
15974 -93984 -331711 -113945 57507 158204 -229568 -139980 100687 525337 160924 98153
15964 98153 -285164 45308 261945 -9738 -159476 -116385 57293 18486 -72984 115757 52390
15952 -154962 -302765 -37969 -309333 -98795 283877 -67845 86335 -76087 290930 -68504 -43770
15941 -43770 13808 -20908 -208813 -356433 231041 -271269 -159835 -290361 -71160 141436
15930 -1815 -263604 222067 15972 -201198 233213 -124819 161829 -51909 243437 -265307
15919 69588 -47362 -240360 -65724 157598 -153272 -215063 -86799 80256 -316989 -112129 50147
15907 -115463 181221 -34411 -16297 -115915 -99606 180006 303072 333400 3335 50356 -230734
15895 -45451 -291662 -264554 -91654 2385 -270138 -182157 -269967 -151067 -67618 122611 -88105
15883 -79347 87406 12032 -136234 -25519 167679 -92945 -152260 -193945 -93562 -111331 57414
15871 -343859 -101459 57702 -73249 -37929 -52395 -195963 58621 150612 -74917 -192726 -183146
15860 -183146 -152968 -58460 6287 80685 202043 56068 75229 15 64502 72722 -157204 206154
15847 -71434 -6739 171882 255664 -2362 -41442 -134309 -327268 -107471 -336645 -146692 222267
15835 -58771 129571 -61143 -56711 333968 -124388 -119105 -118736 -148616 -243011 -85186 -408687 76363
15822 -275919 -19822 10905 -84085 76108 -149104 105022 41624 217891 -277417 81804 -226398
15810 237709 -306109 132645 -396379 -54819 -105538 -51058 153098 39794 161387 31246
15799 -285653 -18796 44282 -279094 -147467 -30010 15878 -8466 -277812 120178 14280 -67046
15787 29540 -347413 16669 53630 -281453 -256041 -28727 294355 15459 17315 -97390 -195503
15776 -195503 -154783 -150643 52382 -13468 76562 36079 131647 -333693 55614 -216927 296049
15764 -76445 -104341 -11795 47400 -45369 46967 338057 -74642 195658 209836 469468 -117292
15752 -141952 166803 49341 -431896 -131510 -7468 343822 -188052 56451 51310 -135692 -215174
15741 -215174 -303355 101550 23647 -138325 29978 -6340 106488 -301805 -318311 -129827 -186919
15730 -186919 130196 -45462 95445 125128 24700 -40816 213862 198151 57621 30685 -142413
15718 -84010 258261 98884 -72553 -158802 219549 -53884 -78970 -220879 -204409 -172989 -76818
15706 161155 -119989 -6216 54898 17806 100035 134428 -27788 72310 35861 -145922 -108512
15695 -108512 -92492 120452 -200202 151515 212933 197740 -6120 257396 -82233 -98484 140146
15683 -209137 234013 -89608 -1289 -287807 -283927 110494 94397 71579 -85443 -79552 -194869
15672 -194869 4065 279175 204835 134839 217847 -87383 -68472 -16428 202064 -46728 653 -168637
15659 206007 -122042 61419 -231669 -74017 -84960 73887 -477299 -349475 -1357 23457 -78642
15647 -272835 -57598 -254059 -161791 -53467 -21795 -210349 16449 -122762 -261415 228731
15636 -494665 2163 -184987 -130132 -318511 -300494 -13272 9634 -191106 144883 -194035 -72297
15624 -195914 298229 -30888 -47108 158262 -130938 165589 322611 162727 330639 -123376
15613 -87889 -4301 -289485 -49642 -1673 -164219 -119834 -262573 57230 -47563 160297 -32059
15601 -302528 -533251 163846 -118679 -148539 -61242 -97860 -200945 -452086 178625 -136284
15590 -133562 96890 -10714 234546 454243 -41267 597761 277022 -20367 -172801 56147
15579 -83944 -153525 -315822 -240771 190757 -202184 355899 -333455 17697 -18283 -219751
15569 -219751 -56285 153696 -45806 -290703 18016 -123746 -347666 303035 33448 -77825
15558 86308 -107187 30248 80164 -135469 -73713 -88381 -139229 324115 -46279 107699 99460
15547 99460 -222688 -158202 127524 18558 43781 -309523 135747 -3157 84189 64541 -41589
15535 67106 41365 -218064 214748 18590 98403 6418 370965 -48605 -285884 3146 112705
15524 112705 236689 128827 227189 -37504 -281508 -122071 -41083 112056 -19977 14133
15513 29208 -100003 -7338 231821 -84020 49854 185964 154248 59590 81579 4499 35432
15502 35432 -76495 263770 249003 -16298 -178200 -16165 169218 -17596 -2848 30839 8532
15490 -370925 -118684 37858 -252905 77435 -70029 178099 51916 -365711 -291327 -243946 -79525
15478 89188 -6502 -26499 25170 -259730 126230 -161456 -196384 224830 -177391 32597 -183918
15466 -33762 10190 -163907 54782 -261278 25326 -59503 184367 111941 192492 119512 -367794
15454 -329821 296463 41208 65455 -121738 -298532 19844 112238 -102155 -271834 163737
15443 13795 -79030 35009 -169394 -76771 36689 93917 123589 414503 -277773 194429 -105801
15431 -6272 -319926 48935 171000 -8364 -56696 157577 139330 -114763 -177146 80082 -309248
15419 245540 -311285 137959 -16664 -97276 430031 114542 -224796 16056 -44868 -234812
15409 -234812 -221077 -136365 -365615 93720 108303 41045 -80555 -20692 164164 9107 -302410
15397 86380 89920 -126489 -193818 -247178 -18102 -229784 158284 42604 79877 -215521 178487
15385 -47329 138520 -122649 -11494 116885 224585 17571 -55397 -116796 219762 84239 -20796
15373 -144609 146367 -182199 -2142 -134313 91442 334299 75264 28738 -56765 -139917 -107510
15362 -107510 -257116 -247232 -23372 -153000 22444 7903 49770 81430 -403003 -195240 177771
15350 2440 -146421 15830 73670 -240208 -44184 113799 310964 78987 123560 -125539 69339
15338 112205 -12445 45364 -271449 297565 -115453 140071 119836 313406 -94169 42795
15327 -34836 -65383 -51275 263153 440753 174273 -125471 128455 -136557 -53010 17180
15316 55567 10204 170100 251668 -43856 423302 246965 135200 19497 -220864 239251
15305 -62764 -430129 -63276 7818 -118888 55641 -227440 110777 -106918 32565 32302 -61329
15293 -343685 375781 362513 415849 -221549 -81513 71442 213999 -246893 -103347 -5432 26115
15281 -59477 5658 36434 -83973 170905 123711 -87450 -58314 -19909 46693 -167842 -77447
15269 434526 125535 -73270 32227 14141 23426 -89854 -343388 -552371 514189 -158356 135453
15257 261133 110110 -32880 143936 243718 125260 294809 130933 257997 444849 635105
15247 635105 1557583 868028 1151885 1015234 224570 116847 216006 -3980 -70188 -25380
15236 -138444 -88465 -116191 -85774 -210834 186174 61611 113339 6117 -138699 -454 -156512
15225 -156512 541551 -90528 85258 -57887 -68866 2923 212610 169900 228460 -18402 -83330
15214 -83330 -129508 -178467 -187161 62891 52780 49242 -40572 -121411 -139820 98230 56542 26795
15201 128947 -18701 -235382 482654 157938 385466 -16851 -80142 73747 129730 -111285
15190 -14423 28472 89896 -84926 83854 44791 233644 -23503 -204108 220378 -78816 25653
15178 28685 366374 -31769 59754 -6411 104715 189841 156170 133284 81084 146528 262406
15167 262406 242930 8876 -12744 -376599 293521 170216 53731 227571 28021 357098 14117
15155 142977 173083 96205 -16074 -44332 170750 195704 -38696 -23711 25909 169855 -76578
15143 -54837 -327646 347014 -17972 -18901 240735 55927 176151 -37177 215225 305111 -4494
15131 40202 378346 80217 169336 374084 157881 83523 249572 290181 170715 -22693 -48212
15120 -48212 199053 38871 -169637 16875 -223006 -5034 103419 -4564 -372601 196883 194282
15109 194282 127033 115015 -9930 161053 301188 -232782 188689 20839 143943 87469 -17665
15097 315414 -21079 128150 194598 204121 -50180 137967 94608 41833 -81083 -80406 50648 149801
15085 149801 107573 248605 -77864 46052 122267 -230204 41676 -94999 2894 -197386 84585
15073 111119 363081 91038 217528 -63851 200574 63567 -48061 -813 63250 -90186 -323531
15062 -323531 -68389 94335 21311 33142 -3690 17844 -130156 240579 238598 123643 40976
15050 69445 77489 367494 -115733 -66415 1793 372923 -131016 -123516 273344 312266 -154824
15038 294965 213426 308041 263545 162664 42260 -257572 -133052 -22983 63784 128423 368491
15027 368491 129961 -162461 87268 195305 378811 365570 36106 -5051 47259 157161 193488
15016 193488 90913 52786 342905 -35135 275446 221739 7484 206246 262972 72776 -111884
15004 145005 406436 -155401 75581 227073 217649 248501 294922 247355 283578 135188 -42440
14992 252684 46120 -168811 127903 168330 319321 -121053 -53762 13290 -10654 269851
14981 278864 33106 -202459 92213 -69006 333026 224614 180221 394573 358567 533926
14971 533926 129284 24546 224893 -210480 315261 116851 415365 475551 125226 533434
14961 533434 -15159 482112 390607 464472 44859 -57455 -147608 246486 519609 388236 472271
14950 472271 112155 -148952 -5331 331401 363864 291710 354664 323016 184415 201620 272932
14939 272932 212362 222353 291913 -66016 242678 241840 215801 273146 290868 105616 162260 139428
14927 139428 238344 260667 216569 493618 549392 148007 87742 274519 375708 234202
14917 234202 133985 130154 263900 127045 -56599 400435 180163 52778 -7635 225106 264571
14906 264571 186370 383262 97074 498011 377260 74122 44314 462740 44868 398594
14896 398594 123818 188677 412553 341780 153545 81763 64969 162275 176854 475142 438716
14885 438716 370533 262767 123329 276492 22616 237314 317906 289049 613562 185957
14874 470794 218498 63498 249582 126693 257457 338402 564795 172143 409477 -49222
14863 379883 252986 112859 144235 156271 764761 426607 102558 348151 73417 161828
14853 161828 724284 666838 407257 399307 382878 679495 192415 320351 353646 257769 390493
14842 390493 389886 340829 419542 376402 477997 152883 541230 564116 224785 480568 462222
14831 462222 269464 112528 320696 263561 196516 519763 378135 373885 553778 220114
14820 53851 127354 268732 360216 605755 373049 167156 329093 2591 524997 505205 410244
14809 410244 600342 859398 321022 466042 505075 440280 448165 748599 402120 131444
14798 364524 246660 329200 173912 389645 168081 431063 420362 723841 477782 209847
14787 298514 103417 766441 440109 444575 684347 354411 730815 746445 284551 453283
14777 453283 186416 471359 619582 549902 444414 82096 240996 377709 930021 263066
14766 509087 510141 559748 287005 502877 178759 739580 397404 525450 743514 263287
14755 439977 423971 861113 436758 685637 651461 559929 404929 809542 407275 460866
14745 460866 674767 417154 621990 385311 370910 258887 509010 524669 392690 627685
14735 627685 584339 716479 486698 689437 566638 558174 314359 152966 687759 549372
14725 549372 596929 288638 231013 758787 507397 112937 497374 945484 314056 517160
14715 517160 845368 985892 811373 638430 616585 556519 909875 536466 551200 429440
14705 429440 813106 521987 639769 901216 771998 609325 891894 892957 753337 908718
14695 908718 663322 859935 800233 523067 819869 488768 701264 470590 913058 597218
14685 597218 771489 725269 796686 860741 649230 956454 590247 855974 600645 879026
14675 879026 675885 878007 664243 645034 714602 949348 991851 674577 797191 929771
14665 929771 892022 775300 890572 797765 982754 1018464 706382 1069922 811490 776841
14655 776841 950136 760226 678913 912934 778359 1070584 1052304 1078652 971288 867721
14645 867721 1053511 641672 1207957 465591 792473 1125950 1013112 1372354 1096650 942897
14635 942897 1023371 850673 738182 1396409 1156978 1013877 1201628 1032727 1338145 1156295
14625 1156295 1190575 929409 1004494 1250458 1286757 1333409 1383575 1003476 993887 1012423 842158
14614 842158 1135412 1066536 1397564 1037787 1214209 1457834 1378068 1038872 1283298 1406931
14604 1406931 1449096 1173972 1219450 1768144 1348086 1278297 1541473 1200762 1393456 1277607
14594 1277607 1271567 1209932 1600086 1110125 1591666 1339243 1426177 1457280 1452161 1860164 1351494
14583 1351494 1511160 1677708 1671560 1451425 1509730 1548675 1698050 1698137 1942783 1510596 1875850
14572 1875850 1723082 1818820 1637029 2010713 1967264 1751649 1778939 1856108 1767566 1943121
14562 1943121 1817357 2018271 2044061 2680470 1952633 2520622 2666488 2694343 2579967 2662201
14552 2662201 3323920 4048199 4850534 6081521 10317519 20147097 39688833 40683640 18083182
14542 7374594 3451023 2072739 1768334 1557897 1405517 1474487 1362244 1452674 1432118 1538596
14532 1538596 1965729 1864545 1845492 1802783 1803531 2055078 2027879 1830164 2051070 2137089 2124728
14521 2124728 2034658 1874005 1882901 2127672 2202678 2163042 1981833 2086735 2142569 2024456
14511 2024456 2393255 2021309 2510254 2433169 2101023 2493738 2144099 2486596 2670434 2450667
14501 2450667 2500855 2840028 2517422 2521383 2536488 2507282 2668400 2525460 2910059 3076062
14491 3076062 3032796 2998315 2864809 2881986 2695888 2840229 3063780 2933606 2950252 2958323
14481 2958323 2913677 3212694 3210096 3228391 3073018 3191471 3393891 3116237 3313503 3340551
14471 3340551 3381526 3351423 3343498 3423309 3765415 3425192 3595458 3718576 3730278 3936958
14461 3936958 3909399 3625478 4051511 3722980 4111977 4156739 3976592 4278951 4407123 4355593
14451 4355593 4644961 4479721 4407713 4524597 4743676 4756871 4776729 4896699 4941096 4868073
14441 4868073 5035616 5266971 4935793 4993831 5311277 5042629 5628722 5077307 5713706 5355707
14431 5355707 5870385 5864909 5299307 6091893 6073063 5884699 6022740 6186385 6212956 6479338
14421 6479338 6352736 6565725 6795037 6517845 6911521 6914912 7124454 7256376 7290198 7270671
14411 7270671 7213750 7539010 7816731 7824212 7667475 7935194 7991245 8342846 8142505 8404288
14401 8404288 8506983 8566826 8782267 8827519 8826574 9175854 9471513 9503846 9648953 10041347
14391 10041347 9972155 9923550 10823694 10572086 10624990 11073336 11086641 11246498 11557792 11646216
14381 11646216 11861455 12302009 12347270 12607681 13213563 13136686 13491300 13287780 13950672 13973777
14371 13973777 14593567 14596957 15139450 15076639 15421426 15870058 16298460 16783142 16848804 17364743
14361 17364743 17851850 18202365 18547105 19114006 19243345 20395498 20369035 20868895 21288472
14352 21288472 21715698 22472562 22775662 23619413 24029615 24838194 25573792 26293600 26887893
14343 26887893 26925266 28303423 28927753 29732637 30541118 31518972 32296278 33508437 34217678
14334 34217678 35460335 36583279 37255299 38442672 39514724 41162253 42282789 43871346
14326 43871346 45082180 46518818 48471753 49627827 51961202 53646916 55543349 57730476
14318 57730476 59969870 62203464 64339657 67319468 70002161 72947099 75869960 78841009
14310 78841009 82470515 85903877 89965033 93412802 98193400 102837944 107526910 112920449
14302 112920449 118447755 124465838 130664190 137674297 144770419 152796241 160433185 169462914
14294 169462914 178768622 188907305 199177276 210254598 222379894 234644649 248161451
14287 248161451 261895268 276287927 291416666 307024205 323003417 339021499 355347953
14280 355347953 370915512 386471814 400976871 414556998 426427494 437095023 445040123
14273 445040123 449457553 448704463 446253093 443984178 441684216 437267649 431899778 422195853
14265 422195853 410450165 397550421 383161164 367308221 350833774 334423808 318109755
14258 318109755 301905523 286201485 271224759 256514982 243879168 230531646 218376471
14251 218376471 206409579 195541910 184907252 175382021 166451677 157704597 149696762
14244 149696762 142483621 135480300 128673567 122554801 116778026 111006705 106730708 101736649
14236 101736649 97074835 92747728 88782374 85121118 81461929 78679339 75210087 72493997
14228 72493997 69236718 66801537 64291405 61812056 59470163 57279741 55012224 53343202
14220 53343202 51579397 49895702 47992777 46624111 44797231 43431890 42579423 40898811
14212 40898811 39740212 38156767 37301728 35926875 35434715 34571806 33816682 32709226 31072857
14203 31072857 30747226 29558911 29207370 28752040 27460775 26949547 25951252 25163968 24714178
14194 24714178 24453823 23749078 23124851 22242532 21834062 21125935 20869107 20489808 19802830
14185 19802830 19311500 19138368 18752878 18390277 17971865 17731088 17127816 16795714 16188176
14176 16188176 16385522 15811192 15465625 15023159 14606382 14584481 14331951 13652876 13735876 13313074
14166 13313074 13214110 12971837 12781077 12597797 12154966 12261467 12038873 11470504 11668944
14157 11668944 11282052 11100955 10993673 10701727 10361077 10370531 10150746 10088006 9831051 9997728
14147 9997728 9607436 9174454 9267113 8921144 8789682 8708439 8578973 8515049 8642445 8374207
14137 8374207 8284020 8186035 8162772 7764856 7871141 7590614 7591164 7259807 7237526 6982905 7261668
14126 7261668 6981464 6754900 6777490 6537096 6692073 6408540 6322235 6410287 6242515 6439009
14116 6439009 5932320 5980748 5590801 5763004 5798582 6137284 5695645 5514450 5456561 5744183
14106 5744183 5367980 5230460 5284971 4955209 5299441 5008454 5370826 4902758 4745618 4775589
14096 4775589 4834047 4819606 4642947 4738626 4537234 4754024 4299457 4255293 4704215 4342012
14086 4342012 4110031 4354025 4385957 4089443 4302547 4270061 4119340 4270706 4003302 3970389
14076 3970389 3702314 3879989 3537112 3570469 3676940 3547096 3576893 3731520 3142295 3404833
14066 3404833 3354332 3455746 3332121 3505781 3687804 3544415 3470076 3556008 3313812 3215787
14056 3215787 3323358 3377375 3315912 2895274 3037037 3034325 3156475 3267989 2529979 2643324
14046 2643324 2674517 3004082 2751181 2609919 2609267 2830543 2611513 2705955 2435083 2747459
14036 2747459 2697412 2267332 2558348 2314052 2771270 2669383 2574505 2311095 2441051 2467558
14026 2467558 2458608 2349340 2464152 2026122 2138562 2363673 2094701 2278010 2392912 2208532
14016 2208532 2621616 2187818 2188944 2335446 1773795 1855399 2099955 2233677 2017648 2190523
14006 2190523 1774840 1865015 1924588 1803511 2056419 1924182 1652518 1651735 1611383 2199297
13996 2199297 1993731 1834546 1541782 1553859 1560961 2093437 1912871 2690197 5768319 13507803
13986 13507803 33345598 42440463 22317459 10084534 6220553 4554093 4079271 3621310
13978 3621310 2455218 2897600 2383128 2761119 2180172 2227216 2400028 2102608 2162652 2059956
13968 2059956 1984815 2180315 1863570 1741332 1663918 1704275 1726200 1817913 1897549 1883594 1657077
13957 1657077 1726845 1764582 1696385 1543455 1946076 1667493 1293379 1694805 1773166 1730223
13947 1730223 1475696 1714599 1574869 1603826 1664536 1711656 1575789 1482567 1476637 1254712
13937 1254712 1273664 1464878 1466519 1293412 1660527 1387470 1473891 1543445 1308387 1528538
13927 1528538 1314686 1459703 1330375 1448538 1087541 1250838 1197276 1164755 1262938 1281519
13917 1281519 1439976 1114852 1336099 1705363 1366314 1317786 1217635 1396786 1063320 1337443
13907 1337443 1330015 1536497 1345643 1008824 935865 1139686 835317 1258942 1307107 949243
13897 949243 1250547 1035197 1094130 936487 1140715 1231924 1058036 1327905 1088170 1043270
13887 1043270 924315 1242145 1283680 925400 870121 938320 672654 1063454 795564 1304180
13877 1304180 1030275 732461 1197682 822639 972301 1042685 1265700 684854 730895 956203
13867 956203 884178 772099 1146929 1013029 1037837 890013 1031307 1295181 933716 965075
13857 965075 1074433 999707 1042849 794349 747375 864883 914675 1111154 740512 1083383
13847 1083383 957986 920688 703637 917850 901808 986830 1061060 811631 824706 1019410
13837 1019410 839813 816176 544734 535716 671679 976066 740072 673374 857544 776991
13827 776991 238956 688560 633744 627461 676250 840376 625649 440716 621524 698170
13817 698170 728383 898539 384292 640421 556794 717072 448044 674255 467516 585361
13807 585361 706296 744649 554468 638514 657247 676921 453115 688531 466644 673305
13797 673305 489874 367003 770874 545336 778238 666347 716393 581946 335626 264350
13787 264350 718214 784908 503677 919475 550988 568267 542154 326053 609363 400068
13777 400068 672792 906942 706989 589261 751212 983557 572484 290404 553569 715767
13767 715767 656194 514756 366876 839186 782301 687999 397235 732895 724600 466043
13757 466043 475285 544074 594128 468517 402839 701544 622454 517495 301262 393655 847597
13746 847597 542138 359534 590790 219249 547290 391521 578894 736607 696431 416023
13736 416023 433786 419289 415177 662848 504884 548141 470074 350970 495703 521604 333463
13725 333463 689930 506718 324636 389122 727333 459925 690766 532096 550970 334594
13715 334594 606207 364694 699424 461583 375136 586383 634030 421856 212930 364791
13705 364791 608626 639165 625977 380838 652346 297997 191223 272387 470233 231254
13694 371913 424401 502618 517433 524567 411246 544940 725253 395349 469434 756670 491549
13683 491549 462781 398076 543683 193932 237282 450305 247558 278411 -62190 315870
13672 314858 390264 272699 434540 361011 498842 232865 926314 282583 419828 429827
13662 429827 113121 310693 354980 382821 262644 188874 562475 603120 241989 391544
13652 391544 175064 499049 456945 198827 378753 310581 498967 -62671 355658 547197
13642 547197 587716 52036 356504 374643 423909 171924 335924 149910 94446 481136
13632 481136 263341 339337 376322 222176 -93170 282032 333782 484265 329598 501388
13622 501388 325750 18037 299738 757745 207617 494500 634470 193493 719760 532107
13612 532107 216842 601072 504150 327986 264069 96149 191970 149446 80222 494226 489553
13601 489553 157910 592456 489610 288152 323145 118649 282045 343188 464025 411783
13591 411783 319799 212079 216713 256558 590367 148522 146530 573160 367704 593372 343998
13580 343998 278533 365904 243651 225903 74524 324340 249284 303064 194394 316586 111135
13568 333012 352871 272300 420666 135276 84745 112622 371130 190125 190749 324364 169815
13557 169815 179315 573861 162415 53054 33316 34933 281608 344121 106404 431384 394206
13546 394206 141667 613835 242970 209450 415501 497584 228523 286678 -35933 303483
13535 431362 82328 96686 414259 244542 242008 291966 142619 -45653 175946 319926 355971
13524 355971 163776 182791 161492 215953 292625 96354 356600 109014 132734 313207 64207
13512 188952 -43800 167067 120648 117846 363508 531107 218139 331690 -29446 631831
13501 99275 31890 293787 361701 234232 533394 253638 -93497 228945 398958 128167
13490 309899 149311 382908 416683 -316154 428383 205952 16935 16163 187462 -62792 357164
13478 247487 -14128 270989 -59914 183991 443706 480965 300920 261765 193153 348920
13468 348920 185138 128996 294285 159408 33156 424201 506143 240814 313351 179711
13458 179711 64708 19992 418170 -139902 248183 660647 106805 220859 243009 178587
13448 178587 -171804 -37026 299336 281129 91368 147393 -82211 386528 177133 50654 62459
13437 62459 418348 407554 221784 -98591 -173244 326169 199786 308861 187852 198491
13427 198491 270147 274466 -159293 -32364 199460 174143 -168073 176401 89853 184659 232135
13416 232135 235408 131459 155912 214842 159099 50952 154840 10743 268256 171049 -29793
13404 -80124 89250 243885 -64165 -39233 -2885 105937 220694 76666 363155 291518 7609
13392 279315 197092 175920 -65557 78202 85535 357386 13521 238644 433380 161582 430627
13381 430627 -16119 -13174 177948 324762 302202 380466 248302 103135 123043 264512 201883
13370 201883 -77376 -41860 183023 38037 107640 69042 -48193 -79456 59704 195013 217792
13359 217792 243202 -63147 68058 99560 278268 105164 99570 484595 220143 143329 180067
13348 180067 380743 308297 186983 507194 514241 362811 505517 65900 65651 114783 93417
13337 93417 254708 -125883 -19858 281108 83862 307552 65073 403320 171537 -115751
13326 226253 309861 295757 161303 80607 -59577 -5162 350371 9059 46259 188184 160885
13315 160885 235437 153126 22666 109370 168417 243950 20615 196903 -88990 336093 389138
13304 389138 41926 -24021 157627 197043 121577 2834 -116173 284425 252650 81224 -69590
13292 400018 271706 188315 -92544 120333 184472 -27903 373356 230229 194296 2928 227295
13281 227295 215369 214590 -132956 -87199 202349 6309 281231 365301 140819 -73912 -6298
13269 225689 74418 269665 279806 311541 56420 145507 -108 86194 504400 58397 127220
13258 127220 55473 108545 234275 23879 -51541 -143106 57230 100600 247986 -234006 -94523
13246 24634 110091 279054 173759 33584 8569 253461 49975 -155150 -57770 183089 61617
13234 369747 169420 -51274 79360 163378 280866 225004 202880 302866 185875 13605 395195
13223 395195 -38075 86086 241979 15415 257025 18462 38542 -35843 30890 181116 -109186
13211 -24639 -72135 193469 22355 235577 -115899 -192029 92846 113765 96153 -89915 120532
13199 571525 25811 -215036 -186749 133899 -65548 106017 60602 -123135 365584 196864
13189 196864 176895 -65379 -128787 411963 214861 46549 195091 39936 56765 428282 1601
13177 175302 288560 -8069 -7097 -185004 223430 9781 288661 -56616 -63540 72269 -251469
13165 -259999 197314 -82667 245185 82388 253350 32630 230666 252601 31969 -179950
13154 -153822 -170392 -89353 -14741 27201 -225128 -78857 -116157 206083 -196654 13868 344645
13143 344645 121270 -46447 -100071 75820 51836 -48578 -119960 21898 -100952 -249880 144598
13131 122564 -45485 -176504 246532 67556 31861 -6077 3262 -284799 -337074 243751 463604
13120 463604 -223586 271881 -10125 140953 437829 -18703 -145368 446863 126881 126820 -29028
13108 108058 517359 231363 -104739 -342180 180352 165171 210855 234836 300931 -15665
13097 -390712 105621 -541 -7622 341800 -105978 -99240 83993 49999 -133729 126386 226101
13086 226101 7866 25898 -7431 288605 60544 -105967 86407 107965 42563 114113 -309340
13074 283289 96412 132720 -78416 -12490 195741 167383 302648 179736 -153053 -32138 68629
13062 229518 200242 62906 342001 122117 269469 223063 392929 206070 -89443 168856
13051 23349 330743 132275 259768 138522 -143531 -17431 -38111 -83486 109080 430175
13041 430175 389121 144857 80787 322460 138528 -201170 -52071 81534 95538 -45710 73445
13029 -128446 -3908 158549 200526 202675 -48238 218761 184044 414934 -145224 18033 172185
13018 172185 370714 3658 106915 22492 101316 74067 35172 -94965 215937 249984 -66655
13006 -228326 396481 15145 281807 227883 63452 298710 25757 -110124 -242916 -37845
12995 -174713 -11052 -61558 16769 30498 -180116 -197142 -1924 88707 -178486 -168218 68125
12983 53301 -204908 209988 177015 -298670 -260222 208997 16264 316166 232810 113783
12972 73277 176723 70333 -251577 -55073 -91536 86981 125859 189323 154718 -94951 138731
12960 160719 338919 237707 -145530 -242112 14852 -606739 105859 180979 49650 198844
12950 198844 345855 -320926 1004 36391 50312 181615 212086 -236308 -154465 -374870 -156382
12938 277603 4731 503762 185685 368731 3670 159622 206225 78713 -10868 -183105 -77666
12926 -32780 -129942 -60492 110839 -114824 -185746 181331 149044 83129 264828 -424586 -5398
12914 -316769 90870 -35895 103392 -8578 59755 92213 133168 -38409 -225224 -19383 79139
12902 151584 163926 -30202 249077 380835 141700 101323 -108305 499226 234876 99333
12891 170620 48860 371025 172008 109818 85074 -197870 332275 -2164 28476 -35060 -184508
12880 -184508 48115 251164 152673 -145568 47593 68531 -113982 215693 61136 65694 15098
12868 -15132 -10499 -195816 55946 -83292 59618 -19582 -239812 49996 211756 -37119 55828
12856 178869 -18682 44184 49436 215885 141057 -88851 -20101 420452 250578 -89483 -172297
12845 -172297 293719 55156 -56657 -238313 -66761 448783 -118977 11331 -96004 238587
12834 -28844 -121283 152027 -25067 -1950 81812 -114937 330212 -21041 -73917 71758 -93710
12822 240588 255734 28373 267172 9504 55183 -45396 65653 -408504 83273 103040 -47946
12810 109516 -84601 38994 -166008 -46284 -106247 454102 -58120 14523 -58055 -69087 -19554
12798 174529 109048 315513 195340 -143245 210463 72636 147567 215957 -191092 218878
12787 -13933 -124730 14335 -299395 -157850 -101949 75505 97924 52050 -166778 76683 -148686
12775 206234 80436 -46352 85486 136231 301963 -153892 -16449 -93849 37867 120760 438064
12764 438064 16997 129303 -258068 -77258 44678 138562 -157220 14286 -34149 -95133 289021
12752 171421 56244 256789 216926 -42955 219745 715 217821 176724 -41303 20159 -35728
12740 -23302 -37324 117738 -16508 45389 106993 430173 -91560 -69183 -9062 -37650 247132
12728 283282 22824 185235 -9287 -249334 214960 25541 -99554 -62237 -104673 -288573 125579
12716 -2752 -298128 23062 128144 -4405 323406 227158 238752 285693 95343 154846 190450
12705 190450 262769 292142 281649 244065 361207 130075 173871 31424 -47850 130768 28773
12693 -68609 90830 234751 142744 -257749 59649 -318715 203179 69696 41851 -207645 157735
12681 73888 202043 53021 473700 -197876 -216616 126853 -1978 487672 -60154 -141446 164815
12669 -154242 -109775 -31709 209915 228033 -11800 -11526 216866 -477004 59145 371340 47386
12657 -48688 139914 270404 -12147 -68347 -21421 142419 69686 199404 100006 -139482 23904
12645 218113 -56247 -414358 47698 334849 -4932 121134 375360 107203 -42800 237544
12634 292091 25757 209014 228431 240260 -128093 312568 246074 324403 178597 -94834 231110
12622 42460 518117 261575 376261 40434 140272 356774 298767 53768 -3626 28710 42829
12611 42829 154438 76194 4978 174002 219385 -114 24588 -5715 -367631 112756 -3167 10497
12598 304775 67337 -33552 -32646 10684 257831 -86913 -4392 210701 -18957 -429145 122576
12586 -24821 385465 -45689 59269 -48158 76503 -168436 13239 -291936 61947 5101 318746
12575 318746 -182799 97448 18989 -368827 154800 206102 186614 196929 17387 148 -80598
12563 491346 -131869 -181025 -28621 182749 129752 465993 30177 203059 356487 -34893
12552 34605 265677 -106552 -150840 113253 -144368 -224132 -83926 2709 117781 -190318 17788
12540 -147636 -286049 -98264 -31512 -48828 88397 75945 235856 -12093 69793 -55107 37051
12528 -114902 -141858 178466 265943 178849 90405 -70511 179773 378334 81770 9927 40247
12517 40247 235547 -162474 -25214 -123056 64063 2127 -129656 -122992 53474 143872 175895
12506 175895 198445 5407 42903 -56531 -258665 67876 266428 -112196 257605 16725 -211655
12494 -293892 -54284 101760 -101848 206667 238424 7792 370902 290255 189088 112443 98374
12483 98374 -117015 -53468 -65559 27418 -148378 126125 -200899 -22899 -151249 195549
12472 -168614 -161558 13560 -103637 133144 14527 72067 -159462 -97619 167075 146994 -294150
12460 -47318 125821 -255595 -132109 11868 109987 -120063 24260 -61767 159792 -71128 -123949
12449 -123949 184412 -178234 -25802 -74245 -27927 -80456 -9873 -134769 85869 405706 -47025
12437 274077 -91502 254154 331524 -47479 38068 306610 -96141 77061 -159006 -314592 -96232
12425 192975 -87933 -346615 60246 -38468 319371 195550 55832 77366 222809 27048 170701
12414 170701 235133 -146605 -67561 -25300 -252624 254123 22125 3866 108992 -108260 -178049
12403 -178049 -15482 46486 390716 311080 -61535 50527 -31137 135552 -99006 -159217 -169625
12392 -169625 223983 58464 18246 -25147 -244625 7447 96498 62264 -279544 15442 127336
12381 127336 240686 -178650 -22702 -109321 -241062 316250 -73373 53476 237670 -473938
12370 57337 71826 -173626 96758 -240859 36142 -53677 -5185 -271636 101665 -9691 73586
12358 -135545 125808 -46787 206170 -82176 27619 157844 -84549 -57730 -3617 -104919 26494
12346 -264748 229403 210787 -5538 174975 -35490 -10975 100482 142188 32894 123076 -270703
12334 51006 -162282 -92869 306936 369524 119978 95129 -6923 -24105 13986 -166216 144552
12322 142205 16420 -214161 26566 -247481 219444 -64054 -205422 293883 144707 -62998
12311 -37296 -42117 -298310 -133647 -175504 174117 -119929 -151007 63449 -1441 499550 -10633
12299 -283483 -223998 -41833 254915 32960 -106904 -322055 -122377 274597 287883 138048
12288 319004 -406563 112339 175408 287379 201024 134115 35230 20709 134898 126521 -175408
12276 -73153 -56351 98381 103848 172939 11128 215978 -129245 -159922 214501 16786 -51195
12264 191966 322439 -188102 288400 -68621 75335 87467 -112162 249060 -9428 240877
12253 242104 217754 -38925 132708 -13050 142094 56171 -69310 250414 -75773 -1351 -103797
12242 -103797 168919 -127550 110110 576853 396197 181673 64863 270551 157675 -110072
12231 46734 93846 -196017 110150 -6898 276760 403565 337698 226214 66009 382627 121736
12219 248597 -160520 325759 276474 85123 -178245 85971 312267 521278 280160 -101272
12208 317159 -7040 332634 269231 321892 274919 220319 178785 327706 340497 167414 175862
12197 175862 134880 106693 -249 140294 409544 278428 269165 -40766 -94059 218978 -343069
12185 645 77654 -251678 115739 81550 -93859 235220 199081 -267003 260735 -35095 272617
12173 87039 248831 157832 102069 -125911 164610 279366 2030 164642 134539 -200783 -69172
12161 122660 -173382 -52067 -174844 36543 -37713 57324 105006 -61658 37325 10994 145171
12150 145171 135484 10531 99569 8303 -116764 -12975 269779 126971 -413546 148423 29009
12138 62517 -5248 -80371 -97224 42332 67847 22829 -150942 -64349 -175782 220803 -275664
12126 -76518 -190580 -307964 2363 143158 260735 -83062 3426 267403 151304 168341 136122
12115 136122 -74510 -47797 -228182 -246211 -223397 -173253 365849 -93036 -102095 -280506 -24527
12103 -222052 -215224 -135136 -321296 -271190 102301 -214088 18558 315036 134033 61145 -155917
12091 -71400 192710 -250625 -153424 -139189 -278263 8619 -8186 24411 96122 38802 236863
12080 236863 -89413 -138466 349768 559573 1647455 1804500 351349 -43016 -34840 -85257
12070 -85257 -56468 -16826 16241 10954 -27445 -284012 31721 48525 -129452 205496 -103565
12058 -144544 43981 331205 -49862 -163203 -72542 -77975 224214 10086 187385 21666 -19824
12046 -50605 196431 65710 91092 10263 160927 138639 30344 -140878 -134083 -122381 -319712
12035 -319712 175134 67128 118089 159183 310315 -28434 168333 22285 -75411 -71677 -18594
12023 152610 -86317 116326 187742 90647 187984 -191239 255344 -14116 122262 182510 -242532
12011 39070 69802 42455 -336421 -81319 162921 82603 173470 -86228 -243864 -92472 -198984
12000 -198984 42071 -172879 -229508 102842 -21089 -124962 -135760 44103 -2127 293026 -294497
11988 153382 207887 -96485 52259 -444806 -91143 -42601 122047 -134658 248724 -374522
11977 22388 -290694 69919 52645 28623 -106010 15125 118144 -311915 -28775 -161680 331962
11965 -171252 94987 -102799 -53804 25289 6321 -14427 -173287 -70451 -75571 -63142 -149274
11954 -149274 -288020 -118222 47025 -43872 65997 -268970 244703 178644 16653 180536
11944 180536 -144175 -242673 -90951 143514 189501 129816 -70551 119225 184613 -100121 -106830
11933 -106830 -122723 -159381 -68890 38053 49016 84601 -5171 480868 125589 54253 -72044
11921 182755 92422 -252284 72498 -42880 315514 -21059 -57470 71781 -385947 213470 -198657
11909 -165092 27619 -92060 35371 189256 -74615 194552 -14387 204684 114092 -223801 -91188
11897 -97724 -221319 161481 -120892 45885 -372227 195062 -397544 87303 -59242 -189980
11887 -189980 -81824 -235284 30612 77776 -141282 -203487 -38741 -33383 83475 150715 137185
11876 137185 -196681 -158104 -75139 -151942 197658 184129 -138594 167124 -129395 46554
11865 -16701 -169470 -61048 -16991 31041 -375021 -180692 -79900 47743 -441723 -42219 -80191
11854 -80191 71011 288913 -192656 -196318 -192424 45065 33675 -72034 -325237 19885 131234
11843 131234 -17971 -176070 -86991 -120425 80098 -182791 -43529 -43863 -216020 37717 334266
11832 334266 -265767 -155511 -175803 17461 111278 79658 -89373 132141 103580 -107110 -234721
11821 -234721 33026 -198406 -136953 -3422 -182942 110539 -251423 -7095 361726 40657 -270009
11809 68225 -101548 -120298 145499 -15191 128737 -55014 -206965 100732 -236574 138529
11798 91072 -109177 369720 236485 191601 -247249 339964 -119671 -30471 -131016 63685
11787 101267 54291 1538 -158243 282998 -100714 -254255 -70293 6085 214266 -474956 -115655
11775 -204684 -19966 241882 129988 87488 114628 -48905 -116500 144900 30741 103189 176445
11764 176445 35913 -82302 31131 -316909 61741 -85312 82664 -7799 -184836 -83695 86011
11752 99432 -161726 -78986 -45807 99855 -109000 -200739 -174679 -352682 -91119 -206389 -68023
11740 307136 -41839 64800 222694 60233 5037 139450 -99326 -227929 -82045 315241 -230975
11728 -16421 -41907 -100769 123631 -275933 39010 -186593 241858 -180728 -148956 308620
11717 120758 -233613 58773 319732 107103 307531 -48404 56413 205272 -120865 289564
11706 5160 -66214 -33208 -56040 -121461 -319672 92406 -34491 -98733 167098 183378 -183214
11694 99938 -64630 70835 109919 158344 137496 46785 156268 126337 107997 228857 383879
11683 383879 372794 -311558 192281 -31482 112450 338355 18486 202471 -83014 27970
11672 -408795 196763 160343 47938 243521 1309 116009 -88829 23834 -24277 24766 69309
11661 69309 209658 -59311 313104 -45546 96663 112808 50030 109512 244504 217770 -388879
11649 42210 385018 47545 -420116 297903 -177347 -243428 173273 245718 -73353 2009 214757
11638 214757 -110083 104497 -24483 -97325 -52712 176325 -437938 444478 -20167 324036
11627 30810 17687 230479 -130734 89425 64776 -317958 -89690 410559 31082 -49203 -55461
11616 -55461 113644 -153151 -17166 173130 -117030 89192 -52953 45050 119896 -17577 -48224
11605 -48224 8979 -19046 -2525 17882 857 -265207 236240 166980 72938 216518 149504 279238
11593 279238 -75335 -76344 82679 329729 185489 233730 -222200 -29772 127302 104885 -42805
11581 160293 282990 106766 171501 135431 188193 46698 391277 -115230 44409 216843
11571 216843 -100504 128258 -86391 -64785 307040 193248 -152240 93303 58185 -127395
11560 355588 151849 164749 405068 28472 -120172 -98199 64637 195615 250083 215346 -121674
11548 121292 -247176 -209715 -78043 168567 108023 55270 13652 153729 -4334 -42037 21775
11536 40904 -43009 966 56474 141535 186411 262333 129503 90325 173854 -215130 137015
11524 87 213969 131331 33837 214232 28183 234013 -326 288713 227964 -86538 154128 309222
11512 309222 306017 242679 506202 -33332 -39094 191728 -15992 59213 212204 62702 132263
11501 132263 111815 -442526 80096 82319 -5077 49586 282408 -24676 165845 70826 -156900
11489 40212 -116670 186156 -145331 -199109 55332 60735 31110 125878 128452 -41096 221945
11477 199254 -73882 225316 401508 -242029 192401 306615 49791 155230 263859 113451
11466 315048 106440 326633 -266654 -68731 129292 198742 -40673 282981 143953 305924
11456 305924 253159 5453 75725 -112176 199680 325998 70914 50116 218441 12563 420844
11445 420844 209147 205629 242123 -90042 289953 247703 -44578 163965 171179 -2044 -50264
11434 -50264 19561 -102690 -36006 296128 52975 -22562 357257 -75019 -268515 75672 -331429
11422 163697 62334 -182128 -21605 211791 -100142 61934 -167775 4349 151680 132259 305398
11411 305398 105166 -2531 -107198 -108970 285041 -290064 41687 450833 -155240 -93213 87806
11399 -77573 491118 -73104 145116 16457 -212457 400 54563 43869 58108 -145141 -182826
11388 -182826 -18388 -135023 -142752 137418 -75957 -93384 -43682 59231 -235161 -33252 -6742
11376 190649 38711 -98993 91535 302642 24893 -261606 -122392 84309 -81481 208552 -14802
11364 -114429 161021 -5925 -287353 68070 -36424 -99961 -102448 -101794 53322 310728 -280961
11352 142673 521892 -11739 -428151 185733 232678 148658 -66740 -130145 -211554 317747 -1541
11340 -49359 252230 390858 -203381 -178847 -261815 -64685 141912 -161210 173472 -283113
11329 -229410 201188 92669 68566 243072 -272624 31603 152367 70570 -130695 188290
11318 -38611 105253 107597 -202578 57784 -54888 56753 -39117 153412 -79569 -3758 -17893
11307 -17893 100503 -310507 144800 -46765 33335 -283990 28019 -288684 -65168 -74755 355511
11295 -131555 -65458 -39240 -79597 66997 -222247 160494 58276 14303 -136709 -73647 -2312
11283 176663 -65351 -132407 320344 -56688 137704 297922 -73656 125881 -141081 -52517
11272 58800 -277856 218626 -55717 93281 -286278 -230298 -88198 -143642 -207523 163174 -79770
11260 40168 -464645 -321087 -177861 -70422 43854 -194834 -184233 39949 192991 -22005 -313462
11249 -313462 67163 -21977 -162045 -16364 -19513 182065 -328299 -38367 38169 -455473 147785
11237 -134463 -13243 1392 1058 -18474 -332544 308143 -50519 6520 17002 132532 -375719
11225 -117830 -104103 -335158 -197524 -6675 -152022 -180257 161869 124531 -201256 -28082 136909
11213 -3566 -311815 -322107 69879 -356982 202383 20554 40034 6754 -238052 -281377 132123
11201 -80164 -14416 -30331 -426563 233984 4042 65627 182757 21060 192762 -445272 -87140
11189 -66923 55422 -31768 -192739 31102 28639 -22107 -214269 -3638 -237870 -94408 67020
11177 139478 102843 5431 -191482 127625 347979 -113881 247919 80316 118793 214265 41577
11165 80175 -48432 12407 278936 -62209 263588 55164 223387 278298 88864 -161740 153298
11153 -49081 -222517 8775 286803 -39543 197504 17791 166996 21541 -136740 98454 -97059
11141 -51443 -97140 50057 -10776 -68677 72279 19411 -374956 24740 173009 54586 43406
11130 43406 -34686 -6000 112379 376507 31480 190105 59880 290450 -141418 -134258 -37075
11118 16111 395502 275620 -10940 101884 21311 103016 345464 320384 -6403 43152 -308002
11106 175967 39621 204657 136357 23151 321387 -11922 287789 216666 254563 -33341 302336
11094 10015 507862 466413 107951 11188 277564 161671 71395 429870 506097 216122
11083 -176487 218499 181762 -124234 225602 -58907 374160 304443 244554 249106 105052 452759
11072 452759 145314 230994 333638 130359 326979 145215 327046 362942 171958 444383
11062 444383 394150 438025 299042 743762 496778 520551 236811 415038 778067 609376
11052 609376 438211 681282 598322 480511 1019153 926128 644410 790703 705395 586250
11042 586250 577661 452381 753898 401206 629060 616713 683936 517989 420041 411792 739587
11031 739587 791065 614286 467988 814854 530847 872806 489825 527920 638020 1134038
11021 1134038 528285 478431 524283 852015 477166 323538 510093 477859 523003 363816
11011 363816 373126 373738 531828 818752 636242 593091 404313 396735 452757 328032 568206
11000 568206 659146 454247 757202 413111 553013 668542 327473 797797 956038 855718
10990 855718 661997 673755 512225 858368 1053972 994724 608341 1070820 819463 1269977
10980 1269977 1283357 1461520 1543244 1859548 1681893 2257078 2372040 2485146 2622088 2765444
10970 2765444 2575108 2367569 1990398 2505092 1830720 1584521 1798912 1895344 1607277 1805657
10960 1805657 1849697 2080040 1822867 1478327 1893347 1983011 1538443 1447834 1227742 1426089
10950 1426089 936063 930874 509725 176221 587582 202454 36123 238853 77931 107853
10940 107853 -77088 52543 172338 40103 503901 216649 52480 280603 116791 124558 422354
10929 422354 -42309 266584 -63052 90931 -1909 301211 76100 138754 174818 132193 -255341
10917 21494 -150082 -64089 334602 201224 -63143 160385 -66327 -251807 -36886 31855 -122225
10905 150246 -203619 -98325 -164304 -39872 -251487 80838 -191959 -69023 106963 1357 90226
10894 90226 101185 -137063 -109356 -63564 126119 59084 -13880 102339 -117322 -138676 16011
10882 74993 -61980 240887 -184420 -405441 212228 30777 129511 -94112 -29776 -4106 -162963
10871 -162963 -44693 165720 203816 164335 -37541 101320 25017 87305 -118835 -81581 53805
10859 164146 -148388 71213 -177862 154463 -67128 -94576 -14172 22652 -128295 -88820 -31681
10847 -182707 7691 -241240 25502 -135913 -140375 -79289 299773 -193205 25349 -99747 -157684
10836 -157684 20984 -75099 206545 33430 -210632 -140712 144981 -8713 -1755 187111 137824
10825 137824 -342957 -11592 147432 -3361 268210 155758 -138934 -96383 70426 68947 -211087
10813 -96033 -60645 -170903 28110 -101092 104475 -159700 131620 39337 -108002 57308
10802 32522 -168897 -100993 -132119 58364 -199056 139546 1940 94176 146330 -184836 51195
10790 368873 -129524 177833 14504 -103349 -111165 115394 -109869 -113523 7099 125346 -18095
10778 7478 2371 -397095 -42109 -71369 -80521 215702 -220255 92220 197972 10089 -211766
10766 -71736 258688 -18127 260220 -222670 -65990 23637 76028 -115677 57054 301519 -141920
10754 45157 -95188 166069 204336 -178332 48831 91699 4415 334586 162404 -62196 176635
10742 -103930 393899 -326 45702 -186366 103373 -140024 -234782 230812 -37739 -259325 -158129
10731 -158129 54070 -259738 -16376 104095 171575 -441748 -197385 -3568 -276523 -101112
10720 24373 -194450 -12608 70547 -155104 120903 106676 -58640 61727 187498 -181752 52019
10708 -9022 -55834 80975 -158188 19053 -24049 114489 -271575 -217064 206212 -120382 105402
10696 -143929 -143866 -103519 55666 -112846 10621 118803 206524 -57472 -31098 -50568 81149 73276
10684 73276 -76484 3908 68150 -196611 -47595 -187070 -144584 -39915 63330 126515 -228637
10672 -65348 109253 67110 -51556 -140372 10089 -66952 -185284 71505 -5524 -79497 -123793
10661 -123793 299341 -10310 -144629 -76773 84430 -138664 56769 136016 1928 33860 -151888
10649 57642 -6288 -137286 83110 -153119 -140161 -98252 262613 -177785 -326960 -118579 -154675
10638 -154675 -65042 20459 -84638 26466 174177 -208360 141059 62055 -255015 -85790 42677
10626 -241828 -55562 51315 123131 -45900 -322979 -356912 -532576 -387881 -113968 184098
10615 -187770 -62163 -84848 163217 52437 -25125 -298288 104239 -19769 -80045 -331812 128146
10603 72908 148808 -104660 234257 18329 465747 -208557 29414 -130122 -112156 -134864 22762
10591 -301939 -260672 -77638 129536 -73686 -328417 -201004 2702 191152 -31854 -110717 -334389
10580 -334389 -255284 -148968 -205420 -64858 88165 -180504 -159995 119013 -123101 -136908 -89536
10569 -89536 25546 -302645 -222538 -72384 -211487 -101094 25840 -35327 -327682 110333 -237893
10557 262222 -389483 -111931 -256397 144725 170557 -268471 -107943 -187229 2316 -71089
10546 -347058 137842 79773 -324045 -70148 131364 146544 69654 -104423 -16601 -130510
10536 -130510 -646 35461 138975 -92525 -67380 -193742 23083 59619 41502 -390193 99418
10524 -29250 -194612 208150 77482 -114654 -47762 367760 -88232 -111575 105514 84653 -111095
10512 -125553 -155395 -115659 180541 -122582 295675 220782 219325 -82618 -73347 -50245 -65870
10501 -65870 -61993 108531 41579 250413 -88416 -79737 -112351 197361 -40320 -612 -273665 -1092
10488 -179658 -78835 319109 -50398 -72302 209284 139618 364392 404998 400202 289246 236105
10477 236105 -176476 67778 -67218 102671 67542 15470 161536 109014 220954 -278394
10466 34791 18314 95750 158428 137783 -152885 288830 -158034 -13303 -204634 -51941 -104166
10455 -104166 -39701 -83294 159066 -246177 16777 -28302 21748 -147382 172175 359136
10445 359136 -157597 -4416 -138834 226473 -110333 3456 163089 -47267 12430 -36926 -43064
10434 -43064 -419877 180053 -266274 317815 192173 234611 -17521 -121936 21466 -63204
10423 306772 -146813 -21577 -138873 225894 -11417 -266589 -172530 -154072 -20436 -186986
10413 -186986 131245 68570 -277198 11824 150140 6193 169443 -19340 -214645 7602 35889
10402 35889 -219664 -111550 -142052 85388 -20714 26376 48373 172210 226235 93508 53454
10391 53454 244274 -64222 -88163 -59483 40795 186222 73235 123050 205395 241207 104443
10379 -62022 -153094 175701 68231 124903 -156769 -61344 55596 216000 292643 241647 382288
10368 382288 314688 323088 394967 342347 297065 466664 163806 358715 239173 436428 44103
10356 319817 -29545 240326 -56867 268395 378164 612794 583559 655397 257331 128786
10346 128786 120671 216007 160123 406483 544791 367455 355640 360738 301054 375875 301538
10335 301538 121159 51680 72353 25446 -18816 5461 285370 176500 -158515 253981 98832
10323 -15569 -40762 174331 167996 496662 15682 266118 377446 10143 -19663 198693 86831
10311 -77521 217775 -194773 265797 149198 -60561 105690 425181 -13701 116343 -12217
10300 53039 -59848 -41224 -22014 -9983 38752 -283613 160696 -50034 -365461 -143591 505176
10288 95517 -2228 -281100 10529 347531 33187 -162701 -184751 176470 -105040 231408 -314512
10276 -84447 -64011 54180 84183 -253807 104715 11510 -214202 397953 -204520 -67688 138550
10264 59425 354648 -38857 291341 534766 15617 287870 386001 -96153 599637 232644
10253 122410 -177440 -29941 -61469 69470 142364 -105813 222824 203524 10103 -217376 -132906
10242 -132906 -289336 475262 263694 -116616 -23017 -129572 -232580 -120479 -75376 -122242
10232 -122242 -30057 8743 178658 -90043 -36854 -119382 15454 -68712 -28435 -150916 -22404
10220 55951 -134774 -13423 -51327 122287 252139 -36719 241236 -50281 99902 -31808 145818
10208 -178810 -168682 -154200 -150038 -14164 117962 -167920 23911 -288847 345398 129807 -168574
10196 -14010 -105856 -227543 185031 -241301 -84503 -46985 -226305 10358 5157 -159392 -110990
10185 -110990 175986 -245249 17774 -166228 50365 -347784 -82910 -216626 -218346 266740
10174 -75895 28556 -51419 25540 -83585 25427 326550 -421349 -5317 206861 -6489 -217352
10163 -217352 166843 -342872 4034 -75910 190984 -184287 -165646 -67786 6357 -255570 -198145
10152 -198145 -25780 -115993 -374404 -75851 7726 -282341 155171 -184572 -157484 3242 16216
10141 16216 128608 -155593 46718 69408 -64318 369982 25852 -43942 -77562 -52605 193432
10129 106074 212412 -299147 -424832 -276299 -151095 33746 -111670 77264 -49826 175733
10118 56812 -37975 31356 -134430 -179280 -65272 126039 -398846 -318698 174214 95990 -237866
10106 129858 12138 74681 132166 140237 242179 86514 48603 272247 -255467 -61643 193322
10094 69091 -163844 207851 261117 14956 200437 -127338 -28103 -150906 28942 -190367
10083 -78167 -249796 113954 436227 -253859 -257007 -291430 -284385 -71385 316484 -57281 14508
10071 -126082 -76788 -17753 16782 -78651 161269 -121002 1545 42075 -140501 -64416 92956
10059 -26094 108436 241528 -3886 321600 -182610 30957 -50756 -55272 133185 -248665 -65440
10047 -5578 -250904 176433 18620 -109947 -267577 -185526 -34562 -117767 -160187 48673 -153251
10035 56680 -234158 -154418 -25888 345688 -95041 -305003 68850 -163910 -44007 -184675 78031
10023 16161 120050 129874 -204154 177606 -278975 -94540 -164632 -212631 -266861 -48377 331998
10011 -128238 -63498 -60471 -204112 34090 -73494 -203776 -182230 -120129 49379 173059 -211862
9999 22721 -367178 -371571 -292963 -142276 -47867 -377529 -17753 -459001 -121578 -21389 42049
9987 -70014 -122241 25247 -85878 -118576 -299163 -380715 110790 178150 -172478 477592 209290
9975 56211 -351777 -181088 -235982 -189074 109858 289272 -203452 138955 96304 -415212
9964 -42108 -93575 56138 283177 -177553 -200242 -109197 -143710 249003 -287521 -298855 120591
9952 -19337 -203271 -1441 -159019 228130 90033 4606 14191 61552 -11080 74308 -188530 21303
9939 31222 -159066 -203795 58339 144752 100903 43838 -45799 -248642 -81300 -277990 -297997
9928 -297997 -167777 -97132 -87645 -175700 -76538 -282113 -57142 -122860 -187660 -173747 -333375
9917 -333375 -9471 -29136 317529 -328290 -232559 -218367 33835 201003 -175998 -311063 -8471
9905 -129236 -35357 -184616 41419 -289012 -413282 -133059 -202851 179879 151507 55134 -203022
9893 239943 -230035 -157377 -249410 125149 -83818 -262231 -44409 -198282 -67784 -26116 -105274
9882 -105274 -344084 -58225 215411 -90350 -34446 -286521 116684 -265643 -256981 -192427 129222
9870 -5829 78054 -576 108184 -263688 104549 -61529 188308 7804 -183853 -392974 12959
9858 -280622 -189775 68060 -61420 15274 -250492 12196 106499 -217707 -208058 395245 -223728
9846 -110246 -5820 60177 -231833 -171033 -155139 -3314 -152704 -68257 -282220 -66043 -285509
9835 -285509 -320480 204960 55032 -231684 -65081 55444 154956 63849 132799 -31637 -397602
9824 -397602 264272 145710 202728 -162952 26167 164780 -248320 132883 -236035 -266252
9814 -266252 -115332 -187604 -49705 -352806 48032 -311743 -232222 -108981 158433 -144530
9803 101337 -285484 -40473 149650 106236 -156064 60711 26663 -43599 -289884 -11374 49376
9791 -223764 -134057 49665 116318 222379 3600 -223208 -125191 69497 -65385 -153684 308292
9779 -115502 51836 -1877 -58766 128411 -13100 -71053 271268 -227873 29731 -71605 -359375
9768 -359375 158524 38186 128751 -335862 -112150 -251020 361113 -180564 153726 -274987
9757 157590 -75683 50463 -220525 49253 -29398 -56968 104588 -194340 72316 -141136 -185575
9746 -185575 -311754 -17091 -77557 -47420 -60874 -40746 -48933 -91354 -140268 86798 -49535 -62586
9734 -62586 74437 261429 147578 317024 189567 -37861 47096 78503 -231256 -221135 -247674
9723 -247674 350826 -34394 97170 -155698 -171430 4377 6757 -55503 -91747 -160688 -40613 -63625
9711 -63625 -226791 178484 -194651 7162 -204768 161388 -145286 295560 -187923 -258478
9701 -258478 109733 3506 34977 -10556 35651 -174491 272214 145301 -11689 -364955 116925
9689 -268071 -95702 -218394 242960 133637 -201886 -246084 -221230 406668 171954 126115
9679 126115 -315603 -122246 -212440 -130193 65508 1884 -52052 136290 -137320 122042 -85812
9667 -268916 -62439 107440 69179 133857 -144844 80302 -14736 -377303 -46298 -300484 140845
9655 48638 -23900 -85350 -19736 -215819 235382 -384322 21562 168536 -143496 -100452 65976
9643 -52000 -274722 211798 -134363 -54387 -132457 -238706 -389951 -42381 -456639 40892 -304694
9631 -68156 -33947 -208127 -176616 -362077 -7984 -50238 19164 8035 233205 -77069 32894 -79045
9618 12079 -158490 -257981 181174 -10360 -91183 -66033 13280 -86836 26764 105616 -269586
9606 -116421 -171701 -81004 -337425 -124870 133144 27568 -198770 -42345 -161981 -303003
9596 -303003 211695 111085 -149873 146876 -39111 -351845 94062 -25756 -129082 164604
9585 96646 112990 115483 -42346 -211818 -15499 -18933 -86150 -172959 118994 12670 153509 -210656
9572 -134302 45697 -72191 68228 -86272 -16039 -106021 228539 -262809 316933 -360719 -30847
9560 21934 7293 -151103 294602 -274496 -10409 12286 -119213 -444230 -65935 -70698 54713
9548 -366447 -131921 -109917 330515 -55651 -39517 -414971 -46467 -31945 -265432 356118 208578
9537 208578 -133340 -45160 -20445 174188 -47528 -98831 -162280 183852 -440543 253780 -10919
9525 324221 208679 -351786 36119 225981 -199648 226301 50898 -13712 -315687 -405323
9515 -405323 164530 -334712 -292181 390592 173913 -296810 120239 -72475 78400 -62777
9504 -448173 -222233 -18833 -27537 -15271 164899 29329 -132002 -12158 -108866 -241070 -204140
9493 -204140 -93341 -163647 -289348 -131721 -118836 -237611 156519 95978 -133601 -173469 7862
9481 -57603 -36631 -346764 -162612 283252 -498 33631 34271 152143 -234516 -21645 193518
9469 -274234 -254724 -301078 34162 -190389 -239766 -311294 177679 166047 249069 -9416 -40563
9458 -40563 71951 5459 59558 158295 -107722 -230767 -113936 -211957 223032 -350365 -127379
9446 -150294 -29635 127823 -142527 153957 -101187 -237092 91097 -37737 -320162 53367
9435 116331 -17638 -2683 152629 14695 9048 -29542 -61235 -129273 -27846 -182709 -50205 283201
9422 -63888 26849 31703 188838 -150424 9522 51251 97483 -85534 129274 199745 102342 -61476
9409 -44741 -45148 -176446 135394 -184895 42998 -45850 -37117 51480 -199797 -225463 -338185
9398 -338185 135657 -190689 -320827 -92820 -24260 214914 2754 -18770 -72672 -96285 245016
9386 -215577 -240696 -34131 -46465 -314813 -298315 -62432 -40054 33307 151219 -51248 74346
9374 8142 -288996 -77060 112799 -5376 300875 -249103 58011 -237131 214093 82198 -9939
9362 -106146 -25019 -75905 -39232 -163249 -8543 83155 172997 162711 -255120 268348 -189218
9350 -52269 -147582 349395 -76715 -44260 -291000 -228689 -76511 127632 -102133 130420 133118
9339 133118 -160725 119307 -194050 -109208 -31552 102020 -123004 -13730 56822 156228 -4008
9327 -171358 -295911 -75983 156088 -216971 -550403 166178 -59778 51727 -176173 -207955
9317 -207955 177890 96103 -82271 -5827 175748 -160583 188448 -124821 200405 76262 152921
9306 152921 -169188 -167260 -28507 -41486 -223119 -263299 88494 247232 57286 180225 -279622
9294 -284553 -296630 -222790 -59541 -184349 149204 6501 -84467 -48031 -144874 -209830 21080
9282 -177806 95147 7758 82719 -8595 8404 -84849 370318 -236154 -183455 -106260 -170482 -171726
9270 -171726 -291864 -336829 -37807 21110 139457 -49284 38027 -70591 -244333 -38164 191860
9258 -348876 190586 32180 -319762 -162932 250223 151777 90135 255491 -99535 -31571 -140981
9247 -140981 41057 -71276 -169368 -19056 10941 -28923 163736 96129 -218319 40628 -333560
9235 98121 -245668 47718 -79903 404087 -12025 -64064 -59268 -50963 -130255 -108432 7671 -145742
9222 -141908 66431 -383294 229698 22559 -547941 -96370 -159621 29518 -81596 150780 -113174
9210 -172510 -236031 -85071 -79557 -205453 188685 -179290 -136888 -103216 -215943 -946 225398
9198 17469 -267423 137989 -45222 -126123 -147446 -96985 -43414 377185 41050 -250390 -360700
9187 -360700 -31904 -3870 154908 -123258 48336 213198 -11523 -5105 -7778 -127637 129448
9175 -160020 40851 -193413 -217351 -88739 -133303 51007 89068 -164637 98342 37371 45222
9164 45222 149240 155106 -281626 -265329 -116625 68915 -141439 -35747 -228321 -191297 -88519
9152 17771 97284 301760 -59466 -123878 -101715 22642 223135 -156980 111632 -444890 -328614
9141 -328614 -142856 -177435 -426570 -335730 -291662 239409 -221171 -228356 -235410 -161822 147613
9129 -39200 92303 -88671 -125888 176574 -98804 25319 -115504 198509 191617 -54698 -5220 243853
9116 -265457 -214584 -248369 -230505 -20087 -280727 253772 231112 -159489 -181358 -142413 -37677
9104 212380 -118921 182142 130352 -194897 240429 -65474 -82872 92793 -68570 -238747 -77571
9092 -23457 -11448 -24612 26949 -93756 -178769 484898 -69408 -76787 -90194 108204 -63548 -120420
9080 -120420 -102052 -96014 16809 45605 -220140 -271761 -52423 -151342 50721 59109 -171381 -162715
9068 -162715 320378 226442 292594 -23884 -107863 -20116 -355312 -31641 41930 32466 -72427
9056 322581 -123079 268538 -93556 30183 325284 11370 -266602 148640 238580 48103 12905
9044 -227712 -215877 -6374 -113069 76316 -116090 70781 -176703 48783 -184080 72022 360084
9033 360084 -101544 46433 -265329 -107551 -47115 -163469 -157532 -189513 -129641 -53097 59744
9021 -117590 222344 114082 522406 58315 53694 113839 -96674 126227 106153 140692 84931
9010 84931 -180342 -40579 161120 -102691 151510 -103382 -59481 50031 -76996 -64338 109546
8998 92258 304085 -74631 -318700 -129914 -265646 119348 56703 -251058 -75887 -20730 -152338
8987 -152338 -481588 -482548 -171660 221511 -156909 -341349 -388787 -52754 277431 -202119 -4341
8975 -236403 -34867 104540 -78996 -354305 404656 -137582 -52213 36219 33585 -30444 -144111
8964 -144111 -100366 -366659 -79045 -109989 -559227 -360256 13247 97233 -248306 -106975 -203997
8953 -203997 114718 -19072 -171145 -135093 -249507 142035 -60398 64218 -178526 -17 -161513
8942 -161513 -168957 -53038 -122715 79537 364388 -294599 -155804 23877 23964 -45608 68683 -94861
8929 -185745 -44181 121359 61762 -4169 271672 122567 1388902 4407706 2968230 942392
8918 -157454 36495 246416 -351 147800 -162845 -472688 9912 -34982 254476 -117487 470039
8906 74031 182249 60757 84398 -66458 -114561 35761 24961 74384 81071 -19147 -78117 134985
8893 -170516 57659 -12605 -1171 -164023 144190 -160500 38241 -214507 84030 -193320 14950
8881 -330453 2238 -11596 -72108 192517 -48093 222291 89348 -86901 -305017 143563 -60194
8869 -232449 -9774 -146146 -130269 346471 -50049 -67758 -11317 -420115 -44660 -201372 -272282
8858 -272282 -90467 -140626 -331945 -100829 -190212 -191418 -11443 -5914 -306975 57448 155383
8847 155383 83859 -128316 141538 -120907 -191922 -46061 -107917 292979 -12503 -75632 -125332
8836 -125332 231859 89535 148664 -127793 120438 -114598 454388 27382 36502 -122069 -108571
8825 -108571 17036 -127950 -53825 -26030 23638 -70366 -74618 -163844 367070 -38570 -157528
8814 -157528 -20406 189747 -307949 18079 -173762 -83716 -262170 -112088 -148344 96518 112499
8803 112499 -115979 203389 -235549 170975 -129267 -40928 -16915 -173508 27460 -245781
8792 9932 -57579 207680 151449 -42671 101407 -103267 -289247 -357175 -276642 -118150 -246002
8781 -246002 -80329 -51067 154582 170257 -292377 -126963 18279 40694 24521 51802 235456
8770 235456 190395 -3828 161769 -236607 -250562 -184539 -736 150619 -122161 -6542 -129203
8759 -129203 -116557 -307199 4701 -119879 -347996 -254290 -17755 -79446 63342 181349 -234915
8747 -262318 69193 -67360 -16713 -58901 -78672 -220482 85179 -54360 -185039 66659 -69800
8735 123454 -253445 -126955 111823 -67963 -58928 29844 180332 74978 -247782 180553 126499
8724 126499 -131598 -382935 60428 148737 -173 -286941 -48945 -293804 -115637 110250 141170
8713 141170 14596 177192 47193 -7196 -88641 -122604 -38206 -115988 76557 160385 -225196
8701 231284 76921 42919 -346235 397728 91630 -68901 -131253 341802 -21150 -51604 -389346
8690 -389346 -110798 -215912 -349613 -253303 -17991 10060 83579 -247783 105083 -98639 157525
8678 118042 -201522 101204 -197814 68255 -31755 -13562 156524 34404 151890 -340659
8667 170494 204115 -44334 -37978 -351798 -73357 -231851 110228 -8790 -114252 -35128 -103821
8656 -103821 93407 -234827 264949 167570 -494893 52938 -140902 138640 45949 55580 226597
8645 226597 50963 55756 94737 -346553 234042 -47367 191919 -42932 -224035 234701 -162516
8633 311359 186096 -35906 -149527 -324547 86400 -49590 -213240 -239279 -9841 -158357 -208926
8622 -208926 41537 -55552 115993 214526 35435 -55026 -181303 41090 -74251 -316327 175974
8610 -65927 3529 258442 -174159 215227 -190615 51842 -96255 30654 289016 -37459 41335
8598 27719 237382 25926 -92431 -141601 9383 -14657 33493 77293 -63636 233113 163714 141463
8586 141463 122609 29384 163502 114549 -154141 126619 -97993 -297923 -328689 -177506 -166958
8575 -166958 100541 65072 -18033 -125140 -104267 67012 -77392 -95822 -39694 -102952 94276
8563 -86708 -12732 -358452 27956 235000 -71689 121847 86990 -207264 -14386 24493 -347244
8551 -85860 10272 133928 47246 35544 -164442 13610 67356 -177516 -25429 -186138 55985
8539 -97754 -56575 90137 -291547 168986 4579 -97224 -110235 -52814 198569 106763 -261787
8527 221181 83178 -5768 26901 -193810 59890 -96318 -288869 -227746 -48457 -130920 11597
8515 -299268 -197214 -75211 -79314 -220333 -470603 -249893 -156601 71164 -118394 74134 -176852
8503 -7547 -186420 8358 284686 45937 -158450 -131178 -316571 -27775 -60511 39450 -272634
8491 356364 -471802 257978 -204320 -281293 -26428 -53787 397905 -139725 -301672 -268 -68728
8480 -68728 -140161 -280541 -330402 -36554 384942 38336 -74677 -209495 839 210615 135953
8469 135953 -256247 -280663 -229413 51490 146560 68271 -117570 -252930 120854 84 -65298
8457 15896 21420 107515 -220907 11714 39905 -53057 124300 -29046 -18272 -83733 -6710 228058
8444 -42583 73870 -17801 -72890 10251 -15136 102787 -14388 -142171 97332 129878 -321565
8432 20656 207848 -328206 -231949 261983 -59622 -112579 62392 48643 58869 9939 -119503
8420 72922 31958 -205251 -121490 33468 -58553 157032 -204205 -307723 -124814 62626 -53881
8408 23605 -94134 -12545 47041 -180659 -126741 220352 355780 -204847 151202 -304577 99895
8396 -235685 -26479 39714 -52790 -177907 -352779 -125351 -51642 51136 -34268 -120650 -102215
8385 -102215 -19230 -99920 -29747 28512 -231806 -89647 76158 182193 -138356 -28105 311132
8373 -164831 -58707 135941 -36899 133668 186162 102463 -220594 -107076 20493 -77926 -40402
8362 -40402 -124172 -20909 -69699 72685 34890 -237422 -174890 -294034 -22924 -493661 -37573
8350 -101227 112287 -178841 152098 187657 186786 158956 218801 -38656 67010 -121654 283084
8338 -90639 287 -41637 -8286 222454 -63659 -21566 -23126 -278991 50497 98853 -150613 -47877
8325 -39371 -42706 263427 114654 47697 -124393 -68638 -54368 142563 -23756 -116519 -487205
8314 -487205 -187630 8619 -166162 194410 -77810 -295667 -122281 -5553 58060 -81434 -87324
8303 -87324 94078 -384457 47337 17857 100543 260939 -184201 -78554 -209631 198637 -3191
8291 -86767 35184 -85514 95517 -101411 100824 171247 -392322 153423 33877 -412839 34636
8279 -86326 201042 -276929 -369407 -232363 52835 148430 294886 -140841 -4401 -181938 183599
8267 11534 199128 -45251 -71581 -189433 -367697 423856 -11372 -85463 -71417 15051 96103
8256 96103 -248229 120749 -294222 45373 -55169 -116456 473960 66220 114156 263264 182403
8245 182403 -241005 -97063 -64399 -86426 186590 73386 -168849 6895 -257723 -292723 -30241
8233 148208 -21924 -71172 181683 91307 -181655 -32182 -28198 178422 -117399 -175450 32258
8221 48665 53748 -119928 207914 316933 76213 -80378 -119683 148010 -210137 -16157 -118174
8210 -118174 -127808 142614 144897 201022 -26593 -16132 21783 -56577 175727 -208638 179893
8198 278661 128587 -64199 -204848 -349947 249882 -69831 55681 -225722 194836 -136060
8187 -204260 -134884 102906 -49649 -167569 81527 -30091 44234 -112753 66956 -74285 -337686
8176 -337686 -81598 -375944 -247757 -103381 -85915 66342 -1066 -12267 65429 179116 -75551
8164 35839 8731 141665 -352631 -57138 -143077 -252353 -57042 262277 27049 290602 -322758
8152 -130573 -202608 -91484 -106118 -95361 -21348 185538 202351 -70339 51874 -126334 190302
8140 -303460 180982 317465 300379 -175256 -324526 -50812 -2929 -4265 -68259 -212015 -389033
8129 -389033 -65256 425171 69283 31586 -8163 -63887 154445 324287 115512 95587 -68292
8117 240062 -83763 -28479 137221 -110876 -141212 47661 -325000 119832 7 -39088 -406344
8106 -406344 -109696 74482 -237773 132197 280175 -128320 238258 -45141 -43676 -300636
8096 -300636 -93943 -41666 4058 -6762 -204234 -120197 -269500 -37905 -168957 -208684 -15279
8084 -58253 154491 -26978 139395 129668 317524 -89983 -208570 -39383 -238314 -222876 -239118
8073 -239118 120322 133298 -61782 137053 291082 -47050 -330143 9224 279356 -63541 -254474
8062 -254474 -107501 -20870 -82210 32906 125486 102314 307651 19907 117470 -184596 241554
8050 -184273 -21969 35937 63439 46038 -59449 292877 -2033 325205 45782 209818 -339583
8038 -23682 -255421 -313493 102942 -160997 -255082 187464 52896 -59275 -235212 89671 117279
8027 117279 191747 -29186 -230757 8726 -88041 86186 89363 225846 -25996 194977 -57851
8015 -233489 -268747 -265868 40902 -15484 -101641 -4165 96897 153228 -250772 -276290 -152717 132762
8002 -144679 71168 -493759 43250 -253275 -446971 20199 149791 83062 -204501 17350 -89942
7990 -74714 -62885 -1825 -60755 -86306 -177516 -194606 -369009 -395459 -59310 -81497 -22071 90326
7977 -224197 -68294 -443922 120361 -198678 64334 54725 -246480 -47366 209999 -268153 -214249
7966 -214249 136003 -146312 -224120 -70807 -197423 57335 -19016 -69342 399065 54529 -108394
7954 -120639 33418 306192 -48977 -44327 26959 -107633 -171313 24264 -85692 6026 -351055
7942 -174333 -329518 86905 -193372 -130083 7282 155901 260486 -74421 -227737 -136671 -139912
7931 -139912 20736 -75040 -94576 6924 -378545 -157352 242560 215519 91477 21966 -45856
7919 -150067 -155044 -151988 -37279 94911 151390 -214496 -177250 279563 7333 -129524 -36072 -3473
7906 -38704 57153 26628 -116386 -89589 -89903 114591 -318572 58371 -129059 64259 171279
7895 171279 -261157 -209065 -54327 -222275 -132218 -231628 -24190 154210 57922 115964 -225034
7883 133079 -19351 9192 45833 -11018 -161676 71417 53311 239537 -3575 -85471 125226
7871 -96111 -64030 -28636 -253746 -14780 87971 -84604 -229692 -235784 -130301 76247 -45459
7859 -18339 66554 60132 -122763 67323 -24723 -94149 -67116 -341393 -207981 59903 -122107
7847 -121332 214363 -293924 82886 59345 288259 442078 -64975 79801 12126 87353 -55808
7835 230245 -24100 -143365 -23915 243140 39768 3083 -277376 -248018 229692 -163362 -130092
7824 -130092 -69644 -126445 -174506 117895 -157867 -68619 169674 -2390 72709 246442 -136125
7812 -334249 -86735 -347674 -141910 102778 333859 -134842 55149 -188805 -27374 -67976
7802 -67976 -18871 193344 23810 -306378 -91441 -60075 219174 108228 -27056 67531 67212
7791 67212 -140155 76195 26165 68207 149534 -47449 -246639 -102075 148758 50560 -36474
7779 -57540 -457352 -44719 63178 -237696 -18436 452463 -169425 -111462 169794 -391084 -89628
7767 -115262 46291 -75822 -94704 -190147 200039 129079 -344833 -307278 -162769 -323101 -7275
7755 -65018 -329613 -234438 225079 85235 -121939 -95981 -83029 -21888 134717 -201601 -264729
7744 -264729 65425 21388 119312 202368 -226579 -203280 -342200 -13529 -171496 20142 -51995
7732 119579 -243080 -207860 45472 -128838 -327280 77145 -14129 111704 -102356 136237
7721 47031 -167420 -282455 -198982 -426084 177173 79942 -101195 -92345 -55216 282923 -277502
7709 94372 -151671 164599 -231143 -37119 -52092 163915 37079 141687 -60353 -70379 -251949
7698 -251949 -204001 54700 -125531 126 46334 -5480 104289 -256157 32728 -309900 -55635
7686 -41289 -72320 -126972 59275 -15944 207305 -69598 -58987 -158211 206526 -188462 132073
7674 124550 -208967 -75257 138785 272480 -119942 -60730 112494 -87661 37537 -154941
7663 -84513 129780 -224376 13920 289479 176835 -142934 -147436 42107 49327 131525 -63026
7651 -198699 71079 -105521 14151 -21772 18725 88606 130693 -177746 -64975 63841 -94125
7639 -343329 -22815 190528 -65235 78627 77622 12761 -85508 -137534 98043 167711 17358 -22357
7626 50973 85110 -41925 -289305 -297785 13620 155077 131666 -251968 292178 124521 80337
7615 80337 -78019 -314 -150008 11826 -181166 -115224 -239149 174674 -26778 -412425 -95431
7603 -76921 -34548 86981 -55473 -37101 152622 -7810 96515 -16995 -68030 133505 -268800
7591 -40469 301477 61243 -261649 1582 -103221 -33372 -214687 143414 -78651 -128438 40083
7579 55280 249598 -141089 -79461 -59036 48494 91598 -62147 -129989 -276691 -93787 62081
7567 258109 -109376 186173 161867 37138 182665 -19869 86080 203529 -125237 -397825
7557 -397825 28932 -26165 -166528 129641 -171295 449314 -101119 -40105 242342 113801
7546 62710 315833 -102523 117702 39840 -229628 -165227 68352 21132 -32822 173812 -58892
7534 -29668 -229594 -67651 -97995 44316 -46290 -377005 73085 388252 157336 -293598 -35876
7522 -8566 -195792 -51649 -210662 -77989 -101407 -203140 217957 63620 -192771 31327 -56843
7510 126051 36490 -35961 241899 -166138 -170930 -253450 126536 -62540 125746 -104498 -31332
7498 -21426 -125081 -83121 -409936 34648 140739 12151 15578 -48489 -365696 -164452 31398
7486 -299528 145727 339636 -60149 334669 111445 -17929 214110 -94281 333036 358913
7476 358913 152281 -29955 -71728 -127136 -168624 -98908 -189284 96249 -155273 -222207 -56973
7464 -3818 -191033 -396678 -231507 46354 -80111 25845 -84267 155018 28522 186736 -41579
7452 15145 -118120 -307582 -307189 -212725 297333 50710 -12934 -145230 103679 -19293 -255747
7441 -255747 -79360 -71870 43686 224917 25305 -120531 -121938 -147363 213090 -214291 -256677
7430 -256677 -115122 -122444 85816 215331 -5691 -53507 -33217 170593 200637 63238 -180235
7418 14702 -41926 -108259 20814 408154 -126063 -274751 -135602 293673 -15438 -262154 94331
7406 25746 -249343 -106126 -14646 34277 182872 34916 126950 26765 -164878 -279554 161725
7394 209534 133661 -211805 -146306 259394 71685 299229 -38507 -100222 -171090 93434 -189360
7382 -219735 -57046 -56615 81870 63255 -74606 428728 147542 25151 -175547 -271959 81474
7370 -77998 219360 -154425 203234 77272 -128402 -253381 165056 -64098 -335166 31146
7359 -45675 -28088 119103 -98407 -37935 47985 240282 -33614 77737 138932 236719 -108688
7347 -292505 127717 -184483 26528 -249220 9535 40690 -176670 15454 -97754 -143788 189469
7335 90076 15327 126327 -113594 -216645 -76355 5468 1423 -20691 -83158 212558 -15300
7323 -17625 -329382 -267346 177083 -201367 -403691 -374313 129125 -117633 -88384 -305130
7313 -305130 -141442 340386 -56829 8235 -232567 5795 -232621 -126678 74897 -1280 59352
7301 -1227 6086 -165098 -4702 -24663 101521 26088 -45162 123165 167599 -11151 -2003 -96143
7289 -96143 89149 -304555 -170602 -10078 -148355 -233310 63492 -270508 22572 -311875 179926
7277 -122684 107059 -31016 83232 187712 315859 49429 42125 -195297 -129529 45555 -14334
7265 75419 -477527 11419 78499 -111198 -74536 16535 25206 76143 -115943 36447 119260
7254 119260 -177694 71156 182869 35842 36164 -62271 -83210 -15941 -176002 9157 -165995
7242 19883 -96033 -57673 31515 29649 273757 2934 -153662 -379723 -333602 -114480 104229
7230 101131 -27921 -65929 86542 -244895 26339 -272795 -66717 -93241 -163007 -111943 -205305
7219 -205305 67166 63145 -4471 -47725 7287 -130233 -93319 -9882 74071 106388 -208181 33235
7206 213493 -131000 -102563 -9410 -16070 154215 -161943 -283949 -7217 157800 156730 -142440
7194 -236754 -176631 -225037 75381 -28545 -122597 -11179 -234124 -52288 -112653 -114985 -274737
7183 -274737 55985 80242 -13820 -37172 -163784 -38701 -32439 318342 -260694 -183400 117950
7171 29161 -2254 5674 559794 -210808 -238616 -272570 41037 -25874 -2705 206429 22069 270261
7159 270261 -61323 -101472 150923 51859 410100 45000 -26831 278568 -49597 -16225 -72729
7148 -72729 83359 177419 -109139 -30696 128130 191650 101537 -222148 -288338 -93535 45576
7136 249356 -162908 -65991 -40777 -39718 48002 -145210 97643 211625 -99523 -286637 15926
7124 24328 -264858 250700 -69777 -60014 -85150 -112629 138931 -171118 -64651 94611 -261675
7112 157637 119461 -53446 -87834 -239692 -85993 -185260 -359451 37018 39498 193784 19995
7100 -85729 5922 -42869 -392545 -181413 -152741 5037 -13856 -183764 -282972 197475 -161417
7088 -242766 197648 266720 140188 -337827 -49096 -95693 -103323 182086 -123882 1124 6087
7077 6087 21302 152409 -107079 -117813 -87370 301853 -97816 -134320 4606 -112247 132037
7065 -32900 -105049 -173205 -89362 -242843 62 220368 78563 -77641 62057 2299 25984 25627 -139184
7051 -191237 -95728 -118611 -40943 -229511 -141898 123134 6013 -55432 11305 7038 -78628 -68551
7039 -68551 -41691 73748 -260037 181334 134453 -127389 -11625 -36468 50641 14397 -122328
7027 -36218 46821 26200 -307754 -192593 -142141 27758 154570 -300644 156494 133710 -89843
7015 456600 -98787 16616 178479 -116528 58861 -102496 -180344 -183724 -32329 -19905 -159711
7004 -159711 117383 -553315 54280 62455 20255 -49984 -37829 55621 238541 320095 -185493
6992 -162197 -157904 -86584 -4362 -200964 -112244 -201646 -246587 198448 930 -13641 -40007 234322
6979 322557 -325806 -46031 -244974 240965 87126 -35020 -266640 -192592 -350223 -207765
6969 -207765 132939 -389334 -51739 843 -7646 -246261 -159690 33433 10860 49752 -40620 311453
6956 161389 -164500 89480 -269821 -222188 38919 -60675 74049 247271 136799 39881 7616
6944 -104267 27875 -119731 -99800 106034 251648 -12912 66106 47080 -142447 176492 212135
6933 212135 135525 111442 -251571 -174756 -184879 9471 -8190 108693 140342 245245 -91856
6921 -55760 49716 88179 87501 -372406 273986 300303 16457 -208155 72798 77340 -253124 -154527
6909 -154527 -189201 150077 -110501 140026 120242 -337169 150901 -13652 -12396 -83991 -214878
6898 -214878 54100 -100694 -408232 -251437 -124623 -157645 125272 -141986 157208 -123487
6887 141501 -229397 64164 224516 99496 9359 -229087 244733 343994 -82483 -118251 -161121
6876 -161121 29536 182555 -201082 49688 -227515 -128331 -174855 -61450 -23684 117386 241130
6865 241130 9874 256033 171730 112362 -261484 -95547 -159925 -97227 26903 21027 347268
6854 347268 927 38065 -166588 118484 -31876 1322 134045 -55336 -409643 -169056 76624
6842 -337152 -36517 45385 23538 68972 -3506 -341704 -280914 19421 -297758 -151718 -209439
6831 -209439 -166765 -59781 237016 137184 -343237 175903 15525 -67119 17152 -23660 -155146
6820 -155146 -97630 341691 3748 -433333 152449 -116811 161763 -104136 -9145 14567 -54014
6808 -7366 -66836 64046 -127655 45155 177563 226965 -46 269610 95849 -103950 -122627 -130747
6796 -130747 -198841 18016 -323184 -262725 -321449 196627 -260702 -11274 -54653 -1032 46065
6784 -121539 -72096 -55007 297946 -305355 216145 -144927 -342770 -468446 13284 -32979
6773 10194 65525 165760 67650 27082 55319 249065 58415 -70309 89824 78563 -52037
6761 262267 -25313 -189747 -331811 127516 -139283 -186160 14958 -335755 -146476 120269
6750 292580 242209 80708 -72096 -225724 -71178 -65380 -172972 -41406 -171743 -161099 20409
6738 -122141 -82498 -257150 -361229 261619 -27000 120457 140942 135096 -147678 76229 -157820
6726 122249 -19645 -133226 41658 -303783 -8489 -247471 -57588 -115017 -96016 -123460 -99571
6715 -99571 132860 135537 87447 21472 180573 -26141 229296 44383 90590 -75642 189982
6703 23633 121942 -144740 -113429 -302120 -58503 20545 121538 -20440 -196611 -146706 -305490
6692 -305490 -61464 122349 46663 -232190 81255 -217486 -34464 -146612 215940 -19486 69846
6680 -205701 72192 -13977 140203 169225 37607 89288 98686 -32332 46368 -57617 -120291 73159
6667 -260777 184647 -180273 -276941 278885 -112384 -437717 118344 -312544 44389 -249581
6656 -303422 71705 -97322 118997 5309 178424 110048 44792 109970 -25594 230224 -99189
6644 -39975 30471 -44643 -343262 130096 -23854 -347135 110051 -248941 124416 -12995 54301
6632 -75493 96075 -68497 -260900 -9626 204568 172769 154772 -306292 280503 203882 -91253
6620 -27450 -83400 98531 -116471 58831 11931 5139 82634 -186164 -107772 -20488 -163828
6609 -163828 57756 -119207 -159797 -247939 11730 118580 53240 -105665 -27363 35979 -7072
6597 103530 108513 106263 -382994 48900 142483 28401 -321959 1476 -57047 3877 -63219 -189250
6585 -189250 -109110 -112870 -192252 212701 -233317 -163173 -121091 313930 25789 -415972 413518
6573 -234046 94381 -108750 40182 -10169 -363573 287496 -25132 -36646 -86250 180543 -152508
6561 116776 -154796 151629 91389 -65046 -87184 31350 172053 -95717 38714 -162080 -34815
6549 -133446 -118963 105418 -210495 331761 31450 80868 -33538 81854 -59673 -9079 236202
6537 160312 49022 252664 179982 60818 -283735 -210925 -206514 107683 -85785 183621 112083
6526 112083 -23860 -427628 -14304 -295558 -16766 -58949 -241437 -104878 32146 -40630 37328
6514 413075 -17003 27532 29405 -165597 -275418 -81476 73829 36426 135010 130053 202374 11749
6501 -132750 523711 209644 2785 71308 186506 -90874 -109475 25800 46071 -249593 -64761
6489 -338830 -25555 -127979 89343 201924 712 -18771 110389 126095 -53301 -94634 382587
6477 -91557 -155325 -252402 -299384 -114784 147098 -80766 79487 222695 127106 -159378 -34417
6465 -94321 17744 280888 -188471 16219 -270860 -166311 128941 32591 -25231 116934 268261
6454 268261 -246437 -19021 -211761 -255589 33935 4022 185257 40992 111547 106808 50323
6442 210883 -158198 -7007 -504768 -253664 75342 132046 67633 -122852 -116257 -65980 -60352
6431 -60352 -222082 -83579 -63730 -62873 15720 -178079 -217252 -72928 50947 323972 7971 231918
6419 231918 -183837 140477 325989 -57901 349500 70875 13433 154177 -213666 99833
6408 29912 16361 -161765 164223 91907 -167729 -141793 -167166 -285186 45545 -8776 124027
6396 -23553 -405844 193893 94818 197206 -139214 -107435 -29527 110669 -58124 -3890 236716
6384 19308 203081 62839 202154 -208621 -59790 -161204 134634 -37754 56362 -291610 -98441
6372 -268737 -361492 -356254 -228427 10610 272280 36001 -61436 -83419 -63024 -171508 -87974
6361 -87974 -118561 -35875 159310 -123797 -374005 22200 -63522 261383 -146755 153582 276152
6350 276152 254940 -166831 198570 121001 136373 218520 -9603 -40095 111325 -131456 241359
6338 -155074 -36020 163299 284297 55431 137796 29223 -74151 115104 -79980 102252 -152856
6326 -19019 -30613 183300 137031 -119061 -61452 -108277 -51722 -459296 -320868 -165931 -76588
6314 -99426 -150789 125736 355440 59850 411162 166398 -90643 -151621 -1617 339774 196859
6303 196859 -20892 111559 -105562 98355 -34771 -103770 -32347 -48134 -49058 -360597 -24881
6291 -22485 278272 284212 124110 -144097 -18955 137326 130795 27129 254682 -318543 -96462
6279 -251628 -154883 412435 106712 -79812 -211111 -92531 -195185 -255659 -236231 -166070 40154
6267 -292462 -240535 98424 -183020 -69398 -13599 -31358 -162508 -105743 78574 110955 75595
6256 75595 180082 -20139 -233895 -98279 299157 -136846 -97241 5532 -26629 -77515 215847
6244 -142210 332668 -86038 27659 101272 -317814 502271 -60715 -201185 -227656 -139349 -216459
6233 -216459 178003 -496239 -92346 -123025 -282579 -289507 24961 -185881 56524 -99440 -9562
6221 144032 -166321 -4054 204477 -75390 42630 -177916 -170135 66301 13039 -48821 227093
6209 -58629 27497 -196584 318392 168003 95444 -56042 178138 -69702 -137236 -23429 197423
6197 268188 1561 54043 22440 -161510 148220 24851 261368 217767 -17833 4212 -284816
6185 -87362 -28315 141256 64851 -265470 -125794 120324 -199092 51964 155441 254073 182750
6174 182750 14859 -251143 -33144 -214057 10239 151816 9961 -203789 -56037 128069 -134957
6162 -167103 -18861 -133461 -48023 87467 65310 -98002 -147419 196841 -68523 -82363 17307
6150 -279766 168054 104579 95756 122899 100096 244265 -98941 74895 -73876 -12492 -319405
6139 -319405 108494 54037 247350 49940 8840 134214 -94077 208405 -165895 -71222 111658
6127 39302 9114 161892 -112808 192861 164534 47136 41745 -232643 -118693 -19573 -164800
6116 -164800 -303768 30813 -55716 6018 68234 -261714 307535 1035 -266852 -130062 -55164
6104 -57032 124703 -179931 90388 103223 106017 399181 280314 -63387 -260809 105238 202439
6093 202439 195586 132545 251402 -9246 182741 90013 -36022 6167 1833 -59641 -145410 -121675
6081 -121675 -113881 65483 77173 -300598 -128246 229741 246627 -103631 1996 -57894 123214
6069 -131289 -146532 -40945 124473 58298 -207302 -5017 26453 72430 -48876 -189987 -145915
6058 -145915 -379538 97676 -189320 -192305 176433 170051 -177126 306027 33218 -35139 206577
6046 -137455 -226846 30531 -266506 -46743 -136430 94885 49533 2607 63187 -525774 -62317
6034 -121299 59466 91493 -13595 129042 49549 235162 27839 -33805 227875 116400 -412411
6022 176414 76745 239051 72388 -47216 -99647 179259 -8955 -305646 334876 106603 -224762
6010 54350 91323 -8604 52714 11480 -104625 156509 -265836 -36166 -59075 -257917 -330811
5999 -330811 -215287 46345 48569 124143 -91090 254661 -265526 -98683 21686 -81065 -83577
5988 -83577 280024 -15969 -148350 -68614 -75510 -51748 -113555 29668 9239 -37569 -119560 -63633
5976 -63633 -403633 134909 -80377 81277 -228443 30890 -8834 -238878 364665 409508 40580
5964 -190243 -132393 -106186 296321 -92273 -195325 -54985 -114343 -143683 -94361 -8844 -299564
5953 -299564 443444 87992 -273475 -155923 -265998 217784 -94253 -154842 -336868 17451
5942 -160265 -77903 250195 54825 195884 71665 -21285 85654 -112104 -119745 80787 -158630
5930 -74881 11444 50012 255977 -332181 -79164 160343 32870 -112586 -152958 10497 -175087
5918 40856 34375 295801 -117161 136336 66959 -251355 -153934 -333811 41543 -141260 256575
5906 327557 -2574 -167909 -301937 -272515 -119685 -298075 -15319 -212914 144607 -30724 49478
5894 -84181 83197 17451 -117122 92484 -213402 144941 49027 341597 -69909 173417 52554
5882 27012 -257848 -92573 -15013 281266 -211024 177675 -5076 -56624 -218869 -108803 169604
5870 -166005 316415 -27028 54416 -272085 162316 -182399 29730 -52723 -39636 134502 -244279
5858 91750 212085 29716 121754 -274810 58795 8460 -228187 135116 -77593 389912 -221481
5846 125025 13886 -245125 246258 -33092 -12623 27208 63143 82831 228165 -47884 -174103
5835 -174103 -247241 100547 -141061 87900 100579 222559 365184 38603 142403 -257682
5824 -932 -119038 -175755 -63841 20311 -5174 199185 1628 -330623 -43839 147304 -32795 -76491
5812 -76491 -381730 -56626 277515 -228613 -311927 85142 -160270 232056 -94057 -154775 14211
5800 92324 283457 -352872 27473 -236963 109119 324391 6621 167603 -95883 -58494 390499
5788 85861 6899 50079 9487 141497 313637 -252741 108549 -116891 -313993 -137306 -42107
5776 96486 -96519 9427 -762 64664 62662 169548 26264 -129444 -384009 -187910 177497 411481
5764 411481 -36594 51716 -230241 255484 249792 10779 55825 175761 -199377 -259770 153453
5752 -282308 -187229 27161 111009 -14998 165885 170061 -149395 223755 104214 -155922 187881
5740 51067 9353 145350 -67718 -217592 -265632 54643 66738 -182594 429800 115940 -88123
5728 125797 -69953 -132953 331755 200904 -36165 214874 72172 31063 -341398 -63457 116550
5716 -233048 129795 -203961 96214 -187142 57569 -196901 -268545 -20163 -215302 -262741 167310
5704 278291 -44447 197545 329267 -872 -306573 -57184 3782 -187686 327324 177479 -242043
5692 88900 -269829 -235526 157392 -281764 23239 18286 141056 64739 404509 -43543 56168
5680 50757 87165 419704 181893 12921 -238960 -74111 -1634 -169877 36769 -71734 34480
5668 -152200 182184 69282 -59413 172579 -68052 -159032 5326 160032 176835 112363 111394 -312258
5655 -25516 -186270 71127 -187628 22781 -21161 -147496 -197036 -77471 -44353 -90560 -65700
5644 -65700 168835 304280 3509 -55260 37435 273213 90030 -65044 266857 -108627 -94704
5633 -94704 -146188 332599 152074 40777 71883 -166969 68083 20243 -141364 -321527 -48801
5621 -395995 8697 110096 -23182 451531 17047 -39136 -118299 90344 155673 465 -138104 -45018
5608 -12020 -239281 -41521 98101 167499 -183386 -2411 -287355 96005 169007 -144783 37547
5596 -163159 -123984 17664 -428010 12340 -30368 108570 -172851 75878 310064 30869 60187
5585 60187 -235712 36911 9344 -95399 32158 -617440 39585 -205925 -80169 -16312 207755
5573 338796 181713 206757 4827 106758 -17165 -304805 71286 188853 103272 -65605 -152635
5562 -152635 181101 282689 -403566 -212725 -73058 117058 53 2546 49273 -23848 94712
5550 -126909 168465 265413 175205 93920 -180389 -73170 -332620 -66374 233426 29385 95241
5539 95241 78310 153318 -65767 321829 -30290 -124720 22329 -139011 -124268 -304016 -41218
5527 -62023 -260537 -141954 -92192 7036 -43482 -139490 -390703 79751 229324 -82223 51748
5515 -63807 -56256 195342 -180426 -153238 -126658 -79809 -39936 -49214 96276 -192054 487 -230321
5502 220609 -75947 -42223 -49828 -101849 -114456 -130781 215977 72343 -182689 139227 56439
5490 -46135 106348 248938 -174492 49533 -306096 -93597 -8656 206119 23783 -175206 -19021
5478 -294088 159475 -33067 78680 -187690 107610 228455 45548 -37378 98777 291851 173950
5467 173950 -56924 29951 -75660 -66704 -128556 7360 -24245 203809 246387 196367 175829 -46320
5454 377070 -110742 -86020 168814 -16000 156905 -14029 86186 -201678 -152584 104108 208706
5443 208706 50218 -174606 174504 98629 -195487 -455570 164878 -51260 152906 -253903
5432 -85080 42461 -101515 61916 -236710 65672 -95973 -101039 71000 234791 -178437 -85367
5420 -24308 117664 67170 92999 -147699 413295 35866 -87437 30273 153740 -204277 68738
5408 -444169 -278918 -176544 -414818 -45343 -36950 -68201 -160962 -79140 -101271 178866 -29554
5396 16150 69591 90092 28598 -571 -310259 374070 5286 -112762 -65813 57730 60475 -139044
5383 6140 -184381 35710 -141554 -149605 -96194 -20085 53233 -25337 -155143 19834 -154968
5371 30783 -115536 -196635 -86255 1146 -153393 268556 18762 -227860 -60276 81147 242239
5360 242239 -102048 104326 -20823 -24972 -79685 -106013 -65936 -54146 78044 186094 -194772
5348 58722 -198170 2468 103411 254906 27330 -69147 -446880 176401 22478 151913 210728
5337 210728 325081 -126153 145011 -206574 -249146 50858 194527 161790 259974 235349 101558
5325 58023 -12492 77385 37518 -244126 308670 -27476 71717 -18448 -31541 147097 365613
5314 365613 95604 134734 129617 -209916 -218489 -41335 -147702 -193367 26109 78938 -30970 305658
5301 196838 219433 66792 44070 146304 -45946 9281 -190481 -165047 181769 -4176 -71105
5290 -71105 160312 190386 -191727 -219074 -10531 68229 -9102 110699 8736 -35687 -98380 -148843
5278 -148843 87457 24496 265849 234690 83637 -1141 14410 -225419 -317664 3143 49355 -94636
5265 -96221 30366 -40500 301018 92819 5536 -195720 325098 190321 485255 43145 -403411
5253 21697 8803 -270711 -382476 -100069 29410 -3179 -24662 -3475 131827 89264 319337
5242 319337 333646 209425 15605 -69654 66221 137547 -104807 -72625 181376 -156807 154543
5230 129705 337273 26092 5991 30890 170945 3490 91546 -48599 -123260 -204130 48962 -104268
5217 13000 242185 271151 -124414 -217596 171490 -226798 231699 -144219 14330 174799
5207 174799 218013 29854 -228682 144125 64303 342624 61730 31709 -185051 7970 223681
5196 223681 -90964 -278400 157715 138034 32492 -172150 -153891 -283479 -131258 128852
5185 65826 5226 -72126 3518 -240618 -45187 -320769 79473 -30754 -274568 -75953 -222190
5174 -222190 -19525 -113340 97962 -104911 -251458 -210949 -306388 134112 7676 204434 -19138
5162 244655 81601 -275494 94447 -2915 -285462 50833 -185238 51034 231458 -51584 28062
5150 -409885 160904 -75473 -98735 264368 -110169 -142744 -59393 22639 -422660 207649 -117190
5138 19244 -95935 -167550 -196918 -63436 146626 26471 -65698 -90995 -55940 97544 203501
5127 203501 95596 -71821 147400 56714 -12550 -256003 -80042 318076 -258327 -45997 -246395
5116 -246395 -95799 73420 -20893 -271522 -61026 54605 -156498 190605 -47172 -103755 -13437
5104 -136524 -25151 29779 59828 -195318 -146449 64950 -150689 47226 51879 174687 56341
5092 398725 -261497 141504 -6916 214415 3881 -117051 49511 128219 169989 419110 169428
5080 217860 -21506 -269291 -7208 -173518 129267 71169 68920 169694 -150547 18280 134554
5069 134554 198451 -207152 -108519 309736 -87819 331276 12934 81444 -389988 -68618 190663
5057 -80102 -137698 -8607 -104569 -130895 -62597 33866 -99292 161201 38440 -173029 61543 220857
5045 220857 -3451 -96063 54862 155954 122810 -189052 -37824 3588 47425 -5026 -56083 408595
5032 -119921 54957 -35617 266432 109801 184009 57404 107964 -696 -4344 -81265 -37876 -66852
5020 -66852 -54563 -180058 52741 -284967 84967 -158018 -91653 -139730 -211992 299740 -24263
5008 -23903 133049 -240100 -90411 164047 78883 -344586 94686 -81164 133815 -157744 -174511
4997 -174511 -64271 -178201 -327019 72708 199266 73857 56955 -100898 164780 161564 -98717
4985 124368 19745 -6029 -189717 127169 342998 55734 -13699 197021 247579 62981 -215055
4973 285386 -149290 -124781 53409 7698 92074 -173329 -37194 6387 -21671 -104345 -39828 -418382
4961 -418382 -278553 63347 -218899 108636 -121410 37837 57665 -411391 -95926 99882 -72572
4949 -71476 341517 -83801 -63188 18822 -119691 16157 6400 -219111 50937 118302 56768
4937 -19650 226581 25218 76901 209106 11561 42124 235740 205714 275779 -8701 61618
4925 -90355 -86373 105010 57652 103551 220274 69360 -82075 -113490 -60200 330754 -88858
4913 -49263 257567 -129875 150695 187641 1206 -96626 210293 444678 -174263 -208287 -263213
4902 -263213 -212896 -50464 -135646 61244 -9655 107480 107742 20287 57991 34859 -68015 -58069
4890 -58069 -125231 231782 -15486 17810 160636 -274794 149355 -343806 71557 -311777 -93130
4878 196067 -56870 -25068 -20631 -59836 111670 18316 -58094 284872 192692 -200340 78631
4866 -94885 36458 159842 -193669 -40703 -154648 -42486 111172 118457 213700 -183737 54768
4854 186913 -81770 28963 -120060 225566 101816 31386 157286 468108 -303687 390267
4843 334138 18194 -153793 44161 119221 167171 -117422 39872 420120 65213 246900 196006
4832 196006 -77053 -89630 -305149 -29458 102910 330470 -184883 -201432 61070 62858 149691
4821 149691 -269753 297712 6413 399479 142564 188800 -156861 68354 154094 59843 -156349
4809 -144928 -308474 108225 -296760 -163882 -91536 169583 78530 77996 -271355 92512 90920
4798 90920 -106214 -47223 -85569 96368 252444 70047 113611 244428 35487 -67585 99341
4786 -12006 -457682 -245339 78709 90171 -36010 -365500 273 131906 29715 97709 47627
4774 -75795 -148616 8282 -33922 152244 -50556 -377822 34805 73311 319584 19512 58716
4763 58716 350411 97531 221273 -53203 -32152 66169 -130311 -253073 -3034 272856 31518
4751 101668 156331 -174867 -236203 -18296 26537 -199142 -61810 128515 34605 83930 -242228
4739 36816 220838 242822 122152 147415 47257 -135446 -23275 82235 52118 196221 124022
4728 124022 102079 259030 54280 -171666 115841 191875 216523 -148846 -71338 11512 -141789
4716 -19065 262613 -222073 97149 178938 110460 -58991 167169 230524 -161851 96612 25116
4704 948 134309 169438 69233 -467395 -70885 17354 -101694 6154 -67833 223343 -45302 161540
4691 330014 -124096 -41870 -39914 -30105 -143434 -21375 -133297 -326712 -15091 -148456 304700
4679 -78328 324694 -318102 -147193 -35139 58218 -40605 425857 10155 -348007 -126273 -122491
4668 -122491 -103867 126507 71627 71401 -223154 -97020 -167706 137477 25216 240472 123754
4657 123754 131263 94443 66854 -305339 180537 -74688 -33823 -45205 -204924 -138972 -208564
4646 -208564 -105336 3613 77799 61235 162475 44544 -114713 71925 -340604 4897 -139912
4634 78571 -13282 272926 -110833 271831 -4266 74243 11397 -60283 276047 144776 316138
4623 316138 137218 -17493 -244422 249016 -17416 -146524 227752 -150753 -114830 86456
4612 -159412 246895 -72898 -240518 -266658 185696 71042 -388804 104406 -46554 106517
4601 -103011 218086 31241 -55049 -104003 -250376 -294747 -158331 -222685 -223131 -19401 179591
4589 -165492 -45717 134880 -300595 184142 285038 -198649 -36552 -173142 -225230 100677
4578 81794 146376 -37883 -111427 -106067 -182796 -60117 -18052 -79817 -68911 -93168 -117251 33011
4565 -8635 -73747 61619 141181 21375 159799 291720 91415 96907 -76496 123657 -29075 -376165
4553 -376165 13509 131213 -205377 -10698 97414 139985 -85579 142182 279825 -131060 57517
4541 141800 157829 -278712 196218 357902 -92485 160564 255458 -272571 25557 -337363
4530 67115 -111298 16072 -106073 341583 -176991 -8470 -398338 -202192 278810 292963 94595
4518 -196629 -170990 -176801 132656 158220 74529 144532 131504 -46914 89209 16366 31459 80909
4506 80909 -72925 61095 -34512 178386 164265 96791 -157555 -134061 -40512 163206 290994
4495 290994 102001 64067 36768 -10749 -173767 134400 64687 128988 28809 -12031 -10091
4484 -10091 -451960 138768 -28712 -83644 -54848 72346 -57536 123881 272931 255747 -45724
4472 166828 -14321 230397 130236 -130021 151662 -96733 -28124 99632 44717 97937 -45048
4460 -340207 -98094 -157352 10261 -414631 194745 -342667 102602 299768 23233 -46370 99296
4448 115946 -192378 -31278 -62363 -82533 -453455 168850 -36637 -95836 -115790 -82632 -164799
4437 -164799 211396 42251 126781 -179843 -44320 220507 -70130 -31156 -11375 125143 -36778
4425 -124895 -65786 330544 -228756 -262102 -162527 50406 -126165 -133453 -196331 -25736 185930
$$ [...]
##END NTUPLES=NMR SPECTRUM
##END=
