##TITLE=AC1713_3097_8749698_3jzR5BpbZs
##JCAMPDX= 6.0         $$ Bruker NMR JCAMP-DX V2.0
##DATA TYPE= NMR SPECTRUM
##DATA CLASS= NTUPLES
##ORIGIN= BRUKER
##OWNER= Administrator
$$ 1.72 TOPSPIN		Version 2.1
$$ 2015-08-11 23:31:10.898 -0700  Administrator@X
$$ Compression mode = diff/dup
##.OBSERVE FREQUENCY= 400.02188249412
##.OBSERVE NUCLEUS= ^1H
##.ACQUISITION MODE= SIMULTANEOUS (DQD)
##.ACQUISITION SCHEME= undefined
##.AVERAGES= 8
##.DIGITISER RES= 22
##SPECTROMETER/DATA SYSTEM= spect
##.PULSE SEQUENCE= zg30
##.SOLVENT NAME= COFFEE_meoh
##.SHIFT REFERENCE= INTERNAL, COFFEE_meoh, 1, 14.98509
##AUDIT TRAIL= $$ (NUMBER, WHEN, WHO, WHERE, PROCESS, VERSION, WHAT)
$$ ##TITLE= Audit trail, TOPSPIN		Version 2.1
$$ ##JCAMPDX= 5.01
$$ ##ORIGIN= Bruker BioSpin GmbH
$$ ##OWNER= Administrator
$$ $$ E:\/data/COFFEE/nmr/AC1713_3097_8749698_3jzR5BpbZs/80/pdata/1/auditp.txt
$$ ##AUDIT TRAIL=  $$ (NUMBER, WHEN, WHO, WHERE, PROCESS, VERSION, WHAT)
(   1,<2015-08-11 23:31:03.601 -0700>,<Administrator>,<X>,<go>,<TOPSPIN 2.1>,
      <created by zg
	started at 2015-08-11 23:29:57.648 -0700,
	POWCHK enabled, PULCHK disabled,
       configuration hash MD5:
       21 0F 79 D6 B3 7B B4 F6 88 20 88 DB 03 48 BD 9F
       data hash MD5: 64K
       9F 94 FC 92 20 05 51 2D 63 4E F2 46 46 82 39 DD>)
(   2,<2015-08-11 23:31:06.710 -0700>,<Administrator>,<X>,<proc1d>,<TOPSPIN 2.1>,
      <Start of raw data processing
       efp LB = 0 FT_mod = 6 PKNL = 1 PHC0 = 0 PHC1 = 0 SI = 32K 
       data hash MD5: 32K
       92 EB 5F 0E AF C7 2C 18 A8 F4 2A 22 80 3B 98 10>)
(   3,<2015-08-11 23:31:07.007 -0700>,<Administrator>,<X>,<proc1d>,<TOPSPIN 2.1>,
      <pk PHC0 = 86.53381 PHC1 = 0 
       data hash MD5: 32K
       0C 56 27 CE 17 7C AB 9B 6A B0 A4 BA 1D 01 43 44>)
(   4,<2015-08-11 23:31:07.117 -0700>,<Administrator>,<X>,<proc1d>,<TOPSPIN 2.1>,
      <abs ABSG = 1 
       data hash MD5: 32K
       12 22 56 99 36 76 1A AB 62 1D E2 C1 9F B5 F4 54>)
(   5,<2015-08-11 23:31:07.179 -0700>,<Administrator>,<X>,<proc1d>,<TOPSPIN 2.1>,
      <abs ABSG = 2 
       data hash MD5: 32K
       CB E6 97 98 6D 98 97 59 1F F8 AD AB 33 E9 85 46>)
(   6,<2015-08-11 23:31:07.257 -0700>,<Administrator>,<X>,<proc1d>,<TOPSPIN 2.1>,
      <abs ABSG = 3 
       data hash MD5: 32K
       95 EA 04 C1 6C 7C A4 85 FB DC 23 73 7B 41 19 8B>)
(   7,<2015-08-11 23:31:07.320 -0700>,<Administrator>,<X>,<proc1d>,<TOPSPIN 2.1>,
      <abs ABSG = 4 
       data hash MD5: 32K
       85 DC B6 60 EC 56 E7 F9 47 29 65 F2 D9 51 8B 9E>)
(   8,<2015-08-11 23:31:07.382 -0700>,<Administrator>,<X>,<proc1d>,<TOPSPIN 2.1>,
      <abs ABSG = 5 
       data hash MD5: 32K
       32 97 1E E0 95 1F A5 38 0C 74 24 37 F7 E0 40 4A>)
$$ ##END=
$$ 
$$ $$ hash MD5
$$ $$ BB 23 C2 B9 69 9C 34 D1 6B BA 01 B1 9D DE 8C EE
##$RELAX= 
##$RELAX= 
##$RELAX= 
##$RELAX= 
##$RELAX= 
##$RELAX= 
##$RELAX= 
$$ Bruker specific parameters
$$ --------------------------
##$DU= <E:\>
##$EXPNO= 80
##$NAME= <AC1713_3097_8749698_3jzR5BpbZs>
##$PROCNO= 1
$$ [...]
150 150 150 150 150 150 150 150
##$TP07= 0
##$TPNAME0= <>
##$TPNAME1= <>
##$TPNAME2= <>
##$TPNAME3= <>
##$TPNAME4= <>
##$TPNAME5= <>
##$TPNAME6= <>
##$TPNAME7= <>
##$TPOAL= (0..7)
0.5 0.5 0.5 0.5 0.5 0.5 0.5 0.5
##$TPOFFS= (0..7)
0 0 0 0 0 0 0 0
##$TUNHIN= 0
##$TUNHOUT= 0
##$TUNXOUT= 0
##$USERA1= <user>
##$USERA2= <user>
##$USERA3= <user>
##$USERA4= <user>
##$USERA5= <user>
##$V9= 5
##$VALIST= <valist>
##$VCLIST= <CCCCCCCCCCCCCCC>
##$VD= 0
##$VDLIST= <DDDDDDDDDDDDDDD>
##$VPLIST= <PPPPPPPPPPPPPPP>
##$VTLIST= <TTTTTTTTTTTTTTT>
##$WBST= 2048
##$WBSW= 25
##$XGAIN= (0..3)
0 0 0 0
##$XL= 0
##$YL= 0
##$YMAX_a= 570813
##$YMIN_a= -502911
##$ZGOPTNS= <>
##$ZL1= 120
##$ZL2= 120
##$ZL3= 120
##$ZL4= 120
##$ABSF1= 14.98509
##$ABSF2= -5.573092
##$ABSG= 5
##$ABSL= 3
##$ALPHA= 0
##$AQORDER= 0
##$ASSFAC= 0
##$ASSFACI= 0
##$ASSFACX= 0
##$ASSWID= 0
##$AUNMP= <proc_prof1d_extract_pilot.lims>
##$AXLEFT= 0
##$AXNAME= <>
##$AXNUC= <1H>
##$AXRIGHT= 0
##$AXTYPE= 0
##$AXUNIT= <>
##$AZFE= 0.1
##$AZFW= 0.1
##$BCFW= 0
##$BC_mod= 0
##$BYTORDP= 0
##$COROFFS= 0
##$CY= 15
##$DATMOD= 1
##$DC= 0
##$DFILT= <>
##$DTYPP= 0
##$F1P= 0
##$F2P= 0
##$FCOR= 0.5
##$FTSIZE= 32768
##$FT_mod= 6
##$GAMMA= 0
##$GB= 0
##$INTBC= 1
##$INTSCL= 1
##$ISEN= 128
##$LB= 0
##$LEV0= 0
##$LPBIN= 0
##$MAXI= 10000
##$MC2= 0
##$MEAN= 0
##$ME_mod= 0
##$MI= 0
##$NCOEF= 0
##$NC_proc= -8
##$NLEV= 6
##$NOISF1= 0
##$NOISF2= 0
##$NSP= 0
##$NTH_PI= 0
##$NZP= 0
##$OFFSET= 14.98509
##$PC= 1
##$PHC0= 86.53381
##$PHC1= 0
##$PH_mod= 1
##$PKNL= yes
##$PPARMOD= 0
##$PPDIAG= 0
##$PPIPTYP= 0
##$PPMPNUM= 2147483647
##$PPRESOL= 1
##$PSCAL= 4
##$PSIGN= 0
##$PYNMP= <proc.py>
##$REVERSE= no
##$SF= 400.02
##$SI= 32768
##$SIGF1= 0
##$SIGF2= 0
##$SINO= 400
##$SIOLD= 32768
##$SPECTYP= <>
##$SREGLST= <1H.CDCl3>
##$SSB= 0
##$STSI= 32768
##$STSR= 0
##$SW_p= 8223.68421052631
##$SYMM= 0
##$S_DEV= 0
##$TDeff= 65536
##$TDoff= 0
##$TI= <>
##$TILT= no
##$TM1= 0
##$TM2= 0
##$TOPLEV= 0
##$USERP1= <user>
##$USERP2= <user>
##$USERP3= <user>
##$USERP4= <user>
##$USERP5= <user>
##$WDW= 1
##$XDIM= 32768
##$YMAX_p= 452108981
##$YMIN_p= -668249
##$CURPLOT= <Network HP LaserJet P1505>
##$CURPRIN= <$Network HP LaserJet P1505>
##$DFORMAT= <normdp>
##$LAYOUT= <+/1D_H.xwp>
##$LFORMAT= <normlp>
##$PFORMAT= <normpl>
##$SURQMSG= 1
$$ End of Bruker specific parameters
$$ ---------------------------------
##NTUPLES= NMR SPECTRUM
##VAR_NAME=  FREQUENCY,     SPECTRUM/REAL,   SPECTRUM/IMAG
##SYMBOL=    X,             R,               I
##VAR_TYPE=  INDEPENDENT,   DEPENDENT,       DEPENDENT
##VAR_FORM=  AFFN,          ASDF,            ASDF
##VAR_DIM=   32768,         32768,           32768
##UNITS=     HZ,            ARBITRARY UNITS, ARBITRARY UNITS
##FACTOR=    0.250966925370066, 1,           1
##FIRST=     8223.43324360094, -68136,       -72330
##LAST=      0,             -17738,          -25927
##MIN=       0,             -668249,         0
##MAX=       8223.43324360094, 452108981,    0
$$ Real data points
##PAGE= N=1
##DATA TABLE= (X++(R..R)), XYDATA
$$ [...]
$$ plain form
19552 -41853 9322 19551 -171132 14134 -21427 -75489 -52820 -48220 305859 86668 -13597 35533
19539 -133697 -180033 -253318 -117112 -59918 -149417 254817 -118941 -60921 20198 72444 -1263
19527 11297 75063 -191978 -44310 -353620 -131783 258145 65582 -314249 -33535 11229 -238639
19515 98767 -86365 -253185 135774 162594 -244571 3629 -225910 -88218 -343501 49446 -16854
19503 -61808 83384 97124 35339 -114686 185 -83440 -142880 224922 81817 -180879 -26009
19491 220512 11431 -307885 -1181 -139671 -129075 -2752 -180048 18807 -135457 -372886 -139971
19479 104295 121123 38016 -115782 -408992 25545 92210 -437040 -217694 -321529 -69652
19468 14166 -98018 -266811 -299684 -240165 97242 -265459 -154069 255109 39407 -83540 -135503
$$ packed form
19552d1853I322J0229a71132A4134b1427n4062K2669M600C05859H6668a3597C5533
19539a33697m6336p3285a17112N7194q9499B54817a18941N8020B0198N2246a263
19527A1297O3766a91978d4310l09310a31783B58145F5582c14249c3535A1229b38639
19515I8767h6365j66820A35774K6820b44571C629b25910h8218k55283D9446a6854
19503f1808H3384J3740C5339a14686A85h3440n9440B24922H1817a80879b6009
19491B20512A1431c07885a181j38490J0596b752j77296A8807a35457k37429a39971
19479A04295J6828C8016a15782k93210B5545O6665d37040b17694j03835f9652
19468A4166i8018j68793l2873N9519I7242b65459J11390B55109C9407h3540n1963
$$ plain form
19457 -135503 -147654 -364924 56172 119346 35989 11014 192680 -14549 -40720 -278280 -198990
19446 -198990 -154606 150696 -108208 23175 6803 -228850 -446488 -249507 -150290 -234158 142580
19434 8011 8945 3458 41096 -3142 -85998 60588 -86359 -118682 387410 -223135 18248 -124815
19421 -372855 -87090 -186162 8255 97997 -231906 -222937 -218253 -87907 77724 47059 -201024 -130471
19409 -130471 74490 151955 -36786 176410 -9220 145111 26858 -115060 -52619 -218201 -67658
19397 -257220 -231842 1811 -41711 -53314 71516 -228430 -196764 -288647 -98986 140680 -80645
19385 -405999 -146403 205030 -158697 -110362 -62450 -70807 -57351 150461 -206454 -166148 -251957
19374 -251957 -149968 -166706 59505 144269 -305968 -128310 64217 76644 67720 -86332 -177725
$$ packed form
19457a35503j2151k17270E6172O3174C5989A1014J81666a4549k6171k37560P9290
19446a98990M4384A50696a08208B3175F803b28850k17638J96981R9217q3868A42580
19434H011R34C458L7638c142q2856F0588h6359l2323C87410b23135A8248a24815
19421c72855h7090r9072H255Q9742b31906Q969M684h7907G7724l0665b01024P0553
19409a30471G4490P7465c6786A76410i220A45111B6858a15060e2619j65582f7658
19397b57220K5378A811d1711j1603G1516b28430L1666r1883i8986A40680h0645
19385d05999a46403B05030a58697M8335M7912q357J3456A50461b06454M0306q5809
19374b51957J01989j6738E9505Q4764c05968a28310F4217J2427q924h6332r1393
$$ plain form
19363 -177725 -191188 27128 -28478 -245906 -195194 -88568 -336709 -24789 103581 119024 -102527
19351 -151181 -286156 -143776 -285809 -122061 -88261 222434 212438 -133136 50691 -37139
19340 77368 170203 24733 7657 121330 27912 196076 -85371 30549 -80917 126684 -289485
19328 -247292 -48847 -135682 -158043 42404 17325 -17525 276649 -394411 -349870 -243292 -14421
19316 -183397 94090 -155316 97813 234796 -109706 -219490 53063 -70140 98421 -237469
19305 24869 273416 -92809 -213476 89022 24235 3238 -455087 -62411 -101520 -63753 -227907
19294 -227907 -44770 -36685 -160547 -14165 -44293 -73426 2299 -37563 -130831 -200568 -152857 -101315
19282 -101315 -183305 101450 142582 -84362 -389371 -140849 -198947 12439 -73102 -122891 -140593
$$ packed form
19363a77725j3463B7128b8478k17428N0712h8568k48141b4789A03581J5443a02527
19351a51181j34975J42380j42033a22061L3800B22434r996a33136E0691c7139
19340G7368R2835B4733G657J13673B7912J68164h5371C0549h0917A26684b89485
19328b47292d8847q6835k2361D2404A7325a7525B76649c94411M4541J06578a4421
19316a83397I4090a55316I7813J36983a09706j09784E3063g0140I8421b37469
19305B4869K48547i2809j20667H9022B4235C238d55087f2411l9109L7767j64154
19294b27907d4770Q085j23862a4165l0128k9133B299c7563r3268o9737M7711N1542
19282a01315q1990A01450M1132h4362l05009a40849n8098A2439g3102m9789j7702
$$ plain form
19271 -140593 20071 6808 -209111 -71436 -178744 201124 130862 -141262 395500 -161618
19260 -154980 23494 -120773 -151158 -107210 -75754 -113274 189799 332424 -229155 -100957
19249 -22946 87587 61458 -92350 321404 -84035 31115 -40460 -160515 146388 98732 -264120
19237 -375808 -341897 -41263 -452316 194522 -113426 252205 -6505 -225900 205011 -166573
19226 -317505 355511 -32634 116727 92399 -24173 148316 -27662 -122815 103948 -223528
19215 -53368 -169533 -477745 124020 -17322 -109676 -317903 -170420 -230982 -60253 -88325 123100
19203 -75583 -214180 54526 -234756 130898 -101751 -178531 -160634 38192 -149130 9076 20296
19192 20296 -94767 -35275 87019 -13701 -6766 260522 52643 29839 -95929 -83119 10640 -186050
$$ packed form
19271a40593B0071F808b09111g1436j07308B01124p0262a41262C95500a61618
19260a54980B3494a20773l0385M3948L1456l7520A89799J42625b29155a00957
19249b2946H7587k6129i2350C21404h4035C1115d0460j20055A46388m7656b64120
19237c75808L3911d1263m11053A94522a13426B52205f505k19395B05011a66573
19226c17505C55511c2634A16727k4328b4173A48316b7662r5153A03948b23528
19215e3368j16165l08212A24020a7322r2354k08227J47483o0562f0253k8072A23100
19203g5583j38597E4526b34756A30898a01751p6780J7897C8192a49130I076J1220
19192B0296i4767c5275H7019a3701f766B60522E2643k2804i5929J2810A0640a86050
$$ plain form
19179 194564 6226 -185216 65086 -78270 22883 63574 89374 -437924 -289570 186083 -280980
19167 84164 -14839 -164037 -24753 -54381 -51073 24713 35095 35100 -203619 -39290 -35506 -70838
19155 -70838 -173797 -78706 100678 -15149 -121179 38705 207667 29432 108792 33456 -32698
19143 -215651 258480 -105348 -216562 -26005 -136526 -132830 232635 -97740 -224114 92411
19132 -15466 -90283 -313717 -180318 -184946 -132179 78129 -7355 -113484 -172653 37010 29350 -43043
19119 -279785 2938 -618540 -90700 -144639 -225621 161398 -278898 -187103 -80784 -105850 -132698
19108 -132698 -395339 164100 -117462 289036 -252682 96145 100863 -162042 -297139 85400
19097 -34041 -95962 -876 -27293 30661 -168890 -168538 143982 66857 -42266 -198177 -107763 -364106
$$ packed form
19179A94564F226a85216F5086g8270B2883M0691K5800d37924J48354A86083b80980
19167H4164a4839j49198b4753k9628L308B4713J0382Nb03619c9290L784l5332
19155g0838j02959g8706A00678a5149j06030C8705J68962B9432P9360C3456c2698
19143b15651B58480a05348j11214b6005j10521L696B32635i7740j26374I2411
19132a5466p4817k23434J33399m628N2767G8129g355j06129n9169C7010p660d3043
19119b79785B938f18540i0700n3939q0982A61398b78898R1795h0784k5066k6848
19108a32698k62641A64100a17462B89036b52682I6145M718a62042j35097H5400
19097c4041o1921h76k6417C0661a68890L52A43982F6857d2266j55911R0414k56343
$$ plain form
19085 -364106 -258697 -87387 -377818 224461 -4569 -230931 -324632 -163670 -126867 -70417 -78672
19074 -78672 -176617 -360474 -61755 -19400 -60497 -104234 -74346 -313110 -33264 74189 183463
19063 183463 -289562 -33080 307881 72079 139591 -268134 167269 -139676 -55823 -135880
19053 -135880 71305 -421861 -36249 31862 -40900 -118673 222188 107628 -120674 -35265 -363162
19042 -363162 20256 -152188 -92556 -382578 -8716 226107 -127717 -71090 -296270 70462 -167552
19030 -53400 165930 244257 147029 -68747 14236 107027 -49836 -31560 104467 16215 80408
19019 80408 404703 -36315 153838 -125139 -361597 -214185 186889 -243047 -66366 -233078
19009 -233078 -154147 -283698 -91581 -309533 116693 -237604 -223935 -471685 -43685 -246442
$$ packed form
19085c64106J05409h7387k90431B24461d569k26362r3701J60962L6803N6450q255
19074g8672r7945j83857f1755a9400m1097m3737K9888k38764c3264G4189J09274
19063A83463b89562c3080C07881G2079O7512b68134A67269a39676e5823q0057
19053a35880G1305d21861c6249C1862d0900p7773B22188A07628a20674c5265l27897
19042c63162B0256a52188N9632k90022h716B26107a27717N6627k25180G0462a67552
19030e3400A65930P8327r7228f8747A4236R2791d9836J8276A04467A6215O4193
19019H0408L24295c6315A53838a25139k36458J47412A86889b43047f6366j66712
19009b33078P8931j29551i1581k17952A16693b37604J3669k47750d3685k02757
$$ plain form
18999 -246442 -215562 -274584 194291 -180782 33100 -56170 -245220 -276047 74750 146658 7336
18987 -116751 90189 79624 143162 -92516 201619 -93039 -59325 -254628 79706 132941 -176144
18975 -109615 -147783 -154753 54568 166272 -218250 69300 -131226 240595 51936 -223210 183011
18963 -251702 -117779 442550 -84986 -385026 81816 -210598 -226799 -260164 168836 101058
18953 101058 99529 25930 53716 4899 -86039 -423892 -243907 -12998 -159058 -175998 -81132
18941 198083 18409 45531 106971 77950 -278270 272195 -335106 -255582 -102789 -214026
18931 -214026 45505 88739 433890 125071 -113146 119601 -197209 -253662 122057 -328361
18920 -212358 83623 -80457 30952 159752 -165002 163141 -196185 -19340 -135912 45551
$$ packed form
18999b46442L0880n9022A94291a80782C3100e6170j89050l0827G4750P1908G336
18987a16751I0189j0565O3538i2516B01619i3039L3714j95303G9706N3235a76144
18975a09615l8168o970E4568J11704b18250F9300a31226B40595E1936b23210A83011
18963b51702a17779D42550h4986l00040H1816b10598j6201l3365A68836o7778
18953A01058j529B5930K7786D899h6039l37853J79985a2998j46060j6940h1132
18941A98083A8409K7122O1440k9021b78270B72195c35106P9524a02789j11237
18931b14026D5505M3234L45151A25071a13146A19601a97209n6453A22057c28361
18920b12358H3623h0457C0952J28800a65002A63141a96185a9340j16572D5551
$$ plain form
18909 -203237 -288454 24120 -170959 -123185 145873 -200686 55487 -171026 -184866 17412 -332224
18897 -66493 -253765 4654 122466 -33913 -34844 47888 398417 -268687 156820 -180683 -239217
18886 -239217 -21265 -181984 -21247 -227199 -82469 -374364 -329679 41560 17411 89200 -142953
18874 510878 -186053 94667 128492 -318498 -132812 -136084 -448495 -74304 -37318 85859 -1472
18862 238653 -218466 -4373 42801 238210 -101606 -24581 -356823 -276643 -94587 42671 -87666
18850 200511 -67251 -122925 -50352 -110790 -47598 243729 121775 -470768 -351640 102598
18839 -135571 -168193 41844 -118269 16552 -91827 -376384 320443 38599 -14711 -41034 -195318
18828 -195318 -245033 135422 -20368 -358230 -62292 -86399 138433 201591 60800 172840 102232
$$ packed form
18909b03237q5217B4120a70959M7774A45873b00686E5487a71026j3840A7412c32224
18897f6493j87272D654J17812c3913r31D7888L50529b68687A56820a80683n8534
18886b39217b1265j60719b1247k05952h2469k91895M4685D1560A7411P1789a42953
18874E10878a86053I4667L3825c18498a32812l272l12411g4304L6986H5859a472
18862B38653b18466d373D2801J95409a01606b4581l32242Q0180i4587D2671h7666
18850B00511f7251n5674e0352o0438d7598B43729A21775d70768J19128A02598
18839a35571l2622D1844a18269A6552i1827k84557C20443C8599a4711k6323j54284
18828a95318m9715A35422b0368l37862f2292k4107A38433O3158F0800J12040p0608
$$ plain form
18817 102232 133437 -156822 -48873 3824 -283226 -144169 154679 200884 335506 37021 -243272
18805 -194331 -25303 210871 107032 231526 3512 -233061 51018 301198 -121076 -496592
18795 -496592 35305 130305 -220757 -230307 -4971 -68017 -16025 186401 -293763 108541 221773
18784 221773 -190034 41379 179292 97685 -183092 -94605 -187950 106765 86366 141640 -146194
18772 -237304 -1555 -222130 -50316 16201 99654 39276 -258439 -56534 -54487 -118195 -146667
18761 -146667 -559957 -315713 -455662 -10693 -27955 -10049 -46817 53441 -280553 69007 -109094
18749 -142122 169107 183409 -29150 104202 -528 -329403 -65428 -34047 -237509 -88525 -4104
18737 -141558 -148851 250082 -42919 140208 -213345 -77832 178225 -145076 -67208 -38022 87475
$$ packed form
18817A02232L1205a56822d8873C824b83226J39057A54679M6205J34622C7021b43272
18805a94331b5303B10871j03839J24494C512b33061E1018K50180a21076l75516
18795d96592C5305R5000b20757r550d971o3046a6025A86401b93763A08541J13232
18784B21773a90034D1379J37913q1607a83092Q8487r3345A06765k0399N5274a46194
18772b37304a555k20575e0316A6201Q3453C9276b58439e6534K047o3708k8472
18761a46667m13290K44244j39949a0693j7262a0049l6768E3441b80553F9007a09094
18749a42122A69107J4302b9150A04202e28l28875f5428L1381k03462h8525d104
18737a41558p293B50082d2919A40208b13345g7832A78225a45076f7208K9186H7475
$$ plain form
18725 -237876 315968 -244025 20134 -18442 -11760 78875 -65008 -59615 2335 45554 -343533
18713 -77808 322382 -149182 -255665 112183 -25943 -20751 -158377 -142670 -163303 -67080 839
18701 118258 -290335 86020 143456 -171843 -297755 -98068 77929 -97330 -57945 -167144 8107
18689 -199922 -20189 -70513 419361 135746 -247377 136181 -21973 -192287 -140745 31463
18678 -57476 -146791 -103414 39242 -96215 -248730 -102508 13970 9485 -221838 -24482 281154
18666 -131199 -311486 11786 59258 -186030 126358 -51733 -197232 26004 -8813 155638 91817
18655 91817 9681 30302 59754 -104621 -166239 -156588 -419245 -182794 160437 -228772 -26770
18643 -110234 -228459 145804 93977 140011 -185302 -234871 -269044 77047 5595 -225094 -109491
$$ packed form
18725b37876C15968b44025B0134a8442O682G8875f5008N393B335M3219c43533
18713g7808C22382a49182j06483A12183b5943N192j37626J5707k0633f7080H39
18701A18258b90335H6020N7436a71843j25912i8068G7929i7330L9385j09199H107
18689a99922b0189n0324D19361A35746b47377A36181b1973j70314N1542C1463
18678e7476q9315M3377C9242i6215j52515a02508A3970m485b21838b4482B81154
18666a31199j80287A1786M7472a86030A26358e1733j45499B6004h813A55638o3821
18655I1817I681K0621K9452a04621o1618R651k62657a82794A60437b28772b6770
18643a10234j18225A45804n1827M6034a85302m9569l4173G7047E595b25094a09491
$$ plain form
18631 -179062 67147 -375711 -224725 -58385 -140528 -21425 -139123 -120006 -25034 -53777 116172
18619 3041 -209515 117974 90067 -157293 -62834 -309598 -71312 128234 -148104 -246041 -123728
18608 -123728 -2267 139012 -131671 85112 -225677 141549 -184438 -313274 7956 69715 -123146
18596 82585 -101746 -215369 73830 -8753 -159695 -79207 -97902 -54914 -275804 -30102 -240990
18585 -240990 227051 41406 -19870 -244089 33209 -12117 -92595 95287 -210350 197031 63289
18573 -80087 197158 -142686 -173229 -166762 -539230 207374 -483627 248699 261618 -33168 -106902
18562 -106902 62855 -121133 -96658 2092 -152156 -367195 73854 -100274 -177553 -327879 45396
18550 -127051 354539 -110888 -73841 -77280 -88273 -43443 218259 -67671 10000 20703 -187007
$$ packed form
18631a79062F7147c75711J50986e8385q2143b1425j17698J9117b5034k8743A16172
18619C041b09515A17974k7907a57293f2834k46764g1312A28234a48104r7937J22313
18608a23728b267A39012a31671H5112b25677A41549a84438j28836G956O1759a23146
18596H2585a01746j13623G3830h753j50942g9207j8695M2988k20890c0102k10888
18585b40990B27051D1406a9870k24219C3209a2117q0478I5287b10350A97031F3289
18573h0087A97158a42686l0543O467l72468B07374d83627B48699J2919c3168p3734
18562a06902F2855a21133K4475B092a52156k15039G3854a00274p7279j50326D5396
18550a27051C54539a10888L7047l439j0993d3443B18259f7671A0000J0703a87007
$$ plain form
18538 145890 24687 12081 53366 -295545 251082 -121892 -52728 113882 -213085 -315487
18528 -315487 -1014 -303987 187047 171387 72508 16812 -5726 -342229 130033 -5687 216540
18516 -233315 -203944 -48856 -173913 22025 176932 308514 -38016 113593 -29493 231979
18505 -84336 -138632 -251761 -22617 -30707 168502 -156234 -489141 272266 -67882 -90971 -234605
18494 -234605 33465 -465850 -225796 359246 -103245 -264782 -108210 48268 135462 205717
18484 205717 158742 -168739 108711 -83484 -55640 -141243 -145108 -202024 58204 97298 64164
18473 64164 -74845 -211617 141382 -120699 -205055 -481224 -35064 41241 149663 -71001 -51528
18462 -51528 170387 -51809 -230050 191885 -1069 144392 108384 -514078 -38210 234491 -284855
$$ packed form
18538A45890B4687A2081M1285b95545B51082a21892e2728A13882b13085j02402
18528c15487a014l02973A87047j5660G2508A6812e726l36503A30033e687B16540
18516b33315K9371d8856j25057B2025J54907J31582c8016A13593b9493B31979
18505h4336n4296j13129b2617q090A68502a56234l32907B72266f7882k3089j43634
18494b34605C3465d65850b25796C59246a03245j61537a08210D8268Q7194P0255
18484B05717m6975a68739A08711h3484K7844q5603l865n6916E8204L9094l3134
18473F4164g4845j36772A41382a20699q4356k76169c5064D1241J08422g1001J9473
18462e1528A70387e1809j78241A91885a069A44392l6008e14078c8210B34491b84855
$$ plain form
18450 -168535 334373 -188647 249237 279596 106013 -127587 -19623 -57440 90189 -153100
18439 -36942 -254723 167933 -151534 -31848 -206881 -320900 -5627 -99415 -27843 -280235 -301944
18428 -301944 196450 -211524 -90031 -33502 -182874 140186 74632 -209 -267007 -98022 -155181
18417 -155181 -492964 2525 83485 132005 -237719 338619 -20487 -134879 41049 -158029 -237757
18406 -237757 87188 -15354 286879 25828 -71216 -29226 -441238 131319 -45591 -96066 -83853
18395 -83853 -26691 209379 161861 31355 297460 -3027 117565 94096 55511 117716 -124760
18383 180799 233619 87525 -337166 187356 -322321 -123888 -254755 155630 128587 126478
18373 126478 -205888 216308 -22921 -12833 144059 -183972 -85041 -262129 -102821 172630
$$ packed form
18450a68535C34373a88647B49237L0359A06013a27587a9623l7817I0189a53100
18439c6942k17781A67933a51534c1848j75033j14019e627r3788b7843k52392k1709
18428c01944A96450b11524i0031c3502j49372A40186o5554b09k66798i8022n7159
18417a55181l37783B525Q0960M8520b37719C38619b0487j14392D1049a58029p9728
18406b37757H7188a5354B86879B5828g1216b9226m12012A31319d5591n0475J2213
18395h3853b6691B09379m7518C1355K66105c027A17565k3469l8585O2205a24760
18383A80799N2820H7525c37166A87356c22321a23888j30867A55630k7043k109
18373A26478b05888B16308b2921J0088A44059a83972h5041j77088a02821A72630
$$ plain form
18362 199068 -314418 -137731 -377667 -54059 86965 49930 187847 -222437 114756 289119
18352 289119 120621 -86942 151911 47034 -133856 -97945 151680 98631 146212 121027 -285802
18340 -37451 9330 132158 -125607 -85198 -146294 -341907 287312 -16797 -27800 -265872 -98986
18328 28863 72341 62393 -125983 84973 -132698 -129156 -17187 -17585 -58479 102341 -383602 -150021
18315 -400946 -22396 49657 111877 202407 65729 4836 -107659 6799 -103904 -108813 -186181 187516
18302 136482 12933 -77787 -108103 335458 -45521 -184620 -195334 140226 142668 -148112 4804
18290 159564 -146276 30157 -136192 -262447 -351273 -302658 -98422 -28207 -49933 -50874 -38678
18279 -38678 92967 -153831 -50003 -233697 45895 -301082 -250708 87731 -32120 -31938 692 334973
$$ packed form
18362A99068c14418a37731k39936e4059H6965l7035J37917b22437A14756J74363
18352B89119A20621h6942A51911D7034a33856L5911A51680n3049M7581k5185b85802
18340c7451I330J22828a25607M0409o1096j95613B87312a6797j1003k38072i8986
18328B8863M3478r948a25983H4973a32698L542a7187l98m0894A02341c83602a50021
18315d00946b2396D9657O2220R0530F5729D836a07659F799a03904m909p7368A87516
18302A36482A2933g7787l0316C35458d5521j39099j0714A40226K442a48112D804
18290A59564a46276C0157a36192j26255q8826M8615i8422b8207k1726r41J2196
18279c8678I2967a53831e0003j83694D5895c01082N0374H7731c2120J82F92L34281
$$ plain form
18267 334973 -26871 -210301 -202304 -8863 -117729 18445 178861 88945 -147192 -190395 131378
18255 166040 -168669 5815 -15144 63223 -40291 -143482 -268232 -128448 -138044 228445 94442
18243 102622 -143647 47442 -34973 277271 -28953 -140602 105295 247 45149 -12048 -125771
18232 -125771 29743 -169412 -127890 -23397 -182082 45108 -236447 -165925 -13134 124928 159538
18221 159538 -207465 244194 -339906 48419 -147567 -106309 93323 -71076 -11362 -299900
18211 -299900 -284114 366616 -290318 20939 -99011 -140433 162807 -173929 -360351 -43663
18200 -35215 194716 299341 -169558 -79511 -150334 -184583 183290 -106358 138542 -255730
18189 -12215 37596 199932 19921 76381 64110 -167087 87603 -260918 -200380 -20086 -7165
$$ packed form
18267C34973b6871j83430P997h863j08866A8445J60416H8945a47192m3203A31378
18255A66040a68669E815a5144F3223d0291j03191j24750a28448r596B28445I4442
18243A02622a43647D7442c4973B77271b8953j11649A05295B47M4902a2048j13723
18232a25771B9743a69412M1522b3397j58685D5108b36447P0522a3134A24928L4610
18221A59538b07465B44194c39906D8419a47567M1258I3323g1076a1362k88538
18211b99900J5786C66616b90318B0939i9011m1422A62807a73929j86422d3663
18200c5215A94716J04625a69558g9511p0823l4249A83290a06358A38542b55730
18189a2215C7596J62336A9921N6460j2271a67087H7603b60918O0538b0086g165
$$ plain form
18177 139016 -197986 -166979 -216142 -127215 -189869 152184 -102216 -100214 238318 -324724 246338
18165 -59979 38054 -83437 -218291 -169572 73808 153414 -33249 -299212 -108415 -268507 -129384
18153 -52469 -136342 -139555 158528 -97695 315218 104614 150318 -179973 -252601 -15627 -252955
18142 -252955 -108727 28238 -9462 -158265 -89838 -39502 -85012 -168273 45496 177230 151015
18131 151015 3974 -116683 -104643 16965 92281 217774 -66488 -315207 19130 135748 -216757
18119 618 165238 18072 -68537 -6899 -347929 -89160 -136952 92657 -118650 96646 -242156
18107 109024 -161942 -221226 47139 -73770 47109 -149994 85684 -338898 56523 -3484 133142
18095 66236 -62364 -37690 -174843 -299350 -241224 10521 112742 -61232 373066 -162808 -111491
$$ packed form
18177A39016a97986L1007m9163Q8927o2654A52184a02216K002B38318c24724B46338
18165e9979C8054h3437j34854M8719G3808P9606c3249k65963a08415j60092a29384
18153e2469q3873l213A58528i7695C15218A04614M5704a79973p2628a5627k37328
18142b52955a08727B8238i462j48803O8427c9502m5510q3261D5496J31734k6215
18131A51015C974a16683J2040A6965P5316J25493f6488k48719A9130J16618b16757
18119F18J64620A8072f8537f899l41030h9160m7792I2657a18650I6646b42156
18107A09024a61942n9284D7139g3770D7109a49994H5684c38898E6523c484A33142
18095F6236f2364K4674j37153j24507N8126A0521J02221f1232C73066a62808N1317
$$ plain form
18084 -111491 140648 -414263 124791 -113997 198247 -365767 95886 230855 49196 135432
18074 135432 113413 -153365 -32425 -94062 219762 -198194 -59625 196091 113707 -88083 -162350
18063 -162350 84715 175269 -29003 -75873 -159735 370140 -124068 -68583 -226844 -121569 -94708
18052 -94708 165374 -102425 -122637 216208 287300 -98850 195398 124019 -325514 -322652 -13922
18040 20830 46918 28373 152087 26994 -51670 -334974 -41257 -158594 138213 113973 -134253
18028 36925 -18600 184048 23156 89804 156804 300900 9887 189964 -140646 -30605 -340492
18017 -340492 -287841 -292983 -335566 -297592 -26396 58924 -4561 -232367 175212 -127097 11767
18005 114317 127635 119158 -291989 -5991 54894 -18991 202870 -101299 -314932 -198346 189814
$$ packed form
18084a11491A40648d14263A24791a13997A98247c65767I5886J34969D9196Q6236
18074A35432k2019a53365c2425o1637B19762a98194e9625A96091q2384h8083p4267
18063a62350H4715R0554b9003m6870q3862C70140a24068N5485j58261J05275K6861
18052i4708A65374a02425k0212B16208P1092i8850A95398p1379c25514K862a3922
18040B0830K6088j8545J23714B6994e1670k83304d1257j17337A38213k4240a34253
18028C6925a8600A84048B3156O6648O7000J44096I887J80077a40646c0605l09887
18017c40492N2651n142m2583L7974b6396E8924d561k27806A75212a27097A1767
18005A14317J3318q477b91989e991E4894a8991B02870a01299k13633J16586A89814
$$ plain form
17993 -71760 244753 -170171 192080 115729 -502117 -427194 201155 -109618 -193488 -15199
17982 88785 301501 -108210 381519 57993 224619 151826 -387268 -98770 -165294 -407521
17972 -407521 296045 43544 31812 319582 -199785 -231477 191352 -217703 130540 -176524
17961 -421223 10974 44887 -28495 161028 -49890 -211709 -336076 -46922 -272036 99662 -65568
17949 295436 -239714 -224161 106621 50709 -352080 51291 -51995 79486 -177903 -71747 76826
17937 136557 -184117 -143540 81421 -86358 77930 122208 150185 -124012 14860 -218038 -232348
17926 -232348 15642 -65365 37057 -114433 -160727 199162 15901 -170881 179995 20169 -51669
17914 96981 3005 -245156 85406 -698 -196340 -71074 110530 -136289 8210 -151176 -87414
$$ packed form
17993g1760B44753a70171A92080p6351e02117P4923B01155a09618q3870a5199
17982H8785K12716a08210C81519E7993J66626p2793c87268i8770o6524k42227
17972d07521B96045D3544j1732K87770a99785l1692A91352b17703A30540a76524
17961d21223A0974L3913b8495A61028d9890j61819j24367d6922k25114I9662f5568
17949B95436b39714J5553A06621E0709c52080E1291e1995G9486a77903g1747G6826
17937A36557a84117M0577H1421h6358G7930M4278K7977a24012A4860b18038j4310
17926b32348A5642f5365C7057a14433m6294A99162A5901a70881A79995B0169e1669
17914I6981C005b45156H5406f98j95642g1074A10530a36289H210a51176O3762
$$ plain form
17903 -87414 -190641 -17975 -67102 -133435 -54690 10848 247840 205359 -67672 -132627 -91302
17892 -91302 -20345 -176160 -235982 -104933 -175797 117131 3585 -148194 -170649 -95419 6365
17880 438112 -153649 292230 106697 22182 87094 -70311 213555 304549 55194 -107126
17869 226488 368549 -413 267163 283332 -192723 239446 -306812 -153304 308038 121666
17858 -25887 52760 398689 -69347 237319 286953 60024 -91349 75684 186028 113100 32966
17846 -448989 -15277 -33726 6851 10858 -166615 76669 212522 -273567 -71434 -41725 -128614
17835 -128614 -302582 -28878 -20850 70987 -46302 -201352 -49184 14284 -21690 198767 186380
17824 186380 -65789 137180 -162100 161216 13465 -140935 405162 -336625 -100227 -176520
$$ packed form
17903h7414j03227a7975m9127o6333e4690A0848K36992m2481f7672o4955M1325
17892i1302b0345j55815n9822a04933p0864A17131C585a48194k2455P5230F365
17880D38112a53649B92230A06697B2182O4912g0311B13555R0994E5194a07126
17869B26488J42061d13B67163J6169a92723B39446c06812a53304C08038A21666
17858b5887E2760L45929f9347B37319M9634F0024i1349G5684J10344p2928C2966
17846d48989a5277j8449F851M007a66615G6669J35853b73567g1434K9709q6889
17835a28614j73968b8878Q028G0987d6302j55050d9184A4284b1690A98767j2387
17824A86380f5789A37180a62100A61216A3465a40935D05162c36625a00227p6293
$$ plain form
17814 -176520 120617 31908 -34116 55361 67751 20724 263905 -207870 7533 -88784 -26729
17802 -53943 -121774 415278 81115 -315459 115454 56785 -144616 -20919 -168741 113402
17791 -20904 -142871 106511 -126024 -43459 -82369 155104 276690 -131712 99787 -128881
17780 76502 295271 -179832 24918 169094 56819 158454 -150671 -92147 197198 -281777
17769 104069 14051 80995 114709 438522 157947 -105638 -323341 -196373 92009 -514218
17758 -31 135439 -30359 -13395 188073 -77563 236919 -138553 -601 34748 244115 -19337 397805
17745 80476 -11982 -30211 -194835 -66148 -157357 101242 -114134 160010 -27665 -50346 64279
17733 -249117 -35895 176728 109206 312103 314965 -96675 -234874 93473 50506 -172148 -134110
$$ packed form
17814a76520A20617C1908c4116E5361J2390B0724K43181b07870G533h8784b6729
17802e3943o7831D15278H1115c15459A15454E6785a44616b0919j47822A13402
17791b0904j21967A06511a26024d3459l8910A55104J21586a31712I9787a28881
17780G6502K18769a79832B4918J44176E6819J01635a50671N8524A97198b81777
17769A04069A4051O6944L3714L23813A57947a05638k17703J26968I2009e14218
17758c1A35439c0359a3395A88073g7563B36919a38553f01C4748K09367a9337C97805
17745H0476a1982j8229j64624f6148r1209A01242a14134A60010b7665k2681F4279
17733b49117c5895A76728o7522K02897K862i6675j38199I3473m2967a72148L8038
$$ plain form
17722 -134110 -9198 259144 423735 220801 -134421 232589 -216661 147276 -342125 -162260
17711 298986 200641 -380670 -72525 247267 -207279 -120233 245577 328715 -443079 150222
17700 270300 -33981 124033 179828 35910 -120924 29862 199515 -52119 -128636 93565 -316251
17688 181249 186473 111529 -39582 161861 -151833 -393615 -14950 -52199 -352304 179462 62167
17676 248660 3005 184974 -219454 131257 -71070 114438 25821 -68376 -125371 -72621 -25707
17664 359315 -168149 139098 111701 177268 -23875 106171 -115741 -73698 -68347 -117720 -336613
17653 -336613 293657 8848 -64349 -66029 132707 69627 -291399 160150 235235 231714 -150552
17641 88922 20763 59871 -108081 178247 119019 -50094 16056 179641 102146 10764 -103066
$$ packed form
17722a34110i198B59144J64591k02934a34421B32589b16661A47276c42125a62260
17711B98986r8345c80670g2525B47267b07279Q7046B45577Q3138d43079A50222
17700B70300c3981A24033N5795C5910a20924B9862J69653e2119p6517I3565c16251
17688A81249N224p4944c9582A61861a51833k41782a4950l7249l00105A79462F2167
17676B48660C005J81969b19454A31257g1070A14438B5821f8376n6995N2750b5707
17664C59315a68149A39098k7397O5567b3875A06171a15741M2043N351m9373k18893
17653c36613B93657H848f4349j680A32707o3080b91399A60150P5085l521a50552
17641H8922B0763L9108a08081A78247n9228e0094A6056J63585p7495A0764a03066
$$ plain form
17629 37166 34179 103227 -5220 -227239 -184414 267809 37209 439495 -43707 51770 -16871
17617 -121249 63880 106303 30434 -32696 -193004 -14448 -39334 320752 40158 -198712 294848
17605 15206 78086 -29418 236588 -5939 181899 -128089 -128512 172087 174680 -10396 7890 57304
17593 57304 287692 12763 280457 -155433 -91065 159670 342897 49579 32402 67333 10628
17581 136107 2130 122124 -47098 -14779 129425 231042 79114 -270326 61572 -52798 -32250
17570 -32250 -1528 -310055 -321744 -1640 -35636 137894 -43909 -233429 -75833 404435 58126
17558 68176 88807 45586 -93165 106463 -269658 -117864 -288599 249404 68031 140407 -144866
17546 -199531 96897 -40286 -87680 174410 -25842 59259 -278127 202436 -269245 -297611 -146734
$$ packed form
17629C7166k987O9048e220k22019M2825B67809C7209M02286d3707E1770a6871
17617a21249F3880M2423C0434c2696j60308a4448k4886C20752D0158a98712B94848
17605A5206O2880b9418B36588e939A81899a28089m23A72087K593a0396G890M9414
17593E7304K30388A2763K67694a55433O4368A59670J83227D9579j7177L4931A0628
17581A36107B130J19994d7098a4779A29425J01617G9114b70326F1572e2798K0548
17570c2250a528l08527j1689a640l3996A37894d3909j89520g5833D04435E8126
17558F8176K0631m3221i3165A06463b69658a17864j70735B49404F8031P2376a44866
17546a99531I6897d0286m7394A74410b5842E9259b78127B02436b69245k8366a46734
$$ plain form
17534 92090 -126664 233665 -210933 118464 -86077 15653 -12664 -74663 415066 77096 42464
17523 42464 -183124 95152 177548 -48410 -171649 100357 232072 31864 -21787 -6087 288637
17511 156020 516335 425357 19579 -46929 -8117 -61062 350351 -231211 83361 156603 26120
17499 -55667 171776 159777 337673 -83111 118316 38086 235545 -30978 147186 -140337
17488 239800 111859 252432 -31052 165003 31141 208301 73105 -18036 219696 141901
17478 141901 170449 94013 99427 -111812 116108 296124 -198596 155505 124126 -11232 351322
17466 222276 253408 -28071 195766 -236938 154134 34660 23829 -178525 382876 -79179
17455 104769 192061 251803 113077 68390 449198 137259 485752 226720 233872 -83227 -82322
$$ packed form
17534I2090a26664B33665b10933A18464h6077A5653a2664o1999D15066G7096l4632
17523D2464a83124I5152Q2396d8410j23239A00357J31715C1864b1787f087B88637
17511A56020L60315r0978A9579d6929h117n2945C50351b31211H3361P3242B6120
17499e5667A71776j1999J77896h3111A18316C8086J97459c0978A47186a40337
17488B39800A11859J40573c1052A65003C1141J77160G3105a8036B19696p7795
17478A41901K8548p6436N414a11812A16108J80016a98596A55505l1379a1232C51322
17466B22276L1132b8071A95766b36938A54134C4660j0831a78525C82876g9179
17455A04769Q7292N9742A13077m4687L80808A37259L48493B26720P152h3227R05
$$ plain form
17444 -82322 426938 446845 391226 77832 19382 246581 311526 264242 215370 -108393 119566
17432 227854 260956 241855 183793 259414 192053 509275 50924 348908 231715 461949 162037
17420 -78974 207849 280556 272878 252098 563176 447932 234614 65834 385798 331578 244093
17409 244093 19386 183685 63034 14137 493119 262489 247811 345991 58605 25612 243831
17398 243831 44099 133984 65035 166987 -151746 244965 379866 1230 -269300 386108
17387 -26799 44855 201524 205960 487198 163017 95449 387924 556794 33944 -169745 299548
17375 18398 -167806 9111 586370 69865 94280 -141979 199331 140994 374753 314731 100119
17363 60869 -130645 215564 133960 418440 -125245 185873 218974 192560 460748 19566
$$ packed form
17444h2322D26938J9907n5619G7832A9382K27199O4945m7284m8872a08393A19566
17432B27854L3102j9101n8062P5621o7361L17222E0924K97984j17193K30234A62037
17420g8974B07849P2707p678k0780L11078j15244k13318F5834L19964n4220q7485
17409B44093A9386J64299F3034A4137M78982k30630j4678R8180E8605B5612K18219
17398B43831D4099Q9885F5035J01952a51746B44965J34901A230b69300C86108
17387b6799D4855J56669M436K81238A63017o7568K92475J68870C3944a69745B99548
17375A8398a67806I111N77259F9865K4415a41979A99331n8337K33759o0022A00119
17363F0869a30645B15564q1604K84480a25245A85873L3101k6414K68188A9566
$$ plain form
17352 212651 -80296 21680 234308 215698 233216 -209076 238557 -17643 318052 173388
17342 173388 4797 -61796 109772 574065 57088 -30836 254410 169914 -21231 -296818 296320
17330 -116364 127606 -327774 151108 -179491 -112585 317773 -18712 3969 6645 209083 -184350
17318 230858 601832 118721 17677 87652 169235 221886 325690 120705 232396 246956
17308 246956 124136 -86069 131205 -78360 393919 145227 6225 889 106843 349028 -178502
17296 187277 234685 205326 254206 22172 171265 -26891 420255 228887 -66831 -111700 -25538
17284 286811 208588 276572 303160 79481 215895 117301 64344 38623 599965 197108 538826
17273 538826 64075 108268 51393 214952 221626 109831 419463 246756 259030 234735 297834
$$ packed form
17352B12651h0296B1680K12628j8610J7518b09076B38557a7643C18052j44664
17342A73388D797f1796A09772M64293E7088c0836B54410q4496b1231k75587B96320
17330a16364A27606c27774A51108a79491O6906C17773a8712C969K676K02438a84350
17318B30858L70974A18721A7677O9975Q1583N2651J03804A20705J11691J4560
17308B46956j22820h6069A31205g8360C93919A45227F225H89J05954K42185a78502
17296A87277M7408k9359M8880B2172J49093b6891D20255j91368f6831m4869b5538
17284B86811p8223O7984K6588G9481J36414r8594n2957k5721N61342A97108L41718
17273E38826F4075M4193E1393J63559O674A09831L09632j72707J2274k4295O3099
$$ plain form
17262 297834 139818 -112118 193308 -40717 234650 119802 137070 183082 410234 227662
17252 227662 33080 -31626 -32774 -1399 79001 253560 352606 406232 254872 416759 75684
17240 285565 29784 170405 260966 64725 258333 313690 253494 373878 285624 390330 101318
17228 -168501 326603 373463 -58178 -21541 -36806 126206 246040 390785 -65388 -94231 143781
17216 -18202 319255 147535 187216 -69374 2377 266574 247724 240859 209674 231332 351969
17205 351969 246326 21213 455837 255697 431524 261629 -41378 337394 160689 332661
17195 332661 187865 199106 -258861 678711 336081 193344 172688 185331 -1257 235336
17184 20463 132497 42719 91277 100085 505275 439765 426382 127329 320271 383861 295412
$$ packed form
17262B97834A39818a12118A93308d0717B34650j14848J7268M6012K27152j82572
17252B27662C3080c1626j148a399G9001J74559R9046N3626j51360J61887G5684
17240B85565B9784J40621R0561F4725J93608N5357o0196J20384q8254J04706A01318
17228a68501C26603M6860e8178b1541j5265A26206J19834J44745f5388k8843A43781
17216a8202C19255A47535L9681f9374B377K64197j8850o865l1185K1658J20637
17205C51969j05643B1213M34624k00140J75827j69895d1378C37394A60689J71972
17195C32661j44796J1241b58861F78711C36081j42737k0656J2643a257B35336
17184B0463J12034D2719M8558Q808M05190o5510j3383A27329J92942O3590q8449
$$ plain form
17173 295412 509525 477880 299277 347035 319711 489594 428479 579736 174217 477993
17163 477993 613957 328846 313901 307504 115772 76073 195834 190866 335049 -151122 328437
17151 371682 92596 263662 439949 186672 537214 36604 297347 693818 509980 568056
17141 568056 162784 639531 316034 293532 276977 16066 256574 303219 208023 334185
17131 334185 306264 12362 212957 111577 598146 130654 308262 367259 361783 242899
17121 242899 479129 511179 269274 452142 297752 505940 633698 500846 366102 304784
17111 304784 467585 208987 586475 295660 647462 631875 638221 468150 268180 450334
17101 450334 407462 452749 597087 496275 491598 553116 485846 185978 369869 569346 332437
$$ packed form
17173B95412K14113l1645j78603M7758k7324J69883o1115J51257A74217L03776
17163D77993J35964k85111j4945o397A15772l9699J19761m968J44183a51122C28437
17151C71682I2596J71066J76287A86672L50542C6604K60743L96471j83838N8076
17141E68056A62784M76747C16034k2502j6555A6066K40508M6645r5196J26162
17131C34185k7921A2362K00595j01380M86569A30654J77608N8997n476j18884
17121B42899K36230L2050k41905J82868j54390K08188J27758j32852j34744o1318
17111C04784J62801B08987L77488k90815L51802j5587O346j70071j99970J82154
17101D50334m2872M5287J44338j00812m677O1518o7270A85978J83891J99477k36909
$$ plain form
17090 332437 523621 432456 519573 523555 85064 710310 581823 451867 561623 645652 749633
17079 749633 497167 559561 301539 592065 455941 412692 433104 630766 521799 211120
17068 540297 327773 776083 712071 291868 515520 416962 419472 676741 929732 458778
17057 742157 698540 482014 707576 746799 655701 522649 727002 836627 542570 683361
17047 683361 630455 623032 564037 701074 436670 789574 501070 458961 958797 660357
17037 660357 567942 261121 470233 717361 559905 935387 448012 703968 662803 637824
17027 637824 743091 274679 917584 960329 929294 351631 724737 294476 612682 388970
17017 388970 664255 692909 769228 806135 556063 633535 835357 919610 658039 819624
$$ packed form
17090C32437J91184r1165Q7117L982H5064O25246j28487j29956J09756Q4029J03981
17079G49633k52466O2394k58022K90526j36124m3249K0412J97662j08967B11120
17068E40297k12524M48310o4012B91868K23652r8558K510K57269K52991D58778
17057G42157m3617k16526K25562L9223r1098j33052K04353J09625k94057J40791
17047F83361n2906p423n8995J37037k64404L52904k88504m2109M99836k98440
17037F60357r2415B61121K09112K47128j57456L75482D48012K55956m1165k4979
17027F37824J05267B74679O42905M2745l1035C51631L73106B94476L18206k23712
17017C88970K75285K8654P6319L6907k50072P7472K01822Q4253k61571J61585
$$ plain form
17007 819624 805776 1091871 771470 941148 706615 1164448 761347 854201 797179 722359
16997 722359 900328 677180 871704 666021 1040375 710581 791185 563537 500984 969517
16987 969517 909332 892250 1145083 1169690 967818 725782 737509 895256 666031 1169452
16977 1169452 836019 962477 772330 1041049 797153 1092273 979238 1201621 1516952
16968 1516952 839817 939729 837690 782479 901865 1111639 916633 1070859 1279196 914210
16958 914210 1337024 1317675 1256363 1198928 1109291 1298246 1058142 1327767 1076795 1240691
16948 1240691 1087985 1267379 960113 1162783 1111290 1637114 1227159 1420446 1227209 1388550
16938 1388550 1340394 1171269 1327527 1414688 1126688 1065614 1178158 1643737 1437299 1168331
$$ packed form
17007H19624j3848K86095l20401J69678k34533M57833m03101R2854n7022p4820
16997G22359J77969k23148J94524k05683L74354l29794Q0604k27648o2553M68533
16987I69517o0185j7082K52833K4607k01872k42036J1727J57747k29225N03421
16977A169452l33433J26458j90147K68719k43896K95120j13035K22383L15331
16968A516952o77135R9912j02039n5211J19386K09774j95006J54226K08337l64986
16958I14210M22814j9349o1312n7435q9637J88955k40104K69625k50972J63896
16948A240691j52706J79394l07266K02670n1493N25824m09955J93287j93237J61341
16938A388550m8156j69125J56258Q7161k88000o1074J12544M65579k06438k68968
$$ plain form
16928 1168331 1339641 1273147 1230583 1355881 1666232 1441631 1544599 1375252 1618664 1610238
16918 1610238 1483168 1583920 1545291 1684864 1535060 1644453 1474651 1929687 1865741 1778243
16908 1778243 1641586 1560089 1971283 1700271 1740443 1989128 1998624 2154516 2014639 1928117
16898 1928117 1945724 2340708 2197919 1919060 2222348 1993196 2147254 2242348 1868986 2280096
16888 2280096 2142502 2300541 2351097 2371417 2801809 2491885 2520736 2364004 2457733 2329759
16878 2329759 2408804 2308262 2401996 2622731 2598472 2596163 2813033 2722751 2870238 3102858
16868 3102858 2760801 3105918 3141083 2925245 3226226 3155137 3126595 3314535 3125407 3239192
16858 3239192 3308091 3401747 3493244 3256138 3613779 3520309 3153920 3606499 3527756 3658342
$$ packed form
16928A168331J71310o6494m2564J25298L10351k24601J02968j69347K43412q426
16918A610238j27070J00752l8629J39573j49804J09393j69802M55036o3946q7498
16908A778243j36657q1497M11194k71012M0172K48685R496J55892j39877q6522
16898A928117J7607L94984j42789k78859L03288k29152J54058R5094l73362M11110
16888B280096j37594J58039N0556K0320M30392l09924K8851j56732R3729j27974
16878B329759P9045j00542R3734K20735k4259k309K16870r0282J47487K32620
16868C102858l42057L45117L5165k15838L00981p1089k8542J87940j89128J13785
16858C239192O8899R3656R1497k37106L57641r3470l66389M52579p8743J30586
$$ plain form
16848 3658342 3714900 3552606 3675230 3903182 4074708 4081809 4054837 4133592 4461477 4546732
16838 4546732 4531667 4559279 4544930 4572124 4525818 5056351 4916305 4775884 4966835 4958873 5576752
16827 5576752 5525608 5475128 5638569 5463216 5715080 5992776 5871867 6253420 6271128 6355102
16817 6355102 6337373 6906316 6719039 6686080 7153728 7153330 7460679 7375289 7558214 7894623
16807 7894623 8167896 8127051 8167556 8639050 8604600 8666043 9294099 9499285 9302319 9834203
16797 9834203 9533683 10341494 10662232 10868103 10976652 11199417 11614780 11992963 12238256
16788 12238256 12629525 12954589 13184376 13609857 13970544 14499961 14933411 15314879 15698553
16779 15698553 16157566 16743212 17305100 17361270 18388398 18724018 19366357 19669703 20598113
$$ packed form
16848C658342N6558j62294J22624K27952J71526P101k6972P8755L27885Q5255
16838D546732j5065K7612j4349K7194m6306N30533j40046j40421J90951p962O17879
16827E576752n1144n0480J63441j75353K51864K77696j20909L81553J7708Q3974
16817F355102j7729N68943j87277l2959M67648l98L07349q5390J82925L36409
16807G894623K73273m0845M0505M71494l4450O1443O28056K05186j96966N31884
16797I834203l00520Q07811L20738K05871J08549K22765M15363L78183K45293
16788A2238256L91269L25064K29787M25481L60687N29417M33450L81468L83674
16779A5698553M59013N85646N61888N6170J027128L35620O42339L03346R28410
$$ plain form
16770 20598113 21467893 22075793 23097744 23636754 24675009 25311593 26362961 27171362 28483900
16761 28483900 29372844 30491708 31847595 33164213 34449525 35910114 37146919 39285887
16753 39285887 40707752 42467605 44669001 46612707 48686794 51021789 53385333 55774065
16745 55774065 58570082 61129125 64310238 67629395 70793801 74226446 78308933 81760457
16737 81760457 86012686 90029875 94753775 99007001 103557375 108428755 113094874 117737011
16729 117737011 122235833 126832285 131244415 135281189 139462328 142722732 145498587 147680353
16721 147680353 149269758 150363636 150690607 150208351 149194087 147400787 145301098 142124557
16713 142124557 138980130 135155380 130745234 126602026 121785444 117185023 112223928 107589934
$$ packed form
16770B0598113Q69780O07900J021951N39010J038255O36584J051368Q08401J312538
16761B8483900Q88944J118864J355887J316618J285312J460589J236805K138968
16753C9285887J421865J759853K201396J943706K074087K334995K363544K388732
16745E5774065K796017K559043L181113L319157L164406L432645M082487L451524
16737H1760457M252229M017189M723900M253226M550374M871380M666119M642137
16729A17737011M498822M596452M412130M036774M181139L260404K775855K181766
16721A47680353J589405J093878L26971m82256j014264j793300k099689l176541
16713A42124557l144427l824750m410146m143208m816582m600421m961095m633994
$$ plain form
16705 107589934 102886966 98231881 93441899 89133154 84900517 80844393 77068447 73383232
16697 73383232 69481478 66063245 63122441 59988435 56694431 54446171 51844758 49207950
16689 49207950 47190824 44885111 43358510 41370463 39396036 37718547 36012945 34685792
16681 34685792 33270386 31745372 30513190 29306250 28099645 26997550 25991169 25112023
16673 25112023 23984243 23448500 22063329 21593046 20724530 19827266 19258238 18852302 18165988
16664 18165988 17471360 17190357 16852110 15987201 15763941 15029498 14919291 13974182 13787135
16655 13787135 13242028 12925321 12597149 12231881 12039842 11387920 11215034 11005270 10793047
16646 10793047 10269660 10285891 9947255 9782413 9418770 8971575 8858728 8503848 8582955 8302235
$$ packed form
16705A07589934m702968m655085m789982m308745m232637m056124l775946l685215
16697G3383232l901754l418233k940804l134006l294004k248260k601413k636808
16689D9207950k017126k305713j526601j988047j974427j677489j705602j327153
16681C4685792j415406j525014j232182j206940j206605j102095j006381q79146
16673B5112023j127780n35743j385171m70283q68516q97264n69028m05936o86314
16664A8165988o94628k81003l38247q64909k23260p34443j10207r45109j87047
16655A3787135n45107l16707l28172l65268j92039o51922j72886k09764k12223
16646A0793047n23387J6231l38636j64842l63643m47195j12847l54880P9107k80720
$$ plain form
16636 8302235 8123677 7736826 7791587 7320071 7344161 7194555 7015088 6750917 6813861 6568469
16626 6568469 6591617 6344306 6564314 6114656 6027493 5766252 5930909 5607957 5801523 5335542
16616 5335542 5171790 5102698 5047406 4915063 4750590 4798485 4765903 4390795 4643269 4241157
16606 4241157 4263782 4511042 4163833 4277506 4085458 3651671 3815658 3731019 3593437 3734179
16596 3734179 3937174 3686156 3470567 3383547 3480474 3578825 3067092 3269274 3259029 3455198
16586 3455198 3114668 3234493 3102316 2973191 2974756 3010214 2862784 2513699 2746482 2265574
16576 2265574 2785744 2644308 2677482 2600280 2536680 2374620 2261184 2222145 2367702 2055884
16566 2055884 2402064 2116944 2126017 2310010 2156186 2319181 2105134 2131671 2263573 1867167
$$ packed form
16636H302235j78558l86851N4761m71516K4090j49606j79467k64171O2944k45392
16626F568469K3148k47311K20008m49658q7163k61241J64657l22952J93566m65981
16616E335542j63752o9092n5292j32343j64473M7895l2582l75108K52474m02112
16606D241157K2625K47260l47209J13673j92048m33787J63987q4639j37582J40742
16596C734179K02995k51018k15589q7020R6927R8351n11733K02182j0245J96169
16586C455198l40530J19825j32177j29125J565L5458j47430l49085K32783m80908
16576B265574N20170j41436L3174p7202o3600j62060j13436l9039J45557l11818
16566B055884L46180k85120R073J83993j53824J62995k14047K6537J31902l96406
$$ plain form
16556 1867167 1966578 1845656 2108066 1789505 2071293 1852821 1943575 1938786 1767791 1805203
16546 1805203 1831727 1816009 1573962 1473549 1745375 1780362 1521654 1637747 1645737 1430687
16536 1430687 1559586 1501676 1423477 1629809 1624903 1733015 1395272 1501896 1400975 1463708
16526 1463708 1432008 1600596 1541564 1378151 1539849 1275531 1101078 1417334 916219 1231331
16516 1231331 981031 1515114 1382979 1322447 1191470 1345259 1120724 1037769 1211667 943737
16506 943737 1152213 1248392 1104401 1231842 1179211 1123785 1018267 1126619 854500 1140479
16496 1140479 1110417 1053365 801077 1212292 785577 966042 1009865 969164 706795 1034810
16486 1034810 782316 927493 704246 738261 882454 1252348 794990 904685 953322 1146979
$$ packed form
16556A867167R9411j20922K62410l18561K81788k18472R0754m789j70995L7412
16546A805203K6524j5718k42047j00413K71826L4987k58708J16093P990k15050
16536A430687J28899n7910p8199K06332m906J08112l37743J06624j00921O2733
16526A463708l1700J68588n9032j63413J61698k64318j74453L16256n01115L15112
16516A231331k50300N34083j32135o0532j30977J53789k24535q2955J73898k67930
16506I43737K08476R6179j43991J27441n2631n5426j05518J08352k72119K85979
16496A140479l0062n7052k52288M11215m26715J80465M3823m0701k62369L28015
16486A034810k52494J45177k23247L4015J44193L69894m57358J09695M8637J93657
$$ plain form
16476 1146979 1023558 766919 724833 1168980 534736 803152 782289 779562 844049 686403
16466 686403 848372 809875 1110472 765189 917092 569917 940193 386818 732536 618638
16456 618638 913397 573650 677564 419900 523542 516782 540554 713415 711796 580324
16446 580324 468600 301424 675413 523971 279373 495596 869878 328391 454212 443144
16436 443144 942135 895908 573629 500869 716637 543017 659429 454238 832514 530357
16426 530357 579925 430830 214004 199556 302921 774138 546610 584704 408953 764681
16416 764681 352915 445855 655052 353561 257149 599158 277641 677518 527646 928423
16406 928423 807259 86126 556860 669052 351153 553034 302193 569857 303426 399157
$$ packed form
16476A146979j23421k56639m2086M44147E34736K68416k0863k727O4487j57646
16466F86403J61969l8497L00597l45283J51903l47175L70276C86818L45718j13898
16456F18638K94759l39747J03914k57664J03642o760K3772J72861j619j31472
16446E80324j11724j67176L73989j51442k44598K16223L74282C28391J25821j1068
16436D43144M98991m6227l22279p2760K15768j73620J16412k05191L78276l02157
16426E30357M9568j49095B14004j4448J03365M71217k27528L8094j75751L55728
16416G64681C52915R2940K09197l01491r6412L42009B77641L99877j49872M00777
16406I28423j21164H6126M70734J12192l17899K01881k50841K67664k66431R5731
$$ plain form
16396 399157 633669 527190 467778 719605 185292 415080 429891 184807 423295 83241
16385 599802 559919 457694 384426 280416 252241 455817 15046 474204 186173 261732
16375 261732 249543 470098 291620 91439 390706 438210 558149 355560 432723 81687
16364 250532 149537 628694 404801 309557 163843 109475 338310 354753 371842 187511
16354 187511 196060 137253 453549 658339 247468 105679 294471 -24863 -81485 217927
16343 406053 146180 414710 480476 434262 351402 419335 14 491355 276621 277273 117727
16331 209171 -69327 209819 213962 148470 529274 66702 448631 135557 -10366 45932 352158
16320 352158 283434 31209 486717 105988 331224 167524 -88821 728393 350868 143960
$$ packed form
16396C99157K34512j06479n9412K51827A85292K29788J4811A84807K38488H3241
16385E99802l9883j02225p3268j04010k8175K03576A5046M59158A86173P5559
16375B61732j2189K20555j78478I1439K99267M7504J19939k02589P7163H1687
16364B50532j00995M79157k23893r5244j45714n4368K28835J6443J7089j84331
16354A87511Q549n8807L16296K04790B47468A05679J88792b4863n6622B17927
16343D06053A46180K68530O5766m6214q2860O7933A4M91341k14734O52A17727
16331B09171f9327B09819M143o5492L80804F6702L81929A35557a0366D5932L06226
16320C52158o8724C1209M55508A05988K25236j63700h8821G28393C50868A43960
$$ plain form
16309 225568 206765 303996 204868 143349 29664 32021 362612 310011 382750 83582 406349
16298 406349 214871 -223305 2233 37749 224441 152348 473138 256260 -41956 525173
16287 -176188 396563 120000 66731 342872 124657 248539 122595 -22661 217340 -138001
16276 -285566 195870 294086 11435 -17742 116503 295758 128310 215483 97145 96169 76773
16265 76773 393594 -54267 65145 135228 66831 463188 183742 299417 70329 -6063 -84088
16254 -84088 248905 -15889 469086 -196802 126574 219697 60409 51703 253880 -73194 -20829
16242 507041 227361 136444 207028 253304 119086 -1346 96050 320616 285073 -104068 253866
16230 -21633 121136 -123436 223117 -112751 219471 443855 271186 -59033 419028 -5461
$$ packed form
16309B25568j8803R7231r9128o1519B9664K357L30591n2601P2739H3582L22767
16298D06349j91478b23305B233L5516J86692p2093L20790k16878d1956E25173
16287a76188C96563A20000n3269K76141A24657J23882A22595b2661B17340a38001
16276b85566A95870R8216A1435a7742A16503J79255A28310Q7173I7145r76j9396
16265G6773L16821e4267F5145P0083F6831L96357A83742J15675G0329f063p8025
16254h4088B48905a5889D69086a96802A26574R3123F0409q706K02177g3194b0829
16242E07041B27361r0917P0584M6276A19086a346I6050K24566l5543a04068B53866
16230b1633A21136a23436B23117a12751B19471K24384j72669e9033D19028e461
$$ plain form
16219 200172 20290 138912 336863 206062 237867 -25810 78960 157185 171271 383157 -222372
16207 74938 279575 -132990 154201 360049 145990 220158 -18762 201246 -141567 -4915
16196 136492 -67826 -57087 208533 -59474 106279 -166072 -99114 50499 145203 163112 57686
16184 -309195 -256593 400080 -291424 192891 162924 73265 146456 -194924 189404 51546
16173 -161368 -149043 77676 25108 -309701 -122238 116215 44420 62916 71213 54611 -56126
16161 -77991 150765 -130307 -1336 -197728 -127714 15654 -40696 26065 21829 -113610 -253218
16150 -253218 -249674 -31246 -111046 23964 57564 -165598 -51928 -80858 -90011 -9445 -121526 249097
16137 335820 -92082 422342 122978 24292 -130781 -9751 66842 201825 -226281 -28088 -151778
$$ packed form
16219B00172B0290J18622J97951j30801L1805b5810G8960P8225J4086K11886b22372
16207G4938K04637a32990A54201K05848A45990P4168a8762B01246a41567d915
16196A36492f7826J0739B08533e9474A06279a66072O6958E0499R4704J7909E7686
16184c09195N2602D00080b91424A92891k9967G3265P3191a94924A89404E1546
16173a61368J2325G7676B5108c09701a22238A16215D4420J8496Q297j6602e6126
16161g7991A50765a30307a336j96392P0014A5654d0696B6065m236a13610j39608
16150b53218L544c1246p9800B3964L3600a65598e1928k8930r153i445j12081B49097
16137C35820i2082D22342A22978B4292a30781i751F6842J34983b26281b8088j23690
$$ plain form
16126 -151778 90183 78813 127019 108543 428982 133093 105422 144160 -110760 63194 35715
16115 35715 92421 71459 483408 199848 -109565 64503 41925 89465 167599 389318 37114
16103 214964 82694 561964 398068 460946 -50085 142637 16008 183655 50444 -28785 99881
16091 -278242 -54544 191029 -207928 234517 -25467 100408 362801 221157 -28567 -43507
16081 -43507 -147579 -64891 139514 108987 117368 188771 231243 29663 -28419 -364136 -143205
16069 121255 -242425 -97218 49499 244555 156811 -94800 -355849 -97100 -314762 11928 130461
16058 130461 -277193 37046 -233303 32453 -42537 -383329 -590697 -59554 255623 -26104
16047 126223 320216 -68546 -275063 125431 36479 103786 205032 -21630 -5235 -27663 -21015
$$ packed form
16126a51778I0183j1370M8206j8476L20439A33093k7671L8738a10760F3194k7479
16115C5715N6706k0962M11949A99848a09565F4503k2578M7540P8134K21719C7114
16103B14964H2694M79270j63896O2878e0085A42637A6008J67647E0444b8785I9881
16091b78242e4544A91029b07928B34517b5467A00408K62393j41644b8567j4940
16081d3507j04072f4891A39514l0527Q381P1403M2472B9663b8419l35717a43205
16069A21255b42425i7218D9499J95056q7744i4800k61049i7100k17662A1928J18533
16058A30461b77193C7046b33303C2453d2537l40792k07368e9554B55623b6104
16047A26223J93993f8546k06517A25431C6479O7307J01246b1630e235k2428O648
$$ plain form
16036 -21015 -201080 118016 188280 109262 105103 21324 -490 35132 23620 -223489 -145961 89343
16023 -160722 144051 26930 3188 -232970 -21988 -312581 48212 170948 117108 -40446 -36138
16012 -36138 -24718 240897 -2692 -233796 286520 57821 -145826 116812 202197 -21538 -281756
16001 -281756 223639 28303 91793 -78046 11389 -159222 -277270 -214435 231920 138756 -38314
15989 93484 5265 87607 -132316 68915 152078 532840 240536 259416 354767 105711 203854
15978 203854 -154469 191143 -157861 -2801 92329 81627 416384 -216425 66512 55826 85225
15967 85225 58596 214609 248471 40843 522375 222698 543722 50189 -199792 254451
15956 297191 -4180 36597 -335790 187795 -185723 -217808 -97360 -162748 -98506 51485 -75538
$$ packed form
16036b1015j80065A18016P0264p9018m159B1324d90C5132j1512b23489P7528H9343
16023a60722A44051B6930C188b32970b1988k90593D8212J22736n3840d0446M308
16012c6138J1420B40897b692k31104B86520E7821a45826A16812Q5385b1538k60218
16001b81756B23639B8303O3490g8046A1389a59222j18048O2835B31920r3164c8314
15989I3484E265Q2342a32316F8915Q3163L80762B40536J8880R5351A05711R8143
15978B03854a54469A91143a57861b801I2329j0702L34757b16425F6512j0686K9399
15967H5225k6629J56013L3862D0843M81532B22698L21024E0189a99792B54451
15956B97191d180C6597c35790A87795a85723l2085i7360o5388O4242E1485g5538
$$ plain form
15944 -162511 -116183 -180963 -77217 -9775 297176 -96040 -218866 30366 -154653 -150389 -129782
15933 -129782 234897 78315 300253 20409 11882 68946 47596 313806 -44091 2714 -100676
15921 151437 359620 77212 79089 -126872 -258106 -30663 -190807 47217 -120499 -82310 33194
15909 -160812 -129591 -99421 -44216 105806 -35551 -346208 140386 -93995 -110069 -58416 -4539
15897 -63750 28219 -292552 283806 -38099 144499 56468 70135 -160844 -81650 -31330 -44175
15886 -44175 -267575 83058 -121703 119445 -226111 -57862 -487275 55945 28201 -372426
15875 149186 -43891 -104796 88318 -61530 -272439 -29433 153939 -37099 -164637 7743 -158907
15863 313901 -167001 -176106 35964 -71635 180174 -71076 -151948 220303 -238152 131710 -79536
$$ packed form
15944a62511M6328o4780g7217i775B97176i6040j22826C0366a54653M264K0607
15933a29782B34897G8315K21938B0409q527N7064k1350K66210d4091B714a00676
15921A51437K08183G7212J877a26872j31234c0663j60144D7217a20499L8189C3194
15909a60812L1221L0170d4216A05806c5551l10657A40386i3995j6074N1653d539
15897f3750B8219b92552B83806c8099A44499E6468J3667a60844P9194c1330j2845
15886d4175k23400H3058a21703A19445b26111e7862m29413E5945k7744c72426
15875A49186d3891o0905H8318f1530k10909b9433A53939c7099j27538G743a58907
15863C13901a67001r105C5964g1635A80174g1076q0872B20303b38152A31710g9536
$$ plain form
15851 94625 104736 108227 39620 40923 -320238 -67922 97899 234208 -281182 -167 197085 -355023
15838 77274 195333 -86070 -7892 87757 -115393 -27286 -115179 -271356 147800 -54905 -102037
15827 -102037 5526 -194812 83488 -55482 8286 -229046 -150158 72112 393100 -254115 -187107
15816 -187107 280025 -131546 33271 213989 35867 -34746 54614 197877 120870 66678 101772
15805 101772 144367 -69520 21575 -43106 -91759 164108 52757 2311 -78791 -173755 92117
15793 158867 -42572 -173376 -98144 -17053 85751 39785 124714 -92423 108869 359245 63636
15781 205919 -436459 -260032 228360 64730 -209899 109076 -207583 -55507 -87589 -157340
15771 -157340 -112748 -167373 -265146 -209720 -219762 -191996 24693 -235715 -80640 -118269 88211
$$ packed form
15851I4625J0111L491C9620J303c20238f7922I7899J36309b81182a67A97085c55023
15838G7274J18059h6070g892H7757a15393b7286q7893j56177A47800e4905m7132
15827a02037E526a94812H3488e5482H286b29046P8888G2112L20988b54115O7008
15816a87107B80025a31546C3271J80718C5867c4746E4614J43263p7007n4192L5094
15805A01772M2595f9520B1575d3106m8653A64108E2757B311g8791r4964I2117
15793A58867d2572j30804P5232a7053H5751C9785Q4929i2423A08869K50376F3636
15781B05919d36459J76427B28360F4730b09899A09076b07583e5507l2082o9751
15771a57340M4592n4625r7773N5426j0042K7766B4693b35715h0640l7629H8211
$$ plain form
15759 133734 -44332 81202 -147558 146076 111816 -231471 -107974 -233134 -12590 117101
15748 -75469 54565 -109149 -305698 -17130 35004 -222518 148614 -63235 -2730 -83578 -30675
15736 -270255 343807 -359840 145894 105392 -390943 51945 -182641 -29604 -164231 379844
15725 -58673 -74768 166047 -210530 -192022 148375 -63194 15088 -93295 22630 233741 134356
15714 134356 89507 124036 -141285 -397708 -285386 -114863 -124126 207306 -91794 -278035
15704 -278035 -211012 -145872 -46701 87524 124874 83202 -126165 -308155 -155977 47286 252381
15693 252381 -49669 -159109 -124914 -169292 314892 18118 -108350 263446 -192419 -212218
15683 -212218 136205 -221145 -150270 -199643 -21425 154414 -33287 -58570 389063 -40364 280056
$$ packed form
15759A33734d4332H1202a47558A46076l4260b31471a07974j25160a2590A17101
15748g5469E4565a09149j96549a7130C5004b22518A48614f3235b730q0848c0675
15736b70255C43807c59840A45894m0502c90943E1945a82641b9604j34627C79844
15725e8673j6095A66047b10530J8508A48375f3194A5088i3295B2630K11111r9385
15714A34356m4849L4529a41285k56423J12322a14863r263B07306i1794j86241
15704b78035O7023O5140d6701H7524L7350m1672a26165j81990J52178D7286K05095
15693B52381d9669j09440L4195m4378C14892A8118a08350B63446a92419j9799
15683b12218A36205b21145P0875m9373b1425A54414c3287k5283C89063d0364B80056
$$ plain form
15671 588694 464575 -174791 -8036 -284075 63761 8372 -6400 -74873 -256992 111746 -123143
15659 72814 -19382 42579 -124227 149536 24069 122680 134462 -2035 -174917 -170797 -279022
15648 -279022 -298306 30986 -51723 285894 70496 -114593 -46422 150266 -178267 -10542 -44834
15637 -44834 -382041 -65752 107753 82099 122118 -27662 -22279 -105474 102896 302328 30152
15625 -10719 87743 -11289 77046 -246505 -289293 -128826 -146058 -68844 -58742 -175090 47481
15613 -281940 118612 22732 -75385 358310 96661 306085 100297 -47377 -138777 -209913 1705
15601 -26973 -188945 -356390 -263746 -242299 -46728 135720 267788 174497 -165730 193507
15590 -95582 -64444 326223 -200307 72945 133974 169936 -530163 155717 -74797 31661 -340862
$$ packed form
15671E88694j24119a74791h036k76039F3761H372f400o8473j82119A11746a23143
15659G2814a9382D2579a24227A49536B4069R8611J1782b035j72882M120j08225
15648b79022j9284C0986e1723B85894G0496a14593d6422A50266a78267a0542l4292
15637d4834l37207f5752A07753k5654M0019b7662N383q3195A02896J99432C0152
15625a0719H7743a1289G7046b46505m2788a28826j7232f8844J0102j16348D7481
15613b81940A18612B2732g5385C58310I6661K09424A00297d7377r1400p1136A705
15601b6973j61972j67445R2644K1447d6728A35720J32068r3291a65730A93507
15590i5582L1138C26223b00307G2945O1029L5962e30163A55717g4797C1661c40862
$$ plain form
15578 225740 -203612 364226 56066 -9095 442256 147607 55511 299900 -274082 -205713
15568 -205713 158529 86146 -23758 -370542 -71064 80008 166348 266649 -65328 174016 -32817
15556 6436 -176195 -92727 -95905 -316682 169452 -192874 -93044 -14025 46298 -79351 29006
15544 -150061 -226184 -179526 -12271 -200641 -46557 -169205 -116119 -192963 98828 195326 174769
15533 174769 124078 198252 -131018 231459 262700 118136 -493840 -19021 20332 251802
15523 251802 -98495 -164362 108125 -29306 -97746 -257189 20680 42076 158430 -30633 79053
15511 114459 87158 -58910 262642 -9487 292806 80464 -149338 9714 26832 205126 -95132
15499 -146870 -268593 -279973 -310014 464817 118521 24743 -88004 12987 -165498 155050
$$ packed form
15578B25740b03612C64226E6066i095D42256A47607E5511K44389b74082O8369
15568b05713A58529p2383b3758l46784g1064H0008Q6340J00301f5328A74016c2817
15556F436a76195Q3468l178k20777A69452a92874i3044a4025D6298g9351B9006
15544a50061p6123M6658a2271j88370d6557j22648N3086p6844I8828R6498k0557
15533A74769n0691P4174a31018B31459L1241A18136d93840a9021B0332K31470
15523B51802i8495o5867A08125b9306o8440j59443B0680K1396J16354c0633G9053
15511A14459k7301e8910B62642i487B92806H0464a49338I714J7118J78294i5132
15499a46870j21723j1380l0041D64817A18521B4743h8004A2987a65498A55050
$$ plain form
15488 110798 460440 167369 -46761 -133059 157309 81691 -74613 -205255 -68184 43948 -132645
15476 -407078 -11308 168616 147867 -338434 -53973 444207 -63709 50066 31908 -189646 -12498
15464 -134132 -143620 -426448 -134172 230561 78154 152 61605 196973 -32803 -242794 51272
15452 -143769 240708 78403 -97894 249293 -174303 38068 145100 -117592 44891 24436
15442 24436 -390625 224385 -112589 -38503 -116302 -30080 -44023 52777 -26177 -98951 79224
15430 155091 -3446 -62385 -65122 -98013 -161859 -191942 36180 -13746 -256210 -62590 17598 312238
15418 312238 -258062 -113364 88018 -20705 -10430 -102525 -38190 -344951 -82577 -59765 -3848
15406 -9816 -42353 -77466 -334396 -20043 228834 36269 227853 99517 67304 44420 -140950
$$ packed form
15488A10798L49642A67369d6761q6298A57309p5618g4613j30642f8184D3948a32645
15476d07078a1308A68616k0749c38434e3973D44207f3709E0066j8158a89646a2498
15464a34132r488k82828a34172B30561G8154A52O1453J35368c2803k09991E1272
15452a43769B40708G8403i7894B49293a74303C8068J07032a17592D4891k0455
15442B4436c90625B24385a12589c8503p7799c0080j3943E2777b6177p2774G9224
15430A55091c446n8939k737l2891o3846l0083C6180a3746k42464f2590A7598K94640
15418C12238b58062a13364H8018b0705J0275r2095c8190l06761h2577K2812c848
15406i816l2537l5113k56930b0043B28834C6269J91584I9517l2213k2884a40950
$$ plain form
15394 911 -106732 2706 -365271 105930 -4743 272387 -22979 -39830 -198413 344979 102578
15382 17469 21736 151476 -242727 -291284 95527 -28314 27728 -112640 181830 -140349 80298
15370 4221 -277062 339725 109525 -41858 -57176 211554 7513 -123847 -36760 147669 -216898
15358 -28794 75987 -227114 -161365 -98653 55445 -359490 -340929 57086 158112 42677 146503
15347 146503 17500 31478 103664 278127 311238 25420 135178 -265772 355589 -68044 78141
15335 -20003 416400 -6044 -123480 -151648 -96409 -53854 372639 -161820 -53666 210338 124480
15324 124480 -318053 -151574 -65156 84130 151340 -782 32292 74104 -24260 -100587 270086
15312 69428 165651 -82848 -118417 115728 7963 -78723 -161406 -114986 -36824 152418 459961
$$ packed form
15394I11a06732B706c65271A05930d743B72387b2979j6851j58583C44979A02578
15382A7469M267J29740b42727m8557I5527b8314B7728a12640A81830a40349H0298
15370D221b77062C39725A09525d1858j5318B11554G513a23847c6760A47669b16898
15358b8794G5987b27114O5749O2712E5445c59490J8561E7086J01026D2677J03826
15347A46503A7500J3978P2186J74463L3111B5420J09758b65772C55589f8044G8141
15335b0003D16400f044j17436k8168N5239M2555C72639a61820e3666B10338q5858
15324A24480c18053a51574f5156H4130O7210g82C2292M1812b4260p6327B70086
15312F9428R6223h2848l5569A15728G963g8723q2683M6420c6824A52418L07543
$$ plain form
15301 459961 -104657 -11169 -330327 148689 -115849 18149 77452 -102533 199871 73298
15290 303574 291206 -106886 -46615 -157154 -314859 151747 -257811 29623 157365 174375
15280 174375 15090 70285 105952 49187 4363 223280 -244158 -114971 -197521 230576 -355251
15268 50106 177647 79945 -113723 95833 -37198 -258143 171733 209385 276078 28087 112892
15257 112892 48730 -20552 276672 53939 125472 -99483 47401 385824 945263 1717584 1379208
15246 1379208 1196082 1587571 598726 290080 317450 56692 63256 -55570 227424 97489
15235 -270331 -48594 51385 31556 122661 71916 -34615 105688 -26234 174201 39251 38089
15224 38089 34411 -12868 106182 64240 123889 177232 -154301 240780 66815 -20846 -3804
$$ packed form
15301D59961a04657a1169l19158A48689a15849A8149N9303a02533A99871G3298
15290C03574j2368a06886d6615j10539j57705A51747b57811B9623J27742J7010
15280A74375A5090N5195L5667D9187D363K18917b44158a14971q2550B30576c55251
15268E0106J27541G9945a13723I5833c7198k20945A71733L7652O6693B8087Q4805
15257A12892D8730b0552B76672E3939P1533i9483D7401L38423N59439P72321l38376
15246A379208j83126L91489E98726B90080K7370E6692O564e5570B27424I7489
15235b70331d8594E1385j9829R1105n0745c4615A05688b6234A74201C9251j162
15224C8089l678a2868A06182m1942N9649N3343a54301B40780F6815b0846c804
$$ plain form
15212 -70927 -32575 -146454 -335206 268123 303474 -248983 -83048 -151885 109834 59361 -20073
15200 -61201 96689 44672 20379 49785 -425521 76873 67627 115499 -131372 183692 128750
15189 128750 -66261 214695 330741 219637 51332 -161821 307248 -67462 -107309 -170016
15179 -170016 218332 159689 65830 55576 -107402 168888 299335 -194232 -154522 -69319
15168 81783 141020 -143591 -308717 239988 175027 46158 76174 -234470 86415 -22206 -229604
15157 -229604 62344 65500 366509 -1341 33577 506505 260099 91943 -27508 -248948 -385040
15146 -385040 7274 377980 184370 426361 258741 211257 -178139 -118610 -289972 -67046
15135 100991 311550 -57176 96222 26695 231548 -64185 196685 -291649 169917 211805
$$ packed form
15212g0927c2575j13879j88752B68123L5351b48983h3048o8837A09834n0473b0073
15200f1201I6689D4672B0379K9406d25521G6873r246M7872a31372A83692n4942
15189A28750f6261B14695J16046j11104E1332a61821C07248f7462l9847o2707
15179a70016B18332n8643F5830j0254a07402A68888J30447a94232L9710f9319
15168H1783N9237a43591j65126B39988o4961D6158L0016b34470H6415b2206k07398
15157b29604F2344L156L01009a341C3577M72928k46406I1943b7508k21440j36092
15146c85040G274L70706A84370K41991j67620m7484a78139N9529j71362f7046
15135A00991K10559e7176I6222B6695K04853f4185A96685b91649A69917M1888
$$ plain form
15125 211805 22438 279722 365788 237727 327020 80528 -82976 70375 275970 34839 198270
15114 198270 -20431 -17530 -58040 160200 175866 164388 -81363 -148570 46785 -159811 105860
15102 -237601 17815 188889 343893 26034 153996 -99664 374890 -73829 51761 329874
15092 329874 -43950 130570 73947 109366 166987 -342412 -73268 165888 27694 76204 174523
15081 174523 27111 62931 -57452 -120801 -5098 238755 228455 11538 203519 210545 -176784
15069 46096 428360 113333 -56194 211554 21228 -40065 242307 -18561 -35021 114503 52747
15057 430716 -126509 -32284 -158899 73886 -318510 295525 209264 206265 233621 21658 56251
15046 56251 236529 -54311 317811 266075 -133494 56754 38898 286553 -62438 119041 338172
$$ packed form
15125B11805B2438K57284Q6066j28061Q9293H0528h2976G0375K05595C4839J63431
15114A98270b0431K901m0510A60200J5666j1478h1363o7207D6785a59811A05860
15102b37601A7815J71074J55004B6034J27962i9664C74890g3829E1761K78113
15092C29874d3950A30570n6623L5419N7621c42412g3268A65888B7694M8510R8319
15081A74523B7111L5820e7452o3349e098B38755j0300A1538J91981P026a76784
15069D6096L82264A13333e6194B11554B1228d0065B42307a8561j6460A14503E2747
15057D30716a26509c2284j26615G3886c18510B95525q6261k999K7356B1658L4593
15046E6251J80278e4311C17811n1736a33494E6754j7856K47655f2438A19041K19131
$$ plain form
15035 338172 70681 21569 -28858 116491 -118752 349736 99507 -110280 -340694 158316
15024 31487 446763 120382 328076 -19494 159930 74995 87601 16484 204255 -48901 246636
15012 297448 225809 95557 3572 -95234 47779 -242378 157984 214295 -56789 86984 89223
15001 89223 256018 97217 254288 341832 92822 249883 261665 268108 139159 161066 470468
14990 470468 140294 363727 107014 294563 205424 1083 232971 431206 232702 300220
14980 300220 76026 30485 162873 287268 223304 423237 -163349 123433 326521 214993
14970 214993 360294 366988 127604 336917 234401 240009 6726 -65176 514488 127882 308283
14959 308283 108678 104180 233367 401120 192884 244866 170551 157866 330677 22244 428830
$$ packed form
15035C38172G0681B1569b8858A16491a18752C49736I9507a10280k30414A58316
15024C1487M15276A20382K07694a9494A59930G4995J2606A6484J87771d8901B46636
15012B97448p1639I5557C572i5234D7779b42378A57984N6311e6789H6984K239
15001H9223J66795I7217J57071Q7544I2822J57061J1782O443j28949K1907L09402
14990D70468A40294K23433A07014J87549q9139A083K31888J98235j98504O7518
14980C00220G6026C0485J32388J24395o3964J99933a63349A23433K03088j11528
14970B14993J45301O694A27604K09313j02516N608F726f5176E14488A27882J80401
14959C08283A08678m498J29187J67753A92884N1982p4315j2685J72811B2244M06586
$$ plain form
14948 428830 413991 194772 133508 250720 -45952 608139 107289 8086 282319 373501 270502
14937 270502 387040 252833 266219 285086 657618 74801 236762 45246 71745 355637
14927 355637 390294 184598 347005 128802 149264 -130810 97958 199856 -30036 63219
14916 266900 298911 525052 154064 423505 268737 -6820 167939 -127052 344508 330602
14906 330602 156676 215259 289065 218340 56998 475214 137572 111289 220258 325126
14896 325126 479900 399576 397159 437660 299011 285757 687160 287269 132651 468785
14886 468785 264077 328231 509633 243041 108763 223441 287013 585396 98978 -134793
14875 159814 413487 320092 344762 176225 252035 185526 162793 360010 241797 313541 120536
$$ packed form
14948D28830j4839A94772o1264J17212d5952F08139A07289H086K74233R1182j02999
14937B70502J16538j34207J3386J8867L72532G4801J61961D5246K6499K83892
14927C55637L4657A84598J62407A28802K0462a30810I7958J01898c0036F3219
14916B66900L2011K26141A54064K69441j54768f820A67939a27052C44508j3906
14906C30602A56676N8583P3806p0725E6998M18216A37572k6283J08969J04868
14896C25126J54774q0324k417M0501j38649j3254M01403B87269A32651L36134
14886D68785k04708O4154J81402B43041A08763J14678O3572K98383I8978a34793
14875A59814K53673r3395K4670j68537P5810o6509k2733J97217j18213P1744A20536
$$ plain form
14863 276662 525864 284472 675177 328970 266641 396978 19189 426696 589697 71324
14852 -62068 131787 428777 134586 282333 377797 377810 340039 466763 355535 900649 159924
14840 305833 55387 453703 498441 508048 303468 308445 438850 288782 591830 753673 350411
14828 302839 196500 275333 471210 334825 408886 100920 355168 256743 308285 430408
14818 430408 273821 677964 226360 330456 441788 375760 492028 742938 43447 218370
14808 218370 466403 358863 417531 636221 613592 369778 367417 277055 221690 512592 399573
14797 399573 406221 449932 434143 342229 507521 420549 470940 515053 583340 295929 426638
14786 426638 545494 345410 299901 504686 310595 247905 346488 581596 630590 308825
$$ packed form
14863B76662K49202k41392L90705C28970o2329J30337A9189M07507J63001G1324
14852f2068A31787K96990A34586J47747R5464J3l7771J26724j11228N45114A59924
14840C05833E5387L98316M4738R607k04580M977J30405j50068L03048J61843C50411
14828C02839j06339P8833J95877j36385P4061A00920K54248r8425N1542J22123
14818D30408j56587M04143B26360J04096J11332o6028J16268K50910D3447J74923
14808B18370K48033j07540N8668K18690k2629k43814k361r0362n5365K90902j13019
14797C99573O648M3711j5789r1914J65292q6972N0391M4113O8287k87411J30709
14786D26638J18856k00084m5509K04785j94091o2690R8583K35108M8994C08825
$$ plain form
14775 695056 427148 526717 607621 638835 322288 364483 513565 240147 526214 652244
14765 652244 760500 171545 208645 478379 448814 557765 656144 576198 93366 310456
14755 310456 561041 818600 448203 360162 734643 583951 829380 627407 483858 398152
14745 398152 446999 459877 358493 675775 748106 709232 768813 701212 714549 352734 312429
14734 312429 591780 832861 475217 650276 729740 699590 854734 560261 752272 629728
14724 629728 532560 700537 717630 480307 298373 759757 909324 1060119 867967 754974
14714 754974 781076 762291 876010 761812 798294 710209 514765 617294 774119 763727
14704 763727 620532 424682 628294 503497 733057 652646 812809 555937 560572 857608
$$ packed form
14775F95056k67908R9569Q0904L1214l16547M2195J49082B40147K86067J26030
14765F52244J08256A71545L7100K69734k9565J08951R8379p9946I3366K17090
14755C10456K50585K57559l70397q8041L74481j50692K45429k01973j43549q5706
14745C98152M8847J2878j01384L17282P2331l8874N9581o7601J3337C52734m0305
14734C12429K79351K41081l57644J75059P9464l0150J55144k94473J92011j22544
14724F29728r7168J67977J7093k37323j81934M61384J49567J50795j92152j12993
14714G54974K6102j8785J13719j14198L6482q8085j95444J02529J56825j0392
14704G63727j43195j95850K03612j24797K29560q0411J60163k56872M635K97036
$$ plain form
14694 857608 674702 943039 630611 847593 843290 798734 794068 840027 1013697 1296407 789221
14683 789221 907818 656791 854067 788649 729694 692873 443471 727684 740725 1091409
14673 1091409 819685 563895 1002433 661676 809980 1184010 881904 834974 872995 1108491
14663 1108491 819947 973490 982947 813255 926948 603828 990770 878177 962228 901905
14653 901905 853805 830658 1061972 874642 588457 1128622 841542 859563 1315001 1169019
14643 1169019 1325966 941201 953270 983360 1007616 1196341 861232 1006650 1135527 987208
14633 987208 1299510 1065720 1408736 896097 1415536 1376936 1167974 822469 1404190 1451470
14623 1451470 1233685 1004325 1492968 1310759 1120013 1050095 1355291 1366928 1345079 850056
$$ packed form
14694H57608j82906K68337l12428K16982m303m4556m666M5959J73670K82710n07186
14683G89221J18597k51027J97276o5418n8955l6821k49402K84213J3041L50684
14673A091409k71724k55790M38538l40757J48304L74030l02106m6930L8021K35496
14663A108491k88544J53543R457j69692J13693l23120L86942j12593Q4051o0323
14653I01905m8100k3147K31314j87330k86185N40165k87080J8021M55438j45982
14643A169019J56947l84765J2069L0090K4256J88725l35109J45418J28877j48319
14633I87208L12302k33790L43016n12639N19439l8600k08962l45505N81721M7280
14623A451470k17785k29360M88643j82209j90746o9918L05196J1637k1849m95023
$$ plain form
14613 850056 811089 1149332 1422165 1525522 1581083 1350726 1575622 1312495 1454942 1415968
14603 1415968 1330902 1298078 1141637 1396570 1355245 1311699 1601044 1292632 1234344 1351931
14593 1351931 1520816 1540658 1590013 1246705 1475105 1474409 1594007 1548936 1503460 1766899 1497636
14582 1497636 1432438 1564843 1788627 2049598 1753101 1651452 1677095 1654861 1994359 1900620
14572 1900620 1562771 1921529 1681668 2039632 2124719 1781746 2063129 2231249 2397564 2456063
14562 2456063 2121074 2258542 2233822 2152702 2607447 2293598 2682801 2822589 3060363 3075686
14552 3075686 3129830 3629159 4670628 6186201 10531853 19883481 42263294 44493582
14544 44493582 18205864 6744596 3266369 2461468 1871005 1833010 1692790 1653478 1750590
$$ packed form
14613H50056l8967L38243K72833J03357N5561k30357K24896k63127J42447l8974
14603A415968q5066l2824j56441K54933m1325m3546K89345l08412n8288J17587
14593A351931J68885J9842M9355l43308K28400o96J19598m5071m5476K63439k69263
14582A497636o5198J32405K23784K60971k96497j01649K5643k2234L39498r3739
14572A900620l37849L58758k39861L57964Q5087l42973K81383J68120J66315N8499
14562B456063l34989J37468k4720q1120M54745l13849L89203J39788K37774J5323
14552C075686N4144M99329J041469J515573M345652R351628K2379813K230288
14544D4493582A8205864F744596C266369q04901n90463l7995j40220l9312R7112
$$ plain form
14535 1750590 1365611 1907705 1875655 1558300 1888577 1752352 1605154 1852718 1674601 1737808
14525 1737808 2043255 2068284 1602774 2059549 2263769 2403664 2213949 2295911 2295176 2084090
14515 2084090 2193249 2423098 2507605 2273958 2391234 2297988 2383267 2923257 2638657 2509171
14505 2509171 2346351 2546670 2353260 2578722 2504416 2570178 2671268 2728267 2680641 2552389
14495 2552389 2671266 2837383 2999507 2887097 3018707 2741661 3158664 2971844 2901935 2842951
14485 2842951 3121605 3032460 3051701 3271063 3211277 3603816 3316963 3341307 3327579 3450961
14475 3450961 3459670 3561920 3636313 3420937 3362232 3863297 3674894 3552587 3603217 3801791
14465 3801791 3658349 3945905 3869344 3849448 3897486 3934027 4328154 4057386 4181004 3973375
$$ packed form
14535A750590l84979N42094l2050l17355L30277j36225j47198K47564j78117O3207
14525A737808L05447K5029m65510M56775K04220J39895j89715Q1962p35k11086
14515B084090J09159K29849Q4507k33647J17276r3246Q5279N39990k84600j29486
14505B509171j62820K00319j93410K25462p4306O5762J01090N6999m7626j28252
14495B552389J18877J66117J62124j12410J31610k77046M17003j86820o9909n8984
14485B842951K78654q9145J9241K19362n9786L92539k86853K4344j3728J23382
14475C450961Q709J02250P4393k15376n8705N01065j88403j22307N0630J98574
14465C801791j43442K87556p6561j9896M8038L6541L94127k70768J23618k07629
$$ plain form
14455 3973375 4389250 4257437 4420379 4383263 5055984 4445181 4753976 4685924 4730673 5147798
14445 5147798 4417258 4808645 4650809 5162698 5353962 4979763 5330460 5517306 5703807
14436 5703807 5374354 5550098 5425156 5706685 5850444 6010950 6271115 6249043 5812731 6449606
14426 6449606 6764641 6062655 6457309 6404355 6238292 7033004 6506144 7241366 7243363 6933478
14416 6933478 7423839 7279841 7530928 7787438 7819196 7786385 7918445 8207010 8105424 7910619
14406 7910619 8356900 8298132 8415992 8726294 8610939 8912018 9304788 9179997 9374874 9453583
14396 9453583 9583010 10064367 10007203 10014335 10212216 10603241 10899501 10742217 10895360 11094031
14386 11094031 11451282 11068778 12329894 12025409 12405329 12369507 12839649 12927526 13354791
$$ packed form
14455C973375M15875j31813J62942l7116O72721o10803L08795o8052M4749M17125
14445E147798p30540L91387j57836N11889J91264l74199L50697J86846J86501
14436E703807l29453J75744j24942K81529J43759J60506K60165k2072m36312O36875
14426F449606L15035p01986L94654n2954j66063P94712n26860P35222J997l09885
14416F933478M90361j43998K51087K56510L1758l2811J32060K88565j01586j94805
14406G910619M46281n8768J17860L10302j15355L01079L92770j24791J94877P8709
14396I453583J29427M81357n7164P132J97881L91025K96260j57284J53143J98671
14386A1094031L57251l82504J261116l04485L79920l5822M70142Q7877M27265
$$ plain form
14377 13354791 13328323 13427384 14106732 14190694 14618519 14956070 14995408 15593269 15683504 16330658
14367 16330658 16193047 16708386 17005356 17681998 17869084 18035251 18682410 19150171 19701644
14358 19701644 20018399 20255683 20774665 21563790 21723268 22862738 22890752 23460096 24063672
14349 24063672 24452087 25281037 25790126 26292860 27200428 28085625 28650941 29483097 30421707
14340 30421707 31337734 31848723 32916913 34093948 34930601 35738344 36985311 38015094 38866630
14331 38866630 40264166 41750172 42702672 44312499 45696586 47397871 48838837 50590409
14323 50590409 52367910 54180826 56002272 58314716 60204103 62853120 65026288 67393360
14315 67393360 70269560 73075088 76091059 78978258 82554904 86160319 90079085 93717667
$$ packed form
14377A3354791k6468R9061O79348Q3962M27825L37551L9338N97861R0235O47154
14367A6330658j37611N15339K96970O76642J87086J66167O47159M67761N51473
14358A9701644L16755K37284N18982P89125J59478J139470K8014N69344O03576
14349B4063672L88415Q28950N09089N02734R07568Q85197N65316Q32156R38610
14340C0421707R16027N10989J068190J177035Q36653Q07743J246967J029783Q51536
14331C8866630J397536J486006R52500J609827J384087J701285J440966J751572
14323E0590409J777501J812916J821446K312444J889387K649017K173168K367072
14315F7393360K876200K805528L015971K887199L576646L605415L918766L638582
$$ plain form
14307 93717667 97888847 102626703 107434324 112275123 117781579 123574250 129581795 136429413
14299 136429413 143298785 150641214 158537147 167127127 175790828 185150338 195712126 206404019
14291 206404019 217861426 229676026 242337542 256004754 270035624 284276329 299442264
14284 299442264 314816463 330366321 346577529 362295468 377667851 392868243 406601748
14277 406601748 419673835 431071270 441063002 448714071 452108981 449955921 447493624 445972978
14269 445972978 444246155 438311828 431095110 422131325 410934285 398102901 384059785
14262 384059785 369534741 353466692 336904947 320750134 304714305 289336948 274149512
14255 274149512 260394975 247007251 234116413 221775935 209666956 198795392 188268835
$$ packed form
14307I3717667M171180M737856M807621M840799N506456N792671O007545O847618
14299A36429413O869372P342429P895933Q589980Q663701R359510J0561788J0691893
14291B06404019J1457407J1814600J2661516J3667212J4030870J4240705J5165935
14284B99442264J5374199J5549858J6211208J5717939J5372383J5200392J3733505
14277D06601748J3072087J1397435R991732P651069L394910k153060k462297j520646
14269D45972978j726823n934327p216718q963785j1197040j2831384j4043116
14262C84059785j4525044j6068049j6561745j6154813j6035829j5377357j5187436
14255B74149512j3754537j3387724j2890838j2340478j2108979j0871564j0526557
$$ plain form
14248 188268835 178811834 169451700 160797923 153195753 145787673 138597341 131790317 125529159
14240 125529159 119730115 114310757 109377941 104679607 99833288 94961223 91174738 87407359
14232 87407359 84074704 81049626 77689663 74306592 71408439 68711253 66082329 63675376
14224 63675376 61217818 58937315 56867397 54927442 53352040 51247882 49391755 48065532
14216 48065532 46326048 45145797 43798308 42843027 41154940 39483620 38409123 37297749
14208 37297749 36623933 36047878 34764146 33434635 32787856 31623444 30692543 30317968 29845225
14199 29845225 28699308 27805733 26979658 26289369 25742173 25373596 24757731 23861891 23054912
14190 23054912 22615950 22124626 21872243 21442082 20683112 20622568 19673620 19314985 18793134
$$ packed form
14248A88268835r457001r360134q653777p602170p408080p190332o807024o261158
14240A25529159n799044n419358m932816m698334m846319m872065l786485l767379
14232H7407359l332655l025078l359963l383071k898153k697186k628924k406953
14224F3675376k457558k280503k069918j939955j575402k104158j856127j326223
14216D8065532j739484j180251j347489r55281j688087j671320j074497j111374
14208C7297749o73816n76055j283732j329511o46779j164412r30901l74575m72743
14199B9845225j145917q93575q26075o90289n47196l68577o15865q95840q06979
14190B3054912m38962m91324k52383m30161p58970o0544r48948l58635n21851
$$ plain form
14181 18793134 18310875 18240822 17676692 17255920 17143105 16665860 16309981 16313951 15569141 15271498
14171 15271498 15096269 15131500 14346865 14058890 13808653 13907549 13798145 13317975 13231918 12842884
14161 12842884 12843370 12288114 12173025 12487442 12014114 11858703 11324571 10991053 11000805 10992372
14151 10992372 10548897 10283699 10340869 10161311 9987779 9671784 9783361 9492796 9323020
14142 9323020 8907798 8979393 8827141 8886377 8642653 8345795 8466039 8225581 8359076 8191982
14132 8191982 7873368 8019375 7805539 7257607 7598365 6971506 7180698 7350839 7377026 6719080
14122 6719080 6836434 6864025 6809448 6522397 6472728 6283671 6382324 5987060 6349232 6450748
14112 6450748 5960210 6171508 5877127 5628373 5458556 5616882 5760115 5420901 5613592
$$ packed form
14181A8793134m82259p0053n64130m20772j12815m77245l55879L970p44810k97643
14171A5271498j75229L5231p84635k87975k50237R8896j09404m80170q6057l89034
14161A2842884M86n55256j15089L14417m73328j55411n34132l33518R752q433
14151A0992372m43475k65198N7170j79558j73532l15995J11577k90565j69776
14142I323020m15222P1595j52252N9236k43724k96858J20244k40458J33495j67094
14132H191982l18614J46007k13836n47932L40758o26859K09192J70141K6187o57946
14122F719080J17354K7591n4577k87051m9669j89057R8653l95264L62172J01516
14112F450748m90538K11298k94381k48754j69817J58326J43233l39214J92691
$$ plain form
14103 5613592 5458547 5400883 5204785 5100108 5187125 4802436 5111368 4871690 4836734 4729737
14093 4729737 4904049 4577164 4826976 4503813 4674054 4623448 4682944 4404270 4643711 4285727
14083 4285727 4385947 4412834 4387508 4171799 4396343 3952093 4208865 4121620 4391284 3917747
14073 3917747 3726537 3822718 3453736 3949626 3961310 3689551 3725784 3726891 3673874 3693850 3392204
14062 3392204 3613802 3465669 3484649 3322619 3551361 3400088 3350963 3184925 3390023 3236666
14052 3236666 3159707 3131274 3237471 3081847 3052429 3086578 3010369 2934831 2899782 2923766 2749580
14041 2749580 2892450 2889107 2915839 2807159 2715910 2434427 2474684 2558236 2885566 2781399
14031 2781399 3071336 3127496 2636453 2750390 2246131 2521090 2365797 2600140 2289638 2731419
$$ packed form
14103E613592j55045n7664j96098j04677Q7017l84689L08932k39678l4956j06997
14093D729737J74312l26885K49812l23163J70241n0606N9496k78674K39441l57984
14083D285727J00220K6887k5326k15709K24544m44250K56772q7245K69664m73537
14073C917747j91210R6181l68982M95890J1684k71759L6233J107n3017J9976l01646
14062C392204K21598j48133J8980j62030K28742j51273m9125j66038K05098j53357
14052C236666p6959k8433J06197j55624k9418L4149p6209p5538l5049K3984j74186
14041B749580J42870l343K6732j08680r1249k81483M0257Q3552L27330j04167
14031B781399K89937N6160m91043J13937n04259K74959j55293K34343l10502M41781
$$ plain form
14021 2731419 2508381 2804435 2004840 2294360 2200114 2432414 2057141 2297541 2128299 2270777
14011 2270777 1939768 1675167 2221415 1939278 1656918 2094431 1926509 1888193 1918892 2258609
14001 2258609 2188391 1984436 1604179 1846002 1929117 1555653 1873358 1542129 1630108 1661069
13991 1661069 1881456 2288792 2494819 5258694 12587155 32308554 47407531 22734502
13982 10505924 6867400 4692797 4193202 3674301 3246215 2994007 2931560 2608863 2542675
13973 2542675 2319545 2215565 2136280 2107091 1996679 2030517 2305095 2166745 1960132 1801138
13963 1801138 1965656 2134302 1889021 1843632 1886171 2051556 1661776 2014685 1596436 1840985
13953 1840985 1753728 1582936 1791079 1729435 1601463 1519807 1791901 1683631 1617104 1618457
$$ packed form
14021B731419k23038K96054p99595K89520r4246K32300l75273K40400j69242J42478
14011B270777l31009k64601N46248k82137k82360M37513j67922l8316L0699L39717
14001B258609p0218k03955l80257K41823Q3115l73464L17705l31229Q7979L0961
13991A661069K20387M07336K06027K763875P328461J9721399J5098977B2734502
13982A0505924l638524k174603m99595n18901m28086k52208o2447l22697o6188
13973B542675k23130j03980p9285k9189j10412L3838K74578j38350k06613j58994
13963A801138J64518J68646k45281m5389M2539J65385l89780L52909m18249K44549
13953A840985q7257j70792K08143o1644j27972q1656K72094j08270o6527J353
$$ plain form
13943 1618457 1533361 1771519 1413352 1376450 1565214 1338427 1613910 1812376 1523329 1468851
13933 1468851 1337231 1367666 1429703 1554701 1253865 1435711 1446422 1360972 1394360 1257063
13923 1257063 1271902 1342200 1301206 1261324 1274891 1137900 1182200 1192064 1543184 1232265 1117666
13912 1117666 1533129 856765 1315991 1133160 1368449 1318851 1527112 1166325 1228371 1537023
13902 1537023 1366558 1175608 1072565 1236295 1271362 1019186 1322658 615468 1165312 899120
13892 899120 1158925 984900 1223007 1018074 1096966 1046508 956713 1031359 1079812 1017297 887853
13881 887853 983382 1060969 1005294 957779 1078053 1220148 894772 992852 850363 720016
13871 720016 1083580 904490 850596 1009228 1043652 1031794 830114 1021046 1221302 791111
$$ packed form
13943A618457q5096K38158l58167l6902J88764k26787K75483J98466k89047n4478
13933A468851j31620L0435O2037J24998l00836J81846J0711q5450L3388j37297
13923A257063J4839P0298m0994l9882J3567j36991M4300R864L51120l10919j14599
13912A117666M15463o76364M59226j82831K35289m9598K08261l60787O2046L08652
13902A537023j70465j90950j03043J63730L5067k52176L03472F15468N49844k66192
13892H99120K59805j74025K38107k04933P8892n0458q9795P4646M8453o2515j29444
13881H87853R5529P7587n5675m7515J20274J42095l25376R8080j42489j30347
13871G20016L63564j79090n3894J58632L4424j1858k01680J90932K00256m30191
$$ plain form
13861 791111 818764 1210629 931931 1125006 1078465 938236 1004362 740639 961629 787731
13851 787731 820423 824558 657509 911773 930467 700203 1112893 883633 1181419 478044
13840 845467 914960 688517 696340 764500 855399 744567 948754 907559 859181 656639 879895
13829 879895 968183 823684 608202 587821 973618 760749 1012037 977023 1003309 834192
13819 834192 732824 657504 810221 741110 680578 510112 746735 776858 451823 415489
13809 415489 906474 812341 676898 770166 748771 772355 713801 956064 643177 1209744
13799 1209744 690295 773701 767791 439807 684674 766774 883537 933490 460925 715078
13789 715078 741084 1150155 548186 662109 829247 470589 619030 619086 828585 1104637
$$ packed form
13861G91111K7653L91865k78698J93075m6541j40229O6126k63723K20990j73898
13851G87731L2692M135j67049K54264J8694k30264M12690k29260K97786D78044
13840H45467O9493k26443P823O8160R0899j10832K04187m1195m8378k02542K23256
13829H79895Q8288j44499k15482k0381L85797k12869K51288l5014K6286j69117
13819H34192j01368p5320J52717o9111o0532j70466K36623L0123l25035l6334
13809D15489M90985r4133j35443R3268k1395K3584n8554K42263l12887N66567
13799A209744n19449Q3406n910l27984K44867Q2100J16763M9953D60925K54153
13789G15078K6006M09071E48186J13923J67138l58658J48441N6K09499K76052
$$ plain form
13779 1104637 734187 758318 425023 801643 580656 635183 498531 826969 629951 646723
13769 646723 647578 508939 647908 573246 478402 552917 505577 706614 519856 468973 610708
13758 610708 347008 514194 628569 800136 305074 285204 567066 714648 698278 581411
13748 581411 721538 719258 876772 719848 565406 774526 145546 762565 860906 684319
13738 684319 449196 563173 613384 690734 601112 615917 713464 428849 763869 430410
13728 430410 553845 682410 446731 768230 728321 650066 281362 594239 570269 681519
13718 681519 653265 405518 670394 297557 469093 306530 712534 393144 250877 377592
13708 377592 402975 754891 512118 262333 493165 484400 344442 136115 313336 564435
$$ packed form
13779A104637l70450K4131l33295L76620k20987N4527j36652L28438j97018J6772
13769F46723Q55j38639J38969p4662r4844P4515m7340K01037j86758n0883J41735
13758F10708k63700J67186J14375J71567C05074j9870K81862J47582j6370j16867
13748E81411J40127k280J57514j56924j54442K09120A45546O17019R8341j76587
13738F84319k35123J13977N0211P7350q9622J4805R7547k84615L35020l33459
13728D30410J23435J28565k35679L21499l9909p8255B81362L12877k3970J11250
13718F81519k8254k47747K64876B97557J71536j62563M06004l19390j42267J26715
13708C77592K5383L51916k42773k49785K30832q765j39958A36115J77221K51099
$$ plain form
13698 564435 591100 501099 194265 210675 517893 360743 533880 181973 267437 380014
13688 380014 622521 634746 446780 573338 443267 355288 345420 447491 467018 499113 107603
13676 516007 356779 454965 289262 445295 524407 672742 315700 333082 499340 89348
13665 526946 503839 483837 602265 307315 380908 436653 582632 136189 417319 326428
13655 326428 169717 392751 99449 519088 267096 352406 166580 547465 167268 117672
13645 117672 352712 421885 365513 193733 609745 409227 555272 401992 424681 192828
13634 390347 247500 435403 370797 275951 439546 187200 255223 255902 583722 384018 154892
13622 521752 554006 292123 116180 150181 43425 168968 84139 525998 257979 562803
$$ packed form
13698E64435K6665r0001A94265J6410L07218j57150J73137A81973Q5464J12577
13688C80014K42507J2225j87966J26558j30071q7979r868J02071J9527L2095A07603
13676E16007j59228R8186j65703J56033P9112J48335C15700J7382J66258H9348
13665E26946k3107k0002J18428k94950P3593N5745J45979A36189K81130r0891
13655C26428j56711K23034I9449M19639k51992Q5310A66580L80885A67268m9596
13645A17672K35040O9173n6372j71780M16012k00518J46045j53280K2689A92828
13634C90347j42847J87903o4606r4846J63595A87200O8023O79L27820j99704A54892
13622E21752L2254k61883A16180L4001D3425J25543H4139M41859B57979L04824
$$ plain form
13612 562803 278709 453991 477090 331876 208066 343406 145933 178131 97501 482362
13602 482362 169254 296093 241125 621244 126809 623044 231537 90267 247690 16114
13591 16752 370217 500134 427298 198095 548330 668354 546567 125740 266113 354806
13581 354806 13845 475348 58339 27580 540283 362252 109196 384882 417349 415183 196311
13569 165209 494177 140254 269570 206726 338684 456393 537713 106135 43740 156917
13559 156917 232366 170941 364515 315688 194899 503324 247358 242579 162830 718390 269936
13547 400317 -134232 -1047 319775 373808 13904 708260 74001 333500 180107 357711
13537 357711 245559 367694 106224 52896 428348 204481 268548 264768 187202 151818 216513
$$ packed form
13612E62803B78709J75282K3099j45214j23810J35340A45933L2198q0630L84861
13602D82362A69254J26839n4968L80119A26809M96235B31537I0267J57423A6114
13591A6752L53465J29917p2836A98095L50235J20024j21787A25740J40373Q8693
13581C54806A3845M61503E8339B7580N12703j78031A09196K75686L2467k166A96311
13569A65209L28968A40254J29316o2844J31958J17709Q1320A06135D3740J13177
13559A56917P5449o1425J93574m8827j20789L08425B47358m779p9749N55560B69936
13547D00317a34232a047C19775N4033A3904O94356G4001K59499j53393J77604
13537C57711j12152J22135A06224E2896L75452B04481O4067l780p7566l5384O4695
$$ plain form
13526 216513 154985 353038 518558 192762 287005 143118 87543 -130133 190250 273743
13516 273743 -208190 342279 -14757 297716 148826 297993 107072 282253 103886 103397
13506 103397 383563 209544 -220034 404263 465867 525515 62400 314080 172183 207661
13496 207661 233212 246715 424649 303610 315621 94473 535827 271155 195561 155291 426996
13485 426996 173548 393876 350345 245413 308064 60410 31765 275428 351335 72268 135659
13474 135659 210647 196083 441295 478681 469320 251008 148099 -51858 168118 150127 264285
13463 264285 338911 390172 182331 51229 386731 219915 32925 174495 410158 195091
13452 13457 186356 -54212 241934 127170 133048 180489 63295 237791 225921 82660 443523
$$ packed form
13526B16513o1528J98053J65520A92762R4243A43118n5575a30133A90250Q3493
13516B73743b08190C42279a4757B97716A48826J49167A07072J75181A03886m89
13506A03397K80166j74019b20034D04263O1604N9648F2400K51680j41897L5478
13496B07661K5551J3503J77934j21039J2011I4473M41354k64672p5594m0270K71705
13485D26996A73548K20328m3531j04932O2651F0410k8645K43663P5907G2268O3391
13474A35659P4988j4564K45212L7386r361k18312j02909e1858A68118j7991J14158
13463B64285P4626N1261A82331E1229L35502j66816C2925J41570K35663A95091
13452A3457J72899e4212B41934j14764N878M7441F3295J74496j1870H2660L60863
$$ plain form
13441 443523 317970 145304 308975 95690 397231 44273 111584 369355 70570 -303543
13430 243813 218022 -123463 196091 128162 154637 4248 566669 181796 375183 -199086
13419 200827 237328 91212 158696 421340 121533 307438 100247 206157 527930 -35441
13408 210237 321608 172192 302628 396834 -43462 -141562 492210 86395 296611 497946
13398 497946 367048 164303 -109856 190797 148987 122753 -30335 98696 299612 -36936
13387 -117418 -42545 160573 335216 -102074 131999 -12255 232209 275767 437530 -125455
13376 119937 279045 185768 573125 -150549 236759 261150 168367 303330 406225 342509
13366 342509 112571 363901 112744 -45856 347424 183480 -161019 235558 500829 216187
$$ packed form
13441D43523j25553A45304J63671I5690L01541D4273O7311K57771G0570c03543
13430B43813k5791a23463A96091o7929K6475D248N62421A81796J93387a99086
13419B00827L6501I1212O7484K62644A21533J85905A00247J05910L21773c5441
13408B10237J11371j49416J30436R4206d3462r8100D92210H6395K10216K01335
13398D97946j30898A64303a09856A90797m1810k6234c0335I8696K00916c6936
13387a17418d2545A60573J74643a02074A31999a2255B32209M3558J61763a25455
13376A19937J59108r3277L87357a50549B36759K4391r2783J34963J02895o3716
13366C42509A12571K51330A12744d5856C47424j63944a61019B35558K65271B16187
$$ plain form
13355 4799 -27770 150197 817 52225 562437 -54882 379193 -134460 325915 354537 118994
13343 384625 569002 485870 419245 153294 335695 24939 179418 154217 2671 537103 158873
13331 473254 264161 140419 238977 316466 354423 151548 -7952 158708 418214 202441
13320 93241 168440 263914 178219 137647 236031 187491 112537 157402 251384 305905 234798 226823
13308 226823 249738 515030 70395 -59454 -202354 310953 228515 224913 -94034 -58091 400615
13296 154540 -34902 39033 262682 -168244 45089 582 488701 75678 307854 -373780 149229
13284 193093 37895 24534 39469 262660 341766 182758 45805 119711 440367 -37681 397046
13272 -10131 51515 36495 18009 241515 187602 160232 248563 99200 18127 108271 87675
$$ packed form
13355D799b7770A50197H17N1408N10212e4882C79193a34460C25915K8622A18994
13343C84625J84377q3132o6625A53294J82401B4939J54479k5201B671N34432A58873
13331D73254k09093j23742R8558P7489L7957A51548g952A58708K59506B02441
13320I3241P5199R5474q5695m0572R8384m8540p4954M4865R3982N4521p1107p975
13308B26823K2915K65292G0395e9454j42900C10953q2438l602i4034L5943D00615
13296A54540c4902C9033K23649a68244D5089E82M88119G5678K32176c73780A49229
13284A93093C7895j3361J4935K23191P9106j59008D5805P3906L20656c7681C97046
13272a0131E1515j5020A8009K23506n3913k7370Q8331I9200A8127R0144k0596
$$ plain form
13261 87675 186457 -99012 219999 38760 147350 451156 27951 216454 -55063 90882 156578
13250 156578 35157 146311 133605 -33020 190025 30082 -275965 284662 269217 125719
13239 115390 150813 -48947 -314274 11531 147128 218162 125769 -110419 92391 30867 272597
13228 272597 124623 224490 123290 -161811 401412 158781 66970 434946 108300 5956
13217 -142861 -204259 187030 -99606 137878 217099 183878 -60782 109126 7451 -191176 98696
13205 -148357 258826 144462 395072 -145482 101955 79102 -99006 -281607 283655 -190431
13194 134107 323170 -28339 66887 147866 36092 95817 -264037 411778 -200861 -164831 615968
13182 179088 443537 -16910 48534 205466 230899 35475 -67579 -88077 -100269 -375137 -83362
$$ packed form
13261H7675R8782i9012B19999C8760J08590L03806B7951J88503e5063I0882O5696
13250A56578C5157J11154j2706c3020A90025C0082b75965B84662j5445A25719
13239A15390L5423d8947k65327A1531J35597P1034r2393a10419I2391C0867K41730
13228B72597A24623R9867j01200a61811D01412A58781F6970L67976A08300E956
13217a42861o1398A87030i9606A37878P9221l3221f0782A09126G451a91176I8696
13205a48357B58826j14364K50610a45482A01955k2853i9006j82601B83655a90431
13194A34107J89063b8339F6887Q0979C6092N9725b64037D11778b00861L6030F15968
13182A79088K64449a6910D8534J56932K5433C5475f7579k0498j2192k74868h3362
$$ plain form
13170 167619 237907 -53812 248700 -207366 270017 107419 29265 208895 242283 18209
13159 285356 108157 -225675 149478 26472 269416 -14097 315937 67167 194860 -168543
13148 66833 68079 214075 -257765 -187477 -46510 133553 2407 -124608 156124 67464 408155
13137 408155 23310 24519 142050 65857 -46602 -166377 296387 74202 -119892 -246978 -199329
13126 -199329 -4832 2238 -103823 -58668 348621 116086 180311 26695 19483 33440 284561
13115 284561 181122 157382 -10708 -73553 428488 144773 -92771 116502 26903 -114240
13104 182823 -40900 7182 -42725 56898 -148131 -22323 155010 -341881 30108 -153508 217926
13092 139444 313308 104865 301515 198232 -97755 128648 205476 30946 211043 231556
$$ packed form
13170A67619P0288e3812B48700b07366B70017A07419B9265J79630L3388A8209
13159B85356A08157b25675A49478B6472K42944a4097C15937F7167J27693a68543
13148F6833J246J45996b57765P0288d6510A33553B407a24608A56124F7464L40691
13137D08155B3310J209J17531F5857d6602j19775B96387G4202a19892j27086M7649
13126a99329d832B238a03823M5155C48621A16086O4225B6695p212J3957K51121
13115B84561j03439k3740a0708o2845D28488A44773i2771A16502B6903a14240
13104A82823d0900G182d2725E6898a48131b2323A55010c41881C0108a53508B17926
13092A39444J73864A04865J96650j03283i7755A28648P6828C0946J80097K0513
$$ plain form
13082 231556 204417 203567 46252 191782 271392 190790 -10529 -45544 257132 -156095 142354
13070 126657 -33861 19244 61091 83518 -115727 116137 36095 -71027 471513 212397 119650
13059 119650 251149 152045 387011 217909 41084 87171 179308 120020 -99016 68937 -139002
13047 174997 101002 -111591 -78541 48938 -132971 20818 226098 208154 -425471 264490
13036 146219 8514 53833 87990 262587 324791 238225 43705 86462 9536 94357 152760 289288
13024 289288 314908 74055 372340 137102 185699 -36364 141393 315889 -344121 242077
13013 227744 222942 81442 -28533 97940 40081 175518 250858 348477 449221 230577 11468
13001 -270340 9317 -1855 177391 172637 67565 -11027 249358 140719 276098 338403 -313726
$$ packed form
13082B31556k7139q50D6252J45530P9610q0602a0529l5015B57132a56095A42354
13070A26657c3861A9244M1847K2427a15727A16137C6095g1027D71513B12397r2747
13059A19650J31499r9104K34966j69102D1084M6087R2137n9288i9016F8937a39002
13047A74997p3995a11591L3050D8938a32971B0818K05280j7944d25471B64490
13036A46219H514M5319L4157J74597O2204q6566D3705M2757I536Q4821N8403J36528
13024B89288K5620G4055K98285A37102M8597c6364A41393J74496c44121B42077
13013B27744m802H1442b8533I7940D0081J35437P5340R7619J00744k18644A1468
13001b70340I317a855A77391m754F7565a1027B49358j08639J35379O2305c13726
$$ plain form
12989 -43890 -223085 94881 231704 -29750 -10300 71175 119352 80037 55086 -98337 -218472
12978 -218472 -48863 -219598 6480 -4712 299757 52179 -201343 21606 -21558 183237 -92096
12966 80878 76305 -100213 106048 66129 374636 -247632 108168 -43519 -286983 318849
12955 190507 109345 -147647 -29838 -68447 -82078 183136 77153 338704 198473 -87402 68279
12943 126218 137420 -86799 344110 140666 -180499 -198737 142053 -232169 182618 155546
12933 155546 -113845 -293600 -148434 102579 -242627 -111330 -341118 -1955 577299 288204
12922 -94992 371412 -22736 99062 -64785 213067 192391 257932 96958 -64284 -138524 23201
12910 110471 -495 -7576 -73317 146116 81439 39525 -504574 91788 -161038 117421 89550
$$ packed form
12989d3890j79195I4881J36823b9750a0300G1175M8177l9315k4951i8337j20135
12978b18472d8863j70735F480d712B99757E2179b01343B1606b1558A83237i2096
12966H0878m573a00213A06048l9919L08507b47632A08168d3519k43464C18849
12955A90507q1162a47647b9838l8609j3631A83136G7153K61551j40231h7402F8279
12943A26218J1202h6799C44110A40666a80499j8238A42053b32169A82618k7072
12933A55546a13845j79755J45166A02579b42627a11330k29788a955E77299B88204
12922i4992C71412b2736I9062f4785B13067k0676O5541I6958f4284p4240B3201
12910A10471d95p081o5741A46116o4677C9525e04574I1788a61038A17421k7871
$$ plain form
12899 89550 -83722 167300 18845 114926 156896 -271894 272830 100551 -139455 -930 34386
12887 85523 92294 -102258 129746 186778 -45023 -139588 -166373 114991 34792 142998 65320
12875 -327297 -19869 27595 255930 38679 30976 -77946 153621 -6652 -112815 141920 -108130
12863 -157493 -36788 -26731 -25488 -90304 117670 -28861 342865 -48479 -163314 -85284 103645
12851 -148172 120041 204456 439824 -11180 -154391 -126897 32993 -25375 229195 137284 143488
12840 143488 153518 5128 155554 50900 145062 -396519 10366 -43620 -12803 -53808 271750
12828 -215038 235139 172135 31959 -102276 -55134 -1164 -19 -165888 60246 11262 79970 -120813
12815 -119454 136613 259282 273555 99996 -69555 -54397 -160713 -28505 73195 -256188 121027
$$ packed form
12899H9550h3722A67300A8845R6081M1970b71894B72830A00551a39455i30C4386
12887H5523O771a02258A29746N7032d5023r4565k6785A14991C4792J08206F5320
12875c27297a9869B7595K28335C8679p703g7946A53621f652j06163A41920a08130
12863a57493c6788J0057J243o4816A17670b8861C42865d8479j14835P8030A03645
12851a48172A20041Q4415K35368a1180j43211K7494C2993b5375B29195r1911O204
12840A43488J0030E128J50426E0900R4162c96519A0366d3620a2803m1005B71750
12828b15038B35139o3004C1959a02276M7142a164a9j65869F0246A1262O8708a20813
12815a19454A36613J22669J4273I9996f9555J5158j06316b8505G3195b56188A21027
$$ plain form
12803 492390 46294 179795 114001 -45346 284746 -367398 -98350 -148242 -98228 -65411 -58280
12792 -58280 3398 323711 139706 185652 -323555 160484 63824 309486 -16398 124519 -114782
12780 -123296 79910 -30597 -130273 112904 -20002 -67249 -181430 361010 -263635 145732
12769 319020 -183363 28032 -273791 -232388 -303838 -32218 -108311 -202041 230798 84003 -178977
12757 36443 -162205 -213813 -144888 45301 -270154 19857 71696 -10784 129587 -157712 -169926
12746 -169926 54537 -84191 -65562 127535 -88394 -22000 138295 240236 234499 -228684 148032
12734 19707 127518 4649 104636 50191 -110252 -51913 169764 129823 -426512 226581 65355
12722 -201526 76580 -200701 309215 104963 -207165 150800 -116155 51289 126604 -90576
$$ packed form
12803D92390D6294J33501o5794d5346B84746c67398i8350m9892N0014L2817P131
12792e8280C398L20313A39706M5946c23555A60484F3824K45662a6398A24519a14782
12780a23296G9910c0597r9676A12904b0002m7247j14181C61010b63635A45732
12769C19020a83363B8032b73791M1403p1450c2218p6093r3730B30798H4003a78977
12757C6443a62205n1608O8925D5301b70154A9857N1839a0784A29587a57712j2214
12746a69926E4537h4191J8629A27535h8394b2000A38295J01941n737b28684A48032
12734A9707J07811D649R9987E0191a10252e1913A69764l9941d26512B26581F5355
12722b01526G6580b00701C09215A04963b07165A50800a16155E1289P5315i0576
$$ plain form
12711 290035 -60139 55367 298817 147679 63969 94286 179486 202039 -28421 -140545 98112
12699 83319 61336 -227718 10400 250085 181019 98778 177931 241267 -177623 -124887 81885
12687 39033 61099 281747 230725 386444 -86429 -39767 347946 180123 -46996 9296 332683
12676 332683 104368 58849 313177 -20830 345289 -89170 -14361 -238366 186485 128676
12666 128676 106501 248419 204219 459807 -186813 270466 235089 275481 390292 103443
12655 -132507 294543 -307071 -213095 247905 234713 156817 -95687 -118989 426191 119151
12644 255801 38429 106852 103513 313687 40090 179821 -101027 63105 74232 200540 -355565
12632 215624 263189 431851 -43546 304891 -50670 338295 440997 346077 271663 85676 195980
$$ packed form
12711B90035f0139E5367K43450A47679F3969L0317Q5200K2553b8421j12124I8112
12699H3319k1983b27718A0400K39685o9066q2241P9153O3336a77623N2736H1885
12687C9033K2066K20648n1022J55719h6429c9767C47946j67823d6996I296L23387
12676C32683A04368m5519K54328b0830C45289h9170a4361k24005A86485n7809
12666A28676k2175J41918m4200K55588a86813B70466l5377M0392J14811A03443
12655a32507B94543c07071R3976B47905j3192p7896i5687k3302D26191A19151
12644B55801C8429O8423l339K10174D0090J39731a01027F3105J1127J26308c55565
12632B15624M7565J68662d3546C04891e0670C38295J02702r4920p4414H5676J10304
$$ plain form
12621 195980 176608 -35573 70914 -57960 -1304 372257 117576 83740 -77016 8046 112331
12610 112331 -150824 318294 9116 136838 -62503 -111992 -87252 126526 147734 113534 101655
12599 101655 255700 -200961 292431 199207 54929 -71498 -187570 415817 -220634 22429
12588 -130228 -120863 158787 40092 110614 -129307 259565 125165 -74305 -362491 -20505 -65814
12577 -65814 256785 -1899 222165 179354 -80722 -17877 40312 6582 235951 113723 213869
12566 213869 -35589 65973 15371 -191563 -25795 98977 -41281 -211341 210306 -96252 179441
12554 520620 -58495 326503 79576 23337 -97681 -713 176810 -149704 -147017 168487 6427
12542 86603 307040 -80966 17022 -155105 332712 -168967 -21484 95537 -396327 18404 304511
$$ packed form
12621A95980j9372c5573G0914e7960a304C72257A17576l3836g7016H046J04285
12610A12331a50824C18294I116J27722f2503m9489K4740A26526K1208l4200j1879
12599A01655J54045b00961B92431r3224E4929g1498j16072D15817b20634B2429
12588a30228R365A58787D0092P0522a29307B59565A25165g4305k88186b0505m5309
12577f5814B56785a899B22165m2811h0722a7877D0312F582K29369A13723J00146
12566B13869c5589F5973A5371a91563b5795I8977d1281j70060B10306i6252A79441
12554E20620e8495C26503G9576B3337i7681g13A76810a49704K687A68487F427
12542H6603K20437h0966A7022a55105C32712a68967b1484I5537c96327A8404K86107
$$ plain form
12531 304511 96562 256831 237898 14307 58715 85256 48053 -9764 122425 27809 178897
12520 178897 -405262 231158 -36614 -146782 100191 3138 -172679 -206813 381816 -143492
12509 72729 55740 19402 -106728 -338582 50011 117570 -423721 -22221 -58912 -112616 384303
12497 171989 113459 -186418 -172781 96125 79119 85920 -12473 -115485 110026 157777 64170
12485 -108174 -41278 133219 -36463 -179201 -69368 102276 -7805 -167503 -180722 -74041 16090
12473 40294 95008 10751 63072 -36430 161861 -34721 364219 194713 194182 -70798 -114185
12462 -114185 83161 -70757 -3219 -250883 -57183 -346396 -16029 165629 -267490 58955 -63010
12450 161602 69152 53468 173177 -202308 -169532 228570 -63758 -24146 23775 -198253 105174
$$ packed form
12531C04511I6562J60269j8933A4307M4408K6541l7203i764A22425B7809J51088
12520A78897d05262B31158c6614j10168A00191C138a72679l4134C81816a43492
12509G2729j6989A9402a06728k31854E0011O7559d23721b2221l6691n3704C84303
12497A71989n8530a86418J3637I6125j7006O801a2473j03012A10026M7751F4170
12485a08174d1278A33219c6463j42738f9368A02276g805j59698j3219g4041A6090
12473D0294N4714A0751N2321c6430A61861c4721C64219j69506n31g0798m3387
12462a14185H3161g0757c219k47664e7183k89213a6029A65629b67490E8955f3010
12450A61602F9152j5684J19709b02308L2776B28570f3758b4146B3775a98253A05174
$$ plain form
12438 -168496 -225208 -83875 -67915 60670 -217139 33784 -188655 155756 -70615 196543 15652
12426 -178007 119817 42868 276959 -118993 117559 322248 -40754 69761 334845 -100605
12415 87380 100738 332249 -25207 -435 144087 -120161 -73733 287789 -22320 -216879 -104452
12403 -72650 -114956 -5730 223002 -343109 25418 -269021 340053 122462 136392 38292 -141054
12391 34999 161213 -29976 156657 -7841 485015 -44571 -121630 -77819 141848 163729 232994
12380 232994 -161275 -78482 -247255 -87386 202444 -38336 -369500 -98587 -72515 -122894 -232538
12369 -232538 -186586 203455 71850 -123831 -78864 -154780 -355628 -313112 -156252 18021 287132
12358 287132 116163 -121754 -86079 227082 -69927 225049 -140399 -112040 -155958 -6740 141076
$$ packed form
12438a68496n6712h3875J5960F0670b17139C3784a88655A55756g0615A96543A5652
12426a78007A19817D2868K34091a18993A17559K04689d0754F9761K65084a00605
12415H7380J3358K31511b5207d35A44087a20161M6428B87789b2320j94559a04452
12403g2650m2306e730B23002c43109B5418b69021C40053A22462J3930C8292a41054
12391C4999J26214b9976A56657g841D85015d4571p7059M3811A41848K1881O9265
12380B32994a61275g8482j68773h7386B02444c8336l31164i8587K6072n0379j09644
12369b32538M5952B03455G1850a23831M4967p5916k00848M2516a56252A8021K69111
12358B87132A16163a21754L5675B27082f9927B25049a40399K8359m3918f740A41076
$$ plain form
12346 170220 -184728 63236 272757 166581 27585 113094 263611 28864 56440 108650 -48284
12334 -126397 209494 68846 -91699 393827 243945 -65531 -76855 182873 243535 -303773
12323 -69085 141161 -16805 93763 -220886 -49937 -99525 -41643 283277 -49621 -311222 52715
12311 -32660 82004 137873 -62401 -175271 -81040 189174 -212615 57210 -106183 17360 76076
12300 76076 -369249 54861 32492 -65540 -97904 -82722 170387 353158 196283 12441 51038
12289 51038 -272947 100631 129750 164344 135577 -22614 126884 90646 3266 -120158 -375586
12278 -375586 140669 170462 31749 349325 54939 66657 301780 82573 211972 126609 -241090
12266 331032 42863 275870 154675 -33609 132 223889 -86122 -11286 -316384 -93392 55041
$$ packed form
12346A70220a84728F3236K09521j06176B7585Q5509J50517B8864K7576N2210d8284
12334a26397B09494F8846i1699C93827j49882f5531j1324A82873O0662c03773
12323f9085A41161a6805I3763b20886d9937m9588d1643B83277d9621k61601E2715
12311c2660H2004N5869f2401j12870h1040A89174b12615E7210a06183A7360N8716
12300G6076c69249E4861k2369f5540l2364J5182A70387J82771j56875A2441L8597
12289E1038b72947A00631K9119L4594k8767b2614A26884l6238C266a20158k55428
12278c75586A40669K9793C1749L17576E4939J1718K35123H2573J29399q5363b41090
12266C31032D2863K33007j21195c3609A32K23757h6122a1286l05098i3392E5041
$$ plain form
12254 45813 -8541 217590 168553 122891 -117347 133519 -223400 -29346 247822 -494199 6906
12242 331040 139358 121639 123100 -173672 139762 -59103 58756 236538 245044 -637 -92171
12231 -92171 -118828 200173 -136356 -107761 429935 178578 388929 51076 30556 356015
12221 356015 483638 270243 -150460 -17981 196715 450897 -85864 57486 171545 73261
12210 577936 -168853 -31519 4023 228766 -1762 199796 36039 -110146 137047 -105482 348736
12198 311368 204398 507444 211141 237094 178971 266999 244435 172761 398282 557639
12188 557639 31115 240978 340981 55733 -156566 -78345 -26325 184157 -182814 357078
12177 -184355 307480 267503 160690 162290 144148 29728 125189 360172 263588 113764 -26083
$$ packed form
12254D5813h541B17590m9037m5662a17347A33519b23400b9346B47822d94199F906
12242C31040A39358j7719J461a73672A39762e9103E8756J77782Q506f37r1534
12231i2171k6657B00173a36356K8595D29935A78578K10351E1076k0520L25459
12221C56015J27623k13395a50460a7981A96715K54182h5864E7486J14059G3261
12210E77936a68853c1519D023K24743a762A99796C6039a10146A37047a05482C48736
12198C11368j06970L03046B11141K5953n8123Q8028k2564p1674K25521J59357
12188E57639C1115K09863J00003E5733a56566P8221b6325A84157a82814C57078
12177a84355C07480l9977j06813J600j8142B9728R5461K34983r6584A13764b6083
$$ plain form
12165 291998 147249 231022 227298 153139 160052 121164 202831 350814 367178 -92749 63665
12153 228628 73140 -155535 43577 209130 155064 -109277 68299 -35989 -135889 51291 -184017
12141 362031 235869 -101027 -31267 93318 -106597 -81504 1107 106832 35997 30059 27775
12130 27775 54955 36219 25564 99317 17316 265152 38810 90637 300451 124858 -149132
12118 -144164 -123569 -99023 184899 -32554 38193 48222 -205637 50928 -211288 -88058 91738
12106 -318237 -354921 44727 46491 143038 -16708 86615 48789 -113139 281808 -73649 145854
12094 260493 -201446 -332894 678 27139 53396 166100 -20933 138969 -140984 -77898 73586
12082 37296 116587 293362 211663 -160166 250574 -432428 401403 124434 728629 1923227
$$ packed form
12165B91998j44749Q3773l724p4159O913l8888Q1667J47983J6364i2749F3665
12153B28628G3140a55535D3577J65553n4066a09277F8299c5989r9900E1291a84017
12141C62031j26162a01027c1267I3318a06597K5093A107J05725C5997n938k284
12130B7775K7180j8736j0655P3753A7316K47836C8810N1827K09814A24858a49132
12118a44164K0595K4546A84899c2554C8193J0029b05637E0928b11288h8058I1738
12106c18237l6684D4727J764R6547a6708H6615l7826a13139B81808g3649A45854
12094B60493b01446j31448F78K6461K6257J12704b0933A38969a40984O3086G3586
12082C7296P9291J76775q1699a60166B50574d32428D01403A24434O04195J194598
$$ plain form
12072 1923227 2229294 760994 208184 44717 103781 97938 -192306 -131249 -212905 -74857 -79116
12061 -79116 3131 -85761 89731 -76983 -107118 131809 135828 295085 268872 -13007 -1439 -19914
12049 -19914 205962 -231826 209270 73290 -112125 258290 -143341 -193560 185375 -348083
12038 -302810 -16881 -90349 37520 -11099 -330808 -97150 -199538 -93165 83223 33061 -84619
12026 -166876 18863 75754 -200438 -102399 -122756 -5897 -45402 -38813 71565 -19227 226454
12014 39575 348858 -119655 108053 -219792 -228679 2361 -164192 300175 -79754 159130 82487
12003 82487 285228 -191296 106301 -63437 71812 -239564 127981 23760 -33980 229908
11992 -305825 38711 344942 -452584 99906 117918 162754 -260807 304335 -17132 13044 68549
$$ packed form
12072A923227L06067G60994B08184D4717N9064n843a92306O1057q1656g4857m259
12061g9116C131h5761H9731g6983l0135A31809M019J59257k6213a3007a439j8475
12049a9914B05962b31826B09270G3290a12125B58290a43341n0219A85375c48083
12038c02810a6881p3468C7520a1099l19709i7150j02388i3165H3223C3061h4619
12026a66876A8863N6891b00438R8039k0357e897l9505O589G1565a9227B26454
12014C9575L09283a19655A08053b19792q887B361a64192C00175g9754A59130p6643
12003H2487K02741a91296A06301f3437G1812b39564A27981B3760c3980B29908
11992c05825C8711L06231d52584I9906J8012M4836b60807C04335a7132A3044N5505
$$ plain form
11981 68549 151759 3087 148956 -147441 50639 -409568 313658 -117281 -49690 -83594 -35301
11969 -246998 233597 -180734 250906 59628 -109995 146083 41515 -198617 284951 -210583
11958 179706 125261 117081 -86779 -131211 -121410 -44204 -350074 -144397 -16403 -52320 50739
11946 196913 90126 -80087 182346 10507 -69643 -30202 -16225 -39728 -31682 -62119 -118021
11935 -118021 -94255 -125376 -2075 55351 -99685 42223 -135933 43814 -65994 -208142 532480
11923 -77868 93150 -185660 -80666 7260 -57121 228008 149513 173455 -243340 23670 -21015
11911 92378 -205737 112442 277509 -92154 -63042 31741 277326 14623 108633 218724 58695
11899 62864 -240088 250512 18024 -123728 24074 190801 64420 -101919 -202780 29526
$$ packed form
11981F8549Q3210C087J45869a47441E0639d09568C13658a17281d9690l3904c5301
11969b46998B33597a80734B50906E9628a09995A46083D1515a98617B84951b10583
11958A79706n4445q180h6779m4432R801d4204l05870a44397a6403l5917E0739
11946A96913I0126h0087A82346A0507f9643c0202J3977k3503Q046l0437n5902
11935a18021K3766l1121b075E5351i9685D2223a35933D3814f5994j42148E32480
11923g7868I3150a85660h0666G260e7121B28008p8495K3942b43340B3670b1015
11911I2378b05737A12442J65067i2154K9112C1741K45585A4623R4010J10091E8695
11899F2864b40088B50512A8024a23728B4074J66727F4420a01919j00861B9526
$$ plain form
11888 -113842 139730 278525 196298 -13407 -16412 170695 52405 -45379 -41496 33718 -96795
11876 -204794 -210296 -431855 -8544 24018 -134377 211349 110944 206089 -286854 70333 -64855
11864 -90725 -121488 135714 18938 -251934 110867 -18948 -141192 -201358 -296089 121090 225648
11853 225648 1158 -43860 27086 69411 88979 -416984 -324378 -138371 267040 -180610 -112634
11842 -112634 -80291 -175945 36035 -2788 230752 -81803 -119865 328286 -103148 115266 114764
11831 114764 -10670 -219885 187206 22771 -97783 195432 -190834 -10548 -243975 134237
11820 246543 -201661 -137113 25242 -326033 -143130 7641 -22049 -75121 21805 -1658 197497
11808 -48896 318423 -176785 -38204 -69147 -140511 -341351 849 -224808 15631 -14932 -200231
$$ packed form
11888a13842A39730J38795q2227a3407l005A70695E2405d5379L883C3718i6795
11876b04794n502k21559h544B4018a34377B11349j00405R5145b86854G0333f4855
11864i0725l0763A35714A8938b51934A10867a8948j22244o0166r4731A21090J04558
11853B25648A158d3860B7086M2325J9568d16984R2606a38371B67040a80610O7976
11842a12634L2343r5654C6035b788B30752h1803l8062C28286a03148A15266n02
11831A14764a0670k09215A87206B2771i7783A95432a90834a0548k33427A34237
11820B46543b01661O4548B5242c26033a43130G641b2049n3072B1805a658A97497
11808d8896C18423a76785c8204l0943p1364k00840H49b24808A5631a4932j85299
$$ plain form
11797 -200231 -178700 25753 -176716 -508643 -195235 51555 216498 192864 20009 -279458
11786 40227 -265028 -65981 63644 -86346 -83412 14952 399574 39869 411373 130473 -217323
11774 181292 -280964 -46395 -220115 256242 54383 -382732 -191691 538977 128466 -174937
11763 -134248 -223045 -144901 -2900 -276072 -292713 -59378 -34819 219258 271955 24207 -110957
11751 -24763 -38426 -4724 -73295 -71834 144949 3954 6341 203558 -221368 -159145 114756 49286
11738 197908 25256 -79995 -171472 -93845 -103472 -90990 275753 -19061 24686 -73534 -208175
11727 -208175 -253278 102399 275039 199602 -144389 126202 -36358 96531 174099 40854 35281
11716 35281 -144852 -188701 1176 190790 103195 9080 230201 2249 124975 153750 88801
$$ packed form
11797b00231K1531B5753a76716l31927a95235E1555J64943k3634B0009b79458
11786D0227b65028f5981F3644h6346K934A4952L84622C9869L71504A30473b17323
11774A81292b80964d6395j73720B56242E4383c82732J91041E38977A28466a74937
11763a34248q8797P8144b900k73172j6641e9378K4559B19258N2697B4207a10957
11751b4763j3663d724o8571J461A44949C954K387J97217b21368O2223A14756D9286
11738A97908B5256g9995r1477P7627r627J2482B75753a9061B4686g3534j34641
11727b08175m5103A02399J72640p5437a44389A26202c6358I6531P7568D0854n573
11716C5281a44852m3849A176J89614q7595I080K21121B249J22726K8775o4949
$$ plain form
11705 88801 24876 63770 8084 64958 -121483 -280129 -58553 14999 -46941 206215 -184192
11693 235447 -130344 90474 -390372 -103751 -127810 20695 -88012 244633 178760 -227777
11682 -337964 -75511 -160109 22621 -55828 28089 -331205 -89611 -160931 9897 68000 55244
11671 55244 -489786 48863 204999 -331312 -283656 55948 101056 47004 -158899 108120 -24252
11659 152744 -74569 -77724 95105 259034 196879 14038 5887 96904 320170 -118259 45164
11647 48826 -73682 -443747 -31021 99634 21855 -97245 -41479 21951 -112304 88086 228351
11636 228351 -156438 -148502 240369 -209452 93653 112091 -94616 -94429 160157 215726 404185
11625 404185 -131478 347287 398862 -125478 11309 30297 213386 -28288 -34732 21737 -144131
$$ packed form
11705H8801B4876L8894H084N6874a21483j58646e8553A4999d6941B06215a84192
11693B35447a30344I0474c90372a03751k4059B0695h8012B44633o5873b27777
11682c37964g5511q4598B2621e5828B8089c31205h9611p1320I897N8103j2756
11671E5244d89786D8863J56136c31312M7656E5948M5108D7004a58899A08120b4252
11659A52744g4569l155I5105J63929o2155A4038E887R1017K23266a18259D5164
11647D8826g3682l70065c1021I9634B1855i7245d1479B1951a12304H8086J40265
11636B28351a56438P936B40369b09452I3653J8438i4616J87A60157N5569J88459
11625D04185a31478C47287N1575a25478A1309J8988J83089b8288o444B1737a44131
$$ plain form
11613 17362 -40731 10575 -85635 -108746 21604 -6138 176119 2826 135722 239509 -73782
11601 -49354 -119896 -151078 308361 267400 -209286 -174870 89459 152619 21019 249675 43941
11589 92409 -155860 -59859 -222957 130056 328290 -167097 129965 186681 30092 -92277
11578 -177839 40108 109367 183763 12558 78093 106169 -58172 327026 146192 195306 -220495
11566 130525 -53282 -49182 89866 -7245 -82935 64390 255349 153523 78740 244871 523860
11555 523860 -79450 65134 -44726 38240 -174209 359013 -98823 288973 -88906 139692 49635
11543 268172 -232107 162325 359526 -37256 3402 36055 110713 25743 22757 4927 230058
11532 230058 -117837 83946 312930 171400 52382 128630 -44212 247476 279167 209062 -13765
$$ packed form
11613A7362d0731A0575h5635k3111B1604f138A76119B826J32896J03787g3782
11601d9354p0542l1182C08361m0961b09286L4416H9459O3160B1019K28656D3941
11589I2409a55860e9859j63098A30056J98234a67097A29965N6716C0092i2277
11578a77839D0108O9259P4396A2558O5535K8076e8172C27026A46192M9114b20495
11566A30525e3282M100H9866g245p5690F4390J90959j01826p4783J66131K78989
11555E23860g9450F5134d4726C8240a74209C59013i8823B88973h8906A39692D9635
11543B68172b32107A62325J97201c7256C402L2653P4658B5743k986D927K25131
11532B30058a17837H3946K28984j41530E2382P6248d4212B47476L1691p0105a3765
$$ plain form
11520 47550 160801 -14588 -12538 -87036 -323479 27551 101676 53417 -217742 -80124 433998
11508 586105 717537 267789 87130 189094 263371 360167 114439 44453 406488 301042
11498 301042 29096 -708 312228 -137579 273775 218691 180002 321610 56501 22493 231658
11487 231658 7475 4771 137051 151485 241698 105319 125149 -29205 497311 235106 333504
11476 333504 -56467 155028 -119049 250442 -95666 119061 42090 262601 474592 199677
11465 153588 126528 -61509 83954 -26573 151625 164726 75150 -41167 136042 67757 26328
11453 141628 -144348 -17152 -171860 -43535 212697 370431 -150545 175383 72619 304394
11443 304394 342776 106103 -470654 -89370 11232 -11918 131768 271575 76205 -158890
$$ packed form
11520D7550J13251a4588K050p4498k36443B7551P4125m8259b17742h0124D33998
11508E86105J31432B67789H7130J01964P4277R6796A14439D4453L62035j05446
11498C01042B9096g08C12228a37579B73775n5084l8689J41608E6501B2493K09165
11487B31658G475k704J32280J4434R0213A05319J9830b9205D97311B35106R8398
11476C33504e6467A55028a19049B50442i5666A19061D2090K20511K11991A99677
11465A53588k7060f1509H3954b6573A51625J3101G5150d1167A36042F7757B6328
11453A41628a44348a7152j54708d3535B12697J57734a50545A75383G2619K31775
11443C04394L8382A06103d70654h9370A1232a1918A31768J39807G6205a58890
$$ plain form
11432 18093 125212 -56359 145426 275375 109058 141101 -210185 83405 -26623 82363 -146375
11420 -9012 -2806 221370 93439 300817 -32089 -278714 10848 220310 234290 -21902 1828
11408 144777 126809 -293489 -14074 169293 25456 11836 118659 8982 -21116 105430 111617
11397 111617 -61425 92704 5048 -149458 11265 9163 14782 131745 209189 -327111 9650 157085
11385 157085 47333 4233 116858 45657 -218020 -176555 -220505 133915 -178516 72472 104576
11374 104576 64787 3895 -150840 114469 -59978 76932 233623 -177546 -198026 262204 -161336
11362 -133378 -230908 28778 -15058 -238073 -140750 -77287 -198245 -72128 -84497 182069 -348181
11350 122024 -148027 44614 405673 -170082 137461 -16297 -96284 208882 -126339 -203956
$$ packed form
11432A8093J07119e6359A45426J29949A09058L2043b10185H3405b6623H2363a46375
11420i012b806B21370I3439K07378c2089k46625A0848K09462J3980b1902A828
11408A44777j7968b93489a4074A69293B5456A1836J06823H982b1116A05430O187
11397A11617f1425I2704E048a49458A1265k102N619J16963P7444c27111I650J47435
11385A57085D7333D233J12625D5657b18020M1465m3950A33915a78516G2472L2104
11374A04576l9789C895a50840A14469e9978G6932J56691a77546k0480B62204a61336
11362a33378r7530B8778a5058k23015R7323O3463j20958g2128j2369A82069c48181
11350A22024a48027D4614L61059a70082A37461a6297p9987B08882a26339p7617
$$ plain form
11340 -203956 -139469 -62982 89906 65473 -259402 -243506 63043 144365 -183158 -50501 62485
11328 21255 129152 -31455 339504 352430 69632 -59725 -74073 -74687 -184441 -16071 78953
11316 105932 170907 109765 35242 -79762 137511 77679 76815 69895 124587 -212067 -121075 126437
11303 107309 -165196 52644 -99364 -61283 -241624 19043 -124988 57881 102735 387110 -317447
11291 -440907 -179290 135128 -94198 -31832 102703 -70712 -62161 -178763 -159361 -128763 -113804
11280 -113804 171951 254940 -141377 203598 158899 98424 77154 -76806 16010 134566 199387
11269 199387 109058 63451 201412 70946 -62723 62588 196535 49867 198832 -31479 186120
11257 139552 -329866 -317615 -310882 125908 -124790 9499 21060 125896 -193280 -87383 -32489
$$ packed form
11340b03956O4487f2982H9906k4433b59402J5896F3043Q1322a83158e0501F2485
11328B1255J07897c1455C39504J2926F9632e9725j4348o14j09754a6071G8953
11316A05932O4975o1142C5242g9762A37511n9832q64o920N4692b12067R0992A26437
11303A07309a65196E2644i9364L8081j80341A9043a24988E7881M4854K84375c17447
11291d40907a79290A35128i4198c1832A02703g0712Q551j16602J9402L0598J4959
11280a13804A71951Q2989a41377B03598m4699o0475k1270g6806A6010J18556O4821
11269A99387r0329m5607J37961G0946f2723F2588J33947D9867J48965c1479A86120
11257A39552c29866J2251O733A25908a24790I499J1561J04836a93280h7383c2489
$$ plain form
11245 52300 -36890 -32927 52478 -2845 32552 -68294 6894 215954 -357323 41797 171753 -65617
11232 -34547 -190964 -295442 -325594 207104 249779 -155385 71932 135150 83955 -295621 105322
11220 189842 -83072 146212 -269077 -330339 154100 89748 -128106 18278 65218 -40503 170929
11208 168713 -170986 -143887 179168 -191693 -253909 -64951 -175095 -5677 -32879 -139768 -202208
11197 -202208 291346 -143970 -319831 -96384 68188 -64857 110459 136605 -67215 287449
11186 -52807 277775 207341 -52094 -140950 -199945 -460304 47231 -32661 143778 -206871 89110
11174 -140405 -71923 67412 -355186 -32709 -89391 39667 -214861 -147992 -179545 217795 117213
11163 117213 299210 275759 -292431 55948 -249191 -96621 249579 33419 -20644 -210278
$$ packed form
11245E2300c6890L963E2478b845C2552f8294F894K09060c57323D1797J29956f5617
11232c4547j56417j04478l0152B07104M2675a55385G1932O3218n1195b95621A05322
11220A89842h3072A46212b69077o1262A54100o4352a28106A8278M6940d0503A70929
11208A68713a70986K7099A79168a91693o2216f4951j10144e677k7202j06889o2440
11197b02208B91346a43970j75861i6384F8188f4857A10459K6146f7215B87449
11186e2807B77775p0434e2094q8856n8995k60359D7231c2661A43778b06871H9110
11174a40405O8482F7412c55186c2709n6682C9667b14861O6869l1553B17795j00582
11163A17213J81997k3451b92431E5948b49191i6621B49579C3419b0644j89634
$$ plain form
11153 -210278 92890 -179453 152961 103726 -192090 -74027 164841 81972 72016 -55876 -351257
11142 -351257 -102442 -106339 45485 114531 -200915 -148973 -251259 163558 -281028 -122835
11131 -162660 -93598 -23754 88007 -143247 -444245 353096 174585 241674 252445 -303313
11120 -253209 81715 313394 28006 -81693 112783 -184858 47757 -69790 -43182 290355 -78351
11108 146560 189287 -216719 7676 22226 -41287 297417 -12578 27797 360005 42216 -84859
11096 227425 44479 202560 425731 374946 65021 277062 -79977 171895 365241 -17441
11085 270184 -21867 456595 182215 133363 71213 301230 218878 368246 326564 299087 83089
11073 179142 347669 83390 368715 499768 -51108 13954 305999 491044 256428 355065
$$ packed form
11153b10278I2890a79453A52961m9235a92090g4027A64841H1972r956e5876k95381
11142c51257a02442l897D5485O9046b00915N1942j02286A63558b81028a22835
11131a62660O9062b3754H8007a43247l00998C53096A74585O7089J0771c03313
11120b53209H1715K31679B8006h1693A12783a84858D7757f9790K6608B90355g8351
11108A46560M2727b16719G676J4550d1287B97417a2578B7797L32208D2216h4859
11096B27425D4479J58081K23171n0785F5021K12041g9977A71895J93346a7441
11085B70184b1867D56595A82215m8852o2150K30017q2352J49368m1682k7477H3089
11073A79142J68527H3390K85325J31053e1108A3954K92045J85045k34616R8637
$$ plain form
11063 355065 581914 565008 464680 479447 342633 825205 475730 788864 457896 295390
11053 295390 910553 310865 513111 902097 923767 489381 423642 764569 641872 855828
11043 855828 574170 1044005 1209144 893282 785967 694155 814711 492694 489396 702875
11033 702875 705580 866955 712796 697155 603511 646703 677949 550369 571920 676776 944289
11022 944289 902849 830134 719452 854968 815173 480309 618550 839250 633935 649474
11012 649474 477711 686799 733529 728498 853530 873905 1031341 856294 618860 808776
11002 808776 462755 638321 682470 737233 887580 450145 546381 858775 600905 256460
10991 679039 1120173 591559 459883 703946 721185 981158 1056778 1301876 1142984 1231786
$$ packed form
11063C55065K26849j6906j00328J4767j36814M82572l49475L13134l30968j62506
11053B95390O15163C10865K02246L88986K1670m34386o5739L40927j22697K13956
11043H55828k81658M69835J65139l15862j07315r1812J20556l22017l298K13479
11033G02875K705J61375j54159j5641r3644M3192L1246j27580K1551J04856K67513
11022I44289m1440p2715j10682J35516l9795l34864J38241K20700k05315J5539
11012F49474j71763K09088M6730n031J25032K0375J57436j75047k37434J89916
11002H08776l46021J75566M4149N4763J50347m37435R6236L12394k57870B56460
10991F79039M41134n28614j31676K44063J7239K59973P5620K45098j58892Q8802
$$ plain form
10981 1231786 1173412 1349239 1355533 1516210 1457511 2029855 2432327 2072603 2445498 2695664
10971 2695664 3056661 3183209 3146538 3365927 2905161 2867192 2063763 2342068 1965202 1609487
10961 1609487 1625849 1543312 1728128 1637672 1590663 1874905 1745165 1728640 1598691 1452236
10951 1452236 1199245 1059851 723386 695485 627136 718086 430709 340620 332395 386459 244961
10940 244961 181776 195492 101204 155056 35877 -149386 53363 48079 275144 27954 159606
10929 159606 -48961 328532 145135 138700 -191645 327271 215273 119893 -71625 -1218 103810
10917 330072 -58881 -122281 81627 -33698 -136603 88118 -81923 157502 172755 -83077 -152179
10906 -152179 -10295 90147 -63071 16586 -85078 254826 -88078 -160519 -180227 289330 -7174
$$ packed form
10981A231786n8374J75827O294J60677n8699N72344M02472l59724L72895K50166
10971B695664L60997J26548l6671K19389m60766l7969q03429K78305l76866l55715
10961A609487J6362q2537J84816r0456m7009K84242j29740j6525j29949j46455
10951A452236k52991j39394l36465k7901o8349R0950k87377r0089q225N4064j41498
10940B44961o3185J3716r4288N3852C5877a49386E3363n284K27065B7954J31652
10929A59606d8961C28532A45135o435a91645C27271j11998r5380g1625a218A03810
10917C30072e8881o3400H1627c3698j02905H8118h1923A57502J5253h3077o9102
10906a52179a0295I0147f3071A6586h5078B54826h8078p2441j9708B89330g174
$$ plain form
10894 219370 90205 95373 127485 15312 -22085 -188192 97678 237799 148406 92461 -41471
10882 -28527 -20019 -206294 -143483 -237613 -79943 -312496 125087 -169081 -304466 144312 -119181
10870 31904 -136636 -194199 10154 -25729 -239117 86517 -317723 33208 93460 -378890 246568
10858 7993 -26526 -127572 -78209 -51722 -145879 245059 19724 -33094 -102964 -210825 11694
10846 -24407 -54972 64929 200535 24461 -202967 -204504 -211385 350285 -30454 -138729 11163
10834 181949 42773 245003 125580 -28069 261154 106186 81207 -195336 -20513 -272771
10824 -272771 194941 -110829 -194593 -71749 -61705 -64764 385198 52585 241002 -66601 -25227
10812 -260829 -116996 18679 -353293 -212617 -325457 45193 -81670 267072 -100926 -15933
$$ packed form
10894B19370I0205N168L2112A5312b2085j66107I7678J40121q9393n5945d1471
10882b8527Q508j86275O2811r4130g9943k32553A25087a69081j35385A44312a19181
10870C1904a36636n7563A0154b5729k13388H6517c17723C3208O0252c78890B46568
10858G993b6526j01046M9363K6487r4157B45059A9724c3094o9870j07861A1694
10846b4407l0565F4929J35606B4461b02967j537o881C50285c0454j08275A1163
10834A81949D2773K02230j19423b8069B61154A06186k4979a95336b0513k52258
10824b72771A94941a10829q3764g1749J0044l059C85198E2585J88417f6601b5227
10812b60829a16996A8679c53293J40676j12840D5193h1670B67072a00926a5933
$$ plain form
10801 -317635 -51450 -8027 162952 -335405 -257726 5223 61798 -194116 1917 65483 -351835
10789 -319670 130548 -286970 -118762 111406 -16476 58562 40277 126534 -4772 -51104 109369
10777 21244 -316010 115157 234384 81199 -281427 -72633 180682 -332335 -69977 14713
10766 68219 377820 44585 -435004 103601 -69918 183378 -220858 -123747 37896 -213288
10755 -145689 -159291 -113240 -26389 -93627 164718 148914 -177952 -117067 228486 79166 84476
10744 84476 -85753 -87506 402416 -93351 -143867 105656 157754 142051 -36659 -83141 -277497
10733 -277497 -100089 25134 -397597 -5578 -252298 63522 186933 245689 -64076 -337811 45205
10721 -122559 -145713 288668 149494 200753 188180 -236092 87889 -12327 143094 99346 44810
$$ packed form
10801c17635e1450h027A62952c35405P7679E223N6575a94116A917O3566c51835
10789c19670A30548b86970a18762A11406a6476E8562j8285Q6257d772m6332A09369
10777B1244c16010A15157J19227H1199b81427g2633A80682c32335f9977A4713
10766F8219L09601D4585d35004A03601f9918A83378b20858R7111C7896b13288
10755a45689j3602M6051b6389o7238A64718j5804a77952O0885B28486G9166N310
10744H4476h5753j753D02416i3351n0516A05656N2098j5703c6659m6482j94356
10733b77497a00089B5134c97597e578k46720F3522J23411N8756f4076k73735D5205
10721a22559k3154B88668j39174N1259j2573b36092H7889a2327A43094m3748D4810
$$ plain form
10709 -5357 -4037 -197382 171886 -50698 -144168 53198 40424 -111655 114467 -101310 -231864
10698 -231864 350689 90486 -102475 -108527 112340 79020 46179 -68679 81616 148485 44610
10686 40686 40687 -87743 -227341 38218 -11603 170534 -323506 -165282 -239092 -151460 -245437 280903
10673 -296757 37231 104875 -189715 41713 -418053 -72481 -320169 -37567 150089 -44663 -86709
10662 -86709 -6691 -123035 -51502 248870 -183448 -85893 123215 -224239 -6193 -111965 -30650
10650 -173468 40637 34527 -116157 -111157 241095 -263666 -57362 -304055 -133985 28076 27627
10639 27627 -84087 -28824 140457 -179180 -189591 -213422 -241657 99794 -364269 1056 132806
10628 132806 70243 163868 -80193 45142 -2277 -106234 -43564 324455 -141241 -290988 -82958
$$ packed form
10709e357J320j93345A71886e0698r3470E3198j2774a11655A14467a01310j30554
10698b31864C50689I0486a02475o052A12340l3320l2841f8679H1616O6869D4610
10686D0686Jh7743j39598C8218a1603A70534c23506J58224p3810Q7632r3977B80903
10673b96757C7231O7644a89715D1713d18053g2481k47688c7567A50089d4663m2046
10662h6709f691j16344e1502B48870a83448h5893A23215b24239f193j05772c0650
10650a73468D0637o110a16157N000B41095b63666e7362k46693a33985B8076m49
10639B7627h4087b8824A40457a79180j0411k3831k8235I9794c64269A056J31750
10628A32806o2563R3625h0193D5142b277j03957d3564C24455a41241j49747h2958
$$ plain form
10616 -75347 -117243 -93760 -2376 -210451 -47472 60383 -46639 27753 -281144 564 -198985 -174244
10604 -174244 1422 205442 -203043 -232207 27369 208310 -253745 -293131 -25644 103404 -138696
10592 109400 26750 -209856 222927 10638 -50508 200640 212130 83877 -194386 -238035 18274
10580 109885 -102254 -121164 -127136 -189163 63730 19497 -39328 -179400 -51513 -181860 146750
10568 286725 61046 2231 -65390 80418 -177225 177741 14702 -20846 258907 -63172 368204
10556 -235350 148402 -263651 -392095 -456817 -191350 -75407 30226 -65112 81344 206066
10546 206066 -12023 118618 253734 -102656 126902 43510 -51498 -182938 24846 205194
10536 205194 -282306 189219 197779 79256 205881 -81872 317744 65758 -257950 158383
$$ packed form
10616g5347m1896K3483b376k08075d7472F0383d6639B7753b81144E64a98985K4741
10604a74244A422K04020b03043k9164B7369J80941b53745l9386b5644A03404a38696
10592A09400B6750b09856B22927A0638e0508B00640J1490H3877a94386m3649A8274
10580A09885a02254j8910n972o2027F3730A9497c9328j40072e1513j30347A46750
10568B86725F1046B231f5390H0418a77225A77741A4702b0846B58907f3172C68204
10556b35350A48402b63651j28444o4722a91350g5407C0226f5112H1344J24722
10546B06066a2023A18618J35116a02656A26902D3510e1498j31440B4846J80348
10536B05194b82306A89219Q560G9256J26625h1872C17744F5758b57950A58383
$$ plain form
10525 -93020 61720 -24212 179331 -184057 -91135 974 4024 -118824 262025 39740 -156880
10513 -285864 49605 -45074 -78511 51566 252804 -221733 44642 -99003 -78087 67175 182134
10502 182134 250503 116667 65161 -20094 200409 99828 24666 -208153 -311518 91629 178858
10491 178858 201658 -41380 -137749 107473 78358 -38768 -165878 -149969 4420 23929 134941
10480 134941 300944 214249 241221 -39911 410427 -20765 -126200 213700 5667 170183 448429
10469 448429 -73042 165847 -53842 110632 -107205 -269840 1718 -311750 -86717 -56576 -8374
10457 -99983 8694 -30150 -123009 347521 -101961 306115 -50957 90871 -107194 -262708 150248
10445 29964 49996 170978 32184 -11138 -128534 -295597 -84838 63541 -140281 -187934 -68303
$$ packed form
10525i3020F1720b4212A79331a84057i1135I74L050a18824B62025C9740a56880
10513b85864D9605d5074l3437E1566K01238b21733D4642i9003K0916F7175J14959
10502A82134O8369A16667n1506b0094B00409I9828B4666b08153j03365I1629Q7229
10491A78858K2800d1380r6369A07473k9115c8768j27110J5909D420J9509J11012
10480A34941J66003q6695K6972c9911D10427b0765j05435B13700E667J64516K78246
10469D48429g3042A65847e3842A10632a07205j62635A718c11750h6717L0141h374
10457i9983H694c0150r2859C47521a01961C06115e0957I0871a07194j55514A50248
10445B9964K0032J20982C2184a1138j17396j67063h4838F3541a40281m7653f8303
$$ plain form
10433 81419 31409 -97439 -167649 -156049 -411318 -170009 -294530 249158 -282500 -67033 -158335
10422 -158335 -104527 -97991 -119921 13869 2117 20721 101723 -207784 245467 -107949 85946
10410 395196 207587 59986 -183770 -117827 -55120 183418 229367 316634 -148104 127268
10399 112668 83594 51509 96345 -114112 -212219 49613 -55640 62075 15932 262883 -118526
10387 131542 178199 202202 262256 222165 -31254 123858 41951 14580 144288 -121102 29757
10375 211897 602111 69537 329987 491351 229264 339940 414263 324609 456274 282966
10365 282966 578638 235469 352860 217958 492542 -51765 136258 331485 -90737 -380324
10355 -380324 306968 461726 459633 349777 700999 643385 557556 522971 558692 644698 111350
$$ packed form
10433H1419C1409i7439p0210J1600k55269a70009j24521B49158b82500f7033r1302
10422a58335N3808O536k1930A3869B117J8604Q1002b07784B45467a07949H5946
10410C95196j87609E9986a83770O5943e5120A83418M5949Q7267a48104A27268
10399A12668k9074l2085M4836a14112r8107D9613e5640F2075A5932K46951a18526
10387A31542M6657K4003O0054m0091c1254A23858D1951A4580J29708a21102B9757
10375B11897L90214F9537K60450J61364B29264J10676P4323q9654J31665j73308
10365B82966K95672B35469J17391j34902K74584e1765A36258J95227i0737k89587
10355c80324C06968J54758k093j09856L51222n7614q5829l4585L5721Q6006A11350
$$ plain form
10343 291754 544802 386902 20456 332587 405782 217490 149739 163642 444791 122670
10332 9072 9785 77705 -94005 5222 167030 231748 150393 -63815 489895 281426 -45245 340846
10319 265818 131161 302386 129782 30129 411760 -191551 -33731 119583 -63611 298614
10308 -301991 138927 10076 -25242 -214949 -322859 -76445 -76836 -69416 -185572 -456478 -167877
10296 -36594 -99562 69743 -35419 9146 79637 90591 -166841 -114461 -127132 -96979 -301817
10285 -301817 -98498 287768 72299 -105388 127647 -281874 -269584 -119280 278570 93576
10274 -23548 89831 79712 -9360 1179 283836 -19812 110262 -19273 -1988 243886 329008 126406
10261 -64703 368195 -142286 65566 68819 438940 155265 523659 472338 -31045 191842 -69361
$$ packed form
10343B91754K53048j57900B0456L12131P3195j88292o7751J3903K81149A22670
10332I072P13O7920i4005E222J61808O4718q1355f3815D89895k08469d5245C40846
10319B65818A31161J71225A29782C0129L81631a91551c3731A19583f3611B98614
10308c01991A38927A0076b5242j89707j07910g6445l91P420j16156k70906a67877
10296c6594o2968F9743c5419I146P0491J0954a66841N2380j2671L0153k04838
10285c01817i8498B87768G2299a05388A27647b81874J2290a19280B78570I3576
10274b3548H9831j0119i360A179K82657a9812A10262a9273a988B43886Q5122A26406
10261f4703C68195a42286F5566L253L70121A55265L68394n1321c1045A91842f9361
$$ plain form
10249 229553 27402 277707 15823 182217 -143863 219667 -7978 -269511 -21697 -6748 -127382
10238 -127382 -146991 65444 256911 -29754 -387493 -63472 263256 67155 -139611 -229843 -11674
10226 39763 247273 -133288 71228 89639 129323 -56154 -104499 55923 -290386 139645 -127042
10214 -62826 -102358 -99254 -252132 -230005 200131 -548513 -255962 -78686 77322 86897 -94227
10202 -166897 462230 -355658 180112 213652 192590 -205798 -104900 -25312 -82642 -326363
10192 -326363 -401355 -45116 -188905 -103305 10396 -351201 -87653 -165680 -6127 -198455 -155785
10181 -155785 66124 15238 31511 -36807 -97591 -33632 217215 135363 -61648 453817 -261556
10169 -93014 80886 -224012 -78980 287408 -99 4887 110666 -243751 203545 33947 -114274
$$ packed form
10249B29553B7402K50305A5823J66394a43863B19667g978k61533b1697f748j20634
10238a27382j9609F5444J91467b9754l57739f3472B63256F7155a39611r0232a1674
10226C9763K07510a33288G1228J8411L9684e6154m8345E5923b90386A39645a27042
10214f2826l9532L104j52878K2127B00131e48513b55962g8686G7322R575i4227
10202a66897D62230c55658A80112L3540k1062b05798J00898b5312n7330k43721
10192c26363p4992d5116j43789Q5600A0396c51201h7653p8027f127j92328M2670
10181a55785F6124A5238J6273c6807o0784c3632B17215q1852f1648D53817b61556
10169i3014H0886b24012g8980B87408i9D887J05779b43751B03545C3947a14274
$$ plain form
10157 17989 109004 -141776 19910 50462 158073 88056 -2927 94738 45315 -160884 132200
10145 85514 215926 221445 260311 -71288 76045 -260960 172742 -81855 -162254 -98982 -2286
10133 -254898 -78498 -202232 -130455 -107675 -19821 -68707 -156255 -110833 -242651 63416 207721
10122 207721 91229 -373600 18437 142363 -231393 9890 -336730 -2216 -215041 -145429 -69553
10110 17653 -81628 -214606 11913 -56001 -29151 140898 -86321 -298054 -261192 -221348 -93874
10098 -83719 144815 65793 -62321 -64299 168389 -101686 -159960 29922 -248351 112 -42310
10086 -154111 -98601 85914 -137451 -148933 -278068 33369 -261157 -12426 -4954 -195919 -87162
10074 50845 206472 -348458 -53704 -235849 -68304 91572 24276 -29926 -73626 -376304 33208
$$ packed form
10157A7989R1015a41776A9910L0552J07611p0017b927I4738D5315a60884A32200
10145H5514J30412N519L8866g1288G6045b60960A72742h1855q0399O3272b286
10133b54898g8498j23734P1777K2780a9821m8886q7548M5422j31818F3416J44305
10122B07721I1229c73600A8437J23926b31393I890c36730b216k12825O9612f9553
10110A7653h1628j32978A1913e6001K6850A40898h6321k11733L6862L9844i3874
10098h3719A44815F5793f2321j978A68389a01686n8274B9922b48351A12d2310
10086a54111N5510H5914a37451j1482j29135C3369b61157a2426d954j90965h7162
10074E0845J55627c48458e3704j82145f8304I1572B4276b9926m3700l02678C3208
$$ plain form
10062 26031 -317144 -298933 296711 103646 93437 -3285 -140279 41058 -195229 82504 -20606
10050 18421 -90542 -295782 -25253 -169754 85120 10222 -35882 -131674 60487 -252570 -119472
10038 -13635 58144 134799 84132 18668 314906 18506 212670 27689 -439904 3447 65822
10027 65822 111484 -217050 -267017 26134 -372517 5760 -151702 22035 -69830 -143249 -317607
10016 -317607 -68824 -59244 127927 -347847 -173377 -24005 147453 52802 -297507 -299403 -249261
10005 -249261 -226645 -16476 154125 76121 -131740 -54989 147182 -65243 131118 -132697
9994 39215 85204 -104767 -171222 67687 -37069 62843 -196057 92081 178094 -73827 -161434
9983 -161434 -109880 -128405 -45012 -188354 14183 -44734 -142652 -64481 -223490 -212269 -337724
$$ packed form
10062B6031c17144J8211B96711A03646j0209c285j36994D1058a95229H2504b0606
10050A8421i0542k05240b5253j44501H5120A0222c5882r5792F0487b52570a19472
10038a3635E8144P6655n0667A8668K96238A8506J94164B7689d39904C447O2375
10027F5822M5662b17050m9967B6134c72517E760a51702B2035f9830p3419j74358
10016c17607f8824R580A27927c47847a73377b4005A47453E2802b97507j896N0142
10005b49261K2616a6476A54125G6121a31740e4989A47182f5243A31118a32697
9994C9215M5989a04767o6455F7687c7069F2843a96057I2081Q6013g3827q7607
9983a61434N1554j8525d5012j43342A4183d4734r7918f4481j59009J1221j25455
$$ plain form
9972 -337724 -9090 344669 -158189 1264 -183359 -211301 -125938 -303871 90406 -54676 -382733
9961 -382733 103392 49705 16722 -231089 -174297 118699 -21895 213423 196216 -5447 -10769
9950 -10769 6828 -28339 -57872 -106385 -90368 -259808 -102088 -64136 -26413 -92824 454 14517
9938 14517 269462 71805 46556 -193570 76569 -215263 55119 -17453 -3674 -42157 -69205
9927 -69205 -219746 -91174 -155853 -1609 148732 -254702 -40076 -77595 107393 -11860 -164270
9916 -164270 -84094 -106879 -97324 70493 -97725 74150 -48868 134842 61739 223557 261436
9905 261436 212686 -292896 65092 -143722 -314798 3169 -93596 36369 -231520 -196117 -247963
9894 -247963 -123003 -89875 111633 266673 71469 59519 -271353 274055 30070 -143757
$$ packed form
9972c37724i090C44669a58189A264a83359k7942Q5363j77933I0406e4676l28057
9961c82733A03392D9705A6722b31089N6792A18699b1895B13423j7207e447n322
9950a0769F828b8339k9533m8513J6017j69440a02088L7952b6413o6411D54J4063
9938A4517K54945G1805k5249a93570G6569b15263E5119a7453c674l8483k7048
9927f9205j50541i1174o4679a609A48732b54702d0076l7519A07393a1860j52410
9916a64270Q0176k2785R555G0493i7725G4150d8868A34842F1739J61818L7879
9905B61436m8750b92896F5092a43722j71076C169i3596C6369b31520L5403n1846
9894b47963a23003L3128A11633J55040G1469j1950b71353B74055C0070a43757
$$ plain form
9883 88448 -240875 280188 -323440 -20625 -68770 -67786 101053 -231486 -224310 67768 -409139
9871 -354582 155743 -296762 -104327 46030 155452 -117920 249759 -5538 -313872 -54014
9860 -135909 -202077 -270702 5083 38395 -169882 268305 214469 85041 -136959 -403974 -69341
9848 377 -190008 290009 27325 -191465 -37173 53716 -135529 -513776 102893 -69537 -141200
9837 -141200 -450220 -3607 -33059 160379 -104822 187202 -167218 -90906 90933 -196422 -216923
9826 -216923 -338467 93148 -384216 206390 40213 -145161 -213662 6287 178394 -347776 174563
9814 -167833 13459 -35872 -383076 -233775 -45530 -204862 -31741 224414 107528 105196 -5907
9802 -3962 -77257 103200 -23057 -197376 -113910 -57067 -290077 -101679 -35972 73537 172288
$$ packed form
9883H8448b40875B80188c23440b0625m8145R84A01053b31486P176F7768d09139
9871c54582A55743b96762a04327D6030J09422a17920B49759e538l08334e4014
9860a35909o6168o8625E083L3312a69882B68305n3836H5041a36959k67015f9341
9848C77a90008B90009B7325a91465c7173E3716a35529l78247A02893f9537p1663
9837a41200l09020c607k9452A60379a04822A87202a67218P6312I0933a96422k0501
9826b16923j21544I3148c84216B06390D0213a45161o8501F287J72107c47776A74563
9814a67833A3459c5872l47204J49301d5530j59332c1741B24414A07528k332e907
9802c962p3295A03200b3057j74319Q3466N6843k33010a01679c5972G3537R8751
$$ plain form
9791 172288 -363093 -24669 -364468 -17555 -122890 -50663 -80109 -186212 -168739 102120 -251271
9779 -97414 -127925 -368850 -247064 324709 239656 -202040 -252292 17654 -340530 17526 -247367
9767 -142751 -177787 -300073 84032 84677 -381350 105470 -69074 -18480 -14055 103390 -32877
9755 -135687 123617 -181569 -280668 11506 -243404 -405823 62699 -25577 7013 -37312 -34026
9744 -34026 -110392 102122 -187621 144249 -401179 -148692 163122 31343 -90189 -397487
9734 -397487 -197764 -226043 -285260 248243 58758 190935 -48182 -158980 262748 -282824
9723 -273012 83635 -195624 132801 -390239 -101639 -104473 -157703 -83164 -177702 -113030 51969
9711 95265 -224609 142771 -195861 -102561 188615 -319827 -47868 -126506 -422698 -184324
$$ packed form
9791A72288c63093b4669l39799a7555j05335e0663k9446j06103J7473A02120b51271
9779i7414l0511k40925J21786C24709q5053b02040n0252A7654c40530A7526b47367
9767a42751l5036j22286H4032O45c81350A05470f9074a8480M425A03390c2877
9755a35687A23617a81569r9099A1506b43404j62419F2699b5577G013c7312L286
9744c4026p6366A02122a87621A44249d01179a48692A63122C1343i0189l07298
9734c97487a97764k8279n9217B48243E8758J32177d8182j10798B62748b82824
9723b73012H3635a95624A32801c90239a01639k834n3230P4539r4538O4672E1969
9711I5265b24609A42771a95861R3300A88615c19827d7868p8638k96192a84324
$$ plain form
9700 18495 -80519 -198053 -202695 -73965 -217533 -131937 70271 73930 142831 -151745 -275293
9689 -275293 244754 77411 83133 -22297 -207838 -352376 -78971 233915 13191 -223809 169024
9677 -302051 -260551 73295 312810 64878 -103934 325446 -392138 213133 -409983 -25335
9666 -476712 -183312 -56829 -263931 21033 29707 80132 -201603 -56675 128592 -69748 66122
9654 -148139 -26137 -308386 170391 -125764 101377 149004 -158559 -20315 -26941 285678 323294
9643 323294 -341587 -47821 97896 -8378 -89845 120675 65437 72566 -70652 110987 165981
9632 165981 9865 -195967 -167120 -100106 -37594 -217848 -51306 -3289 -339547 -32757 -47273
9621 -47273 20154 -43771 -174704 -56511 60349 -317628 -135699 -120980 -6169 -30082 34133
$$ packed form
9700A8495h0519j17534m642g3965j43568Q5596G0271L659O8901a51745j23548
9689b75293B44754G7411N722b2297j85541j44538g8971B33915A3191b23809A69024
9677c02051M1500G3295K39515F4878a03934C25446c92138B13133d09983b5335
9666d76712a83312e6829k07102B1033Q674N0425b01603e6675A28592f9748F6122
9654a48139b6137k82249A70391a25764A01377M7627a58559b0315o626B85678L7616
9643C23294c41587d7821I7896h378q1467A20675n5238P129g0652A10987N4994
9632A65981I865a95967K8847O7014c7594j80254e1306c289l36258c2757j4516
9621d7273B0154d3771j30933e6511F0349c17628a35699J4719f169k3913C4133
$$ plain form
9609 67869 -70810 -174511 60079 -81896 -237344 8511 -372024 -361412 -448301 -106686 -230972
9598 -230972 -177265 273490 138384 53600 -47781 264259 157422 16696 226283 -32656 -9956
9586 -155818 103586 111194 -27778 107932 -564178 -184769 -37506 -67544 27462 -190651 -104265
9575 -104265 -39853 -142336 53247 -95005 8281 328805 -58088 189103 71004 -57606 -69896
9564 -69896 -230624 -211036 -47696 -198534 168057 -279161 -103493 84289 -9222 -158814 133469
9552 -234392 -150170 70894 132725 -437992 -26695 225330 33623 -192402 -24338 -129122 -48382
9540 -119421 -89030 -139580 212036 -343608 -67540 -26801 146491 16512 -313645 47329 313455
9529 313455 37013 -167063 63379 -64618 249040 37358 -92748 270792 78306 -106102 -202542
$$ packed form
9609F7869g0810j03701F0079h1896j55448H511c72024J0612q6889a06686j24286
9598b30972N3707B73490j35106E3600d7781B64259j06837A6696K09587c2656i956
9586a55818A03586P608b7778A07932e64178a84769c7506l0038B7462a90651Q6386
9575a04265c9853j02483E3247i5005H281L20524e8088A89103G1004e7606j2290
9564f9896j60728J9588d7696j50838A68057b79161a03493H4289i222j49592A33469
9552b34392Q4222G0894O1831d37992b6695B25330C3623a92402b4338j04784d8382
9540a19421L0391n0550B12036c43608f7540b6801A46491A6512c13645D7329K66126
9529C13455C7013a67063F3379f4618B49040C7358i2748B70792G8306a06102r6440
$$ plain form
9518 -202542 147109 319445 -16188 11293 1050 345108 -77923 1715 -354077 250081 -323594
9506 -215359 213329 2249 -141210 215464 -326940 -93135 29691 25263 82400 310223 58421
9494 -122371 49061 -56789 -136081 -73652 13305 6590 -267064 -186990 -278851 -97668 138138
9482 37262 -284117 -74632 -39217 -240623 166369 78005 92712 -77690 277434 -160229 76958
9470 -337967 14420 -156320 35508 117187 -154006 107674 17530 -64905 -62491 114309 -136648
9458 73582 -168774 43923 128828 -6277 -46189 -63316 31016 256730 -222644 -164868 -226799
9447 -226799 -82479 -59568 -319526 17889 33185 -403237 -187474 -52789 216995 -4418 20627
9435 -15453 -70124 157849 -84394 -362502 -231370 -253990 266020 -330407 -209617 -119215 -223407
$$ packed form
9518b02542A47109J72336a6188A1293A050L44058g7923A715c54077B50081c23594
9506b15359B13329B249a41210B15464c26940i3135B9691m428N7137K27823E8421
9494a22371D9061e6789p9292O2429A3305F590b67064Q0074r1861i7668A38138
9482C7262b84117g4632L5415k01406A66369G8005J4707g7690B77434a60229G6958
9470c37967A4420a56320C5508Q1679a54006A07674A7530f4905K414A14309a36648
9458G3582a68774D3923Q4905f277l9912j7127C1016K25714b22644N7776o1931
9447b26799h2479K2911k59958A7889J5296d03237a87474e2789B16995d418B0627
9435a5453n4671A57849h4394k78108J31132k2620B66020c30407J20790R0402j04192
$$ plain form
9424 -223407 18140 135674 129594 -158193 -146108 42387 -403987 91356 -45804 -116566 250076
9412 132394 -151200 173730 -48765 -129674 -68574 -413768 -135619 -52959 -104194 46148 43019
9401 43019 -38564 215940 11008 91525 -154736 -50228 100671 44686 -8373 -147182 42950
9389 -40671 322271 349982 1326 -154881 -13963 -237365 -77857 -146061 -200789 10147 168317
9378 168317 72292 167938 -240286 -75957 -215110 -17187 -174335 87192 67871 -103634 -25214
9366 -55079 -269608 -278752 -129081 437434 -64725 -136409 -237944 -255829 -105497 -210764 -224686
9355 -224686 -161724 -445513 -280178 -4350 278733 -363881 150377 39167 -389794 -180703
9344 -206411 -73640 -101427 -223785 -256394 307689 -17311 -88401 -217929 -110188 -2917 -102847
$$ packed form
9424b23407A8140J17534o080a58193J2085D2387d03987I1356d5804p0762B50076
9412A32394a51200A73730d8765q0909O1100l45194a35619e2959n1235D6148l129
9401D3019c8564B15940A1008Q0517a54736e0228A00671D4686h373j38809D2950
9389d0671C22271K7711A326a54881a3963k23402g7857o8204n4728A0147J58170
9378A68317G2292R5646b40286g5957j39153a7187j57148H7192j9321a03634b5214
9366e5079k14529r144a29081D37434f4725p1684j01535j7885a05497j05267j3922
9355b24686O2962k83789J65335d350B78733c63881A50377C9167c89794a80703
9344b06411g3640k7787j22358l2609C07689a7311p1090j29528J07741b917r9930
$$ plain form
9333 -102847 -124039 -72544 126260 -11217 -477075 -41582 193485 64886 -210031 -97774 269968
9321 -410905 -114354 -144830 -72570 -123448 -74924 12437 4871 -658377 -52244 -161650 -64513
9309 103748 365363 -121846 -402352 -175177 -45865 -16075 -2289 -310958 -114096 -60858 -70369
9298 -70369 102634 -68102 -136500 35824 86637 -397681 154496 170447 -67087 -63775 -165299
9287 -165299 -143608 -96543 -23813 -172694 -59914 184354 -36194 -243559 -77116 -71833 -4853
9275 290184 -383102 -216295 -86951 -29116 303214 117771 31534 214707 -25495 -88416 -145912
9264 -145912 38056 -130010 37874 -181276 112808 -20290 57232 -50648 -58002 143860 236728
9253 236728 64989 66337 -90083 76232 -14774 59652 13506 23050 -14011 -27585 21078 -102713
$$ packed form
9333a02847k1192N1495A26260a1217m65858d1582A93485F4886b10031i7774B69968
9321d10905a14354l0476P2260n0878M8524A2437D871f58377e2244j09406f4513
9309A03748K61615a21846k80506a75177d5865a6075b289l08669a14096N3238r511
9298g0369A02634f8102o8398C5824N0813c97681A54496J5951f7087L312j01524
9287a65299K1691M7065b3813j48881e9914A84354c6194k07365g7116N283d853
9275B90184c83102J66807h6951b9116C03214A17771C1534J83173b5495o2921n7496
9264a45912C8056a30010C7874a81276A12808b0290E7232e0648p354A43860R2868
9253B36728F4989J348i0083G6232a4774E9652A3506R544a4011j3574B1078a02713
$$ plain form
9240 -61477 -102024 308984 55577 -118847 -15660 -148092 -49265 -74266 97947 115201 133007
9229 133007 -148620 -160728 -127411 -172157 -145485 -83889 8345 105283 106115 -68952 -90823 525866
9216 20751 -212252 157873 184965 73489 -137706 250463 108913 110492 -262581 72907 5838
9204 -422461 -156254 313168 146011 386443 92699 -101835 -159074 427849 -315066 -272959
9194 -272959 95544 -238332 89968 -354516 -132970 -54423 -220326 -121807 -237850 -152418 -221160
9183 -221160 -319288 -139621 -419084 76362 2858 195235 -297468 13650 -85417 -264779 111809
9171 37525 -420119 19959 -308192 -405174 -229995 -255462 104948 -15726 -110585 -70555 -159262
9160 -159262 279647 16230 33115 -186420 65575 -45020 247445 -89654 -197502 66874 5999
$$ packed form
9240f1477m0547C08984E5577a18847a5660j32432d9265k5001I7947J7254J7806
9229A33007a48620j2108L3317m4746K6672O1596H345R6938Q32f8952k1871E25866
9216B0751b12252A57873K7092G3489a37706B50463A08913J579b62581G2907E838
9204d22461a56254C13168A46011K40432I2699a01835n7239D27849c15066M2107
9194b72959I5544b38332H9968c54516a32970e4423j65903R8519j16043Q5432o8742
9183b21160r8128a39621k79463G6362B858J92377b97468A3650h5417j79362A11809
9171C7525d20119A9959c08192r6982J75179k5467A04948a5726r4859M0030q8707
9160a59262B79647A6230J6885a86420F5575d5020B47445h9654j07848F6874E999
$$ plain form
9148 -253549 104072 58088 -74545 -12445 -171389 18298 -80296 -131032 -375458 -158066 -269994
9137 -269994 -207197 -235402 14173 -317984 260559 92204 43986 72212 55420 186491 -344458
9125 -49463 -128796 -27764 -371534 119601 -68096 -43210 -248816 -28555 -183807 282468 102903
9113 80372 -88973 147558 -278683 -338918 55100 -91238 147994 -211879 -16473 -216446 2193
9101 -197730 -43565 291874 159621 30403 128933 359140 85987 -35773 -207704 82763 -195668
9089 -87064 -133295 -92235 -161235 -62350 6673 -306136 -59817 41008 225827 298075 -53949 134349
9076 31492 -65496 165700 -59147 -271866 -20639 13353 41186 -48153 -4162 -207231 -102005
9064 34926 -335292 -165743 -53693 140052 -3977 -84686 -70129 -418924 321775 -237987 -195825
$$ packed form
9148b53549A04072m5984g4545a2445j58944A8298h0296n0736k44426a58066j11928
9137b69994O2797k8205A4173c17984B60559I2204D3986K8226j6792J31071c44458
9125d9463p9333b7764l43770A19601f8096K4886k05606b8555j55252B82468A02903
9113H0372h8973A47558b78683o0235E5100i1238A47994b11879a6473j99973B193
9101a97730d3565B91874j32253C0403R8530K30207H5987c5773j71931H2763a95668
9089h7064m6231M1060o9000f2350F673c06136e9817D1008J84819P2248e3949A34349
9076C1492f5496A65700e9147k12719b0639A3353K7833d8153d162k03069a02005
9064C4926c35292a65743e3693A40052c977q0709J4557l48795C21775b37987M2162
$$ plain form
9053 -195825 -9984 -229333 -218954 -258486 -212623 -165267 -48461 -237062 -97864 -91714 34556 -157881
9040 -183994 101537 218988 1665 -184855 221571 183640 -194826 -309429 -89859 74555 201224
9029 201224 -75562 -67754 -297564 -12685 -58318 -183124 -42966 -52671 -289596 -116285 28357
9017 -45828 -461420 -166368 67836 -244175 3229 43935 198458 -282121 -81172 -194644 22403
9005 -57420 91792 162956 62130 67915 155526 -154607 -153121 9251 60417 -220948 -11524 17180
8992 -236852 -117398 9599 -120369 -143371 -178977 -31028 14933 -126718 -372972 -97115 -168634
8981 -168634 -486142 7663 129712 124578 -185028 -119824 312171 138184 96988 -25409 -37268
8970 -37268 383963 89184 -200202 -183930 -82410 -217132 4877 -66892 116409 7911 -111713
$$ packed form
9053a95825i984k19349J0379l9532M5863M7356d8461j88601i7864O150C4556a57881
9040a83994A01537J17451A665a84855B21571l7931a94826j14603h9859G4555J26669
9029B01224g5562P808k29810a2685m5633j24806d2966r705k36925a16285B8357
9017d5828m15592a66368F7836b44175C229M0706J54523b82121h1172j13472B2403
9005e7420I1792P1164F2130N785Q7611a54607J486I251N1166b20948a1524A7180
8992b36852a17398I599a20369k3002l5606c1028A4933a26718k46254i7115p1519
8981a68634l17508G663J22049n134a85028O5204C12171A38184m1196b5409j1859
8970c7268C83963H9184b00202J6272h2410j34722D877f6892A16409G911a11713
$$ plain form
8958 -47819 70722 -175197 -82856 -54462 -323947 -88094 -28951 66361 105458 -55716 -272802
8947 -272802 -53775 -107223 132400 216796 -85805 -344695 293546 -114011 -41865 -56283 165580
8935 -59610 -99484 181603 52768 -74547 -12556 -62808 -267728 -144748 -153612 -191485 195094
8923 582371 543615 2369784 4123354 849891 -45862 25934 220720 -106343 26802 -28078
8912 245003 86065 166239 -39838 -61048 263891 85124 -125871 305915 80226 44782 -140332
8900 67736 -21788 18101 -222560 -179461 -91716 398552 55229 174069 -179849 -149848 18897
8888 109354 119862 -100266 282540 437933 -134347 -69249 -568509 126785 58798 -67679
8877 -152753 -172435 -117903 72705 136464 -102278 -107331 -335628 -361616 129589 -381698 -105813
$$ packed form
8958d7819G0722a75197h2856K8394k69485h8094b8951F6361L9097e5716k17086
8947b72802e3775n3448A32400Q4396h5805k58890B93546a14011d1865j4418A65580
8935e9610l9874A81603E2768g4547a2556n0252k04920J22980q864l7873A95094
8923E82371l8756J826169J753570H49891d5862B5934J94786a06343B6802b8078
8912B45003H6065Q0174c9838k1210B63891H5124a25871C05915H0226l5444a40332
8900F7736b1788A8101b22560M3099Q7745C98552E5229J18840a79849L0001A8897
8888A09354J0508a00266B82540J55393a34347O5098m99260A26785E8798f7679
8877a52753j9682N4532G2705O3759a02278n053k28297k5988A29589c81698a05813
$$ plain form
8865 -77598 -228582 47149 -473503 -216695 -140405 -119591 -110161 -109788 -101944 -58658 60484 -426756
8852 72934 46702 131136 -267337 36101 -19294 41334 -22793 -237739 -122042 -27794 -105907
8841 -105907 -27616 -73432 442943 -62594 -29354 144492 -227875 125276 -255553 -124794
8830 -4153 -258641 -31167 -88291 -240132 18393 115691 -377729 -126117 -29308 123029 99519
$$ packed form
8865g7598j50984D7149d73503b16695P6290K0814R430L73P844M3286F0484d26756
8852G2934k6232Q4434b67337C6101a9294D1334b2793k14946J15697b7794p8113
8841a05907b7616m5816D42943f2594b9354A44492b27875A25276b55553a24794
8830d153k54488c1167n7124j51841A8393R7298c77729a26117b9308A23029k3510
$$ [...]
##END NTUPLES=NMR SPECTRUM
##END=
