##TITLE=AC1713_3097_8749698_3jzR5BpbZs
##JCAMPDX= 6.0         $$ Bruker NMR JCAMP-DX V2.0
##DATA TYPE= NMR SPECTRUM
##DATA CLASS= NTUPLES
##ORIGIN= BRUKER
##OWNER= Administrator
$$ 1.72 TOPSPIN		Version 2.1
$$ 2015-08-12 09:54:53.164 -0700  Administrator@X
$$ Compression mode = diff/dup
##.OBSERVE FREQUENCY= 400.02188249412
##.OBSERVE NUCLEUS= ^1H
##.ACQUISITION MODE= SIMULTANEOUS (DQD)
##.ACQUISITION SCHEME= undefined
##.AVERAGES= 64
##.DIGITISER RES= 22
##SPECTROMETER/DATA SYSTEM= spect
##.PULSE SEQUENCE= noesygpps1d.comp
##.SOLVENT NAME= COFFEE_meoh
##.SHIFT REFERENCE= INTERNAL, COFFEE_meoh, 1, 14.96136
##AUDIT TRAIL= $$ (NUMBER, WHEN, WHO, WHERE, PROCESS, VERSION, WHAT)
$$ ##TITLE= Audit trail, TOPSPIN		Version 2.1
$$ ##JCAMPDX= 5.01
$$ ##ORIGIN= Bruker BioSpin GmbH
$$ ##OWNER= Administrator
$$ $$ E:\/data/COFFEE/nmr/AC1713_3097_8749698_3jzR5BpbZs/42/pdata/1/auditp.txt
$$ ##AUDIT TRAIL=  $$ (NUMBER, WHEN, WHO, WHERE, PROCESS, VERSION, WHAT)
(   1,<2015-08-08 04:33:10.953 -0700>,<Administrator>,<X>,<go>,<TOPSPIN 2.1>,
      <created by zg
	started at 2015-08-08 04:21:41.234 -0700,
	POWCHK enabled, PULCHK disabled,
       configuration hash MD5:
       21 0F 79 D6 B3 7B B4 F6 88 20 88 DB 03 48 BD 9F
       data hash MD5: 64K
       47 F9 0E 44 14 EB 85 E9 75 EB 1A F4 1D 2D 64 DB>)
(   2,<2015-08-08 04:33:18.047 -0700>,<Administrator>,<X>,<audit>,<TOPSPIN 2.1>,
      <user comment:
       ICON-NMR User ID: COFFEE
       data hash MD5: 64K
       47 F9 0E 44 14 EB 85 E9 75 EB 1A F4 1D 2D 64 DB>)
(   3,<2015-08-12 09:54:50.601 -0700>,<Administrator>,<X>,<proc1d>,<TOPSPIN 2.1>,
      <Start of raw data processing
       efp LB = 0.3 FT_mod = 6 PKNL = 1 PHC0 = 0 PHC1 = 0 SI = 128K 
       data hash MD5: 128K
       69 2E 8F 7A 8E ED F7 F2 E8 D7 D8 2A C2 ED 53 4D>)
(   4,<2015-08-12 09:54:51.554 -0700>,<Administrator>,<X>,<proc1d>,<TOPSPIN 2.1>,
      <pk PHC0 = -83.92456 PHC1 = 0 
       data hash MD5: 128K
       30 99 BF 8A BF 29 81 A7 F5 E0 07 36 4B 99 75 4E>)
(   5,<2015-08-12 09:54:52.226 -0700>,<Administrator>,<X>,<proc1d>,<TOPSPIN 2.1>,
      <abs ABSG = 1 
       data hash MD5: 128K
       B2 59 89 1B 03 CE F3 D8 65 F7 D1 75 76 3A DB F9>)
(   6,<2015-08-12 09:54:52.445 -0700>,<Administrator>,<X>,<proc1d>,<TOPSPIN 2.1>,
      <abs ABSG = 2 
       data hash MD5: 128K
       85 61 C5 73 B8 AF AF 3B 25 4E 9F 7E 92 9A 13 7D>)
(   7,<2015-08-12 09:54:52.539 -0700>,<Administrator>,<X>,<proc1d>,<TOPSPIN 2.1>,
      <abs ABSG = 3 
       data hash MD5: 128K
       9A 23 40 FF 13 1E 09 FB 97 1B 62 FE E7 1A C3 3A>)
(   8,<2015-08-12 09:54:52.757 -0700>,<Administrator>,<X>,<proc1d>,<TOPSPIN 2.1>,
      <abs ABSG = 4 
       data hash MD5: 128K
       67 48 3D 0E 6F 4B 81 6B BB BE F4 A5 69 67 D1 5D>)
(   9,<2015-08-12 09:54:52.851 -0700>,<Administrator>,<X>,<proc1d>,<TOPSPIN 2.1>,
      <abs ABSG = 5 
       data hash MD5: 128K
       58 CF 31 A0 D1 38 25 D0 0F 8C 39 10 6F 7B 23 FE>)
$$ ##END=
$$ 
$$ $$ hash MD5
$$ [...]
##$TP07= 0
##$TPNAME0= <>
##$TPNAME1= <>
##$TPNAME2= <>
##$TPNAME3= <>
##$TPNAME4= <>
##$TPNAME5= <>
##$TPNAME6= <>
##$TPNAME7= <>
##$TPOAL= (0..7)
0.5 0.5 0.5 0.5 0.5 0.5 0.5 0.5
##$TPOFFS= (0..7)
0 0 0 0 0 0 0 0
##$TUNHIN= 0
##$TUNHOUT= 0
##$TUNXOUT= 0
##$USERA1= <user>
##$USERA2= <user>
##$USERA3= <user>
##$USERA4= <user>
##$USERA5= <user>
##$V9= 5
##$VALIST= <valist>
##$VCLIST= <CCCCCCCCCCCCCCC>
##$VD= 0
##$VDLIST= <DDDDDDDDDDDDDDD>
##$VPLIST= <PPPPPPPPPPPPPPP>
##$VTLIST= <TTTTTTTTTTTTTTT>
##$WBST= 2048
##$WBSW= 25
##$XGAIN= (0..3)
0 0 0 0
##$XL= 0
##$YL= 0
##$YMAX_a= 7264366
##$YMIN_a= -14207803
##$ZGOPTNS= <>
##$ZL1= 120
##$ZL2= 120
##$ZL3= 120
##$ZL4= 120
##$ABSF1= 14.96136
##$ABSF2= -5.596822
##$ABSG= 5
##$ABSL= 3
##$ALPHA= 0
##$AQORDER= 0
##$ASSFAC= 0
##$ASSFACI= 0
##$ASSFACX= 0
##$ASSWID= 0
##$AUNMP= <proc_prof1d_extract.lims>
##$AXLEFT= 0
##$AXNAME= <>
##$AXNUC= <1H>
##$AXRIGHT= 0
##$AXTYPE= 0
##$AXUNIT= <>
##$AZFE= 0.1
##$AZFW= 0.1
##$BCFW= 0
##$BC_mod= 0
##$BYTORDP= 0
##$COROFFS= 0
##$CY= 15
##$DATMOD= 1
##$DC= 0
##$DFILT= <>
##$DTYPP= 0
##$F1P= 0
##$F2P= 0
##$FCOR= 0.5
##$FTSIZE= 131072
##$FT_mod= 6
##$GAMMA= 0
##$GB= 0
##$INTBC= 1
##$INTSCL= 1
##$ISEN= 128
##$LB= 0.3
##$LEV0= 0
##$LPBIN= 0
##$MAXI= 10000
##$MC2= 0
##$MEAN= 0
##$ME_mod= 0
##$MI= 0
##$NCOEF= 0
##$NC_proc= -2
##$NLEV= 6
##$NOISF1= 0
##$NOISF2= 0
##$NSP= 0
##$NTH_PI= 0
##$NZP= 0
##$OFFSET= 14.96136
##$PC= 1
##$PHC0= -83.92456
##$PHC1= 0
##$PH_mod= 1
##$PKNL= yes
##$PPARMOD= 0
##$PPDIAG= 0
##$PPIPTYP= 0
##$PPMPNUM= 2147483647
##$PPRESOL= 1
##$PSCAL= 4
##$PSIGN= 0
##$PYNMP= <proc.py>
##$REVERSE= no
##$SF= 400.020009491154
##$SI= 131072
##$SIGF1= 0
##$SIGF2= 0
##$SINO= 400
##$SIOLD= 131072
##$SPECTYP= <>
##$SREGLST= <1H.CDCl3>
##$SSB= 0
##$STSI= 131072
##$STSR= 0
##$SW_p= 8223.68421052631
##$SYMM= 0
##$S_DEV= 0
##$TDeff= 65536
##$TDoff= 0
##$TI= <>
##$TILT= no
##$TM1= 0
##$TM2= 0
##$TOPLEV= 0
##$USERP1= <user>
##$USERP2= <user>
##$USERP3= <user>
##$USERP4= <user>
##$USERP5= <user>
##$WDW= 1
##$XDIM= 131072
##$YMAX_p= 382463521
##$YMIN_p= -11436
##$CURPLOT= <Network HP LaserJet P1505>
##$CURPRIN= <$Network HP LaserJet P1505>
##$DFORMAT= <normdp>
##$LAYOUT= <+/1D_H.xwp>
##$LFORMAT= <normlp>
##$PFORMAT= <normpl>
##$SURQMSG= 1
$$ End of Bruker specific parameters
$$ ---------------------------------
##NTUPLES= NMR SPECTRUM
##VAR_NAME=  FREQUENCY,     SPECTRUM/REAL,   SPECTRUM/IMAG
##SYMBOL=    X,             R,               I
##VAR_TYPE=  INDEPENDENT,   DEPENDENT,       DEPENDENT
##VAR_FORM=  AFFN,          ASDF,            ASDF
##VAR_DIM=   131072,        131072,          131072
##UNITS=     HZ,            ARBITRARY UNITS, ARBITRARY UNITS
##FACTOR=    0.0627417313425164, 1,          1
##FIRST=     8223.62146879497, 1287,         -63542
##LAST=      0,             3685,            -63114
##MIN=       0,             -11436,          0
##MAX=       8223.62146879497, 382463521,    0
$$ Real data points
##PAGE= N=1
##DATA TABLE= (X++(R..R)), XYDATA
$$ [...]
61423E88037M689L824K376J075L6r10j718k359k963l385l198k537k231k655l133
61408E74948l064k861l098l356k877j931j529j999k680k964k786k212j382r05
61394E41304j469k787l619l149j871q22m43m34m01j51L97J236K096K506K157J285
61378E35835N89O09J199J766K048K344K871L306L285L057L227L941M740N128N016
61363E78961M642M352M436N018O057P551R453J1328J2501J2852J3174J4274J5933
61350G00532J7180J7384J6645J5274J3482J1511R557P552N389L275J480k38k353
61337H16670m754o715p819q394q885r227r170q747q120p258o073m748l615k826
61323G20319k284j851j469j147r08p12m05J25Q48J676K644L786M977O097P283
$$ y = [588037, 592726, 596550, 598926, 600001, 600037, 599127, 597409, 595050, 592087, 588702, 585504, 582967, 580736, 578081, 574948, 571884, 569023, 565925, 562569, 559692, 557761, 556232, 554233, 551553, 548589, 545803, 543591, 542209, 541304, 539835, 537048, 533429, 530280, 528409, 527587, 527144, 526710, 526309, 526158, 526555, 527791, 529887, 532393, 534550, 535835, 536424, 537033, 538232, 539998, 542046, 544390, 547261, 550567, 553852, 556909, 560136, 564077, 568817, 573945, 578961, 583603, 587955, 592391, 597409, 603466, 611017, 620470, 631798, 644299, 657151, 670325, 684599, 700532, 717712, 735096, 751741, 767015, 780497, 792008, 801565, 809117, 814506, 817781, 819261, 819023, 816670, 811916, 805201, 797382, 788988, 780103, 770876, 761706, 752959, 744839, 737581, 731508, 726760, 723145, 720319, 718035, 716184, 714715, 713568, 712660, 711948, 711543, 711668, 712516, 714192, 716836, 720622, 725599, 731696, 738979]
61308G38979Q721J0281J1591J2466J2827J2316J0450P298L680M09k316m672o706
61295H15324q336r558j0364j0590j0134r214q164p030n664m159k871j998j307
61282G25935n54J23M16M34P00J492K525L500M633O149P627Q465Q916R861J1462
61267G91684J2883J3666J4497J5976J7565J8615J9642K1357K2844K2194J8939
61256I89862J4526J0174N570K45n038r187j2202j4708j6643j7437j7099j6211
61244I11852j4971j3141j0923r067p919o995n798m572l892l771l596k851j705
61231H22651p41k10K46J021J893K273K030J658J497J254N96j94n91o18o86p54
61215H31325k46J076K576L419L477L348L524L885M025L903L968M641N900P433
$$ y = [738979, 747700, 757981, 769572, 782038, 794865, 807181, 817631, 824929, 828609, 829018, 826702, 822030, 815324, 806988, 797430, 787066, 776476, 766342, 757128, 748964, 741934, 736270, 732111, 729240, 727242, 725935, 725381, 725504, 725920, 726354, 727054, 728546, 731071, 734571, 739204, 745353, 752980, 761445, 770361, 780222, 791684, 804567, 818233, 832730, 848706, 866271, 884886, 904528, 925885, 948729, 970923, 989862, 1004388, 1014562, 1020132, 1020377, 1015339, 1006152, 993950, 979242, 962599, 945162, 928063, 911852, 896881, 883740, 872817, 863750, 855831, 848836, 843038, 838466, 834574, 830803, 827207, 824356, 822651, 821910, 821700, 821946, 822967, 824860, 827133, 829163, 830821, 832318, 833572, 834168, 833974, 833383, 832765, 832079, 831325, 831079, 832155, 834731, 838150, 841627, 844975, 848499, 852384, 856409, 860312, 864280, 868921, 874821, 882254]
61201H82254R069J0808J2567J4178J5628J6995J8117J8589J8154J6904J4992J2453
61189A060708R379O031K634n79l061m188m122m052n146p332r499j0753j1193j1523
61175A007304j2261j3365j4421j5089j5428j5757j6205j6561j6605j6419j6159
61164H39034j5737j4881j3406j1392r210p415o264n336l927j925R7J759L266M730
61150G59393N704N861N536M993L732J320j493l430m300m989n840o082n069l208
61136G52128j179R53L329N604P284Q345R029R401R696J0604J2561J4914J6462
61123H59131J6760J6394J5987J5610J5212J4995J5030J4922J4160J2666J0789
61112A021656Q994P678O982O540N658M038K126M49j159l283n993q751j1254j3776
$$ y = [882254, 891323, 902131, 914698, 928876, 944504, 961499, 979616, 998205, 1016359, 1033263, 1048255, 1060708, 1070087, 1076118, 1078752, 1078173, 1075112, 1070924, 1066802, 1062750, 1057604, 1050272, 1040773, 1030020, 1018827, 1007304, 995043, 981678, 967257, 952168, 936740, 920983, 904778, 888217, 871612, 855193, 839034, 823297, 808416, 795010, 783618, 774408, 766993, 760729, 755393, 751466, 749541, 749638, 751397, 754663, 759393, 765097, 770958, 776494, 781487, 785219, 786539, 785046, 781616, 777316, 772327, 766487, 760405, 755336, 752128, 750949, 751902, 755231, 760835, 768119, 776464, 785493, 794894, 804590, 815194, 827755, 842669, 859131, 875891, 892285, 908272, 923882, 939094, 954089, 969119, 984041, 998201, 1010867, 1021656, 1030650, 1038328, 1045310, 1051850, 1057508, 1061546, 1063672, 1064121, 1062962, 1059679, 1053686, 1044935, 1033681, 1019905]
61098A019905j6440j8631j9669j9740j9612j9582j9305j8644j7942j7277j6104
61087H16959j4099j1893j0333r339q173o665n450m888m448l544k411j679j378
61074G32659q86J21J236J857J926J882K118K676L439M383N563O848P906Q582R179
61059G89489J0164J1520J2706J3410J4092J5401J7219J8695J9347J9620K0140
61048I61803K0826K1126K0912K0588K0416K0220J9926J9871K0328K1013K1405
61037A188434K1352K1122K1013K1120K1385K1670K2011K2886K4927K8084L1425
61026A445429L4171L6556L9201M1993M4318M6242M8608N1927N6005O0876O7282
61015A972608P5732Q5744R6597J08398J21926J37768J56213J77911K04386K38078
$$ y = [1019905, 1003465, 984834, 965165, 945425, 925813, 906231, 886926, 868282, 850340, 833063, 816959, 802860, 790967, 780634, 771295, 763122, 756457, 751007, 746119, 741671, 738127, 735716, 734037, 732659, 731773, 731894, 733130, 734987, 736913, 738795, 740913, 743589, 747028, 751411, 756974, 763822, 771728, 780310, 789489, 799653, 811173, 823879, 837289, 851381, 866782, 884001, 902696, 922043, 941663, 961803, 982629, 1003755, 1024667, 1045255, 1065671, 1085891, 1105817, 1125688, 1146016, 1167029, 1188434, 1209786, 1230908, 1251921, 1273041, 1294426, 1316096, 1338107, 1360993, 1385920, 1414004, 1445429, 1479600, 1516156, 1555357, 1597350, 1641668, 1687910, 1736518, 1788445, 1844450, 1905326, 1972608, 2048340, 2134084, 2230681, 2339079, 2461005, 2598773, 2754986, 2932897, 3137283, 3375361]
61005C375361K81812L37467M04896M83002N72471O76922Q01051R48661J122143
60996I003786J319948J529649J722831J860199J904546J830007J624365J294699
60988B2090030Q81367M63754J36399l8213o3667j959O4723O6987m1696k83512
60978B3274213o45896j070999j468251j752905j883549j870608j755586j583950
60970A1242469j390415j197419j018199q59329p22673o07159n10242m29178l62018
60961D145837l07553k64197k29457k00857j76961j57124j40556j26167j13086
60952B429879j00882q9431p8870o9569o1815n5514n0376m6232m2925m0111l7446
60941A756708l4809l2133k9228k6060k3018k0522j8453j6290j3774j1187q982
$$ y = [3375361, 3657173, 3994640, 4399536, 4882538, 5455009, 6131931, 6932982, 7881643, 9003786, 10323734, 11853383, 13576214, 15436413, 17340959, 19170966, 20795331, 22090030, 22971397, 23435151, 23571550, 23533337, 23469670, 23467711, 23532434, 23599421, 23557725, 23274213, 22628317, 21557318, 20089067, 18336162, 16452613, 14582005, 12826419, 11242469, 9852054, 8654635, 7636436, 6777107, 6054434, 5447275, 4937033, 4507855, 4145837, 3838284, 3574087, 3344630, 3143773, 2966812, 2809688, 2669132, 2542965, 2429879, 2328997, 2239566, 2160696, 2091127, 2029312, 1973798, 1923422, 1877190, 1834265, 1794154, 1756708, 1721899, 1689766, 1660538, 1634478, 1611460, 1590938, 1572485, 1556195, 1542421, 1531234, 1522252]
60930A522252p367o255n430m745m276m214m549n041n554o183o934p613q246r216
60916A436629j0690j2238j3400j4359j5516j6712j7433j7639j7749j7929j8019
60905A264945j8181j8818j9699j9957j9257j8318j7819j7449j6601j5513j4911
60894A068422j4848j4572j3599j2223j0974j0113r759r954j0371j0358r568q324
60882I33759p190o373n801n491n607o216p168q241r225j0019j0641j1103j1180
60869H29504j0562r334q149p658p812p978p671o964o191n479m727l909l251l104
60855G36715l638m591n364n525n193m790m372l517k056o43j77p63j625k192k783
60840F89486l919n345o211o180n768n454m975l898k531j679j538j366m73Q55J709
$$ y = [1522252, 1514885, 1508630, 1503200, 1498455, 1494179, 1489965, 1485416, 1480375, 1474821, 1468638, 1461704, 1454091, 1445845, 1436629, 1425939, 1413701, 1400301, 1385942, 1370426, 1353714, 1336281, 1318642, 1300893, 1282964, 1264945, 1246764, 1227946, 1208247, 1188290, 1169033, 1150715, 1132896, 1115447, 1098846, 1083333, 1068422, 1053574, 1039002, 1025403, 1013180, 1002206, 992093, 982334, 972380, 962009, 951651, 942083, 933759, 926569, 920196, 914395, 908904, 903297, 897081, 889913, 881672, 872447, 862428, 851787, 840684, 829504, 818942, 809608, 801459, 793801, 785989, 778011, 770340, 763376, 757185, 751706, 746979, 743070, 739819, 736715, 733077, 728486, 723122, 717597, 712404, 707614, 703242, 699725, 697669, 697026, 696849, 696086, 694461, 692269, 689486, 685567, 680222, 674011, 667831, 662063, 656609, 651634, 647736, 645205, 643526, 641988, 640622, 640149, 641004, 642713]
60825F42713J656J156R83J443K270L027L482L597L329K578J402J58p36j167j317
60810F64574j307j114q85r83j501k042k260k378k803l425l745l660l559l667l769
60795F27476l711l735m073m588n122n789o616p143o850n837m734m026l686l413
60781E58153k989k536k522l260m240m347l095j333l02k89o93j040j191p21Q16
60766E30411K861L999L637K814K845L686M325M297M059M088M320M526M676M806
60752E85350M932N065N068M572L435K187J481J140K92j432l389m838n737o367
60738E91759o611o234n551n270n693o474p114p325o959o050n005m383m287m254
60724E10549l920l506l431l672l723l156k017p42J29K49l24j120j593j519j070
$$ y = [642713, 644369, 645525, 646508, 647951, 650221, 653248, 656730, 660327, 663656, 666234, 667636, 667794, 667058, 665891, 664574, 663267, 662153, 661268, 660285, 658784, 656742, 654482, 652104, 649301, 645876, 642131, 638471, 634912, 631245, 627476, 623765, 620030, 615957, 611369, 606247, 600458, 593842, 586699, 579849, 574012, 569278, 565252, 561566, 558153, 555164, 552628, 550106, 546846, 542606, 538259, 535164, 533831, 533529, 533240, 532547, 531507, 530316, 529595, 530411, 533272, 537271, 540908, 543722, 546567, 550253, 554578, 558875, 562934, 567022, 571342, 575868, 580544, 585350, 590282, 595347, 600415, 604987, 608422, 610609, 612090, 613230, 613522, 612090, 608701, 603863, 598126, 591759, 585148, 578914, 573363, 568093, 562400, 555926, 548812, 541487, 534528, 528478, 523473, 519090, 514803, 510549, 506629, 503123, 499692, 496020, 492297, 489141, 487124, 486382, 486511, 486760, 486436, 485316, 483723, 482204, 481134]
60709D81134n87l25l27l74j70L25P61P50K99k05l67n4N97J309J853K277K842L549
60691D93287L931L650L165L320M281N340N894O091O265O333O140N943N948N758
60677E65346M953M018L858M428M628L827K680K041J659O17j304l331m677n211
60663E83532n208m940m611m349m080l636l070k665k579k629k542k188j622j070
60649E38343q77j233j872k281k298k239k353k482k447k441k679k921k785k410
60635E07025k256k315k053j277n29k96l16o6M04O61O36O44P53O82L47K4j69m53
60617E01446r01j200j121q67p15o21m61l26k78j58O5N4l44n89n0J000J601J280
60599D97815N45M2j71l42m54k93J31O09J059J592K242K833L111K942K412J701
$$ y = [481134, 480547, 480222, 479895, 479521, 479351, 479676, 480437, 481187, 481486, 481281, 480914, 480860, 481457, 482766, 484619, 486896, 489738, 493287, 497218, 500868, 504033, 507353, 511634, 516974, 522868, 528959, 535224, 541557, 547697, 553640, 559588, 565346, 570299, 574317, 578175, 582603, 587231, 591058, 593738, 595779, 597438, 598055, 596751, 593420, 588743, 583532, 578324, 573384, 568773, 564424, 560344, 556708, 553638, 550973, 548394, 545765, 543223, 541035, 539413, 538343, 537466, 536233, 534361, 532080, 529782, 527543, 525190, 522708, 520261, 517820, 515141, 512220, 509435, 507025, 504769, 502454, 500401, 499124, 498595, 498299, 497983, 497917, 498321, 498982, 499618, 500262, 501015, 501697, 502044, 502068, 501899, 501446, 500545, 499345, 498224, 497357, 496642, 496021, 495560, 495234, 494956, 494798, 494863, 494917, 494573, 493984, 493934, 494934, 496535, 497815, 498360, 498402, 498231, 497889, 497435, 497142, 497273, 497882, 498941, 500533, 502775, 505608, 508719, 511661, 514073, 515774]
60583E15774R30J36n28p41l40L22O66N42M06P94J771K960L904M315M199L899L940
60566E42949M655N933P305Q254Q545Q383Q190Q052P487O031L962K139J064M60
60552F23409j40p90j233j320r91k04Q70J734K069K213K825M109N712P343R100
60537F54706J1121J3193J4921J6000J6260J5598J4125J2177R954P248L803p0l507
60524G85529n848p109p647p613o999o019n049m209l416k812k745l103l114k105
60510G17741k81J562K874L670M247M904N919P409R212J1107J3063J5141J7359
60497H13927J9875K3013K6758L0462L3451L5700L7362L7907L6470L2980K8157
60486A156062K2348J5129O357l145j2342k0772k8164l3907l7549l9394l9981l9284
$$ y = [515774, 516704, 516840, 516312, 515571, 515231, 515553, 516219, 516761, 517167, 517961, 519732, 522692, 526596, 530911, 535110, 539009, 542949, 547604, 553537, 560842, 569096, 577641, 586024, 594214, 602266, 609753, 615784, 619746, 621885, 622949, 623409, 623269, 622479, 621246, 619926, 618935, 618731, 619601, 621335, 623404, 625617, 628442, 632551, 638263, 645606, 654706, 665827, 679020, 693941, 709941, 726201, 741799, 755924, 768101, 778055, 785303, 789106, 789036, 785529, 779681, 772572, 764925, 757312, 750313, 744294, 739245, 735036, 731620, 728808, 726063, 722960, 719846, 717741, 717460, 719022, 721896, 725566, 729813, 734717, 740636, 748045, 757257, 768364, 781427, 796568, 813927, 833802, 856815, 883573, 914035, 947486, 983186, 1020548, 1058455, 1094925, 1127905, 1156062, 1178410, 1193539, 1199896, 1196751, 1184409, 1163637, 1135473, 1101566, 1064017, 1024623, 984642, 945358]
60474I45358l7066l3789l0480k7772k5487k3167k0600j7880j5361j3516j2487
60463F87753j1816j0931r815q893q408q213q082p795p048n777m500l829l640l237
60449E85769k394j676j532j629j414r66q05j098j515j789k003k273k476k445k214
60434E59540j905j476q45j85J06j33n97q67q75p96o40k78J65L27J32oL03R65J613
60415E54548K020K151K016J745J576J522J237M96l63p93p30n90o22n55M6J214
60399E64918K387K780K113J060P35J506K619L147L076L059L430L912M192M251
60385F03185M151L857L415K988K680K530K587K797K889K648K197J820J584J393
60371F40721J171P51j45j328j888j120M30J521J736J733J995K179K002J957K610
$$ y = [945358, 908292, 874503, 844023, 816251, 790764, 767597, 746997, 729117, 713756, 700240, 687753, 675937, 665006, 655191, 646298, 637890, 629677, 621595, 613800, 606752, 600975, 596475, 592646, 589006, 585769, 583375, 581699, 580167, 578538, 577124, 576158, 575353, 574255, 572740, 570951, 568948, 566675, 564199, 561754, 559540, 557635, 556159, 555314, 555129, 555235, 555102, 554505, 553638, 552763, 551967, 551327, 551049, 551214, 551541, 551673, 551667, 551970, 552935, 554548, 556568, 558719, 560735, 562480, 564056, 565578, 566815, 567311, 566948, 566155, 565425, 564835, 564213, 563658, 563704, 564918, 567305, 570085, 572198, 573258, 573993, 575499, 578118, 581265, 584341, 587400, 590830, 594742, 598934, 603185, 607336, 611193, 614608, 617596, 620276, 622806, 625393, 628190, 631079, 633727, 635924, 637744, 639328, 640721, 641892, 642643, 642498, 641170, 639282, 638162, 638592, 640113, 641849, 643582, 645577, 647756, 649758, 651715, 654325]
60356F54325L712M533M752M583M354M359M834N654O302O441O313O198N830M815
60342G27005L309J809M30j032k478l546m317n272o375o827o170n099m610m666
60328F82161m398l510k735k671k867k505j570p50l97k44j50m03j016j323o81P13
60312F57654K131L156L900M617N583P139R382J1826J3802J5140J6100J6741J6757
60299G83928J5951J4358J1926Q529M374%m267q429j2265j5111j6514j6743j6414
60286G49323j5822j4850j3373j1465r435p714o598n983n521n021m479l725k507
60273F42830j052j21k25j040j777j954j593r95n17l82m91n34l99j79J51O80J057
60256F33459O35n88j643j665r40l91l76m96m34l31l89n22n29l13J12N81Q42Q36
$$ y = [654325, 658037, 662570, 667322, 671905, 676259, 680618, 685452, 691106, 697408, 703849, 710162, 716360, 722190, 727005, 730314, 732123, 732553, 731521, 729043, 725497, 721180, 715908, 709533, 702706, 696536, 691437, 686827, 682161, 677763, 674253, 671518, 668847, 665980, 663475, 661905, 661155, 660758, 660514, 660364, 659961, 658945, 657622, 656941, 657654, 659785, 662941, 666841, 671458, 677041, 684180, 693562, 705388, 719190, 734330, 750430, 767171, 783928, 799879, 814237, 826163, 834692, 839066, 839066, 834799, 826370, 814105, 798994, 782480, 765737, 749323, 733501, 718651, 705278, 693813, 684378, 676664, 670066, 664083, 658562, 653541, 649062, 645337, 642830, 641778, 641657, 641432, 640392, 638615, 636661, 635068, 634073, 633556, 633174, 632683, 632149, 631750, 631571, 631722, 632402, 633459, 634094, 633506, 631863, 630198, 629258, 628867, 628491, 627995, 627561, 627230, 626841, 626319, 625790, 625477, 625589, 626170, 627012, 627848]
60238F27848Q16J004J304J625K150K884L279K861K071J836K331K845K930K953
60224F58737L227L321K736J829J427J809K529L125L538L849M063M189M225M058
60210G02662L622L156K976L002K849K405J967J661J144J76q14j140p53k86l09
60195G22318q52j649k454l033l170k871k371j843j364j149j373j631j066N18K032
60180G00042K136Q11n69p65Q9Q45O81p2l36M88J778K394K099J799K153K585K209
60163G18367J238O54P35Q68P03O24Q95J177J220J317J698K151K502K921L297L052
60147G43419K065J187J234J907K363K378K310K214J852J406J496K357L528M453
60133G74169M931N000M662L898K698J170l47j456k148k785l423l596l130k661
$$ y = [627848, 628664, 629668, 630972, 632597, 634747, 637631, 640910, 643771, 645842, 647678, 650009, 652854, 655784, 658737, 661964, 665285, 668021, 669850, 671277, 673086, 675615, 678740, 682278, 686127, 690190, 694379, 698604, 702662, 706284, 709440, 712416, 715418, 718267, 720672, 722639, 724300, 725444, 725620, 724806, 723666, 722913, 722627, 722318, 721466, 719817, 717363, 714330, 711160, 708289, 705918, 704075, 702711, 701562, 700189, 698558, 697492, 698010, 700042, 702178, 702989, 702420, 701655, 701744, 702589, 703270, 703198, 702862, 703350, 705128, 707522, 709621, 711420, 713573, 716158, 718367, 719605, 720259, 720994, 721862, 722565, 723189, 724084, 725261, 726481, 727798, 729496, 731647, 734149, 737070, 740367, 743419, 745484, 746671, 747905, 749812, 752175, 754553, 756863, 759077, 760929, 762335, 763831, 766188, 769716, 774169, 779100, 784100, 788762, 792660, 795358, 796528, 796181, 794725, 792577, 789792, 786369, 782773, 779643, 776982]
60119G76982k759k987k595j874j921l032m214m440l743k784k019j560j384j223
60105G40447o53L62J257J520J266J005J046J359J802K229K461K423K252K214K552
60090G63542L259L881L652K279N21m32k20M28P80Q56Q22L10j085k971m498n428
60074G65696o262p288q098q260q004p847p907p893p606p024o036m573l017k059
60060F73822j957k259k445k465k392j961r65J77Q54J144J656K456K891K632K209
60045F73397K120K043J412K69r72k255l659m834n309n316n580o251o616o045m792
60030F27612l674l333l882m955n883o078n465m457l523k854k456k283k225k058
60016E74486j527n85L28L79q25k463l046k034m78L05J96LK02O67J295K068K651
$$ y = [776982, 774223, 771236, 768641, 766767, 764846, 761814, 757600, 753160, 749417, 746633, 744614, 743054, 741670, 740447, 739794, 740156, 741413, 742933, 744199, 745204, 746250, 747609, 749411, 751640, 754101, 756524, 758776, 760990, 763542, 766801, 770682, 774334, 776613, 777134, 776702, 776482, 776910, 777690, 778546, 779368, 779678, 778593, 775622, 771124, 765696, 759434, 752146, 744048, 735788, 727784, 719937, 712030, 704137, 696531, 689507, 683471, 678898, 675881, 673822, 671865, 669606, 667161, 664696, 662304, 660343, 659378, 659555, 660409, 661553, 663209, 665665, 668556, 671188, 673397, 675517, 677560, 678972, 679241, 678269, 676014, 672355, 667521, 662212, 656896, 651316, 645065, 638449, 632404, 627612, 623938, 620605, 616723, 611768, 605885, 599807, 594342, 589885, 586362, 583508, 581052, 578769, 576544, 574486, 572959, 572374, 572702, 573081, 572256, 569793, 566747, 564713, 564235, 564540, 564736, 564739, 564941, 565608, 566903, 568971, 571622]
59999E71622K659K295K124K218K222K155K380K802K873K533K320K384K201J504
59985F04292P05P9o78j653k266k209k047k274k427j928j217j095j339j003Q4J041
59969E86065J210Q68N35L91O36J623L154M214M018L053K465K575K589J825P12
59954F15933K05N04Q50N48j91o60o25n46r37j784k606k930k614j866r48M5J078
59937F03456J802J711Q91L30R87K630M102M636M530M452M614M778M713M380L900
59922F51912L471L184K978K917L340M361N373N619N172M752M652M463L853K921
59908G08968J633j86k088l054k804k236k122k125j744j378j599j929j399J7J429
59893F89383K312K905L444L815M042M361M810N257N775O424O803O478N770N413
$$ y = [571622, 574281, 576576, 578700, 580918, 583140, 585295, 587675, 590477, 593350, 595883, 598203, 600587, 602788, 604292, 604997, 605076, 604398, 602745, 600479, 598270, 596223, 593949, 591522, 589594, 588377, 587282, 585943, 584940, 585024, 586065, 587275, 588143, 588678, 589069, 589705, 591328, 594482, 598696, 602714, 605767, 608232, 610807, 613396, 615221, 615933, 616138, 616642, 617492, 618040, 617849, 617189, 616564, 616018, 615081, 613297, 610691, 607761, 605147, 603281, 602333, 602378, 603456, 605258, 606969, 607860, 608190, 609177, 611807, 615909, 620545, 625075, 629527, 634141, 638919, 643632, 648012, 651912, 655383, 658567, 661545, 664462, 667802, 672163, 677536, 683155, 688327, 693079, 697731, 702194, 706047, 708968, 710601, 710415, 708327, 705273, 702469, 700233, 698111, 695986, 694242, 692864, 691265, 689336, 687937, 687954, 689383, 691695, 694600, 698044, 701859, 705901, 710262, 715072, 720329, 726104, 732528, 739331, 745809, 751579, 756992]
59879G56992N441N150M149K799J468J43j088j901k361l034m174n301n847n727
59865G46709n087m131l444l696m637n074m400l485l384l783l533k369j020J23
59851F98789J463L195M766N706O305P059P915Q513Q786Q934R041R029Q773Q023
59837G96297O577M835L810M064M871N050M428L742L081J376k014n926q420q938
59823H12833q672q906r728j0420j0452r697q260o558n281m803m745m387l456k343
59809G15125j651j729k443l213l433l048k604k543k678k598k300k072j950j778
59795F81085j673j962k541k791k234j005M14J578K093J763J007O91J145J607J161
59780F80338P5m26K39J287J761J819K266L153L676L414K887K629K383J801J269
$$ y = [756992, 762433, 767583, 771732, 774531, 775999, 776142, 775054, 773153, 770792, 767758, 763584, 758283, 752436, 746709, 741622, 737491, 734047, 730351, 725714, 720640, 716240, 712755, 709371, 705588, 702055, 699686, 698666, 698789, 700252, 703447, 708213, 713919, 720224, 727283, 735198, 743711, 752497, 761431, 770472, 779501, 788274, 796297, 802874, 807709, 811519, 815583, 820454, 825504, 829932, 833674, 836755, 838131, 836117, 830191, 821771, 812833, 804161, 795255, 785527, 775107, 764655, 754958, 746698, 740140, 734859, 730056, 725311, 720924, 717468, 715125, 713474, 711745, 709302, 706089, 702656, 699608, 697004, 694461, 691783, 689185, 686885, 684813, 682863, 681085, 679412, 677450, 674909, 672118, 669884, 668879, 669293, 670871, 672964, 674727, 675734, 676425, 677570, 679177, 680338, 680413, 679987, 680226, 681513, 683274, 685093, 687359, 690512, 694188, 697602, 700489, 703118, 705501, 707302, 708571]
59765G08571J381J907K068J734J552J872K281K417K491K748K979K988L032L342
59751G41363L715L976M379N033N331M652L304K197J731J567J334R65L71n05j349
59736G78064j676j527j385j426j291p70j79J10J56J95L02M21M77K77l10r34r32
59719G69572j80O31R00R43J453K404L036K948K626K684L024L173L118L311L831
59704H03474M168M018L800L961M172L837L115K683K581K064Q93j98o69j042j943
59689H34914k927l131k609k174k129k086j966k288l310m635n770o564o905o672
59675G81748o112n756n783n888n888n907n875n470m631l624k489j062L38J029
59661G24630R89J048J626K075J787J243J252J659J615Q00l22j277j944k294k368
$$ y = [708571, 709952, 711859, 713927, 715661, 717213, 719085, 721366, 723783, 726274, 729022, 732001, 734989, 738021, 741363, 745078, 749054, 753433, 758466, 763797, 768449, 771753, 773950, 775681, 777248, 778582, 779547, 779918, 779413, 778064, 776388, 774861, 773476, 772050, 770759, 769989, 769810, 769920, 770076, 770271, 770573, 770994, 771471, 771748, 771438, 770504, 769572, 769392, 770023, 770923, 771866, 773319, 775723, 778759, 781707, 784333, 787017, 790041, 793214, 796332, 799643, 803474, 807642, 811660, 815460, 819421, 823593, 827430, 830545, 833228, 835809, 837873, 838766, 838568, 837899, 836857, 834914, 831987, 828856, 826247, 824073, 821944, 819858, 817892, 815604, 812294, 807659, 801889, 795325, 788420, 781748, 775636, 769880, 764097, 758209, 752321, 746414, 740539, 735069, 730438, 726814, 724325, 723263, 723601, 724630, 725619, 726667, 728293, 730368, 732155, 733398, 734650, 736309, 737924, 738724, 738402, 737125, 735181, 732887, 730519]
59646G30519k456k786l113l049k681k358k003j205j4Q80R72N00Ml20o63j266k220
59629G08741l452m728n712o127n906n257m563m066l572k782j953j824k611l477
59615F52711l396k338j105k08M96J203J772K104K370K700L001L233L522L803L724
59600F73592L127K387J974J906J843J596J278J015P74N07K78J75J29n0m02o60
59584F89469n69l63o05j404k096k048j510j269j572j968k214k670l604m543m760
59569F58274m088k918j704q25o50j195j786j605o04M78J041J175J230J304J373
59554F49500J621K184K811L128L209L523M334N442O599P866R451J1379J3448J5309
59540G39804J6508J6656J5793J4342J2444R611N499R05k545l927l846l494l275
$$ y = [730519, 728063, 725277, 722164, 719115, 716434, 714076, 712073, 710868, 710854, 711734, 712706, 713206, 713210, 712890, 712227, 710961, 708741, 705289, 700561, 694849, 688722, 682816, 677559, 672996, 668930, 665358, 662576, 660623, 658799, 656188, 652711, 649315, 646977, 645872, 645664, 646160, 647363, 649135, 651239, 653609, 656309, 659310, 662543, 666065, 669868, 673592, 676719, 679106, 681080, 682986, 684829, 686425, 687703, 688718, 689492, 689999, 690277, 690452, 690581, 690531, 690129, 689469, 688900, 688537, 687932, 686528, 684432, 682384, 680874, 679605, 678033, 676065, 673851, 671181, 667577, 663034, 658274, 654186, 651268, 649564, 648739, 648089, 646894, 645108, 643503, 642899, 643377, 644418, 645593, 646823, 648127, 649500, 651121, 653305, 656116, 659244, 662453, 665976, 670310, 675752, 682351, 690217, 699668, 711047, 724495, 739804, 756312, 772968, 788761, 803103, 815547, 825158, 830657, 831562, 829017, 825090, 821244, 817750, 814475]
59527H14475k754j652l21P34J264J048k21k455m756o034o046n610n671o377p217
59512G68407p805q225q608q684q080o888n686m887m347l690k912k283j790j043
59498F93479Q2J032J136M01n51j240j674j906j738j094l50R6L53Q27J621K539
59482F93013L534M698N816O434O524O603O959P100O354M734K899J486P19N03N64
59467G57940O22O96J055J767K436K788L255M509O550Q564R725R792R034P979P212
59452H33924P013P024O521N119L065R41p86k041l256n040p364r275r804r020p749
59437H09272o507n273m155l412k792j635J07J733K892M126N887P755R189J0347
59423H27534J1614J2807J3579J4172J5043J6043J6626J6592J5967J4467J1774
$$ y = [814475, 811721, 810069, 809748, 810482, 811746, 812794, 812573, 810118, 805362, 799328, 793282, 787672, 782001, 775624, 768407, 760602, 752377, 743769, 735085, 727005, 720117, 714431, 709544, 705197, 701507, 698595, 696312, 694522, 693479, 693561, 694593, 695729, 696130, 695579, 694339, 692665, 690759, 689021, 687927, 687577, 687673, 688026, 688853, 690474, 693013, 696547, 701245, 707061, 713495, 720019, 726622, 733581, 740681, 747035, 751769, 754668, 756154, 756873, 757376, 757940, 758562, 759258, 760313, 762080, 764516, 767304, 770559, 775068, 781618, 790182, 799907, 809699, 818733, 826712, 833924, 840937, 847961, 854482, 859601, 862666, 863607, 862821, 860780, 857524, 852484, 845120, 835845, 826041, 817021, 809272, 802765, 797492, 793337, 789925, 787133, 785498, 785605, 787338, 790230, 794356, 800243, 807998, 817187, 827534, 839148, 851955, 865534, 879706, 894749, 910792, 927418, 944010, 959977, 974444, 986218]
59412I86218Q129L957q44o363j1548j4612j4701j2461q881m461K23M098O294O713
59398I41761N379J954l484r588j4442j7043j7622j6763j4824j2250r819q265p699
59385H17295p526o918n470l529j784n00N80J520J821J170K05m7O04J294J300R25
59369H00940R86J729K628L193L626M554O163P794Q500Q060P301P375Q790J1126
59355H82765J3527J5286J6140J6257J5964J5399J4498J3375J2428J1728J0582
59344A037949Q223M884J648q39k943n159p257q815j0068j1538j3090j4049j4255
59331I64691j4294j4554j4644j4043j2810j1344r840q390p326o966p085p067o596
59318H29732n950n565n520n504n160m435l651l178l037k862k412j838j379q99
$$ y = [986218, 994347, 998304, 997460, 991097, 979549, 964937, 950236, 937775, 928894, 924433, 924656, 928754, 935048, 941761, 947140, 949094, 945610, 936022, 921580, 904537, 886915, 870152, 855328, 843078, 833259, 824994, 817295, 809769, 802851, 797381, 793852, 792068, 791568, 792148, 793668, 795489, 796659, 796864, 796817, 797421, 798715, 800015, 800940, 801926, 803655, 806283, 809476, 813102, 817656, 823819, 831613, 840113, 848173, 855474, 862849, 871639, 882765, 896292, 911578, 927718, 943975, 959939, 975338, 989836, 1003211, 1015639, 1027367, 1037949, 1046172, 1051056, 1052704, 1051865, 1048922, 1043763, 1036506, 1027691, 1017623, 1006085, 992995, 978946, 964691, 950397, 935843, 921199, 907156, 894346, 883002, 873162, 864772, 857446, 850480, 843395, 836328, 829732, 823782, 818217, 812697, 807193, 802033, 797598, 793947, 790769, 787732, 784870, 782458, 780620, 779241, 778342]
59304G78342oJ449L165M642N571O098O823Q278J0295J1996J2638J2167J0666P772
59290H79896L177k362p194j0087j0986j0492r092p110m930k899j098N89K347M407
59276H24166O795R006J0239J0198R465Q877Q656Q398P699O537N182L884K746J710
59262I23558O59n07j828l231m501n455o244p222q294q687p829o249n024m388l564
59247H51194k060m84L30M70P12J519K645L577L919L512K532J397L92n43j561k633
59231H64918l670m656n418n601n165m652m622m970n157m956m560m129l607l073
59217H00682k836l037l345l305k892k576k790l399l818l707l358l206l155k701
59203G56557j665m64L69O65N76M56P00J419K175K437K253K056J880J489J281K073
$$ y = [778342, 778336, 779785, 782950, 787592, 793163, 799261, 806084, 814362, 824657, 836653, 849291, 861458, 872124, 879896, 883073, 880711, 873517, 863430, 852444, 841952, 832860, 825750, 820820, 817921, 816823, 817412, 819759, 824166, 830961, 839967, 850206, 860404, 869869, 878746, 887402, 895800, 903499, 910036, 915218, 919102, 921848, 923558, 924217, 923710, 921882, 918651, 914150, 908695, 902451, 895229, 886935, 878248, 870419, 864170, 859146, 854758, 851194, 849134, 848650, 848980, 849450, 850162, 851681, 854326, 857903, 861822, 865334, 867866, 869263, 869655, 869112, 867551, 864918, 861248, 856592, 851174, 845573, 840408, 835756, 831134, 826164, 821007, 816051, 811491, 807362, 803755, 800682, 797846, 794809, 791464, 788159, 785267, 782691, 779901, 776502, 772684, 768977, 765619, 762413, 759258, 756557, 754892, 754428, 754797, 755462, 756038, 756494, 757194, 758613, 760788, 763225, 765478, 767534, 769414, 770903, 772184, 774257]
59187G74257L753M932M678L777L567M094M317L806L256L436M350N517O480O967
59173H37187P069P241P790Q391Q465P821O561M721K508O14l94q95j818l517n539
59158H86205p378q755r299q736p536o684o609o847o895o820o878p032p056o797
59144G82883o237n639n473n768n728m628l053k356k818l172k265l81J409K530
59130G39304L044L201L455M408O150P934R073R795J0792J2287J4095J6200J8611
59117H58349K0811K2107K2575K3055K4053K5153K5606K5061K3545K1171J8267
59106A109753J5448J3113J0890Q009M299M91k594m901o923q837j0245j0701j0134
59093A107668q753o931n241m236l931l943m208n127o747q329r221r661j0203j0765
$$ y = [774257, 778010, 782942, 787620, 791397, 794964, 799058, 803375, 807181, 810437, 813873, 818223, 823740, 830220, 837187, 844256, 851497, 859287, 867678, 876143, 883964, 890525, 895246, 897754, 898368, 897974, 897079, 895261, 891744, 886205, 878827, 870072, 860773, 852037, 844501, 837817, 831208, 824361, 817466, 810646, 803768, 796736, 789680, 782883, 776646, 771007, 765534, 759766, 754038, 749410, 746357, 744001, 741183, 738011, 735746, 735365, 736774, 739304, 742348, 745549, 749004, 753412, 759562, 767496, 776569, 786364, 797156, 809443, 823538, 839738, 858349, 879160, 901267, 923842, 946897, 970950, 996103, 1021709, 1046770, 1070315, 1091486, 1109753, 1125201, 1138314, 1149204, 1157213, 1161512, 1162003, 1159409, 1154508, 1147585, 1138748, 1128503, 1117802, 1107668, 1098915, 1091984, 1086743, 1082507, 1078576, 1074633, 1070425, 1065298, 1058551, 1050222, 1041001, 1031340, 1021137, 1010372]
59079A010372j0872j0538j0119r596q772q008p909q286q235p334o012m753l685
59066I06253l168l753n237o502o766o380o022n784n521n389n370m853l414j660
59052H36434o33n36o75m37J44P39J107J148Q84M49o3o14r46n97O28K386M161N700
59034H49279O956P943Q883J0135J1731J3281J4528J5652J6764J7534J7601J6939
59022A007226J5482J2893R235N433K486M73j146k526l344l472l124k368j118M68
59008A036598K046L567N210O840Q013Q520Q541Q227P592O742N787M401K088r19
58994A113253l499m729m918n226o459q440j0346j1377j1198j0029q404o731m992
58981A016905k999q86Q75K089L273N107P405R070R365Q914Q977R936J1040J1610
$$ y = [1010372, 999500, 988962, 978843, 969247, 960475, 952467, 944558, 936272, 928037, 920703, 914691, 909938, 906253, 903085, 899332, 894095, 887593, 880827, 874447, 868425, 862641, 857120, 851731, 846361, 841508, 838094, 836434, 835801, 835265, 834590, 834153, 834297, 835036, 836143, 837291, 838175, 838624, 838561, 837947, 837001, 836404, 837032, 839418, 843579, 849279, 856235, 864178, 873061, 883196, 894927, 908208, 922736, 938388, 955152, 972686, 990287, 1007226, 1022708, 1035601, 1044836, 1050269, 1052755, 1053228, 1052082, 1049556, 1046212, 1042740, 1039616, 1037248, 1036130, 1036598, 1038644, 1042211, 1047421, 1054261, 1062274, 1070794, 1079335, 1087562, 1095154, 1101896, 1107683, 1112084, 1114172, 1113253, 1109754, 1105025, 1100107, 1094881, 1088422, 1079982, 1069636, 1058259, 1047061, 1037032, 1028628, 1021897, 1016905, 1013906, 1013020, 1013895, 1015984, 1019257, 1024364, 1031769, 1040839, 1050204, 1059118, 1068095, 1078031, 1089071, 1100681]
58967A100681J1817J2076J2358J2456J2460J2374J1600R418N929K061j390m386
58955A197454p317j0403j3512j6243j8115j8789j8247j6829j5067j3380j1737
58944A037815r644o742l479r77n8o30k056l757n280o286o852p498q502r345r286
58929I57423q367p409o981o820o363n474m443l509k683j982j493j073j97J561
58915I02190L817N542O229O557P499Q979J0082J0488J0974J2221J3778J4722J4928
58902A028006J5098J5722J6501J6918J6992J7284J8158J9233J9817J9999K0820
58891A224548K2880K5089K5560K3742K0815J7834J4433R866M494o23n139r565
58879A373934j4115j8190k1096k2844k3980k4907k5435k5048k3584k1505j9302
$$ y = [1100681, 1112498, 1124574, 1136932, 1149388, 1161848, 1174222, 1185822, 1195240, 1201169, 1203230, 1201840, 1197454, 1190137, 1179734, 1166222, 1149979, 1131864, 1113075, 1094828, 1077999, 1062932, 1049552, 1037815, 1028171, 1021429, 1017950, 1016973, 1016915, 1016285, 1014229, 1010472, 1005192, 998906, 992054, 984556, 976054, 966709, 957423, 949056, 941647, 934666, 927846, 921483, 916009, 911566, 908057, 905374, 903392, 901899, 900826, 900629, 902190, 906007, 911549, 917778, 924335, 931834, 940813, 950895, 961383, 972357, 984578, 998356, 1013078, 1028006, 1043104, 1058826, 1075327, 1092245, 1109237, 1126521, 1144679, 1163912, 1183729, 1203728, 1224548, 1247428, 1272517, 1298077, 1321819, 1342634, 1360468, 1374901, 1384767, 1389261, 1388638, 1383499, 1373934, 1359819, 1341629, 1320533, 1297689, 1273709, 1248802, 1223367, 1198319, 1174735, 1153230, 1133928]
58868A133928j6935j4333j2194j1436j1814j2070j1672j1418j1872j2229j1532
58857I96423j0148r026q248p351o653o992q347r716j0406j0581j0595j0539j0509
58844H77312j0577j0450r737q512p112n564l828k385j770j671j238k50P75J519
58830H16512K075K345K100J672J685K022J989J601J629K114J955N91r30j338q64
58815H35158o73j130j538j399j074j128j654k336k813k885k625k397k508k900
58801H08098l225l289l185l110l159l318l500l538l151k095m68J205K411L225
58787G82901M131N199N811N513M696M093L857L700L599L855M457M964N003M487
58773H46266L398J853K38j117k340l548m212l702k441j740k213l076l299k912
$$ y = [1133928, 1116993, 1102660, 1090466, 1079030, 1067216, 1055146, 1043474, 1032056, 1020184, 1007955, 996423, 986275, 977249, 969001, 961650, 954997, 948005, 939658, 929942, 919536, 908955, 898360, 887821, 877312, 866735, 856285, 846548, 838036, 830924, 825360, 821532, 819147, 817377, 815706, 814468, 814218, 814993, 816512, 818587, 820932, 823032, 824704, 826389, 828411, 830400, 832001, 833630, 835744, 837699, 838290, 837360, 836022, 835158, 834485, 833355, 831817, 830418, 829344, 828216, 826562, 824226, 821413, 818528, 815903, 813506, 810998, 808098, 804873, 801584, 798399, 795289, 792130, 788812, 785312, 781774, 778623, 776528, 776060, 777265, 779676, 782901, 787032, 792231, 798042, 803555, 808251, 812344, 816201, 819901, 823500, 827355, 831812, 836776, 841779, 846266, 849664, 851517, 851755, 850638, 848298, 844750, 840538, 836836, 834395, 832655, 830442, 827366, 824067, 821155]
58759H21155k650k817k992k665j703l09J185K445L280L727M000M392N159O376
58745H38583P892R523J1171J2700J3890J4687J5312J5997J6711J7259J7391J6771
58733A007887J5266J3388J1851J0427P937L931l38l347n068o390p424p576p035
58720A033509o825p305p770p740p578p599p580p469p638q108q353q321q675r657
58706I22891j0600j1167j2143j4182j6439j7345j6435j4647j3067j2056j1422
58695G73388j0772r734q213o573n329m694m508m422m009l006j675o72l19j99L53
58680G09616J505K911M243N571P188R128J0999J2406J3540J4940J6630J8005J8813
58667H45495J9562K0451K0596J9023J5872J1671O167q16p851j2818j5292j6555
$$ y = [821155, 818505, 815688, 812696, 810031, 808328, 808019, 809204, 811649, 814929, 818656, 822656, 827048, 832207, 838583, 846475, 855998, 867169, 879869, 893759, 908446, 923758, 939755, 956466, 973725, 991116, 1007887, 1023153, 1036541, 1048392, 1058819, 1066756, 1070687, 1070349, 1067002, 1061934, 1055544, 1048120, 1040544, 1033509, 1026684, 1019379, 1011609, 1003869, 996291, 988692, 981112, 973643, 966005, 957897, 949544, 941223, 932548, 922891, 912291, 901124, 888981, 874799, 858360, 841015, 824580, 809933, 796866, 784810, 773388, 762616, 752882, 744669, 738096, 732767, 728073, 723565, 719143, 715134, 712128, 710453, 709781, 709462, 709263, 709616, 711121, 714032, 718275, 723846, 731034, 740162, 751161, 763567, 777107, 792047, 808677, 826682, 845495, 865057, 885508, 906104, 925127, 940999, 952670, 958837, 958021, 950170, 937352, 922060, 905505]
58655I05505j7166j6264j3699j1075r691q822p154m789k697j146R5O90K06p92
58641H13201j247r92p16q02j083j482j997k238j779q79j26N38J625L064M167M702
58625H13956N317O598Q233R414R692R302Q811Q572Q382P745O494N025L705K300
58611I13546L19k140m234n158m929m368m262m638m903m696m250l845l341k631
58597H60470k043j716j000P60L120N163O936R208J1917J4004J4994J5485J5778
58584I53076J5255J3616J1607R823P809N160K658J373J303J772K595M139O569
58571A036755R729J3363J6975J9859K1789K3156K4136K4368K3815K3025K2021
58560A258991J9895J6222J2073Q728O111L427O47j657l418n044o585p863r007
$$ y = [905505, 888339, 872075, 858376, 847301, 837610, 828788, 821634, 816845, 814148, 813002, 813097, 813787, 813993, 813201, 811954, 810962, 810246, 809444, 808361, 806879, 804882, 802644, 800865, 799986, 799860, 800398, 802023, 805087, 809254, 813956, 819273, 825871, 834104, 843518, 853210, 862512, 871323, 879895, 888277, 896022, 902516, 907541, 911246, 913546, 913865, 911725, 907491, 902333, 897404, 893036, 888774, 884136, 879233, 874537, 870287, 866442, 863101, 860470, 858427, 856711, 855711, 856471, 859591, 864754, 871690, 880898, 892815, 906819, 921813, 937298, 953076, 968331, 981947, 993554, 1003377, 1011186, 1016346, 1019004, 1020377, 1021680, 1023452, 1026047, 1030186, 1036755, 1046484, 1059847, 1076822, 1096681, 1118470, 1141626, 1165762, 1190130, 1213945, 1236970, 1258991, 1278886, 1295108, 1307181, 1315909, 1322020, 1325447, 1326094, 1324437, 1321019, 1315975, 1309390, 1301527, 1292520]
58547A292520j0157j1017j1457j2035j3144j4127j4174j3533j2988j2603j2002
58536A155283j1370j1058j0573r121o961n064l521j511J131L443M747N581O798
58523A117804Q341R357R141P785O023M442K801M93k254m303n125n694p143r210
58509A132458j0821j1627j1995j1973j1320j0323r585r075q332p440o882o512
58497A016573n576l804j731J17J655K882L776M631N887P582R359J0957J2321J3415
58483A078044J4274J4969J5155J4121J1735Q848O218L588N18k607n135p146q959
58470A143623j0180j0254r503q634p604o001m179k838j742l3K295M322N536O260
58456A101068O741O732O054M806L113J274j57j080k198l800m786m031k216r93
$$ y = [1292520, 1282363, 1271346, 1259889, 1247854, 1234710, 1220583, 1206409, 1192876, 1179888, 1167285, 1155283, 1143913, 1132855, 1122282, 1113161, 1106200, 1101136, 1097615, 1096104, 1097235, 1100678, 1105425, 1111006, 1117804, 1126145, 1135502, 1144643, 1152428, 1158451, 1162893, 1165694, 1166187, 1163933, 1159630, 1154505, 1148811, 1141668, 1132458, 1121637, 1110010, 1098015, 1086042, 1074722, 1064399, 1054814, 1045739, 1037407, 1029967, 1023085, 1016573, 1010997, 1007193, 1005462, 1005579, 1007234, 1010116, 1013892, 1018523, 1024410, 1031992, 1041351, 1052308, 1064629, 1078044, 1092318, 1107287, 1122442, 1136563, 1148298, 1157146, 1163364, 1166952, 1167470, 1164863, 1159728, 1152582, 1143623, 1133443, 1123189, 1113686, 1105052, 1097448, 1091447, 1087268, 1084430, 1082688, 1082655, 1084950, 1089272, 1094808, 1101068, 1107809, 1114541, 1120595, 1125401, 1128514, 1129788, 1129631, 1128551, 1126353, 1122553, 1117767, 1113736, 1111520, 1110527]
58442A110527o02K61K287M604O136O721O641O177N837O204P263Q551R903J1285
58428A191795J2128J1783J0506R110P779O137M245K395K47k638n528p085p260
58415A233614p363q153q971r040q462p645o674n503m076k229j62J239J480J606
58401A169661L070N629P556P864P122O082M808L398K309J622Q64j73j180j889
58387A216743k101j422Q2J322J416J188K165M333O271P259P782Q009P455O374
58373A266876N894O448P275P793Q234Q767R184R638J0480J1274J1166J0240R243
58360A382512Q103O156L827K485K456K664K433K231K495L165M482O769R344J1177
58346A450299J2637J4919J7782J9680K0284K0875K1881K2044K0537J8139J5686
$$ y = [1110527, 1109925, 1110186, 1112473, 1117077, 1123213, 1129934, 1136575, 1142752, 1148589, 1154793, 1162056, 1170607, 1180510, 1191795, 1203923, 1215706, 1226212, 1235322, 1243101, 1249238, 1253483, 1255878, 1256125, 1253487, 1247959, 1240874, 1233614, 1226251, 1218098, 1209127, 1200087, 1191625, 1183980, 1177306, 1171803, 1167727, 1165498, 1165336, 1166575, 1168055, 1169661, 1172731, 1178360, 1185916, 1193780, 1200902, 1206984, 1211792, 1215190, 1217499, 1219121, 1219985, 1219812, 1218632, 1216743, 1214642, 1213220, 1213302, 1214624, 1216040, 1217228, 1219393, 1223726, 1229997, 1237256, 1245038, 1253047, 1260502, 1266876, 1272770, 1279218, 1286493, 1294286, 1302520, 1311287, 1320471, 1330109, 1340589, 1351863, 1363029, 1373269, 1382512, 1390615, 1396771, 1400598, 1403083, 1405539, 1408203, 1410636, 1412867, 1415362, 1418527, 1423009, 1429778, 1439122, 1450299, 1462936, 1477855, 1495637, 1515317, 1535601, 1556476, 1578357, 1600401, 1620938, 1639077, 1654763]
58335A654763J3089J0400Q204O423M404K556K057K576K305Q41k4Q15K179K877
58321A713465L529M965O563P474Q136R315J0832J2188J3384J4409J5043J5642
58309A834945J6874J8366J9002J8852J9126J9962K0056J8980J7920J7591J7251
58298B038925J6446J5898J6053J6444J6988J8146J9474K0035K0420K2108K4650
58287B245587K6026K6187K7375L0219L2460L2603L2038L2310L2948L3373L4343
58276B585469L6099L7510L8468M0645M4638M8704N1562N3935N6213N7306N7126
58265C107675N7395N8622N9003N7679N6156N5249N3724N1485N0847N2833N5457
58254C716125N7484O0534O5460P0057P2687P4972P8574Q2539Q6089R0778R7379
$$ y = [1654763, 1667852, 1678252, 1686456, 1692879, 1697283, 1699839, 1701896, 1704472, 1706777, 1707618, 1707594, 1708409, 1710588, 1713465, 1716994, 1721959, 1728522, 1735996, 1744132, 1753447, 1764279, 1776467, 1789851, 1804260, 1819303, 1834945, 1851819, 1870185, 1889187, 1908039, 1927165, 1947127, 1967183, 1986163, 2004083, 2021674, 2038925, 2055371, 2071269, 2087322, 2103766, 2120754, 2138900, 2158374, 2178409, 2198829, 2220937, 2245587, 2271613, 2297800, 2325175, 2355394, 2387854, 2420457, 2452495, 2484805, 2517753, 2551126, 2585469, 2621568, 2659078, 2697546, 2738191, 2782829, 2831533, 2883095, 2937030, 2993243, 3050549, 3107675, 3165070, 3223692, 3282695, 3340374, 3396530, 3451779, 3505503, 3556988, 3607835, 3660668, 3716125, 3773609, 3834143, 3899603, 3969660, 4042347, 4117319, 4195893, 4278432, 4364521, 4455299, 4552678]
58243D552678J03825J08726J13762J20213J26512J31591J37286J44907J52919
58234E692419J60466J69480J80748J91823K01486K12371K26392K41759K57257
58225G534201K75054K96363L18901L41759L67943L99034M32307M66530N05269
58216A0937361N51137O02350O58320P22703P97501Q80787R73848J083623J214655
58207A8422285J366669J543887J758252K020306K337475K726139L215313L835035
58199C7225361M611763N573331O738539Q102032R659752J1460855J3608547J6201401
58191A13181581J9301284K2933674K6993170L1041528L4242207L5612119L4372184
58184C17677747L0055124K2453827J1812554p41618j3139464k3113380k9281303
$$ y = [4552678, 4656503, 4765229, 4878991, 4999204, 5125716, 5257307, 5394593, 5539500, 5692419, 5852885, 6022365, 6203113, 6394936, 6596422, 6808793, 7035185, 7276944, 7534201, 7809255, 8105618, 8424519, 8766278, 9134221, 9533255, 9965562, 10432092, 10937361, 11488498, 12090848, 12749168, 13471871, 14269372, 15150159, 16124007, 17207630, 18422285, 19788954, 21332841, 23091093, 25111399, 27448874, 30175013, 33390326, 37225361, 41837124, 47410455, 54148994, 62251026, 71910778, 83371633, 96980180, 113181581, 132482865, 155416539, 182409709, 213451237, 247693444, 283305563, 317677747, 347732871, 370186698, 381999252, 381257634, 368118170, 345004790, 315723487]
58177C15723487l1657085l1257744k9322458k6787884k4172906k1668539j9276710
58170A31580161j6958672j4734039j2673605j0834364r231627p859274o703893
58163E2584687n739418m932174m256737l696147l229868k834683k495855k206572
58155B3193233j958446j742117j554535j395970j261328j142051j034449r39030
58147A2165307q53913p75618p04107o40701n83113n28232m77354m33213l94287
58138F774769l57350l23203k94545k70589k48951k30563k17526k07920j97776
58129D426346j86571j76200j66193j54526j41916j30917j21747j12728j03856
58120C131692r6457r0309q4218p8338p3212o8025o2318n7672n5130n2965m9689
$$ y = [315723487, 284066402, 252808658, 223486200, 196698316, 172525410, 150856871, 131580161, 114621489, 99887450, 87213845, 76379481, 67147854, 59288580, 52584687, 46845269, 41913095, 37656358, 33960211, 30730343, 27895660, 25399805, 23193233, 21234787, 19492670, 17938135, 16542165, 15280837, 14138786, 13104337, 12165307, 11311394, 10535776, 9831669, 9190968, 8607855, 8079623, 7602269, 7169056, 6774769, 6417419, 6094216, 5799671, 5529082, 5280131, 5049568, 4832042, 4624122, 4426346, 4239775, 4063575, 3897382, 3742856, 3600940, 3470023, 3348276, 3235548, 3131692, 3035235, 2944926, 2860708, 2782370, 2709158, 2641133, 2578815, 2521143, 2466013, 2413048, 2363359]
58109B363359m6939m6440m6433m4497m1756m0788m1183m0693l9194l8003l6697
58098A900736l4110l1239k9861k9333k7869k5877k4858k4048k1426j7317j4005
58087A620793j2279j1132j0253j0268j1109j2374j4526j7638k0028k0404k0093
58076A460689k0782k1423k0034j7283j5377j4519j3368j2059j1691j1548r952
58065A292653p415o026n964n445l933k686k233j874j721k719m561n787o089o358
58051A229842o663o225n354n215n688n588m975n154o333p278p404p335p298o787
58037A142545n945n576n609n217m378l840l605l047k446k707l670m221m042l693
58023A084549l229k270j227q42p13R0J319J995K265L030M101M559M590N048N483
$$ y = [2363359, 2316420, 2269980, 2223547, 2179050, 2137294, 2096506, 2055323, 2014630, 1975436, 1937433, 1900736, 1866626, 1835387, 1805526, 1776193, 1748324, 1722447, 1697589, 1673541, 1652115, 1634798, 1620793, 1608514, 1597382, 1587129, 1576861, 1565752, 1553378, 1538852, 1521214, 1501186, 1480782, 1460689, 1439907, 1418484, 1398450, 1381167, 1365790, 1351271, 1337903, 1325844, 1314153, 1302605, 1292653, 1285238, 1279212, 1273248, 1267803, 1263870, 1261184, 1258951, 1257077, 1255356, 1252637, 1248076, 1242289, 1236200, 1229842, 1223179, 1216954, 1211600, 1206385, 1200697, 1195109, 1190134, 1184980, 1178647, 1171369, 1163965, 1156630, 1149332, 1142545, 1136600, 1131024, 1125415, 1120198, 1115820, 1111980, 1108375, 1105328, 1102882, 1100175, 1096505, 1092284, 1088242, 1084549, 1081320, 1079050, 1077823, 1076981, 1076268, 1076358, 1077677, 1079672, 1081937, 1084967, 1089068, 1093627, 1098217, 1103265, 1108748]
58008A108748M762L450L385M776N888N917N982O836P592P456O867O254N304M142
57994A187359L606L625K801L82k678n219p221q948j0000r969r085p693n990m635
57980A126335m534n487o080n422m072k941k180j604j270j180j066q16n05l2O30
57965A089776R51N80L63J512L687N140M941L959L491L868M696N427N483M691L736
57950A142301L424L606L699L995N213O950P990Q211Q777J0269J1980J3345J4606
57937A244366J5707J5980J5421J5055J5377J5570J4877J3608J2208J0391P864
57926A396424N054K408j87k773m848o123o969p634p737p011n877m824l803k780
57912A343320k158k254k771l198l294l044k603k382k587k709k101r98k23N6L39
$$ y = [1108748, 1113510, 1116960, 1120345, 1125121, 1131009, 1136926, 1142908, 1149744, 1157336, 1164792, 1171659, 1177913, 1183217, 1187359, 1190965, 1194590, 1197391, 1197773, 1195095, 1189876, 1182655, 1173707, 1163707, 1153738, 1144653, 1136960, 1130970, 1126335, 1121801, 1116314, 1110234, 1104812, 1100740, 1097799, 1095619, 1094015, 1092745, 1091565, 1090499, 1089683, 1089178, 1089146, 1089776, 1090727, 1091307, 1091670, 1093182, 1096869, 1102009, 1106950, 1110909, 1114400, 1118268, 1122964, 1128391, 1133874, 1138565, 1142301, 1145725, 1149331, 1153030, 1157025, 1162238, 1169188, 1177178, 1185389, 1194166, 1204435, 1216415, 1229760, 1244366, 1260073, 1276053, 1291474, 1306529, 1321906, 1337476, 1352353, 1365961, 1378169, 1388560, 1396424, 1401478, 1403886, 1403699, 1400926, 1396078, 1389955, 1382986, 1375352, 1367615, 1360604, 1354727, 1349903, 1346100, 1343320, 1341162, 1338908, 1336137, 1332939, 1329645, 1326601, 1323998, 1321616, 1319029, 1316320, 1314219, 1313221, 1312998, 1313054, 1313393]
57897A313393O47N35K91Q86K330L327L062K361K440L320M135M308L809K878J987
57882A349709J655J877K135K138K115K240K424K709L228L661L483K819K391K485
57868A385069K749K986L396L917M239M516N188O034O341O049N814N832N683N378
57854A453191N336N228M145K229Q21N11K90p85k291l415m056m299l886k961k370
57839A447688k452k473j901j312j233j106k78R13J893K823L897M541M369M190
57825A459559N002O486P528P764P587P103O080M746L648K907K316K077K643L889
57811A529335N003N257M536L305K296K032K377K761L004L480M354N293O078O862
57797A585973P568P765P484P383P643P613P024O678P170P825P789P455P740Q467
$$ y = [1313393, 1314040, 1314575, 1314866, 1315752, 1318082, 1321409, 1324471, 1326832, 1329272, 1332592, 1336727, 1341035, 1344844, 1347722, 1349709, 1351364, 1353241, 1355376, 1357514, 1359629, 1361869, 1364293, 1367002, 1370230, 1373891, 1377374, 1380193, 1382584, 1385069, 1387818, 1390804, 1394200, 1398117, 1402356, 1406872, 1412060, 1418094, 1424435, 1430484, 1436298, 1442130, 1447813, 1453191, 1458527, 1463755, 1467900, 1470129, 1470950, 1471461, 1471751, 1470966, 1468675, 1465260, 1461204, 1456905, 1453019, 1450058, 1447688, 1445236, 1442763, 1440862, 1439550, 1438317, 1437211, 1436933, 1437846, 1439739, 1442562, 1446459, 1451000, 1455369, 1459559, 1464561, 1471047, 1478575, 1486339, 1493926, 1501029, 1507109, 1511855, 1515503, 1518410, 1520726, 1522803, 1525446, 1529335, 1534338, 1539595, 1544131, 1547436, 1549732, 1551764, 1554141, 1556902, 1559906, 1563386, 1567740, 1573033, 1579111, 1585973, 1593541, 1601306, 1608790, 1616173, 1623816, 1631429, 1638453, 1645131, 1652301, 1660126, 1667915, 1675370, 1683110, 1691577]
57783A691577Q623P963P336P371P700P602O912O068N577N439N022L746J937N41
57769A773414j11o23j406j993j962j820k217k826k739j664j24J292K368L170L964
57754A766723M930N748N909N659O022P450R102J0018J0289J0477J0493R875Q747
57741A871442P669O792N882M926M170L698L487L534L549K927J601N00N11J318
57727A922006J858J718J449J669K365L039L241L030L009L602M277M082K960J887
57713A960192J534J632J956K819M065M643M049L295L537M486N184N567O205P061
57699B016225P633P957Q353Q565Q217P750P867Q258P994P045O383O624P476Q546
57685B124893R707J0748J1521J2536J4572J7684K1269K5071K9409L4431L9950
$$ y = [1691577, 1700200, 1708163, 1715499, 1722870, 1730570, 1738172, 1745084, 1751152, 1756729, 1762168, 1767190, 1770936, 1772873, 1773414, 1773303, 1772680, 1771274, 1769281, 1767319, 1765499, 1763282, 1760456, 1757717, 1756053, 1755929, 1757221, 1759589, 1762759, 1766723, 1771653, 1777401, 1783310, 1788969, 1794991, 1802441, 1811543, 1821561, 1831850, 1842327, 1852820, 1862695, 1871442, 1879111, 1885903, 1891785, 1896711, 1900881, 1904579, 1908066, 1911600, 1915149, 1918076, 1919677, 1920177, 1920688, 1922006, 1923864, 1925582, 1927031, 1928700, 1931065, 1934104, 1937345, 1940375, 1943384, 1946986, 1951263, 1955345, 1958305, 1960192, 1961726, 1963358, 1965314, 1968133, 1972198, 1976841, 1980890, 1984185, 1987722, 1992208, 1997392, 2002959, 2009164, 2016225, 2023858, 2031815, 2040168, 2048733, 2056950, 2064700, 2072567, 2080825, 2088819, 2095864, 2102247, 2108871, 2116347, 2124893, 2134600, 2145348, 2156869, 2169405, 2183977, 2201661, 2222930, 2248001, 2277410, 2311841, 2351791]
57674B351791M6070N3254O1720P1319Q1863R2796J02417J08096J07275R7956P8776
57663C253333M9957J4600k1705n3152p5743q7861r0131q5126p6204o5910n5384
57652B706674m5207l6198k9092k3826j9547j5334j0988p151m562l132k020o67
57640B508950P13J829K919M207N389O166O800P566Q215Q523Q848R385R571R021
57626B598102Q482Q824R588R663Q990Q402Q100P596P045P242Q158Q800Q833R159
57612B716984J0374J1689J1994J1226J0131R313Q988R198R752J0318J0775J1217
57600B841959J1542J1501J1179J0958J0955J1013J1143J1439J1606J1252J0628
57589B965175J0350J0470J0528J0509J0870J1541J1796J1364J0862J0770J0824
$$ y = [2351791, 2397861, 2451115, 2512835, 2584154, 2666017, 2758813, 2861230, 2969326, 3076601, 3174557, 3253333, 3303290, 3317890, 3296185, 3243033, 3167290, 3079429, 2989298, 2904172, 2827968, 2762058, 2706674, 2661467, 2625269, 2596177, 2572351, 2552804, 2537470, 2526482, 2519331, 2514769, 2511637, 2509617, 2508950, 2509663, 2511492, 2514411, 2518618, 2524007, 2530173, 2536973, 2544539, 2552754, 2561277, 2570125, 2579510, 2589081, 2598102, 2606584, 2615408, 2624996, 2634659, 2643649, 2652051, 2660151, 2667747, 2674792, 2682034, 2690192, 2698992, 2707825, 2716984, 2727358, 2739047, 2751041, 2762267, 2772398, 2781711, 2790699, 2799897, 2809649, 2819967, 2830742, 2841959, 2853501, 2865002, 2876181, 2887139, 2898094, 2909107, 2920250, 2931689, 2943295, 2954547, 2965175, 2975525, 2985995, 2996523, 3007032, 3017902, 3029443, 3041239, 3052603, 3063465, 3074235, 3085059]
57578C085059J0791J1045J1860J2717J2918J2501J2107J2167J2608J3103J3369
57567C220245J3423J3542J3857J4090J4052J4073J4451J4697J4183J3403J3590
57556C373606J4924J6097J6026J5152J4618J4853J5527J6313J7055J7615J8020
57545C549806J8492J9006J9119J8627J8002J7842J8104J8216J7796J6982J6214
57534C748206J5813J5700J5514J5139J4932J5242J5859J6322J6618J7061J7657
57523C924063J8118J8365J8491J8364J7930J7752J8485J9809K0701K0832K0843
57512D133753K1169K1415K1255K1041K1083K1084K0787K0574K0841K1324K1479
57501D365805K1238K0827K0289J9648J9229J9320J9670J9714J9302J8841J8763
$$ y = [3085059, 3095850, 3106895, 3118755, 3131472, 3144390, 3156891, 3168998, 3181165, 3193773, 3206876, 3220245, 3233668, 3247210, 3261067, 3275157, 3289209, 3303282, 3317733, 3332430, 3346613, 3360016, 3373606, 3388530, 3404627, 3420653, 3435805, 3450423, 3465276, 3480803, 3497116, 3514171, 3531786, 3549806, 3568298, 3587304, 3606423, 3625050, 3643052, 3660894, 3678998, 3697214, 3715010, 3731992, 3748206, 3764019, 3779719, 3795233, 3810372, 3825304, 3840546, 3856405, 3872727, 3889345, 3906406, 3924063, 3942181, 3960546, 3979037, 3997401, 4015331, 4033083, 4051568, 4071377, 4092078, 4112910, 4133753, 4154922, 4176337, 4197592, 4218633, 4239716, 4260800, 4281587, 4302161, 4323002, 4344326, 4365805, 4387043, 4407870, 4428159, 4447807, 4467036, 4486356, 4506026, 4525740, 4545042, 4563883, 4582646]
57490D582646J9008J9110J8791J8392J8503J9170J9781J9962K0092K0605K1237
57479D797297K1552K1756K2293K2968K3288K3364K3600K3771K3372K2781K2952
57468E048994K3938K4786K5011K5171K5719K6339K6698K6950K7089K6681K5646
57457E333022K4553K3837K3457K3514K4329K5613K6491K6717K7000K7754K8390
57446E614677K8318K7761K7188K6728K6603K7194K8210K8703K8407K8154K8457
57435E920400K8678K8309K8029K8574K9441K9656K9173K8598K8130K7689K7528
57424F234205K7857K8310K8579K9021K9862L0374K9837K8837K8552K9145K9794
57413F554373L0116L0483L0992L1126L0616K9936K9766L0352L1439L2376L2450
$$ y = [4582646, 4601654, 4620764, 4639555, 4657947, 4676450, 4695620, 4715401, 4735363, 4755455, 4776060, 4797297, 4818849, 4840605, 4862898, 4885866, 4909154, 4932518, 4956118, 4979889, 5003261, 5026042, 5048994, 5072932, 5097718, 5122729, 5147900, 5173619, 5199958, 5226656, 5253606, 5280695, 5307376, 5333022, 5357575, 5381412, 5404869, 5428383, 5452712, 5478325, 5504816, 5531533, 5558533, 5586287, 5614677, 5642995, 5670756, 5697944, 5724672, 5751275, 5778469, 5806679, 5835382, 5863789, 5891943, 5920400, 5949078, 5977387, 6005416, 6033990, 6063431, 6093087, 6122260, 6150858, 6178988, 6206677, 6234205, 6262062, 6290372, 6318951, 6347972, 6377834, 6408208, 6438045, 6466882, 6495434, 6524579, 6554373, 6584489, 6614972, 6645964, 6677090, 6707706, 6737642, 6767408, 6797760, 6829199, 6861575, 6894025]
57402F894025L1508L0252K9529K9526K9902L0441L1156L1916L2432L2517L2144
57391G235348L1477L0955L0982L1376L1556L1483L1811L2835L3898L4282L4129
57380G590132L4006L4128L4447L5003L5632L5846L5486L5028L4841L4697L4440
57369G973686L4497L5122L5784L5952L5913L6113L6323L6205L6118L6517L7024
57358H369254L6991L6654L6807L7540L8087L7889L7157L6447L6197L6498L6997
57347H776518L7154L6912L6734L6743L6398L5429L4381L3770L3372L2967L3063
57336I163441L4076L5406L6163L6322L6418L6577L6649L6762L6959L6772L5987
57325I561532L5349L5633L6488L7034L7089L6979L6651L5971L5471L5676L6100
$$ y = [6894025, 6925533, 6955785, 6985314, 7014840, 7044742, 7075183, 7106339, 7138255, 7170687, 7203204, 7235348, 7266825, 7297780, 7328762, 7360138, 7391694, 7423177, 7454988, 7487823, 7521721, 7556003, 7590132, 7624138, 7658266, 7692713, 7727716, 7763348, 7799194, 7834680, 7869708, 7904549, 7939246, 7973686, 8008183, 8043305, 8079089, 8115041, 8150954, 8187067, 8223390, 8259595, 8295713, 8332230, 8369254, 8406245, 8442899, 8479706, 8517246, 8555333, 8593222, 8630379, 8666826, 8703023, 8739521, 8776518, 8813672, 8850584, 8887318, 8924061, 8960459, 8995888, 9030269, 9064039, 9097411, 9130378, 9163441, 9197517, 9232923, 9269086, 9305408, 9341826, 9378403, 9415052, 9451814, 9488773, 9525545, 9561532, 9596881, 9632514, 9669002, 9706036, 9743125, 9780104, 9816755, 9852726, 9888197, 9923873, 9959973]
57314I959973L5852L4987L4306L4151L4273L4523L4731L4350L3236L2351L2597
57303A0335330L3359L3386L2668L2150L1941L1291L0193K9550K9634K9744K9564
57292A0678810K9557K9755K9439K8425K7501K7187K7001K6383K5413K4343K3257
57281A0977071K2513K2578K3135K3211K2634K2427K3318K4615K5128K4570K3541
57270A1234741K2647K2084K1752K1310K0424J9119J7726J6450J5271J4261J3552
57259A1439337J3014J2399J1711J1092J0366R169P492N697M109K859J995J494
57247A1530734J341J706K572L181K659J495J347K818M464M864M543M752N472O044
57233A1577992O719P981R054Q898Q115Q091Q648Q450P369O476N786M148J507p34
$$ y = [9959973, 9995825, 10030812, 10065118, 10099269, 10133542, 10168065, 10202796, 10237146, 10270382, 10302733, 10335330, 10368689, 10402075, 10434743, 10466893, 10498834, 10530125, 10560318, 10589868, 10619502, 10649246, 10678810, 10708367, 10738122, 10767561, 10795986, 10823487, 10850674, 10877675, 10904058, 10929471, 10953814, 10977071, 10999584, 11022162, 11045297, 11068508, 11091142, 11113569, 11136887, 11161502, 11186630, 11211200, 11234741, 11257388, 11279472, 11301224, 11322534, 11342958, 11362077, 11379803, 11396253, 11411524, 11425785, 11439337, 11452351, 11464750, 11476461, 11487553, 11497919, 11507088, 11514580, 11520277, 11524386, 11527245, 11529240, 11530734, 11532075, 11533781, 11536353, 11539534, 11542193, 11543688, 11545035, 11547853, 11552317, 11557181, 11561724, 11566476, 11571948, 11577992, 11584711, 11592692, 11601746, 11610644, 11618759, 11626850, 11635498, 11643948, 11651317, 11657793, 11663579, 11667727, 11669234, 11668500]
57219A1668500k111l813o451q915j0321j1474j3446j6027j8483k0743k3062k5430
57207A1508224k7970l0964l3970l5899l6470l6623l7036l7344l7244l7170l7328
57196A1120206l7031l5755l3965l2370l1070k9871k8723k7597k6614k6408k7445
57185A0783357k8946k9554k9100k8626k8630k8560k8232k8350k9269l0391l1046
57174A0462653l0996l0027k8188k6368k5271k4095k1705j8926j7634j7783j7505
57163A0204155j6307j5810j6850j8320j9739k2615k8323l6754m7912o2164p7325
57152I842036q7974q9888q3977p4607o5726n9957n9157o3443p0563p7962q4677
57141I024105r0244r3430r3650r2205r0472q7973q3711p8040p1834o4859n6648
$$ y = [11668500, 11666389, 11662576, 11656125, 11647210, 11636889, 11625415, 11611969, 11595942, 11577459, 11556716, 11533654, 11508224, 11480254, 11449290, 11415320, 11379421, 11342951, 11306328, 11269292, 11231948, 11194704, 11157534, 11120206, 11083175, 11047420, 11013455, 10981085, 10950015, 10920144, 10891421, 10863824, 10837210, 10810802, 10783357, 10754411, 10724857, 10695757, 10667131, 10638501, 10609941, 10581709, 10553359, 10524090, 10493699, 10462653, 10431657, 10401630, 10373442, 10347074, 10321803, 10297708, 10276003, 10257077, 10239443, 10221660, 10204155, 10187848, 10172038, 10155188, 10136868, 10117129, 10094514, 10066191, 10029437, 9981525, 9919361, 9842036, 9754062, 9664174, 9580197, 9505590, 9439864, 9379907, 9320750, 9257307, 9186744, 9108782, 9024105, 8933861, 8840431, 8746781, 8654576, 8564104, 8476131, 8392420, 8314380, 8242546, 8177687, 8121039]
57130H121039m7861l9548l2116k6211k3290k4097k7823l3786m2309n2809o2680
57119G708509o9514p2836p2555o7704n8193m5856l2193j6971m34J5418K9576M3861
57107G361108O0239P8600R9136J24508J57507J98945K50033L14435L96024M97172
57097I537707O21108P72668R54710J166822J408168J675282J954566K224453K469523
57088B2785007K684325K857706K966702L003209L002560L025695L102248L190549
57080D6618001L185412K957003K403634J514883M12780o84727j576434k178384
57072E2652168k530404k726466k848535k944324l029443l093155l111580l067085
57064B9301176k957100k788147k570701k321797k063936j815608j585613j377876
$$ y = [8121039, 8073178, 8033630, 8001514, 7975303, 7952013, 7927916, 7900093, 7866307, 7823998, 7771189, 7708509, 7638995, 7566159, 7493604, 7425900, 7367707, 7321851, 7289658, 7272687, 7272253, 7287671, 7317247, 7361108, 7421347, 7499947, 7599083, 7723591, 7881098, 8080043, 8330076, 8644511, 9040535, 9537707, 10158815, 10931483, 11886193, 13053015, 14461183, 16136465, 18091031, 20315484, 22785007, 25469332, 28327038, 31293740, 34296949, 37299509, 40325204, 43427452, 46618001, 49803413, 52760416, 55164050, 56678933, 57091713, 56406986, 54830552, 52652168, 50121764, 47395298, 44546763, 41602439, 38572996, 35479841, 32368261, 29301176, 26344076, 23555929, 20985228, 18663431, 16599495, 14783887, 13198274, 11820398]
57056A1820398j196415j042915r14078q05058p12907o34852n66846n06532m55015
57047D985780m13226l78731l48042l19826k93830k68845k44025k20549j99891
57038B298815j81677j64832j49549j36381j24575j12954j01610r1267q1714p2085
57028A082171o2076n1810m1011k9215j6394k784J1074K3267L0082K7665J4482
57017I85451p516l3296n6429p1854p8255p7780p3424o7121n9897n2413m4932l7593
57005C24941l1114k6452k3566k1375j9181j7262j5841j4451j2798j1332j0510
56994A21059j0154r825r261q156o297m051k056k69J847M284O464Q301J0138J1416
56980A13440J0648P180K051l270p943j1244j2265j0961q681o787n408m075k832
$$ y = [11820398, 10623983, 9581068, 8666990, 7861932, 7149025, 6514173, 5947327, 5440795, 4985780, 4572554, 4193823, 3845781, 3525955, 3232125, 2963280, 2719255, 2498706, 2298815, 2117138, 1952306, 1802757, 1666376, 1541801, 1428847, 1327237, 1235970, 1154256, 1082171, 1020095, 968285, 927274, 898059, 881665, 878881, 889955, 913222, 943304, 970969, 985451, 977935, 944639, 888210, 816356, 738101, 660321, 586897, 519776, 459879, 407466, 362534, 324941, 293827, 267375, 243809, 222434, 203253, 185991, 170150, 155699, 142901, 131569, 121059, 110905, 101080, 91819, 83663, 77366, 73315, 71259, 70990, 72837, 77121, 83585, 91886, 102024, 113440, 124088, 131268, 133319, 130049, 122106, 110862, 98597, 87636, 78955, 72168, 66760, 62685, 59853]
56967E9853j902r02P53L030N514Q132J1130J4524J8040K1332K3954K5341K4946
56954B13745K2120J5998O316n405j6205k3663k7163k7346k5196k1909j8592j5373
56942G7327j1446o570j849J550L832O133R191J3185J8236K4120K9696L3477L4748
56929B31630L3553K9715K2613J2170l98j2969k3572l1037l5029l5688l3473k9287
56917A28228k4456k0138j6708j3966j1789j0233r135q165F408G8e063l401j601
56904a0065n99l76pR74K013K631b244A853N140O020P041Q447R767J0588J1527
56889F0383J3643J7084K0837K3614K4573K3449K0523J6282J0866M163l173r474
56877B22770j3329j4738j4548j3264j0994q049m742r33L540Q221J2537J6608K0902
$$ y = [59853, 57951, 57049, 57802, 60832, 66346, 74478, 85608, 100132, 118172, 139504, 163458, 188799, 213745, 235865, 251863, 258179, 252774, 236569, 212906, 185743, 158397, 133201, 111292, 92700, 77327, 65881, 59311, 57462, 59012, 62844, 68977, 78168, 91353, 109589, 133709, 163405, 196882, 231630, 265183, 294898, 317511, 329681, 329283, 316314, 292742, 261705, 226676, 190988, 157515, 128228, 103772, 83634, 66926, 52960, 41171, 30938, 21803, 13638, 6408, 78, -5063, -8464, -10065, -10664, -11040, -11047, -10073, -8060, -5429, -2244, 1853, 6993, 13013, 20054, 28501, 38268, 48856, 60383, 74026, 91110, 111947, 135561, 160134, 183583, 204106, 220388, 231254, 235417, 232244, 222770, 209441, 194703, 180155, 166891, 155897, 147848, 143106, 142173, 145713, 153934, 166471, 183079, 203981]
56864B03981K5423L0086L5457M1921M8176N1805N1467M7498M0090K8363J2178
56853F16445o082k2616l4736m1667m3510m0715l4449k6482j8220j0239k748M203
56841C39184J1065J8572K6884L5471M4237N4012O5080P5666Q2634Q3692P8138
56830I14635O5589M5268J7507j4429m4828o8187q1599q5274q1518p3153o2347
56819E31664n0448l8602k7928j8852j0673k320O536J5544K4511L3613M2752N1141
56807E56938N7582O0715N8920N0563L4843J2701j2805l7070n5642o6279o9595
56796E90871o7530o1651n3184m3844l5357k8137k1442j4918r062m014J006O629
56784B59367J2556J8314K3867K8802L1694L1133K6875J9376Q806m403j8353l0093
$$ y = [203981, 229404, 259490, 294947, 336868, 385044, 436849, 488316, 535814, 575904, 604267, 616445, 610363, 587747, 553011, 511344, 467834, 427119, 392670, 366188, 347968, 337729, 334981, 339184, 350249, 368821, 395705, 431176, 475413, 529425, 594505, 670171, 752805, 836497, 914635, 980224, 1025492, 1042999, 1028570, 983742, 915555, 833956, 748682, 667164, 594011, 531664, 481216, 442614, 414686, 395834, 385161, 382841, 389377, 404921, 429432, 463045, 505797, 556938, 614520, 675235, 734155, 784718, 819561, 832262, 819457, 782387, 726745, 660466, 590871, 523341, 461690, 408506, 364662, 329305, 301168, 279726, 264808, 255746, 251732, 252738, 259367, 271923, 290237, 314104, 342906, 374600, 405733, 432608, 451984, 460790, 456387, 438034, 407941]
56772D07941l7565m0658m0447l8000l4086k9458k4910k1009j7838j5116j2687
56761I6167j0739r329p881n814l619k518k797l300l053k548k652l045k763j866
56747C4243j391j732k158k084j822j731j440n39N22Q06Mj199j841j569q38l04
56731A6927j03J80Q15J515J853J781J473J015O00O95J456K247K322J844J603J846
56715C8069K072J968J834J935K031J842J461J103Q05O02O41R53J350J633J600
56700E9899R72j58r95p76J32N80J94k37j68p8m27p02l09L30M55J77O6m5p44j765
56680E6401k082j340k19O69J332J691J394O90N01J096J557J228Q53J369K347K698
56664G0185K497K789L744M290L837L169L130L427L391L117L037K906K170R96J63
$$ y = [407941, 370376, 329718, 289271, 251271, 217185, 187727, 162817, 141808, 123970, 108854, 96167, 85428, 76099, 68218, 62404, 58785, 56267, 53470, 50170, 47117, 44569, 41917, 38872, 36109, 34243, 32852, 31120, 28962, 26878, 25056, 23325, 21885, 21346, 21868, 22674, 22678, 21479, 19638, 18069, 17231, 16927, 16824, 17004, 17819, 19334, 21187, 22968, 24441, 25456, 26056, 26751, 28207, 30454, 32776, 34620, 36223, 38069, 40141, 42109, 43943, 45878, 47909, 49751, 51212, 52315, 53120, 53722, 54363, 55316, 56666, 58299, 59899, 60871, 60713, 59718, 58942, 59074, 59654, 59848, 59611, 59443, 59365, 58938, 58236, 57927, 58257, 58712, 58889, 58955, 58910, 58166, 56401, 54319, 52979, 52760, 53429, 54761, 56452, 57846, 58536, 59037, 60133, 61690, 62918, 63771, 65140, 67487, 70185, 72682, 75471, 79215, 83505, 87342, 90511, 93641, 97068, 100459, 103576, 106613, 109519, 111689, 112685, 112848]
56649A12848oJ78N58J335K460L406L742L381K311O47j000j921k235k725l517l710
56633A15752k815j749j665k361k770k659k773l417l928l773l276k850k279j351
56619G8086n79n84j048j064m12K17L16K11L56N76M99L36O21J200J171Q3j215j384
56601G7386j11J530K233J767J013Q80J331J535R45Q7K5J035K132K234J448Q57
56585I6327J085J633J725J248O86M91Q03J452J953J784J042N31Q05J376J371Q37
56569A15149P31J586K810L578L962M670N902O974P129O433N658N415N571N628
56555A81196N481N534N931O040N084L209J460N80K78q3n03n68l53m77j188j973
56539B09648k384k665l245l928m210m132m181m343m031l143k513k776l357l259
$$ y = [112848, 112842, 113020, 113578, 114913, 117373, 120779, 124521, 127902, 130213, 130860, 129860, 127939, 125704, 122979, 119462, 115752, 112937, 111188, 109523, 107162, 104392, 101733, 98960, 95543, 91615, 87842, 84566, 81716, 79437, 78086, 77507, 76923, 75875, 74811, 74399, 74616, 74932, 75143, 75499, 76075, 76574, 76910, 77531, 78731, 79902, 79985, 78770, 77386, 77275, 78805, 81038, 82805, 83818, 84698, 86029, 87564, 88509, 88596, 88621, 89656, 91788, 94022, 95470, 96327, 97412, 99045, 100770, 102018, 102704, 103195, 103998, 105450, 107403, 109187, 110229, 110760, 111565, 112941, 114312, 115149, 115880, 117466, 120276, 123854, 127816, 132486, 138388, 145362, 152491, 158924, 164582, 169997, 175568, 181196, 186677, 192211, 198142, 204182, 209266, 212475, 213935, 214515, 214793, 214710, 214207, 213639, 213286, 212809, 211621, 209648, 207264, 204599, 201354, 197426, 193216, 189084, 184903, 180560, 176529, 173386, 170873, 168097, 164740, 161481]
56525A61481k591k390l020l608l391k809k677k856k512j502p30r40j803k433k439
56510A25780k104j770j478j139q27p36r52j293j367q72P3Q98J014L94l21l80M01
56493A15321J476K109K048J653J381J296J155Q62N99M79L16Pj34K83J054J498
56477A31403J291Q33O08O03O03P16J114J495J408R16M87K82J45K18Q39J691J879
56460A46531J133K42j69n20j355k188k080j042MM30L89K08Q3K67Q44J292J017
56443A45086L15O5M55P58N48L30N61Q49O51K14J33L30J63n05r24l70Q48J555R76
56424A52038k71p83NJ133J405Q78N13P04J017J233J663K242K313J713J165J115
56408A68083R74J88o86p58j48L45N34Q74J376J442Q96L66L96P43R25R70J251J767
$$ y = [161481, 158890, 156500, 153480, 149872, 146481, 143672, 140995, 138139, 135627, 134125, 133395, 132455, 130652, 128219, 125780, 123676, 121906, 120428, 119289, 118462, 117726, 116774, 115481, 114114, 113242, 113315, 114213, 115227, 115621, 115300, 114920, 115321, 116797, 118906, 120954, 122607, 123988, 125284, 126439, 127301, 127900, 128379, 128695, 128702, 128568, 128851, 129905, 131403, 132694, 133527, 134135, 134738, 135341, 136057, 137171, 138666, 140074, 140990, 141477, 141759, 141904, 142122, 142961, 144652, 146531, 147664, 147906, 147737, 147217, 145862, 143674, 141594, 140552, 140556, 140986, 141375, 141583, 141666, 141933, 142777, 144069, 145086, 145401, 145466, 145921, 146679, 147227, 147557, 148118, 148967, 149618, 149832, 149965, 150295, 150458, 149953, 149029, 148659, 149507, 151062, 152038, 151767, 150984, 150989, 152122, 153527, 154405, 154918, 155622, 156639, 157872, 159535, 161777, 164090, 165803, 166968, 168083, 169057, 169245, 168559, 167801, 167653, 167998, 168532, 169406, 170782, 172224, 173120, 173486, 173882, 174625, 175550, 176520, 177771, 179538]
56390A79538K026J668R65N92Q92J479J711J422J033R10R41Q58P40Q99J369J728
56374A98771J530Q86M94Q92J690J918J307P78J183J968J913R93M98J178K194K263
56358B20456J221p2p98o90L7Q13J077Q19M95L32K35L67J031J816J746P51K9L90
56340B30055J120J272J135J439J871J615R29Q57J577K163K011J500J128R60J074
56325B50706J653K420K668K157J450J146J284J580J818J855J746J818K279K754
56311B77334K672K072J514J294J334J744K720L814M106L384K613K849M049N245
56297C16744N560M885L841L234L406L937M206M100M000M174M533M876N051M970
56283C77517M801M998N738O524O755O510O326O395O566O910P666Q658R456J0105
$$ y = [179538, 181564, 183232, 184197, 184789, 185681, 187160, 188871, 190293, 191326, 192236, 193177, 194035, 194775, 195674, 197043, 198771, 200301, 201187, 201681, 202573, 204263, 206181, 207488, 208266, 209449, 211417, 213330, 214323, 214821, 215999, 218193, 220456, 221677, 221605, 220807, 220117, 220154, 220967, 222044, 222863, 223358, 223690, 223925, 224292, 225323, 227139, 228885, 229636, 229665, 230055, 231175, 232447, 233582, 235021, 236892, 238507, 239436, 240293, 241870, 244033, 246044, 247544, 248672, 249632, 250706, 252359, 254779, 257447, 259604, 261054, 262200, 263484, 265064, 266882, 268737, 270483, 272301, 274580, 277334, 280006, 282078, 283592, 284886, 286220, 287964, 290684, 294498, 298604, 301988, 304601, 307450, 311499, 316744, 322304, 327189, 331030, 334264, 337670, 341607, 345813, 349913, 353913, 358087, 362620, 367496, 372547, 377517, 382318, 387316, 393054, 399578, 406333, 412843, 419169, 425564, 432130, 439040, 446706, 455364, 464820, 474925]
56269D74925J1000J2124J3087J3976J5391J7456J9553K1326K3290K6025K9407
56258F77560L3040L6968M1407M6158N0766N5074N9280O3551O7912P2387P6935
56247A281038Q1249Q4787Q7082Q7899Q7161Q4709Q0244P3491O4485N3552M1065
56236B106762K7444J3418j50j2811k4612l5431m4666n1908n7485o2012o5731o8665
56224A724153p0936p2403p2471p0851o8203o5394o2440n8889n4933n1295m8209
56213A028129m5204m1921l8446l5013l1922k9562k7823k5742k2628j9288j7141
56202F93439j6171j4911j2583j0154q771q172p327n975m795m338m449m608m451
56189E86734l907l113k214j331o17j56K68R51J665J751J165Q89J723L101L834
$$ y = [474925, 485925, 498049, 511136, 525112, 540503, 557959, 577512, 598838, 622128, 648153, 677560, 710600, 747568, 788975, 835133, 885899, 940973, 1000253, 1063804, 1131716, 1204103, 1281038, 1362287, 1447074, 1534156, 1622055, 1709216, 1793925, 1874169, 1947660, 2012145, 2065697, 2106762, 2134206, 2147624, 2147474, 2134663, 2110051, 2074620, 2029954, 1978046, 1920561, 1858549, 1792818, 1724153, 1653217, 1580814, 1508343, 1437492, 1369289, 1303895, 1241455, 1182566, 1127633, 1076338, 1028129, 982925, 941004, 902558, 867545, 835623, 806061, 778238, 752496, 729868, 710580, 693439, 677268, 662357, 649774, 639620, 630849, 622677, 615350, 609375, 604580, 600242, 595793, 591185, 586734, 582827, 579714, 577500, 576169, 575552, 575396, 575664, 576615, 578280, 580031, 581196, 582085, 583808, 586909, 590743]
56174E90743L654L286L249L412L559L715L935M353N293O772Q185R011R472R916
56160F68555J0171J0256J0996J2888J4951J5896J6053J6788J8442K0230K1923
56149H37149K4117K6869K9627L2587L6716M2239M8561N5859O5276P7129R0251
56138A366380J03453J16278J27829J36324J40503J40357J35968J26845J13311
56129B507248R7581Q2672P0660O2106N6032N0124M2074L1369J9229O794n583j7255
56117C003051k7067l4827m1902m9896n9698p1953q6809j02555j15894j24490j28314
56106B159646j28065j23625j14914j03023q9636p6063o3448n2806m4098l6270
56096A327698k8883k2761j8485j5283j2142r054o541m766l666l097k487j213M61
$$ y = [590743, 594397, 597683, 600932, 604344, 607903, 611618, 615553, 619906, 625199, 631971, 640156, 649167, 658639, 668555, 678726, 688982, 699978, 712866, 727817, 743713, 759766, 776554, 794996, 815226, 837149, 861266, 888135, 917762, 950349, 987065, 1029304, 1077865, 1133724, 1199000, 1276129, 1366380, 1469833, 1586111, 1713940, 1850264, 1990767, 2131124, 2267092, 2393937, 2507248, 2604829, 2687501, 2758161, 2820267, 2876299, 2926423, 2968497, 2999866, 3019095, 3025889, 3020306, 3003051, 2975984, 2941157, 2899255, 2849359, 2789661, 2717708, 2630899, 2528344, 2412450, 2287960, 2159646, 2031581, 1907956, 1793042, 1690019, 1600383, 1524320, 1460872, 1408066, 1363968, 1327698, 1298815, 1276054, 1257569, 1242286, 1230144, 1221090, 1214549, 1209783, 1206117, 1203020, 1200533, 1199320, 1199781]
56083A199781J833L165N269P731R179R545J0253J1735J2838J3188J4010J5596
56071A314123J6174J4625J2380J1116J0361R014P590P188P454P401P191P589Q474
56058A440680R322J0300J1682J3024J4003J5190J6955J8662J9845K0980K2288
56047A612931K3049K3024K3212K4250K5472K6430K7767K9551L0545L0213K9778
56036A906222L0058L0168K9648K9973L2332L5690L8535M0829M2786M3666M3427
56025B303334M3682M5307M6891M7272M7687M9660N2610N5336N7993O0880O3324
56014B873976O5439O8777P3511P7325P9038Q0674Q3955Q7523R0066R3298R8975
56003C772557J05575J10958J15780J21404J26980J31580J36702J43506J50172
$$ y = [1199781, 1201614, 1204779, 1210048, 1217779, 1226958, 1236503, 1246756, 1258491, 1271329, 1284517, 1298527, 1314123, 1330297, 1344922, 1357302, 1368418, 1378779, 1387793, 1395383, 1402571, 1410025, 1417426, 1424617, 1432206, 1440680, 1450002, 1460302, 1471984, 1485008, 1499011, 1514201, 1531156, 1549818, 1569663, 1590643, 1612931, 1635980, 1659004, 1682216, 1706466, 1731938, 1758368, 1786135, 1815686, 1846231, 1876444, 1906222, 1936280, 1966448, 1996096, 2026069, 2058401, 2094091, 2132626, 2173455, 2216241, 2259907, 2303334, 2347016, 2392323, 2439214, 2486486, 2534173, 2583833, 2636443, 2691779, 2749772, 2810652, 2873976, 2939415, 3008192, 3081703, 3159028, 3238066, 3318740, 3402695, 3490218, 3580284, 3673582, 3772557, 3878132, 3989090, 4104870, 4226274, 4353254, 4484834, 4621536, 4765042, 4915214]
55994D915214J55150J60331J67838J76481J84775J94363K06957K20963K34918
55985F616990K50990K71176K93401L15529L39684L68318L99820M32596M69481
55976I757985N13196N61705O13308O71749P40801Q18740R04302J002953J120955
55967A6705694J259062J419147J611189J846882K133798K484384K923950L482734
55959C3866840M188780N072830O162294P459757Q950973J0656246J2656724J5052466
55951A04066910J7921050K1325449K5265253K9482093L3292291L5710666L5797880
55944C02861592L2870940K6481658J6528970L720361j0088858k2345888l0946217
55937C19082558l5163137l5635601l3625685l0299882k6465131k2624688j9074427
$$ y = [4915214, 5070364, 5230695, 5398533, 5575014, 5759789, 5954152, 6161109, 6382072, 6616990, 6867980, 7139156, 7432557, 7748086, 8087770, 8456088, 8855908, 9288504, 9757985, 10271181, 10832886, 11446194, 12117943, 12858744, 13677484, 14581786, 15584739, 16705694, 17964756, 19383903, 20995092, 22841974, 24975772, 27460156, 30384106, 33866840, 38055620, 43128450, 49290744, 56750501, 65701474, 76357720, 89014444, 104066910, 121987960, 143313409, 168578662, 198060755, 231353046, 267063712, 302861592, 335732532, 362214190, 378743160, 382463521, 372374663, 350028775, 319082558, 283919421, 248283820, 214658135, 184358253, 157893122, 135268434, 116194007]
55930A16194007j5955582j3303818j1098705r291506p819980o624288n654495
55923D6445633m865532m215771l674412l222471k843913k521950k244189k003629
55915B0853766j793244j605863j439368j295127j170525j058779r56136q63405
55907A0671319p80354p04426o35192n74509n21872m74359m31241l93956l61696
55898E793714l31721l03847k80043k59813k40466k21773k05785j92132j78105
55889C580029j63436j50503j39607j28472j16840j07147r9836r2185q2865p4002
55879B425136o7440o2360n7789n4523n3363n3890n5899n9571o3517o5081o3411
55868A768292o0234n7112n3957n0555m7379m4496m1565l9079l7744l6718l4596
$$ y = [116194007, 100238425, 86934607, 75835902, 66544396, 58724416, 52100128, 46445633, 41580101, 37364330, 33689918, 30467447, 27623534, 25101584, 22857395, 20853766, 19060522, 17454659, 16015291, 14720164, 13549639, 12490860, 11534724, 10671319, 9890965, 9186539, 8551347, 7976838, 7454966, 6980607, 6549366, 6155410, 5793714, 5461993, 5158146, 4878103, 4618290, 4377824, 4156051, 3950266, 3758134, 3580029, 3416593, 3266090, 3126483, 2998011, 2881171, 2774024, 2674188, 2582003, 2499138, 2425136, 2357696, 2295336, 2237547, 2183024, 2129661, 2075771, 2019872, 1960301, 1896784, 1831703, 1768292, 1708058, 1650946, 1596989, 1546434, 1499055, 1454559, 1412994, 1373915, 1336171, 1299453, 1264857]
55857A264857l1917l0439l0052k8978k7018k5933k6192k6092k4753k3530k3492
55846I66461k3730k3162k2165k1391k0559j9266j7782j6340j4832j3558j3042
55835G60634j2901j2179j0908r989r583r058q414q069p428n530l147k172k755
55822F58501l046k240j745k635l894m136l457k596j710q86n92p71n74K49P43J96
55806F31407r13k023l408n270o942p749p894p831p552p087o960p559q560r376
55792E42283r666r215p968o363m974l726k173n69J79k44j186j969k410k355j625
55777D88019o19j27m36j235k391l995n679o837p552q419r425r912r668r114q411
55762D04199p316o005n031m391l527k327j303p80p88j636l623o265q706j0799
$$ y = [1264857, 1232940, 1202501, 1172449, 1143471, 1116453, 1090520, 1064328, 1038236, 1013483, 989953, 966461, 942731, 919569, 897404, 876013, 855454, 836188, 818406, 802066, 787234, 773676, 760634, 747733, 735554, 724646, 714657, 705074, 696016, 687602, 679533, 672105, 666575, 663428, 661256, 658501, 655455, 653215, 651470, 648835, 644941, 640805, 637348, 634752, 633042, 632156, 631564, 630793, 630219, 630468, 631211, 631407, 630494, 628471, 625063, 619793, 612851, 605102, 597208, 589377, 581825, 574738, 567778, 560219, 551659, 542283, 532617, 523402, 515434, 509071, 504097, 500371, 498198, 497629, 497808, 497564, 496378, 494409, 491999, 489644, 488019, 487400, 487273, 486837, 485602, 483211, 479216, 473537, 466700, 459148, 450729, 441304, 431392, 421724, 412610, 404199, 396883, 390878, 385847, 381456, 377929, 375602, 374299, 373519, 372731, 371095, 367472, 361207, 352501, 341702]
55748C41702j2760j4045j3786j2210j0339q401n908l278j798j718j859j488j183
55735B52929j373j354m90P54J614J961J966J631J104N93j86j660l349m173l925
55720B46042l352k764j800p26m44r04r80l65o0m81o50j7M65J22j06P25J900K243
55702B38848J881J520R56k39j345j343o12m33j008j255m75Q65J996K608K688K408
55686B47060K252K648L336L546K850J623P18Q00J760K649K547J615Q20O22N29
55671B75375J60m6M11J299K089K571K599J882N31o93j212j276j387j565j675j950
55655B77113k693l774m856n769o407o635o510o202n570m402l122k591l002l705
55641B11875m218m562m480l453j883j038j281j450p19R9Pn55o40m55p80j428j605
$$ y = [341702, 328942, 314897, 301111, 288901, 278562, 270161, 264253, 260975, 259177, 257459, 255600, 254112, 252929, 251556, 250202, 249712, 250466, 252080, 254041, 256007, 257638, 258742, 259335, 259149, 257489, 254140, 249967, 246042, 242690, 239926, 238126, 237400, 236956, 236052, 235072, 234707, 234647, 234166, 233516, 233499, 233964, 234086, 233980, 234705, 236605, 238848, 240729, 242249, 243205, 242966, 241621, 240278, 239666, 239233, 238225, 236970, 236495, 237360, 239356, 241964, 244652, 247060, 249312, 251960, 255296, 258842, 261692, 263315, 264033, 264833, 266593, 269242, 271789, 273404, 274224, 274846, 275375, 275535, 275489, 275900, 277199, 279288, 281859, 284458, 286340, 286871, 286178, 284966, 283690, 282303, 280738, 279063, 277113, 274420, 270646, 265790, 260021, 253614, 246979, 240469, 234267, 228697, 224295, 221173, 218582, 215580, 211875, 207657, 203095, 198615, 195162, 193279, 192241, 190960, 189510, 188791, 188890, 188897, 188342, 187702, 187247, 186467, 185039, 183434]
55624A83434j346j358j754k057k205k477k567j841n08M75O63M84L12O7l00o33
55608A68389r84j515j931j703r40l76m02o72p70p03o04m16q2K53M09L10Kl27m59
55589A57479m41n84r23j047o77j18L06P68J446J867J498P42O20J423K365K733
55573A67457K774L189M131N050N404N221M891M493L685K336R94K71k7n97j517
55558B07755k142k156k006k043j994j667j424j491j520j320j320j674j663p89
55544A84546J36m8j183j962j553k72J070J756J317r0j526k176k288k636l241l402
55528A68448k868k203j990k255k720l044k846k050j199r39j195j343j126q88r14
55513A40868j061j070q74n95m87p68j195j076j72P40P34o2p26p65m28K3O24J215
$$ y = [183434, 182088, 180730, 178976, 176919, 174714, 172237, 169670, 167829, 167321, 167796, 168459, 168943, 169255, 169322, 169022, 168389, 167405, 165890, 163959, 162256, 161316, 160940, 160538, 159866, 159096, 158393, 157789, 157373, 157291, 157544, 157953, 158263, 158265, 157938, 157479, 157038, 156454, 155531, 154484, 153807, 153689, 153995, 154763, 156209, 158076, 159574, 160316, 160936, 162359, 164724, 167457, 170231, 173420, 177551, 182601, 188005, 193226, 198117, 202610, 206295, 208631, 209625, 209896, 209869, 209272, 207755, 205613, 203457, 201451, 199408, 197414, 195747, 194323, 192832, 191312, 189992, 188672, 186998, 185335, 184546, 184682, 184634, 183451, 181489, 179936, 179664, 180734, 182490, 183807, 183717, 182191, 180015, 177727, 175091, 171850, 168448, 165580, 163377, 161387, 159132, 156412, 153368, 150522, 148472, 147273, 146334, 145139, 143796, 142670, 141782, 140868, 139807, 138737, 137863, 137268, 136781, 136013, 134818, 133742, 133570, 134310, 135044, 134982, 134256, 133491, 133063, 133086, 133710, 134925]
55495A34925J340Q10m4p95j200j096m57L72Q67P88K92l62q79r77o85m86p39j179
55477A30495j287r89o21m07l54l64j39O88J876K409J575p7j293j373m57R02J976
55460A32560K111J512J211J667J931J061l17q93n68k51j82P6K32n94k153l004
55444A34399k462j384o37q0M77N54pm11o1N05N32J60n6m9N6M55J216J862K030
55425A37099K048K296K509K366K214K551L206L715M065M475M805M816M694M655
55411A85514M317L120J202p05k084k902l274l395l538l726l658l348l456m374
55397A59693n352n258m007k513j413n94L5J83j70m81l72j42k13m70o03o99r94
55380A36630j206p16N29J696J943J377P42L38k69j309k095j768n51L26L1j017
$$ y = [134925, 136265, 137075, 137031, 136236, 135036, 133940, 133483, 133855, 134722, 135510, 135802, 135440, 134561, 133584, 132899, 132413, 131674, 130495, 129208, 128219, 127598, 127191, 126837, 126473, 126334, 127022, 128898, 131307, 132882, 132805, 131512, 130139, 129682, 130584, 132560, 134671, 136183, 137394, 139061, 140992, 142053, 141736, 140843, 140275, 140024, 139842, 139918, 140150, 139556, 137403, 134399, 131937, 130553, 129916, 129836, 130313, 130867, 130860, 130449, 130388, 130893, 131425, 131585, 131529, 131480, 131536, 131991, 133207, 135069, 137099, 139147, 141443, 143952, 146318, 148532, 151083, 154289, 158004, 162069, 166544, 171349, 176165, 180859, 185514, 189831, 192951, 194153, 193448, 191364, 188462, 185188, 181793, 178255, 174529, 170871, 167523, 164067, 159693, 154341, 149083, 145076, 142563, 141150, 140556, 140591, 140774, 140604, 140123, 139751, 139609, 139396, 138926, 138323, 137624, 136630, 135424, 134708, 135237, 136933, 138876, 140253, 140995, 141333, 141064, 139755, 137660, 135892, 135341, 135667, 135698, 134681]
55364A34681j799j786j145l33J63j2p17j303j219n99RK74K17q5m84n81l3R06J458
55345A27612J147L40k03j29K51M56L51J58P5J6k14n96q83q15l31M05J041J212
55327A29893Q64L70J30N1k57q03j052o29R1M27K44L6J66L66J54m81j046j164r66
55308A26394p95p31n74k53M2J14k0j96k25P7P63J589K163K259J863J041Q0l85
55290A33206L2P40O71k20p74k46O10P78M75N76J023R72L08j48PJ95m9l46k49k
55270A37559p9m38o73n52j56K21K20k54p15o01n9K22J8k22k35k97m67k61M93J130
55250A34854J004M11Q3J46J23k98r08j327j322r39m86k62k10p5J33K28L52P94
55232A32301J220Q53k87j112q50p1K74J43J08K48K26J01K72O76Q00N07K15K34
$$ y = [134681, 132882, 131096, 129951, 129618, 129781, 129769, 129052, 127749, 126530, 125931, 125940, 126214, 126431, 126346, 125862, 125281, 125248, 126154, 127612, 128759, 129099, 128896, 128767, 129018, 129474, 129825, 129983, 130058, 130074, 129860, 129264, 128381, 127566, 127235, 127640, 128681, 129893, 130757, 131127, 131257, 131308, 131051, 130248, 129196, 128567, 128658, 129085, 129329, 129365, 129531, 129897, 130051, 129570, 128524, 127360, 126394, 125599, 124868, 124294, 124041, 124083, 124197, 124177, 123981, 123756, 123833, 124596, 126185, 128348, 130607, 132470, 133511, 133591, 133206, 133238, 133978, 134649, 134429, 133655, 133409, 134019, 134797, 135272, 135848, 136871, 137843, 138151, 138003, 138010, 138205, 138156, 137810, 137561, 137559, 137480, 137042, 136369, 135817, 135661, 135882, 136102, 135848, 135133, 134532, 134473, 134695, 134713, 134491, 134256, 133959, 133492, 133231, 133724, 134854, 135858, 136269, 136352, 136498, 136621, 136323, 135415, 134088, 132766, 131827, 131341, 131079, 130869, 130794, 130927, 131155, 131507, 132301, 133521, 134374, 134087, 132975, 132125, 132054, 132328, 132471, 132579, 132827, 133053, 133154, 133426, 134102, 134902, 135409, 135624, 135858]
55214A35858L72K94j26p96j388j407o90J76M34J48J98J077K059J973O54o85p57
55197A37394L24J168P83l13r72r63r05r52n30M01Q68K28p15p22K38J077J038L46
55179A37793m17r09j053r21o30j82N13J223J441J116Q80J127J323Q78J86R5N60
55162A43023P32K64k52k29K08O30Q32Q42P71P66P71M29l79j037q21rK84m92j640
55143A44693k107j593o26J24L53K94M85J107J633J410N72j10k86l81q24j381j524
55126A41839j065k18O72J212J137N71m1m45p40r74r16m84p4j50n77o69J5J076
55108A40169J636J323P79R21J702K048J238q1p13m10L9O3m7J46N40P61P10M35
55090A51259j10q97j538j557r41j97J65J09k4l2j09m41p02l58N06J160J189R80
$$ y = [135858, 136230, 136524, 136398, 135602, 134214, 132807, 132117, 132293, 132727, 132875, 133073, 134150, 136209, 138182, 138836, 138151, 137394, 137718, 138886, 139669, 139356, 138384, 137421, 136516, 135564, 135034, 135435, 136303, 136531, 135816, 135094, 135332, 136409, 137447, 137793, 137376, 136467, 135414, 134493, 133863, 133681, 134194, 135417, 136858, 137974, 138854, 139981, 141304, 142182, 142368, 142463, 143023, 143755, 144019, 143767, 143538, 143746, 144376, 145208, 146050, 146821, 147587, 148358, 148787, 148408, 147371, 146550, 146541, 146825, 146333, 144693, 142586, 140993, 140367, 140491, 140844, 141138, 141623, 142730, 144363, 145773, 146345, 146235, 145949, 145568, 144744, 143363, 141839, 140774, 140556, 141228, 142440, 143577, 144148, 144107, 143662, 142922, 141948, 141032, 140548, 140474, 140324, 139747, 139078, 139093, 140169, 141805, 143128, 143907, 144828, 146530, 148578, 149816, 149735, 149022, 148612, 148651, 148714, 148667, 148813, 149353, 150114, 150824, 151259, 151149, 150252, 148714, 147157, 146216, 146019, 146184, 146293, 146269, 146237, 146128, 145687, 144985, 144627, 145133, 146293, 147482, 148462]
55072A48462R20P17J13l54p8M75L01o25j304j206q01n07j11M17M90j49p94p43
55054A45223k85p2o1K24O68O18r2q11q58k78K71K00l69o07J79J625K537K216J189
55035A51517L54r6m75p97q01n82n50q04j018j009r32q62o09p6M39O08M69L74N78
55016A45728R63J119P68J19k81j73J02Q7j14L9P77J626J901J410N97N8L2L13N66
54997A55637O38N52L75K29L10O99J174J438J443J263P32l76j729k447k003p90
54981A57145L61J018J243J281J350J551J634J123J2r31r54k40L62N01O57J333
54965A67446K289K799K398J277M3p59r74p41j50Q20J900K421J927P87j30l71j53
54948A80829J58M52P54J051J376J770K129K369K769L757N223O454O922O876O927
$$ y = [148462, 149382, 150099, 150212, 149858, 149780, 150255, 150556, 149931, 148627, 147421, 146620, 146113, 146002, 146419, 146909, 146760, 145966, 145223, 144938, 144866, 144805, 145029, 145697, 146315, 146223, 145412, 144554, 144276, 144547, 144747, 144378, 143771, 143950, 145575, 148112, 150328, 151517, 151871, 151775, 151300, 150503, 149702, 149120, 148570, 147766, 146748, 145739, 144807, 143945, 143336, 143260, 143699, 144307, 144776, 145150, 145728, 146691, 147810, 148578, 148697, 148416, 148243, 148345, 148432, 148318, 148357, 149134, 150760, 152661, 154071, 154668, 154726, 154758, 155071, 155637, 156275, 156827, 157202, 157431, 157741, 158440, 159614, 161052, 162495, 163758, 164490, 164114, 162385, 159938, 157935, 157145, 157506, 158524, 159767, 161048, 162398, 163949, 165583, 166706, 166718, 165787, 164833, 164593, 164955, 165456, 166113, 167446, 169735, 172534, 174932, 176209, 176252, 175493, 174519, 173778, 173628, 174448, 176348, 178769, 180696, 181483, 181353, 180982, 180829, 180987, 181439, 182193, 183244, 184620, 186390, 188519, 190888, 193657, 197414, 202637, 209091, 216013, 222889, 229816]
54933B29816P344Q005Q758R398R493Q656O967M901K758M80k006m511o706q344
54919B75009r267r461r158q741q403q005p289o156m752l442k667k614k908k825
54905A89321j970n90P63J684J929J411M68r4L42J607L041M258N270O061O574P065
54889B27140P944R120R958J0083R723R065P784N547K640l94l387o309q708r983
54875B70223j0137r793r407q862p928o725n608m865m536m356l931l197k519k132
54861A86227j724j038n75r80j853k019j131j93j06m73m69k67o63j633k186j750
54845A69167r66p34j041j189q69n93r52j748k083j342L4R35P78J00j78J41M77
54828A59937M22K43L32N37M46J16M8M16P51N98J65MK52N36O15O62Q30R45Q14N32
$$ y = [229816, 237160, 245165, 253923, 263321, 272814, 281470, 288437, 293338, 296096, 296576, 294570, 290059, 283353, 275009, 265742, 256281, 247123, 238382, 229979, 221974, 214685, 208529, 203777, 200335, 197668, 195054, 192146, 189321, 187351, 186761, 187524, 189208, 191137, 192548, 193016, 192922, 193264, 194871, 197912, 202170, 207440, 213501, 220075, 227140, 235084, 244204, 254162, 264245, 273968, 283033, 290817, 296364, 299004, 298610, 295223, 288914, 280206, 270223, 260086, 250293, 240886, 232024, 224096, 217371, 211763, 206898, 202362, 198006, 194075, 190878, 188359, 186227, 184503, 183465, 182890, 181910, 180057, 178038, 176907, 176714, 176608, 176135, 175666, 175399, 174736, 173103, 170917, 169167, 168201, 167467, 166426, 165237, 164368, 163775, 162823, 161075, 158992, 157650, 157684, 158619, 159397, 159497, 159319, 159460, 159937, 160359, 160602, 160934, 161471, 161917, 162033, 162081, 162497, 163248, 163846, 164011, 164015, 164267, 164803, 165418, 166080, 166910, 167855, 168669, 169201]
54808A69201L08K80O30J480K379K399J262k2l01K55N54K80K18P87J266R83M83
54791A82442P55J786K667K919K991L457M320N226N919O335O596P046P999R324
54777B49782J0422J0865J0836J0823J0860J0311Q555N819L190J604R07N8j706
54764C32326m130o277p393p341o516n560m978m878n073n476o198p207q072q220
54750B45007p381n766l984k715k175j832r80L30J302J529J619K380L806N258O339
54735B42737P051P361P280P286P906Q783Q695O810L548o7l438o470q901j0277
54721B78304j0542j0250r912r388q211o433m825m105m108m009l367k623k429k727
54707A95375k814k212j207m16j47k86o73j237j825k084j704p98J37O13M82q2p57
$$ y = [169201, 169509, 169789, 170419, 171899, 174278, 176677, 177939, 177917, 177616, 177871, 178425, 178705, 178923, 179710, 180976, 181959, 182442, 183197, 184983, 187650, 190569, 193560, 197017, 201337, 206563, 212482, 218817, 225413, 232459, 240458, 249782, 260204, 271069, 281905, 292728, 303588, 313899, 322454, 328273, 331463, 333067, 333974, 334032, 332326, 328196, 321919, 314526, 307185, 300669, 295109, 290131, 285253, 280180, 274704, 268506, 261299, 253227, 245007, 237626, 231860, 227876, 225161, 222986, 221154, 220174, 220504, 221806, 223335, 224954, 227334, 231140, 236398, 242737, 249788, 257149, 264429, 271715, 279621, 288404, 297099, 303909, 307457, 307390, 303952, 297482, 288581, 278304, 267762, 257512, 247600, 238212, 230001, 223568, 218743, 214638, 210530, 206521, 203154, 200531, 198102, 195375, 192561, 190349, 189142, 188726, 188579, 188293, 187620, 186383, 184558, 182474, 180770, 179972, 180109, 180722, 181204, 181122, 180365]
54690A80365j187j089n10J24L71J84j62m41n39l25K30P55P10N7n86o59k99p8l08
54671A76613p88j140j172r13n28j58J79N22Q06Q54N79Q3m52q19p93l51J65L44
54653A73031K28K20M34N10K27o0J12O81J103R46K39o00j056r87p84q47r67o10
54635A71820R5L46j86q15q67o63q19j147r65k39M08O77Q27R50P41J44l92m83k15
54616A69217K24P87J308J457J163P47M49J47k33m65l92k39k31j75K30Q06R96N57
54598A76353j41n89o77o16m75p0O10J142J136Q07P40J011J007L30n55r11o58k89
54580A78155j51k38m94p97p47m2R26J398J197R15R93J108P49k2p05j013j047r69
54562A79216q25o39m93l84j50L60R67J209Q58K96O8J60P5k23j18O91J596J879
$$ y = [180365, 179178, 178089, 177579, 177703, 178074, 178258, 178096, 177655, 177116, 176791, 177021, 177776, 178486, 178543, 177957, 177298, 176999, 176921, 176613, 175825, 174685, 173513, 172600, 172072, 171914, 172093, 172615, 173421, 174275, 174854, 174937, 174485, 173666, 172873, 172522, 172687, 173031, 173259, 173479, 173913, 174423, 174650, 174590, 174702, 175383, 176486, 177432, 177671, 177071, 176015, 175028, 174244, 173397, 172430, 171820, 171915, 172261, 172075, 171260, 170393, 169730, 168911, 167764, 166799, 166560, 166968, 167645, 168472, 169422, 170163, 170307, 169915, 169432, 169217, 169441, 170228, 171536, 172993, 174156, 174903, 175352, 175499, 175266, 174801, 174409, 174170, 173939, 173764, 173994, 174800, 175796, 176353, 176212, 175623, 174946, 174330, 173855, 173785, 174395, 175537, 176673, 177480, 178220, 179231, 180238, 180568, 180013, 179102, 178444, 178155, 178004, 177766, 177272, 176475, 175728, 175686, 176612, 178010, 179207, 180122, 181115, 182223, 182972, 182950, 182245, 181232, 180185, 179216, 178391, 177752, 177259, 176875, 176725, 177085, 178052, 179261, 180119, 180415, 180483, 180643, 180718, 180495, 180377, 181068, 182664, 184543]
54544A84543J652J405J154P27M96R11J496J294K80n63o48l71j28K64Q51J079N76
54527A95018k30p41q59o64j09M87L39p36j751j707q98l81n41r03j074j077q35
54510A83338j28Q39J403J158L30n42r68o64K38J095J231N83l21r40j046o75j20
54493A84811K08K22L16P33J019O14j95n59k40J40J63K02O52J211J370J214J179
54476A93060J296J174P34M06M88O91N34om90n61k73J29N16Q06Q24N40L02N13J010
54457B01693J171P58K45J01J46k6l29m21m19p35j238j290p69m10p44j180p96L25
54439A96082J145J015L68k6%R7L0j20k37k36j4L93O39M15j7m8M77J020J117R45
54419B03045R19J039J043Q99O89K64m39r45o63K20Q64Q25M43J73N5M6J91L03K0
$$ y = [184543, 186195, 187600, 188754, 189481, 189977, 190888, 192384, 193678, 193958, 193395, 192747, 192376, 192248, 192512, 193363, 194442, 195018, 194788, 194047, 193188, 192524, 192415, 192902, 193241, 192505, 190754, 189047, 188149, 187768, 187227, 186324, 185250, 184173, 183338, 183210, 184049, 185452, 186610, 186940, 186398, 185430, 184766, 185004, 186099, 187330, 187913, 187592, 186652, 185606, 184931, 184811, 185019, 185241, 185557, 186290, 187309, 187923, 187728, 187169, 186929, 187069, 187232, 187434, 188086, 189297, 190667, 191881, 193060, 194356, 195530, 196264, 196670, 197158, 197849, 198383, 198377, 197887, 197326, 197053, 197182, 197698, 198504, 199328, 199868, 200170, 200683, 201693, 202864, 203622, 203867, 203968, 204114, 204088, 203759, 203338, 202919, 202184, 200946, 199656, 198887, 198477, 197733, 196553, 195757, 196082, 197227, 198242, 198610, 198584, 198584, 198681, 198711, 198591, 198354, 198118, 198104, 198497, 199136, 199551, 199534, 199486, 199963, 200983, 202100, 203045, 203964, 205003, 206046, 206945, 207634, 207898, 207459, 206514, 205851, 206071, 206935, 207760, 208203, 208376, 208431, 208477, 208668, 208971, 208991]
54400B08991n46q15o44n31n44N7J486K554K112P90J33L89M62p5l53N2J97o78j724
54381B11313j608l65Q51J441J725J896J674J095P24P49O50R4m19k84K78O31O89
54364B21134Q74J315J653J697J663J672J500J079P62Q02R60J046J428K440L598
54349B43623M048L692L182K793K045O54q16j698k095k557l214l733l844l503k756
54334B35821j865j332j337j455j244r47j042j348j212m94K67O50P15N02j60j051
54318B24468j434r15l5L15j06q02j188j051n94k79m82j101j653j832j668j113
54302B10530R3J744K835K466R49m47r02p18n59m60L7J011J780J586M92n93q64
54285B18980m37l3pr0j9J4j84l32j42R6j51q01j160q20o5O44J127J331J170Q22
$$ y = [208991, 208445, 207630, 206986, 206455, 205911, 205968, 207454, 210008, 212120, 212910, 213043, 213432, 213894, 213819, 213466, 213518, 213715, 213037, 211313, 209705, 209340, 210191, 211632, 213357, 215253, 216927, 218022, 218746, 219495, 220145, 220239, 219820, 219536, 219814, 220445, 221134, 222008, 223323, 224976, 226673, 228336, 230008, 231508, 232587, 233349, 234151, 235111, 236157, 237585, 240025, 243623, 247671, 251363, 254545, 257338, 259383, 260037, 259221, 257523, 255428, 252871, 249657, 245924, 242080, 238577, 235821, 233956, 232624, 231287, 229832, 228588, 227641, 226599, 225251, 224039, 223545, 223812, 224462, 225177, 225679, 225519, 224468, 223034, 222119, 222084, 222399, 222293, 221491, 220303, 219252, 218658, 218379, 217897, 216796, 215143, 213311, 211643, 210530, 210623, 212367, 215202, 217668, 218617, 218170, 217268, 216550, 215991, 215531, 215568, 216579, 218359, 219945, 220437, 219844, 218980, 218543, 218510, 218503, 218413, 218394, 218408, 218224, 217892, 217750, 217846, 217695, 216894, 215734, 214914, 214849, 215493, 216620, 217951, 219121, 219943]
54265B19943P75J178J542J371Q50M57K09j49m49l06K4j85r72j406r21j89j03m45
54247B21224l60J80L17k85q79p13rM43K92k21o63p00k54L26M61J5n18o80o20o55
54227B16701o15p8Q29J367J016J00n57m87n2J9m40p26j88P42R46J19q07r79p10
54208B16200p54j097j175q96o23l71J91R54J350J194R19Q87J000J144J405J699
54192B22027J698J323Q97O04K69k31p44j189j556j576r84k17r5n92o81J04P90
54175B19847L03r18j516r54J05Q93J126O53n57j916k450j845p97r7J74L68N84
54158B13003O46N10L99N56Q98R65L18q45j655j408m00M00M44N7j14K66J140K134
54140B17314K626K163J026L8l29l52m19m19q1M60Q33J032J335J761K026K052K123
$$ y = [219943, 220718, 221896, 223438, 224809, 225659, 226116, 226325, 226176, 225727, 225421, 225445, 225260, 224288, 222882, 221961, 221772, 221669, 221224, 220864, 221044, 221361, 221076, 220197, 219484, 219475, 219918, 220210, 219989, 219326, 218626, 218372, 218698, 219159, 219174, 218656, 217976, 217356, 216701, 216086, 216008, 216837, 218204, 219220, 219320, 218763, 218276, 218224, 218243, 217803, 217077, 216889, 217631, 218577, 218696, 217889, 216910, 216200, 215446, 214349, 213174, 212278, 211655, 211284, 211475, 212429, 213779, 214973, 215892, 216779, 217779, 218923, 220328, 222027, 223725, 225048, 225945, 226549, 226818, 226587, 225843, 224654, 223098, 221522, 220538, 220321, 220226, 219634, 218953, 219057, 219847, 220150, 219232, 217716, 216762, 216867, 217760, 218886, 219539, 218982, 217066, 214616, 212771, 211974, 211877, 212051, 212419, 213003, 213649, 214159, 214558, 215114, 216012, 216977, 217295, 216450, 214795, 213387, 212987, 213387, 213831, 213888, 213774, 214040, 215180, 217314, 219940, 222103, 223129, 223167, 222838, 222486, 222067, 221648, 221567, 222027, 222860, 223892, 225227, 226988, 229014, 231066, 233189]
54123B33189K401K535K098J257O63P07J033J025O41M76R24J560J628J042N26O94
54107B52399J291J533R94l5r11j113n39L96J023R96O66O16Q91J094J162J601K684
54090B64748L879M553M870N454O321O975P601R320J2675J6530J9096J9738J9077
54077D00837J7556J4835J0680N512j67o240j2309j7188j9688j9708j8113j5799
54065C40208j3330j1114r311p640n862m310l516l379l290k987k675k266j348n1
54051B69129P80O55J39J5L17O64J043J654K329K784L173L826M607N116N436O003
54035C07670O839P511P915Q456R353J0299J0988J1407J1527J1109J0154Q955P560
54022D29743N673L294R52j055l008m976o289o442o079o299p271q163q324p850
$$ y = [233189, 235590, 238125, 240223, 241480, 242143, 242850, 243883, 244908, 245549, 246025, 246949, 248509, 250137, 251179, 251705, 252399, 253690, 255223, 256217, 256182, 255271, 254158, 253619, 254015, 255038, 256034, 256700, 257316, 258207, 259301, 260463, 262064, 264748, 268627, 273180, 278050, 283504, 289825, 296800, 304401, 313721, 326396, 342926, 362022, 381760, 400837, 418393, 433228, 443908, 449420, 449253, 443013, 430704, 413516, 393828, 374120, 356007, 340208, 326878, 315764, 306453, 298813, 292951, 288641, 285125, 281746, 278456, 275469, 272794, 270528, 269180, 269129, 269909, 270564, 270703, 270718, 271035, 271699, 272742, 274396, 276725, 279509, 282682, 286508, 291115, 296231, 301667, 307670, 314509, 322020, 329935, 338391, 347744, 358043, 369031, 380438, 391965, 403074, 413228, 422183, 429743, 435416, 438710, 439662, 438607, 435599, 430623, 424334, 417892, 411813, 405514, 398243, 390080, 381756, 373906]
54008C73906p089o257n584n293n347n545n819o018n651m487l245k886l263l294
53994C04128k608k105k548l422l737l270k449j602r21p49j145j559j497j265j417
53979B73834j755j553o03N66J395J631J107q8j271j624j142n59k74M7O35J078
53963B71424R19M02J94O57J649K743L395L173K151J027N53Q84J507J766J462J009
53947B94915J079J882K934L642M005M443N082N619N927O275O880P554Q081Q517
53933C66835R005R562J0255J1292J2623J3793J4533J5368J7210K0261K3488K5370
53921E49595K5104K3030J9882J5829J0569M280j988p165j0940j3315j3904j2466
53909E88511r964q081p530p563p354p037p032p131o951o723o842p003o535n481
$$ y = [373906, 366817, 360560, 354976, 349683, 344336, 338791, 332972, 326954, 321303, 316816, 313571, 310685, 307422, 304128, 301520, 299415, 296867, 293445, 289708, 286438, 283989, 282387, 281466, 280717, 279572, 278013, 276516, 275251, 273834, 272079, 270526, 269923, 270489, 271884, 273515, 274622, 274534, 273263, 271639, 270497, 269938, 269664, 269711, 270346, 271424, 272343, 272745, 272939, 273596, 275245, 277988, 281383, 284556, 286707, 287734, 288287, 289171, 290678, 292444, 293906, 294915, 295994, 297876, 300810, 304452, 308457, 312900, 317982, 323601, 329528, 335803, 342683, 350237, 358318, 366835, 375840, 385402, 395657, 406949, 419572, 433365, 447898, 463266, 480476, 500737, 524225, 549595, 574699, 597729, 617611, 633440, 644009, 648289, 646301, 639136, 628196, 614881, 600977, 588511, 578547, 570466, 562936, 555373, 548019, 540982, 533950, 526819, 519868, 513145, 506303, 499300, 492765, 487284]
53895D87284m714m886n770o680p180p308p308p310p199o898o669o904p514p882
53881C93062p605o907o153n375m598m106l987l798l218k728l027l994m797m938
53867C27831m636m284m051l958l900l615l063k691k842l117k876k250j926k044
53853B82578k029j610j197j055q98n69m51p43r37n52R6M05L38K28P0l23p23o68
53835B71960k26j0l81j041j507j584j280o69QL86L14J4j65l3M84J365K314K756
53817B72705K316J318N97P09J378J865J785J480J569K213L006L558L976M622N458
53802C08555N901N526M794M744N839P292P870P249O250N723N605N241M288K918
53788C87795J361k74j769k751l046k820k304j631j022q29j166j738k249k817l688
$$ y = [487284, 482570, 477684, 471914, 465234, 458054, 450746, 443438, 436128, 428929, 422031, 415362, 408458, 400944, 393062, 385457, 378550, 372397, 367022, 362424, 358318, 354331, 350533, 347315, 344587, 341560, 337566, 332769, 327831, 323195, 318911, 314860, 310902, 307002, 303387, 300324, 297633, 294791, 291674, 288798, 286548, 284622, 282578, 280549, 278939, 277742, 276687, 275789, 275220, 274769, 274026, 273089, 272537, 272633, 273038, 273376, 273604, 273674, 273351, 272628, 271960, 271734, 271724, 271343, 270302, 268795, 267211, 265931, 265262, 265270, 265656, 265970, 265984, 265819, 265786, 266270, 267635, 269949, 272705, 275021, 276339, 276936, 277645, 279023, 280888, 282673, 284153, 285722, 287935, 290941, 294499, 298475, 303097, 308555, 314456, 319982, 324776, 329520, 335359, 342651, 350521, 357770, 364020, 369743, 375348, 380589, 384877, 387795, 389156, 388882, 387113, 384362, 381316, 378496, 376192, 374561, 373539, 372710, 371544, 369806, 367557, 364740, 361052]
53773C61052m681n258n237n082n265n532n225m209l127k566k411k295k313k778
53759C05073l445l563k777j532m69R6L2p00j670k111j792j404j605k069k020j359
53743B78685o59k65m7Q0J0j16P0O35J217J507J418Q41k62j447j992j620o99L28
53725B77684J289K036K369K349K259K183J970J687J563J481J063L51q3O6M99J001
53709B99767J777K844L636L704L379L270L425L398K887J996J149R04J504K408
53695C36048K711K329K166K763L426L227K299J465J013O77M62P23J393J954K058
53680C64714J752J110L02j64J09P18Q50L67j26k14q0N8J49m2q29j836k103j293
53662C63442k10K82L09M92Q78R50M38l70j041j346j239q21l41p5j53n37j010j203
$$ y = [361052, 356371, 351113, 345876, 340794, 335529, 329997, 324772, 320563, 317436, 314870, 312459, 310164, 307851, 305073, 301628, 298065, 295288, 293756, 293287, 293383, 293415, 292715, 291045, 288934, 287142, 285738, 284133, 282064, 280044, 278685, 278026, 277761, 277714, 277794, 277804, 277688, 277758, 278393, 279610, 281117, 282535, 283376, 283114, 281667, 279675, 278055, 277356, 277684, 278973, 281009, 283378, 285727, 287986, 290169, 292139, 293826, 295389, 296870, 297933, 298284, 298201, 298267, 298766, 299767, 301544, 304388, 308024, 311728, 315107, 318377, 321802, 325200, 328087, 330083, 331232, 332136, 333640, 336048, 338759, 341088, 343254, 346017, 349443, 352670, 354969, 356434, 357447, 358124, 358586, 359309, 360702, 362656, 364714, 366466, 367576, 367878, 367714, 367823, 368541, 369391, 369758, 369632, 369418, 369338, 369396, 369545, 369503, 368674, 366838, 364735, 363442, 363232, 363514, 363823, 364315, 365193, 366143, 366581, 366211, 365170, 363824, 362585, 361764, 361423, 361348, 361195, 360658, 359648, 358445]
53644C58445q88l34r9l28n38k62L61Q52R79Q30N99M93P09J153J385J158Q25R55
53626C66295J603K288K614K639K601K579K525K399K216K044K051K459L330M393
53612D02036N116N045M263L481L402L933M269L931L468L775M913N993O237N753
53598D65615N171M868M845N054N521O138O644O830O715O415N957N299M458L566
53584E43096K777K082J180l39k465m509n582n508n021m909n192n409n418n395
53570D99388n217m446l255k611l105l977l921k677j198l53j26j92n12j029j291
53555D65478q56P5Q66J133R62O17L75M68Q95J263J201Q87Q77J302J555J037N2
53538D78187l99K94J597K431K316J762J570K028K982M311N942P478Q347Q414Q162
$$ y = [358445, 357557, 357223, 357124, 356796, 356258, 355996, 356357, 357209, 358188, 359018, 359617, 360110, 360819, 361972, 363357, 364515, 365340, 366295, 367898, 370186, 372800, 375439, 378040, 380619, 383144, 385543, 387759, 389803, 391854, 394313, 397643, 402036, 407152, 412197, 416460, 419941, 423343, 427276, 431545, 435476, 438944, 442719, 447632, 453625, 459862, 465615, 470786, 475654, 480499, 485553, 491074, 497212, 503856, 510686, 517401, 523816, 529773, 535072, 539530, 543096, 545873, 547955, 549135, 548796, 546331, 541822, 536240, 530732, 525711, 520802, 515610, 510201, 504783, 499388, 494171, 489725, 486470, 483859, 480754, 476777, 472856, 470179, 468981, 468628, 468502, 468310, 467798, 466769, 465478, 464622, 464697, 465563, 466696, 467658, 468275, 468650, 469118, 470013, 471276, 472477, 473364, 474241, 475543, 477098, 478135, 478187, 477788, 478082, 479679, 482110, 484426, 486188, 487758, 489786, 492768, 497079, 503021, 510499, 518846, 527260, 535422]
53523E35422Q136Q514R319J0648J2365J3849J4502J4528J4723J5524J6431J6639
53511F90600J6067J5541J5965J7308J8627J9096J8839J8621J8937J9738K0854
53500H90193K2154K3221K3495K3075K2806K3206K3738K3676K3273K3365K4053
53489A146255K4589K4493K4039K3542K2868K1921K0947K0038J8887J7463J6425
53478A381467J6313J6717J6800J6436J6230J6526J6888J6689J5769J4394J2826
53467A557055J1126R279P380N578L842J832p37l572o050q000r868j1859j3397
53454A542609j3891j3697j3748j4441j5471j6626j7990j9387k0313k0626k0776
53443A355643k1099k1421k1534k1581k1638k1435k0781j9898j8946j7656j5782
$$ y = [535422, 543558, 552072, 561391, 572039, 584404, 598253, 612755, 627283, 642006, 657530, 673961, 690600, 706667, 722208, 738173, 755481, 774108, 793204, 812043, 830664, 849601, 869339, 890193, 912347, 935568, 959063, 982138, 1004944, 1028150, 1051888, 1075564, 1098837, 1122202, 1146255, 1170844, 1195337, 1219376, 1242918, 1265786, 1287707, 1308654, 1328692, 1347579, 1365042, 1381467, 1397780, 1414497, 1431297, 1447733, 1463963, 1480489, 1497377, 1514066, 1529835, 1544229, 1557055, 1568181, 1577460, 1584840, 1590418, 1594260, 1596092, 1595355, 1591783, 1585733, 1577733, 1567865, 1556006, 1542609, 1528718, 1515021, 1501273, 1486832, 1471361, 1454735, 1436745, 1417358, 1397045, 1376419, 1355643, 1334544, 1313123, 1291589, 1270008, 1248370, 1226935, 1206154, 1186256, 1167310, 1149654, 1133872]
53432A133872j3532j1159q564n843l739k843k610j896l57J420L022M599O087O995
53418A105452P300P776Q936J0310J1299J2219J3766J5783J7328J7925J8140J8893
53406A265127K0566K2804K4803K5905K6307K7124K9328L2595L5708L8071M0245
53395A588583M2848M5557M7683M9212N0657N2136N3241N3836N4385N5292N6377
53384B149807N7264N7926N8466N8571N7683N5692N3155N0700M8513M6500M4677
53373B738954M3092M1475L9314L6360L2917K9464K6065K2279J7683J2329O574
53362C046506N05o205j3757k1689k9242l6069m2234m7478n1093n2839n3561n4348
53350B638496n5358n5988n6007n5830n5612n4846n3199n1236m9856m9339m9319
$$ y = [1133872, 1120340, 1109181, 1100617, 1094774, 1091035, 1088192, 1085582, 1083686, 1083329, 1084749, 1087771, 1092370, 1098457, 1105452, 1112752, 1120528, 1129464, 1139774, 1151073, 1163292, 1177058, 1192841, 1210169, 1228094, 1246234, 1265127, 1285693, 1308497, 1333300, 1359205, 1385512, 1412636, 1441964, 1474559, 1510267, 1548338, 1588583, 1631431, 1676988, 1724671, 1773883, 1824540, 1876676, 1929917, 1983753, 2038138, 2093430, 2149807, 2207071, 2264997, 2323463, 2382034, 2439717, 2495409, 2548564, 2599264, 2647777, 2694277, 2738954, 2782046, 2823521, 2862835, 2899195, 2932112, 2961576, 2987641, 3009920, 3027603, 3039932, 3046506, 3047011, 3040806, 3027049, 3005360, 2976118, 2940049, 2897815, 2850337, 2799244, 2746405, 2692844, 2638496, 2583138, 2527150, 2471143, 2415313, 2359701, 2304855, 2251656, 2200420, 2150564, 2101225, 2051906]
53339B051906m9341m9043m8126m6608m5028m3836m2656m0684l7794l4798l2386
53328A581606l0332k7973k5221k2629k0608j8958j7315j5800j4941j4959j5441
53317A357429j5837j5974j5819j5045j3381j1354j0017r651r321q123o314m710
53305A221883l470k194q51K42J215K541M064N062N471O225P989J0335J2579J4710
53291A285801J6872J8632J9620K0477K2204K4699K6735K7466K7248K6840K6456
53280A543050K5863K4950K3850K2726K1719K0878K0045J8938J7418J5468J2957
53269A767862R777O286L202Q54j226l715o837j0438j4332j8181k1310k3271k4574
53256A664097k6250k8569l0660l1676l1876l2121l2597l2699l2092l1194l0405
$$ y = [2051906, 2002565, 1953522, 1905396, 1858788, 1813760, 1769924, 1727268, 1686584, 1648790, 1613992, 1581606, 1551274, 1523301, 1498080, 1475451, 1454843, 1435885, 1418570, 1402770, 1387829, 1372870, 1357429, 1341592, 1325618, 1309799, 1294754, 1281373, 1270019, 1260002, 1250351, 1241030, 1232907, 1226593, 1221883, 1218413, 1216219, 1215368, 1215610, 1216825, 1219366, 1223430, 1228492, 1233963, 1240188, 1248177, 1258512, 1271091, 1285801, 1302673, 1321305, 1340925, 1361402, 1383606, 1408305, 1435040, 1462506, 1489754, 1516594, 1543050, 1568913, 1593863, 1617713, 1640439, 1662158, 1683036, 1703081, 1722019, 1739437, 1754905, 1767862, 1777639, 1783925, 1787127, 1787981, 1786755, 1783040, 1776203, 1765765, 1751433, 1733252, 1711942, 1688671, 1664097, 1637847, 1609278, 1578618, 1546942, 1515066, 1482945, 1450348, 1417649, 1385557, 1354363, 1323958]
53245A323958k9479k8152k6997k6926k7938k8903k8860k8093k7638k8038k8805
53234A014129k9012k8158k6587k5112k4217k3550k2307k0211j7802j5775j4264
53223G67134j3034j2006j1338j1057j0957j0801j0466r960r498r430r892j0647
53211F38048j1358j1886j2144j1975j1441j0962j0792j0583r906q946q158p473
53199E12424o594n906o224p458q367q114p270o750o444n701m706m391n021n744
53185D23734n718n018m198l512k959k684k867l327l605l443k975k469k096j945
53171C76918k094k489k812k733k347k193k574l082l097k641k275k192j993j531
53157C42865j300j557j656r91j04m1p66j180p34j03o3m83q55j102j335j362r79
$$ y = [1323958, 1294479, 1266327, 1239330, 1212404, 1184466, 1155563, 1126703, 1098610, 1070972, 1042934, 1014129, 985117, 956959, 930372, 905260, 881043, 857493, 835186, 814975, 797173, 781398, 767134, 754100, 742094, 730756, 719699, 708742, 697941, 687475, 677515, 668017, 658587, 648695, 638048, 626690, 614804, 602660, 590685, 579244, 568282, 557490, 546907, 537001, 528055, 519897, 512424, 505830, 499924, 493700, 486242, 477875, 469761, 462491, 455741, 449297, 443596, 438890, 434499, 429478, 423734, 418016, 412998, 408800, 405288, 402329, 399645, 396778, 393451, 389846, 386403, 383428, 380959, 378863, 376918, 374824, 372335, 369523, 366790, 364443, 362250, 359676, 356594, 353497, 350856, 348581, 346389, 344396, 342865, 341565, 340008, 338352, 337361, 337257, 337216, 336450, 335270, 334536, 334433, 334370, 333887, 333032, 331930, 330595, 329233, 328254]
53140C28254m28o6J51M19O17N21K53R6Q9J54L70Q04J302J824K572L368L384K206
53122C45890P46K76P02P64o6q88q97n54o96j204j335r45o52r10j480j774j501
53105C35476q94n97j092k157k998l074k524j674o04N72J398J546J279J049Q27
53090C26533L03m23q33o62j22M71R58J215J156R22Q23R73J190J231R47K91n86
53073C34387j299j547j425j231j055q20n86n19o40q75j252j706j875j447o92k29
53057C17189k79n07n78m78k99j05k5p3J02Q10J625J699R20J58J06L95K77k42m78
53038C20217p1N75P75K42o58j187r33l03n9k81k21N99J546J548L90j048j722j279
53020C18130j82P39R78Q05R51J661K331K257J467N82P5K2L07P10R82J089J198
$$ y = [328254, 327826, 327760, 327911, 328330, 328947, 329468, 329721, 329817, 329906, 330060, 330430, 331234, 332536, 334360, 336932, 340300, 343684, 345890, 346636, 346912, 347614, 348378, 348312, 347424, 346527, 345973, 345277, 344073, 342738, 341793, 341141, 340231, 338751, 336977, 335476, 334582, 333985, 332893, 330736, 327738, 324664, 322140, 320466, 319862, 320434, 321832, 323378, 324657, 325706, 326533, 326836, 326413, 325580, 324918, 324796, 325267, 326225, 327440, 328596, 329518, 330341, 331314, 332504, 333735, 334682, 334973, 334387, 333088, 331541, 330116, 328885, 327830, 327010, 326424, 325905, 325265, 324390, 323138, 321432, 319557, 318110, 317418, 317189, 316910, 316403, 315825, 315347, 315048, 314943, 314918, 314845, 314947, 315757, 317382, 319081, 320001, 320159, 320265, 320660, 320937, 320695, 320217, 320146, 320721, 321496, 321738, 321080, 319893, 318960, 318657, 318598, 318317, 318096, 318695, 320241, 321789, 322179, 321131, 319409, 318130, 317948, 318687, 319665, 320470, 321421, 323082, 325413, 327670, 329137, 329719, 329794, 329816, 330123, 330833, 331815, 332904, 334102]
53003C34102J176N52o83j670j615q02n3M74J144J739J516M56m13l27L69R44J232
52986C38141J421J478J288J078J181J629K248K920L440L465K896K084J365P35
52972C65369J90k2J38J51l55q65n77M14J168J115O17J24n63j712k785k785j587
52955C58035l98n11j794k817k611j788j551k004k118j369m72k11k79O4O96Q45
52939C41717L27k26l29j11K03O24R65P31k11j343k106k430k421j953j019n5M76
52922C32839O07O09N27L47L13N76P44L85j98l32p0k14j030j725j592j016p16n02
52904C29552L44J637K202J460L17nN19R39P36L25K47M80P53R72J083Q04k4j023
52886C41318j471j056k35J75k31j045j375p60K96Q38N41K4MM63Q64R48R13R36
$$ y = [334102, 335278, 335830, 335147, 333477, 331862, 331060, 331007, 331481, 332625, 334364, 335880, 336336, 335923, 335596, 335965, 336909, 338141, 339562, 341040, 342328, 343406, 344587, 346216, 348464, 351384, 354824, 358289, 361185, 363269, 364634, 365369, 365559, 365537, 365675, 365826, 365471, 364606, 364029, 364443, 365611, 366726, 367343, 367467, 366904, 365192, 362407, 359622, 358035, 357637, 357126, 355332, 352515, 349904, 348116, 346565, 344561, 342443, 341074, 340602, 340391, 340112, 340176, 340872, 341717, 342044, 341818, 341489, 341378, 341581, 342205, 343170, 343901, 343690, 342347, 340241, 337811, 335390, 333437, 332418, 332363, 332839, 333446, 334055, 334582, 334929, 335242, 335818, 336562, 336947, 336749, 336417, 336347, 336133, 335103, 333378, 331786, 330770, 330054, 329552, 329896, 331533, 333735, 335195, 335512, 335507, 336026, 336965, 337701, 338026, 338273, 338753, 339506, 340478, 341561, 342365, 342341, 341318, 339847, 338791, 338556, 338731, 338500, 337455, 336080, 335320, 335616, 336454, 336995, 337019, 337023, 337486, 338350, 339298, 340211, 341147]
52868C41147Q75N17j01o97r27o46p3M17P86J372K186K534J791L77n98o28k63k70
52850C47799r20k055l249l757l075j746j005j287j732j599j334j608k049j874
52836C20509j283j148j524j527o93M68J401K081K429K071J109L87M69R12J037
52821C26698R02J064J723K638L572M390M897M977M583L475J317j616m269n773
52807C48578o217o111n550m467l260k510k284k253k306k441k296j556p07n60j027
52792C05033j086j87J004J500J134M53LJ2M48J063J560J876K085J997J274P7q53
52775C17393j012p28o08p03n81l1O16Q43M63k40q13j086j231j355j198n35L09
52758C09503P66P56P06P90O95K01m14o57k47P97K057K776K533J806J342J029J71
$$ y = [341147, 342022, 342539, 342438, 341741, 340814, 340168, 340095, 340512, 341298, 342670, 344856, 347390, 349181, 349558, 348960, 348332, 348069, 347799, 346879, 344824, 341575, 337818, 334743, 332997, 331992, 330705, 328973, 327374, 326040, 324432, 322383, 320509, 319226, 318078, 316554, 315027, 314334, 314802, 316203, 318284, 320713, 322784, 323893, 324280, 324749, 325661, 326698, 327600, 328664, 330387, 333025, 336597, 340987, 345884, 350861, 355444, 358919, 360236, 358620, 354351, 348578, 342361, 336250, 330700, 326233, 322973, 320463, 318179, 315926, 313620, 311179, 308883, 307327, 306620, 306060, 305033, 303947, 303760, 304764, 306264, 307398, 307851, 307854, 307866, 308314, 309377, 310937, 312813, 314898, 316895, 318169, 318246, 317393, 316381, 315653, 315045, 314342, 313761, 313730, 314346, 315189, 315652, 315412, 314599, 313513, 312282, 310927, 309729, 309194, 309503, 310269, 311025, 311731, 312521, 313216, 313417, 313003, 312346, 312099, 312896, 314953, 317729, 320262, 322068, 323410, 324439, 324610]
52741C24610j058j474n51P43J357J598K348L515M197L961L154K183J244N01r0
52726C46238q88j898k343j645m88p0n73j178j394j447j448j197q43q39j101j059
52710C27827o04k62k15n2L28M90M01P09J624K285J872P19j13L1J017K112K319
52693C40488J166n04j222p08j79m72q36k96O47P46j21q92q74m09j11j98n18o17
52675C35090lJ132J670Q21o45j229n80L17O51N61L86J05j22K25J299K510L259
52658C45447L546L611L466L079K553J885R28k02j137j811k473l006k881k064j334
52643C49607j208j134l71P90J402J162O37L21J62P6L22J084K048K657K595J957
52627C62107J046O3j000k225l426m104l912l019j968j220r15r41r93p37j14N71
$$ y = [324610, 323552, 322078, 321527, 322270, 323627, 325225, 327573, 331088, 335285, 339246, 342400, 344583, 345827, 346328, 346238, 345350, 343452, 341109, 339464, 338976, 338906, 338333, 337155, 335761, 334314, 332866, 331669, 330826, 329987, 328886, 327827, 327223, 326961, 326746, 326694, 327022, 327512, 327913, 328622, 330246, 332531, 334403, 335122, 335009, 335040, 336057, 338169, 340488, 341654, 341150, 339928, 339220, 339041, 338569, 337733, 337437, 338084, 338830, 338709, 337817, 336943, 336534, 336423, 336225, 335707, 335090, 335087, 336219, 337889, 338710, 338065, 336836, 336256, 336573, 337224, 337785, 338171, 338276, 338154, 338379, 339678, 342188, 345447, 348993, 352604, 356070, 359149, 361702, 363587, 364515, 364313, 363176, 361365, 358892, 355886, 353005, 350941, 349607, 348399, 347265, 346894, 347684, 349086, 350248, 350885, 351206, 351368, 351444, 351766, 352850, 354898, 357555, 360150, 362107, 363153, 363216, 362216, 359991, 356565, 352461, 348549, 345530, 343562, 342342, 341427, 340486, 339493, 338756, 338642, 339213]
52611C39213R64R63O46J08l54k49O02J615J954J493R05P72R37R38P13N58N48L96
52593C52722n3m70m11M2L10J05j35K04J003J496J197M31j85m17m14l61l59m24
52575C54281l22K39J058J377Q02m5l08m8m2n69j101j253j261j324j092k86O35
52558C50741R04L40n59j242j459j229p75m23l12k94k32k11k71k47q6p7m02p35
52540C43431o87m28l97n44l91J91Q59J419J961K286J810M42r12j186k86J001J990
52523C50559K553K698K246J154j02p73m81M14J203J537J680K077K714L074K689
52508C73242J559J42r82j473j496j555j923k295k246j881j567j244n57K48L76
52493C58348k44n49K59J417J609Q69N05J188K029J903R12M8j20J15K62K64M21
$$ y = [339213, 340177, 341140, 341786, 341894, 341540, 341291, 341893, 343508, 345462, 346955, 347860, 348632, 349569, 350507, 351220, 351778, 352326, 352722, 352669, 352199, 351788, 351830, 352140, 352245, 352110, 352314, 353317, 354813, 356010, 356441, 356256, 355839, 355425, 355064, 354705, 354281, 353959, 354198, 355256, 356633, 357435, 357390, 357082, 357034, 356992, 356423, 355322, 354069, 352808, 351484, 350392, 350106, 350741, 351645, 351985, 351426, 350184, 348725, 347496, 346721, 346298, 345986, 345692, 345460, 345249, 344978, 344731, 344645, 344568, 344166, 343431, 342744, 342316, 341919, 341375, 340984, 341175, 342034, 343453, 345414, 347700, 349510, 349952, 349040, 347854, 347568, 348569, 350559, 353112, 355810, 358056, 359210, 359108, 358335, 357854, 358268, 359471, 361008, 362688, 364765, 367479, 370553, 373242, 374801, 374943, 373961, 372488, 370992, 369437, 367514, 365219, 362973, 361092, 359525, 358281, 357724, 357972, 358348, 358104, 357555, 357814, 359231, 360840, 361709, 362214, 363402, 365431, 367334, 368246, 368294, 368174, 368289, 368551, 368815, 369236]
52476C69236R07J484J655J248P43Q17J520K166K118J454P62M83N69O09J40j000
52460C84911k469l630m060l768l057k361k111k375k654k375j623j057j017j149
52446C51205j107j034j111j061n85K3J85k07p51j098j141q04j18N63Q32P49O81
52429C45221P18O10K84kq8p5M2M48J046J368J176Q83J020J523J963K263K775L647
52411C64822M575N378O367P844R435J0369J0422J0089R688Q738O613L510K17k861
52397D55206n798q291r555r380q632q157p727o653n039l639k715j833q01M3N49
52382C77578J013J491J557J105P74J099J701J901J736J738J952J851J248P18Q57
52367C98319J487J905J708J141O91N74O74Q78J235J707K013J927J670J675K017
$$ y = [369236, 370143, 371627, 373282, 374530, 375273, 376090, 377610, 379776, 381894, 383348, 384110, 384593, 385162, 385771, 385911, 384911, 382442, 378812, 374752, 370984, 367927, 365566, 363455, 361080, 358426, 356051, 354428, 353371, 352354, 351205, 350098, 349064, 347953, 346892, 346307, 346330, 346515, 346308, 345557, 344459, 343318, 342514, 342396, 342959, 343791, 344540, 345221, 345939, 346549, 346833, 346831, 346743, 346668, 346710, 347158, 348204, 349572, 350748, 351631, 352651, 354174, 356137, 358400, 361175, 364822, 369397, 374775, 381142, 388986, 398421, 408790, 419212, 429301, 438989, 447727, 454340, 457850, 458067, 455206, 449408, 441117, 431562, 422182, 413550, 405393, 397666, 391013, 385974, 382335, 379620, 377787, 376986, 377029, 377578, 378591, 380082, 381639, 382744, 383518, 384617, 386318, 388219, 389955, 391693, 393645, 395496, 396744, 397462, 398319, 399806, 401711, 403419, 404560, 405251, 405825, 406499, 407377, 408612, 410319, 412332, 414259, 415929, 417604, 419621]
52352D19621K354K435K306J957J301O36N89J222J702J431J044J505K566L027K558
52337D46254K201K748L601L846L722M073M798N005M596M622N701P005P431P095
52323E12698O902P048O859O051N328N483O526P969R472J0825J1778J2357J3043
52310F22339J4108J5053J5241J4973J5271J6499J7803J8162J7578J6850J6510
52299H00387J6337J5889J5074J4190J3515J3077J2746J2480J2269J1858J0796
52288I48618R013P116N797N131M754M577M737M908M431L371K731L165L960L816
52274A016125K380M61r85j623j695j736k171k821k943k171j094m19J14J245K900
52259A005567M283N252O561Q399R748R741Q978Q736R393J0362J1155J1735J1988
$$ y = [419621, 421975, 424410, 426716, 428673, 429974, 430610, 431199, 432421, 434123, 435554, 436598, 438103, 440669, 443696, 446254, 448455, 451203, 454804, 458650, 462372, 466445, 471243, 476248, 480844, 485466, 491167, 498172, 505603, 512698, 519600, 526648, 533507, 539558, 544886, 550369, 556895, 564864, 574336, 585161, 596939, 609296, 622339, 636447, 651500, 666741, 681714, 696985, 713484, 731287, 749449, 767027, 783877, 800387, 816724, 832613, 847687, 861877, 875392, 888469, 901215, 913695, 925964, 937822, 948618, 957631, 964747, 970544, 975675, 980429, 985006, 989743, 994651, 999082, 1002453, 1005184, 1008349, 1012309, 1016125, 1018505, 1018966, 1017981, 1016358, 1014663, 1012927, 1010756, 1007935, 1004992, 1002821, 1001727, 1001308, 1001422, 1002667, 1005567, 1009850, 1015102, 1021663, 1030062, 1039810, 1049551, 1058529, 1067265, 1076658, 1087020, 1098175, 1109910, 1121898]
52246A121898J1682J1028J0645J0798J1067J0913J0221R274Q412P786P222O312
52234A237258M939L553K674K223J745J108N29j3q10j868k840l548m044m150l692
52219A233064l287l980n714o992o696n426m357l506k304j206j281k270k508j178
52205A182359O16J489J498J519J856K336L114M342N406N455M549L543K963K657
52191A223702K426K239J871J082K07j98l15r43k196l119k964k177j703j843k304
52176A213765k795l126l076k764k791l467m185m157l456k757k236j536o83k86
52162A176450n85j013j017p82p99j080j215r84n10N4O45J123J272J084Q85J063
52146A174591J584J834J144l74j705j983j469j152j379j497r72k07J93M40J207
$$ y = [1121898, 1133580, 1144608, 1155253, 1166051, 1177118, 1188031, 1198252, 1207526, 1215938, 1223724, 1230946, 1237258, 1242197, 1245750, 1248424, 1250647, 1252392, 1253500, 1254029, 1254016, 1253206, 1251338, 1248498, 1244950, 1240906, 1236756, 1233064, 1229777, 1225797, 1220083, 1213091, 1206395, 1200969, 1196612, 1193106, 1190802, 1189596, 1188315, 1186045, 1183537, 1182359, 1182975, 1184464, 1185962, 1187481, 1189337, 1191673, 1194787, 1199129, 1204535, 1209990, 1214539, 1218082, 1221045, 1223702, 1226128, 1228367, 1230238, 1231320, 1231527, 1231329, 1231014, 1230071, 1227875, 1224756, 1221792, 1219615, 1217912, 1216069, 1213765, 1210970, 1207844, 1204768, 1202004, 1199213, 1195746, 1191561, 1187404, 1183948, 1181191, 1178955, 1177419, 1176736, 1176450, 1175865, 1174852, 1173835, 1173053, 1172254, 1171174, 1169959, 1168975, 1168465, 1168519, 1169164, 1170287, 1171559, 1172643, 1173528, 1174591, 1176175, 1178009, 1179153, 1178779, 1177074, 1175091, 1173622, 1172470, 1171091, 1169594, 1168622, 1168415, 1168608, 1169048, 1170255]
52131A170255K477L446L650L578L938M710N320N464N377N342N280N020M737M880
52117A233474N613O578P311P888Q801J0241J1760J2870J3712J4782J6170J7424
52105A366624J8150J8402J8382J8047J7217J5917J4522J3581J3412J3752J3866
52094A541872J3264J2255J1499J1100J0530R444Q075O671N073L166J305j77j474
52081A632603k885m210n145n927o993q100q565q301p915p732p425o769o001n136
52067A541499l641j339R84K408K905L098L354L735M408N447O439O872O771O453
52053A589393N946N307N152N999P226P667P346P536Q779R816R264P521O124N663
52039A688739N279M102K319O61n27j436k410l631m982o083o616o613o355o026
$$ y = [1170255, 1172732, 1176178, 1179828, 1183406, 1187344, 1192054, 1197374, 1202838, 1208215, 1213557, 1218837, 1223857, 1228594, 1233474, 1239087, 1245665, 1252976, 1260864, 1269665, 1279906, 1291666, 1304536, 1318248, 1333030, 1349200, 1366624, 1384774, 1403176, 1421558, 1439605, 1456822, 1472739, 1487261, 1500842, 1514254, 1528006, 1541872, 1555136, 1567391, 1578890, 1589990, 1600520, 1609964, 1618039, 1624710, 1629783, 1632949, 1634254, 1634077, 1632603, 1629718, 1625508, 1620363, 1614436, 1607443, 1599343, 1590778, 1582477, 1574562, 1566830, 1559405, 1552636, 1546635, 1541499, 1537858, 1536519, 1537503, 1539911, 1542816, 1545914, 1549268, 1553003, 1557411, 1562858, 1569297, 1576169, 1582940, 1589393, 1595339, 1600646, 1605798, 1611797, 1619023, 1626690, 1634036, 1641572, 1650351, 1660167, 1669431, 1676952, 1683076, 1688739, 1694018, 1698120, 1700439, 1701100, 1700573, 1699137, 1696727, 1693096, 1688114, 1682031, 1675415, 1668802, 1662447, 1656421]
52025A656421n697n525n696o079o203n687m642l675l544m646o617q520r715j0574
52011A569601j2005j4291j6647j8142j8737j9110j9609j9780j9115j7957j7296
52000A376912j7705j8750j9661k0315k1252k2825k4657k5982k6324k5781k4929
51989A128731k4455k4592k4836k4475k3478k2542k2148k1986k1521k0591j9137
51978H78970j6866j3816j0872q940p803o546n033m110m209m742n231o119p779
51965G76904r327r472q314p361p678q708r168q523p169n576l815j813K60K005
51951F92245L101L564L795M293N228O335P209P642P615P128O192M970L757K788
51937G65862K170J917J918J798J088l58k150l712m749n365n814o290o785o929
$$ y = [1656421, 1650724, 1645199, 1639503, 1633424, 1627221, 1621534, 1616892, 1613217, 1609673, 1605027, 1598410, 1589890, 1580175, 1569601, 1557596, 1543305, 1526658, 1508516, 1489779, 1470669, 1451060, 1431280, 1412165, 1394208, 1376912, 1359207, 1340457, 1320796, 1300481, 1279229, 1256404, 1231747, 1205765, 1179441, 1153660, 1128731, 1104276, 1079684, 1054848, 1030373, 1006895, 984353, 962205, 940219, 918698, 898107, 878970, 862104, 848288, 837416, 828476, 820673, 814127, 809094, 804984, 800775, 796033, 790802, 784683, 776904, 767577, 758105, 749791, 742430, 734752, 726044, 716876, 708353, 701184, 695608, 691793, 689980, 690240, 692245, 695346, 698910, 702705, 706998, 712226, 718561, 725770, 733412, 741027, 748155, 754347, 759317, 763074, 765862, 768032, 769949, 771867, 773665, 774753, 774395, 772245, 768533, 763784, 758419, 752605, 746315, 739530, 732601]
51923G32601o090l995j212J300L241N252Q020J1449J4942J8179K1273K4300K7131
51910H56391K9571L1272L1453K9135K3890J6140O654l984j5235k6064l4905m0318
51898I04000m1828m0248l7111l3601k9942k5829k1286j6874j3055r693o409l137
51886F24987j72K221M012N321O261O853O959O346M901K802M24j931m074n814o878
51871F52218p120o707o042n380m715m040l585l564l723l491k686j769j201r36
51857E97259q63j379k898n010o703p512p801p842p359o281n273m836m411l150
51843E25941j303o0R0pN72J591K130J877J389J210J327J488J553J359N78p49j737
51826E37249j276O70K693L340K607J723J478J420P66m67j702k742l776m625m666
$$ y = [732601, 726511, 722516, 721304, 722604, 725845, 731097, 739117, 750566, 765508, 783687, 804960, 829260, 856391, 885962, 917234, 948687, 977822, 1001712, 1017852, 1024506, 1020522, 1005287, 979223, 944318, 904000, 862172, 821924, 784813, 751212, 721270, 695441, 674155, 657281, 644226, 634533, 628124, 624987, 624815, 627036, 631048, 636369, 642630, 649483, 656442, 662788, 667689, 670491, 670915, 668984, 664910, 659096, 652218, 645098, 638391, 632349, 626969, 622254, 618214, 614629, 611065, 607342, 603851, 601165, 599396, 598195, 597259, 596396, 595017, 592119, 587109, 580406, 572894, 565093, 557251, 549892, 543611, 538338, 533502, 529091, 525941, 524638, 524578, 524668, 524661, 525233, 526824, 528954, 530831, 532220, 533430, 534757, 536245, 537798, 539157, 539735, 538986, 537249, 535973, 536643, 539336, 542676, 545283, 547006, 548484, 549904, 550670, 550203, 548501, 545759, 541983, 537358, 532692]
51811E32692l643k092p53L1K41j5l32l2J135K507L148K840K141J554J049M39k51
51794E40659r18j500j844j730j275j005j300j902k174j718o10P46J844K346K432
51779E32051K728L605M688N336N389N091M469L268J513l95k142l596m474m472
51765E53059l883l399l111k358r70R4o3r80j523j359r12j76J270L044L912L301
51749E45946K041J198Q74O80O34R24J257J243J164J636K603L268L149K656K467
51734E71740K736L061L007K520J931J718K162L218M670O177P122O739M778K025
51720F23604k38j340j609j651j558r75K06J571K613L231L596L647L048J752K85
51705F36182q61j892l256m622m957l816j973m04Q00J973K809K467P46j597l716
$$ y = [532692, 529049, 526957, 526204, 526235, 526476, 526461, 526129, 526097, 527232, 529739, 532887, 535727, 537868, 539422, 540471, 540910, 540659, 539741, 538241, 536397, 534667, 533392, 532387, 531087, 529185, 527011, 525293, 524683, 525429, 527273, 529619, 532051, 534779, 538384, 543072, 548408, 553797, 558888, 563357, 566625, 568138, 567743, 565601, 562005, 557531, 553059, 549176, 545777, 542666, 540308, 539338, 539432, 539369, 538389, 536866, 535507, 534595, 534419, 535689, 538733, 542645, 545946, 547987, 549185, 550059, 550739, 551373, 552297, 553554, 554797, 555961, 557597, 560200, 563468, 566617, 569273, 571740, 574476, 577537, 580544, 583064, 584995, 586713, 588875, 592093, 596763, 602940, 610062, 616801, 621579, 623604, 623366, 622026, 620417, 618766, 617208, 616233, 616439, 618010, 620623, 623854, 627450, 631097, 634145, 635897, 636182, 635321, 633429, 630173, 625551, 620594, 616778, 614805, 614401, 615201, 617174, 619983, 622450, 623196, 621599, 617883]
51690F17883n424o918q233r189r624r458q737p748o917o483o295n985n211l793
51676E17868j922j26J149K027L081M692O709Q738J0568J2229J3786J5043J5390
51663F09232J4115J1082O998K816j052m560p371q882q916p838n966l519j199m9
51649E94891k60p08l54L70K08j189k989m497n875p280q089p636o294n221n012
51634E40065n069m451l062j779j409j798k075j698j022p33j023j532j920k124
51620E10370k059j552p46j96k88o70o80j15O43J197J425J250O48mK3J054K571
51603E12871L867M860N932P167Q221Q936R518J0031J0091R288P577N142K246n83
51589F05164k614l490l493k907j393J579N788J0201J3878J6589J8613K0142K1065
$$ y = [617883, 612459, 605541, 597308, 588119, 578495, 569037, 560300, 552552, 545635, 539152, 532857, 526872, 521661, 517868, 515946, 515820, 516969, 518996, 522077, 526769, 533478, 542216, 552784, 565013, 578799, 593842, 609232, 623347, 634429, 641427, 644243, 643191, 638631, 631260, 622378, 613462, 605624, 599658, 596139, 594940, 594891, 594631, 593923, 593569, 593939, 594147, 592958, 589969, 585472, 579597, 572317, 564228, 556592, 550298, 545077, 540065, 534996, 530545, 527483, 525704, 524295, 522497, 520422, 518724, 517702, 516969, 515946, 514414, 512494, 510370, 508311, 506759, 506013, 505817, 505529, 504859, 504179, 504064, 504707, 505904, 507329, 508579, 509227, 509223, 509246, 510300, 512871, 516738, 521598, 527530, 534697, 542918, 551854, 561372, 571403, 581494, 590782, 598359, 603501, 605747, 605164, 602550, 599060, 595567, 592660, 591267, 592846, 598634, 608835, 622713, 639302, 657915, 678057, 699122]
51576F99122K1135K0320J9034J7746J6319J4054J0653O890L919K283K041L499
51564H37015P060J2351J8136K3104K6291K6865K4473J9900J4620R281L355l475
51552A018976j0330j6050k0386k3719k6194k7827k8914k9643k9715k9002k8050
51541G49146k7159k5519k2271j8094j4591j2333j0620r087q164p773o992n584
51529E80959m680n040n727n419m285l432l102k535j407k16O85J494K266K696K758
51514E55015K830K994K862K258J472O54m09j636k402k332j866j616j566j363j027
51499E53868q90j077j410j752k055k223k212k190k328k593k953l576m544n493
51485E18572n881n498m586l617l092l289l902m193l822l239k933k690k054j152
$$ y = [699122, 720257, 740577, 759611, 777357, 793676, 807730, 818383, 825273, 829192, 831475, 833516, 837015, 844075, 856426, 874562, 897666, 923957, 950822, 975295, 995195, 1009815, 1019096, 1022451, 1018976, 1008646, 992596, 972210, 948491, 922297, 894470, 865556, 835913, 806198, 777196, 749146, 721987, 696468, 674197, 656103, 641512, 629179, 618559, 609472, 601308, 593535, 586543, 580959, 576279, 571239, 565512, 560093, 555808, 552376, 549274, 546739, 545332, 545116, 545801, 547295, 549561, 552257, 555015, 557845, 560839, 563701, 565959, 567431, 568085, 567676, 566040, 563638, 561306, 559440, 557824, 556258, 554895, 553868, 552978, 551901, 550491, 548739, 546684, 544461, 542249, 540059, 537731, 535138, 532185, 528609, 524065, 518572, 512691, 507193, 502607, 498990, 495898, 492609, 488707, 484514, 480692, 477453, 474520, 471830, 469776, 468624]
51471D68624m16J84R09J378R39r9n09K95J528K200K251K122K010K107K890M402
51455D90815N792O323O482P343R155J1349J3587J5840J7625J8101J7082J5108
51443F34602J2454Q936M906J523l85j068j130q59p90k035n171r179j2396j4241
51429F15167j5260j5688j5023j3186j1077r517q227o491m464l069k690k570j820
51416E06085n69K89L44J98O45J663K528K757K574K477K588K624K367K062K288
51401E30920L379M949O168O589O515O367O097N550N142N550O829Q470J0300J2590
51387F25415J5224J7631J9838K2766K6821L0922L3746L5394L6955L8661L9439
51376I42812L8176L4619K8999K1643J3203M546l879j2125j9973k6602l1341l4306
$$ y = [468624, 468208, 468392, 469301, 470679, 471618, 471519, 471010, 471305, 472833, 475033, 477284, 479406, 481416, 483523, 486413, 490815, 496607, 502930, 509412, 516755, 525910, 537259, 550846, 566686, 584311, 602412, 619494, 634602, 647056, 655992, 660898, 662421, 662036, 660968, 659838, 658979, 658189, 656154, 650983, 641804, 629408, 615167, 599907, 584219, 569196, 556010, 544933, 535416, 527189, 520698, 516234, 513165, 510475, 507905, 506085, 505516, 505805, 506149, 506347, 506992, 508655, 511183, 513940, 516514, 518991, 521579, 524203, 526570, 528632, 530920, 534299, 539248, 545416, 552005, 558520, 564887, 570984, 576534, 581676, 587226, 594055, 602525, 612825, 625415, 640639, 658270, 678108, 700874, 727695, 758617, 792363, 827757, 864712, 903373, 942812, 980988, 1015607, 1044606, 1066249, 1079452, 1083998, 1080119, 1067994, 1048021, 1021419, 990078, 955772]
51364I55772l6087l7089l7379l6753l4811l1461k7544k4450k2733k1519j9687
51353F26259j7145j4549j2257j0181q385p128o323n594m857m423m387m384m082
51340E22564l555l125l009l271l792m219m189l682l033k533k276k313k664l051
51326D77852k958k241j429j101j114o96N38K014K772K571K143K309L063L767M033
51311D91523M111M331M609M686M540M224L542K283O84p07j674k495l469m558n491
51296E06139o025o058n716n285m774l703j767L24J288P76k6L25J973L831M874
51281D86176M944M461L817L130K310J295K83m09p41q85o79M46K517M407M803L723
51265E19598K505K141K273J919P65o32j560j711j239o17l63p49j685k892l959
$$ y = [955772, 919685, 882596, 845217, 808464, 773653, 742192, 714648, 690198, 667465, 645946, 626259, 609114, 594565, 582308, 572127, 563742, 556614, 550291, 544697, 539840, 535417, 531030, 526646, 522564, 519009, 515884, 512875, 509604, 505812, 501593, 497404, 493722, 490689, 488156, 485880, 483567, 480903, 477852, 474894, 472653, 471224, 470123, 469009, 468313, 468851, 470865, 473637, 476208, 478351, 480660, 483723, 487490, 491523, 495634, 499965, 504574, 509260, 513800, 518024, 521566, 523849, 524533, 523826, 522152, 519657, 516188, 511630, 506139, 500114, 494056, 488340, 483055, 478281, 474578, 472811, 473135, 474423, 475199, 475173, 475498, 477471, 481302, 486176, 491120, 495581, 499398, 502528, 504838, 506133, 506416, 506007, 505266, 504381, 503702, 504148, 506665, 511072, 515875, 519598, 522103, 524244, 526517, 528436, 529201, 528569, 527009, 525298, 524059, 523442, 523079, 522330, 520645, 517753, 513794]
51250E13794m335l593j911o1J270J963K194K037J589J171J028R34M98k51r01j243
51234E14183j489j828k114k144j988j852j734j450r27l81j11j77k61N8Q53J701
51218E00339K101K038J965K246K754L086L114L122L398L840M145M282M538M982
51204E45950N159M581L393K193J173l5j586k911l364l033k558k334k315k413k578
51189E39322k530j944r38kO15J031J197P77k10j167j650j887k150k079j246j01
51173E27038L79O2j16N07J399J696J417J251J407J397R92O40O42N11l14j428j815
51156E35665j185l42o6j65K2O09J090J168J085J146J294J235P49j76j281k080
51140E38768k231j952j797j965k123j950j546j133p22l00j19l42o13l82L73J083
$$ y = [513794, 509459, 505866, 503955, 503894, 505164, 507127, 509321, 511358, 512947, 514118, 515146, 516080, 516578, 516327, 515426, 514183, 512694, 510866, 508752, 506608, 504620, 502768, 501034, 499584, 498657, 498276, 498165, 497988, 497727, 497785, 498638, 500339, 502440, 504478, 506443, 508689, 511443, 514529, 517643, 520765, 524163, 528003, 532148, 536430, 540968, 545950, 551109, 555690, 559083, 561276, 562449, 562414, 560828, 557917, 554553, 551520, 548962, 546628, 544313, 541900, 539322, 536792, 534848, 533910, 533908, 534523, 535554, 536751, 537528, 537318, 536151, 534501, 532614, 530464, 528385, 527139, 527038, 527417, 527479, 527363, 527870, 529269, 530965, 532382, 533633, 535040, 536437, 537429, 538069, 538711, 539222, 538908, 537480, 535665, 534480, 534138, 534072, 533907, 533929, 534538, 535628, 536796, 537881, 539027, 540321, 541556, 542305, 542129, 540848, 538768, 536537, 534585, 532788, 530823, 528700, 526750, 525204, 524071, 523349, 523049, 522930, 522588, 521975, 521593, 521966, 523049]
51124E23049J314J200J119J176J256J338J573J979K379K583K626K670K755K719
51110E49736K434K015J733J717J885K051K014J586Q06J15L9M91O28l01k060l642
51094E61247m266l937l095k077j084l15N3L1j77k36J50R74J750J896J381Q58R45
51077E54098J511J856J498O29j36k55M37J632K734L360L689M208N074O021O898
51062E93254P978R484J1128J2369J3005J3185J3033J2608J2180J2073J2209J2280
51050G34786J2372J2933J3802J3820J1913Q354M538J560o39k783n325p997j0047
51037G87287j0826j0366r377q625q363q405q494q377p809o858o025n609n099l672
51023F79382j303J083K622L314L738M437N660P339R147J0782J2260J3685J4834
$$ y = [523049, 524363, 525563, 526682, 527858, 529114, 530452, 532025, 534004, 536383, 538966, 541592, 544262, 547017, 549736, 552170, 554185, 555918, 557635, 559520, 561571, 563585, 565171, 565977, 566092, 566131, 566622, 567250, 566949, 564889, 561247, 556981, 553044, 549949, 547872, 546788, 546473, 546526, 546557, 546380, 546144, 546294, 547268, 549018, 550914, 552295, 553153, 554098, 555609, 557465, 558963, 559592, 559456, 559201, 559638, 561270, 564004, 567364, 571053, 575261, 580335, 586356, 593254, 601232, 610716, 621844, 634213, 647218, 660403, 673436, 686044, 698224, 710297, 722506, 734786, 747158, 760091, 773893, 787713, 799626, 807980, 812518, 814078, 813439, 810656, 805331, 797334, 787287, 776461, 766095, 756718, 748093, 739730, 731325, 722831, 714454, 706645, 699787, 693762, 688153, 683054, 679382, 678079, 679162, 681784, 685098, 688836, 693273, 698933, 706272, 715419, 726201, 738461, 752146, 766980]
51010G66980J5407J5629J6033J6593J6690J6079J5358J5112J5136J4802J3781
50999I37600J2085R869P585N830M662L469J885L74n87j265k070k680k545j897
50985I72315j392r66J17K168M779P559J0338J2649J3952J4603J5861J8512K2047
50972A092542K5512K8659L1883L5425L9080M2506M5574M8479N1517N4487N6517
50961A552181N6890N5939N4527N2680M9581M5103M0389L6390L2630K8131K3088
50950B027529J8699J5639J3577J2166J1597J1952J2564J2497J1332R210O284K463
50938B165509k341p802j3155j7603k0861k3338k5777k8703l2121l5629l8781m1461
50926A877937m3954m6594m9379n1898n3608n4070n3095n0926m8117m5060m1743
$$ y = [766980, 782387, 798016, 814049, 830642, 847332, 863411, 878769, 893881, 909017, 923819, 937600, 949685, 959554, 967139, 972969, 977631, 981100, 982985, 983359, 982772, 981507, 979437, 976757, 974212, 972315, 970923, 969957, 970074, 972242, 977021, 984580, 994918, 1007567, 1021519, 1036122, 1051983, 1070495, 1092542, 1118054, 1146713, 1178596, 1214021, 1253101, 1295607, 1341181, 1389660, 1441177, 1495664, 1552181, 1609071, 1665010, 1719537, 1772217, 1821798, 1866901, 1907290, 1943680, 1976310, 2004441, 2027529, 2046228, 2061867, 2075444, 2087610, 2099207, 2111159, 2123723, 2136220, 2147552, 2156762, 2163046, 2165509, 2163168, 2155366, 2142211, 2124608, 2103747, 2080409, 2054632, 2025929, 1993808, 1958179, 1919398, 1877937, 1833983, 1787389, 1738010, 1686112, 1632504, 1578434, 1525339, 1474413, 1426296, 1381236, 1339493]
50915A339493l8163l4771l2009k9631k7043k4289k1956k0055j7802j4900j2234
50904A066640j0734j0058r155p754o516n942n818n727n494n035m283l369k459
50891I84296j355L26K454M243N000M790M275M073M401N116N958O763P464P956
50877A045760Q120Q083Q266Q970J0111J1451J2897J4358J5676J6943J8594K0827
50865A200056K3263K5605K8259L1738L5790L9859M4181M9555N5998O2538O8626
50854A665468P4904Q2162R0162R7993J05071J11308J16707J21341J25373J28667
50844B719156J30478J29939J26686J20749J12260J01540Q9198P5639O0833M5076
50834C711554K9652J6141N101l955j1370j6656j9112j8648j5855j1601o755k025
$$ y = [1339493, 1301330, 1266559, 1234550, 1204919, 1177876, 1153587, 1131631, 1111576, 1093774, 1078874, 1066640, 1055906, 1045848, 1036693, 1028939, 1022423, 1016481, 1010663, 1004936, 999442, 994407, 990124, 986755, 984296, 982941, 983267, 985721, 989964, 994964, 999754, 1004029, 1008102, 1012503, 1017619, 1023577, 1030340, 1037804, 1045760, 1053880, 1061963, 1070229, 1079199, 1089310, 1100761, 1113658, 1128016, 1143692, 1160635, 1179229, 1200056, 1223319, 1248924, 1277183, 1308921, 1344711, 1384570, 1428751, 1478306, 1534304, 1596842, 1665468, 1740372, 1822534, 1912696, 2010689, 2115760, 2227068, 2343775, 2465116, 2590489, 2719156, 2849634, 2979573, 3106259, 3227008, 3339268, 3440808, 3530006, 3605645, 3666478, 3711554, 3741206, 3757347, 3762448, 3758493, 3747123, 3730467, 3711355, 3692707, 3676852, 3665251, 3658496, 3656471]
50822C656471K084N034O087M535j5p686j8369l1327m5097n8388p0980q3162r4494
50809C264693j03866j10739j15419j17881j17439j14000j08725j02664r5476q6428
50799B192056p5993o5435n5212m5012l5127k6529j9333j2453n285J261O018Q991
50787A867947J0815J1525J0802R016O997M937K389o55l502n797q063j0820j3768
50774A881823j6263j8284k0405k2961k5691k8203l0421l2457l4283l5685l6493
50763A580677l6623l5952l4250l1461k7931k4245k0794j7574j4392j1156p901
50752A318398m728j752R99L692O548R528J2378J5031J7808K1081K4994K9585L4871
50739A488433M0622M6305N1572N6586O1646O6642P1107P4586P6728P7267P6321
$$ y = [3656471, 3658555, 3663589, 3669676, 3674211, 3674196, 3666510, 3648141, 3616814, 3571717, 3513329, 3442349, 3359187, 3264693, 3160827, 3050088, 2934669, 2816788, 2699349, 2585349, 2476624, 2373960, 2278484, 2192056, 2116063, 2050628, 1995416, 1950404, 1915277, 1888748, 1869415, 1856962, 1851677, 1852938, 1858956, 1867947, 1878762, 1890287, 1901089, 1910105, 1917102, 1922039, 1924428, 1923773, 1920271, 1914474, 1906411, 1895591, 1881823, 1865560, 1847276, 1826871, 1803910, 1778219, 1750016, 1719595, 1687138, 1652855, 1617170, 1580677, 1544054, 1508102, 1473852, 1442391, 1414460, 1390215, 1369421, 1351847, 1337455, 1326299, 1318398, 1313670, 1311918, 1312917, 1316609, 1323157, 1332685, 1345063, 1360094, 1377902, 1398983, 1423977, 1453562, 1488433, 1529055, 1575360, 1626932, 1683518, 1745164, 1811806, 1882913, 1957499, 2034227, 2111494, 2187815]
50728B187815P4455P2114O9164O5258O0305N4142M6200L6265K5265J4536M431
50717B709950n443j4712k2031k6662k9223l0365k9647k6398k1112j5160r607m842
50705B474748r96J935M032M812L035k091r750j8248k6747l5432m4163n1906n7741
50692B241488o1519o3279o2715n9786n5208m9749m3449l6144k8396k1158j4505
50681A745580p475O94R628J8445K6793L4843M2488M9202N4760N9495O3550O6162
50669B164165O6130O3035N7714N1569M5542L9702L3611K7025K0301J4138Q932
50658B591864M560P95k511n753r620j4283j8919k2597k5277k7321k8324k7382
50646B415232k4474k0611j6490j1863o527r70M331R437J4242J8093K0647K2361
$$ y = [2187815, 2262270, 2334384, 2403548, 2468806, 2529111, 2583253, 2629453, 2665718, 2690983, 2705519, 2709950, 2704507, 2689795, 2667764, 2641102, 2611879, 2581514, 2551867, 2525469, 2504357, 2489197, 2479590, 2474748, 2473752, 2475687, 2479719, 2484531, 2487566, 2485475, 2475725, 2457477, 2430730, 2395298, 2351135, 2299229, 2241488, 2179969, 2116690, 2053975, 1994189, 1938981, 1889232, 1845783, 1809639, 1781243, 1760085, 1745580, 1738105, 1738799, 1748427, 1766872, 1793665, 1828508, 1870996, 1920198, 1974958, 2034453, 2098003, 2164165, 2230295, 2293330, 2351044, 2402613, 2448155, 2487857, 2521468, 2548493, 2568794, 2582932, 2591864, 2596424, 2597219, 2594708, 2588955, 2579335, 2565052, 2546133, 2523536, 2498259, 2470938, 2442614, 2415232, 2390758, 2370147, 2353657, 2341794, 2335267, 2334297, 2338628, 2348065, 2362307, 2380400, 2401047, 2423408]
50634B423408K3441K3241K1529J9612J9070J9843K0490J9951J7927J3927P201
50623B629640k284j3618k5592l6688m4774m8151m7093m3409l8304l1768k4169
50612B273790j7078j1843q224n187k363j51R50M20k239o919j2696j8721k4921
50599B164818l1381l7590m2840m6986n0172n2151n2553n1575m9844m7671m5001
50588A657054m1870l8400l4492l0095k5813k2676k1042k0140j8899j7109j5442
50577A371076j4454j3761j2423j0053p240m745k593k69K479N541Q922J2667J6360
50564A351507J9453K2158K5314K9086L2628L5426L8207M1841M5913M9172N1008
50553A741713N1759N1805N1118M9657M7551M4886M1773L8636L5996L3910L2029
$$ y = [2423408, 2446849, 2470090, 2491619, 2511231, 2530301, 2550144, 2570634, 2590585, 2608512, 2622439, 2629640, 2627356, 2613738, 2588146, 2551458, 2506684, 2458533, 2411440, 2368031, 2329727, 2297959, 2273790, 2256712, 2244869, 2236645, 2231458, 2229095, 2228944, 2229894, 2230314, 2228075, 2221156, 2208460, 2189739, 2164818, 2133437, 2095847, 2053007, 2006021, 1955849, 1903698, 1851145, 1799570, 1749726, 1702055, 1657054, 1615184, 1576784, 1542292, 1512197, 1486384, 1463708, 1442666, 1422526, 1403627, 1386518, 1371076, 1356622, 1342861, 1330438, 1320385, 1313145, 1308400, 1305807, 1305538, 1308017, 1313558, 1322480, 1335147, 1351507, 1370960, 1393118, 1418432, 1447518, 1480146, 1515572, 1553779, 1595620, 1641533, 1690705, 1741713, 1793472, 1845277, 1896395, 1946052, 1993603, 2038489, 2080262, 2118898, 2154894, 2188804, 2220833]
50542B220833L0236K8943K8759L0085L2755L5827L7979L8653L8727L9670M2084
50531B604551M5484M9308N3507N8066O2560O6495O9713P2218P3743P3756P1828
50520C301229O7884O2138N4795M5763L4777K1871P598p282k2174l6581m9908o1613
50508C418497p1428p9186q4642q7596q8027q5886q1039p3718o4692n4554m3182
50497B604547l0395j6981m409O410J5562K3325K9526L3706L5348L3770K8332J9064
50485B777805O725p843k4039m0927n6878p0346q0819q8686r4232r7149r7059r4215
50473B032337q9543q4001p8076p1929o5801o0016n4542m8972m3168l7613l2774
50462A365902k8376k3759j8817j4085j0008o614l915k079j038m17o0j55o48r73
$$ y = [2220833, 2251069, 2280012, 2308771, 2338856, 2371611, 2407438, 2445417, 2484070, 2522797, 2562467, 2604551, 2650035, 2699343, 2752850, 2810916, 2873476, 2939971, 3009684, 3081902, 3155645, 3229401, 3301229, 3369113, 3431251, 3486046, 3531809, 3566586, 3588457, 3596055, 3588773, 3566599, 3530018, 3480110, 3418497, 3347069, 3267883, 3183241, 3095645, 3007618, 2921732, 2840693, 2766975, 2702283, 2647729, 2604547, 2574152, 2557171, 2552762, 2559172, 2574734, 2598059, 2627585, 2661291, 2696639, 2730409, 2758741, 2777805, 2784530, 2776687, 2752648, 2711721, 2654843, 2584497, 2503678, 2414992, 2320760, 2223611, 2126552, 2032337, 1942794, 1858793, 1780717, 1708788, 1642987, 1582971, 1528429, 1479457, 1436289, 1398676, 1365902, 1337526, 1313767, 1294950, 1280865, 1270857, 1264243, 1260328, 1258249, 1257211, 1256794, 1256734, 1256579, 1255931, 1254958]
50448A254958p02n9N56J247K357L793N080O025O890P843Q688R296R967J1049J2386
50433A339374J3486J4245J5226J6968J9254K1299K2613K3308K3555K3254K2493
50422A555075K1921K2129K2927K3644K4164K5036K6614K8623L0726L3036L5675
50411A849570L8239M0097M1084M1442M1239M0166L8050L5185L2023K8589K4422
50400B250106J9087J2550N022l343j2377k1556l0166l7865m4804n1044n6167n9600
50388A969843o1057o0385n7467n2675m6993m1153l4911k7759k0090j2816o095
50377A548442O89P552J3452J7510J9816K0553J9171J5118Q882J554o231j4264
50365A652244k1984k8553l3647l7567m0510m2279m2726m2114m0858l9303l7678
$$ y = [1254958, 1254256, 1254197, 1254753, 1256000, 1258357, 1262150, 1267230, 1273255, 1280145, 1287988, 1296676, 1305972, 1315939, 1326988, 1339374, 1352860, 1367105, 1382331, 1399299, 1418553, 1439852, 1462465, 1485773, 1509328, 1532582, 1555075, 1576996, 1599125, 1622052, 1645696, 1669860, 1694896, 1721510, 1750133, 1780859, 1813895, 1849570, 1887809, 1927906, 1968990, 2010432, 2051671, 2091837, 2129887, 2165072, 2197095, 2225684, 2250106, 2269193, 2281743, 2286765, 2283422, 2271045, 2249489, 2219323, 2181458, 2136654, 2085610, 2029443, 1969843, 1908786, 1848401, 1790934, 1738259, 1691266, 1650113, 1615202, 1587443, 1567353, 1554537, 1548442, 1549131, 1556683, 1570135, 1587645, 1607461, 1628014, 1647185, 1662303, 1671185, 1672739, 1666508, 1652244, 1630260, 1601707, 1568060, 1530493, 1489983, 1447704, 1404978, 1362864, 1322006, 1282703, 1245025]
50354A245025l6024l4145l1908k9537k7289k4941k2019j8550j5127j2182r483
50343I83820o579l333J62L873P728J1445J4587J6764J7592J6639J3697R100L567
50330A089062k221p746j2397j5370j6104j4812j2368r644p042m636k517p84O75
50317I84096K104L596N007O212P183P921Q478R059R783J0359J0340R809R409R478
50303A092834R518Q836P405N689L890J855l26k135l147l512l773m452n697p155
50289A099830q198q501q397q344q252p605o211m318k039Q05M076P142R619J1843
50275A071450J4224J6444J7832J8203J7852J6919J5388J3616J2277J1595J1208
50264A237008J0881J0898J1406J1923J1883J1364J0860J0525J0049R216Q239P684
$$ y = [1245025, 1209001, 1174856, 1142948, 1113411, 1086122, 1061181, 1039162, 1020612, 1005485, 993303, 983820, 977241, 973908, 974070, 977943, 985671, 997116, 1011703, 1028467, 1046059, 1062698, 1076395, 1085495, 1089062, 1086841, 1079095, 1066698, 1051328, 1035224, 1020412, 1008044, 998400, 991358, 986722, 984205, 983421, 984096, 986200, 989796, 994803, 1001015, 1008198, 1016119, 1024597, 1033656, 1043439, 1053798, 1064138, 1073947, 1083356, 1092834, 1102352, 1111188, 1118593, 1124282, 1128172, 1130027, 1129701, 1127566, 1124419, 1120907, 1117134, 1112682, 1106985, 1099830, 1091632, 1083131, 1074734, 1066390, 1058138, 1050533, 1044322, 1040004, 1037965, 1038770, 1042846, 1049988, 1059607, 1071450, 1085674, 1102118, 1119950, 1138153, 1156005, 1172924, 1188312, 1201928, 1214205, 1225800, 1237008, 1247889, 1258787, 1270193, 1282116, 1293999, 1305363, 1316223, 1326748, 1336797, 1346013, 1354252, 1361936]
50252A361936Q245J0379J3781J7453K0766K4258K8865L4481L9973M4597M8539
50241A653273N1840N3655N3254N1220M8904M6981M5210M3318M1411L9438L6823
50230B165327L2813K6843J8544P896m514j7606l0236m1399n0206n6129n9224n9705
50218A932404n7550n3002m7326m2290l8684l6079l4288l4298l7066m1796m6204
50207A463821m8463m8404m6877m4497m1331l7488l3573l0281k7723k5313k2510
50196A057361j9460j6734j4650j3155j2153j1514j0836r743q420p340o401m934
50184I22021k771o89N94J363K325L497M197M019L349K919L146L826M388M555M759
50169I61498N556O605O769N532L794K881L204M313N792P423Q819R679J0256J1014
$$ y = [1361936, 1370181, 1380560, 1394341, 1411794, 1432560, 1456818, 1485683, 1520164, 1560137, 1604734, 1653273, 1705113, 1758768, 1812022, 1863242, 1912146, 1959127, 2004337, 2047655, 2089066, 2128504, 2165327, 2198140, 2224983, 2243527, 2251423, 2246909, 2229303, 2199067, 2157668, 2107462, 2051333, 1992109, 1932404, 1874854, 1821852, 1774526, 1732236, 1693552, 1657473, 1623185, 1588887, 1551821, 1510025, 1463821, 1415358, 1366954, 1320077, 1275580, 1234249, 1196761, 1163188, 1132907, 1105184, 1079871, 1057361, 1037901, 1021167, 1006517, 993362, 981209, 969695, 958859, 949116, 940696, 933356, 926955, 922021, 919250, 918561, 919155, 920518, 922843, 926340, 930537, 934556, 937905, 940824, 943970, 947796, 952184, 956739, 961498, 967054, 973659, 980428, 985960, 989754, 992635, 995839, 1000152, 1005944, 1013367, 1022186, 1031865, 1042121, 1053135]
50155A053135J1826J2021J1236R761Q136O768N855N213M377L260K574L029M375
50142A141566N867P486J0016J3857J8613K3851K9535L5479M1200M6652N2454N8981
50130A485557O5772P2265P8637Q5335R2162R8229J02640J04897J04950J03197
50120B393641J00314R6878R3295R0090Q7589Q5050Q0620P2690O0944M5725K7052
50109C233888N050j9032m3116o5633q5825j02819j15330j22707j25610j25207
50099B433659j22088j16394j08631r9861r1093q2862p5347o8637o2782n7777n3543
50088A494644m9945m6761m3707m0515l7015l3261k9493k5927k2558j9258j6020
50077A130184j2946j0066p402n192l827l385l381l152k356j080L65J566K162K202
$$ y = [1053135, 1064961, 1076982, 1088218, 1097979, 1106115, 1112883, 1118738, 1123951, 1128328, 1131588, 1134162, 1137191, 1141566, 1147433, 1154919, 1164935, 1178792, 1197405, 1221256, 1250791, 1286270, 1327470, 1374122, 1426576, 1485557, 1551329, 1623594, 1702231, 1787566, 1879728, 1977957, 2080597, 2185494, 2290444, 2393641, 2493955, 2590833, 2684128, 2774218, 2861807, 2946857, 3027477, 3100167, 3161111, 3206836, 3233888, 3238938, 3219906, 3176790, 3111157, 3025332, 2922513, 2807183, 2684476, 2558866, 2433659, 2311571, 2195177, 2086546, 1986685, 1895592, 1812730, 1737383, 1668746, 1605964, 1548187, 1494644, 1444699, 1397938, 1354231, 1313716, 1276701, 1243440, 1213947, 1188020, 1165462, 1146204, 1130184, 1117238, 1107172, 1099770, 1094578, 1090751, 1087366, 1083985, 1080833, 1078477, 1077397, 1077762, 1079328, 1081490, 1083692]
50063A083692K217K705L538M143M218L993L781L643L520L324K781J575l9j143
50049A121948j054j21P16J032J168J556K295L307M427N276N515N349N446O196
50035A163056P420Q815J0265J1523J2151J2113J2090J2764J4009J5100J5487J5176
50023A309969J4595J4337J4754J5475J5678J5166J4897J6081J8908K2630K6537
50012A499027L0429L4319L8187M1972M5486M8471N1072N3832N6718N8446N7609
50001B015568N4342N0183M6332M2758L9003L5016L0846K6127K0218J2463K160
49990B375016j1076k6608m2878n8425p2415q4035r2124r5912r5775r2772q7687
49979A615309q0859p2688o3930n5550m8295m2208l6614l0976k5770k1861j9027
$$ y = [1083692, 1085909, 1088614, 1092152, 1096295, 1100513, 1104506, 1108287, 1111930, 1115450, 1118774, 1121555, 1123130, 1123091, 1121948, 1120894, 1120773, 1121489, 1122521, 1123689, 1125245, 1127540, 1130847, 1135274, 1140550, 1146065, 1151414, 1156860, 1163056, 1170476, 1179291, 1189556, 1201079, 1213230, 1225343, 1237433, 1250197, 1264206, 1279306, 1294793, 1309969, 1324564, 1338901, 1353655, 1369130, 1384808, 1399974, 1414871, 1430952, 1449860, 1472490, 1499027, 1529456, 1563775, 1601962, 1643934, 1689420, 1737891, 1788963, 1842795, 1899513, 1957959, 2015568, 2069910, 2120093, 2166425, 2209183, 2248186, 2283202, 2314048, 2340175, 2360393, 2372856, 2375016, 2363940, 2337332, 2294454, 2236029, 2163614, 2079579, 1987455, 1891543, 1795768, 1702996, 1615309, 1534450, 1461762, 1397832, 1342282, 1293987, 1251779, 1215165, 1184189, 1158419, 1136558, 1117531]
49968A117531j5901j1760p542m567k857j444K07J759K680K723J983R05o7j186
49954A082464l219o093q486r511j0122j1730j4025j5465j5648j5741j6365j6552
49942I39507j5328j3212j1454j0596j0419j0612j0811j0550r803r127q746q022
49930H10827o417m484l188k635k138j250m7J358K833L948M457M928O065P479P986
49915H29722P312O633P012Q053Q696Q698Q606Q585Q145O998N516M151K899J584
49901I22610K09j282l286o153r589j2773j5059j6308j6579j5840j4209j2162j0251
49888G89328q643p153n694m489l860l949m659n674o470o558n857m774l811l089
$$ y = [1117531, 1101630, 1089870, 1082328, 1077761, 1074904, 1073460, 1073667, 1075426, 1078106, 1080829, 1082812, 1083717, 1083650, 1082464, 1079245, 1073152, 1064666, 1055155, 1045033, 1033303, 1019278, 1003813, 988165, 972424, 956059, 939507, 924179, 910967, 899513, 888917, 878498, 867886, 857075, 846525, 836722, 827595, 818849, 810827, 804410, 799926, 796738, 794103, 791965, 790715, 790668, 792026, 794859, 798807, 803264, 808192, 814257, 821736, 829722, 837034, 843667, 850679, 858732, 867428, 876126, 884732, 893317, 901462, 908460, 913976, 918127, 921026, 922610, 922819, 921537, 918251, 912098, 902509, 889736, 874677, 858369, 841790, 825950, 811741, 799579, 789328, 780685, 773532, 767838, 763349, 759489, 755540, 750881, 745207, 738737, 732179, 726322, 721548, 717737, 714648]
$$ [...]
##END NTUPLES=NMR SPECTRUM
##END=
