##TITLE=AC1713_3097_8749698_3jzR5BpbZs
##JCAMPDX= 6.0         $$ Bruker NMR JCAMP-DX V2.0
##DATA TYPE= NMR SPECTRUM
##DATA CLASS= NTUPLES
##ORIGIN= BRUKER
##OWNER= Administrator
$$ 1.72 TOPSPIN		Version 2.1
$$ 2015-08-12 09:55:17.039 -0700  Administrator@X
$$ Compression mode = diff/dup
##.OBSERVE FREQUENCY= 400.02188249412
##.OBSERVE NUCLEUS= ^1H
##.ACQUISITION MODE= SIMULTANEOUS (DQD)
##.ACQUISITION SCHEME= undefined
##.AVERAGES= 64
##.DIGITISER RES= 22
##SPECTROMETER/DATA SYSTEM= spect
##.PULSE SEQUENCE= noesygpps1d.comp
##.SOLVENT NAME= COFFEE_meoh
##.SHIFT REFERENCE= INTERNAL, COFFEE_meoh, 1, 14.96117
##AUDIT TRAIL= $$ (NUMBER, WHEN, WHO, WHERE, PROCESS, VERSION, WHAT)
$$ ##TITLE= Audit trail, TOPSPIN		Version 2.1
$$ ##JCAMPDX= 5.01
$$ ##ORIGIN= Bruker BioSpin GmbH
$$ ##OWNER= Administrator
$$ $$ E:\/data/COFFEE/nmr/AC1713_3097_8749698_3jzR5BpbZs/62/pdata/1/auditp.txt
$$ ##AUDIT TRAIL=  $$ (NUMBER, WHEN, WHO, WHERE, PROCESS, VERSION, WHAT)
(   1,<2015-08-08 00:54:03.813 -0700>,<Administrator>,<X>,<go>,<TOPSPIN 2.1>,
      <created by zg
	started at 2015-08-08 00:42:32.922 -0700,
	POWCHK enabled, PULCHK disabled,
       configuration hash MD5:
       21 0F 79 D6 B3 7B B4 F6 88 20 88 DB 03 48 BD 9F
       data hash MD5: 64K
       50 26 32 39 90 09 93 44 9E 36 71 86 41 CE BA 52>)
(   2,<2015-08-08 00:54:10.563 -0700>,<Administrator>,<X>,<audit>,<TOPSPIN 2.1>,
      <user comment:
       ICON-NMR User ID: COFFEE
       data hash MD5: 64K
       50 26 32 39 90 09 93 44 9E 36 71 86 41 CE BA 52>)
(   3,<2015-08-12 09:55:14.367 -0700>,<Administrator>,<X>,<proc1d>,<TOPSPIN 2.1>,
      <Start of raw data processing
       efp LB = 0.3 FT_mod = 6 PKNL = 1 PHC0 = 0 PHC1 = 0 SI = 128K 
       data hash MD5: 128K
       95 41 15 2D 52 AE 30 22 27 75 DA F4 53 04 FF 3B>)
(   4,<2015-08-12 09:55:15.289 -0700>,<Administrator>,<X>,<proc1d>,<TOPSPIN 2.1>,
      <pk PHC0 = -85.13855 PHC1 = 0 
       data hash MD5: 128K
       E1 38 D9 8E 65 8B 14 35 F2 E3 3E 87 59 CD D7 B1>)
(   5,<2015-08-12 09:55:16.117 -0700>,<Administrator>,<X>,<proc1d>,<TOPSPIN 2.1>,
      <abs ABSG = 1 
       data hash MD5: 128K
       C2 C4 64 24 98 D3 2B D5 7A 57 F5 25 1F 38 4D 82>)
(   6,<2015-08-12 09:55:16.351 -0700>,<Administrator>,<X>,<proc1d>,<TOPSPIN 2.1>,
      <abs ABSG = 2 
       data hash MD5: 128K
       1A 4B 14 AD 3B 1A 3B 08 45 E2 BD 2A D7 41 8F 4F>)
(   7,<2015-08-12 09:55:16.445 -0700>,<Administrator>,<X>,<proc1d>,<TOPSPIN 2.1>,
      <abs ABSG = 3 
       data hash MD5: 128K
       FB C2 40 6F 0A 15 A8 34 51 06 71 E3 89 3B 87 9E>)
(   8,<2015-08-12 09:55:16.554 -0700>,<Administrator>,<X>,<proc1d>,<TOPSPIN 2.1>,
      <abs ABSG = 4 
       data hash MD5: 128K
       B0 01 1F C1 10 89 02 21 C9 31 E9 F5 3C 91 83 98>)
(   9,<2015-08-12 09:55:16.742 -0700>,<Administrator>,<X>,<proc1d>,<TOPSPIN 2.1>,
      <abs ABSG = 5 
       data hash MD5: 128K
       48 83 A1 7E C7 1E D5 DD FC 37 C5 BB D4 59 AD A3>)
$$ ##END=
$$ 
$$ $$ hash MD5
$$ [...]
##$TP07= 0
##$TPNAME0= <>
##$TPNAME1= <>
##$TPNAME2= <>
##$TPNAME3= <>
##$TPNAME4= <>
##$TPNAME5= <>
##$TPNAME6= <>
##$TPNAME7= <>
##$TPOAL= (0..7)
0.5 0.5 0.5 0.5 0.5 0.5 0.5 0.5
##$TPOFFS= (0..7)
0 0 0 0 0 0 0 0
##$TUNHIN= 0
##$TUNHOUT= 0
##$TUNXOUT= 0
##$USERA1= <user>
##$USERA2= <user>
##$USERA3= <user>
##$USERA4= <user>
##$USERA5= <user>
##$V9= 5
##$VALIST= <valist>
##$VCLIST= <CCCCCCCCCCCCCCC>
##$VD= 0
##$VDLIST= <DDDDDDDDDDDDDDD>
##$VPLIST= <PPPPPPPPPPPPPPP>
##$VTLIST= <TTTTTTTTTTTTTTT>
##$WBST= 2048
##$WBSW= 25
##$XGAIN= (0..3)
0 0 0 0
##$XL= 0
##$YL= 0
##$YMAX_a= 7127582
##$YMIN_a= -13786678
##$ZGOPTNS= <>
##$ZL1= 120
##$ZL2= 120
##$ZL3= 120
##$ZL4= 120
##$ABSF1= 14.96117
##$ABSF2= -5.597012
##$ABSG= 5
##$ABSL= 3
##$ALPHA= 0
##$AQORDER= 0
##$ASSFAC= 0
##$ASSFACI= 0
##$ASSFACX= 0
##$ASSWID= 0
##$AUNMP= <proc_prof1d_extract.lims>
##$AXLEFT= 0
##$AXNAME= <>
##$AXNUC= <1H>
##$AXRIGHT= 0
##$AXTYPE= 0
##$AXUNIT= <>
##$AZFE= 0.1
##$AZFW= 0.1
##$BCFW= 0
##$BC_mod= 0
##$BYTORDP= 0
##$COROFFS= 0
##$CY= 15
##$DATMOD= 1
##$DC= 0
##$DFILT= <>
##$DTYPP= 0
##$F1P= 0
##$F2P= 0
##$FCOR= 0.5
##$FTSIZE= 131072
##$FT_mod= 6
##$GAMMA= 0
##$GB= 0
##$INTBC= 1
##$INTSCL= 1
##$ISEN= 128
##$LB= 0.3
##$LEV0= 0
##$LPBIN= 0
##$MAXI= 10000
##$MC2= 0
##$MEAN= 0
##$ME_mod= 0
##$MI= 0
##$NCOEF= 0
##$NC_proc= -2
##$NLEV= 6
##$NOISF1= 0
##$NOISF2= 0
##$NSP= 0
##$NTH_PI= 0
##$NZP= 0
##$OFFSET= 14.96117
##$PC= 1
##$PHC0= -85.13855
##$PHC1= 0
##$PH_mod= 1
##$PKNL= yes
##$PPARMOD= 0
##$PPDIAG= 0
##$PPIPTYP= 0
##$PPMPNUM= 2147483647
##$PPRESOL= 1
##$PSCAL= 4
##$PSIGN= 0
##$PYNMP= <proc.py>
##$REVERSE= no
##$SF= 400.020009570071
##$SI= 131072
##$SIGF1= 0
##$SIGF2= 0
##$SINO= 400
##$SIOLD= 131072
##$SPECTYP= <>
##$SREGLST= <1H.CDCl3>
##$SSB= 0
##$STSI= 131072
##$STSR= 0
##$SW_p= 8223.68421052631
##$SYMM= 0
##$S_DEV= 0
##$TDeff= 65536
##$TDoff= 0
##$TI= <>
##$TILT= no
##$TM1= 0
##$TM2= 0
##$TOPLEV= 0
##$USERP1= <user>
##$USERP2= <user>
##$USERP3= <user>
##$USERP4= <user>
##$USERP5= <user>
##$WDW= 1
##$XDIM= 131072
##$YMAX_p= 442605770
##$YMIN_p= -11600
##$CURPLOT= <Network HP LaserJet P1505>
##$CURPRIN= <$Network HP LaserJet P1505>
##$DFORMAT= <normdp>
##$LAYOUT= <+/1D_H.xwp>
##$LFORMAT= <normlp>
##$PFORMAT= <normpl>
##$SURQMSG= 1
$$ End of Bruker specific parameters
$$ ---------------------------------
##NTUPLES= NMR SPECTRUM
##VAR_NAME=  FREQUENCY,     SPECTRUM/REAL,   SPECTRUM/IMAG
##SYMBOL=    X,             R,               I
##VAR_TYPE=  INDEPENDENT,   DEPENDENT,       DEPENDENT
##VAR_FORM=  AFFN,          ASDF,            ASDF
##VAR_DIM=   131072,        131072,          131072
##UNITS=     HZ,            ARBITRARY UNITS, ARBITRARY UNITS
##FACTOR=    0.0627417313425164, 1,          1
##FIRST=     8223.62146879497, 2986,         -62323
##LAST=      0,             5249,            -62122
##MIN=       0,             -11600,          0
##MAX=       8223.62146879497, 442605770,    0
$$ Real data points
##PAGE= N=1
##DATA TABLE= (X++(R..R)), XYDATA
$$ [...]
64960 193500 193042 191958 190524 188908 186909 184654 182883 182137 182118 182243 182412 182857 183554 184203 184660 185044 185478
64943 185478 185874 186032 185914 185866 186349 187301 187927 187500 186209 184909 184222 184221 184742 185447 185737 185252 184450 184128 184365
64924 184365 184513 184287 184179 184683 185662 186673 187444 187915 188309 189274 191422 194509 197590 200187 202841 206384
64908 206384 211097 216788 223183 229975 236915 244079 251701 259573 267003 273508 279180 284200 288389 291371
64894 291371 292782 292201 289312 284341 277993 270856 263240 255568 248357 241752 235693 230622 227310 225705
64880 225705 224661 223254 221825 221286 221934 223432 225419 227520 229049 229346 228378 226625 224474 222010 219245
64865 219245 216278 213277 210422 207760 205130 202461 200077 198277 196662 194453 191645 189272 188211 188228 188523
64850 188523 188715 188895 189140 189413 189698 189916 189941 189846 189828 189746 189234 188396 187768 187382 186668 185701 185726 187635 190558 192895
64830 192895 194373 196158 199143 203044 207193 211403 215834 220597 225701 231003 236153 240893 245343 249586
64816 249586 253135 255329 256221 256487 256362 255231 252429 248047 242827 237627 233181 229938 227811 226250 224745
64801 224745 223148 221493 219804 218210 217004 216373 216190 216195 216264 216429 216761 217335 218205 219303 220421 221339 222019
64784 222019 222716 223938 226157 229364 232961 236274 239219 242398 246579 252180 259178 267211 275623 283544
64770 283544 290221 295543 300272 305591 312145 319465 326485 332661 338361 344083 349508 353578 355306 354260
64756 354260 350357 343630 334368 323323 311602 300321 290256 281597 273979 266881 260165 254197 249415
64743 249415 245848 243230 241518 241076 242161 244366 246812 248876 250530 252023 253584 255594 258650 263068
64729 263068 268427 273889 278900 283357 287299 290790 294018 297098 299722 301365 301830 301245 299489 296035 290554
64714 290554 283396 275281 266800 258406 250684 244301 239617 236367 233734 230893 227755 225119 223767 223446
64700 223446 223089 222101 221016 220725 221448 222751 224254 225947 227965 230391 233271 236605 240357 244683 250049
64685 250049 256853 264783 272678 279242 283975 287294 289623 290507 288980 284836 279152 273272 267641 262036
64671 262036 256602 252046 248842 246837 245750 245543 246097 246981 247820 248640 249617 250766 251999 253244 254325 254966
64655 254966 255152 255349 256215 258176 261370 265827 271575 278644 286957 296157 305580 314535 322549 329222 334075
64640 334075 336845 337857 337844 337482 337292 337596 338111 337764 335542 331481 326340 320431 313454 305432 297062 289001
64624 289001 281481 274862 269768 266287 263558 260647 257435 254307 251397 248590 245968 243822 242337 241461
64610 241461 240917 240285 239396 238725 239005 240316 242026 243746 245835 248751 252464 256875 262333 269247 277531
64595 277531 286775 296705 307139 317828 328638 339587 350417 360447 369118 376353 382103 385918 387293
64582 387293 386170 382806 377513 370808 363483 356119 348776 341384 334111 327112 320288 313605 307270 301317
64568 301317 295424 289453 283701 278254 272661 266763 261396 257597 255366 253801 252225 250647 249295 248326
64554 248326 247962 248351 249233 250106 250805 251648 253022 255011 257414 259951 262408 264541 265782 265341 263035 259897
64538 259897 257313 255523 253656 251314 249223 247960 246979 245575 244129 243593 244152 245134 245859 246015 245549 244870
64522 244870 244830 245935 247838 250051 252665 255828 259103 262160 265584 270168 275699 281348 286845 292296 297129
64507 297129 300322 301716 302097 301986 301242 299939 298646 297547 296161 294241 292249 290601 289132 287659 286580
64492 286580 286560 287981 290824 294632 298413 301097 302352 302613 302281 301320 299682 297539 294937 291739 288108
64477 288108 284574 281520 279114 277833 278391 280775 283971 287074 290244 294092 298510 302619 305610 307109
64463 307109 306920 305009 301887 298505 295540 292910 290180 287331 284966 283763 283861 284826 286094 287352 288678
64448 288678 290516 293423 297532 302315 307188 312307 318316 325322 332791 340626 349648 360538 372885 385929
64434 385929 399735 414933 431650 449582 469048 491207 517175 547592 583170 625128 674922
64423 674922 733996 803911 886479 983747 1097987 1230895 1381284 1542706 1704088 1854330
64413 1854330 1987782 2106149 2215155 2318559 2414284 2495377 2554005 2584355 2583147 2550203 2490207
64402 2490207 2412458 2325908 2232997 2128849 2006995 1865760 1709897 1547884 1388583 1239198
64392 1239198 1104353 986034 884310 798232 726298 666592 617072 575930 541801 513700 490738
64381 490738 471806 455700 441592 429075 417589 406235 394580 383253 373113 363987 354782 344741
64369 344741 334088 323557 313831 305439 298619 293239 289195 286741 286017 286469 287326 288439 289983 291512
64355 291512 292142 291669 290642 289160 286447 281983 276466 271232 267167 264405 262613 261179 259468 257281 254934
64340 254934 252824 251113 249880 249286 249501 250704 253008 256096 259169 261777 264568 268618 274142 280437 286961
64325 286961 293648 300122 305498 309334 312082 314146 315047 313960 310706 305861 300193 294294 288450 282515
64311 282515 276100 269122 262103 255868 251033 247651 245118 242542 239537 236554 234148 232218 230431 229079
64297 229079 228792 229559 230770 232187 234045 236156 237763 238563 239218 240549 242820 245993 250098 254982 260180
64282 260180 265348 270435 275311 279663 283374 286539 288968 290190 290069 288932 287093 284767 282518 281100
64268 281100 280694 280907 281570 282805 284137 284305 282396 278614 273756 268564 263793 260169 257752 255777 253470
64253 253470 250663 247537 244380 241770 240329 239995 240096 240313 240924 241917 242627 242638 242348 242323 242636 243116 243572 243515
64235 243515 242439 240728 239467 238981 238459 237469 236849 237312 238067 237781 236375 234899 234052 233659 233302 232688 231605
64218 231605 230165 228906 228136 227410 226175 224617 223365 222641 222322 222529 223522 225092 226667 228040 229633 232078
64202 232078 235714 240379 245547 250915 256944 264434 273406 282851 291774 299921 307213 313118 317058 318993
64188 318993 319091 317247 313416 308151 302346 296657 291380 286515 281696 276514 271241 266813 263775 261678 259776
64173 259776 257780 255628 253120 250240 247434 245174 243617 242843 242847 243080 242745 241914 241651 242673 244576 246735
64157 246735 249066 251441 253284 254389 255295 256192 256314 255171 253505 252132 250775 249057 247826 248205 249839
64142 249839 251272 251743 251551 251073 250607 250843 252344 254599 256594 258193 260094 262635 265560 268738 272120
64127 272120 275149 277247 278926 281467 285463 290464 295991 301989 308188 313927 318785 322785 325896 327940
64113 327940 329053 329688 330157 330633 331409 332658 334195 336039 338801 342760 346872 349588 350486 350322 349687 348520
64097 348520 346797 344707 342187 339123 336027 333701 332242 331153 330337 330194 330779 331680 332652 333540 333711 332518
64081 332518 330321 328161 326431 324833 323500 323021 323180 322882 321684 320418 319876 319818 319695 319462 319167 318571 317794
64064 317794 317626 318560 319993 321055 321807 323071 325318 328261 331508 335282 340421 347665 356875 367098 377561
64049 377561 388248 399276 410126 420102 429112 437268 443986 448426 450712 451837 452370 452130 451116 449795
64035 449795 448294 446233 443648 441302 439788 438979 438499 437979 436663 433649 428888 423322 417720 412029 406072
64020 406072 400156 394633 389494 384684 380250 375957 371395 366723 362669 359573 357104 355084 353855 353547
64006 353547 353756 354238 355183 356510 357720 358798 360439 362911 365562 367933 370550 373905 377527 380871 384445
63991 384445 389054 394368 399310 403706 408579 414646 421242 427092 431836 436519 442630 450744 460173 469986
63977 469986 480118 491152 503346 516454 530344 544963 559704 573730 587243 601618 617855
63966 617855 635649 654397 674296 695856 719127 744280 772383 804708 841621 883046 929842
63955 929842 983815 1046399 1118174 1199922 1293511 1401220 1524415 1663201 1817358 1987240
63945 1987240 2173397 2375237 2590464 2816199 3050343 3291155 3535521 3778303 4013466
63936 4013466 4235180 4437685 4615154 4762658 4877192 4957415 5002690 5012637 4987163 4926378
63926 4926378 4830693 4701429 4541342 4354525 4146134 3922190 3688860 3451232 3212952 2977265
63916 2977265 2747898 2528467 2321404 2128121 1950049 1788900 1645814 1520632 1412072
63907 1412072 1318369 1237757 1168647 1109642 1059513 1017260 982070 953058 929145 909444 893625
63896 893625 881542 872566 865670 860057 855164 850098 843742 835678 826560 817448 809227 802722 798696 797372
63882 797372 798414 801739 808002 818027 832115 850114 871828 897187 926444 960334 999607 1044195
63870 1044195 1093220 1145930 1202272 1262516 1326879 1395551 1468403 1544446 1622097 1700054 1777285
63859 1777285 1852237 1923038 1988796 2049693 2105310 2153755 2193083 2222709 2242647 2252173 2250233 2236791
63847 2236791 2212828 2179252 2136484 2084899 2024944 1957091 1882339 1802688 1720511 1637520 1554663
63836 1554663 1472688 1392220 1313587 1237242 1164313 1096210 1033668 976519 924234 876278 832099
63825 832099 791284 753707 719281 687689 658653 632266 608716 587818 569103 552235 537049
63814 537049 523317 510765 499169 488239 477515 466596 455421 444310 433887 424788 417054 409863
63802 409863 402375 394792 387995 382136 376424 370474 364963 360515 356772 353116 349553 346199 342536 338027
63788 338027 333076 328625 325082 322205 319770 317775 316223 315187 314795 314744 314222 312821 311111 309828 308844
63773 308844 307504 305637 303642 301899 300584 299769 299259 298665 298087 298252 299440 300811 301402 301288 301063 300684
63757 300684 299737 298529 297918 298180 298878 299834 301383 303570 305774 307309 307954 307895 307596 307808 309229 311977 315511
63740 315511 319013 321752 323440 324538 325945 328104 330692 333330 336139 339281 342571 346056 350450 356397
63726 356397 363678 371601 379679 387395 393944 398912 402804 406146 408543 409316 408620 407137 405091 402356 399090
63711 399090 395408 390865 385275 379651 375286 372173 369453 367219 366561 367779 369727 371268 372416 373746
63697 373746 375510 377669 380082 382370 384161 385609 387112 388496 389133 388934 388461 387990 387255 386259 385527 385330
63681 385330 385400 385735 386947 389431 392759 396289 399872 403596 407333 410951 414642 418652 422922 427172 431074
63666 431074 434157 435852 435854 434251 431184 426622 420613 413597 406332 399568 393734 388762 384257 379964 375984
63651 375984 372500 369581 367336 365916 365138 364539 364036 364063 364750 365548 366126 366996 368683 370823 372857 375060
63635 375060 378133 382193 386982 392546 398803 405022 410864 417589 426912 438786 451566 464342 477793
63622 477793 492566 508147 523897 540152 557633 576472 596328 616949 638284 660480 683880
63611 683880 708362 732431 753547 769623 779891 784534 784324 780694 775315 769193 762630 755999 749806
63598 749806 743931 737639 730557 722889 714444 704238 691434 676158 659186 641433 623855 607196
63586 607196 591564 576750 563005 550943 540736 532178 525504 521260 519246 518515 518580 519761 522150 525178
63572 525178 528460 532163 536252 540300 544392 549234 554995 560965 566864 573579 582059 592388 604512 619000
63558 619000 636373 656464 679142 705058 735154 770219 811371 859511 912544 963386 1002269
63547 1002269 1021983 1021400 1004851 979004 949875 921484 896214 875690 860682 850360 842772 836621
63535 836621 832030 829129 826659 822599 815596 805142 790935 773004 752254 730168 707942 686166
63523 686166 665025 644384 624009 604092 585286 567954 551818 536680 522931 510918 500283
63512 500283 490460 481460 473642 467128 461817 457546 453719 449342 444011 438540 434060 430810 428243 425891
63498 425891 423610 421418 419664 418956 419368 420085 420385 420525 421131 422197 423467 425321 428408 432610 437198 441913
63482 441913 447116 452949 459072 465185 471130 476426 480379 482783 483985 484168 483073 480561 476957 472648
63468 472648 467726 462196 456262 450189 444101 438102 432527 427986 425108 424164 424913 426887 429803 433582 438105
63453 438105 443327 449535 457018 465482 474364 483868 495088 508863 525118 543779 565880 593450 628668
63440 628668 673097 726405 784615 840055 884381 912422 923458 919739 904784 882784 858230 835150
63428 835150 816443 803712 797374 797102 802607 813942 830703 851121 872519 892714 910519 924893
63416 924893 934251 937241 934105 926886 918043 908958 899859 890946 883007 876612 871121 865000 856896 845985
63402 845985 831619 813411 791745 767571 741709 714919 688535 664110 642212 622316 604005
63391 604005 587465 572645 558972 546369 535745 527858 522378 518562 516150 515084 515025 515744 517467 520399
63377 520399 524454 529776 536722 544977 553669 562923 574206 588285 603890 619496 635592 653971 675421
63364 675421 699379 725281 752843 781183 808901 835061 859105 879911 895937 906333 911210 911032
63352 911032 906586 899387 891191 883085 875601 869286 864220 859276 852905 844523 834226 821469 805279
63339 805279 785785 764402 742372 720142 698337 678232 660923 646859 636400 630047 627929 630062
63327 630062 637453 651756 672659 695639 712843 716822 704469 678635 646105 613185 582602 554380
63315 554380 528721 506796 489036 474261 461142 449537 439802 431647 424451 418168 413213 409725 407437
63302 407437 406012 405070 404101 402693 400845 398892 397227 396046 395159 394094 392651 391244 390397 390023 389596 388848
63286 388848 387837 386540 384956 383462 382453 381737 380921 380245 380267 380804 381039 380809 380886 381759 382950 383846 384453
63269 384453 384988 385397 385790 386752 388732 391434 394159 396467 398298 399848 401550 403842 406743 409894 413005
63254 413005 415908 418330 420272 422563 426232 431127 435932 439854 443642 448558 454958 462305 469993 477717
63240 477717 485525 493996 503988 515836 529150 543675 559823 577924 597416 617334 637254 657307
63228 657307 677520 697648 717476 736861 755626 773731 791393 808796 825877 842655 859548
63217 859548 877072 895362 914196 933216 951863 969272 984567 997127 1006322 1011170 1010603 1004182
63205 1004182 992461 976619 957685 935994 911416 884248 855837 828093 802446 779452 759267
63194 759267 742076 728053 717294 709805 705283 703011 702472 704061 708628 716233 725915 736900 749354
63181 749354 763580 779011 794691 810453 827011 844884 863662 882487 900953 919269 937630
63170 937630 955674 972787 988822 1004150 1018785 1031795 1041841 1048057 1050050 1047369 1039606 1026920
63158 1026920 1009972 989295 965207 938297 909562 879977 850299 821171 793048 766112 740713
63147 740713 717657 697464 679510 662693 646856 632761 620612 609589 599146 589903 582733 577598
63135 577598 573701 570272 566854 563403 560568 559350 559974 561436 562535 562970 563137 563352 563756 564577 565935 567587
63119 567587 569201 570652 571787 572283 572154 572088 572927 574926 577739 580833 583636 585608 586594 586934 586979 586681 585844
63102 585844 584511 582883 581138 579563 578555 578217 578164 577997 577732 577624 577868 578656 580264 582740 585726 588774
63086 588774 591705 594558 597411 600327 603231 605864 608201 610843 614478 618926 623333 627407 631816 637117
63072 637117 642997 649034 655595 663414 672662 682954 693989 705744 718258 731567 745695 760546
63060 760546 776186 793393 813408 836775 862952 891382 922340 956196 992484 1030441 1070061
63049 1070061 1111805 1155495 1200260 1245452 1290877 1336184 1380813 1424667 1468159 1511271 1553141
63038 1553141 1593003 1631276 1669312 1708158 1747746 1787149 1825324 1861543 1895342 1926240 1953428
63027 1953428 1975468 1990201 1995344 1989581 1973095 1946885 1911800 1868543 1818322 1762898 1704058 1643595
63015 1643595 1583712 1526648 1473642 1424827 1380406 1341359 1308645 1282275 1261660 1246575 1237355
63004 1237355 1234358 1237546 1246401 1260057 1277746 1299242 1324545 1353067 1383620 1415345 1448106 1481726
62992 1481726 1515443 1548597 1581371 1614342 1647650 1681021 1714194 1746729 1777534 1805034 1827787
62981 1827787 1844717 1855003 1857974 1853016 1839428 1816694 1785064 1745512 1699042 1646427 1588800 1527955
62969 1527955 1465695 1403311 1341878 1282525 1226051 1172739 1122893 1077015 1035101 996358 960073
62958 960073 926347 895539 867546 842124 819320 798956 780168 762123 744812 728574 713310
62947 713310 698813 685434 673602 662980 652848 643080 634093 626073 618878 612458 606655 600895 594831
62934 594831 589095 584668 581627 579215 576927 574745 572507 569995 567625 566143 565457 564615 563126 561507 560232
62919 560232 558943 557143 555077 553361 552106 550844 549124 546851 544228 541625 539436 537863 536901 536504 536632
62904 536632 537075 537420 537237 536251 534516 532551 531100 530498 530354 530065 529453 528677 527802 526858 526157 526164 527076 528827
62886 528827 531308 534218 536855 538514 539133 539266 539538 540333 541775 543567 545020 545689 545912 546333 546980 547210
62870 547210 546538 545140 543600 542515 542284 542897 543885 544711 545208 545488 545659 545849 546232 546749 547093 547302 548009 549668
62852 549668 551814 553645 554958 556036 556969 557800 559015 560971 562960 563709 562893 561402 560018 558582 556711
62837 556711 554584 552701 551457 551184 552086 553766 555348 556424 557456 558934 560611 561958 563061 564559 566854
62822 566854 569727 572690 575439 578024 580700 583596 586493 589029 591166 593242 595531 597906 600022 601727
62808 601727 603291 605304 608296 612235 616447 620283 623878 628072 633577 640411 648132 656451 665583 676138
62794 676138 688699 703425 720060 738342 758317 780246 804456 831340 861194 893866 928883
62783 928883 966199 1006573 1050954 1099737 1152881 1210377 1272176 1337891 1406940 1478738 1552290
62772 1552290 1625822 1697213 1764548 1825889 1878863 1921197 1951563 1969396 1974009 1964613 1941302 1905477
62760 1905477 1859139 1804169 1742367 1675714 1606230 1535620 1465058 1395228 1326761 1260819 1198897
62749 1198897 1141778 1088956 1039514 993285 950745 912168 877524 846877 820142 796559 775205
62738 775205 756023 739602 725919 714017 703119 693379 685269 678805 673666 669542 666112 663074 660530
62725 660530 658992 658781 659638 661078 662892 665230 668455 672956 678803 685583 692930 701234 711415 723974
62711 723974 738683 755315 774150 795493 819040 844070 870244 898156 929179 964696 1005226
62700 1005226 1050316 1099402 1152600 1210409 1272847 1339217 1408466 1479290 1550012 1618926 1684730
62689 1684730 1746157 1801126 1846817 1880790 1901746 1909274 1903379 1884472 1853476 1811763 1761091 1703482
62677 1703482 1640762 1574190 1504869 1434502 1365307 1299058 1236493 1177668 1122599 1071484 1024646
62666 1024646 982402 944860 911729 882328 855735 831061 807935 786782 768180 751827 736651
62655 736651 722124 708782 697074 686508 676590 667879 661142 655931 651033 646070 641703 638459 636275
62642 636275 634996 634332 633425 631514 629009 626894 624962 621784 616730 611068 606569 603790 602165 601126 600598
62627 600598 600740 601596 602828 603782 604105 604194 604627 605353 605964 606489 607231 608029 608544 609137 610597 613063 616074 619568
62609 619568 623893 628868 633971 639530 646641 655700 666091 677531 690609 705649 722197 740139 760334
62596 760334 783561 809637 838053 868647 901218 935320 970777 1007492 1044326 1079166 1110603
62585 1110603 1138562 1162792 1181793 1193936 1198630 1195729 1184882 1166441 1142073 1113462 1081250 1046141
62573 1046141 1010106 975122 941369 907955 875014 843798 814960 788073 762856 739773 719230
62562 719230 701047 684877 670487 657520 645587 634710 625251 617366 610869 605494 600867 596459 592056
62549 592056 588176 585562 584338 583979 583891 583641 582913 581752 580715 580369 580727 581453 582389 583561 584940 586593
62533 586593 588813 591739 595127 598831 603234 608831 615654 623474 632316 642347 653535 665788 679294
62520 679294 694507 712022 732624 756984 785030 816010 849490 885862 925588 968403 1013552
62509 1013552 1060228 1107296 1153055 1195856 1234699 1269008 1298316 1322641 1342621 1358786 1371075
62498 1371075 1379503 1384817 1388035 1389787 1390590 1391329 1393030 1396662 1403484 1414763 1430178 1446768 1460128
62485 1460128 1466724 1465263 1456868 1444365 1430193 1413706 1390917 1357856 1314103 1262749 1207767 1152195
62473 1152195 1097835 1045087 993183 941702 891859 845592 803778 766300 733399 705575 682263
62462 682263 661874 643432 627224 613688 602565 593308 585549 578962 573384 569151 566635 565433 564775
62449 564775 564659 565712 567866 570163 572055 573966 576291 578729 581033 583550 586407 588822 589873 589535 588431
62434 588431 586830 584453 581095 577019 572712 568469 564210 559660 554733 549649 544506 538949 532644 525999
62420 525999 520016 515361 511803 508604 505158 501372 497752 495097 493845 493665 493836 493891 493719 493358 493054 493283
62404 493283 494356 496128 498428 501509 505619 510339 514836 518685 522110 525637 529861 535234 541646 548465
62390 548465 555411 563027 571775 581063 589877 598013 605949 613757 621030 627720 634060 639701 643916 646871
62376 646871 649813 653629 657945 662031 666032 670900 677595 686730 698588 713092 729928 748976 770548
62363 770548 795195 823452 855695 891886 931440 973554 1017612 1062886 1107900 1150463 1188437
62352 1188437 1220360 1245524 1263951 1276318 1283676 1287145 1287814 1286357 1282319 1274182 1260724 1242117 1219366
62339 1219366 1193197 1164207 1133591 1102638 1071590 1039960 1008090 977434 949037 922545 897082
62328 897082 872465 849108 827169 806255 785762 765322 745099 725698 707593 690773 675203
62317 675203 661385 649898 640460 632102 624309 617446 611956 607657 604002 600681 597852 596073 595959 597542
62303 597542 600049 602702 605555 609099 613233 617282 620911 624341 627657 630594 633058 635253 637148 638385
62289 638385 638819 638608 637698 635813 633055 629940 626770 623561 620672 618817 618186 618197 618444 619377 621694 625426
62273 625426 629999 634987 640647 647910 657840 670830 686356 703918 724044 747850 775675 806825
62261 806825 840759 877864 918793 963549 1011442 1061433 1112053 1161269 1206747 1246290 1278265
62250 1278265 1302139 1318758 1329689 1336111 1338357 1336290 1329590 1317688 1299989 1276438 1247745 1215134
62238 1215134 1180088 1144005 1107580 1070682 1033363 996842 962868 932114 903766 876687 850517
62227 850517 825724 803136 783381 766171 750146 733966 717528 701699 687127 673946 662361
62216 662361 652545 643962 635737 627860 621223 616269 612378 608851 605811 603827 603197 603862 605522 607766 610520
62201 610520 614380 619858 626409 632885 638981 645400 652588 660212 668060 676562 686064 696326 707037 718111
62187 718111 729235 739824 749711 759181 768014 775217 780043 782645 783494 782911 781526 780524 781018 783672
62173 783672 789151 798238 811240 827937 848429 873335 902719 935404 969558 1003308 1034612 1061458
62161 1061458 1082801 1098744 1109459 1114638 1114443 1110208 1103498 1094838 1083769 1069669 1052156 1031190
62149 1031190 1007241 981081 953310 924549 896150 869864 846511 825619 806654 789848 775503
62138 775503 763331 752960 744395 737474 731592 726414 722291 719511 717805 716966 717281 718946 721846 726387
62124 726387 733718 744468 757911 772988 789462 807457 826553 846182 866391 887391 908553 928303
62112 928303 944713 955928 960760 959524 953944 945878 936581 927308 919593 914133 910020 905780 900731 894961
62098 894961 888810 883125 879395 878867 881849 888262 898041 910368 923404 935783 947881 960868 975070
62085 975070 990019 1005446 1021249 1037038 1052705 1069127 1087373 1107529 1129072 1151916 1176133
62074 1176133 1201007 1225475 1249411 1273517 1297947 1321762 1343800 1363427 1380471 1395004 1407120
62063 1407120 1416472 1422088 1423025 1419039 1410438 1397801 1382275 1365515 1348675 1331761 1314444 1296859
62051 1296859 1278981 1259966 1239071 1216765 1194005 1170835 1146679 1121707 1096835 1072474 1048193
62040 1048193 1023536 998384 972589 946076 919327 893060 867468 842426 818362 796242 776703
62029 776703 759735 745100 732449 721075 710104 698952 687342 675142 662675 650876 640560
62018 640560 631767 624153 617633 612181 607511 603569 600873 599753 599840 600985 604015 609688 617452 626239 636007
62003 636007 647344 659890 672318 683703 693778 701979 707436 710039 710586 709834 708208 706238 704166
61990 704166 701193 696275 689801 683449 678152 673278 668076 662847 658250 654321 650749 647458 644442 641547
61976 641547 638697 635920 632994 629650 626225 623417 621239 618928 616136 613496 611685 610579 609717 609031 608709
61961 608709 608823 609520 611188 614032 617798 622208 627416 633736 641181 649573 659033 670192 683886 700569
61947 700569 719872 740895 763149 787103 813630 843115 875335 909856 946028 982810 1019139
61936 1019139 1054523 1088895 1122020 1153369 1182353 1208263 1230199 1247522 1260273 1268678 1272446 1270965
61924 1270965 1264022 1252052 1236018 1217562 1198888 1181861 1167398 1156150 1149318 1148085 1152566 1162098
61912 1162098 1176238 1194699 1216508 1240035 1263755 1286234 1305629 1320079 1328562 1330673 1325873 1313935
61900 1313935 1296014 1274176 1249692 1222670 1193394 1162966 1132376 1101941 1072135 1044163 1019067
61889 1019067 996718 976182 956764 938369 921093 904772 888869 872841 856735 841283 827159
61878 827159 814440 803089 793583 786502 781828 779232 778754 780565 784332 789561 796370 805293 816544 830092
61864 830092 846149 864832 885690 908386 933584 962304 994700 1030375 1069596 1113159 1161223
61853 1161223 1213308 1269141 1328295 1389109 1449262 1507460 1563392 1615938 1662769 1701901 1732404
61842 1732404 1753292 1763223 1762090 1751952 1735702 1715549 1693299 1671180 1651566 1636220 1626188 1621960
61830 1621960 1623435 1630158 1641700 1657287 1675059 1692330 1706564 1715482 1716602 1707867 1688946 1660963
61818 1660963 1624936 1581471 1531955 1478664 1423263 1366402 1309119 1253427 1200851 1151481 1105081
61807 1105081 1062195 1023539 989155 958861 932751 910623 891582 874739 859691 846074 833478
61796 833478 822214 813211 806624 801357 796409 791775 787531 783085 778063 773093 768957 765646 762843 760556
61782 760556 758615 756367 753554 750750 748255 745381 741651 737952 735532 734368 733403 732037 730628 729808 729899
61767 729899 730722 731668 732320 733272 735722 739978 745075 750138 755214 760327 764791 768112 770556 772040 771436
61752 771436 768010 762792 757509 752713 747884 742743 737467 732133 726997 722935 720611 719422 718125 716308
61738 716308 714575 713572 713562 714598 716362 718049 719074 719682 720409 721392 722718 724888 728169 731888 735120
61723 735120 737786 740509 743827 748034 753187 758511 762411 763957 763899 763421 762383 759766 755443 750382 745273
61708 745273 739940 734102 727888 721538 715243 709272 703764 698487 693246 688239 683601 678979 674065 669069
61694 669069 664119 658754 652735 646792 641697 637054 631964 626516 621613 617573 613859 609988 605767 600841
61680 600841 595053 589219 584543 581147 578047 574650 571450 569072 567433 566067 564669 563072 561209 559300
61666 559300 557714 556554 555658 554859 553986 552882 551891 551975 553752 556658 559688 562623 565857 569345 572610 575679
61650 575679 579131 583198 587540 591927 596407 600751 604394 606991 608443 608460 606750 603656 599893 595624 590439
61635 590439 584211 577281 569821 561828 553845 546825 540988 535550 529959 524744 520758 518160 516625 516101
61621 516101 516801 518658 521151 523603 525389 526058 525479 523775 520941 516649 510615 503109 494943 486965 479588
61606 479588 472837 466695 461230 456282 451349 446139 441053 436712 433063 429494 425833 422582 419994 417637
61592 417637 415198 413075 411731 410967 410322 409688 409055 408161 406938 405842 405184 404526 403319 401759 400467 399677
61576 399677 399295 399421 400185 401332 402433 403243 403541 403123 402328 402001 402365 402569 401977 401227 401185 401504 401216 400270
61558 400270 399478 399260 399453 400101 401374 402895 404084 405114 406612 408563 410333 411656 412717 413488 413959 414923
61542 414923 417451 421477 425818 429670 433213 436731 440120 443385 446718 449819 451959 452970 453390 453474 452799
61527 452799 451099 448802 446483 444364 442507 440900 439294 437574 436316 436207 436842 436930 435917 434553 433558
61512 433558 432568 430919 428811 427091 426208 425875 425502 424661 423321 421902 420997 420925 421636 422900 424397 425822
61496 425822 427231 429084 431612 434422 437073 439636 442171 444146 445135 445690 446644 447863 448627 448996 449757 451112
61480 451112 452529 453866 455511 457252 458158 457962 457503 457405 457308 456882 456654 457183 458188 459150 460150 461433 462641
61463 462641 463157 462914 462336 461739 461211 460841 460696 460709 460810 460973 461102 461138 461380 462328 464170 466739 469990 474027
61445 474027 478664 483467 488366 493692 499520 505464 511270 517066 522909 528569 533967 539358 544868 550209
61431 550209 555002 559050 562347 565171 568089 571404 574687 577399 579805 582583 585602 587867 588735 588394 587040
61416 587040 584432 580591 576209 571990 568083 564361 560768 557226 553698 550445 547667 544943 541727 538379
61402 538379 535810 533985 531769 528656 525652 523938 523419 523194 522770 522162 521384 520531 519991 519991 520188 520140 519884 519699
61384 519699 519600 519502 519611 520338 521988 524676 528234 532090 535605 538669 541608 544524 547207 549763 552695 556180
61368 556180 559817 563269 566610 569921 573206 576934 581919 588343 595481 602732 610328 618693 627793 637500
61354 637500 648018 659532 672075 686154 702672 721521 740730 757794 771614 782647 791559 798456
61342 798456 803213 805836 806338 804662 800787 794831 787160 778458 769412 760158 750361 740097 730335 722275
61328 722275 716383 712134 708492 704565 700198 696097 693127 691421 690392 689532 688767 688179 687996 688853 691339
61313 691339 695155 699386 703841 709428 717007 726589 737928 751088 765871 781250 795848 808515 818106
61300 818106 823383 823834 820225 813806 805318 795181 784190 773304 762955 753083 743747 735284 727968
61287 727968 721825 716740 712500 708837 705632 703029 701310 700822 701936 704734 708738 713368 718676 725223
61273 725223 733141 741806 750545 759237 768089 777294 787104 797907 810125 824380 841654 862689 887073
61260 887073 913326 939818 965052 987132 1003804 1013415 1015488 1010470 999524 984525 967401 949190
61248 949190 930222 911138 892944 876146 860717 847049 835889 827135 819755 813250 808214 804993
61236 804993 802816 800870 799320 798564 798254 797839 797501 797895 799399 802061 805711 809640 812732 814350 814623 813651
61220 813651 811361 808536 806934 807568 809593 811668 813753 816764 821032 825941 830680 834642 837504 839628
61206 839628 842067 845624 850223 855634 862266 870704 881040 893255 907731 924659 943364 962826 982501
61193 982501 1002015 1020431 1036436 1048968 1057325 1061169 1060999 1058187 1053973 1048696 1042309 1035082 1027346
61180 1027346 1019119 1010476 1001705 992548 981879 968785 953545 937124 920270 903504 887229 871198
61168 871198 854586 837270 820382 804946 790675 776889 763902 752602 743242 735629 729962 726526
61156 726526 724964 724792 726268 729827 735009 740899 747377 754939 763383 771390 777288 779649 777632 771682
61142 771682 763746 755944 749066 742891 737547 733746 731955 732229 734759 739746 746776 755105 764552 775490
61128 775490 788033 801858 816690 832341 848389 864482 880909 898212 916192 933829 950229
61117 950229 965237 979161 992353 1004978 1016786 1027089 1035238 1041168 1045384 1048618 1051466 1053933 1055180
61104 1055180 1054220 1050871 1045412 1037244 1024965 1008222 988517 967520 945509 922303 898863 876756
61092 876756 856572 837918 820675 805240 791676 779537 768474 758466 749638 742395 737346 734450
61080 734450 732502 730132 727037 723770 720840 718626 717672 718256 719984 722453 725907 730585 735880 740917 745597
61065 745597 750333 755175 760039 765526 772684 782054 793497 806662 821044 835975 851218 867289 884643
61052 884643 902961 921753 941221 961818 983416 1005574 1028263 1051667 1075630 1099892 1124508
61041 1124508 1149389 1173819 1197019 1218967 1240244 1261477 1283202 1305776 1329115 1353089 1378341
61030 1378341 1405913 1435988 1468060 1502554 1540908 1583502 1628828 1675347 1722905 1771743 1821816
61019 1821816 1874207 1931750 1997076 2071242 2155191 2250919 2359813 2481172 2613807 2758236
61009 2758236 2916907 3094479 3299387 3543364 3838132 4194156 4622979 5137699 5750640
61000 5750640 6475751 7336576 8368941 9616158 11129813 12970966 15172677 17649018
60992 17649018 20123866 22189491 23501408 23966214 23768046 23235025 22687247 22372000 22449516
60983 22449516 22942236 23661303 24223198 24213879 23401900 21836001 19768287 17496155 15251013
60974 15251013 13174012 11335529 9755343 8419566 7300207 6369187 5600121 4966332
60966 4966332 4443710 4013869 3661703 3371933 3130398 2926646 2752843 2601877 2468560
60957 2468560 2350824 2247401 2155503 2072407 1997690 1931894 1874304 1823810 1780512 1744287 1712664
60946 1712664 1682041 1650590 1618635 1587100 1556974 1529438 1504903 1482507 1461758 1443846 1430118
60935 1430118 1420042 1411964 1405153 1399817 1395880 1393098 1391884 1392718 1395099 1398043 1401170 1404466 1407555 1410049
60921 1410049 1411992 1413223 1412961 1410822 1407462 1403487 1398526 1392160 1384832 1376871 1367546 1356030 1342488 1327347
60907 1327347 1310400 1291693 1272370 1253549 1235048 1216224 1197233 1178476 1159696 1140802 1122773
60896 1122773 1106468 1091180 1075599 1059648 1044288 1030007 1016626 1004035 992040 979998 967692
60885 967692 956174 946661 938978 931985 925093 918407 911817 904918 897520 889465 880399 870410 860387 850950
60871 850950 841651 831964 822364 813521 805179 796864 789048 782481 776817 771000 764689 758383 752514 747277
60857 747277 742940 739451 735989 731646 726236 719963 713044 706228 700852 697485 695201 692959 690805 688832
60843 688832 686024 681416 675577 669606 663375 656166 648434 641426 635405 629715 624385 620280 617766 616438
60829 616438 616153 617229 619616 622817 626567 630713 634668 637859 640536 643288 646031 648327 650314 652325
60815 652325 653908 654280 653566 652659 652066 651686 651405 650980 649762 647490 645033 643341 642083 640399 638476 637069
60799 637069 635766 633203 628975 624070 619359 614830 610360 606024 601408 595787 589288 582966 577468 572425
60785 572425 567352 562283 557277 552097 546723 541603 537171 533479 530339 527371 524117 520693 518148 517499
60771 517499 518559 520306 522144 524063 525844 527146 528401 530704 534601 539570 544711 549348 553040 555768
60757 555768 558237 561412 565635 570597 575985 581623 587101 591898 595869 599174 601863 603943 605598 606783
60743 606783 606765 604602 599963 593189 584936 576208 568235 561618 555757 549578 542568 534862 526921 519606 513856
60728 513856 509643 505826 501663 497779 494960 492821 490593 488403 486656 484884 482470 480013 478606 478054
60714 478054 477060 475055 472645 470411 468379 466661 465548 464961 464639 464727 465426 466327 467018 467967 469832 472198
60698 472198 474119 475589 477347 479490 481485 483432 486065 489478 492953 496119 499334 502929 507010 511863
60684 511863 517535 523133 527644 531426 535838 541500 547865 554389 560876 566736 571186 574435 577596 581153
60670 581153 584368 586285 586405 584440 580473 575497 570819 566752 562705 558546 554863 551839 548905 545715
60656 545715 542560 539696 537113 534975 533487 532330 531074 530029 529687 529516 528370 526007 523046 519554 515036
60641 515036 509888 505423 502079 498884 495148 491542 488971 487382 486279 485587 485437 485752 486460 487580 488872
60626 488872 489919 490660 491276 491631 491547 491463 491953 492699 492911 492699 492984 493969 494770 494702 493948 492845 491484 490140
60608 490140 489081 487837 485697 483038 481149 480559 480590 480678 481009 481613 482031 482314 483301 485434 488122 490622 492804
60591 492804 494776 496598 498586 501094 503812 506004 507483 508536 509034 508664 507988 508045 508820 509313 509245 509430 510269
60574 510269 511249 512288 514211 517362 520931 524314 528108 533182 539641 547193 555608 564415 573015 581437
60560 581437 590079 598459 605205 609559 611923 612780 612294 611145 610371 609897 608600 606406 605026 605856 608311
60545 608311 611023 613670 616853 621058 626531 633460 641715 651078 662044 675460 691096 707527 723682
60532 723682 739316 753631 764877 771974 775304 775274 771464 764026 754677 745277 736391 728067 720922 715446
60518 715446 711186 707540 704606 702462 700549 698616 697438 697696 698947 700524 702643 705847 710102 715213
60504 715213 721354 728561 736607 746077 758619 775303 795717 819402 847047 879208 914855 952370
60492 952370 991108 1030758 1069849 1106096 1137740 1163562 1182069 1191605 1190921 1179089 1155752 1122381
60480 1122381 1082516 1039728 995842 951880 909699 871366 837444 807194 780204 756746 736732
60469 736732 719261 703178 687637 672446 658373 646569 637164 628995 621110 613713 607088 600667 594028
60456 594028 587831 582696 578005 572925 567900 563981 561286 559253 557779 556906 555913 553951 551293 548841 546772
60441 546772 544765 543169 542802 543743 545319 547064 548758 549842 549780 548852 547742 546583 545277 544369 544556 545510
60425 545510 546139 545924 545176 544171 542938 541820 541391 541808 542896 544758 547549 550734 553195 554142 553590 552201
60409 552201 550999 550804 551412 551769 551361 550882 551018 551326 551102 550754 551356 553302 556158 559452 562797 565727 568256
60392 568256 571191 575049 579122 582457 585289 588538 592336 596065 599537 603039 606372 608901 610542 611943
60378 611943 613714 616117 619211 622577 625185 626337 626546 626814 627360 627847 628466 629829 631957 634203 636043
60363 636043 637204 637318 636376 635356 635520 637067 639170 641266 643622 646708 650713 655649 661469 668162 676025
60348 676025 685423 695754 705230 712344 717134 720328 721864 721164 718406 714435 709627 703812 697192 690464
60334 690464 684100 678252 673233 669328 666180 663074 659747 656377 652996 649574 646445 643995 642126 640612
60320 640612 639691 639700 640378 641152 641882 642750 643796 645141 647281 650527 654584 659304 665396 673685 684112 696233
60304 696233 710195 726393 744519 763623 782653 800208 814358 823724 828402 829059 825557 817325 804619
60291 804619 788539 770237 751012 732578 716126 701425 687775 675419 665050 656449 648850 642283
60279 642283 637384 634100 631752 630179 629605 629503 628752 627037 625110 623584 622278 620762 618840 616584 614532
60264 614532 613540 613804 614419 614664 615117 616608 618666 620177 621055 621985 622858 622802 621602 619852 617858 615559 613393
60247 613393 611990 611065 609755 607995 606507 605529 604755 604413 605173 607004 609266 611953 615605 619918 623625
60232 623625 626021 627673 629484 631944 635317 639604 644241 648592 652661 656598 659896 662125 664079 666938
60218 666938 670558 673890 676913 680674 685414 690128 694218 698173 702271 705830 708192 709481 710081 710256 710464
60203 710464 711119 711902 712202 712238 712718 713392 713098 711359 708857 706226 703494 700850 698773 697183 695507 693796
60187 693796 692736 692400 692062 691456 691118 691274 691426 691295 691164 691106 690862 690650 691100 692179 693219 694092 695331 696962
60169 696962 698355 699351 700454 701734 702699 703393 704418 705612 705955 705177 704295 704179 704635 705259 706133 707355 708860
60152 708860 710982 714168 717971 721388 724406 727983 732315 736373 739490 742127 744637 746609 748009 749746
60138 749746 752446 755716 759179 763189 767908 772694 776975 780797 783928 785426 784718 782321 778941 774732
60124 774732 769946 765436 761887 759158 756800 754572 752186 749310 746131 743220 740692 738300 736324 735299
60110 735299 734794 733687 731881 730560 730404 730783 731094 731681 732915 734474 736086 737990 740283 742734 745543
60095 745543 749122 752930 755813 757873 760546 764284 767644 769417 770347 771806 773938 775996 777458 777934 776919
60080 776919 774531 771660 768673 764764 759187 752253 744547 736164 727326 718749 710695 702604 694329 686729
60066 686729 680420 674975 670031 666101 663420 661039 657997 654545 651398 648637 646192 644554 644127 644587 645618
60051 645618 647552 650503 653612 656003 657872 659985 662597 665326 667430 667845 665811 661861 657351 652676
60037 652676 647002 640085 633106 627122 621913 617015 612626 608670 604210 598751 593101 588044 583170 577982
60023 577982 573109 569434 566875 564891 563330 561989 560357 558687 558292 559779 561903 563128 563351 563110 562157
60008 562157 560079 557573 555879 555403 555787 556729 557919 558878 559680 561141 563548 566045 567945 569757 572083
59993 572083 574577 576885 579610 583282 587253 590618 593394 595819 597439 597903 597739 597294 595863 592997 589760
59978 589760 587514 586256 585246 584374 583732 582696 580808 578834 577758 577397 577158 577348 578517 580292 582179
59963 582179 584748 588663 593188 596996 599910 602544 604836 606278 607102 607883 608422 608252 607777 607659 607570 606735
59947 606735 605286 603848 602310 600267 598259 597300 597494 598235 599270 600461 601114 600884 600912 602671 606018 609634
59931 609634 613009 616611 620421 623740 626352 628648 630717 632468 634550 637947 642630 647621 652360 657149
59917 657149 662384 668148 674392 680769 686576 691584 696458 701563 705936 708339 708786 708066 706373 703495 699896
59902 699896 696421 693285 690334 687905 686445 685779 685655 686507 688684 691531 694254 697055 700437 704126 707785
59887 707785 711956 717067 722345 727088 732176 738747 746045 752214 756633 759866 761939 762514 762318 762441 762341
59872 762341 760366 756222 751228 746219 740951 735609 731061 727250 722972 717720 712398 707788 703559 699177
59858 699177 694682 690234 685890 682141 679807 679267 680498 683743 689174 696089 703478 711295 720192 730220
59844 730220 740823 751761 762762 772507 779289 782751 783917 783856 783541 784724 789239 797089 806227 814218
59830 814218 819194 819652 814991 806355 795699 783979 771344 758784 747966 739354 731948 725035 718838
59817 718838 713349 708004 702769 698238 694440 690783 687398 685155 684032 682809 680838 678936 678050 678072 678367
59802 678367 678515 678085 676542 673782 670168 665988 661550 657688 655284 654253 653860 653840 654378 655254 656033 656834
59786 656834 657817 658302 657662 656787 657203 658847 660194 660553 660760 661502 662470 663411 664641 666182 667617 669117 671472
59769 671472 674837 678477 681900 685183 688141 690359 692224 694788 698401 702502 706757 711271 715633 718990
59755 718990 721259 723290 725737 728711 732328 736546 740640 743997 747203 751101 755193 758333 760596 762791
59741 762791 764481 764350 762540 760741 759857 759318 758838 758996 759764 760158 759761 759042 758010 756284 754641 754545 755710
59724 755710 756059 754685 753049 752599 753046 753747 754982 756941 758981 760843 763182 766121 768748 770815 773470
59709 773470 777476 782119 786710 791641 797050 801883 805410 808373 811599 814681 817132 819683 823236 827368
59695 827368 830849 832935 833380 832031 829243 825983 822870 819761 816653 814129 812460 811204 809995 808698
59681 808698 806483 802009 795027 786706 778025 769041 760101 752265 745880 740071 734337 729362 725579 722271
59667 722271 718876 715954 714024 712658 711485 710991 711508 712550 713909 716291 720064 724399 728408 732053 735257
59652 735257 737234 737511 736587 734816 731710 727100 721957 717316 713273 709694 706879 704902 703295 702082 702128
59637 702128 703857 706527 709209 711415 712398 711077 707262 701880 695608 688426 680798 673800 667680 661795
59623 661795 656388 652711 650809 648994 646290 643558 641314 638383 634035 629761 627386 626808 626921 627536 629025
59608 629025 631268 634239 638501 643827 648491 651244 653027 655500 658861 662203 665010 667150 668350 668843
59594 668843 669602 670910 671693 671220 670360 670182 670433 670519 670805 671763 672838 673260 672955 671737 668820 664273 659718
59577 659718 656373 653525 650073 646360 643223 640435 637458 634620 632261 629780 626875 624559 623602 623103 622068
59562 622068 621265 621910 623541 624896 626061 628022 630698 633023 634612 635960 637417 639103 641432 644702 648692
59547 648692 653479 659898 668327 677955 688279 700505 716497 736977 761111 786318 807710 819795
59535 819795 820685 813807 804322 795061 786960 781296 779113 779499 780656 782143 784454 787210 789453 790923 791437
59520 791437 789899 785678 780139 774999 769844 763061 754524 745540 736699 727671 718778 710986 704416 698320
59506 698320 692338 686643 681233 676256 672472 670274 668866 667489 666576 666508 666260 664760 662648 661216 660503
59491 660503 659933 659787 660352 660669 660024 659798 661835 665712 669566 672936 676738 681032 685038 689092 694538 701639
59475 701639 709155 715788 720595 722656 722154 721331 722424 724867 726320 726121 725934 727203 729894 733663 738496
59460 738496 744095 750189 757416 766492 776660 786349 795102 803468 811400 818288 824238 829668 833897 835582
59446 835582 834271 830157 822875 812234 799709 787537 776658 767118 759816 755802 754138 752598 750529
59433 750529 749256 749686 751291 753516 756484 760209 764700 770982 780565 793730 809419 826530 844135
59420 844135 860867 875721 889342 903438 919292 937624 958373 978552 991512 991180 977397 955553
59408 955553 931592 909141 890411 876961 869360 868239 875426 891442 911659 927480 932272 924985
59396 924985 908459 886648 863590 842401 823957 807760 794244 784568 778233 773038 767813 763396
59384 763396 760555 758810 757709 757471 757877 758155 758364 759317 760886 761983 762504 763613 765784 768212 770438 772998
59368 772998 776173 779648 783628 788778 794867 800979 807170 814420 822999 832469 843169 855821 869677
59355 869677 882967 895351 908142 922003 936322 950907 966258 981909 996374 1009049 1020346
59344 1020346 1029850 1036303 1039582 1040642 1039329 1034320 1025505 1014349 1001609 986877 970671 954676 939366
59331 939366 923617 907312 892134 879095 867442 856728 847755 840550 833561 825901 818587 812555 807220
59318 807220 801902 796896 792186 786815 780457 774125 768568 763530 759128 756201 754616 753052 751205 750449
59304 750449 751647 754124 757514 762662 769801 777826 786461 797367 811830 828579 844624 856816 862230
59291 862230 859137 848791 834861 820292 806080 793213 783417 777075 772606 769131 767850 769665 773440
59278 773440 777960 783826 791903 801459 811225 820942 830639 839717 847955 856186 864933 873494 881140 887854
59264 887854 893197 896054 896364 895550 894332 891680 886743 880145 872505 863477 853313 843657 835603 828553
59250 828553 822058 817102 814413 813127 812365 812612 814340 816780 819212 822012 825275 827900 829165 829777 830349
59235 830349 830336 829474 828534 827517 824867 819771 813622 807857 802004 795269 788498 782933 778341 773845 769484
59220 769484 765651 762110 758788 756334 754834 753198 750802 748434 746639 744613 741770 738864 736451 733835
59206 733835 730682 728146 727078 726604 725719 724881 724892 725633 727028 729669 733372 736612 738582 740345 742911 745819
59190 745819 748601 751840 755651 759015 761744 765148 769533 773241 775537 778161 782303 786370 788772 790788
59176 790788 794437 799384 804263 809358 815654 822689 829624 836995 845173 852398 856686 858522 859499 859444 857105
59161 857105 852652 847257 841069 833687 825830 818588 811760 804646 797631 791300 785000 778011 771105 765238
59147 765238 759736 753533 747082 741266 735586 729272 723113 718278 714354 710385 706838 704730 703792 703280 703506
59132 703506 704843 706437 707818 710522 716067 723461 730741 737929 746383 756330 767199 779425 793780
59119 793780 809795 826921 846269 869056 894235 919766 945310 971463 997290 1021025 1042576
59108 1042576 1063026 1082202 1098895 1112898 1124618 1133164 1137000 1136150 1131809 1124155 1112570 1097791
59096 1097791 1082070 1067388 1054858 1045262 1038595 1033707 1029801 1027427 1026615 1025259 1021188 1014692 1007199
59083 1007199 998663 988360 977078 966202 955542 944298 933317 924087 916329 908819 901778 896133
59071 896133 891159 885256 878467 871957 865630 858552 851126 844506 838389 831657 824687 818769 813763 808612
59057 808612 803665 800222 798241 796717 795824 796400 797766 798389 798271 798469 798741 798027 796809 796595 797323 797554 797023
59040 797023 796843 797457 798514 800419 803958 808776 814219 821131 830706 842273 854464 867852 883965 902357
59026 902357 921170 939971 959307 977943 993372 1004893 1013533 1019220 1020722 1018316 1013830 1008117 1001035
59013 1001035 993787 988503 985414 983061 981428 982300 986369 992503 1000085 1009565 1020433 1031050 1040839 1050376
58999 1050376 1059145 1065506 1069090 1071045 1071665 1069992 1065853 1060110 1052805 1043231 1031934 1020457 1009109
58986 1009109 997185 985321 975392 968061 962678 959445 959364 962065 966015 970816 977123 984599 992342 1000937
58972 1000937 1011405 1022473 1031773 1039599 1048557 1059527 1071034 1082707 1096111 1111546 1126934 1140515
58960 1140515 1152004 1160630 1164779 1164160 1159842 1151759 1138790 1121628 1102758 1083224 1062268 1040650
58948 1040650 1021297 1005787 992971 981902 973484 968352 965627 964624 965347 966565 965870 962385 957214
58935 957214 950804 942427 932622 923357 915129 906637 897889 890708 885381 879811 873007 866633 862010 858332
58921 858332 854965 852873 852560 853051 854043 856629 860966 865738 870913 878363 888620 899647 910052 920971
58907 920971 933502 946758 959797 973165 987197 1001045 1014662 1029496 1046011 1062657 1078469
58896 1078469 1094535 1111823 1129782 1148210 1168339 1190931 1215321 1241068 1268198 1294917 1317583
58885 1317583 1334036 1344754 1350055 1348925 1341581 1330285 1316141 1297635 1273833 1246568 1218089 1188980
58873 1188980 1159913 1133000 1109730 1089473 1071396 1055803 1042450 1029742 1016879 1004757 993698
58862 993698 982534 970839 959726 949466 938855 927968 918814 912018 905509 897800 889867 882476 874388
58849 874388 864769 854685 844689 833562 821071 809270 799389 790069 780428 772266 767272 764480 762371
58836 762371 761158 761150 761199 760627 760565 761798 763400 764940 767566 771455 774779 776697 778697 781390 782922 782389
58820 782389 781816 782682 783407 782534 781466 781542 781193 778783 775812 774451 774137 773302 772379 772290 771836 769393 765630
58803 765630 762163 759011 755580 752463 750135 747448 743471 739139 735304 731140 726376 722973 722446 723553
58789 723553 724779 727037 731704 737960 744300 750764 757586 763584 768055 772310 777368 782179 786129 790939
58775 790939 797762 804608 808973 810915 811311 809414 804734 799200 794814 791058 786937 783442 781467 779525
58761 779525 776244 773084 771865 771592 770454 769035 768735 768843 768049 767168 767663 769081 770582 773266 778375 784839
58745 784839 791299 798946 809720 823212 837794 853183 869545 885803 901357 917770 936332 955597
58733 955597 973406 989399 1003355 1013440 1018641 1020711 1021102 1018302 1010899 1000908 991139 981528 971016
58720 971016 960693 951912 943562 934410 925976 919829 914242 906913 898795 891771 884748 875744 865731 856535
58706 856535 846805 834057 819033 804121 788998 771817 753397 736360 721337 707686 696552 689329
58694 689329 684234 678251 671496 666103 661992 657464 652925 650213 649064 647758 646415 646292 646835 646801 647183
58679 647183 649644 653308 656608 660959 668885 679724 691084 703407 719063 737845 757436 777807
58667 777807 801133 827517 854159 878343 898090 910627 913745 908356 897004 880791 860547 839393
58655 839393 820570 803914 787851 773408 762619 754513 746735 739966 736688 736528 736874 737149 738545 740450
58641 740450 741095 740893 741292 741318 739168 736114 734762 734536 733119 731231 731517 733609 734939 735749 738689 743966
58625 743966 749372 754700 761678 769936 777499 784912 794419 805384 814964 822956 831450 839928 845312 846864
58611 846864 846586 844828 839939 832354 824691 817748 810506 803801 799595 796831 792543 786940 782859 780435
58597 780435 777181 773399 772490 775479 780007 785307 793479 805103 818075 831596 847079 864405 881345
58584 881345 897178 912879 927402 937956 944337 948910 952142 952413 950433 949446 950765 953319 957718 966232
58570 966232 978602 992490 1008346 1029137 1054873 1082003 1108583 1135345 1161412 1183860 1202122
58559 1202122 1218068 1231214 1238754 1240917 1241340 1241357 1238817 1233201 1226919 1220599 1212049 1200901 1189483 1178162
58545 1178162 1164652 1148888 1133787 1120195 1105881 1090403 1076092 1063323 1049819 1035655 1023949
58534 1023949 1015507 1007712 999753 993930 990802 988214 986314 988309 994913 1003065 1011379 1021726 1034184
58521 1034184 1045653 1054815 1063340 1070979 1074801 1074478 1072838 1069957 1062512 1050507 1038680 1029347 1019620
58508 1019620 1007728 996248 986752 976946 965662 955349 947128 938567 928717 920284 914577 909454 904354
58495 904354 902055 903247 904771 905455 908219 914130 920076 924881 932094 943930 957821 971726 987405
58482 987405 1005654 1023549 1039189 1053904 1067215 1075111 1076162 1073947 1070729 1064251 1053581 1042343
58470 1042343 1033065 1023847 1013719 1005677 1001270 997781 993932 992662 994983 996967 996426 996890 1001265 1007177
58456 1007177 1012301 1018581 1027086 1034070 1036318 1035497 1033548 1028957 1021217 1013694 1008331 1002719 995938 991760
58442 991760 992373 994543 995800 998746 1005303 1012450 1017781 1023672 1031810 1039372 1044856 1051926 1063043 1074947
58428 1074947 1084836 1095240 1108172 1120231 1128286 1134403 1140372 1143060 1140098 1134617 1129553 1122820 1112834
58415 1112834 1102963 1095494 1087080 1075330 1064072 1056763 1050539 1042353 1035232 1032715 1032566 1031742 1032243 1036379
58401 1036379 1041567 1045354 1050272 1058259 1065744 1069696 1072905 1077858 1081253 1080341 1078691 1079781 1080831 1079019
58387 1079019 1077667 1080012 1082830 1082759 1082953 1087000 1092249 1095845 1101266 1111877 1123916 1132896 1141118 1151892
58373 1151892 1162356 1169342 1176348 1187188 1198582 1206571 1214385 1226263 1239353 1249572 1259572 1272794
58361 1272794 1285378 1292298 1296065 1301153 1305348 1304907 1302828 1303611 1305227 1304511 1305009 1311142 1320183 1328298 1338638
58346 1338638 1354922 1373174 1388811 1405734 1429040 1454787 1476625 1496564 1519209 1541205 1556679
58335 1556679 1567706 1579120 1588369 1590868 1590090 1591962 1594410 1592820 1590398 1592475 1595956 1595341 1593982 1598367
58321 1598367 1606328 1611966 1617166 1627065 1639269 1648853 1658922 1674839 1693154 1707731 1721509 1740511
58309 1740511 1761721 1778986 1795426 1817607 1842705 1863967 1883537 1907172 1931693 1950691 1967267
58298 1967267 1987972 2009612 2025547 2039383 2058608 2080284 2097352 2113464 2136796 2164602 2188933
58287 2188933 2212375 2242806 2277728 2309336 2339978 2376880 2416826 2452109 2486411 2528475 2575366
58276 2575366 2618590 2661158 2711298 2764959 2812582 2857789 2911018 2970001 3025313 3079738 3142552
58265 3142552 3209801 3270408 3326834 3389277 3454301 3510315 3559549 3613266 3669955 3720225 3768575
58254 3768575 3827633 3895246 3960179 4025847 4104704 4193814 4280494 4367566 4467909 4578697 4687095
58243 4687095 4796744 4921661 5058454 5192395 5326463 5475560 5636699 5794942 5954387
58234 5954387 6132141 6325997 6520265 6719128 6940730 7182956 7430055 7688294 7978125
58225 7978125 8295819 8621583 8960981 9337653 9749930 10177955 10629172 11131011 11682813
58216 11682813 12263292 12881383 13568634 14325817 15132074 16002882 16980451 18071389 19257777
58207 19257777 20566203 22057545 23753527 25650255 27802259 30312026 33242836 36638935
58199 36638935 40634965 45447928 51266651 58264142 66710311 76937764 89218812 103866342
58191 103866342 121469602 142855047 168896517 200677375 239550241 285756704 335764227
58184 335764227 381133697 411459057 419896596 406687395 377922557 341351628 302957860
58177 302957860 266013228 231768691 200464630 172105643 146834503 124843164 106097874
58170 106097874 90297795 77073403 66096488 57020984 49476502 43169986 37910297
58163 37910297 33519253 29803394 26625216 23919116 21616928 19624042 17879027 16367808
58155 16367808 15062241 13903022 12855410 11924874 11103824 10354535 9657149 9025304 8461104
58146 8461104 7939817 7450999 7011513 6625371 6270545 5936767 5638343 5378706 5138570
58137 5138570 4909604 4704826 4525100 4348805 4165604 3989303 3827482 3668784 3509916
58128 3509916 3365494 3240527 3120737 2999913 2890335 2796850 2706660 2614252 2531353 2462694
58118 2462694 2395991 2325306 2261178 2208312 2155639 2097745 2044626 2001022 1956829 1907015 1861012
58107 1861012 1823539 1785415 1742024 1702148 1670096 1637284 1599836 1566679 1541922 1516514 1485541
58096 1485541 1457007 1435459 1413426 1387120 1364550 1349898 1335344 1316320 1299798 1289702 1278915
58085 1278915 1263462 1249990 1241339 1228977 1207736 1184507 1164633 1143069 1116710 1092303 1074136
58074 1074136 1056328 1034949 1015716 1002412 989691 974596 963253 958829 954494 945640 937747 934937
58062 934937 931969 925007 919381 919156 919312 915498 911528 910209 906698 897916 888986 883622 877662 868447 860934
58047 860934 857968 854104 845663 837503 833319 828637 820057 812083 807988 803082 793957 785506 781816 778824
58033 778824 772942 768350 768552 768966 765136 760498 758946 757355 752428 747554 745980 744408 740066 736985 738547
58018 738547 740827 739943 739141 742054 745744 746959 748621 753569 758417 760054 761844 767042 772494 775115 778116
58003 778116 784372 790060 791518 792171 796101 800793 802960 805577 812289 820351 825822 830419 836748 842029
57989 842029 843055 842159 841917 839088 830280 818600 808384 798296 785977 774431 767122 761397 753375
57976 753375 744996 739820 736243 731228 726578 725137 724752 722163 719021 718132 717677 715064 712621 713540 716003
57961 716003 717022 718194 721913 725915 727426 728783 733034 737863 739852 740916 744487 749048 751622 753987
57947 753987 759231 765615 770094 774637 782779 793042 802010 810994 823409 838286 852471 866659 883324
57934 883324 901194 917571 933527 950995 967240 978110 984357 989031 991078 987422 979158 969868 959836
57921 959836 947600 935114 925628 918289 910313 902590 897658 894147 888888 882794 879110 877404 874675 870868
57907 870868 867995 865308 860634 855146 851713 849840 847102 844154 843503 844820 846166 848190 852360 856820
57893 856820 858915 860093 863355 867663 869950 870909 873503 877248 879299 879851 881274 883199 883591 883442 885153
57878 885153 887429 887008 884448 883087 883261 882685 881600 882295 884247 884839 884391 885573 888352 890285 891274 893370
57862 893370 896483 898926 901506 906374 912508 916979 920016 924117 928912 931763 932817 934493 936423 935915
57848 935915 933179 931163 930238 927759 922912 917504 912049 905581 899183 895154 892701 888892 883822 880436
57834 880436 879390 878639 878016 879569 883214 886572 889365 893559 898993 903319 906537 911096 917106 921827 924402
57819 924402 926834 929741 931415 931718 932787 935197 937403 939475 943318 948457 951597 951346 949783 948694 947807
57804 947807 947352 948730 951903 955380 959195 964614 970837 975591 979137 983894 989963 994975 998702 1003687
57790 1003687 1010621 1017077 1021786 1026505 1032699 1039702 1046877 1054341 1061024 1065339 1068213 1072175 1077287 1081393
57776 1081393 1084357 1088103 1092325 1094341 1093747 1093050 1092992 1091362 1087353 1083052 1079511 1075266 1069892 1065264 1062078
57761 1062078 1058767 1054999 1052704 1052489 1052646 1052747 1054579 1058415 1062061 1064879 1069115 1075898 1083525 1091037 1099817
57746 1099817 1110070 1119347 1126306 1132645 1139578 1145610 1149481 1152239 1154715 1155916 1155485 1154861 1154610 1153501
57732 1153501 1151487 1150469 1150715 1149840 1146893 1144291 1144017 1144962 1145774 1147213 1149794 1151982 1152809 1153709 1155917 1158414
57716 1158414 1160118 1161694 1163642 1165026 1165560 1166553 1168493 1170140 1171174 1173063 1176156 1178748 1180325 1182854
57702 1182854 1187442 1192697 1197870 1204586 1213692 1223161 1230910 1237126 1242268 1245558 1247108 1248837 1251540 1253683
57688 1253683 1254626 1256329 1260275 1265573 1271706 1280219 1291887 1305160 1319368 1336643 1358737 1384806 1414344
57675 1414344 1449456 1492115 1541999 1599328 1667234 1749289 1847223 1962193 2093412 2231155 2353733
57664 2353733 2436274 2463506 2434507 2359490 2255365 2140953 2030475 1930041 1841006 1764741
57654 1764741 1702412 1652743 1613269 1582636 1559627 1541669 1526773 1515418 1508248 1503430 1498544 1493620
57642 1493620 1490122 1488292 1487521 1487924 1489598 1491702 1493971 1497605 1503067 1508843 1513934 1519522 1526460 1533428
57628 1533428 1539518 1546177 1554331 1561969 1567174 1571295 1576426 1581819 1585719 1588865 1593202 1598718 1604377 1610647
57614 1610647 1618215 1625634 1631101 1635419 1640553 1646578 1652574 1659088 1666945 1674997 1681890 1688878 1698051 1708920
57600 1708920 1719588 1730134 1741865 1754095 1764738 1773507 1781812 1790032 1797458 1804416 1811869 1819359 1825708
57587 1825708 1831316 1837661 1845026 1852675 1860496 1868478 1875616 1881521 1888055 1896990 1907040 1915624 1922619 1929787
57573 1929787 1937489 1944745 1951841 1960050 1969156 1977873 1986378 1995946 2006389 2016294 2025557 2035351 2045849
57560 2045849 2056218 2066605 2077922 2089902 2101457 2112727 2124748 2137458 2149949 2162227 2174798
57549 2174798 2187081 2198333 2209544 2222332 2236560 2251130 2266365 2283262 2301028 2317831 2333581
57538 2333581 2349527 2365482 2379863 2392253 2403596 2414155 2423604 2432901 2443635 2455620 2467363 2478787
57526 2478787 2491299 2505331 2520024 2535163 2551149 2567281 2582377 2596999 2612760 2629536 2645706
57515 2645706 2661115 2677334 2694805 2712142 2728634 2745246 2762703 2780545 2798460 2816690 2834858
57504 2834858 2852160 2868895 2886030 2903242 2919264 2934199 2949589 2966027 2982574 2998666 3014788
57493 3014788 3031087 3047084 3062947 3079425 3096441 3113230 3129803 3146751 3163884 3180662 3197572
57482 3197572 3215330 3233260 3250318 3267199 3285372 3304623 3323758 3343173 3364155 3386024 3406695
57471 3406695 3425993 3445728 3466513 3487269 3508105 3530764 3555566 3580523 3604271 3627509 3650802
57460 3650802 3673340 3694856 3716670 3739784 3763627 3787398 3811017 3834253 3856705 3879109 3902883
57449 3902883 3927959 3952796 3976829 4001009 4025695 4050109 4074242 4099146 4124817 4149901 4174130
57438 4174130 4199014 4225451 4252580 4279552 4306466 4332982 4358085 4382026 4406601 4432730 4459526
57427 4459526 4486335 4513743 4541876 4569682 4596727 4623991 4652150 4680752 4709660 4739451 4769842
57416 4769842 4799576 4828504 4857896 4888132 4918106 4947546 4977762 5009263 5040768 5071538 5102639
57405 5102639 5134804 5166989 5198238 5229236 5260926 5293200 5325928 5359643 5394285 5428945 5463637
57394 5463637 5499522 5536575 5573054 5608299 5643964 5681265 5719021 5755899 5792705 5830793 5869781
57383 5869781 5908540 5947207 5986632 6026874 6067577 6108874 6150733 6192345 6233170 6273711 6314494
57372 6314494 6355292 6396012 6437173 6478944 6520911 6563304 6606929 6651459 6695450 6738731 6782978
57361 6782978 6829068 6875679 6921474 6966862 7012488 7057691 7101730 7145050 7188102 7230255 7271018
57350 7271018 7311064 7351011 7390413 7428837 7466623 7503861 7539992 7575127 7610220 7645339 7679500
57339 7679500 7712863 7747149 7783112 7819674 7856460 7894941 7935874 7977806 8019557 8062124 8106584
57328 8106584 8152097 8197607 8243606 8290579 8337489 8383511 8429536 8476293 8522744 8568017 8613169
57317 8613169 8659219 8705176 8749916 8794313 8839476 8884498 8928110 8971203 9015495 9060860 9106009
57306 9106009 9150673 9195203 9239042 9281573 9323547 9365969 9408622 9451229 9494797 9540035 9585691
57295 9585691 9630238 9673957 9717619 9760567 9802158 9843794 9887303 9932309 9977175 10021484 10065549
57284 10065549 10108603 10149674 10189411 10229026 10268324 10306632 10344571 10382861 10420491 10456228 10490923
57273 10490923 10526142 10561537 10595828 10629367 10663263 10696865 10728686 10759170 10790000 10821193 10851467
57262 10851467 10881094 10911845 10944261 10977306 11010660 11045075 11080444 11115644 11150376 11185243 11220036
57251 11220036 11253739 11286162 11317854 11348522 11377168 11403492 11427605 11448821 11466476 11481355 11494515
57240 11494515 11505255 11512167 11515621 11517168 11517092 11514702 11510626 11506528 11502900 11499268 11496275 11495251 11495990 11497288
57226 11497288 11499588 11504828 11513662 11525028 11538446 11554507 11572996 11592749 11613520 11635891 11659207 11681751
57214 11681751 11703190 11724775 11746833 11768057 11787598 11805913 11823232 11839002 11853164 11866206 11877728
57203 11877728 11886629 11892819 11897074 11899246 11898467 11895069 11890357 11884476 11876405 11865987 11853927 11839834 11822488
57190 11822488 11802182 11780579 11758047 11733240 11705489 11675397 11642793 11606429 11566117 11523060 11477590
57179 11477590 11428669 11375952 11320140 11260868 11196509 11126631 11052452 10974349 10891187 10802785 10710827
57168 10710827 10616505 10519366 10419283 10317549 10215240 10112453 10009955 9909602 9812432 9718262
57158 9718262 9627792 9543041 9465079 9393653 9329914 9277143 9237362 9208918 9188244 9172157 9157708
57147 9157708 9142202 9124791 9106448 9087353 9065884 9040664 9011303 8976185 8931868 8875993 8808908
57136 8808908 8731394 8642992 8543896 8436453 8323489 8207088 8090189 7977226 7871603 7774304
57126 7774304 7686115 7609025 7543957 7489101 7441958 7401051 7364296 7328078 7289976 7250772 7212473
57115 7212473 7176628 7146290 7127340 7125642 7144428 7185847 7252625 7346169 7465482 7610735 7786645
57104 7786645 8001014 8262711 8583672 8980864 9474091 10084682 10839689 11776225 12940298
57095 12940298 14384830 16171263 18368035 21040517 24241262 28009271 32370365 37329083
57087 37329083 42859823 48904187 55357534 62032062 68632985 74805691 80246784 84788301
57079 84788301 88378614 90990457 92556430 92986391 92228861 90309432 87323373 83405857
57071 83405857 78707369 73383397 67595052 61513402 55319014 49192258 43298272 37773844
57063 37773844 32719000 28192610 24213009 20765395 17813238 15307933 13194566 11416442
57055 11416442 9920013 8658178 7590590 6682879 5906837 5240496 4666611 4170705 3740472
57046 3740472 3365977 3039184 2753173 2502128 2281475 2087156 1915075 1761835 1625572
57037 1625572 1505171 1398990 1305144 1222665 1151398 1090936 1040533 999945 969638 950451 943681
57026 943681 951112 974613 1016609 1080619 1167409 1266514 1352791 1396788 1382109 1313245 1208093
57015 1208093 1085902 961402 844361 739624 647890 568498 501262 445217 397615 355945
57005 355945 319804 289506 264181 242714 225288 212324 202906 195755 190867 188617 188065 187797 187836 189198
56991 189198 191966 195223 198700 203330 210326 220574 234794 253498 276717 303494 330648 352048
56979 352048 360947 354419 334995 307727 276933 246028 218104 194738 175336 159073 146472 137973
56967 137973 132460 128827 127811 130607 136786 145421 157307 174209 196744 224917 259798 301807 346792
56954 346792 385589 408545 410486 392406 360064 320992 281312 244388 211902 185034 163941 147390
56942 147390 134286 125045 120515 120415 123979 131347 143154 159480 180455 207350 241971 285232 336371
56929 336371 391687 442748 477809 487959 472417 437356 390788 339634 289607 244601 205668
56918 205668 172021 143100 118784 98530 81822 68947 60033 53955 49436 46344 44594 42819 39805
56905 39805 36363 34081 33072 32635 33179 35493 38933 42334 46137 51695 59048 67366 77017 89186 103994
56890 103994 120966 140808 164702 192382 222928 256515 292522 326092 349418 357281 349870 330701
56878 330701 304225 275322 248219 224618 204280 187610 176039 169987 168610 171822 180554 194683
56866 194683 212813 234742 262372 297613 341113 393727 457362 532671 615703 696431 760390
56855 760390 793885 791094 757349 704587 643583 581061 522054 471167 430742 400274 378695 365867
56843 365867 361726 365916 378779 401208 433344 475012 527435 593009 673828 772138 890514 1026540
56831 1026540 1165280 1280150 1345068 1347503 1291993 1194809 1076214 953831 838547 734728
56821 734728 643824 567004 504814 456532 421110 397907 386094 384537 392787 411253 440267 480245
56809 480245 533124 602337 690195 794260 904212 1001139 1062760 1074461 1037450 965701 875541
56798 875541 779249 685687 601334 528728 466875 414879 373384 342056 318459 300786 289538
56787 289538 285448 287957 296877 313454 338656 372305 414667 466004 522350 573374 606708 614429
56775 614429 595663 555371 501987 444268 388043 335726 288634 248150 214426 186130 162388
56764 162388 143322 128178 115015 103092 93536 86741 81135 75548 70708 67256 64230 60791 57622
56751 57622 55368 53476 51645 50604 50303 49297 47193 45735 46059 46794 46318 45105 44321 43841 43228 42974
56735 42974 43232 42896 41465 40275 40417 41010 41062 41383 43032 45360 47284 49131 51567 53999 55633 56978
56719 56978 58842 60935 62737 64493 66188 66941 66672 66866 68403 70103 70765 71017 71700 72064 71258 70135
56703 70135 69918 70280 70323 70207 70465 70930 71640 73343 75809 77241 76771 75946 76266 76899 76486 75536 75272 75510
56685 75510 75477 75370 75528 75445 75080 75590 77261 78451 78237 78225 79875 81969 82870 83440 85242 87500 88473 88571
56667 88571 89472 91212 92666 94122 96886 100913 105003 108818 112790 116648 119825 122674 125667 128208 129771
56652 129771 131192 133229 135023 135670 136034 137234 138689 139629 141088 144212 147833 150036 150997 151963 152511 151286
56636 151286 148646 146186 144286 142281 140324 138825 136755 132669 127011 121527 117002 113274 110539 108781
56622 108781 106820 103827 100883 99245 98227 96715 95451 95575 96213 95962 95616 96800 98818 99546 98730 97884
56606 97884 97555 97185 97067 97919 98934 98646 97379 96699 97034 97890 99635 102735 105896 107354 107420 107608 108065
56589 108065 108167 108659 110510 112409 112192 110325 109303 109989 111150 112196 113686 115394 116427 117152 118653
56574 118653 120533 121579 122246 124092 127161 130294 133607 138127 143388 147952 152115 157695 165337 174287
56560 174287 184298 195308 205684 213408 218756 223496 227941 231309 234251 238174 242424 245010 245882 246707
56546 246707 247691 247440 245814 244071 242279 239384 235737 232768 230212 226443 221516 217079 213336 208835 203300
56531 203300 197919 192920 187615 182760 180016 179090 178160 176994 176701 176629 174785 171390 168789 167537 165766
56516 165766 162710 159744 157433 154692 151410 148984 147649 146072 143992 142531 141591 139890 137820 137206 137856
56501 137856 137556 135938 135168 136169 137366 137894 138856 140497 141246 140595 140098 140563 141068 141477 143031 145576 147117
56484 147117 147029 146913 147471 147465 146643 146679 148158 149493 149860 150364 151356 151472 150460 150037 150799 151106 150232 149814 150857
56465 150857 151988 152014 151699 151743 151434 150570 150409 151597 153215 154668 156242 157298 156546 154744 154416 156166 158006
56448 158006 158918 160100 161954 162978 162674 162592 163449 164053 164091 165005 167124 168802 169351 169936 170760 170470 169229
56431 169229 169081 170341 170942 170350 170561 172098 172788 171956 172072 174421 176692 176852 176092 175968 175837 175159 175268
56414 175268 176753 177987 178131 178737 180583 181984 182082 182769 185334 188140 189585 190475 191544 191590 190157 189155
56398 189155 189821 190776 190961 191613 193488 195066 195459 196187 198169 199918 200574 201687 204083 206111 206931 208250
56382 208250 210744 212190 211507 211266 213586 216717 218356 219330 221220 223191 224006 224545 225714 226291 225319 224203
56366 224203 224251 224703 225138 226941 230314 232919 233673 234745 237568 240253 241305 242385 244712 246249 245464 244522
56350 244522 245569 247002 246660 245691 245995 246707 246476 246518 248187 250102 250773 251476 253597 255799 256726 257806 260407
56333 260407 263094 264613 266658 270528 273935 274409 273152 272449 272100 271505 272252 275291 278385 279645 280753
56318 280753 283566 286603 288275 290376 294731 299377 301819 303172 305391 307344 307475 307531 309723 312879 315184
56303 315184 317989 323018 328528 332178 335075 339168 343373 346212 349427 354892 360618 363972 366242 369963
56289 369963 374414 377911 381851 388229 395646 401979 408381 416479 424341 429577 433814 439772 446552 452238
56275 452238 458421 467576 478463 488612 498792 510682 522929 534140 546882 563917 583271 601929
56263 601929 621585 645639 673368 702379 734082 771198 812297 854428 898933 949231 1005163
56252 1005163 1064978 1130569 1204908 1286315 1370871 1458429 1550626 1645087 1737454 1827125 1915091
56241 1915091 1997945 2070065 2130092 2179376 2215794 2235207 2237701 2226515 2202223 2163784 2113828
56230 2113828 2056914 1993804 1923195 1847621 1771748 1696174 1618836 1541095 1466504 1394935 1324073
56219 1324073 1255486 1193109 1136786 1083307 1032735 987748 947841 910128 874860 844380 817818
56208 817818 792515 769222 750004 732655 713360 693424 677081 664293 652056 641111 634541 631117
56196 631117 626930 622372 620730 621072 619459 616092 614399 614069 611928 608593 607324 607380 605530 602933 603408
56181 603408 606114 607246 607708 611502 617694 621791 624102 628814 635586 640139 642561 646986 653487 658338
56167 658338 661870 668041 676571 683606 689761 699288 711708 722619 732491 746047 763107 778693 792275
56154 792275 808229 827104 845253 863278 885915 913149 940409 968059 1001760 1042963 1088200
56143 1088200 1138516 1200441 1276796 1365577 1468652 1592005 1735906 1893559 2060076 2233218
56133 2233218 2404309 2558651 2687681 2792889 2877469 2943731 2999497 3056069 3116403 3173040
56123 3173040 3218643 3249987 3261998 3249282 3216079 3174975 3133406 3089619 3041593 2988747 2923720
56112 2923720 2834354 2717357 2580871 2432422 2274983 2116042 1968310 1837919 1722025 1620121
56102 1620121 1536827 1471433 1416319 1368669 1332721 1308012 1287018 1267293 1254231 1248782 1244259 1238431
56090 1238431 1236760 1240209 1241897 1239540 1239244 1243305 1246315 1247100 1252213 1263588 1274864 1283834 1296184 1313218
56076 1313218 1328685 1341653 1359331 1382929 1404069 1419580 1436201 1456148 1472064 1481327 1491185 1504419
56064 1504419 1514192 1518595 1525871 1539405 1552028 1560989 1573744 1592810 1610045 1622421 1638186 1660677
56052 1660677 1681584 1697261 1715946 1741546 1766240 1786701 1811354 1843612 1874356 1899275 1927021
56041 1927021 1961757 1994679 2021674 2052068 2090637 2128497 2161256 2198198 2243509 2286868 2323296
56030 2323296 2363783 2415092 2467635 2514767 2565020 2623245 2678996 2726356 2776205 2836012 2896732
56019 2896732 2952518 3013393 3085152 3157176 3223856 3297047 3383201 3469836 3549440 3634468 3733231
56008 3733231 3833910 3928763 4030700 4148676 4270458 4387549 4512862 4655282 4801777 4943826
55998 4943826 5095758 5266823 5441556 5608665 5782320 5973506 6168904 6360713 6567774
55989 6567774 6803156 7051215 7301475 7573212 7880385 8205779 8537708 8897362 9300526
55980 9300526 9729009 10171260 10652700 11192618 11771760 12378044 13041295 13784885 14589133
55971 14589133 15443876 16388711 17457213 18634083 19916039 21359200 23014641 24879696
55963 24879696 26972267 29388358 32225792 35530527 39395803 44036674 49689408 56531214
55955 56531214 64785679 74792575 86875410 101298923 118514449 139307847 164604422
55948 164604422 195438941 233246859 279215451 331716973 383756652 424083826 442605770
55941 442605770 435904161 408171679 367540724 321761164 276258412 234247049 197280862
55934 197280862 165690957 139130930 117074879 98954819 84115112 71912097 61861287
55927 61861287 53596689 46757654 41021855 36189126 32129941 28690085 25720608 23149979
55919 23149979 20944741 19034249 17339714 15837843 14529725 13378787 12336909 11399235
55911 11399235 10577328 9846789 9172467 8557532 8018535 7537406 7084092 6662493 6290055
55902 6290055 5954557 5632783 5330532 5064129 4822338 4584561 4357635 4158098 3976322
55893 3976322 3793496 3616735 3463215 3325808 3187272 3052911 2937359 2833819 2727340
55884 2727340 2624619 2540863 2470355 2398765 2331613 2282091 2242607 2195695 2141816 2090394 2035150
55873 2035150 1964736 1887221 1818472 1756054 1688850 1622208 1568932 1524747 1476810 1427925 1389025
55862 1389025 1356086 1317515 1276725 1244961 1219034 1187748 1153390 1125733 1101647 1071498 1039180
55851 1039180 1015312 996788 972950 945930 925200 907902 884210 856767 835579 818754 797107
55840 797107 772993 755958 744196 728544 710625 699166 692243 680732 665828 656043 650272 640601
55828 640601 628604 622525 621394 617886 613674 616060 622403 623578 620011 619048 619480 614161 605188 601098
55814 601098 601342 598592 594033 595294 601201 603530 602275 604511 609555 609645 604307 600092 597057 589196 577443
55799 577443 568838 563433 554880 543129 533803 526008 513692 498351 487673 482187 475743 468600 467344
55786 467344 471875 474702 473369 472114 471388 467314 461374 459299 460340 458573 454425 453864 456603 456264 451877
55771 451877 448065 444233 434973 421204 409674 401106 389814 375368 363688 356103 348044 339206 334436
55758 334436 333831 332293 329543 330349 334146 334690 330925 328194 327873 325745 321410 319244 318891 314690 305826
55743 305826 297602 291580 283937 274677 268828 267057 264415 259770 257394 257884 256718 253313 252436 255008 256294
55728 256294 254720 253747 253635 250192 243311 238084 235811 232425 227310 224941 226051 225850 222945 221527 222736
55713 222736 222265 218706 216144 216280 215919 214265 214811 217955 219601 219100 220733 225325 228204 227596 227176 228198
55697 228198 226988 222624 219362 218980 218215 216204 216947 221827 227011 230713 235720 242297 246049 245527 244810
55682 244810 245873 245565 242858 241837 244482 247283 247984 248957 251102 251165 248112 245638 245403 244155 240358 237283
55666 237283 236765 236231 234598 234645 236868 237599 236150 237135 242488 247614 248780 248118 247988 246582 242642 238613
55650 238613 235576 230638 222737 215509 211221 207289 201859 197232 194674 191457 186296 182241 180971 179627
55636 179627 176416 173949 173898 173735 171847 170481 170581 169247 165525 163062 163687 163957 161586 159671 160796 162367
55620 162367 161779 161051 162292 163474 162745 162228 163614 164444 162648 160409 159887 159397 157403 155922 156384 156408 154236
55603 154236 152088 151669 150730 147586 144794 144685 145426 144994 144830 146096 146525 144624 142905 143389 144019 143058 142844
55586 142844 145477 148823 150525 152040 155037 157700 158429 159383 162608 166281 168424 170761 175294 180740 185905
55571 185905 192842 202962 213610 222158 229942 238501 245581 248664 248970 248294 245330 238921 231494 225444
55557 225444 219343 211428 203553 197864 192868 186727 181362 179349 179546 179444 179093 179250 178610 176349 174583
55542 174583 174947 175593 174715 173874 174556 174850 172966 170721 169969 168968 165968 162965 161979 160906 157132 152159
55526 152159 148549 145369 140887 136838 135566 135521 133862 131238 129875 129274 127811 126353 126309 126307 124621 122708
55510 122708 122616 123156 122371 121440 122247 123367 122437 120461 119910 120443 120277 119843 120413 120906 119683 117784 117148 117436
55492 117436 117625 118530 120661 121985 121073 119996 120828 121930 121192 120155 121086 122610 122312 121220 121622 122691
55476 122691 122393 121580 122131 123066 122608 121999 123210 124868 124561 123218 123061 123155 121286 118532 117696 118750 119870
55459 119870 121384 124577 128145 129865 130348 131281 131641 129684 126982 126246 126702 125759 123749 122837 122735 121832
55443 121832 121103 122509 124720 124846 123295 122722 123289 123236 122966 124132 125616 124975 123148 123337 125793 127913
55427 127913 128964 130560 132911 134698 136284 139158 142615 144762 146320 149670 154781 159787 164844 171417
55413 171417 178406 183115 185587 188014 190297 190208 187625 184535 181090 175685 168840 163082 158922 154664 150115
55398 150115 146801 144579 141690 138181 135722 134142 131743 128928 127929 128940 129936 130208 130722 131245 130629 129680
55382 129680 130115 130939 129589 126451 124473 124361 124052 122955 122766 123745 124031 123147 122644 122806 122115 120396 119143
55365 119143 118454 116979 115152 114960 116209 116515 115423 115124 116586 118321 119444 120656 121719 121273 119757
55350 119757 119310 120255 120763 120397 120772 122227 123042 122542 121873 121264 119592 117194 116022 116493 117151 117729 119386
55333 119386 121626 122326 121367 120944 121703 121908 121024 120728 121510 121657 120623 120239 121473 122957 123812 124941 126418
55316 126418 126474 124362 121693 119851 118450 117193 116718 116738 115829 113986 113048 113848 115239 116467 118094 120007
55300 120007 120994 120889 120807 120888 120268 119525 120403 122753 124456 124819 125312 126569 127516 127912 128864 130219 130343 129074
55282 129074 128092 127816 126816 124849 123559 123585 123814 124044 125298 126992 127029 125463 124849 126124 127336 127366 127552
55265 127552 128493 128573 127112 125866 125905 125813 124468 122878 121890 120790 119535 119737 121994 124685 126600 128263
55249 128263 129671 129588 128231 127793 128883 129301 127773 126081 125947 126502 126494 126368 126484 125841 124323 123736 124890
55232 124890 125971 125498 124563 124496 124665 124320 124370 125484 126461 126257 125714 125705 125514 124590 123957 124359 124872 124746 124766 125479
55212 125479 126009 125900 126109 126936 127098 126127 125523 126165 126733 126126 125288 125188 125104 124389 123889 124168 124320 123955 124198
55193 124198 125388 126004 125449 125563 127653 130122 130870 130130 129169 128164 127151 127276 129134 131305 132174 131885
55177 131885 131261 130366 129362 129133 129848 130542 131029 132304 134224 135061 134436 134268 135502 136484 136096 135910 137352
55160 137352 139102 139389 138729 138359 137905 136696 135534 135211 134920 133964 133355 133953 134778 134865 135006 135896 136399 135471
55142 135471 134074 133374 132749 131359 129963 129484 129433 129408 130235 132001 132885 131809 130344 130150 130489 130174 129928
55125 129928 130651 131343 130997 130745 131771 132791 132064 130395 129734 130093 130210 130087 130605 131585 132314 133012 134045
55108 134045 134771 134811 135189 136593 137903 138129 138217 139190 140126 139875 139182 139166 139325 139058 139396 141063 142492 142158
55090 142158 141323 142006 143644 144298 143915 143786 143861 143117 141755 140670 139583 137997 137080 138270 140659 141992
55074 141992 141706 140995 140597 140446 140841 141982 142939 142805 142193 142070 142041 141367 140620 140556 140485 139552 138549 138607 139147
55055 139147 138978 138413 138447 138918 139229 139802 140993 141815 141577 141493 142702 144031 143835 142803 142724 143623 144280 144487
55037 144487 144601 144000 142271 140887 141403 142978 143825 144054 144747 145387 144753 143493 143261 143972 144329 144333 144917 145749
55019 145749 145780 145371 145655 146406 146758 147286 149090 151497 152915 153346 153764 153819 152491 150419 149166 148780 148342
55002 148342 148234 149388 150903 151013 150019 149839 150927 151996 152487 152951 153305 152972 152507 152911 153677 153615 153152 153661
54984 153661 154979 155864 156348 157297 158144 157577 156136 155663 156361 156802 156599 156715 157309 157644 157957 159118 160697
54967 160697 161643 162575 164904 167914 169320 168704 167919 168007 168210 168152 168560 169531 170332 171137 172830 174954 176046
54950 176046 176105 176591 177811 178458 177943 177180 176942 177400 179219 183023 187832 192147 196447 202471 210214 218073
54934 218073 225860 235102 246169 257588 268568 279811 291293 301394 308656 312471 311957 306359 296867
54921 296867 285936 274586 262395 250030 239332 230702 222804 215182 208781 203598 198318 192795 188444
54908 188444 185639 183072 180349 178815 179108 180150 181289 183241 186101 188582 190130 191850 194577 197905
54894 197905 201792 207194 214361 222371 230998 241202 253205 265784 277937 289324 298771 304466 306199
54881 306199 305377 302389 296124 286573 275590 264403 252627 240441 229415 220290 212147 204574 198391
54868 198391 193413 188006 181994 177577 175980 175407 173876 171995 171271 171555 171893 172332 173161 173642 173029 171793
54852 171793 170600 169223 167523 166298 166004 165807 164890 163590 162380 160951 159199 157910 157600 157763 157926 158237
54836 158237 158419 157556 155632 154007 153655 154214 155198 156636 158005 158197 157222 156402 156245 155807 154815 154547 155747
54819 155747 157414 158627 159873 161577 163007 163738 164655 166378 168108 169062 169652 170334 170762 171018 172109 174274
54803 174274 176273 177341 178308 179801 180946 181004 180742 180984 181235 180956 180846 181637 182913 184233 186166 189062
54787 189062 192103 194663 197460 201400 206454 212584 220364 229717 239459 249163 260064 273036 286975
54774 286975 300237 312251 322700 330603 335480 338113 339004 337368 332778 326402 319480 311979 303989 296927
54760 296927 291867 287928 283629 278671 273076 265977 256912 247250 238815 231882 225785 220549 216615 213852
54746 213852 212018 211382 211920 212840 213927 216177 220077 224480 228402 232688 238652 246233 254791 264549 275792
54731 275792 287561 298467 307843 314938 318110 316308 310492 302348 292474 281026 269013 257521 246534
54718 246534 235932 226779 220142 215347 210744 205693 200612 195742 191026 186710 183119 180332 178685 178622
54704 178622 179440 179440 178184 177266 177816 178680 178351 177298 176826 176895 176695 176332 176231 175728 174008 171736 170228 169550
54686 169550 168920 168369 168502 169077 169206 168667 167865 166983 166169 165931 166284 166186 164934 163462 163173 164133 165484 166891
54668 166891 168409 169616 170043 169971 169800 169261 168191 167333 167418 168156 168956 169846 170778 171050 170391 169688 169683 169923 169961
54649 169961 170429 171788 173126 173424 173006 172597 172046 171190 170812 171389 171972 171625 170905 170580 170076 168738 167503
54632 167503 167636 168709 169404 169496 169506 169263 168383 167396 166969 166815 166657 167199 168655 169520 168566 167021 166952 168404
54614 168404 169913 170918 171728 171998 171299 170621 171304 172969 174252 174989 175817 176354 175762 174646 174363 174835 174947
54597 174947 174719 175165 176312 177270 177963 178973 179992 180316 180459 181303 181996 180843 178172 176121 175535 175183 174269
54580 174269 173636 173968 174699 175303 176097 177142 177795 177887 178138 178903 179544 179397 178451 176949 175225 173987 173789 174241
54562 174241 174566 174724 175104 175511 175549 175615 176323 177375 178178 179082 180668 182320 182979 182947 183358 184207 184508 184210 184315
54543 184315 185165 186154 187077 188279 189468 189821 189360 188944 188928 189011 189221 189769 190124 189588 188595 188125 188147 187931 187531
54524 187531 187407 186970 185185 182465 180355 179501 179436 180065 181550 182918 182775 181469 180744 181083 181196 180390 179629
54507 179629 179801 180571 181433 182437 183344 183482 182907 182560 182843 183179 183271 183652 184717 186139 187405 188053 187557 186025
54489 186025 184813 185215 186810 188264 189335 190622 191842 192147 191945 192543 193994 195117 195670 196627 198111 198919
54473 198919 198490 197675 197165 196797 196699 197483 198883 199749 199793 199896 200426 200862 201287 202486 204136 204642 203438 201910
54455 201910 201419 201870 202717 203821 204686 204381 202999 201803 201286 200399 198422 196275 195177 195130 195429 195650 195524
54438 195524 194850 194063 194009 194765 195528 195861 196008 195962 195415 194687 194438 194445 194029 193681 194581 196436 197589 197566 197624 198395
54418 198395 198925 198741 198901 200055 201236 201601 201786 202417 202778 202176 201286 200915 200632 199878 199415 200350 202436 204382
54400 204382 205352 205388 204937 204613 204821 205136 204741 203754 203252 203707 204448 205031 205930 207367 208649 209332 209969 211037
54382 211037 212068 212445 212200 211527 210423 209273 208806 209031 209151 208880 208793 209082 209139 208805 208841 209684 210862 212103
54364 212103 213821 215991 217716 218514 218986 219779 220906 222448 224709 227310 229381 231088 233650 237446 241421
54349 241421 244815 248059 251432 254206 255710 255925 254555 251037 246077 241664 238803 236631 234365 232460
54335 232460 231102 229310 226642 224207 222830 221655 219750 217794 216914 217057 217689 218946 220792 222067 221641
54320 221641 219841 217768 215969 214548 213615 212848 211559 209911 208993 209087 209149 208657 208495 209066 209113 207632 205571
54303 205571 204312 203703 202937 202237 202213 202531 202635 202975 204198 205833 206959 207486 207747 207653 207282 207534 209026 211042
54285 211042 212486 213139 213161 212328 210734 209306 208655 208259 207664 207450 208074 208885 209321 209951 211173 212064 211815 211338
54267 211338 212058 213975 216154 218234 220198 221539 222023 222505 223686 224728 224381 222841 221304 220377 220084 220661
54251 220661 222074 223289 223212 221922 220161 218324 216750 216073 216274 216373 216021 216324 217995 219853 220493 220317 220451
54234 220451 220730 220352 219601 219247 218960 217990 216761 216188 216037 215593 215369 216439 218410 219740 219868 219620 219593 219522
54216 219522 219077 218129 216403 213981 211870 211021 211081 210995 210352 209302 207849 206314 205749 206635 207822 207990 207487
54199 207487 207484 208067 208639 209494 211347 213699 215237 215624 215543 215316 214764 214121 213799 213479 212672 211796 211565 211693 211387
54180 211387 210647 209939 209130 208042 207469 208192 209427 209672 208736 207661 207028 206699 206696 206941 206593 205135 203755 204147
54162 204147 206214 208340 209622 210403 210969 211207 211380 211823 212090 211639 211016 211037 211284 210847 210085 210088 210814 211392 211951
54143 211951 213415 215706 217789 219379 220984 222427 223009 223050 223617 224765 225630 226200 227302 228821 229661 229578
54127 229578 229419 229421 228979 228342 228830 230916 233529 235676 237395 238779 239420 239346 239377 240165 241720 243915 246399
54110 246399 248150 248343 247579 247088 246926 246413 246032 247082 249381 251169 251631 251873 252972 254703 256715 259360
54094 259360 262617 265518 267432 268937 270875 273491 276887 281293 286535 292198 298703 307358 319142 334282
54080 334282 353025 375681 401588 428723 454157 474061 484024 481280 467015 445426 420595 395249
54068 395249 371720 351834 335518 321317 308679 298277 290081 282986 276692 272128 269461 267459 265412
54055 265412 263976 263429 262787 261487 260439 260555 261546 262934 264888 267337 269582 271567 274265 278096 282233
54040 282233 286199 290770 296485 302591 308334 314098 320465 327343 334839 343707 354013 364543 374496 384616
54026 384616 395728 407324 418535 429307 439444 447547 452188 453383 451897 447916 441429 433165 424072
54013 424072 414467 404556 395097 386583 378455 370013 361501 353484 345780 337928 330146 322972 316477 310610
53999 310610 305802 302336 299536 296334 292446 288446 285079 282870 281938 281724 281331 280477 279582 278789 277683 276289
53983 276289 275389 275319 275304 274591 273462 272570 271996 271562 271314 271096 270366 269006 267674 266868 266355 266008 266339 267571
53965 267571 269001 269945 270636 271548 272575 273544 274770 276383 277813 278681 279615 281466 284208 287237 290215 293065
53949 293065 295633 297966 300437 303223 306173 309480 313712 318824 323974 328795 333948 339912 346183 352369
53935 352369 359128 367171 376112 385158 394253 403757 413668 424123 436137 450933 468809 489325 512372
53922 512372 538581 568811 603091 639036 670995 692188 699045 693343 679857 662749 644498 626669
53910 626669 610007 594227 578940 564619 551932 540673 530266 520841 512823 505788 498794 491621
53898 491621 484772 478361 471925 465308 458941 453100 447462 441515 435005 427900 420207 411939 403228 394538
53884 394538 386674 380210 374906 370067 365417 361075 356789 352041 346976 342353 338354 334321 329971 325931
53870 325931 322612 319458 315910 312333 309355 306928 304598 302111 299263 295826 292130 289030 286840 284894
53856 284894 282607 280250 278213 276287 274229 272317 270796 269459 268304 267830 268140 268493 268348 268055 267903 267340
53840 267340 265867 263966 262365 261091 259984 259383 259440 259352 258279 256684 255983 257059 259622 262643 265015 266186
53824 266186 266569 266939 267329 267180 266680 266883 268123 269373 269795 269935 270722 272286 274500 277664 281784 286002
53808 286002 289617 292985 296704 300760 305154 310376 316428 322356 327680 333360 340347 348128 355697 362986
53794 362986 370125 376294 380731 384089 387318 389823 390260 388759 386847 385406 384043 382341 380407 378229
53780 378229 375607 372754 369978 366813 362435 356904 351103 345551 340177 335145 330913 327365 323669 319221
53766 319221 314234 309368 305192 301880 299043 296031 292717 289639 287153 284994 283049 281810 281440 281082 279817
53751 279817 277805 275796 274089 272682 271867 271874 272336 272798 273295 273835 273970 273534 273209 273578 274252 274677 275152 276203
53733 276203 277577 278683 279490 280169 280464 280286 280285 280972 281837 282160 282122 282286 282678 283220 284365 286347 288459 290011
53715 290011 291326 292870 294198 294802 295247 296339 297958 299826 302658 307196 312719 317813 322050 325729 328648
53700 328648 330545 332179 334547 337479 340282 343193 346715 350102 352100 352851 353487 354127 353944 353034 352601 353249
53684 353249 354518 356131 358231 360338 361458 361479 361338 361647 362180 362695 363198 363425 363114 362678 362604 362419 361340
53667 361340 359704 358587 358208 357906 357448 357114 356677 355653 354476 354178 354954 356135 357322 358365 358570 357401
53651 357401 355762 355117 355438 355437 354707 354127 354168 354379 354626 355392 356655 357807 358800 360024 361070 361059 360314 360192
53633 360192 361111 362136 362605 362744 362605 362036 361861 363427 366572 369595 371638 373568 376153 378947 381505 384208
53617 384208 387269 390276 393219 396663 400480 403875 407035 411144 416211 420665 423833 427120 431706 436707
53603 436707 440895 444850 449917 456039 462056 467457 472612 477817 483138 488757 494611 500145 505152 510362
53589 510362 516534 523462 530419 536996 542918 547633 550686 552050 551648 549121 544453 538249 531055 523037
53575 523037 514654 506897 500411 495009 490356 486406 482874 479172 475315 472134 470178 469091 468382 467961 467550
53560 467550 466531 464937 463789 463783 464352 464546 464225 463868 463810 464140 464814 465485 465757 465870 466522 467819 469082 469874
53542 469874 470482 471183 471896 472755 474160 476039 477963 480201 483629 488294 493114 497446 501925 507325 513608
53527 513608 520582 528470 537252 546471 556272 567629 580771 594342 606914 618663 630809 644088
53515 644088 658395 673318 688388 703323 718522 734797 752306 770395 788747 807871 828116
53504 828116 849091 870439 892286 914490 936401 957928 979985 1003303 1027584 1052259 1077184
53493 1077184 1102123 1126435 1149901 1173108 1196527 1219970 1243205 1266127 1288026 1307908 1326059
53482 1326059 1344069 1362631 1380559 1396757 1411948 1427499 1443707 1460297 1477568 1495751 1513928
53471 1513928 1530685 1545354 1557823 1567921 1575857 1582531 1588393 1592578 1593956 1592369 1588019 1580504 1569534
53458 1569534 1556004 1541374 1526465 1511619 1497270 1483298 1468460 1451590 1433006 1413792 1394164
53447 1394164 1373557 1351961 1330083 1308393 1286857 1265552 1244756 1224497 1204519 1184619 1164796
53436 1164796 1145499 1127954 1113563 1102463 1093304 1084896 1077426 1071593 1067438 1064691 1063422 1063581 1064619
53423 1064619 1066411 1069842 1075675 1083508 1092599 1102944 1114628 1126926 1139205 1152147 1166942 1183633
53411 1183633 1201255 1219286 1238047 1257934 1279157 1301967 1326424 1352182 1379154 1408000 1439314
53400 1439314 1472806 1507955 1544958 1584303 1625924 1669608 1715761 1764859 1816448 1869428 1923097
53389 1923097 1977283 2031936 2087237 2143718 2201565 2260112 2318501 2376330 2433127 2487947 2540261
53378 2540261 2590603 2639563 2686702 2731264 2773284 2813071 2850157 2883758 2913896 2941122 2965460
53367 2965460 2986441 3003750 3016919 3024608 3024989 3016795 2999607 2973593 2939578 2898958 2853016 2802695
53355 2802695 2749274 2694400 2638825 2581928 2523227 2463576 2404274 2345921 2288954 2234322 2182522
53344 2182522 2132751 2084006 2036210 1989274 1942027 1893445 1844279 1796177 1749806 1705046 1662362
53333 1662362 1622578 1585676 1551126 1519053 1489944 1463630 1439730 1418705 1401272 1387106 1375121
53322 1375121 1364509 1354417 1343293 1329965 1315021 1299892 1285066 1270398 1256564 1244618 1234493
53311 1234493 1225351 1217093 1210096 1203942 1198049 1193217 1190824 1190636 1191134 1191963 1194330 1198833 1204704 1211500 1219880
53296 1219880 1230169 1241575 1253512 1266618 1281909 1299815 1320310 1343074 1367282 1392176 1417916
53285 1417916 1444999 1472894 1500323 1526782 1552537 1577244 1600081 1621419 1642843 1665019 1686736
53274 1686736 1706508 1723884 1738775 1750676 1759233 1764701 1767365 1767308 1764959 1760853 1754512 1744556 1730338
53261 1730338 1712506 1691676 1667596 1640123 1610042 1578386 1545693 1512332 1478761 1445083 1411129
53250 1411129 1377335 1344685 1313521 1283289 1253806 1225785 1199553 1174126 1148227 1121588 1094653
53239 1094653 1067591 1040169 1012263 984043 955953 928654 902587 877556 853190 829864 808571
53228 808571 789874 773535 759138 746383 734814 724038 714203 705512 697273 688265 678105 667456
53216 667456 656880 646298 635535 624437 612471 599280 585720 573270 562199 551371 540092
53205 540092 529098 519385 511109 504008 497937 492546 487292 482173 477604 473309 468296 462253 455947 449836
53191 449836 443360 436174 429070 422920 417527 412263 407157 402608 398537 394553 390586 386879 383678 381248
53177 381248 379781 378970 378120 376872 375343 373474 370913 367708 364426 361370 358352 355399 352900 350854 348792
53162 348792 346734 345352 344826 344368 343360 342119 341031 339698 337614 335085 332825 331068 329579 328240 327161
53147 327161 326448 326065 325709 324832 323249 321649 320958 321222 321785 322392 323273 324158 324281 323557 322769 322388 322196 322376
53129 322376 323841 326925 330732 334320 337715 341145 344153 346189 347495 348714 350067 351340 352244 352451 351827
53114 351827 350865 350229 349640 347965 344769 340997 337719 334973 332315 329729 327427 325343 323423 321948 321137
53099 321137 320847 320897 321166 321272 320806 320075 319863 320343 321019 321815 323162 324827 325875 326262 327233 329477 331937
53082 331937 333296 333690 334010 334322 333985 332900 331746 331210 331490 332206 332507 331735 330225 328842 327645 325890
53066 325890 323522 321491 320194 318841 317003 315556 315176 315050 314144 312796 311928 311515 311026 310641 310767 310828 309854
53049 309854 308011 306447 305810 305849 306250 306894 307453 307610 307664 308166 309050 309802 310286 310789 311359 311750 311903 311953 311914
53030 311914 311823 311970 312539 313206 313511 313382 312966 312364 311921 312372 314118 316645 319075 320952 322192 322748 322836 323039
53012 323039 323670 324399 324896 325359 325962 326354 326288 326263 326877 327890 328577 328729 328784 329176 329990 331067 332101 332898 333690
52993 333690 334835 336090 336802 337013 337618 339077 340743 341904 342724 343618 344473 345108 345879 347159 348786 350564
52977 350564 352719 355321 357933 360380 363150 366368 369127 370552 370888 370838 370548 370012 369724 370007 370247 369621
52961 369621 368093 365970 363158 359700 356410 353991 352078 350073 348338 347530 347226 346322 344545 342630 341254
52946 341254 340615 340734 341337 341794 341919 342410 343670 344746 344405 342824 341199 340081 339172 338372 337877 337435 336635
52929 336635 335828 335675 335862 335422 334361 333882 334729 336153 336851 336282 334949 333925 334133 335518 336935 337323 336855
52912 336855 336414 336224 335713 334584 333244 332147 331309 330496 329439 327994 326528 325917 326690 328370 330100 331584
52896 331584 332960 334175 335179 336365 338087 339934 341074 341141 340355 339111 337876 337049 336348 334886 332421
52881 332421 329995 328705 328437 328477 328694 329256 329909 330542 331831 334196 336671 338010 338478 339285 340645 341674
52865 341674 342041 342343 342872 343294 343678 344673 346386 347994 348734 348534 347604 346192 344770 343711 342712 341126 338800
52848 338800 336028 332917 329534 326436 324257 322945 322047 321406 320838 319707 317772 316001 315450 315811 316224 317050
52832 317050 319338 322778 325721 327260 327840 327743 326548 324504 322952 322753 323383 324172 325522 328366 333188 339988
52816 339988 348304 356776 363374 366603 366168 362496 356294 348627 340662 333113 326442 321374 318338 316538
52802 316538 314654 312508 311002 310350 309570 308011 306264 305045 304148 303101 302145 301938 302718 304051 305064 304940
52786 304940 303772 302865 303466 305199 306515 306648 306310 306502 307575 309462 311766 313531 313947 313480 313304 313527
52770 313527 313061 311469 309743 308837 308570 308518 308986 310388 312417 314439 316092 317114 317241 316717 316294 316349 316539
52753 316539 316501 316280 315916 315422 315265 316019 317317 318045 317886 317795 318662 320325 322227 324091 325639 326626 327638
52736 327638 329907 333727 337829 340858 342716 343963 344735 344898 344601 344001 342918 341263 339357 337516 335808
52721 335808 334470 333889 333870 333597 332641 331393 330271 329264 328482 328306 328628 328807 328734 329067 329983 330645 330489 330177
52703 330177 330538 331316 331697 331485 331083 330795 330775 331259 332298 333560 334730 335745 336496 336865 337254 338342 340056
52686 340056 341423 341739 341198 340177 338756 337251 336261 335734 334841 333298 331961 331584 331795 331923 332032 332478 333109
52669 333109 333567 333818 333848 333464 332877 332827 333602 334562 335182 335971 337862 341259 346020 351596 356746 359903 360418
52652 360418 358892 356015 352025 347608 344184 342523 341952 341579 341365 341389 341207 340819 341213 342903 344842 345909
52636 345909 346581 347956 349964 351883 353953 356902 360224 362398 362750 361900 360427 358296 355693 353301 351404
52621 351404 349548 347340 345040 343159 341925 341236 340782 340241 339632 339268 339130 338678 337688 336880 337163 338558 340302
52604 340302 341737 342642 343071 343344 343882 344657 345142 345153 345240 345843 346637 347262 348127 349859 352327 354793 356613 357326
52586 357326 356609 354825 353190 352767 353473 354456 355013 354791 353737 352292 351123 350237 348961 347131 345438 344201
52570 344201 342843 341238 340390 340813 341324 340623 339178 338268 337980 337562 337140 337520 338668 339807 340864 342430
52554 342430 344391 345902 346704 347286 347709 347419 346309 344967 343768 342629 341674 341237 341226 341311 341681 342739 344212
52537 344212 345472 346550 347829 348932 349112 348734 349067 350412 351570 351503 350502 349428 348776 348855 349953 351823
52521 351823 353720 355359 357128 359094 360574 361128 361371 362312 364327 367070 369881 372026 372931 372516 371099
52506 371099 368972 366375 363692 361151 358459 355416 352780 351690 352173 352995 353156 352838 352658 352814 353332 354402
52490 354402 355928 357185 357483 356985 356629 357366 359546 362661 365597 367442 368224 368661 369294 370164 371215 372427
52474 372427 373528 374097 374088 373874 373709 373531 373364 373547 374413 376019 378135 380210 381395 381026 379138 376233 372616
52457 372616 368312 363558 358992 355289 352814 351514 350891 350215 349089 347701 346395 345319 344643 344599 344913 344743
52441 344743 343735 342600 342018 341549 340455 339117 338608 339110 339858 340537 341661 343397 344979 345674 345648 345593 345944
52424 345944 346608 347081 346774 345684 344661 344613 345606 347199 349327 352203 355705 359670 364545 370901 378497 386745
52408 386745 395964 407131 420377 434579 448350 460294 468395 470595 466604 458252 447687 436066
52396 436066 424180 413053 403237 394435 386585 380511 376790 374699 373067 371632 370755 370359 369977 369608 369735
52381 369735 370651 372357 374941 378429 382353 385983 389032 391701 394078 395954 397289 398445 399735 400995
52367 400995 401857 402366 403100 404574 406632 408625 410132 411273 412343 413463 414721 416212 417730 418793 419371
52352 419371 420234 422112 424748 427228 429053 430431 431761 433286 435107 437077 438843 440403 442381 445270
52338 445270 448672 451802 454560 457499 460967 464882 469259 474334 480166 486547 493230 499973 506637 513522
52324 513522 521134 529125 536178 541650 546723 552998 560513 568275 576225 585325 595913 607374 619409
52311 619409 632335 646025 659876 674062 689535 706416 723594 740329 757137 774527 791976
52300 791976 808785 825002 840820 855901 869934 883140 895604 906828 916560 925398 933911 941753
52288 941753 948339 953892 959182 964547 969701 974191 977621 979779 980972 981915 983006 984018 984661 984984 984999
52273 984999 984462 983316 981875 980288 978367 976234 974572 973815 973589 973386 973430 974458 976931 980782 985726 991671
52257 991671 998998 1008422 1020171 1033338 1046516 1058999 1070855 1081999 1092057 1101184 1110144 1119376
52245 1119376 1128723 1138228 1148255 1158544 1167998 1175869 1182440 1188230 1193302 1197739 1201976 1206117 1209597
52232 1209597 1211964 1213383 1213946 1213265 1211219 1208454 1205601 1202609 1199261 1195674 1191850 1187425 1182433 1177636
52218 1177636 1173472 1169384 1164854 1160530 1157535 1156013 1155032 1153631 1151460 1148687 1145789 1143276 1141366 1140185
52204 1140185 1140266 1142224 1145774 1149840 1153921 1158520 1163907 1169412 1174472 1179428 1184477 1188642 1190753 1190950 1190393
52189 1190393 1189922 1189756 1190004 1190613 1191015 1190586 1189342 1187760 1186215 1184936 1184068 1183318 1182033 1180034 1177830 1175588
52173 1175588 1172615 1168476 1163861 1159636 1155701 1151656 1147947 1145351 1143802 1142680 1141873 1141543 1141120 1139673 1137217
52158 1137217 1134767 1133021 1131793 1130810 1130345 1130893 1132692 1135608 1139074 1142204 1144342 1145435 1145631 1144835 1143003
52143 1143003 1140521 1137800 1134905 1132045 1129972 1129228 1129379 1129676 1130160 1131405 1133478 1135975 1138936 1142935 1148279
52128 1148279 1154756 1162124 1170170 1178226 1185247 1190639 1194703 1198217 1201869 1206049 1211005 1217147 1225142 1235363
52114 1235363 1247214 1259489 1271608 1283985 1297080 1310916 1325867 1342931 1362347 1382673 1402064
52103 1402064 1419934 1436522 1451541 1464449 1475753 1486819 1498412 1510334 1522385 1534658 1546739
52092 1546739 1557556 1566357 1573310 1579060 1584209 1589167 1593869 1597528 1599135 1598275 1595108 1589785 1582439 1573559
52078 1573559 1563726 1553096 1541713 1530206 1519561 1510269 1502281 1495669 1490635 1486949 1484119 1482208 1481903
52065 1481903 1483679 1487385 1492612 1498930 1505728 1512415 1518890 1525395 1531888 1538006 1543720 1549573 1556137 1563488
52051 1563488 1571216 1578740 1585771 1592669 1600114 1608165 1616005 1622939 1629175 1635154 1640576 1644782 1647734 1649866
52037 1649866 1651226 1651506 1650782 1649441 1647417 1644075 1638835 1631447 1622009 1611357 1601159 1592776 1586046 1579823
52023 1579823 1573592 1567860 1563174 1559523 1556679 1554291 1551621 1547865 1542700 1535928 1526818 1514702 1500152
52010 1500152 1484512 1468167 1450250 1430355 1409525 1389084 1369299 1349854 1331012 1313521 1297473
51999 1297473 1281729 1264505 1244501 1221664 1196994 1171583 1145960 1120478 1095834 1072613 1050459
51988 1050459 1028349 1005615 982213 958186 933634 909228 886045 864782 845708 829388 816633
51977 816633 807447 800645 794884 789694 785347 782174 780147 778698 776760 773365 768394 762396 755655 747900
51963 747900 738982 729383 719858 710968 703062 696346 690780 686155 682449 679959 679157 680515 684182 689529
51949 689529 695359 701072 707368 715242 724511 733924 742500 750050 756542 761832 766074 769618 772367 773877
51935 773877 774194 773942 773403 772136 769598 765537 759672 751763 742339 732751 724098 716501 709656 703721 699414
51920 699414 697579 698827 703278 710636 720852 734661 752966 775721 802056 831536 864574 901267
51908 901267 940277 979012 1014252 1042211 1058691 1060252 1045758 1016963 977691 932346 884753 837853
51896 837853 793969 754765 720857 691945 667773 648610 634531 624781 618413 615199 615282 618397 624110
51883 624110 632353 642736 653573 662652 668972 672873 674556 673504 669486 663188 655549 647239 639021 631853
51869 631853 626244 621953 618460 615311 612098 608758 605809 603675 601942 600037 598344 597581 597146 595299 591154
51854 591154 585341 578486 570313 560819 551168 542644 535453 529158 523634 519020 515425 513192 512811 514022
51840 514022 515702 517140 518834 521494 524855 528094 530882 533407 535736 537727 539267 540269 540711 540945 541563
51825 541563 542784 544419 546521 549363 552557 554903 555512 554418 551875 547837 542632 537355 532960 529488
51811 529488 526657 524532 523124 522029 521131 521092 522436 524606 526555 527916 529028 530291 532053 534617 537667
51796 537667 540066 540881 540354 539263 537673 534977 531003 526422 522085 518418 515500 513399 512410 513043 515608
51781 515608 519744 524705 530115 536089 542574 549156 555607 561831 567064 569904 569663 567074 563244 558602
51767 558602 553412 548569 544992 542548 540307 537709 534954 532472 530473 528917 527606 526551 526378 527899
51753 527899 531041 534747 538206 541567 545056 548133 550116 551136 551797 552420 553215 554709 557260 560500 563884
51738 563884 567533 571881 576760 581390 585018 587133 587423 586162 584444 583556 584363 587566 593913 603261 613636
51723 613636 621982 626039 625430 621414 616138 611762 609529 609469 611004 613498 616153 618162 619643 621996 626609
51708 626609 633238 639945 644248 644202 639211 630646 621326 613707 608673 606386 607539 612836 621400 630445 636565
51693 636565 637197 631544 620918 608060 595471 584293 574736 566788 559984 553269 546003 538699 532109
51680 532109 526138 520507 515896 513262 512395 512340 513147 516008 521518 528906 537351 547298 559974 575984 594501
51665 594501 613355 629863 642038 649261 651728 649655 643522 634737 625239 616339 608382 601408 595662
51652 595662 591613 589958 591272 594971 598864 600545 599223 595611 590378 583638 575890 568293 561604 555596
51638 555596 549908 544811 540689 537242 533710 529752 525804 522656 520776 519943 519540 519170 518804 518272 517122
51623 517122 515279 513321 511635 509824 507590 505693 505115 505540 505674 505018 504358 504387 504790 505006 505155 505713 506797
51606 506797 508182 509775 511920 515407 521142 529366 539302 550071 561913 575779 591525 606980 619063
51593 619063 625511 625671 620433 611861 602454 594156 587942 584282 583794 587394 596033 610224 629423 651789
51579 651789 674824 696538 716240 734649 753416 773882 795359 814522 827114 830745 826287 817157
51567 817157 807761 802206 803473 813172 831942 859562 894072 931112 965166 992034 1010185 1020123
51555 1020123 1023177 1020749 1013799 1002509 986607 966071 941273 912629 880730 846864 812787 779760
51543 779760 748183 718280 690710 666350 645825 629316 616379 605789 596032 586366 577279 569767
51531 569767 564236 560139 556528 552881 549434 546595 544085 541032 537173 533584 531689 531784 532988 534516 536412
51516 536412 539000 542187 545535 548763 551979 555469 559223 562621 564778 565274 564341 562328 559400 555940 552709
51501 552709 550255 548605 547825 548234 549544 550476 549982 548398 546589 544424 541004 536144 530636 525120 519549
51486 519549 513820 508154 502716 497469 492478 487963 484077 480996 478927 477548 475894 473486 471199 470178
51472 470178 470241 470270 469914 469806 470197 470449 470012 469011 467763 466628 466389 467841 470800 474346 478180 482880 488653
51455 488653 494825 500908 507325 514731 523473 534280 548806 568647 593686 621237 646528 664562
51443 664562 672841 673000 669486 666467 666056 668652 673376 677727 678089 671718 658311 639713 618615 597479
51429 597479 577834 560095 544307 530987 520708 513116 507217 502610 499554 497858 496759 495992 495918 496355
51415 496355 496486 496287 496917 499071 501970 504683 507515 511261 515753 520023 523451 526171 528708 531738 535783
51400 535783 540707 545875 551052 556671 563082 570185 577974 586601 595606 604054 612007 621043 632707 647180
51386 647180 664060 683696 706936 734117 765058 799691 838090 880108 925113 971382 1015423
51375 1015423 1052831 1080600 1098173 1105990 1104003 1092306 1072122 1045014 1011786 973264 931599 889497
51363 889497 848316 808015 768954 732684 700748 673456 650055 629622 611605 595891 582470
51352 582470 570976 560749 551522 543655 537389 532223 527441 522856 518643 514835 511408 508519 506155 503824
51338 503824 501009 497674 494042 490227 486353 482575 478670 474201 469450 465501 462872 460792 458414 456077
51324 456077 454538 453720 453232 453541 455399 458368 461114 463195 465528 468974 473425 478455 483970 489774 495195
51309 495195 499654 503263 506650 510425 514872 519698 523812 525772 524810 521396 516687 511485 505786 499271
51295 499271 492170 485451 480035 475977 472735 470128 468503 467976 468194 469094 471187 474700 479060 483678 488626
51280 488626 493894 498558 501507 502734 503211 503651 504038 504276 504638 505520 507155 509566 512530 515696 518861 521874
51264 521874 524152 524894 524192 523367 523576 524476 524789 523792 521567 518264 514018 509509 505727 503060 501143 499664
51248 499664 498836 499013 500299 502600 505693 509160 512415 514818 515811 515282 513907 512610 511422 509385 505995
51233 505995 502165 499225 497491 496454 495869 495831 496052 495922 495220 494197 493129 492376 492662 494519 497512 500600
51217 500600 503260 505749 508414 511278 514196 516930 519217 521247 523880 527876 533039 538561 543916 548902
51203 548902 553183 556460 558845 560403 560595 558923 555913 552642 549485 546131 542708 539929 538032 536426
51189 536426 534614 532833 531594 531087 531128 531233 530790 529708 528801 528895 529638 529839 528944 527448 525928 524574 523746
51172 523746 524024 525323 526686 527443 528075 529524 532030 534915 537194 538176 537817 536677 535325 533736 531578
51157 531578 528979 526614 525008 524204 523944 523781 523213 522384 522481 524605 528187 531363 533077 533944 534803 535337 534704
51140 534704 532816 530305 527659 525034 522627 520670 519162 517972 517088 516442 515785 515059 514777 515581 517473 519736
51124 519736 521652 523107 524479 526122 528094 530318 532794 535467 537980 539875 541141 542227 543430 544629
51110 544629 545870 547699 550509 553896 557148 560080 562844 565238 566824 567573 567752 567290 565907 563828 561698
51095 561698 559717 557500 554848 552104 549603 547409 545698 544841 544792 544898 544566 543740 542611 541297 540082 539489
51079 539489 539761 540528 541258 541849 542526 543396 544369 545491 547176 549990 554151 559310 564991 571238 578488 586698
51063 586698 595090 603211 611907 622688 636186 651516 666988 681129 693314 703976 714277 725428
51051 725428 738325 753511 770555 787197 800262 808417 813356 817282 819806 818536 812185 801722 788728
51038 788728 774333 760049 748026 739504 733652 728405 721890 712976 701615 689234 678064 669442 663253
51025 663253 659124 657248 657623 659412 661856 665227 670261 677209 686009 696848 709800 724229 739187
51012 739187 754257 769552 785152 801040 817395 834515 852441 870864 889258 906955 923343
51001 923343 938192 951593 963489 973523 981426 987288 991417 994236 996227 997470 997263 994776 990263
50988 990263 985028 980085 975499 971298 968389 968127 971404 978454 988958 1001877 1015629 1029074 1042304
50975 1042304 1056376 1072653 1092462 1116771 1145652 1178414 1214636 1254741 1299163 1347360 1398255
50964 1398255 1451386 1507011 1564982 1623936 1681787 1736802 1788134 1835426 1878094 1915236 1946346
50953 1946346 1971906 1992997 2010358 2024033 2033884 2040342 2044945 2050402 2059676 2074095 2091946 2109070
50941 2109070 2120996 2124779 2119732 2107313 2090138 2070317 2048502 2024618 1998933 1971692 1942188 1909315
50929 1909315 1872911 1833548 1791096 1744691 1694387 1641767 1588549 1535548 1483388 1433225 1386068
50918 1386068 1342113 1301311 1264026 1230554 1200538 1173375 1148813 1126740 1106821 1088751 1072490
50907 1072490 1057994 1045032 1033501 1023489 1014902 1007446 1001037 995738 991317 987482 984465 982617 981518
50894 981518 980445 979742 980588 983161 986149 988526 990726 993567 997107 1001225 1006349 1012805 1020171 1027977 1036292
50879 1036292 1045082 1053815 1062321 1071250 1081034 1091297 1101919 1113685 1127052 1141242 1155554 1170750
50867 1170750 1188094 1207838 1229798 1254727 1283807 1317219 1354467 1395809 1442246 1494375 1552362
50856 1552362 1616875 1688952 1768986 1856656 1951714 2054010 2162893 2277430 2397061 2521332
50846 2521332 2649183 2779226 2910303 3040741 3167183 3285154 3390859 3481919 3556835 3614944
50836 3614944 3656859 3683868 3696695 3695632 3682041 3658981 3630233 3599353 3569665 3544212 3525228
50825 3525228 3513960 3510943 3515829 3526799 3540636 3553580 3561870 3561787 3549999 3524291 3483821 3428683
50813 3428683 3359438 3276856 3181822 3075662 2960830 2840861 2719139 2598044 2479610 2366446
50803 2366446 2261287 2165989 2081549 2008580 1946970 1895535 1853121 1819901 1796717 1783220 1777682
50792 1777682 1778607 1785523 1797943 1814373 1832732 1851244 1868692 1884256 1897317 1907206 1913149 1914749
50780 1914749 1912326 1906507 1897812 1886977 1875078 1862519 1848290 1830987 1810291 1786664 1760037 1729881
50768 1729881 1696426 1660701 1623400 1584746 1545588 1507577 1471876 1438539 1407436 1379047 1354036
50757 1354036 1332745 1315463 1302592 1294189 1289752 1288642 1290357 1294442 1300660 1309301 1320794 1335051 1351730
50744 1351730 1371110 1394066 1421210 1452749 1489159 1531234 1579348 1633319 1693047 1758616 1829652
50733 1829652 1905161 1984027 2064991 2146139 2225232 2300753 2372104 2438798 2500129 2555471 2603930
50722 2603930 2643603 2672098 2688067 2691563 2683056 2663277 2634274 2599431 2561877 2523713 2487140 2455079
50710 2455079 2429863 2412057 2401240 2397130 2399081 2405165 2412812 2420088 2425639 2427714 2424001 2412263 2390686
50697 2390686 2357985 2313973 2260053 2198724 2132675 2064532 1997040 1932765 1873539 1820471 1774381
50686 1774381 1735933 1705453 1682987 1668561 1662249 1664137 1674344 1693026 1720281 1756141 1800573 1853219
50674 1853219 1913172 1979195 2049925 2123387 2196493 2265785 2328889 2384867 2433232 2473381 2505217
50663 2505217 2529673 2548226 2562238 2572745 2580146 2583760 2582333 2575319 2563197 2546363 2524570 2497936
50651 2497936 2467803 2435958 2403587 2371652 2341774 2315904 2295284 2280361 2271568 2269574 2274716 2286617
50639 2286617 2304288 2326334 2351144 2377188 2403151 2427772 2450027 2469787 2488106 2506663 2527221
50628 2527221 2551419 2579728 2609182 2632286 2639610 2624812 2587997 2535059 2474336 2413362 2357200
50617 2357200 2308345 2267551 2234798 2209860 2192392 2181751 2176772 2175837 2177381 2180461 2184593 2188843 2191260
50604 2191260 2189317 2180855 2164555 2139844 2106758 2065985 2018902 1967371 1913303 1858217 1803183 1749213
50592 1749213 1697517 1649190 1604799 1564474 1528296 1496331 1468451 1444406 1423913 1406367 1390648
50581 1390648 1375638 1360894 1346511 1332573 1319202 1306933 1296448 1288034 1281818 1278368 1278410 1281988 1288568
50568 1288568 1297934 1310308 1325647 1343636 1364484 1388908 1417164 1448849 1483834 1522591 1565296
50557 1565296 1611417 1660486 1712464 1766873 1822283 1877123 1930326 1980763 2026932 2067947 2104248
50546 2104248 2136717 2165698 2191600 2215893 2240590 2266934 2295162 2325212 2356945 2389904 2423592
50535 2423592 2458085 2494080 2532556 2574637 2621414 2673406 2730465 2792507 2859903 2932734 3010071
50524 3010071 3090395 3172182 3253471 3331358 3402706 3465149 3516890 3555971 3580633 3590174 3584614 3563632
50512 3563632 3526663 3474110 3407701 3329565 3241672 3146399 3047021 2947217 2850352 2759396 2677095
50501 2677095 2605784 2547030 2501597 2469742 2451578 2447137 2455978 2476715 2507190 2545234 2588917 2635775
50489 2635775 2682075 2723118 2754083 2770531 2768815 2746941 2705143 2645312 2569934 2481874 2384780
50478 2384780 2282895 2180100 2079249 1982221 1890195 1803846 1723635 1650052 1583398 1523467 1469712
50467 1469712 1421730 1379345 1342301 1310191 1282744 1259982 1242043 1228953 1220550 1216490 1216294 1219347
50455 1219347 1224738 1231142 1237080 1241410 1243535 1243409 1241720 1239953 1239621 1241211 1244241 1248326 1253591 1259962
50441 1259962 1266817 1273746 1280969 1288596 1296149 1303447 1311423 1321336 1333580 1347920 1364495 1383803 1405811
50428 1405811 1429804 1454964 1480573 1505823 1530081 1553350 1575958 1598018 1619704 1641864 1665620
50417 1665620 1691422 1719053 1748447 1779875 1813461 1849271 1887904 1930055 1975168 2021118 2065639
50406 2065639 2107629 2146832 2182772 2214512 2241150 2262063 2276635 2284002 2283081 2272793 2252348 2221453
50394 2221453 2180407 2130176 2072462 2009448 1943215 1875492 1808088 1743292 1683437 1630156 1584371
50383 1584371 1546803 1518083 1498351 1487215 1484245 1489211 1501705 1520762 1544905 1572347 1600978 1628301
50371 1628301 1651533 1667941 1675299 1672344 1658932 1635876 1604698 1567356 1525804 1481586 1435979 1390481
50359 1390481 1346664 1305299 1265934 1227673 1190212 1153986 1119630 1087654 1058447 1032239 1009159
50348 1009159 989417 973276 960671 951169 944487 940811 940455 943535 950126 960391 974342 991840 1012893
50335 1012893 1037205 1062922 1086229 1102784 1109565 1105642 1092278 1072930 1052213 1033554 1017761 1004243
50323 1004243 993059 985006 980277 978149 977961 979498 982475 986495 991587 998080 1005831 1014271 1023210 1032963
50309 1032963 1043580 1054581 1065513 1076113 1085869 1094076 1100601 1106069 1111025 1115232 1117887 1118274 1116313
50296 1116313 1112935 1109711 1107538 1105641 1102359 1096816 1089275 1080182 1069757 1058617 1047840 1038121 1029577
50283 1029577 1022702 1018728 1018511 1021652 1027321 1035509 1046878 1061605 1078896 1097651 1117190 1137270 1157505
50270 1157505 1176845 1193760 1207227 1217612 1226440 1235250 1244810 1255227 1266382 1278041 1289758 1300792
50258 1300792 1310160 1317026 1321376 1324273 1327188 1331196 1337020 1345538 1357728 1374118 1394733 1419635 1449214
50245 1449214 1484024 1524553 1570965 1622585 1677664 1733941 1789429 1842580 1892268 1938299 1981777
50234 1981777 2024289 2066684 2108844 2150133 2189173 2223179 2248265 2260630 2257393 2236912 2199427
50223 2199427 2147502 2085160 2016427 1945066 1875120 1810412 1753201 1704069 1663096 1629966 1602534
50212 1602534 1576331 1546399 1509623 1465499 1415688 1363236 1311341 1261994 1215863 1173459 1135679
50201 1135679 1102897 1074348 1048997 1026543 1007076 990218 975175 961365 948623 937075 927060
50190 927060 918846 912220 906709 902341 899636 898637 898612 899052 900394 903314 907779 913167 918817 924058 928348
50175 928348 931956 936046 941409 947406 952650 956490 959343 962002 965119 969093 973787 978490 982746 987205
50161 987205 993193 1001473 1011756 1023363 1035967 1049584 1064034 1078501 1091622 1102169 1109782 1114965
50149 1114965 1118443 1120755 1122374 1123694 1124768 1125542 1126594 1129326 1135238 1145314 1160164 1180239 1205625
50136 1205625 1236076 1271502 1312026 1357435 1407194 1461507 1522020 1591026 1670125 1759643 1858640
50125 1858640 1964895 2075203 2186224 2295093 2399474 2497954 2590953 2680771 2770041 2860076
50115 2860076 2950516 3039531 3123505 3196831 3252870 3285406 3289640 3263069 3206493 3123959 3020998
50104 3020998 2902778 2773929 2639119 2502721 2368073 2237798 2114617 2001093 1898644
50095 1898644 1807391 1726832 1655982 1592962 1535298 1480975 1429036 1379364 1332430 1289178 1250448
50084 1250448 1216322 1186267 1159835 1136883 1117308 1101086 1088504 1079790 1074438 1071311 1069430 1068325
50072 1068325 1067674 1067127 1066621 1066537 1067415 1069559 1072802 1076469 1079802 1082701 1085777 1089345 1092710 1094895 1095802 1096122
50056 1096122 1096343 1096437 1096326 1096005 1095296 1094118 1092918 1092284 1092274 1092811 1094531 1098275 1103638 1109014 1113419 1117480
50040 1117480 1122267 1127986 1134371 1141597 1150050 1159646 1170152 1181820 1194929 1208837 1222242 1234482
50028 1234482 1246100 1258213 1271832 1287638 1305589 1324337 1341567 1355493 1366009 1374331 1381887 1389941
50016 1389941 1400014 1413929 1433126 1457986 1487907 1521922 1559329 1600071 1644743 1694111 1748427
50005 1748427 1807057 1868579 1930992 1991932 2049162 2101201 2147480 2187963 2223055 2253949 2282374
49994 2282374 2309283 2333731 2353065 2363614 2360781 2339496 2296258 2231385 2148820 2053753 1951004
49983 1951004 1845248 1741123 1642201 1550461 1467267 1394030 1331239 1277639 1231376 1191588 1158122
49972 1158122 1130167 1106240 1085481 1068110 1054504 1044531 1037880 1034436 1034115 1036640 1041567 1048194 1055477
49959 1055477 1062288 1067749 1071077 1071413 1068341 1062413 1054687 1045802 1035829 1024742 1012355 998093 981625
49946 981625 963868 946635 931092 917117 904248 892441 881576 870918 859745 848170 836876
49935 836876 826282 816443 807554 800017 793971 789131 785204 782263 780617 780352 781111 782382 784110 786952
49921 786952 791711 798416 806111 813636 820478 826773 832785 838727 845122 852902 862714 874081 885438 895139
49907 895139 902400 907350 910643 913316 916554 920752 924600 925585 921743 912708 899214 882346 863637 845062
49893 845062 827995 812327 797262 782960 770798 761999 756535 753388 751328 749252 746236 741722 735667
49880 735667 728542 721294 715103 710711 707862 705699 703817 702717 703172 705458 709334 714523 720985 728779
49866 728779 737828 747785 758108 768204 777494 785420 791564 795867 798628 800294 801369 802435 803781 804840
49852 804840 804336 801370 796145 789433 781699 773159 764361 756090 748759 742378 737087 733234 730866 729595
49838 729595 729082 729261 729984 730809 731434 732144 733636 736459 740730 746234 752680 759817 767328 774695 781336 786934
49822 786934 791515 795231 798348 801457 805216 809509 813116 814655 813775 811151 807489 802914 797244 790533
49808 790533 783340 776683 771622 768563 766971 765957 765055 764311 763831 763553 763371 763211 763033 762916 763027 763402 763973
49791 763973 764972 766994 770462 775353 781591 789212 797735 805910 812719 818374 823814 829468 835048 840292
49777 840292 845205 849701 853589 856863 859441 860735 860034 857267 852842 846844 838967 829223 818181 806452
49763 806452 794437 782512 770946 759712 748878 739075 730946 724174 717700 710984 704550 699306 695837
49750 695837 694242 693932 693653 692389 690342 688427 686894 685262 683523 682449 682486 683340 684906 687566 691157
49735 691157 694623 697391 700311 704525 710129 716651 724064 732298 740255 746426 750408 753022 755009 756445
49721 756445 757380 758156 758757 758430 756370 752431 746977 740383 733024 725571 718892 713586 709678 706819 704659
49706 704659 702988 701597 700220 698833 697833 697747 698711 700388 702382 704615 707338 710951 715736 721575 727946
49691 727946 734349 740671 747024 753501 760333 767975 776568 785504 794074 802393 811100 820210 828950 836758
49677 836758 843670 849453 853092 853637 851149 846409 840075 832505 824077 815211 806288 797910 791114 786876
49663 786876 785288 785241 784902 782633 777869 771346 764336 757560 750924 744149 737313 730764 724898 720141 716781
49648 716781 714654 713245 712229 711680 711724 712258 713091 714055 714938 715568 715922 715889 714998 712798 709468 705640 701705
49631 701705 697746 694078 691274 689581 688783 688621 688789 688616 687478 685680 684277 683868 684139 684613 685155 685615
49615 685615 685773 685880 686510 687642 688577 689032 689429 689883 689810 689019 688196 687775 687225 686175 685338 685438 686057 686541
49597 686541 687402 689652 693125 696578 699228 701204 702619 703240 703178 703082 703423 704173 705219 706570 708135 709815
49581 709815 711870 714666 717984 720998 723029 724113 724951 726560 729732 734426 739759 744959 750241 756525
49567 756525 764530 774384 785690 797511 808503 817593 824487 829320 832171 833258 833099 831972 829521 825463
49553 825463 820381 815312 810798 806836 803478 800950 799446 799224 800495 802679 804238 804009 802433 800897 800303
49538 800303 801003 803540 808302 814674 821670 829411 838978 850851 864637 880493 899538 922248 947294
49525 947294 972526 996452 1018281 1037238 1052709 1064857 1074564 1082845 1090552 1098405 1106932 1116270 1125913
49512 1125913 1134443 1139692 1139672 1133541 1121571 1104496 1083446 1060325 1037383 1016010 996306 977942
49500 977942 961005 945837 932532 920873 910579 901510 893902 888239 884580 882165 880223 878982 879198
49487 879198 880698 882215 882892 883263 884442 886941 890644 895338 900767 906517 912220 917731 922997 928123 933626
49472 933626 940043 947010 953242 957719 960517 962210 963009 962836 961753 959795 956721 952364 946899 940340 932156
49457 932156 922022 910799 900170 891193 883566 876364 869201 862504 856810 852105 848012 844633 842712
49444 842712 842667 843793 845075 846672 849801 855004 861401 867998 874905 882556 890361 897159 902758 908177 914366
49429 914366 921480 929553 939016 949915 960875 969428 973552 972938 968968 963713 958851 955181 952777 951447
49415 951447 951189 952428 955867 962065 971187 983173 997881 1014717 1032318 1049167 1064750 1079808 1095284
49402 1095284 1111344 1127531 1143473 1159049 1174065 1188141 1200895 1212017 1221261 1228505 1233794 1237173
49390 1237173 1238519 1237661 1234572 1229366 1222173 1213117 1202380 1190273 1177323 1164243 1151694 1140080 1129696
49377 1129696 1120887 1113771 1108040 1103549 1101066 1101723 1105469 1110663 1115587 1119909 1124229 1128618 1132264 1134236
49363 1134236 1133982 1131167 1125727 1118236 1109745 1101063 1092464 1084087 1076248 1069201 1062922 1057297 1052282 1047753
49349 1047753 1043481 1039475 1036120 1033702 1031870 1029822 1027012 1023521 1019706 1015688 1011314 1006525 1001626 997096
49335 997096 993213 989919 987082 984853 983715 984182 986422 990137 994780 999921 1005408 1011245 1017418 1023908
49321 1023908 1030808 1038271 1046333 1054856 1063706 1073029 1083296 1095016 1108278 1122685 1137919 1154388
49309 1154388 1173023 1194344 1218088 1244005 1272567 1304048 1336646 1365952 1386809 1396027 1393649 1382148
49297 1382148 1364567 1343058 1318638 1292094 1265013 1239772 1218444 1201880 1189907 1182233 1178940 1180242
49285 1180242 1186078 1195907 1208533 1221878 1233217 1240260 1242416 1241006 1238144 1235430 1233610 1233027 1233883 1236216
49271 1236216 1240098 1245980 1254486 1265691 1278934 1293573 1309879 1329327 1354217 1386514 1426048 1469575
49259 1469575 1512399 1551223 1584627 1610524 1624691 1623345 1606637 1578234 1541750 1498990 1451607
49248 1451607 1402671 1355708 1313117 1276102 1245162 1219766 1198217 1178828 1161151 1145623 1132489
49237 1132489 1121649 1113164 1107145 1103302 1101181 1100760 1102308 1105788 1110923 1117794 1126797 1137847 1149999
49224 1149999 1162016 1173056 1182737 1190869 1197454 1202907 1208007 1213403 1219148 1224923 1230834 1237798 1246899
49211 1246899 1258471 1272077 1287296 1304093 1322429 1341934 1362068 1382268 1401905 1420477 1437986
49200 1437986 1454772 1470901 1486054 1500001 1512591 1523258 1531189 1536403 1540092 1543487 1546851 1549935
49188 1549935 1552930 1556495 1561377 1568614 1579630 1595317 1615252 1638614 1666017 1699911 1743201 1797737
49176 1797737 1863486 1937695 2014035 2083122 2135184 2163584 2167231 2150734 2122224 2089893 2059165
49165 2059165 2032170 2009056 1989385 1972578 1958006 1945331 1934759 1926779 1921702 1919501 1919951 1922731
49153 1922731 1927519 1934100 1942444 1952634 1964693 1978416 1993259 2008353 2022715 2035632 2047103 2057991
49141 2057991 2069536 2082446 2096460 2110924 2125600 2140594 2155694 2170349 2184351 2198036 2211627
49130 2211627 2224907 2237851 2251118 2265482 2281061 2297559 2315047 2334159 2355700 2380396 2408835
49119 2408835 2441328 2478032 2519534 2567163 2622664 2688180 2767091 2863747 2980018 3110472 3241647
49108 3241647 3358885 3457166 3546535 3644659 3759543 3876600 3963854 3993623 3962362 3891148 3807778
49097 3807778 3727780 3649359 3562038 3458365 3339783 3215050 3094656 2985878 2891503 2811752
49087 2811752 2746318 2694445 2654176 2622625 2597111 2575753 2557303 2541037 2526826 2514775 2504577
49076 2504577 2495454 2486815 2478767 2471938 2466825 2463293 2460524 2457559 2454080 2450636 2447890 2445675 2443014 2439122
49062 2439122 2434151 2428849 2423738 2418846 2414124 2409724 2405739 2401926 2397921 2393689 2389577 2386026 2383447 2382399
49048 2382399 2383576 2387459 2394036 2402871 2413070 2422965 2430146 2432396 2428862 2420389 2408842 2396246 2384328
49035 2384328 2374404 2367360 2363657 2363289 2365734 2370142 2375837 2382606 2390389 2398763 2406926 2414171 2420242 2425359
49021 2425359 2430136 2435443 2442033 2450125 2459328 2468950 2478349 2487189 2495612 2504106 2513040 2522345 2531794 2541384
49007 2541384 2551173 2560907 2570142 2578800 2587301 2596153 2605590 2615553 2625735 2635775 2645731 2656274 2667869
48994 2667869 2679712 2690012 2697615 2702905 2706939 2710113 2712152 2712983 2713019 2712577 2711477 2709268 2705577 2700182
48980 2700182 2693028 2684258 2674078 2662618 2650017 2636597 2622762 2608837 2595268 2582867 2572482 2564383
48968 2564383 2558309 2554242 2552701 2553990 2557422 2561721 2566102 2570616 2575612 2581323 2588106 2596578 2607088 2619218
48954 2619218 2632051 2644813 2657029 2668255 2678120 2686719 2694659 2702565 2710678 2718956 2727408 2736241 2745860
48941 2745860 2756800 2769488 2784003 2800276 2818585 2839560 2863591 2890405 2919441 2950377 2983098
48930 2983098 3017388 3053114 3090657 3130800 3174038 3220132 3268341 3317876 3368130 3418792 3470063
48919 3470063 3522742 3577878 3636078 3697003 3759456 3822059 3883985 3945151 4005848 4066243 4126166
48908 4126166 4185235 4243232 4300514 4357932 4415989 4474054 4530865 4585896 4639752 4692925 4744673
48897 4744673 4793687 4839413 4881940 4920748 4954593 4983052 5007469 5029868 5051262 5071442 5089914
48886 5089914 5106336 5120232 5130997 5138411 5142610 5143295 5139359 5129618 5113726 5092226 5066036 5036238
48874 5036238 5004005 4970103 4934410 4896463 4856519 4815541 4773904 4730754 4685177 4637587 4589344
48863 4589344 4541215 4492917 4444058 4394768 4345227 4295267 4244726 4193676 4142032 4089620 4037145
48852 4037145 3986550 3939605 3896402 3855892 3817754 3782970 3752518 3726224 3703173 3682709 3664672
48841 3664672 3649036 3635690 3624421 3614823 3606340 3598669 3592082 3587265 3584915 3585574 3589613 3597094 3607614
48828 3607614 3620524 3635390 3652245 3671373 3692907 3716634 3742080 3768744 3796332 3824907 3854843
48817 3854843 3886589 3920359 3955973 3992832 4029905 4065828 4099390 4130208 4158885 4186404 4213510
48806 4213510 4240744 4268632 4297357 4326448 4355310 4384071 4413420 4443606 4474204 4504948 4536105
48795 4536105 4567563 4598044 4625746 4649499 4668941 4683940 4694444 4700814 4703923 4704890 4704873 4704863 4705349 4706323
48781 4706323 4707775 4709866 4712266 4713747 4712987 4709640 4704140 4696620 4686617 4673808 4658457 4640974 4621445
48768 4621445 4599783 4576149 4551070 4525130 4498359 4469873 4438438 4403631 4366117 4326453 4284124
48757 4284124 4238244 4188779 4136451 4081948 4026137 3970872 3918414 3869844 3824829 3783052 3744893
48746 3744893 3710314 3677860 3645410 3611440 3575342 3537312 3498593 3461297 3427176 3396637 3369295
48735 3369295 3345104 3324426 3307294 3293242 3281826 3272826 3265960 3260814 3257180 3255212 3255144 3256915 3260056
48722 3260056 3263872 3267827 3271851 3276170 3280945 3286230 3292148 3298615 3304881 3309905 3313526 3316848 3321152 3326734
48708 3326734 3333034 3339483 3345806 3351802 3357397 3362800 3368244 3373581 3378395 3382365 3385335 3387216 3388045 3387969 3387050
48693 3387050 3385398 3383690 3383045 3383983 3385908 3388097 3390738 3394298 3398254 3401341 3403050 3403957 3404538 3404499 3403684 3402847
48677 3402847 3402955 3404155 3406050 3408685 3412647 3418191 3424718 3431238 3437124 3442401 3447463 3452598 3457593 3461608
48663 3461608 3463239 3460665 3452000 3436009 3412761 3383522 3349922 3313360 3275162 3236835 3199658 3163984
48651 3163984 3129249 3094788 3060590 3027268 2995504 2965656 2937790 2911815 2887391 2863740 2839812
48640 2839812 2814866 2788872 2762162 2734753 2706249 2676519 2646210 2616335 2587417 2559235 2531444
48629 2531444 2504293 2478633 2455301 2434549 2416065 2399415 2384334 2370592 2357783 2345513 2333755
48618 2333755 2322748 2312439 2302276 2291787 2281165 2270954 2261220 2251517 2241861 2233334 2227266 2223860
48606 2223860 2221900 2219824 2216752 2212467 2206885 2200004 2192264 2184480 2177258 2170641 2164477 2158897 2154187 2150261
48592 2150261 2146525 2142320 2137397 2131897 2126062 2120094 2114257 2108887 2104264 2100566 2098007 2096872 2097353 2099351
48578 2099351 2102605 2107000 2112696 2119958 2128976 2139768 2152031 2164846 2176631 2185601 2190483 2190812 2186687
48565 2186687 2178458 2166775 2152779 2137882 2123153 2108932 2095087 2081539 2068331 2055237 2041612
48554 2041612 2026885 2011119 1994887 1978626 1962355 1946113 1930404 1915927 1902923 1891068 1879985
48543 1879985 1869636 1860112 1851345 1843310 1836319 1830735 1826352 1822408 1818434 1814864 1812603 1812203 1813694 1817117
48529 1817117 1822889 1831674 1844190 1861161 1883314 1911608 1947657 1993287 2048103 2106459 2157379 2189060
48517 2189060 2194946 2176498 2141003 2097130 2051678 2008776 1970558 1937987 1911252 1889927 1873382
48506 1873382 1861371 1854238 1852539 1856623 1866687 1882972 1905892 1936273 1975267 2022678 2073866 2118418
48494 2118418 2143630 2141182 2111511 2062347 2003532 1942871 1885275 1833733 1789864 1753663 1723680
48483 1723680 1698300 1676991 1659998 1646919 1636275 1626806 1618607 1612399 1608138 1605138 1603312 1603326 1605382
48470 1605382 1608692 1612484 1616878 1622329 1628630 1634851 1639948 1643139 1644084 1643076 1640897 1638145 1634849 1630866
48456 1630866 1626377 1621690 1616738 1611033 1604097 1595788 1586202 1575383 1563205 1549632 1535061 1520207 1505578
48443 1505578 1491308 1477673 1465341 1454792 1445788 1437790 1430562 1423942 1417474 1410957 1405040 1400548 1397421
48430 1397421 1395029 1393229 1392228 1391606 1390459 1388517 1386145 1383211 1378967 1373189 1366434 1358999 1350650 1341598
48416 1341598 1332680 1324180 1315493 1306379 1297603 1289780 1282534 1275342 1268387 1261928 1255692 1249472 1243630 1238424
48402 1238424 1233585 1229070 1225489 1223148 1221382 1219421 1217260 1215116 1212736 1209827 1206536 1202981 1198996 1194782
48388 1194782 1191037 1187902 1184575 1180545 1176376 1172662 1169066 1165142 1161323 1158284 1155905 1153502 1150613 1147057
48374 1147057 1142894 1138790 1135711 1133837 1132487 1131371 1130981 1131475 1132308 1133393 1135431 1138570 1141954 1145165 1148829
48359 1148829 1153181 1157377 1160934 1164556 1168815 1173382 1178218 1184202 1191817 1200591 1210443 1222028 1235253
48346 1235253 1249214 1264276 1282283 1304113 1329107 1357393 1389875 1424676 1456336 1480316 1496168
48335 1496168 1505398 1509439 1511366 1516156 1526553 1541225 1558919 1581287 1609320 1640512 1672560 1706678
48323 1706678 1744196 1783278 1822442 1864091 1910930 1962230 2017258 2078855 2149560 2228059 2313883
48312 2313883 2411657 2526027 2656747 2804130 2974800 3176563 3413040 3690383 4024293 4433452
48302 4433452 4931901 5535259 6266998 7150329 8204661 9462797 10982300 12831260 15085653
48293 15085653 17854049 21236208 25132582 29040358 32118341 33589167 33169467 31158895
48285 31158895 28167784 24783098 21414914 18304852 15569598 13234312 11273677 9649563
48277 9649563 8320341 7236258 6347907 5619238 5024107 4535658 4128444 3786530 3500586
48268 3500586 3259885 3053807 2877335 2728009 2600173 2487976 2390681 2309072 2239380 2176208
48258 2176208 2118694 2068365 2023352 1980100 1938825 1902236 1870482 1841891 1816925 1796865 1779991
48247 1779991 1763459 1747816 1735604 1726587 1718318 1710538 1705219 1702977 1703087 1706544 1715551 1729764 1745445
48234 1745445 1758039 1763588 1758878 1743244 1719958 1693605 1666532 1639478 1614055 1591878 1572165 1552973
48222 1552973 1534200 1516943 1500622 1483327 1464670 1445963 1427796 1409483 1390590 1371205 1351078
48211 1351078 1330171 1309480 1289657 1269586 1248048 1225946 1205054 1185432 1166052 1147152 1129798
48200 1129798 1113754 1097951 1082691 1069402 1058499 1049233 1041227 1034408 1027879 1020743 1013697 1008078 1003676
48187 1003676 999117 994035 989162 984661 980049 975429 971219 967033 962396 958049 954945 952456 949300 945803
48173 945803 943420 942394 941640 940615 939513 937868 934903 931182 928185 926234 924464 922804 922235 922939 923716
48158 923716 923515 922326 920575 918847 918100 918820 920099 920732 920935 921670 922688 922868 922263 922149 923053 924323 925681
48141 925681 927608 930003 931901 932851 933344 933747 934003 934459 935753 937831 940142 942778 946232 950155 953605
48126 953605 956401 958933 960852 961450 961343 962197 964571 967448 970071 972821 975998 979175 982165 985396 988895
48111 988895 992057 994803 997885 1001740 1006067 1010819 1016519 1023255 1030362 1037453 1044837 1052676 1060624 1068551
48097 1068551 1076798 1085522 1094609 1104273 1114815 1125785 1136329 1146429 1156838 1167786 1178784 1189735
48085 1189735 1201089 1212843 1224492 1236115 1248358 1261193 1273803 1285885 1297967 1310279 1322479
48074 1322479 1334708 1347720 1361655 1375841 1390182 1405598 1422539 1439907 1455914 1469230 1479224
48063 1479224 1486093 1491088 1495616 1499753 1502378 1502789 1501136 1497265 1490545 1481279 1471093 1461381 1452361 1443978
48049 1443978 1436437 1429241 1420887 1410275 1397587 1383299 1367451 1350622 1334416 1319944 1306542 1292915
48037 1292915 1278863 1264968 1251156 1236571 1220718 1204013 1187345 1171443 1156393 1141495 1125956
48026 1125956 1109923 1094287 1079346 1064409 1049095 1034186 1020615 1008257 996435 985071 974605
48015 974605 965103 956170 947619 939676 932527 926078 920221 915104 911006 907913 905230 902106 898251 894182
48001 894182 890501 887268 884415 882242 880873 879695 878160 876805 876581 877421 878381 879008 879541 879880 879545 878717
47985 878717 878129 877730 876601 874497 872428 871231 870523 869553 868263 866963 865679 864298 862774 860860 858238
47970 858238 855178 852429 850210 847987 845445 842964 840850 838799 836414 833686 830789 827983 825749 824338
47956 824338 823181 821608 820108 819863 821046 822674 824267 826371 829146 831788 833956 836563 840422 845110
47942 845110 849953 855175 861300 868207 875547 883437 892037 901055 910233 919628 928935 937343 944738 952221
47928 952221 960634 969223 976586 982355 987146 991362 994857 997431 998933 999118 997984 996005 993640 990893
47914 990893 987640 983970 979900 975203 969837 964017 957703 950620 943042 935844 929491 923687 918273 913635
47900 913635 909889 906589 903764 902292 902632 903983 905387 906904 909022 911679 914602 917933 921737 925514
47886 925514 928939 932543 936959 942001 947199 952678 958810 965483 972382 979535 987017 994561 1002026 1009665
47872 1009665 1017358 1024156 1029207 1032572 1034605 1035258 1034661 1033598 1032527 1030712 1027244 1022401 1017169 1011883
47858 1011883 1006257 1000380 994660 988900 982187 973677 963084 950763 937809 925639 914905 905122 895788
47845 895788 887335 880506 875456 872059 870366 870029 869967 869544 869511 870930 873668 876894 880529 885121 890653 896552
47829 896552 902768 909832 917945 926798 936291 946683 958066 970253 983123 996661 1010935 1026539
47817 1026539 1044548 1065294 1087472 1109188 1129612 1148966 1167229 1183690 1197643 1208806 1217162
47806 1217162 1222873 1226130 1226649 1223660 1216933 1207332 1195826 1182550 1167605 1152172 1137835 1125126 1113655
47793 1113655 1103376 1094815 1088246 1083561 1080897 1080540 1082248 1085306 1089121 1093220 1096937 1099870 1102458 1105431
47779 1105431 1108822 1112086 1114864 1116942 1117843 1117313 1116012 1114948 1114269 1113191 1110881 1106963 1101557 1095498 1090072
47764 1090072 1085783 1081787 1077092 1071748 1066079 1059571 1051714 1043367 1035992 1029733 1023477 1016612 1009576 1002854
47750 1002854 996615 991217 986921 983147 979121 975202 972444 970971 970005 969546 970651 973845 978439 983719
47736 983719 989728 996584 1004119 1012547 1022498 1033967 1046107 1058351 1070925 1084007 1097315 1110794
47724 1110794 1124779 1139127 1153050 1166117 1178568 1190333 1200625 1208857 1215145 1219564 1221819 1222059
47712 1222059 1221129 1219466 1216477 1211448 1204381 1195543 1184990 1173090 1160779 1148743 1136891 1125098 1113823
47699 1113823 1103541 1094169 1085613 1078343 1072841 1068955 1066258 1064619 1063980 1064026 1064542 1065740 1067872 1070919 1074960
47684 1074960 1080326 1086986 1094282 1101745 1109746 1118848 1128933 1139503 1150535 1162442 1175307 1188609
47672 1188609 1201658 1213958 1225170 1234991 1243151 1249507 1254240 1257894 1260945 1263367 1264810 1265109 1264241 1261915
47658 1261915 1257761 1251988 1245373 1238429 1230988 1222718 1213630 1203961 1194000 1184207 1175199 1167464 1161316 1157102
47644 1157102 1155126 1155366 1157553 1161515 1167204 1174645 1184246 1196856 1212899 1231660 1252043 1273780 1297128
47631 1297128 1321646 1346299 1370681 1395019 1418721 1440050 1457704 1471823 1482888 1490412 1493295 1490873
47619 1490873 1483002 1469650 1451021 1427806 1400860 1370901 1338795 1305729 1272701 1240103 1208098
47608 1208098 1177218 1148394 1122555 1100154 1080727 1062975 1045765 1029112 1013815 1000296 988416
47597 988416 978203 969895 963178 957247 951743 946785 941923 936108 929134 922197 916476 911878 907728 903904
47583 903904 900650 897851 895190 892588 890024 887357 884774 882862 881760 880792 879438 878044 877024 875990
47569 875990 874413 872595 871067 869342 866239 861436 855970 851049 846833 842517 837301 831156 824834 819172
47555 819172 814383 810149 806272 802783 799401 795429 790514 785175 780306 776458 773696 771703 769824 767499
47541 767499 764941 762993 762094 761795 761453 760859 759948 758532 756815 755662 755891 757582 760349 763812 767435 770410
47525 770410 772245 773283 774267 775604 777185 778522 778914 777960 776189 774746 774212 774196 774213 774233 774148 773492 772131
47508 772131 770569 769068 767202 764849 762921 762335 762801 763353 763595 763664 763467 762832 762169 762108 762511 762470 761237 758787
47490 758787 755715 752974 751383 750841 750306 749017 747425 746459 746357 746832 747941 749932 752418 754560 756044
47475 756044 757331 759002 761385 764627 768524 772376 775656 778781 782686 787668 793176 798575 803484 807427
47461 807427 809874 810922 811513 812766 815285 819037 823508 828008 832228 836656 842225 849531 858576 869134
47447 869134 881045 894146 908127 922468 936509 949788 962438 974968 987397 998847 1008216 1015024
47435 1015024 1019420 1021729 1022333 1021733 1020356 1018412 1016057 1013425 1010420 1006895 1003196 1000021 997494 995019
47421 995019 992420 990627 990655 992302 994396 995896 996326 995671 994472 993540 992922 991518 988327 983614 978214 972230
47405 972230 965316 957793 950428 943302 935870 928067 920455 913274 906258 899443 893315 887988 883011 878249
47391 878249 874261 871544 869957 869089 868686 868543 868494 868756 869905 872340 876092 881135 887452 894741 902520 910596
47375 910596 918992 927461 935552 943188 950647 957863 964271 969505 973662 976697 978010 977079 974147 969960
47361 969960 965001 959246 952548 944948 936553 927307 917055 905960 894641 883627 872672 861148 849202
47348 849202 837949 828153 819332 810685 802410 795323 789486 784061 778441 772784 767403 762292 757383 752727
47334 752727 748361 744425 741369 739530 738552 737772 737147 737168 737922 738955 740183 742167 745145 748419 751123 753231
47318 753231 755471 758500 762331 766294 769476 771584 773409 775972 779139 781590 782340 781701 780468 778809 776521
47303 776521 773889 771571 769743 767957 765874 763640 761444 759154 756642 754283 752782 752495 753068 753814 754422
47288 754422 755241 756961 760066 764474 769611 774888 780238 786132 792918 800332 807919 815783 824474 834155
47274 834155 844322 854414 864273 873877 883145 892234 901563 911297 921148 930920 940883 951403 962656
47261 962656 974930 988747 1004492 1022195 1041470 1060635 1075776 1082088 1077302 1063318 1044006 1022336
47249 1022336 1000268 979896 962749 948338 934989 922135 910583 900721 891978 884248 878469 875237
47237 875237 873878 873300 872949 872588 872092 871894 872869 875298 878574 882237 886547 891661 897016 902055 906946 912124
47221 912124 917622 923411 929865 937294 945314 953169 960475 967270 973535 979025 983520 987012 989704 991823
47207 991823 993233 993369 991818 988823 984754 979321 971983 963123 954012 945399 936900 928108 919619 912461
47193 912461 906939 902530 898607 894899 891534 888960 887607 887398 887877 888979 891325 895451 901070 907404 913996
47178 913996 920988 928831 938015 948917 961639 975954 991423 1007479 1023545 1039370 1055238 1071617
47166 1071617 1088642 1106103 1123710 1140928 1156699 1169871 1180064 1187808 1193879 1198733 1202386 1204356
47154 1204356 1203870 1200644 1195367 1188938 1181445 1172535 1162576 1152626 1143174 1133725 1123762 1113434 1103176 1093379
47140 1093379 1084642 1077615 1072280 1067988 1064376 1061667 1059953 1058939 1058671 1059745 1062397 1066035 1070055 1074533
47126 1074533 1079793 1085886 1092833 1100724 1109098 1116846 1123275 1128839 1134360 1139920 1144876 1148473 1150092 1149371
47112 1149371 1146593 1142600 1137940 1132437 1125853 1118454 1110587 1102175 1093063 1083477 1073761 1064000 1054247 1044651
47098 1044651 1035089 1025060 1014301 1003083 991638 979833 967755 956065 945362 935639 926706 918629
47086 918629 911444 905058 899843 896641 895592 895528 895215 894724 894947 896213 898094 900174 902332 904514 906883
47071 906883 909920 913788 917874 921513 924862 928445 932143 935334 937821 939915 941739 943098 943980 944485 944298
47056 944298 942881 940300 937386 934926 933149 932071 931934 933024 935263 938119 940987 943746 947000 951512
47042 951512 957335 963759 970211 976783 983739 991018 998587 1006748 1015548 1024205 1031717 1037899 1043398 1048887
47028 1048887 1054634 1060675 1066924 1073133 1079078 1084798 1090525 1096556 1103272 1110914 1119158 1127274 1134845 1141906
47014 1141906 1148246 1153287 1156957 1159938 1162517 1163892 1163271 1161020 1157923 1153959 1148767 1142861 1137220 1131930
47000 1131930 1126355 1120595 1115634 1111895 1108683 1105400 1102374 1100055 1098164 1096232 1094423 1093262 1092907 1093224
46986 1093224 1094295 1096312 1099103 1102199 1105491 1109475 1114692 1121048 1127887 1134806 1142116 1150297 1159196 1168209
46972 1168209 1177209 1186687 1196723 1206471 1215183 1223317 1232030 1241771 1251959 1261964 1271838 1282043 1292757
46959 1292757 1303441 1312881 1319890 1324337 1327355 1330210 1333115 1335452 1336736 1336888 1335818 1333500 1330458 1327662
46945 1327662 1325819 1325115 1325558 1327076 1329304 1331759 1334383 1337547 1341482 1346030 1350982 1356318 1362009 1367908
46931 1367908 1373921 1380121 1386639 1393602 1401079 1408889 1416560 1423737 1430596 1437636 1445067 1452599 1459769 1466282
46917 1466282 1472086 1477316 1482113 1486429 1490045 1492768 1494443 1494816 1493698 1491210 1487439 1481899 1473948 1463901
46903 1463901 1453106 1442621 1432507 1422777 1414248 1407755 1403115 1399679 1397490 1397159 1398907 1402523 1408105
46890 1408105 1416107 1426696 1439574 1454288 1470302 1487040 1504362 1522619 1541683 1560457 1578066
46879 1578066 1595067 1612452 1629781 1645423 1658497 1669486 1678862 1686241 1691265 1694463 1696769 1698810
46867 1698810 1700927 1703349 1706084 1709079 1712601 1716956 1721850 1726723 1731789 1738057 1746147 1755737 1766311 1777807
46853 1777807 1790260 1803444 1817139 1831171 1844965 1857654 1868900 1879056 1888273 1896048 1901942 1906091
46841 1906091 1908627 1909156 1907330 1903493 1898270 1891903 1884414 1876096 1867416 1858685 1850204 1842459 1835789 1830073
46827 1830073 1825140 1821294 1819103 1818802 1820208 1823112 1827491 1833483 1841431 1851891 1865222 1881089 1898530
46814 1898530 1916591 1934858 1953391 1972259 1991200 2009653 2026961 2042458 2055499 2065657 2072891
46803 2072891 2077371 2079196 2078597 2076260 2072857 2068166 2061337 2052338 2042450 2032878 2023553 2013965 2004504 1995988
46789 1995988 1988294 1980502 1972334 1964483 1957496 1951241 1945602 1940851 1937149 1934361 1932557 1931965 1932241 1932453 1932067
46774 1932067 1931354 1930630 1929725 1928445 1926967 1925489 1923982 1922561 1921584 1921140 1920898 1920703 1920831 1921526 1922823 1925082
46758 1925082 1929071 1935193 1943073 1952217 1962619 1974393 1987258 2000751 2014706 2029204 2044324 2060034
46746 2060034 2076097 2091965 2107112 2121523 2135473 2148787 2160817 2171122 2179697 2186517 2191534 2195244
46734 2195244 2198529 2201653 2204002 2205044 2204999 2204370 2203540 2203171 2204264 2207275 2211580 2216169 2220512 2224609 2228860
46719 2228860 2234180 2241539 2250792 2260512 2269459 2277643 2285567 2293108 2299839 2305793 2310948 2314289 2314320 2310523
46705 2310523 2303670 2294737 2284058 2271478 2256690 2239255 2218811 2195574 2170550 2145089 2120127 2095678
46693 2095678 2071011 2045525 2019548 1994010 1969358 1945169 1920991 1897086 1874102 1852387 1831922
46682 1831922 1812621 1794364 1776991 1760506 1745077 1730734 1717345 1704942 1693618 1683041 1672612
46671 1672612 1662320 1652828 1644496 1636979 1630118 1624505 1620637 1618090 1616194 1615017 1615064 1616510 1619443 1624486
46657 1624486 1632284 1642510 1654023 1665887 1677680 1689083 1699958 1710766 1722132 1733797 1744524
46646 1744524 1753182 1759537 1764051 1767407 1770248 1772797 1774533 1774653 1773065 1770609 1768220 1766308 1765142 1765408
46632 1765408 1767963 1773223 1781109 1791452 1804129 1818830 1835144 1853085 1873239 1895950 1920445 1945155
46620 1945155 1968933 1991503 2012688 2031843 2048405 2062371 2073575 2080979 2083493 2081287 2075471 2066664
46608 2066664 2054769 2040096 2023664 2006179 1987593 1967921 1947707 1927397 1907126 1887376 1868917
46597 1868917 1851687 1834695 1817559 1801269 1786809 1773927 1761970 1751052 1741480 1732798 1724436 1716708
46585 1716708 1710125 1704197 1697947 1691280 1684776 1678438 1671749 1664832 1658447 1652764 1647116 1641205 1635679 1631243
46571 1631243 1627802 1624739 1621580 1618211 1614886 1612101 1610153 1608815 1607747 1607032 1606842 1606772 1606106 1604660 1602899
46556 1602899 1601296 1600112 1599689 1600370 1602058 1604341 1607024 1610141 1613573 1617142 1621025 1625570 1630753 1636271
46542 1636271 1642122 1648656 1656118 1664578 1674111 1684547 1695242 1705677 1716250 1727885 1740951 1755089
46530 1755089 1769951 1785513 1801721 1818520 1836243 1855424 1876223 1898585 1922786 1949107 1977010
46519 1977010 2005364 2033584 2061845 2090122 2117784 2144317 2169715 2193910 2216457 2237032 2255655
46508 2255655 2272171 2286113 2297390 2306494 2313709 2318701 2321337 2322370 2322731 2322467 2320895 2317671 2313324 2308809
$$ [...]
##END NTUPLES=NMR SPECTRUM
##END=
