##TITLE=AC1713_3097_8749698_3jzR5BpbZs
##JCAMPDX= 6.0         $$ Bruker NMR JCAMP-DX V2.0
##DATA TYPE= NMR SPECTRUM
##DATA CLASS= NTUPLES
##ORIGIN= BRUKER
##OWNER= Administrator
$$ 1.72 TOPSPIN		Version 2.1
$$ 2015-08-12 09:55:03.351 -0700  Administrator@X
$$ Compression mode = diff/dup
##.OBSERVE FREQUENCY= 400.02188249412
##.OBSERVE NUCLEUS= ^1H
##.ACQUISITION MODE= SIMULTANEOUS (DQD)
##.ACQUISITION SCHEME= undefined
##.AVERAGES= 64
##.DIGITISER RES= 22
##SPECTROMETER/DATA SYSTEM= spect
##.PULSE SEQUENCE= noesygpps1d.comp
##.SOLVENT NAME= COFFEE_meoh
##.SHIFT REFERENCE= INTERNAL, COFFEE_meoh, 1, 14.96138
##AUDIT TRAIL= $$ (NUMBER, WHEN, WHO, WHERE, PROCESS, VERSION, WHAT)
$$ ##TITLE= Audit trail, TOPSPIN		Version 2.1
$$ ##JCAMPDX= 5.01
$$ ##ORIGIN= Bruker BioSpin GmbH
$$ ##OWNER= Administrator
$$ $$ E:\/data/COFFEE/nmr/AC1713_3097_8749698_3jzR5BpbZs/52/pdata/1/auditp.txt
$$ ##AUDIT TRAIL=  $$ (NUMBER, WHEN, WHO, WHERE, PROCESS, VERSION, WHAT)
(   1,<2015-08-07 21:52:29.953 -0700>,<Administrator>,<X>,<go>,<TOPSPIN 2.1>,
      <created by zg
	started at 2015-08-07 21:40:59.797 -0700,
	POWCHK enabled, PULCHK disabled,
       configuration hash MD5:
       21 0F 79 D6 B3 7B B4 F6 88 20 88 DB 03 48 BD 9F
       data hash MD5: 64K
       8B 72 91 4F A8 D6 3D 13 3E 82 46 88 51 DB 07 94>)
(   2,<2015-08-07 21:52:36.828 -0700>,<Administrator>,<X>,<audit>,<TOPSPIN 2.1>,
      <user comment:
       ICON-NMR User ID: COFFEE
       data hash MD5: 64K
       8B 72 91 4F A8 D6 3D 13 3E 82 46 88 51 DB 07 94>)
(   3,<2015-08-12 09:55:00.695 -0700>,<Administrator>,<X>,<proc1d>,<TOPSPIN 2.1>,
      <Start of raw data processing
       efp LB = 0.3 FT_mod = 6 PKNL = 1 PHC0 = 0 PHC1 = 0 SI = 128K 
       data hash MD5: 128K
       09 58 D8 92 2E 78 76 63 F1 58 FA 95 86 15 0C 26>)
(   4,<2015-08-12 09:55:01.664 -0700>,<Administrator>,<X>,<proc1d>,<TOPSPIN 2.1>,
      <pk PHC0 = -85.45715 PHC1 = 0 
       data hash MD5: 128K
       62 C5 C0 55 71 D8 1C 7A B5 12 A1 52 39 B1 BD 7C>)
(   5,<2015-08-12 09:55:02.539 -0700>,<Administrator>,<X>,<proc1d>,<TOPSPIN 2.1>,
      <abs ABSG = 1 
       data hash MD5: 128K
       F2 05 0E 60 AF 86 E9 D3 F0 20 39 7D 93 FF 0D 50>)
(   6,<2015-08-12 09:55:02.742 -0700>,<Administrator>,<X>,<proc1d>,<TOPSPIN 2.1>,
      <abs ABSG = 2 
       data hash MD5: 128K
       19 31 14 72 EF A6 F0 5E 2A B3 1F 79 91 4B 20 39>)
(   7,<2015-08-12 09:55:02.835 -0700>,<Administrator>,<X>,<proc1d>,<TOPSPIN 2.1>,
      <abs ABSG = 3 
       data hash MD5: 128K
       64 91 E1 BD 5D 3B E0 9A 76 8C 21 18 D2 4E 27 BF>)
(   8,<2015-08-12 09:55:03.039 -0700>,<Administrator>,<X>,<proc1d>,<TOPSPIN 2.1>,
      <abs ABSG = 4 
       data hash MD5: 128K
       81 5F AD 4F 3E 15 7C AE C4 DB 5A E9 6E 6D A1 8D>)
(   9,<2015-08-12 09:55:03.164 -0700>,<Administrator>,<X>,<proc1d>,<TOPSPIN 2.1>,
      <abs ABSG = 5 
       data hash MD5: 128K
       5A 75 24 A1 FA EB 3C 0D 71 05 5F 9F 6A B1 29 40>)
$$ ##END=
$$ 
$$ $$ hash MD5
$$ [...]
##$TP07= 0
##$TPNAME0= <>
##$TPNAME1= <>
##$TPNAME2= <>
##$TPNAME3= <>
##$TPNAME4= <>
##$TPNAME5= <>
##$TPNAME6= <>
##$TPNAME7= <>
##$TPOAL= (0..7)
0.5 0.5 0.5 0.5 0.5 0.5 0.5 0.5
##$TPOFFS= (0..7)
0 0 0 0 0 0 0 0
##$TUNHIN= 0
##$TUNHOUT= 0
##$TUNXOUT= 0
##$USERA1= <user>
##$USERA2= <user>
##$USERA3= <user>
##$USERA4= <user>
##$USERA5= <user>
##$V9= 5
##$VALIST= <valist>
##$VCLIST= <CCCCCCCCCCCCCCC>
##$VD= 0
##$VDLIST= <DDDDDDDDDDDDDDD>
##$VPLIST= <PPPPPPPPPPPPPPP>
##$VTLIST= <TTTTTTTTTTTTTTT>
##$WBST= 2048
##$WBSW= 25
##$XGAIN= (0..3)
0 0 0 0
##$XL= 0
##$YL= 0
##$YMAX_a= 6691151
##$YMIN_a= -13322768
##$ZGOPTNS= <>
##$ZL1= 120
##$ZL2= 120
##$ZL3= 120
##$ZL4= 120
##$ABSF1= 14.96138
##$ABSF2= -5.596802
##$ABSG= 5
##$ABSL= 3
##$ALPHA= 0
##$AQORDER= 0
##$ASSFAC= 0
##$ASSFACI= 0
##$ASSFACX= 0
##$ASSWID= 0
##$AUNMP= <proc_prof1d_extract.lims>
##$AXLEFT= 0
##$AXNAME= <>
##$AXNUC= <1H>
##$AXRIGHT= 0
##$AXTYPE= 0
##$AXUNIT= <>
##$AZFE= 0.1
##$AZFW= 0.1
##$BCFW= 0
##$BC_mod= 0
##$BYTORDP= 0
##$COROFFS= 0
##$CY= 15
##$DATMOD= 1
##$DC= 0
##$DFILT= <>
##$DTYPP= 0
##$F1P= 0
##$F2P= 0
##$FCOR= 0.5
##$FTSIZE= 131072
##$FT_mod= 6
##$GAMMA= 0
##$GB= 0
##$INTBC= 1
##$INTSCL= 1
##$ISEN= 128
##$LB= 0.3
##$LEV0= 0
##$LPBIN= 0
##$MAXI= 10000
##$MC2= 0
##$MEAN= 0
##$ME_mod= 0
##$MI= 0
##$NCOEF= 0
##$NC_proc= -2
##$NLEV= 6
##$NOISF1= 0
##$NOISF2= 0
##$NSP= 0
##$NTH_PI= 0
##$NZP= 0
##$OFFSET= 14.96138
##$PC= 1
##$PHC0= -85.45715
##$PHC1= 0
##$PH_mod= 1
##$PKNL= yes
##$PPARMOD= 0
##$PPDIAG= 0
##$PPIPTYP= 0
##$PPMPNUM= 2147483647
##$PPRESOL= 1
##$PSCAL= 4
##$PSIGN= 0
##$PYNMP= <proc.py>
##$REVERSE= no
##$SF= 400.020009486742
##$SI= 131072
##$SIGF1= 0
##$SIGF2= 0
##$SINO= 400
##$SIOLD= 131072
##$SPECTYP= <>
##$SREGLST= <1H.CDCl3>
##$SSB= 0
##$STSI= 131072
##$STSR= 0
##$SW_p= 8223.68421052631
##$SYMM= 0
##$S_DEV= 0
##$TDeff= 65536
##$TDoff= 0
##$TI= <>
##$TILT= no
##$TM1= 0
##$TM2= 0
##$TOPLEV= 0
##$USERP1= <user>
##$USERP2= <user>
##$USERP3= <user>
##$USERP4= <user>
##$USERP5= <user>
##$WDW= 1
##$XDIM= 131072
##$YMAX_p= 394020820
##$YMIN_p= -10746
##$CURPLOT= <Network HP LaserJet P1505>
##$CURPRIN= <$Network HP LaserJet P1505>
##$DFORMAT= <normdp>
##$LAYOUT= <+/1D_H.xwp>
##$LFORMAT= <normlp>
##$PFORMAT= <normpl>
##$SURQMSG= 1
$$ End of Bruker specific parameters
$$ ---------------------------------
##NTUPLES= NMR SPECTRUM
##VAR_NAME=  FREQUENCY,     SPECTRUM/REAL,   SPECTRUM/IMAG
##SYMBOL=    X,             R,               I
##VAR_TYPE=  INDEPENDENT,   DEPENDENT,       DEPENDENT
##VAR_FORM=  AFFN,          ASDF,            ASDF
##VAR_DIM=   131072,        131072,          131072
##UNITS=     HZ,            ARBITRARY UNITS, ARBITRARY UNITS
##FACTOR=    0.0627417313425164, 1,          1
##FIRST=     8223.62146879497, 508,          -56725
##LAST=      0,             636,             -56551
##MIN=       0,             -10746,          0
##MAX=       8223.62146879497, 394020820,    0
$$ Real data points
##PAGE= N=1
##DATA TABLE= (X++(R..R)), XYDATA
$$ [...]
67709 113047 112784 112675 112919 113572 114156 114027 113118 111934 110824 109732 108722 108211 108383 108749 108722 108403 108425 109118
67691 109118 110167 110979 111104 110396 109160 108132 107912 108345 108711 108575 108189 108002 108124 108453 109056 110105 111494
67674 111494 112726 113265 113001 112369 112000 112174 112590 112721 112344 111706 111277 111414 112099 112811 112727 111370 109140 107108
67656 107108 106246 106822 108363 110009 111030 111287 111187 111105 111027 110912 111119 112000 113186 113780 113349 112383 111727 111892
67638 111892 112887 114252 115194 115168 114521 114151 114442 114975 115420 116105 117397 119106 120861 122589 124146 125037 125148
67621 125148 125323 126488 128463 130344 131729 132720 132952 131773 129604 128063 128178 129179 129644 129246 128719 128585
67605 128585 128690 128785 128785 128466 127519 126068 124672 123695 123020 122559 122622 123494 124862 125923 126026 125104 123653 122415
67587 122415 121901 122004 122115 121776 121179 120879 121118 121658 122251 122977 124016 125287 126463 127257 127566 127484 127257 127108
67569 127108 126965 126486 125535 124492 123827 123494 123086 122528 122251 122622 123531 124645 125686 126310 126123 125135 123933
67552 123933 123048 122396 121696 121204 121491 122595 123870 124725 125078 124997 124407 123393 122411 121860 121688 121714 122138 123309
67534 123309 125078 126743 127720 128010 127895 127457 126695 125973 125955 126825 127803 127792 126587 125128 124435 124502 124499 123894 123053
67515 123053 122736 123310 124529 125833 126744 127093 127033 126824 126631 126529 126595 126837 127113 127316 127520 127726 127550 126561 125018
67496 125018 123929 124166 125638 127396 128394 128168 127134 126334 126617 127865 129220 130168 131049 132329 133802 134913
67480 134913 135588 136181 136693 136580 135488 133815 132349 131537 131239 131018 130535 129768 129008 128622 128755 129245 129773 130109
67462 130109 130264 130516 131234 132577 134353 136206 137825 138985 139543 139619 139634 139934 140380 140497 140063 139436 139294 140129
67444 140129 141901 143970 145362 145374 144137 142551 141556 141440 141754 141857 141542 141183 141293 141908 142513 142604 142257 142004
67426 142004 142228 142792 143268 143397 143354 143573 144294 145226 145711 145330 144329 143432 143288 144046 145280 146216 146257 145511 144735
67407 144735 144606 145124 145789 146195 146334 146479 146961 147899 148953 149499 149268 148681 148347 148429 148763 149348 150292 151422
67389 151422 152397 153144 153844 154557 155206 155808 156261 156061 154850 153240 152444 152915 153946 154754 155306 155771 155858 155283
67371 155283 154367 153582 152857 151964 151314 151637 152893 154140 154648 154686 155010 155901 156959 157677 158012 158364 159071 160034
67353 160034 160982 161978 163338 165038 166583 167673 168563 169497 170198 170358 170282 170488 170911 171087 171036 171311 172111 172947
67335 172947 173344 173376 173388 173622 174336 175773 177679 179188 179637 179294 178942 178877 178666 177900 176868 176320 176696 177742
67317 177742 178870 179755 180418 180835 180796 180333 179940 180056 180501 180852 181264 182376 184351 186538 188293 189654 190849
67300 190849 191535 191091 189608 188085 187482 187762 188044 187585 186514 185613 185427 185698 185660 184823 183401 182111 181735
67283 181735 182736 184917 187387 189152 189976 190501 191406 192618 193521 193805 193842 194241 195147 196053 196295 195792 195245
67266 195245 195493 196644 198011 198891 199225 199384 199576 199695 199654 199580 199612 199689 199636 199430 199263 199311 199503 199615 199530 199308
67246 199308 198983 198542 198162 198179 198627 199043 199010 198705 198521 198366 197844 197091 196852 197583 198980 200580 202315 204126
67228 204126 205474 205738 204932 203676 202593 202008 202012 202459 203020 203615 204692 206753 209572 212223 213879 214383 214078
67211 214078 213443 212976 213076 213774 214669 215344 215817 216472 217516 218624 219183 218872 217918 216861 216214 216335 217319 218793
67193 218793 220024 220541 220611 220824 221356 221983 222668 223574 224446 224575 223669 222336 221442 221316 221773 222480 223014 223015 222653
67174 222653 222561 222953 223251 223027 222852 223587 225174 226818 228095 229168 230094 230761 231498 232855 234574 235571 235335
67157 235335 234715 234868 235909 237056 237704 237781 237308 236165 234427 232568 231230 230857 231488 232725 233943 234707
67141 234707 235081 235581 236794 238926 241610 244258 246621 248763 250368 250587 249127 247190 246510 247441 248693
67126 248693 249131 249107 249631 250950 252501 253818 254828 255537 256040 256678 257610 258397 258548 258427 259001 260606 262495
67109 262495 263774 264376 264855 265575 266443 267223 267825 268265 268572 268774 268981 269472 270617 272523 274743 276514 277385
67092 277385 277532 277460 277569 278043 278969 280348 282039 283834 285578 287121 288213 288635 288537 288558 289400 291188 293303
67075 293303 294936 295809 296298 296874 297610 298297 298898 299646 300645 301622 302230 302594 303364 305114 307716 310354 312193
67058 312193 313020 313291 313679 314639 316272 318404 320699 322818 324587 326117 327726 329662 331863 333986 335782
67043 335782 337392 339161 341139 342950 344261 345234 346362 347893 349580 350960 351827 352465 353488 355370 358044
67028 358044 361064 364168 367481 371057 374500 377359 379729 382137 384870 387733 390416 392818 395042 397386
67014 397386 400297 403959 407900 411368 414168 416823 419802 422942 425762 428017 429819 431529 433695 436781
67000 436781 440707 444901 448896 452669 456330 459913 463624 467827 472454 476922 480984 485202 490082 495137
66986 495137 499505 503178 506895 510917 514739 518128 521740 526383 532160 538564 544963 550760 555640 560089
66972 560089 565284 571941 579418 586393 592347 598025 604490 612056 620154 627945 635013 641667 648662 656522
66958 656522 665099 673899 682684 691557 700530 709321 717634 725459 733039 740757 749102 758399 768413 778459
66944 778459 788214 798188 809058 820667 832166 843157 854251 866299 879484 893449 907924 922760
66932 922760 937502 951509 964624 977443 990780 1005054 1020232 1036131 1052593 1069494 1086642
66921 1086642 1103741 1120609 1137572 1155414 1174593 1194593 1214453 1233903 1253543 1273879 1294723
66910 1294723 1315714 1336886 1358277 1379445 1399964 1420247 1441336 1463862 1487587 1511940 1536621
66899 1536621 1561592 1586832 1612304 1637943 1663506 1688529 1712588 1735669 1758310 1781350 1805358
66888 1805358 1830232 1855378 1880283 1904779 1928763 1952060 1974715 1997129 2019511 2041405 2062052
66877 2062052 2081149 2098977 2115972 2132428 2148430 2163709 2177686 2190092 2201446 2212410 2222746
66866 2222746 2231472 2238123 2243257 2247474 2250468 2251553 2250758 2248831 2246253 2242729 2237805 2231662 2225054 2218460
66852 2218460 2211424 2202770 2191538 2177697 2161965 2145082 2127391 2109030 2090226 2071266 2052304 2033202
66840 2033202 2013437 1992225 1969044 1944186 1918631 1893274 1868378 1843760 1819239 1794680 1769801
66829 1769801 1744212 1717744 1690706 1663805 1637714 1612516 1587573 1562130 1536113 1510182 1484987
66818 1484987 1460605 1436738 1413130 1389624 1366017 1342160 1318142 1294297 1271087 1248918 1227786
66807 1227786 1207031 1185832 1164194 1143093 1123339 1104581 1085875 1066964 1048391 1030434 1012566
66796 1012566 994197 975405 956697 938432 920834 904244 888864 874389 860259 846259 832570
66785 832570 819290 806205 793061 779800 766520 753509 741328 730399 720285 709757 697989
66774 697989 685532 673717 663160 653295 643360 633335 623664 614493 605623 596978 588571 580025 570640
66761 570640 560283 549911 540801 533253 526327 518935 510917 502959 495709 489279 483457 477960 472400 466410
66747 466410 460068 453943 448405 443115 437506 431550 425596 419621 413264 406641 400423 394879 389438 383641
66733 383641 377999 373321 369541 365858 361850 357798 353948 350151 346329 342718 339365 335843 331791 327432
66719 327432 323270 319491 315932 312487 309271 306431 303918 301473 298740 295529 292004 288560 285505 282906
66705 282906 280652 278530 276274 273732 270977 268121 265171 262280 259969 258663 257982 256865 254536 251060
66691 251060 246998 242908 239271 236432 234293 232342 230211 228029 226085 224458 223114 222052 221128 220069
66677 220069 218885 217888 216993 215451 212738 209475 206894 205459 204502 203169 201298 199300 197649 196610 196089
66662 196089 195552 194278 191937 188842 185656 182942 180963 179667 178723 177718 176388 174698 172833 171227 170472
66647 170472 170844 171866 172567 172271 170993 169070 166734 164213 162036 160865 160858 161359 161400 160597 159470 158769 158505
66630 158505 157863 156171 153787 151880 151355 152164 153551 154755 155392 155296 154247 152093 149198 146569 145186 145119
66614 145119 145499 145467 144961 144513 144526 144944 145367 145283 144354 142705 140827 139063 137367 135715 134372 133469 132637 131493
66596 131493 130230 129269 128559 127791 127145 127080 127412 127324 126533 125806 125945 126785 127548 127723 127250 126247 125054 124238
66578 124238 124022 123940 123441 122646 122023 121510 120528 118811 116724 114753 113198 112388 112603 113535 114231 113958 112899
66561 112899 111809 111225 111231 111691 112359 112862 112902 112477 111756 110839 109835 109009 108520 108050 107005 105241 103407 102464
66543 102464 102895 104348 105897 106652 106328 105364 104449 103939 103777 103824 103974 104009 103673 103029 102408 101856 100936 99376
66525 99376 97617 96414 96023 96147 96532 97199 98157 99285 100473 101518 101913 101256 99936 98904 98557 98341 97777
66508 97777 97353 97839 99012 99696 99089 97651 96568 96574 97342 97869 97477 96547 96100 96534 97086 96868 96070 95607 95752
66489 95752 95827 95294 94490 94010 93897 93825 93703 93619 93424 92819 91817 90780 90017 89564 89345 89351 89621 90184 91036 92079
66469 92079 93145 94099 94812 95030 94537 93588 92928 93070 93646 93852 93521 93352 93921 94771 94853 93818 92445 91686
66451 91686 91587 91527 91283 91291 91730 91990 91529 90827 90787 91402 91783 91558 91402 91890 92589 92826 92701 92681 92673 92269 91632 91282
66429 91282 91189 90846 90204 89712 89410 88849 88112 87991 88699 89246 88757 87767 87445 87953 88396 88185 87661 87394 87537
66410 87537 87923 88259 88142 87408 86558 86369 86973 87738 88132 88220 88192 87906 87199 86256 85402 84788 84486 84552 84814 84960
66390 84960 85049 85537 86511 87327 87420 87094 87037 87323 87475 87305 87101 86994 86732 86173 85542 85059 84731 84664 85177 86375
66370 86375 87865 89084 89742 89855 89586 89253 89221 89589 90104 90486 90701 90866 91126 91747 93083 95149 97319 98701
66352 98701 98858 98093 97014 95901 94545 92722 90743 89320 88794 88714 88399 87716 86958 86161 85066 83795 83005
66335 83005 83150 83961 84830 85383 85507 85224 84870 85096 86310 88218 90088 91303 91579 90986 89993 89247 89022 89116
66317 89116 89363 89903 90710 91360 91607 91760 92068 92178 91748 91176 91018 91014 90472 89416 88562 88174 87810 87264 86936
66298 86936 87102 87554 88192 89216 90403 91003 90873 90988 92154 93803 94781 94933 95109 95817 96640 96881 96150 94365
66280 94365 91899 89733 88816 89073 89602 89946 90561 91760 92895 93103 92504 92041 92341 93217 94262 95371 96531
66263 96531 97485 97902 97740 97256 96743 96370 96232 96390 96823 97387 97893 98218 98324 98186 97778 97223 96870 97029 97561
66244 97561 97886 97580 96814 96036 95324 94330 92906 91489 90696 90735 91378 92313 93312 94128 94513 94396 93966 93584 93646
66225 93646 94304 95162 95471 94944 94275 94466 95628 96841 97240 96851 96224 95670 95156 94658 94265 93999 93814 93656
66207 93656 93427 93042 92654 92602 92950 93309 93361 93347 93791 94919 96582 98536 100473 101960 102705 102842 102697 102425
66189 102425 102089 101870 101882 101985 102152 102771 104060 105382 105743 105000 104015 103537 103522 103636 103853 104297 104961 105918 107393
66170 107393 109249 110739 111147 110540 109586 108760 107993 107008 105791 104678 104099 104224 104847 105652 106420 106919 106884 106483
66152 106483 106555 107805 109832 111498 112282 112582 112634 111968 110400 108840 108420 109176 110212 110886 111196 111209 110795 110053
66134 110053 109527 109749 110781 112250 113742 115165 116806 118873 120928 122082 121876 120714 119237 117696 116257
66119 116257 115453 115758 116907 118160 119116 119826 120322 120600 121003 121983 123400 124563 125102 125319 125556 125679 125493
66102 125493 125296 125690 126960 128870 130911 132571 133498 133641 133303 132926 132761 132718 132583 132438 132710 133616 134640
66085 134640 134982 134642 134545 135271 136138 136067 135034 134013 133633 133660 133812 134339 135450 136743 137682 138319 139136 140341
66067 140341 141649 142705 143477 144206 145047 145783 145955 145377 144441 143694 143189 142486 141301 139870 138631 137775 137177
66050 137177 136612 136001 135595 135819 136782 138051 139162 140167 141349 142584 143525 144335 145672 147842 150473 153030
66034 153030 155121 156258 156070 155001 154093 153716 153133 151809 150477 150225 151030 151970 152587 153199 154040 154948 156022
66017 156022 157828 160595 163654 166037 167398 168288 169684 172255 175775 179173 181470 182674 183516 184392 185019
66002 185019 185201 185463 186566 188637 191004 192764 193374 192913 191927 190946 190023 188827 187157 185148 182938 180480
65986 180480 177814 175250 173018 170981 168988 167347 166563 166630 166885 166682 165980 165132 164305 163379 162416 161872 162057
65969 162057 162492 162201 160842 159273 158725 159515 160927 162254 163546 165200 167204 169084 170457 171420 172430
65954 172430 173914 175930 178182 180423 182801 185568 188480 190899 192577 193978 195506 196830 197378 197262 197223
65939 197223 197793 198974 200623 202577 204407 205642 206453 207654 209766 212488 215323 218282 221628 225242 228677
65924 228677 231573 233629 234456 234041 233240 233263 234530 236375 237926 238915 239569 240146 240726 241226 241406 241094 240457
65907 240457 239753 238719 236610 233128 229004 225279 222163 219003 215319 211438 207991 205098 202320 199335
65893 199335 196434 194196 192733 191398 189394 186624 183778 181571 180084 178932 177864 176951 176311 175857 175360
65878 175360 174686 173923 173331 173111 173198 173435 173933 175015 176644 178128 178700 178273 177366 176370 175261 174018 172916
65861 172916 172212 171782 171326 170760 170231 169926 170064 170960 172726 174867 176500 177161 177277 177696 178814 180267 181373
65844 181373 181700 181403 181268 182358 185157 188940 192353 194853 197184 200110 203146 205234 206480 208337 211822
65829 211822 216258 220180 222943 224861 226249 227047 227294 227227 226741 225273 222505 218899 215302 212206 209533
65814 209533 206991 204504 202331 200862 200285 200454 201121 202107 203130 203623 203127 201909 200917 200961 202112 203956
65798 203956 206256 209161 212881 217339 222207 227286 232881 239789 248743 259742 271893 284009 295480
65785 295480 306547 317603 328206 337031 343054 346534 348367 348533 345849 339542 330447 320166 309497
65772 309497 298397 287231 277239 269590 264503 261479 259948 259564 260312 262560 266686 272489 279240 286421
65758 286421 294014 301954 309770 317091 324083 330965 337282 342124 344953 345875 345163 342861 338841 332943 325013
65743 325013 315106 303733 291750 279883 268447 257509 247156 237503 228619 220617 213711 207991 203147
65730 203147 198624 194151 189968 186450 183654 181368 179384 177457 175201 172425 169551 167187 165271 163207
65716 163207 160979 159451 159153 159386 159128 158352 157704 157306 156779 156300 156633 157905 159151 159389 158581 157386 156583
65699 156583 156937 158932 162156 165453 168043 170190 172592 175645 179523 184372 189964 195670 201237 207205
65685 207205 214134 221949 230551 240554 252647 266468 280807 294749 308050 320544 331900 342037
65673 342037 351224 359568 366754 372351 376139 378195 378976 379230 379531 379969 380504 381389 382845 384533 385820 386517
65657 386517 386876 386924 386231 384348 381016 375972 369011 360368 350621 340082 328601 316084 302917 289792
65643 289792 277264 265511 254332 243430 232900 223287 214897 207299 199967 193260 188186 185124 183313
65630 183313 181632 179413 176440 172781 168924 165627 163288 161691 160491 159603 158997 158528 158199 158178 158366 158328
65614 158328 157929 157615 157745 157964 157653 156737 155673 154883 154583 154988 156261 158260 160637 163162 165767 168407
65598 168407 171140 174218 177847 181949 186370 191192 196634 202795 209766 217802 227010 236887 246582 255739
65584 255739 264865 274811 285963 297876 309478 319642 327778 333961 338510 341579 343197 343327 341597
65571 341597 337236 329836 320154 309669 299275 288803 277939 267079 256906 247511 238419 229377 220701
65558 220701 212834 205894 199789 194529 190234 186847 184013 181329 178736 176558 175073 174141 173379 172687 172371
65543 172371 172698 173563 174680 175920 177292 178811 180538 182564 184717 186500 187572 188141 188606 188990 189127 189189
65527 189189 189464 189595 188724 186625 184149 182246 180965 179757 178293 176495 174187 171379 168684 166808 165719
65512 165719 164800 163766 162844 162161 161638 161576 162584 164654 166903 168582 169860 171285 172998 174930 177303 180319
65496 180319 183628 186623 189134 191350 193193 194290 194539 194243 193680 192905 192003 191179 190462 189642 188598 187528
65480 187528 186752 186405 186308 186031 185156 183613 181716 179814 178029 176438 175199 174296 173467 172735 172690 173737 175255
65463 175255 176089 175900 175405 175226 175096 174561 173940 174103 175483 177692 180014 181959 183370 184316 185019 185754 186620
65446 186620 187355 187484 186771 185573 184579 184208 184395 185028 186256 188150 190308 192141 193437 194323 194815 194791 194330
65429 194330 193714 193065 192334 191589 190967 190317 189269 187749 186075 184420 182569 180384 178223 176714 176249 176729
65413 176729 177665 178507 179148 180035 181542 183323 184784 186129 188324 191770 195601 198688 200894 202840 204741
65398 204741 206095 206455 206022 205321 204562 203473 201665 199130 196427 194354 193314 192999 192690 191875 190709 189982
65382 189982 190518 192355 194557 196082 196788 197294 197971 198573 198891 199209 199887 200950 202423 204667 208005 212279
65366 212279 217113 222403 228265 234813 242328 251404 262404 274871 287812 300429 312179 322259 329662
65353 329662 333927 335494 335068 332822 328438 321853 313818 305636 298233 291464 284377 276255 267331 258493
65339 258493 250483 243505 237390 231870 226760 222096 218114 214961 212407 209916 207029 203750 200620 198291
65325 198291 196755 195061 192147 188060 184045 181302 179955 179371 179002 178552 177700 176230 174440 173024 172518
65310 172518 173016 174264 175799 177107 177992 178808 180150 182338 185286 188629 191803 194235 195791 196900 197992
65295 197992 199018 199783 200415 201078 201412 200821 199307 197504 195894 194449 193151 192312 192073 191958 191275 189873
65279 189873 188272 187083 186442 186008 185447 184864 184625 184781 184965 185007 185311 186248 187478 188393 189103 190350 192363
65262 192363 194386 195577 195856 195619 195019 194012 192782 191657 190708 189792 188877 187945 186626 184420 181419 178521
65246 178521 176639 175916 175890 176282 177144 178256 178845 178351 177264 176718 177172 177876 177831 176938 175883 175138 174441 173280
65228 173280 171569 169781 168490 167772 167026 165587 163636 162328 162777 165013 168064 170852 172792 173746 173940
65213 173940 173934 174311 175223 176320 177077 177062 176105 174554 173285 173079 173924 175128 176073 176611 176870 177048 177387 177993
65195 177993 178687 179353 180295 181802 183424 184268 184142 183865 184262 185319 186538 187596 188306 188432 187995 187429 187007
65178 187007 186439 185509 184798 185120 186375 187580 188125 188430 189156 190277 191326 192319 193865 196219 198545 199505
65162 199505 198679 197139 196378 196765 197454 197762 198088 199165 200920 202685 204326 206483 209597 213347 217373 222037
65146 222037 227947 234956 242218 249247 256315 263573 270325 275787 280421 285826 293040 301333 309039 315283
65132 315283 320467 325239 329550 332829 334643 334932 333921 332076 329947 327691 324805 320503 314352 306408
65118 306408 296930 286266 275009 263964 253798 244825 237127 230685 225276 220462 215960 212006 209059
65105 209059 207063 205220 202766 199846 197353 195888 195223 194879 194861 195486 196710 198000 198834 199016 198552 197548
65089 197548 196297 195204 194510 194296 194685 195704 196897 197492 197164 196359 195705 195459 195778 197039 199342 201917
65073 201917 203695 204557 205526 207525 210355 213086 215122 216445 217131 217116 216516 215689 214787 213540 211789 209999
65057 209999 208848 208376 207936 207036 205826 204618 203376 202040 200935 200307 199614 197944 195238 192521 190668
65042 190668 189390 187785 185539 183095 180885 178910 177116 175748 175092 175045 175120 174825 174047 173104 172464 172343 172617
65025 172617 173118 173914 175173 176855 178696 180474 182118 183595 184894 186155 187696 189812 192609 196005 199696
65010 199696 203083 205486 206662 207079 207500 208315 209405 210616 212090 214038 216321 218455 220021 221016 221858
64995 221858 223173 225490 228939 233167 237586 241692 245183 247872 249671 250543 250269 248397 244749 239988 235382
64980 235382 231871 229545 228012 226899 225848 224433 222463 220182 217961 215982 214393 213392 212804 211936 210351
64965 210351 208595 207587 207411 207237 206422 205048 203341 201227 198737 196340 194473 193116 192179 191919 192483 193284
64949 193284 193393 192617 191779 191814 192808 194068 194923 195235 195189 194816 193970 192716 191461 190534 189835 189151 188608 188468
64931 188468 188578 188523 188397 188976 190797 193342 195419 196196 195641 194146 192155 190183 188909 188905 190275 192616 195487
64914 195487 198864 203001 207906 213174 218506 224071 230116 236486 242925 249615 256952 264787 272418 279367
64900 279367 285729 291672 297061 301718 305595 308460 309752 309003 306185 301572 295656 289247 283150 277457
64886 277457 271523 264922 258071 251725 246326 242176 239696 238930 239112 239318 239402 239836 240715 241422 241242 239964
64870 239964 237904 235609 233522 231648 229604 227156 224563 222192 219983 217664 215261 213038 210993 208826
64856 208826 206420 204018 201912 200230 199059 198550 198709 199168 199302 198728 197779 197316 197727 198294 198047 197200 197070
64839 197070 198372 200380 202186 203998 206402 208948 210513 210863 210947 211646 213073 215151 218012 221572 225379
64824 225379 229258 233598 238697 244222 249604 254608 259216 263224 266224 267894 268179 267304 265591 263100 259551
64809 259551 254846 249518 244338 239623 235318 231537 228520 226226 224613 224151 225196 226864 227521 226719 225768
64794 225768 225946 226990 227967 228801 229949 231128 231529 231214 231308 232609 234739 236990 239387 242532 246736 251709
64778 251709 256972 262298 267793 273692 280130 287058 294361 301888 309311 316157 322185 327677 333158 338887
64764 338887 344788 350708 356457 361608 365544 367782 368079 366227 362071 355847 348292 340197 331924 323502
64750 323502 315033 306787 298902 291271 283850 276977 271165 266611 263077 260350 258644 258346 259411 261180
64736 261180 262903 264357 265934 268184 271341 275241 279620 284375 289521 294924 300272 305385 310400 315450
64722 315450 320150 323606 325039 324376 322154 318861 314440 308478 300891 292233 283258 274358 265692 257694
64708 257694 250957 245576 241115 237420 234954 233965 233780 233457 232811 232184 231614 231004 230939 232329 235023 237660
64692 237660 239373 241003 244047 248822 254257 259267 263771 268415 273721 279561 285196 289780 292941 294845
64678 294845 295647 295115 292997 289576 285565 281486 277361 273017 268530 264316 260835 258208 256179 254534 253424
64663 253424 253108 253502 254335 255657 257797 260735 263959 267107 270313 273725 277172 280647 284729 289997 296336
64648 296336 303245 310640 318774 327415 335638 342515 347707 351409 354042 356013 357388 357737 356644 354443
64634 354443 352088 350116 348014 344801 340048 334181 327967 321883 315844 309411 302312 294885 287917 281994
64620 281994 277082 272793 268850 265133 261437 257521 253500 249967 247561 246455 246336 246799 247643 248817 250327
64605 250327 252274 254845 258081 261730 265498 269461 274130 280055 287429 296004 305279 314813 324532 334759
64591 334759 345828 357615 369488 380586 390104 397459 402455 405255 406039 404810 401754 397576 393023
64578 393023 388080 382131 374923 366933 358648 350068 341180 332436 324309 316738 309463 302649 296711 291726
64564 291726 287465 283832 280759 277825 274573 271270 268772 267430 266573 265318 263583 262071 261530 262320 264403
64549 264403 267335 270294 272516 273889 274978 276329 277857 279037 279553 279509 278971 277626 275167 271877 268516
64534 268516 265645 263318 261395 259816 258468 257099 255635 254365 253658 253645 254304 255567 257161 258678 260047
64519 260047 261739 264194 267301 270767 274710 279429 284708 289929 294851 299775 304833 309530 313229 315738
64505 315738 317237 317856 317567 316271 313822 310118 305408 300508 296562 294489 294526 296147 298457 300847 303277
64490 303277 305874 308331 310005 310581 310346 309714 308739 307255 305256 302973 300619 298273 295903 293430 290928
64475 290928 288884 288098 289077 291501 294505 297453 300317 303286 306254 308871 310917 312357 312997 312383 310298
64460 310298 307262 304292 302071 300424 298648 296242 293403 290969 289898 290556 292415 294551 296530 298680
64446 298680 301544 305360 310165 316033 322918 330446 338175 346011 354212 363203 373590 386111 401153
64433 401153 418437 437595 459035 483848 512885 546358 584471 628077 678566 737490 806557
64422 806557 887632 982271 1091154 1213987 1349663 1496169 1650313 1807804 1963742 2113236
64412 2113236 2252060 2377337 2487694 2582338 2659603 2716495 2749902 2758125 2741038 2699132 2633333
64401 2633333 2546138 2442074 2325737 2199124 2061703 1913559 1758053 1601147 1448777 1305448
64391 1305448 1174519 1058298 957231 869764 793712 727795 671714 625181 587270 556484 531050
64380 531050 509148 489305 470844 453873 438669 425075 412573 400809 389746 379177 368484
64369 368484 357323 346448 337270 330430 325221 320634 316491 313161 310609 308394 306444 305225 305084 305766
64355 305766 306554 306567 305056 301923 297974 294284 291250 288580 285972 283297 280226 276422 272284 268839 266612
64340 266612 265124 263784 262749 262469 262858 263476 264295 265788 268337 271865 275997 280359 284897 290028 296259
64325 296259 303425 310605 316972 322352 326630 329058 328788 325869 321143 315245 308308 300631 292995 286041
64311 286041 279814 274170 269262 265231 261707 258094 254330 250987 248509 246611 244631 242373 240336 239138
64297 239138 238933 239439 240289 241190 242001 242992 244778 247593 250740 253308 255435 258204 262134 266419 270109 273373
64281 273373 276953 280833 284289 287045 289552 292110 294471 296433 298053 299024 298629 296810 294728 293607 293397
64266 293397 293147 292377 291361 290205 288453 285788 282525 279123 275669 272175 268949 266196 263542 260515 257427
64251 257427 255231 254358 254131 253566 252484 251491 251081 251139 251300 251496 251943 252786 253823 254590 254647 253859 252476 250945
64233 250945 249661 248826 248406 248131 247648 246845 245977 245383 245136 245070 244997 244680 243699 241715 239003 236448 234811 234083
64215 234083 233703 233325 233237 234031 235859 238035 239485 239704 239234 239083 239854 241646 244549 248688 253691 258717
64199 258717 263350 268121 273790 280389 287340 294276 301222 308071 314370 319710 323931 326789 327794 326591
64185 326591 323347 318589 312824 306476 300031 293964 288462 283385 278535 273864 269391 265022 260653 256492
64171 256492 253115 251027 250133 249805 249473 249081 248962 249423 250510 252060 253838 255650 257341 258716 259601 260138
64155 260138 260888 262280 263954 265067 265345 265401 265751 265993 265476 264387 263542 263206 262809 261959 261103 260911 261459 262339
64137 262339 263291 264349 265618 267212 269276 271768 274347 276716 278934 281159 283289 285246 287531 290997
64123 290997 295901 301534 306984 312033 317066 322330 327622 332640 337288 341504 345020 347527 349068 350111
64109 350111 351131 352165 352884 353175 353556 354795 357043 359524 361268 362052 362352 362466 362020 360531 358118 355373
64093 355373 352723 350296 348328 347215 346984 347040 346788 346354 346327 346820 347111 346339 344356 341709 338993 336500 334464
64076 334464 333196 332729 332520 331890 330744 329575 328781 328331 328209 328682 329811 331048 331846 332496 333791 335860
64060 335860 337933 339499 341209 344277 349275 355880 363540 371916 380671 389282 397303 404718 411968 419614
64046 419614 427840 436147 443528 449128 452808 455092 456657 457920 458956 459650 459981 460265 460941 461994 462677
64031 462677 462112 460162 457482 454690 451721 448108 443637 438526 433066 427352 421422 415486 409885 404819
64017 404819 400182 395678 391069 386262 381237 375990 370681 365813 362115 360065 359453 359524 359652 359818 360360 361388
64001 361388 362713 364320 366496 369302 372231 374792 377258 380448 384766 389797 394897 399838 404804 410066
63987 410066 415794 421903 427950 433414 438267 443110 448700 455518 463812 473636 484646 496120 507444
63974 507444 518491 529499 540891 553347 567536 583386 599973 616617 633818 652652 673490
63963 673490 695960 720096 746807 777060 811237 849709 893560 944246 1002685 1069157 1144076
63952 1144076 1228599 1324471 1433494 1557123 1696249 1851109 2021422 2206683 2406306 2619427
63942 2619427 2844594 3079664 3321913 3568069 3814131 4055329 4286478 4502475 4698495
63933 4698495 4869972 5012824 5123926 5201305 5243829 5250806 5221942 5157500 5058499 4926946 4766005
63922 4766005 4579797 4372925 4150208 3916693 3677435 3436963 3199065 2967085 2744049
63913 2744049 2532377 2333815 2149890 1982025 1830831 1695686 1575537 1469938 1378767 1301060
63903 1301060 1234731 1177545 1128046 1085605 1050058 1021267 998430 979645 962675 946413 931240
63892 931240 917682 905157 892412 878900 865297 852825 842454 834687 829699 827464 827902 831020 837013
63879 837013 846289 859416 876808 898361 923516 951869 983697 1019789 1060825 1106991 1158109 1213971
63867 1213971 1274471 1339488 1408615 1481046 1555777 1632012 1709355 1787556 1866026 1943518 2018264
63856 2018264 2088484 2152855 2210536 2260790 2302726 2335434 2358144 2370156 2370843 2359997 2338063 2305736
63844 2305736 2263484 2211779 2151724 2084956 2012816 1935984 1855132 1771600 1687104 1602961 1519887
63833 1519887 1438447 1359395 1283564 1211575 1143681 1079807 1019808 963821 912318 865689 823775
63822 823775 785852 751056 718804 688961 661796 637713 616772 598397 581586 565479 549712
63811 549712 534316 519483 505458 492456 480410 468878 457448 446274 435936 426644 417895 409211
63799 409211 400965 394003 388514 383762 379054 374383 369899 365276 360135 354784 349975 346044 342791 340110
63785 340110 338153 336756 335284 333378 331505 330422 330145 329781 328389 325937 323347 321601 320807 320253 319317
63770 319317 318100 317000 316001 314742 313151 311548 310189 309091 308265 307722 307214 306425 305533 305187 305724 306753
63754 306753 307700 308441 309246 310428 312299 315097 318535 321658 323534 324170 324492 325423 327104 328887 329999 330219
63738 330219 330102 330517 331937 334236 337141 340603 344595 348857 353150 357698 363083 369596 376822 383958 390553
63723 390553 396899 403607 410748 417492 422771 426186 428123 429011 428740 426859 423169 418112 412756 408320 405360
63708 405360 403346 401241 398578 395757 393373 391616 390408 389709 389466 389597 390235 391696 393924 396276 398119
63693 398119 399407 400374 400903 400652 399693 398630 397992 397799 397802 397894 398174 398726 399524 400589 402129 404360 407187 410184
63675 410184 413053 415940 419145 422668 426305 430042 433968 437850 441193 443706 445298 445642 444309 441503
63661 441503 438122 434744 430988 426185 420318 413979 407780 402214 397687 394131 390792 386952 382843 379470
63647 379470 377495 376642 376152 375562 374981 374852 375493 376814 378458 380170 381883 383582 385421 387958 391774 396780
63631 396780 402383 408505 415820 424677 434414 444278 454450 465590 477872 491204 505945 522509 540446
63618 540446 558829 577553 597479 619187 642272 665848 689049 710860 730233 746720 760498
63607 760498 771582 779506 783985 785387 784318 781206 776568 771179 765621 759946 753959 747506 740311 732014
63593 732014 722586 712261 700783 687243 671185 653563 636167 620215 605836 592685 580586 569653
63581 569653 560106 552028 545231 539486 534998 532355 531772 532673 534346 536772 540372 545048 549957 554318 558162
63566 558162 562172 567065 573278 581030 590461 601659 614673 629595 646703 666481 689422 715799
63554 715799 745653 778866 815046 853270 892045 929452 963128 990210 1007818 1014132 1009282 995396
63542 995396 975876 954340 933577 915030 899154 886163 876198 868860 863023 857339 850746 842481 832016
63529 832016 819236 804349 787364 768016 746515 724100 702334 681904 662407 643189 624054
63518 624054 605267 587332 570868 556311 543585 532227 521890 512508 504017 496191 488830 481824
63506 481824 474964 468007 461129 455036 450311 446750 443564 440213 436787 433603 430796 428509 427226 427467
63492 427467 429022 430812 431848 432269 433133 435163 438048 441210 444915 450061 456903 464463 471457 477415 482540
63477 482540 486764 489585 490855 491110 490824 489705 487180 483317 478774 473976 468851 463404 457982 452774 447598
63462 447598 442584 438657 436804 436973 438152 439491 440951 442923 445722 449620 455011 462235 471309 481987
63448 481987 494059 507596 523063 541212 562757 588117 617494 650975 688303 728559 770259
63437 770259 811585 850148 882705 905856 917677 918751 911621 899399 884827 870119 857083 847183
63425 847183 841473 840466 844149 852200 864116 878903 894825 909862 922549 932180 938362 940839 939916
63412 939916 936504 931400 924823 916918 908373 900053 892153 884059 874969 864319 851642 836432 818401
63399 818401 797836 775623 752835 730073 707159 683698 660032 637390 616979 599190 583833
63388 583833 570714 559569 549800 540897 533147 527439 524253 523181 523476 524702 526784 529858 534342 540809
63374 540809 549434 559637 570562 581922 594224 608191 624095 641659 660431 680180 700995 723106
63362 723106 746609 771225 796232 820644 843580 864436 882686 897623 908508 915008 917343 916091
63350 916091 912042 906227 899633 892675 885172 876993 868422 859657 850298 839782 828035 815177 800784
63337 800784 784175 765604 746603 728773 712646 698102 685548 676229 671426 671662 676528 684847 694906
63324 694906 704819 712762 716783 714613 704336 685642 660327 631368 601607 573302 548262 527524
63312 527524 510739 496461 483488 471750 461752 453544 446685 440959 436510 433238 430580 428083 425789
63299 425789 423788 421706 419021 415763 412578 410063 408181 406375 404081 401141 397781 394319 390965 387992
63285 387992 385899 385133 385561 386446 387032 387006 386437 385593 384941 384938 385584 386376 386968 387606 388664 390066 391557 393293
63267 393293 395597 398190 400244 401414 402363 403992 406428 409061 411436 413770 416547 419834 423231 426489
63253 426489 429944 434107 438878 443534 447639 451588 455989 460787 465445 469843 474514 480039 486636 494339
63239 494339 503191 513211 524551 537675 552871 569510 586419 603278 621069 640710 661724 682835
63227 682835 703488 724043 744684 764998 784798 804616 824967 845605 865928 885788 905426
63216 905426 924831 943656 961771 979479 996977 1013788 1028788 1040700 1048540 1051828 1050478 1044479
63204 1044479 1033698 1018101 998141 974763 949065 922153 895268 869639 845967 824303 804651
63193 804651 787480 773327 762145 753444 747012 743073 741815 743197 747271 754206 763804 775446 788776
63180 788776 804007 821209 839719 858704 878033 898000 918340 938178 957099 975679 994654
63169 994654 1013890 1032471 1049590 1065004 1078641 1090056 1098413 1103031 1103824 1101047 1094527 1083364 1066688
63156 1066688 1044678 1018630 990114 960354 930314 900777 872055 843922 816245 789519 764504
63145 764504 741428 719884 699537 680702 664083 650085 638461 628600 620056 612718 606521 601193
63133 601193 596453 592343 589088 586590 584420 582458 581253 581433 582892 584839 586550 587786 588579 588985 589173
63118 589173 589478 590152 591216 592635 594413 596353 597910 598634 598747 599016 599913 601043 601535 600939 599624 598325
63102 598325 597399 596636 595750 594882 594399 594209 593622 592214 590674 590285 591450 593207 594519 595592 597347 599884
63086 599884 602264 603962 605732 608521 612086 615350 617922 620547 624046 628330 632714 636839 641019 645844
63072 645844 651561 657870 664423 671597 680448 691532 703996 716391 728371 741015 755400 771546
63060 771546 789059 808155 829511 853532 880261 909641 941319 974536 1008874 1044918 1083522
63049 1083522 1124563 1167173 1211122 1257040 1305024 1353909 1402392 1450231 1497714 1544523 1589948
63038 1589948 1633997 1677476 1720880 1763739 1805192 1844850 1882932 1919779 1955246 1988336 2017391
63027 2017391 2040865 2057875 2067868 2069992 2063216 2047039 2021672 1987591 1945374 1896162 1841843 1784582
63015 1784582 1726356 1668964 1613961 1562293 1514283 1470279 1431039 1397306 1369377 1347426 1331935
63004 1331935 1323299 1321120 1324321 1331979 1343810 1359929 1380373 1404810 1432438 1462275 1493790 1527149
62992 1527149 1562558 1599504 1637002 1674431 1711633 1748172 1783041 1815305 1844643 1871031 1894148
62981 1894148 1913302 1927610 1935983 1937135 1930024 1914326 1890384 1858726 1819745 1773824 1721715 1664781
62969 1664781 1604814 1543524 1482145 1421548 1362520 1305669 1251130 1198715 1148490 1101019 1056993
62958 1056993 1016752 980207 946988 916616 888686 862955 839204 817127 796529 777450 759781
62947 759781 742982 726681 711417 698150 686907 676627 666561 657116 648870 641478 634219 627191
62935 627191 621138 616310 612203 608309 604457 600473 596261 592303 589377 587529 585875 583674 581062 578427
62921 578427 575652 572494 569314 566752 564831 562974 560901 558930 557283 555604 553519 551375 550011 549874
62907 549874 550659 551738 552652 553178 553230 552800 551819 550013 547178 543688 540435 538080 536623 535931 536282 537902
62891 537902 540223 542219 543531 544714 546288 548015 549314 549998 550361 550799 551500 552199 552197 551001 549100 547708
62875 547708 547591 548514 549925 551568 553148 554108 554303 554445 555263 556483 557199 556960 555995 554687 553462 552978 553671
62858 553671 555108 556339 556966 557419 558281 559743 561637 563491 564681 565046 565257 566015 567013 567403 567182 567257 567994
62841 567994 568575 568184 567082 566035 565190 564156 562872 561825 561510 562031 563150 564485 565736 566899 568216
62826 568216 569891 571993 574487 577086 579162 580349 581230 582887 585618 588657 591401 594245 597792 601777
62812 601777 605359 608203 610723 613417 616460 619815 623321 626743 630026 633459 637353 641752 646786 653055
62798 653055 661169 670971 681686 692943 705280 719490 735752 753688 773214 795028 820058 848446
62786 848446 879377 912077 946789 984472 1025762 1070692 1119320 1171933 1228458 1288353 1351492
62775 1351492 1418551 1489867 1564174 1639033 1712282 1782506 1848252 1907496 1958071 1998260 2026907
62764 2026907 2043398 2047633 2039762 2019852 1988092 1945350 1893299 1833915 1769081 1700588 1630105 1558894
62752 1558894 1487800 1417642 1349518 1284589 1223715 1167290 1115275 1067309 1022969 982080 944716
62741 944716 910923 880551 853339 828908 806652 785924 766601 749295 734759 723056 713500 705359
62729 705359 698382 692613 688045 684737 683026 683170 684737 686803 688935 691597 695290 699678 704064 708548
62715 708548 714111 721601 731139 742612 756153 771928 789925 810254 833260 859011 887083 917270
62703 917270 950287 987330 1029048 1075263 1125538 1179632 1237469 1298917 1363546 1430429 1498364
62692 1498364 1566494 1634452 1701511 1765746 1824443 1875213 1916374 1946466 1964145 1968842 1961134 1942144
62680 1942144 1912696 1873255 1824512 1767871 1705394 1639331 1571632 1503743 1436761 1371618 1309024
62669 1309024 1249351 1192775 1139582 1090219 1045095 1004315 967540 934088 903337 875114 849532
62658 849532 826373 804944 784791 766260 749965 735824 723002 710800 699255 688872 680088 673072
62646 673072 667735 663738 660641 658173 656179 654298 651897 648551 644528 640636 637515 635085 632715 629951
62632 629951 627005 624472 622630 621233 619939 618683 617559 616644 616145 616380 617288 618156 618251 617656 617172 617413 618306
62615 618306 619513 620977 622926 625492 628547 631930 635764 640477 646450 653710 662163 672038 683682 696880
62601 696880 710842 725219 740753 758553 779027 801921 827031 854290 883409 914151 946885
62590 946885 982031 1018777 1055063 1089193 1120871 1150228 1176412 1197813 1213406 1223200 1227350 1225452
62578 1225452 1216947 1201854 1180806 1154585 1124008 1090242 1054855 1019296 984435 950726 918559
62567 918559 888099 858875 830181 802160 776077 753102 733145 715256 698892 684199 671204
62556 671204 659469 648714 639225 631302 624669 618757 613332 608524 604408 600836 597688 595063 593179 592108
62542 592108 591636 591377 591078 590759 590536 590434 590510 590991 592069 593721 595994 599299 604007 609788 615861 622061
62526 622061 629206 638136 648736 660316 672811 687144 704373 724721 747608 772515 799604 829489
62514 829489 862578 898808 937941 979749 1023797 1069271 1115268 1161081 1206021 1249172 1289666
62503 1289666 1327024 1360956 1391002 1416768 1438392 1456349 1470895 1482183 1490896 1498203 1504978 1511504
62491 1511504 1518036 1525041 1532622 1540143 1546707 1551500 1553310 1550226 1540546 1523988 1501604 1474520 1442982
62478 1442982 1406463 1364354 1316634 1264265 1209032 1152832 1097057 1042660 990511 941344 895456
62467 895456 852902 814013 779351 749019 722380 698702 677849 659988 644823 631570 619787
62456 619787 609796 601998 596116 591438 587645 584898 583169 582024 581175 580780 581002 581713 582947 585143 588454
62441 588454 592164 595351 597916 600388 602880 604759 605258 603859 600248 594659 588339 582907 578885 575296
62427 575296 570937 565563 559654 553637 547792 542474 537922 533994 530398 526968 523518 519771 515736 511892
62413 511892 508655 505972 503713 502198 501866 502635 503987 505587 507437 509501 511578 513627 515906 518723 522160
62398 522160 526016 529917 533584 537170 541291 546515 552822 559678 566588 573490 580701 588540 596939 605336
62384 605336 613052 619830 625912 631581 636826 641524 645731 649641 653358 656897 660401 664289 669183 675550
62370 675550 683367 692365 702833 715898 732537 752505 774878 799624 827882 860447 896629 935008
62358 935008 974732 1015599 1057249 1098867 1139419 1177811 1212985 1244216 1271103 1293063 1309251
62347 1309251 1319397 1324362 1325369 1322885 1316622 1306277 1291796 1273166 1250561 1224598 1196034 1165388
62335 1165388 1133229 1100563 1068346 1036764 1005572 975022 945813 918179 891668 865936 841177
62324 841177 817694 795553 774817 755606 737765 720918 705100 690914 678784 668415 659193 650827
62312 650827 643272 636353 629867 624042 619548 616931 616063 616251 616920 618134 620275 623213 626159 628535 630708
62297 630708 633486 637070 640838 643977 645983 646713 646454 645815 645084 643817 641569 638865 636789 635615 634552
62282 634552 632931 630958 629139 627741 627194 628229 631030 634774 638613 642725 647870 654364 662246 672088
62268 672088 684734 700281 718122 738189 761462 788874 820232 854622 891586 931465 974716
62257 974716 1021175 1069937 1119604 1168556 1215179 1258038 1295937 1327946 1353543 1372753 1386023
62246 1386023 1393755 1395927 1392230 1382573 1367291 1346801 1321280 1290890 1256247 1218398 1178461 1137553
62234 1137553 1096928 1057636 1019904 983278 947684 913993 883184 855233 829334 805002 782484
62223 782484 762149 743970 727735 713250 700167 688000 676598 666288 657240 648979 640861 632939
62211 632939 625949 620517 616732 614482 613786 614576 616413 618703 621140 623818 627009 630934 635674 641187 647438
62196 647438 654573 662829 672139 681959 691655 701076 710607 720665 731226 741868 752161 761947 771218
62183 771218 779722 786794 791797 794825 796785 798671 800908 803533 806774 811177 817354 825905 837449 852348
62169 852348 870468 891516 915516 942422 971202 999866 1026621 1050715 1072057 1090473 1105648
62158 1105648 1117316 1125081 1128357 1126979 1121659 1113325 1102048 1087106 1068134 1045786 1021134 994901
62146 994901 967611 940262 914308 890754 869498 849835 831601 815513 802254 791520 782355 774256
62134 774256 767532 762522 758968 756317 754269 752799 752100 752784 755801 761636 769763 779275 789900 802014
62120 802014 815783 830782 846547 863104 880747 899433 918469 936655 952713 965693 975090 980651
62108 980651 982316 980417 975745 969261 961849 954401 947882 943028 940081 938863 938930 939611 940327 941211 943185
62093 943185 947141 953248 961171 970607 981268 992808 1005277 1019282 1035080 1051753 1067930 1083317
62081 1083317 1098911 1115763 1134183 1154173 1175860 1199116 1223236 1247416 1271330 1294974 1318155
62070 1318155 1340362 1361033 1379832 1396773 1412017 1425372 1436082 1443352 1447025 1447419 1444593 1438244
62058 1438244 1428388 1415704 1401066 1385125 1368472 1351793 1335482 1319251 1302362 1284189 1264539
62047 1264539 1243632 1221839 1199319 1175851 1151166 1125384 1098982 1072431 1046062 1020069 994268
62036 994268 968052 941105 914138 888389 864403 841841 820534 800993 783630 768042 753465
62025 753465 739537 726254 713615 701723 690898 681233 672256 663437 654884 647135 640456 634723 629898
62012 629898 626270 624245 624205 626481 631133 637631 645034 652667 660628 669545 679785 690825 701443 710605
61998 710605 718148 724458 729701 733676 736345 737983 738627 737808 735097 730630 724858 718099 710692 703241 696246
61983 696246 689594 682883 676223 670312 665596 661678 657708 653225 648499 644141 640497 637333 634069 630342
61969 630342 626390 622858 620202 618314 616755 615325 614306 614127 614861 616304 618455 621655 626071 631319 636898
61954 636898 642930 650241 659728 671793 686261 702574 720198 739166 760250 784348 811618 841312
61942 841312 872459 904621 938087 973453 1010752 1048852 1085904 1120678 1153201 1183890 1212543
61931 1212543 1238570 1261680 1281478 1296765 1306287 1310236 1310063 1306621 1299388 1287902 1273169 1257185
61919 1257185 1241754 1228299 1218178 1212424 1211369 1214937 1223005 1235139 1250342 1267588 1286328 1306059
61907 1306059 1325615 1343245 1357168 1365887 1368401 1364630 1355387 1341534 1323335 1300945 1275182 1247363
61895 1247363 1218556 1189349 1160121 1131128 1102552 1074822 1048665 1024509 1002035 980711 960488
61884 960488 941509 923471 905896 889005 873724 860723 849884 840780 833244 827291 822768 819419
61872 819419 817325 817143 819727 825316 833193 842367 852668 864860 879733 897465 917994 941559 968633
61859 968633 999632 1034832 1074157 1116945 1162456 1210799 1262751 1318326 1376153 1434661 1493180
61848 1493180 1551236 1607376 1659485 1705869 1745431 1777251 1800846 1816446 1824266 1823935 1815650 1801588
61836 1801588 1785106 1768568 1752892 1738987 1728293 1721655 1718829 1719609 1724362 1732820 1743125 1752844 1760409
61823 1760409 1764935 1765176 1759439 1746356 1725188 1695628 1657940 1613314 1563666 1510913 1456488 1401285
61811 1401285 1345853 1290794 1237271 1186968 1141211 1100144 1062929 1028736 997486 969697 945767
61800 945767 925390 907641 891637 877079 864089 852733 842989 834968 828700 823625 818803 813808 809033
61787 809033 804822 800645 795642 789802 784128 779505 775796 772257 768645 765488 763239 761555 759750 757750
61773 757750 756114 755094 754213 753001 751714 750937 750829 751152 751774 752703 753850 755215 757129 759763 762570 764795
61757 764795 766488 768359 770570 772234 772339 770684 767738 764093 760353 757060 754309 751589 748279 744226
61743 744226 739810 735667 732483 730688 730078 729923 729665 729454 729903 731397 733677 735968 737609 738703 740061
61728 740061 742278 745067 747886 750924 754815 759349 763243 765574 766904 768643 771632 775666 779904 783273
61714 783273 784786 784068 781600 778149 774002 768997 763184 757111 751440 746457 741938 737320 732034 725855
61700 725855 719039 712151 705757 700133 695038 689784 683759 676999 670121 663747 658154 653353 649084 644687
61686 644687 639451 633344 627072 621231 615753 610418 605474 601295 597682 594085 590482 587502 585529 584007
61672 584007 581865 578545 574525 571005 569054 568830 569395 569439 568390 566877 566027 566363 567539 569038 570816 573096
61656 573096 575786 578494 580995 583381 585733 588040 590499 593524 597275 601471 605767 609964 613696 616362
61642 616362 617712 618084 617698 616138 613027 608797 604183 599236 593515 587023 580193 573064 565327 557322 550205
61627 550205 544855 541169 538652 537118 536457 536246 535994 535532 534916 534212 533549 533023 532348 530883 528157 524129
61611 524129 518935 512788 506171 499667 493412 487130 480823 474927 469641 464605 459467 454309 449322 444605
61597 444605 440563 437904 436781 436321 435441 433827 431805 429686 427663 425896 424203 422032 419263 416728 415337
61582 415337 414937 414593 413848 413078 412623 412147 411051 409182 406996 405229 404439 404648 405380 406149 406824 407446 407910
61565 407910 408080 408119 408448 409364 410817 412460 413852 414727 415209 415603 415924 415865 415341 414785 414739 415349 416393 417580
61547 417580 418662 419550 420474 421803 423649 425872 428531 431865 435735 439649 443576 448095 453348 458401 462215
61532 462215 464763 466526 467339 466579 464343 461584 458955 456157 452672 448646 444875 442160 440798 440443 440385
61517 440385 440121 439649 439114 438461 437685 437166 437254 437630 437546 436723 435645 434919 434683 434673 434601 434429 434447 435023 436135 437281
61497 437281 438125 438956 440170 441500 442291 442477 442789 443875 445603 447323 448550 449346 450263 451860 454028 455935
61481 455935 457008 457754 459047 460711 461554 461044 460249 460622 462298 464122 465148 465511 465862 466462 467068 467423 467565
61464 467565 467669 467756 467645 467147 466300 465405 464877 464965 465565 466349 467185 468318 469977 471919 473722 475534 478075
61447 478075 481681 485709 489276 492382 495874 500414 505886 511793 517818 523816 529571 534920 540062 545494
61433 545494 551424 557323 562305 566070 569303 572887 576918 580832 584353 587768 591200 594185 596261 597540
61419 597540 598352 598639 598095 596658 594526 591900 588977 586020 583165 580308 577308 574086 570414 566067 561350
61404 561350 557006 553274 549559 545406 541256 537713 534664 531815 529602 528624 528429 527878 526698 525762 525706 526132
61388 526132 526447 526714 527257 528008 528717 529417 530268 531243 532335 533801 535811 537977 539623 540610 541737 544146
61372 544146 548212 553020 557139 560013 562390 565270 568814 572563 576402 580756 585997 592131 599025 606515
61358 606515 614443 623049 633182 645509 659613 674447 689720 706105 723940 742384 760187 776695
61346 776695 791640 804410 814163 820603 824245 825900 826057 824679 821436 816093 808784 799963 790178 779988
61332 779988 769891 760188 750969 742453 735152 729437 725070 721441 718195 715366 713052 711306 710221 709757
61318 709757 709591 709476 709685 710755 712934 716233 720821 726862 734098 742145 751151 761576 773296 785521
61304 785521 797635 809521 820829 830440 836947 839412 837600 831928 823390 813223 802462 791819 781724
61291 781724 772149 762646 753125 744418 737497 732309 728121 724838 723040 722649 722643 722489 723024 725399 729752 735375
61275 735375 741550 747777 753818 760132 767809 777491 788664 800435 812632 825754 840290 856526 874666
61262 874666 894621 915894 937929 960197 981614 1000399 1015005 1024860 1029818 1029432 1023392 1012364
61250 1012364 997746 980804 962482 943747 925485 908190 892212 878129 866337 856528 848104 840960
61238 840960 835308 830916 827169 823897 821538 820429 820399 821132 822454 824135 825813 827270 828556 829762 830898
61223 830898 831955 832811 833084 832455 831153 829878 829204 829315 830341 832536 836009 840465 845349 850115 854346
61208 854346 857892 861098 864769 869688 876082 883606 891884 901072 911826 924738 939873 956884 975275
61195 975275 994311 1012942 1030275 1046080 1060357 1072442 1081142 1085973 1087740 1087570 1085883 1082657 1078160
61182 1078160 1072773 1066348 1058331 1048531 1037303 1025039 1011849 997765 982896 967329 951023 933832
61170 933832 915602 896459 877113 858583 841387 825289 810075 796197 784301 774438 766231 759517
61158 759517 754279 750156 746719 744253 743681 745553 749530 754904 761097 767460 773108 777349 780103 781566
61144 781566 781612 779775 775810 770132 763782 758025 753871 751735 751448 752611 755007 758826 764575 772727 783283
61129 783283 795611 808748 822004 835443 849779 865668 882935 900579 917663 934018 949918
61118 949918 965321 979859 993423 1006214 1018156 1028838 1038198 1046680 1054402 1060632 1064567 1066259 1066297
61105 1066297 1064835 1061460 1055895 1048343 1039052 1027838 1014087 997178 977042 954522 931050 907754
61093 907754 885010 862964 842160 823325 806721 792031 778827 766908 756254 746887 738751 731621
61081 731621 725206 719405 714385 710355 707455 705737 704917 704191 702875 701398 701109 702828 706020 709679 713449
61066 713449 717548 722166 727510 733930 741413 749388 757672 767206 779059 792960 807679 822785 839166
61053 839166 857648 877775 898247 918186 937700 957474 977991 999083 1020248 1041385 1062887
61042 1062887 1084819 1106459 1127070 1146793 1166250 1185547 1204250 1222195 1239842 1257931 1277221
61031 1277221 1298330 1321291 1345517 1370738 1397807 1427964 1461499 1497826 1536668 1578394 1623189
61020 1623189 1670725 1720890 1774343 1832274 1896147 1967676 2048516 2139895 2243037 2359942 2493322
61009 2493322 2646068 2821659 3025238 3263726 3544910 3877015 4268914 4729878 5269400
61000 5269400 5898979 6635386 7502370 8528759 9742889 11162951 12784325 14570610 16455881
60991 16455881 18354971 20168969 21783319 23076916 23959874 24424257 24562927 24528945 24460831
60982 24460831 24428794 24429726 24408877 24274172 23903500 23172890 22012232 20451743 18616677 16671789
60972 16671789 14759744 12972572 11357002 9930473 8692320 7630712 6728795 5968722
60964 5968722 5332393 4801430 4358450 3988319 3678030 3416165 3193084 3001206 2834590
60955 2834590 2688421 2559044 2444065 2341972 2251581 2171800 2101614 2040079 1986323 1939468
60945 1939468 1898343 1861367 1826988 1794261 1762871 1732737 1703949 1677030 1652821 1631878 1614111
60934 1614111 1599044 1586151 1574859 1564509 1554649 1545358 1537091 1530118 1524147 1518545 1512857 1506953 1500645
60921 1500645 1493386 1484612 1474263 1462697 1450086 1436231 1421076 1405059 1388793 1372602 1356499 1340334
60909 1340334 1323761 1306347 1287996 1269101 1250030 1230672 1210782 1190656 1171067 1152581 1135191
60898 1135191 1118584 1102433 1086437 1070419 1054579 1039471 1025544 1012740 1000632 988877 977534
60887 977534 966998 957698 949759 942796 936052 928868 921211 913721 907080 901244 895436 888954 881831 874515
60873 874515 867071 859072 850266 840967 831644 822444 813409 804895 797378 790805 784464 777722 770726 764187
60859 764187 758488 753327 748305 743574 739528 736000 732255 727918 723469 719579 716348 713501 710980 708823
60845 708823 706756 704449 702094 700119 698304 695673 691460 685795 679341 672745 666565 661346 657410 654755
60831 654755 653309 653108 654082 655861 657918 659772 661099 661874 662532 663708 665663 668019 670076 671311 671698
60816 671698 671778 672306 673486 674638 674921 674255 673218 672167 670985 669558 667911 665822 662945 659499 656238
60801 656238 653430 650376 646308 641357 636291 631576 627055 622370 617431 612545 608109 604014 599470 593781
60787 593781 587264 580921 575237 569871 564564 559635 555347 551405 547475 543648 540132 537009 534596 533360
60773 533360 533035 532506 531115 529617 529249 530351 532501 535422 538981 542637 545803 548688 552176 556862 562736
60758 562736 569554 576960 584362 591261 597615 603366 607869 610481 611682 612848 614795 617050 618634 619012
60744 619012 618149 616159 613197 609363 604544 598586 591706 584475 577325 570318 563351 556309 549037 541530
60730 541530 534254 527964 523074 519259 515742 511901 507763 504049 501541 500207 499120 497457 495257 492949
60716 492949 490516 487683 484725 482481 481595 482093 483563 485274 486263 485999 484997 484303 484281 484422 484350 484364 484804
60699 484804 485454 485963 486474 487476 489242 491691 494651 498080 502163 507180 513069 519144 524574 529227 533682
60684 533682 538319 542834 546891 550866 555513 561008 566707 571865 576370 580687 585162 589453 592801 594881
60670 594881 596229 597538 598642 598578 596685 593288 589126 584436 578945 572637 566137 560236 555220 550829 546812
60655 546812 543348 540805 539217 538218 537525 537213 537397 537792 537748 536624 534083 530281 525945 522017 518972 516618
60639 516618 514646 513064 511871 510737 509452 508411 508077 508119 507667 506456 505116 504245 503706 503087 502411 502038
60623 502038 502074 502163 501824 500893 499681 498745 498422 498608 498994 499382 499628 499568 499306 499346 500006 500790 500821 499887 498615 497622
60603 497622 496957 496512 496381 496575 496783 496769 496794 497327 498530 500222 502172 504163 505905 507175 508083 509065 510533
60586 510533 512506 514512 515897 516366 516259 516270 516937 518433 520650 523235 525686 527686 529356 530970 532556
60571 532556 534040 535667 537915 540995 544840 549597 555696 563263 571741 580308 588503 596341 604001 611468
60557 611468 618294 623710 627156 628756 629164 629009 628649 628254 627778 626944 625713 624764 625049 626772 629265 632023
60541 632023 635477 640574 647905 657473 668956 681884 695739 710108 724736 739326 753406 766311
60529 766311 777159 784986 789340 790697 789957 787522 783272 777361 770462 763153 755611 748148 741424 735825
60515 735825 731139 727220 724459 723140 722792 722700 722808 723645 725621 728874 733533 739632 746960 755509 765941
60500 765941 779112 795188 813718 834541 858178 885308 916245 950784 988056 1026402 1063936
60489 1063936 1099423 1132327 1161899 1186579 1204431 1213919 1214167 1204997 1187024 1161491 1129736 1092982
60477 1092982 1052833 1011561 971381 933450 897883 864672 834164 806576 781535 758471 737295
60466 737295 718357 701841 687483 674861 663630 653414 643792 634606 626055 618255 610928 603868 597535
60453 597535 592720 589496 586908 583926 580442 577027 573990 571103 568298 566153 565365 565843 566591 566517 565233
60438 565233 563079 560695 558727 557716 557782 558367 558600 558108 557254 556465 555713 554846 554133 554003 554410 554909 555312 555814
60420 555814 556442 556860 556921 557069 557894 559518 561565 563551 565098 566000 566380 566672 567213 567882 568348 568571 568828 569221
60402 569221 569485 569496 569754 571029 573494 576471 579146 581327 583328 585393 587636 590354 593827 597743 601385
60387 601385 604594 608032 612153 616422 619984 622695 624913 626721 628083 629551 631913 635093 638102 640253
60373 640253 641777 643103 644259 645315 646777 648936 651180 652473 652416 651569 650918 651248 652794 655167 657725
60358 657725 660166 662680 665533 668801 672602 677131 682244 687391 692277 697319 703112 709731 716858 724173
60344 724173 731081 736312 738589 737918 735756 733598 731619 728895 724703 719299 713490 707823 702368 697131
60330 697131 692283 687854 683466 678730 673861 669578 666369 664078 662283 660786 659583 658589 657609 656604 655853
60315 655853 655883 657190 659887 663593 667793 672318 677442 683652 691488 701427 713534 727217 741632 756387
60301 756387 771638 787457 803372 818456 831552 841415 847079 848232 845041 837622 826020 810759
60289 810759 793022 774184 755463 737990 722642 709574 698269 688316 679878 673251 668304 664489
60277 664489 661135 657663 653882 650153 646870 643800 640482 637218 634877 633521 632152 630285 628898 629000
60263 629000 629994 630452 630099 630037 631104 632918 634575 635510 635539 634747 633591 632636 631978 631207 629998 628394 626548
60246 626548 624606 622907 621827 621342 621101 621016 621383 622381 623838 625647 628022 631142 634844 638832 642918 646881
60230 646881 650403 653403 656258 659458 663141 667062 670908 674481 677703 680661 683676 687186 691465 696412
60216 696412 701572 706417 710681 714423 717754 720627 722961 724902 726808 728983 731486 734110 736469 738178
60202 738178 739069 739219 738705 737500 735707 733734 731963 730226 727872 724518 720676 717471 715646 714893 714260
60187 714260 713187 711963 711129 710738 710489 710299 710350 710669 711110 711718 712597 713420 713591 713065 712483 712321 712419 712655 713477
60168 713477 715305 717844 720504 723116 725684 727774 728814 728856 728479 728024 727552 727444 728325 730212 732381 734371
60152 734371 736621 739699 743265 746372 748721 751158 754714 759403 764159 767917 770507 772493 774418 776435
60138 776435 778534 780795 783380 786480 790227 794413 798389 801542 803876 805716 806892 806719 804962 802279
60124 802279 799434 796502 793174 789431 785496 781447 777327 773464 770254 767705 765413 762919 759983 756789
60110 756789 753950 751953 750428 748503 746112 744369 744197 745134 746101 746889 748127 750117 752506 755002 757667
60095 757667 760476 763225 765938 768844 771857 774540 776662 778384 779887 781252 782706 784536 786603 788291
60081 788291 789051 788793 787696 785836 782971 778569 772222 764259 755726 747456 739373 731013 722461 714267 706713
60066 706713 699721 693437 688333 684640 682034 679929 677803 675408 672971 671057 669910 669096 668123 667125 666503
60051 666503 666259 666267 666959 668973 672203 675758 678837 681080 682204 681923 680244 677287 672900 667088 660637 654537
60035 654537 648851 642911 636655 630880 625991 621392 616462 611386 606609 602125 597796 593806 590342 587232
60021 587232 584299 581722 579634 577706 575495 573058 570902 569492 568918 568922 569134 569408 569813 570120 569697 568432
60005 568432 567436 568049 570188 572482 574060 575326 576848 578511 580190 582364 585401 588898 592295 595636 599188
59990 599188 602818 606268 609530 612375 614037 614034 612944 611684 610315 608228 605332 602338 599857 597743 595450
59975 595450 592728 589878 587518 586042 585288 584886 584913 585816 587515 589170 590234 591342 593663 597605 602551
59960 602551 607616 612195 615976 618907 621137 622669 623188 622499 620996 619444 618409 618023 618030 617774 616462 613898
59944 613898 610848 608423 607172 606958 607438 608346 609510 610932 612752 615010 617633 620785 624809 629511 633946
59929 633946 637343 639966 642655 645794 649169 652569 655970 659316 662612 666167 670296 674864 679609 684734
59915 684734 690695 697337 703707 708734 711804 712821 712188 710744 709272 707969 706643 705267 703936 702414
59901 702414 700360 698079 696424 695774 695623 695468 695610 696689 698806 701546 704628 708084 711982 716403 721655
59886 721655 728044 735321 742694 749562 755965 762145 767869 772523 775803 777991 779510 780407 780422 779391 777407
59871 777407 774686 771446 767809 763683 758809 753139 747154 741574 736714 732283 727810 723081 718142 713117
59857 713117 708216 703785 700219 697857 696984 697843 700493 704660 709796 715402 721420 728296 736507 745952 755972
59842 755972 765986 775805 785154 793305 799664 804601 809274 814600 820658 827009 833126 838513 842694 845219
59828 845219 845509 842868 836991 828417 818139 806881 795058 783251 772104 761811 752292 743920 737420
59815 737420 732814 729048 724998 720497 716127 712373 709240 706398 703454 700333 697485 695445 694093 692719
59801 692719 690873 688757 686700 684746 682892 681206 679510 677414 675001 673025 672177 672436 673314 674307 674969
59786 674969 675087 675110 675839 677356 678735 679203 679089 679140 679375 679273 678819 678745 679763 681944 684797 687661 690112
59769 690112 692294 694728 697664 700837 703993 707312 711010 714835 718319 721374 724342 727603 731291 735200
59755 735200 738872 742012 744904 748163 752001 756101 760208 764339 768354 771953 775260 778760 782332 785009
59741 785009 786100 786030 785641 785201 784481 783300 781572 779336 777098 775584 774724 773567 771653 769758 768646 767915
59725 767915 766888 765951 765962 766764 767378 767434 767474 767992 769052 770712 772980 775389 777441 779427 782066 785441 789047
59708 789047 792810 797199 802263 807345 811929 816113 820081 823736 826990 829859 832152 833616 834479 835324 836227
59693 836227 836546 835776 834225 832690 831677 831026 830054 828088 825109 821779 818601 815282 811211 806242 800523
59678 800523 793910 786255 778074 770290 763284 756783 750591 744836 739556 734644 730236 726628 723837 721740
59664 721740 720530 720425 720995 721445 721573 721789 722226 722528 722656 723206 724629 726658 728707 730341 731193 730876 729260
59647 729260 726560 723102 719291 715727 712803 710254 707619 705231 704149 704937 707000 709234 710870 711559 711150
59632 711150 709733 707567 704787 701335 697206 692530 687494 682441 677874 673945 670146 665938 661511 657380
59618 657380 653508 649523 645718 642957 641546 640930 640661 640961 642136 644117 646844 650514 655092 660038 664706
59603 664706 668712 671852 674181 676202 678400 680540 682005 682864 683880 685292 686382 686541 686054 685478 684917
59588 684917 684369 684132 684301 684361 683786 682671 681313 679572 677150 674197 671139 668144 665169 662296 659579 656720
59572 656720 653381 649806 646762 644789 643677 642745 641567 640386 639772 639868 640132 639960 639313 638470 637516 636566 636250
59555 636250 637323 639749 642789 646009 649649 653866 658316 662778 667684 673686 681065 689928 700673 713864
59541 713864 729630 747289 765549 783169 799507 814163 825974 832920 833765 829624 823324 817355 812975
59528 812975 810731 810633 811642 812124 811316 809722 807865 805410 801884 797464 792586 787289 781401 774906 767822
59513 767822 760129 752057 743953 735688 726802 717502 708902 701994 696895 693298 690952 689326 687567 685307
59499 685307 683044 681294 679856 678261 676405 674304 671797 668995 666530 664890 663921 663355 663350 664073 665237 666553
59483 666553 668242 670661 673803 677553 681999 687103 692467 697835 703353 708947 713934 717702 720332 722129
59469 722129 723096 723419 723970 725638 728456 731924 735856 740366 745348 750611 756354 762970 770494 778577 786777
59454 786777 794577 801456 807317 812518 817101 820354 821551 820742 818364 814529 809227 802875 796043 788859
59440 788859 781209 773398 766203 760420 756629 755017 755082 755869 756950 758824 762059 766595 772396 780141 790466
59425 790466 802878 816199 829847 843976 858607 873429 888366 903561 918790 933452 947108
59414 947108 959424 969585 976356 978774 976364 968833 956429 940844 925279 913060 906091 904342 906355
59401 906355 910235 914587 918665 921536 921397 916300 905756 891320 875477 860098 845965 833301 822340
59388 822340 813259 805709 798776 791788 785172 780215 777806 777612 778569 779868 781314 783014 784968 786864 788222
59373 788222 788924 789565 790912 793002 795253 797478 800213 803875 808278 813320 819494 827181 835884 844768 853700
59358 853700 863301 874196 886564 900201 914605 929156 943529 957797 971997 985878 999201 1011902
59346 1011902 1023781 1034333 1043063 1049564 1053228 1053451 1050332 1044563 1036432 1025577 1012029 996835 981228
59333 981228 965796 950746 936284 922268 908295 894694 882673 872829 864187 855417 846337 837488
59321 837488 828902 820276 811843 804112 797091 790593 784989 780747 777492 774349 771057 768038 765569 763592
59307 763592 762108 761107 760366 759942 760571 762865 766401 770381 774919 780965 789160 799444 811502 824780
59293 824780 838197 850503 860824 868341 871863 870598 865170 857194 848058 838734 830341 823911 819665
59280 819665 817290 816818 818560 822424 828034 835310 844116 853563 862499 870626 878401 886082 893628 901236
59266 901236 908982 916006 920965 923333 923513 921841 918246 912775 905658 897039 887464 878283 870564 863783
59252 863783 856753 849689 844131 840808 838886 837553 837104 837959 839691 841694 844019 846960 850364 853788 856839
59237 856839 859075 860084 859948 859151 857797 855329 851076 844730 836481 827341 819097 813008 808487 803868 798554
59222 798554 793523 789625 786451 783215 779902 776951 774438 772073 769582 766776 763588 760207 756846 753401
59208 753401 749790 746492 744164 742748 741577 740266 738864 737352 735861 735232 736314 738647 740835 742317
59194 742317 743792 745785 747928 749949 752218 754873 757421 759803 762883 767281 772500 777805 783221 789025
59180 789025 794901 800291 805054 809321 813194 817047 821548 826894 832531 838094 843971 850459 856945 862542
59166 862542 867030 870562 872829 873237 871662 868488 863998 858197 851163 843253 834969 826711 818563 810330
59152 810330 802017 794139 787115 780457 773179 765080 757027 749843 743503 737589 731954 726700 721992 718089
59138 718089 715109 712717 710535 708882 708449 709248 710613 712357 715076 719107 724082 729832 736824 745221 754392
59123 754392 764030 775090 788815 805301 823726 843643 865295 888773 913460 938414 962995 987120
59111 987120 1011013 1034707 1057763 1079568 1099715 1117781 1132947 1144321 1151581 1154870 1154195 1149502
59099 1149502 1141318 1130737 1118784 1106274 1094115 1083110 1073495 1065265 1058736 1054025 1050168 1045652 1039806
59086 1039806 1032855 1024773 1015141 1004179 992784 981390 969771 958131 947286 937536 928379 919605
59074 919605 911590 904249 896803 888969 881310 874061 866784 859579 853350 848227 842951 836657 830193 824747
59060 824747 820081 815143 809728 804595 800426 797398 795329 793665 791824 790026 789183 789594 790436 790901 791012
59045 791012 790959 790626 790296 790738 791903 792600 792371 792701 795351 800255 806119 812487 820155 829963 842093 856262
59029 856262 871879 888253 905105 922420 939528 955184 969028 981993 994467 1005008 1011851 1014972
59017 1014972 1015648 1014652 1011994 1007950 1003270 998601 994568 992158 992210 994658 998815 1004143 1010306 1016979 1024105
59002 1024105 1031837 1039784 1046874 1052439 1056736 1059957 1061513 1060859 1058184 1053745 1047465 1039839 1032163 1024976
58988 1024976 1017288 1008248 998562 989272 980335 971766 965122 962172 962685 965030 968493 973558 980375 988490
58974 988490 997820 1008457 1019653 1030396 1040880 1052123 1064230 1076342 1088275 1100809 1114165 1127363
58962 1127363 1139354 1149749 1158133 1163617 1165445 1163462 1157786 1148613 1136373 1121528 1104247 1084825
58950 1084825 1064297 1044031 1024854 1007104 991274 977958 967248 958825 952429 947784 944361 941716
58938 941716 939683 937746 934803 930210 924490 918265 911088 902248 892191 882176 872885 864316 856612 850002
58924 850002 844199 838807 834107 830653 828403 826984 826376 826565 827138 828107 830493 835033 840885 846782 852910
58909 852910 860450 869746 880269 891981 905320 920101 935737 952448 971009 991437 1013098 1035815
58897 1035815 1059599 1083589 1106733 1129432 1153136 1178315 1204177 1230226 1256494 1282037 1304744
58886 1304744 1323097 1336946 1346287 1350510 1349227 1342721 1331189 1314555 1293401 1269122 1242888 1215317
58874 1215317 1187252 1159810 1133495 1108283 1084782 1064206 1046852 1031654 1017594 1004671 993187
58863 993187 982957 973588 964765 956071 947283 938936 931677 924996 917514 908688 899237 889773 880122 870256
58849 870256 860744 851760 842552 832477 821876 811485 801631 792393 784013 776802 771087 767323 765673
58836 765673 765404 765344 765054 765042 765798 767241 769015 770709 771872 772450 773071 774240 775525 776284 776851 778069 779983
58819 779983 781938 783622 784889 784934 783034 779978 777440 775921 774567 772945 771555 770490 769078 767204 765642
58804 765642 764679 763580 761744 759208 755758 750918 745280 740591 737808 736071 734106 731715 729459 727842
58790 727842 727356 728486 731132 734710 739046 744394 750451 756324 761687 766980 772266 776978 781114 785538
58776 785538 790675 795840 800191 803319 804618 803302 799664 795377 791882 789191 786598 783761 780677 777446
58762 777446 774491 772335 770855 769397 767770 766353 765204 764007 762978 762826 763722 765321 767870 772143 778131
58747 778131 784998 792510 801336 811720 823139 835574 849791 865906 882852 899714 916531 933388
58735 933388 949848 965613 980627 994171 1005117 1013344 1019639 1023849 1024606 1021404 1015570 1008583 1000756
58722 1000756 992256 983926 976172 968141 958989 949106 939394 930242 921820 914402 907731 900836 893002 884171
58708 884171 874165 862572 849683 836380 822822 808419 793318 778540 764321 749908 735411
58697 735411 722252 711119 701124 691687 683633 677499 672325 667191 662545 659012 656150 653432 651206 649721
58683 649721 648427 647192 646989 648455 651124 654954 661104 670078 680564 691428 703520 718169 735127
58670 735127 753430 773092 794380 816274 837064 855726 871522 883116 889499 891095 888796 882605
58658 882605 872329 858855 843657 827752 812063 797854 785677 774715 764266 755112 748395 743995
58646 743995 741042 739190 738338 737969 737852 738547 740203 741714 742036 741459 740582 739091 736625 733888 731758 730266
58630 730266 729531 730636 734347 739906 746282 753603 762142 771016 779293 787377 795849 803852 810236 815445
58616 815445 820739 826165 830815 834432 837208 838509 837317 833701 828651 822830 816511 810218 804328 798563
58602 798563 792852 788018 784590 781730 778469 775312 773552 773761 776026 780763 788039 796891 806580 817781
58588 817781 831275 846257 861194 875606 889727 903192 915396 926393 936123 943485 947639 949640
58576 949640 951439 953827 956653 960470 966607 975975 988875 1005410 1025074 1046549 1068953 1092608 1117667
58563 1117667 1142859 1166535 1188026 1206985 1222504 1234074 1242338 1247715 1249486 1247526 1243628 1239561
58551 1239561 1234895 1228263 1219661 1209877 1198706 1185547 1170980 1156109 1141100 1125731 1110512 1095889
58539 1095889 1081386 1066905 1053675 1042435 1032059 1021608 1012372 1006012 1002107 999558 998999 1001456 1005792
58526 1005792 1009951 1013862 1018848 1025024 1031601 1038824 1047154 1055156 1060627 1063292 1064150 1062899 1058420 1051243
58512 1051243 1043040 1034060 1023455 1011743 1000549 990123 979357 968065 957155 946856 936849 927761
58500 927761 920408 914001 907274 900918 896699 894662 893503 893201 894907 898559 903010 908253 915243 923888
58486 923888 933519 944842 958946 974691 989586 1002901 1015397 1026401 1033877 1037295 1037714 1035179 1028703
58473 1028703 1018814 1007445 995224 981530 967207 954528 944261 935452 928191 923876 922563 922818 924566
58460 924566 929339 937250 946312 955257 964550 974145 982776 989906 995985 1000383 1001671 1000375 998953 998475
58446 998475 997776 996319 995311 995391 995758 996349 998450 1002348 1006632 1010540 1014850 1019906 1024987 1030217 1036889
58431 1036889 1045292 1054250 1063188 1072503 1081624 1089097 1094951 1100601 1105978 1109162 1109271 1107380 1104186 1099214
58417 1099214 1092674 1085626 1077859 1068138 1056963 1046537 1037591 1028865 1020152 1013095 1008339 1004632 1001460
58404 1001460 999935 1000398 1001647 1003214 1005899 1009517 1012696 1015436 1019155 1023653 1026755 1027508 1027051 1025907 1023405
58389 1023405 1020329 1018940 1019519 1019901 1019218 1019138 1020551 1022180 1023479 1025760 1029334 1032575 1035062 1038755 1044789
58374 1044789 1051852 1058889 1066674 1075630 1084804 1094077 1104719 1116856 1129041 1141018 1154011 1167588
58362 1167588 1179319 1188272 1195777 1202135 1206012 1207761 1209717 1212299 1213514 1213319 1214565 1218474 1223138 1227965
58348 1227965 1235516 1247209 1261026 1275369 1291517 1310334 1330152 1349790 1370177 1391135 1410098
58337 1410098 1425844 1440043 1453344 1463606 1469798 1473918 1477163 1478052 1476293 1474566 1474290 1473471 1470995 1469207
58323 1469207 1469922 1471684 1473334 1476509 1482213 1488664 1494974 1503172 1514184 1525604 1535915 1547092 1560600
58310 1560600 1574762 1588551 1603965 1622026 1640417 1657689 1675700 1695323 1713947 1729990 1745625
58299 1745625 1762254 1777719 1791008 1805227 1822646 1841090 1858432 1876296 1896123 1916076 1935234
58288 1935234 1956450 1981594 2008337 2034914 2063512 2095584 2128609 2161042 2195600 2233930 2272967
58277 2272967 2310377 2348577 2389487 2430563 2470259 2512153 2559245 2609298 2660150 2714253 2773263
58266 2773263 2833537 2891839 2950198 3010329 3068832 3122918 3175345 3228534 3279610 3326569 3373504
58255 3373504 3424170 3476324 3528142 3583981 3647635 3715986 3785653 3859774 3941800 4028888 4118124
58244 4118124 4212976 4316780 4426271 4538419 4657025 4785580 4920640 5059521 5207156 5367714
58234 5367714 5537129 5711867 5896983 6097045 6307651 6525096 6755792 7006523 7274424
58225 7274424 7556780 7861243 8195187 8554576 8935251 9345524 9795155 10282093 10803721
58216 10803721 11370953 11996895 12682131 13426876 14247410 15164635 16187766 17327190 18612900
58207 18612900 20082912 21767171 23705302 25970438 28656083 31854307 35671951 40253959
58199 40253959 45760167 52327132 60079325 69168243 79781081 92148363 106612627 123702582
58191 123702582 144079933 168324936 196648833 228635222 263110006 298229675 331705851
58184 331705851 360897461 382740402 394020820 392446406 378008967 353391332 322841146
58177 322841146 290386672 258743212 229297664 202549001 178447647 156661921 136893668
58170 136893668 119068027 103242408 89411610 77454726 67202665 58471787 51053182
58163 51053182 44737799 39359314 34786270 30889024 27546940 24674585 22210157 20087157
58155 20087157 18241081 16631544 15232393 14008139 12920682 11949627 11085328 10309593
58147 10309593 9601381 8953400 8365516 7828772 7331708 6874842 6463115 6090587 5747058
58138 5747058 5432830 5152425 4900060 4665323 4447358 4249899 4067724 3891315 3720284
58129 3720284 3559867 3408728 3262118 3122609 2995903 2879724 2767804 2661073 2564458 2476402
58119 2476402 2391860 2312010 2240840 2175570 2110341 2046258 1988197 1934776 1880883 1827277 1778430
58108 1778430 1733446 1688051 1643139 1602662 1565368 1527002 1488521 1453923 1422160 1389160 1355791
58097 1355791 1325962 1298898 1271021 1243510 1220269 1200297 1179707 1159570 1144140 1132802 1121221
58086 1121221 1109062 1099195 1090459 1078582 1063396 1048182 1032739 1013991 992734 972988 955143 936215
58074 936215 916434 899181 884737 870179 855254 842476 831702 820347 808730 799619 792804 785576
58062 785576 778260 773766 771852 769203 765066 761652 759090 755077 749440 744139 738923 731812 723618 717126
58048 717126 712043 705565 697754 691408 686734 680984 673433 666033 659099 651007 642326 635644 631056 626118
58034 626118 620468 616273 613968 611709 609108 607426 606087 603091 598836 595513 592933 589122 584739 582473
58020 582473 582135 580875 578317 576997 577503 577758 577539 579095 582577 585226 586041 587197 589953 593037 595873
58005 595873 599596 604047 607552 610482 615297 622215 628487 632813 636852 641509 645379 647934 650699 654041
57991 654041 655972 655235 652644 648585 642201 633815 625104 616213 605738 594038 583343 574066 564405 554210
57977 554210 545704 539554 533798 527684 523029 520612 518646 516194 514743 514852 514417 511996 509060 507376 506789
57962 506789 507025 508924 512304 515136 516490 518013 521055 524580 527339 529841 532746 535375 537257 539324
57948 539324 542391 546188 550793 557154 565352 574226 583425 593823 605380 616847 628217 641090 655862
57935 655862 670896 685180 699351 713245 725115 734371 742576 750453 756245 758340 757299 754124 748787
57922 748787 741804 735035 729446 723926 717583 711240 705460 699109 691358 683336 676460 670663 665393 660721
57908 660721 656442 651727 646655 642516 639770 637371 634808 632928 631995 630960 629527 628875 629368 629604 628724
57893 628724 627609 626771 625263 622872 621203 621208 621675 621568 621889 623709 626242 628470 630886 633934 636320 636634
57877 636634 635433 634198 633385 632747 632371 632138 631312 629762 628531 628316 628671 629426 631338 634471 637536 639840
57861 639840 642317 645727 649441 652952 656799 660901 663769 664633 664672 664908 664533 662595 659596 656070 651257
57846 651257 644754 637937 632158 626882 621031 614842 608928 602873 596345 590400 586103 582888 579623 576297
57832 576297 573423 570972 569202 569347 572023 575952 579553 582897 586855 591348 595651 599520 602790 604797
57818 604797 605279 605101 605125 605224 605098 605010 605050 604859 604722 605535 607017 607514 606397 604945 603989 602585 600235 598468
57800 598468 598708 600228 601774 603588 606203 608838 610858 613505 618298 624746 631254 637173 642407 646261
57786 646261 648486 650520 653978 658721 663737 668859 674163 678889 682546 685985 689790 692749 693607 693243 693286
57771 693286 693592 692828 690620 687333 682638 676218 669120 662630 656426 649533 642320 635894 630258 624912 620564
57756 620564 618445 618421 619461 621433 624788 629040 633245 637497 642363 647405 651923 656505 662068 667837 672069
57741 672069 674506 676408 678416 679996 680775 680895 680229 678669 676902 675568 673945 670784 666073 660748 655207
57726 655207 649492 644399 640869 638656 636902 635511 634693 633855 632478 631363 631371 631575 630442 628251 626533 625591
57710 625591 624564 623540 623492 624244 624487 623925 623623 624185 625228 626701 628982 631588 633507 634972 637238 640350
57694 640350 642737 643305 642561 641415 640294 639670 640094 641367 642868 644905 648641 654614 662508 672377 684919
57679 684919 700640 720062 744630 775971 814225 858539 909319 968701 1038676 1119949 1212310
57668 1212310 1314165 1421070 1525793 1620036 1695143 1741916 1752576 1724728 1663147 1577526 1478959
57657 1478959 1377531 1280638 1192088 1113124 1044280 985525 935364 891755 854195 823452 799144
57646 799144 779249 762325 748519 737858 729167 721456 715022 710333 706919 704091 701791 700095 698763
57633 698763 697751 697336 697417 697612 698253 700171 703186 706006 707973 709705 711606 713036 713592 713964 714730 715340
57617 715340 715103 714368 713982 714276 715198 716698 718440 719795 720652 721615 723009 724417 725582 726992 729137 731919
57601 731919 735140 738852 742804 746352 749336 752351 755715 758855 761084 762351 762906 762940 762912 763505 764814 766132
57585 766132 766859 767067 766997 766714 766478 766717 767331 767742 767895 768572 770424 773287 776568 779640 781840 782887 783462
57568 783462 784569 786188 787419 788013 788836 790613 793230 796495 800569 805274 809981 814559 819551 824989 830026
57553 830026 834189 838127 842641 847801 853455 859737 866575 873502 880469 888092 896655 905593 914352 922960
57539 922960 931380 939106 945860 951842 956882 960277 962027 963370 965455 968299 971634 975861 981312 987279
57525 987279 992720 997527 1002374 1007667 1013327 1019320 1025727 1032405 1039014 1045292 1051131 1056663 1062342 1068576
57511 1068576 1075169 1081565 1087675 1093989 1100900 1108551 1117181 1126729 1136025 1143453 1148774 1153418 1158651 1164269
57497 1164269 1169472 1174115 1178597 1183189 1187992 1193006 1197952 1202618 1207462 1213074 1218950 1223795 1227384 1231081
57483 1231081 1236109 1242276 1248846 1255599 1262434 1268942 1275128 1281745 1289258 1297258 1305415 1314128 1323522 1332791
57469 1332791 1341378 1349998 1359608 1370078 1380765 1391683 1403063 1414268 1424242 1432813 1440753 1448771 1457109
57456 1457109 1465897 1475215 1484957 1495062 1505700 1516883 1528216 1539361 1550376 1561329 1572093 1582801
57444 1582801 1593915 1605505 1616981 1627896 1638456 1648993 1659650 1670788 1682874 1695598 1708026
57433 1708026 1719990 1732332 1745255 1757623 1768709 1779549 1791528 1804509 1817485 1830301 1843467
57422 1843467 1856813 1869620 1881798 1893810 1905651 1916993 1928268 1940560 1954315 1968893 1983423
57411 1983423 1997504 2011135 2024609 2038522 2053405 2069230 2085517 2101732 2117438 2132455 2147254
57400 2147254 2162755 2179356 2196498 2213532 2230486 2247589 2264604 2281161 2297262 2313019 2328403
57389 2328403 2343731 2359769 2376853 2394536 2412628 2431821 2452504 2473687 2494053 2513524 2532901
57378 2532901 2552383 2571472 2590064 2608695 2627807 2647494 2667861 2688972 2710636 2732681 2755147
57367 2755147 2777730 2799586 2820336 2840745 2861653 2882732 2903170 2923131 2943488 2964408 2985287
57356 2985287 3006046 3027565 3050643 3075201 3100512 3125680 3149950 3173203 3196157 3219614 3243679
57345 3243679 3268110 3293048 3318715 3344639 3369926 3394292 3418237 3442350 3466961 3492335 3518591
57334 3518591 3545435 3572380 3599098 3625321 3650729 3675354 3699664 3723890 3747801 3771631 3796506
57323 3796506 3823137 3850725 3878072 3905315 3933499 3962781 3992203 4021161 4050032 4079257 4108737
57312 4108737 4138282 4167968 4197909 4228241 4259288 4291170 4323376 4355383 4387544 4420627 4454590
57301 4454590 4488563 4521974 4554960 4587684 4620108 4652496 4685334 4718554 4751466 4783739 4815930
57290 4815930 4848865 4882867 4917641 4952524 4986915 5020878 5055218 5090547 5126407 5161830 5196546
57279 5196546 5231074 5265847 5300927 5336415 5372362 5408292 5443556 5478218 5512903 5547726 5582128
57268 5582128 5615926 5649787 5684356 5719439 5754397 5788983 5823513 5858458 5894033 5930002 5965864
57257 5965864 6001319 6036353 6070707 6103633 6134661 6164308 6193496 6222533 6251258 6279858 6308812
57246 6308812 6338118 6367336 6396380 6425543 6454806 6483918 6513260 6543758 6575593 6607745 6639242
57235 6639242 6670385 6702273 6735557 6770016 6805025 6839922 6874031 6906806 6938105 6968236 6997570
57224 6997570 7025969 7052592 7076497 7097675 7117339 7136863 7156533 7175535 7193043 7208946 7223600
57213 7223600 7237349 7250593 7264069 7278752 7295255 7313360 7332323 7351781 7372263 7394559 7418721
57202 7418721 7444054 7470079 7497070 7525527 7555564 7586950 7619414 7652703 7686656 7721324 7756753
57191 7756753 7792542 7827949 7862390 7895581 7927272 7957376 7986187 8013879 8039906 8063602 8085247
57180 8085247 8105717 8125124 8142781 8158506 8172902 8186199 8197935 8207944 8216430 8222731 8225339 8223719
57168 8223719 8218871 8211546 8201274 8187853 8172315 8155313 8135859 8112841 8086543 8057125 8022633 7980465
57156 7980465 7930806 7877521 7825743 7779192 7738961 7703529 7670065 7636648 7603287 7570693 7538982
57145 7538982 7508208 7479062 7452001 7426455 7401822 7378382 7356193 7333908 7309826 7283303 7254010
57134 7254010 7220610 7181569 7136710 7086638 7031086 6969104 6900649 6826958 6749642 6670336 6590919
57123 6590919 6513218 6438661 6368619 6304527 6247239 6196985 6154300 6120031 6094007 6074759 6060901
57112 6060901 6051625 6045843 6042781 6044068 6053509 6074356 6108888 6161088 6237219 6343072 6483616 6666771
57100 6666771 6905356 7215323 7616187 8134519 8802547 9650293 10700834 11971931 13475070
57091 13475070 15209899 17162774 19304753 21572371 23846654 25984689 27919999 29752596
57083 29752596 31725523 34083812 36918303 40091613 43265582 46004410 47921167 48811922
57075 48811922 48702110 47779874 46279441 44398237 42269124 39959741 37485603 34843933
57067 34843933 32054465 29174835 26284302 23462073 20778199 18289157 16030821 14016774
57059 14016774 12245809 10708494 9386817 8254535 7283480 6449268 5731426 5112479 4579192
57050 4579192 4121859 3730476 3393540 3101262 2847200 2625727 2430579 2256915 2102245
57041 2102245 1963965 1838063 1721144 1611662 1508332 1409475 1314761 1225597 1142999 1066934
57031 1066934 998222 938923 890067 850978 821522 803056 796586 802067 820177 852341 897576 950708
57019 950708 1004267 1050290 1079977 1084881 1061235 1012615 947284 873654 798328 726030 659227 598350
57007 598350 543457 495123 453333 416839 384481 356145 331713 310148 290499 272891 257702
56996 257702 244555 232822 222405 213492 206171 200718 197559 196683 197795 201257 207953 218074 230910
56983 230910 245879 262540 279294 293209 301645 303361 298166 286810 271487 255142 239625 225278
56971 225278 212322 201451 192892 186206 181399 179061 179121 180805 184262 190981 202079 217302 236167
56958 236167 258713 284444 311546 337651 360291 376225 381909 375857 359934 337789 312782 287588
56946 287588 264298 243786 225755 210179 198036 190196 186475 186398 189995 197318 208081 222463 241373
56933 241373 265249 293252 324040 356369 388209 416133 436349 445955 443117 427346 400540 366956
56921 366956 331130 295947 262859 232946 206935 184716 165561 148691 133490 119835 108384
56910 108384 99829 93620 88213 82786 77817 73792 70468 67807 66496 66869 68266 70050 72369 75396
56896 75396 78794 82610 87730 94719 103085 112383 123185 136189 151242 168139 187518 209914 234317
56883 234317 258369 279467 295054 302755 301526 292673 279175 264161 250195 239096 231512 226956
56871 226956 224886 225504 229256 236181 246349 260413 279184 303196 333136 369985 413925 463426
56859 463426 515869 568535 618297 660766 690679 703596 697700 674833 640191 600278 560289 523156
56847 523156 490661 464464 445747 434685 430877 434014 444086 461676 488270 525605 574421 634393
56835 634393 705041 785463 872685 961137 1043927 1113627 1161894 1180640 1165732 1119769 1050851
56824 1050851 969024 883533 801386 726560 660480 603729 556991 520304 492679 473337 462730
56813 462730 461800 471078 491027 522332 564868 616860 675441 737126 797023 848409 884047 897957
56801 897957 886570 850128 794012 727279 658306 591950 530881 477712 434294 400115 373196
56790 373196 352309 337256 327764 323551 325175 333559 348780 370082 396583 427018 459144 490151
56778 490151 517214 537001 545617 540436 521860 492661 456157 415734 375038 337012 302760 272186
56766 272186 245323 222279 202590 185737 171830 160815 151557 142838 134730 127883 122023 116390 111219
56753 111219 107362 104639 101835 98351 94785 91899 89927 88810 88202 87347 85773 83982 82781 82254 82123
56738 82123 82637 84137 86087 87520 88210 88549 88675 88633 89001 90317 92140 93580 94442 94981 95048 94525 94156 94763
56720 94763 95978 96909 97706 99191 101250 102916 103968 105166 106832 108388 109323 109645 109340 108481 107894 108664
56704 108664 110826 113309 115145 116000 115779 114714 113688 113455 113587 113110 111974 110921 110092 108918 107265 105601
56688 105601 104021 102212 100377 99205 98836 98795 98906 99406 100262 101282 102743 104875 106949 107948 108023 108207 108854
56671 108854 109521 110202 111419 113058 114367 115210 116248 117896 120190 123520 128181 133222 137084 139535 141729
56656 141729 144299 146784 149042 151728 154999 158076 160582 163005 165412 166899 166974 166506 166723 168033 170142
56641 170142 172445 174103 174636 174665 175061 175296 173833 170372 166492 163664 161758 159844 157319 153847 149412
56626 149412 144912 141598 139429 137057 133813 130598 128381 127092 126486 126779 127641 127821 126640 124943 123787
56611 123787 123153 122674 122606 123168 123761 123816 123691 123910 124219 124211 124248 124900 125911 126493 126293 125538 124681 124373 125244 127167
56591 127167 129211 130694 131827 133024 134253 135439 136802 138361 139736 140806 141899 143012 143629 143706 144006
56576 144006 144991 146172 147080 148073 149614 151520 153504 155729 158275 160780 163224 166401 170953 176539 182568
56561 182568 189159 196750 205251 214130 222821 230653 236950 241702 245580 248863 251057 251992 252532 253598 255100
56546 255100 256441 257478 258289 258549 257821 256168 253974 251382 248318 244723 240551 235925 231416 227622 224359
56531 224359 220904 217154 213763 210964 208185 205105 202193 199760 197380 194761 192381 190677 189227 187264
56517 187264 184472 181005 177348 174356 172659 171809 170779 169397 168302 167408 165768 163333 161465 160965 160834
56502 160834 159817 158165 157024 156997 158054 159941 161924 162977 163027 163220 164328 165739 166570 166748 166400 165355
56486 165355 164055 163782 165004 166540 167312 167787 168698 169514 169479 169134 169372 169869 169896 169955 171059 172893 174177 174518
56468 174518 174534 174410 173757 172842 172692 173781 175503 176994 177784 177709 176950 176122 175768 175865 176173 176690 177325 177590 177218
56449 177218 176626 176305 176220 176246 176554 177086 177343 177231 177328 177763 177704 176676 175507 175147 175380 175522 175622 175993 176339
56430 176339 176323 176310 176637 176813 176413 176092 176709 178017 179172 179928 180479 180729 180652 180724 181113 181181 180658 180532 181730
56411 181730 183654 185097 185903 186642 187379 187914 188639 190001 191641 193042 194408 195939 197059 197457 198046 199612
56395 199612 201280 201670 200954 200461 200840 201956 203963 206990 210194 212579 214491 217041 220326 223320 225189
56380 225189 225705 224959 223750 223646 225398 227816 229339 230086 231121 232506 233461 233828 233894 233381 232082 230920
56364 230920 230822 231137 230714 229957 230186 231436 232642 233553 234692 235691 235529 234329 233320 233063 233195 233692 234827
56347 234827 236080 236657 236967 238054 239743 240902 241376 242097 243399 244823 246451 248904 252039 255119 258082
56332 258082 261228 263939 265288 265643 266118 266803 267155 267684 269299 271343 272276 272203 272636 273935 275138 276283
56316 276283 278592 282025 284946 286694 288407 290728 292735 293848 294889 296467 298075 299567 301881 305526
56302 305526 309751 313908 318199 322517 326020 328524 331003 334105 337452 340812 344632 348961 353216 357454
56288 357454 362554 368700 374972 380768 386320 391603 396190 400428 405262 410660 415762 420815 427279 435631
56274 435631 444717 453678 462852 472357 481633 491052 502306 516395 532620 550226 569615 591355 615391
56261 615391 641820 671138 703228 737465 774244 815022 860587 910723 965792 1026877 1093927
56250 1093927 1165467 1240605 1319682 1402525 1487803 1574516 1662278 1749519 1833181 1910850 1981542
56239 1981542 2043923 2095621 2134945 2161458 2174338 2172237 2155572 2126951 2088476 2040473 1983678
56228 1983678 1920535 1853162 1781955 1707495 1632092 1558095 1486094 1415934 1348113 1283141 1220871
56217 1220871 1161486 1105868 1054301 1006189 961635 921646 886145 853535 822982 795285 770701
56206 770701 747819 725573 704577 685512 668029 652146 638785 627850 617647 607279 597757 589743
56194 589743 582191 574428 567583 562611 558736 555101 552167 550212 548299 545986 544275 543646 543041 542065 542160
56179 542160 544200 546944 549321 552250 556563 561087 564516 567485 571088 575054 578979 583698 589784 596266
56165 596266 602290 608451 615165 621623 627793 635471 645746 657355 669181 682349 698110 715688 734124
56152 734124 754256 776899 800993 825688 852476 883178 917607 955400 998496 1049581 1109470
56141 1109470 1178111 1256706 1346841 1448867 1562812 1689184 1826739 1970813 2115655 2256990
56131 2256990 2390977 2512997 2619962 2712437 2792662 2862050 2922080 2975122 3021692 3058556 3081827
56120 3081827 3090554 3085537 3066889 3035162 2992951 2942668 2883978 2815251 2735661 2643892 2537309
56109 2537309 2415369 2282413 2144875 2007512 1874316 1750428 1639798 1542500 1456962 1383233
56099 1383233 1321655 1270448 1227501 1192845 1166703 1146878 1130656 1117524 1107584 1099393 1091965 1086659
56087 1086659 1084343 1082997 1080995 1080252 1083020 1088035 1093121 1099120 1107683 1117628 1127237 1137864 1151308 1165777
56073 1165777 1178441 1189917 1202202 1214201 1223534 1230889 1238298 1244875 1248679 1251198 1255558 1261622 1267111
56060 1267111 1272227 1278952 1287084 1295129 1303826 1314781 1327061 1339147 1352556 1369443 1388342 1406590
56048 1406590 1425075 1446134 1468605 1489733 1510253 1532824 1557099 1581151 1606072 1634147 1664091
56037 1664091 1693085 1721901 1753045 1785599 1817174 1849138 1884495 1922323 1959771 1997756 2039030
56026 2039030 2082462 2125102 2168084 2214414 2262672 2309192 2354772 2402911 2453193 2503021 2554168
56015 2554168 2610712 2671994 2734360 2798194 2866328 2937474 3008646 3082240 3163014 3249905 3338686
56004 3338686 3430689 3530451 3636760 3745071 3857087 3978508 4108727 4242446 4380232 4527362
55994 4527362 4683244 4842444 5005656 5179217 5364303 5557254 5759961 5978844 6214045
55985 6214045 6461149 6723194 7009062 7320386 7652486 8007959 8396307 8820379 9277070
55976 9277070 9771442 10315791 10914783 11567157 12282683 13081318 13975293 14970168 16085477
55967 16085477 17356449 18814852 20490382 22436313 24734795 27474843 30749362 34679614
55959 34679614 39416909 45109405 51888541 59896186 69304358 80313248 93186473 108337153
55951 108337153 126363314 147926492 173481071 202959503 235557900 269744658 303450885
55944 303450885 334187561 358952670 374307463 377208427 366463585 343698370 312824052
55937 312824052 278326229 243722451 211107639 181521592 155390157 132743060 113360431
55930 113360431 96929530 83119061 71568382 61904497 53803675 47008842 41292508
55923 41292508 36445675 32306534 28762754 25717384 23077766 20776937 18774855 17031642
55915 17031642 15500824 14149611 12961901 11917424 10987834 10155510 9416282 8760366 8168293
55906 8168293 7628194 7139889 6698936 6292683 5915075 5570095 5257177 4967040 4694890
55897 4694890 4444451 4215883 4002275 3801029 3616835 3450411 3295340 3148676 3013993
55888 3013993 2891541 2775830 2665393 2564885 2475160 2391025 2311061 2240010 2178961 2122463
55878 2122463 2067869 2018470 1974714 1930973 1883780 1835097 1785091 1729978 1669800 1610437 1555072
55867 1555072 1500975 1447158 1397617 1354218 1313496 1273365 1236176 1202553 1169017 1134481 1102576
55856 1102576 1074745 1047386 1018611 991624 968575 947011 925213 905231 887703 869296 848359
55845 848359 827971 810528 794185 777224 760995 745988 729879 712169 696114 683524 672036
55834 672036 659897 648976 640735 633613 626645 621314 617724 613328 607597 603460 601980 600106 595986 591968
55820 591968 589924 588091 585180 583258 583643 583979 582294 580278 579805 579782 579110 579214 580915 582061 580827 578300
55804 578300 575510 571174 564622 557689 551445 544298 535566 527513 521461 515193 506747 497697 490232 484027
55790 484027 478386 474436 472656 471220 469241 468805 471267 474317 475170 474070 472375 469957 466844 464590 463544
55775 463544 461348 456515 450798 445717 439627 430821 420765 411483 402338 392227 382525 374884 368329 361407
55761 361407 355150 351101 348322 345198 342433 341459 341509 340861 339467 337892 335144 330051 323402 316439 308670
55746 308670 299349 289603 280927 273017 265234 258648 254360 251241 247551 243509 240230 237522 234768 232639
55732 232639 231831 231414 230341 229296 229173 229140 228053 226429 225154 223755 221765 220219 219828 219278 217362 215253
55716 215253 214497 214330 213203 211580 210846 210712 210075 209378 209785 210945 211718 212317 213705 215656 217292 218639
55700 218639 219926 220312 219122 217379 216323 215442 213722 211763 210756 210474 210121 210205 211576 213578 215050 216400
55684 216400 218872 222560 226807 231688 237397 243038 247690 251826 256164 260141 262995 265215 267322 268465
55670 268465 267939 266852 266546 266711 266807 267830 270576 273578 275065 275717 277083 278487 278037 275728 272895 269409
55654 269409 264031 257051 250015 243282 236215 229349 223895 219426 214495 209331 205518 203101 200439 196993
55640 196993 193927 191724 189401 186520 183972 182234 180603 178677 177103 176417 176371 176665 177206 177612 177447 176856
55624 176856 175917 173846 170173 166295 164340 164683 165883 166775 167209 167153 166616 166315 166938 167813 167592 166019 163858
55607 163858 161495 158913 156606 155113 154010 152682 151594 151414 151493 150759 149613 149275 149697 149808 149480 149568 150302
55590 150302 151222 152389 154023 155309 155275 154639 155138 157261 160181 163526 167444 171291 174252 177086 181362
55575 181362 186991 192388 197107 202396 209013 216305 223698 231330 238820 244976 249169 251775 253040 252746
55561 252746 250998 248091 243759 237836 231430 225888 220859 215059 208738 203567 200145 197460 194931 193084
55547 193084 191972 190735 189112 187831 187198 186819 186856 187857 189144 189068 187207 184702 182214 179278 175966 173296
55531 173296 171445 169276 166237 163167 160649 158153 155412 153071 151308 149264 146538 143862 141705 139623
55517 139623 137559 136331 136163 136115 135644 135323 135314 134618 132740 130780 129868 129672 129370 129037 129079 129207 128889 128198 127483
55498 127483 126837 126353 126252 126423 126590 127115 128627 130703 132059 132332 132434 132798 132620 131405 129977 129217 128913
55481 128913 128554 128190 127858 127129 126006 125342 125705 126625 127491 128377 129482 130596 131582 132551 133272 133303 133024 133492
55463 133492 134953 136524 137629 138561 139324 139259 138331 137500 137213 136758 135720 134806 134520 134278 133644 133212 133414 133544
55445 133544 132901 131891 131172 130670 130248 130337 131011 131437 131160 131021 131904 133419 134721 135745 136744 137462 137725 138112
55427 138112 139109 140243 140911 141413 142390 143921 145900 148532 151651 154330 156078 157708 160234 163534 166862
55412 166862 169915 172527 174105 174353 173966 173607 172732 170338 166440 161969 157656 153797 150639 148163 145862
55397 145862 143433 141285 139782 138506 136897 135095 133530 132244 131256 130940 131339 131760 131786 132094 133437 135386
55381 135386 136902 137689 138197 138656 138872 138615 137692 136074 134406 133720 134017 133885 132238 129732 127686 126346
55365 126346 125203 124230 123700 123257 122400 121628 121991 123580 125415 126723 127497 127881 127820 127431 127078 126934 126827 126467
55347 126467 125626 124343 123206 123008 123829 124917 125761 126697 128096 129658 131028 132360 133680 134360 133954 132972
55331 132972 132121 131415 130676 130231 130310 130422 130252 130483 131741 133244 133634 132780 131710 131041 130580 130267 130386 130782
55313 130782 130833 130308 129569 128862 128148 127610 127687 128448 129456 130291 130894 131443 132178 133170 134042 134273 134022 134155 135042
55294 135042 135976 136252 136197 136411 136644 136247 135300 134421 133829 133423 133412 134032 134868 135330 135504 135747 135708 134700 132923
55275 132923 131429 130846 130876 130999 130962 130636 130074 129693 129780 129905 129445 128587 128149 128493 129284 130246 131440 132717 133516
55256 133516 133454 132721 131814 131212 131312 132292 133940 135718 137003 137360 136883 136290 136203 136322 135971 135492 136054 137681
55238 137681 138615 137497 135250 133768 133515 133569 133433 133455 133732 133868 133773 133676 133407 132694 132066 132430 133639 134474 134210
55219 134210 133348 132651 132261 132064 132180 132715 133470 134162 134647 134870 134913 135045 135394 135677 135561 135153 134814 134755 135129
55200 135129 136117 137513 138599 138894 138664 138250 137484 136344 135549 135740 136579 137471 138496 139683 140015 138506 135985
55183 135985 134500 134953 136463 137992 139344 140415 140714 140112 139212 138598 138402 138754 139841 141213 141807 141158
55167 141158 140078 139805 140797 142525 144101 145018 145560 146422 147678 148461 148070 147004 146251 146030 145978 146193 147055
55150 147055 148249 148988 149140 149156 148989 148143 146860 146144 146336 146621 146260 145482 144853 144540 144499 144681 144740 144170 143045
55131 143045 141978 141203 140269 138908 137550 136753 136624 137036 137876 138912 139850 140673 141536 142367 143014 143622 144350
55114 144350 144893 145000 145194 146121 147337 147720 147109 146523 146635 147016 147168 147310 147763 148369 148915 149473 149979 150129
55096 150129 149988 150054 150496 150956 151305 151870 152656 153072 152800 152266 151974 151914 151891 151887 151851 151669 151449 151319 150970 150097 149248
55075 149248 149333 150220 150838 150792 150789 151144 151102 150243 149488 149860 151069 152204 153126 154297 155686 156717 157022 156605 155523
55056 155523 153978 152474 151386 150542 149624 148736 148224 148159 148334 148538 148544 148072 147006 145520 143925 142636 142178
55039 142178 142829 144192 145527 146444 146872 146669 146017 145957 147465 149917 151490 151354 150474 149997 149946 150007 150432 151353
55021 151353 152067 151905 151227 150795 150713 150740 151104 152200 153821 155396 156697 157770 158506 158876 159306 160212 161395
55004 161395 162327 162832 163088 163212 163199 163035 162615 161872 161151 161015 161456 161856 161952 162209 162911 163591 163796 163789 163916 163931
54984 163931 163555 163167 163277 163792 164429 165355 166813 168550 170258 172116 174153 175500 175116 173147 170886 169472
54968 169472 169159 169698 170807 172215 173669 174949 175798 176082 176161 176680 177773 178912 179759 180543 181308 181512 180991
54951 180991 180625 181334 182896 184494 185909 187404 188871 190048 191357 193641 197075 201041 205068 209333 214328
54936 214328 220558 228393 237671 247527 257147 266521 275957 285140 293273 299931 305040 308122 308280 305041
54922 305041 298767 290246 280357 270094 260320 251363 243137 235625 228922 222967 217671 213217 209825 207316
54908 207316 205237 203355 201697 200285 199170 198513 198304 198238 198300 199154 201451 204962 208939 213107 217711 222788
54892 222788 228108 233890 240928 249744 259971 270673 280962 290178 297775 303203 305941 305768 303015 298300
54878 298300 291891 283651 273780 263192 252877 243246 234336 226186 218665 211469 204772 199413 195890 193619
54864 193619 191693 189853 188050 185716 182477 179222 177367 177100 177259 176956 176392 175997 175669 175157 174473 173612
54848 173612 172490 171382 170889 171157 171591 171572 171060 170300 169412 168516 167935 167937 168445 169113 169589 169715 169653 169756 170125
54829 170125 170486 170757 171425 172879 174603 175647 175790 175649 175662 175636 175362 175033 174836 174657 174442 174444 174848 175471 175996
54810 175996 176218 175937 175027 173774 172853 172766 173531 174989 177074 179639 182313 184766 186899 188630 189731 190123
54794 190123 190246 190878 192505 194858 197150 198887 200471 202853 206498 210949 215560 220422 226254 233506 241904
54779 241904 250826 259903 269319 279598 290953 302673 313352 321944 328353 332873 335479 335997 334593
54766 334593 331614 327207 321619 315648 310178 305288 300323 294878 289291 284160 279692 275603 271363 266580
54752 266580 261319 256008 250878 245760 240662 236229 233239 231893 231965 233342 235888 239057 242257 245557 249533
54737 249533 254475 260200 266464 273087 279785 286362 292952 299496 305124 308630 309540 308167 304691 298897
54723 298897 290909 281538 271675 261820 252429 244157 237397 231836 226789 221878 217285 213452 210609 208479
54709 208479 206524 204519 202683 201082 199247 196782 194126 192220 191496 191510 191507 190991 189817 188116 186180 184275
54693 184275 182613 181480 180995 180637 179592 177918 176808 177209 178701 180226 181270 181684 181085 179529 178250
54678 178250 178477 179709 180290 179646 178776 178516 178556 178454 178453 178770 178947 178532 177752 177040 176424 175806 175375 175350 175625 175943
54658 175943 176133 176116 176068 176539 177868 179518 180570 180866 180957 180945 180266 178845 177630 177552 178520 179818 180967 181871
54640 181871 182604 183379 184341 185218 185538 185239 184610 183741 182656 181912 182175 183109 183602 183288 182920 182978 182956 182508 182223
54621 182223 182583 182996 182761 182272 182374 182987 183211 182516 181117 179477 178115 177666 178386 179666 180543 180689 180555
54604 180555 180675 181188 181876 182394 182571 182680 183145 183862 184220 183981 183692 183860 184195 184060 183307 182251 181201 180432
54586 180432 180315 180996 182097 183068 183661 183883 183746 183398 183144 183084 183017 182922 183183 183994 184928 185391 185245 184733 184151
54567 184151 183835 184101 184887 185715 186252 186563 186728 186708 186750 187305 188242 188800 188695 188611 189126 189857 190271 190697 191754
54548 191754 193281 194666 195850 197186 198562 199590 200439 201609 202892 203425 202937 202218 202091 202490 202840 202881
54532 202881 202720 202382 201712 200699 199654 198955 198643 198402 198001 197630 197578 197756 197867 197946 198281 198788 199014 198814 198458
54513 198458 197986 197139 196111 195611 195766 195694 194737 193484 192950 193236 193700 193981 194149 194199 194091 194063 194229 194152 193417
54494 193417 192414 191894 191988 192246 192403 192464 192314 191951 191917 192750 194112 195225 196004 196967 198037 198419 197888 197408
54476 197408 198085 200035 202632 205259 207425 208609 208597 207879 207318 207422 208067 208830 209387 209642 209674 209701 210065 211019
54458 211019 212300 213043 212465 210721 208777 207343 206301 205275 204286 203507 202812 201969 201026 200154 199355 198618 198087
54441 198087 197795 197571 197491 197978 199064 199993 200137 199968 200484 201898 203449 204403 204718 204816 205131 205847 206759 207539
54423 207539 208289 209478 211021 211952 211495 210069 208724 208037 208104 208990 210357 211086 210318 208720 207843 208320 209508
54406 209508 210729 211859 212742 213056 213007 213262 213932 214374 214234 213992 214183 214778 215565 216499 217400 217970 218394 219266
54388 219266 220530 221219 220705 219667 219215 219492 219765 219623 219432 219628 220045 220149 219729 219199 219149 219640 220100 220047 219712
54369 219712 219737 220452 221782 223580 225617 227398 228568 229428 230485 231545 231906 231545 231485 232776 235573 239348
54353 239348 243488 247443 250832 253719 256463 259101 261208 262490 263115 263284 262898 261838 260215 258153 255711
54338 255711 253145 250869 248956 247076 245079 243223 241655 240104 238342 236554 234958 233429 231786 230152
54324 230152 228722 227472 226324 225370 224685 224155 223652 223143 222529 221716 220962 220763 221150 221493 221270 220688 220235 219960
54306 219960 219576 219031 218574 218341 218175 217823 217186 216491 216233 216712 217519 217829 217386 216895 217206 218386 219828 220943
54288 220943 221446 221198 220291 219212 218582 218614 219000 219311 219378 219303 219255 219320 219509 219865 220449 221191 221888 222517 223392 224724
54268 224724 226214 227435 228544 230079 231986 233386 233533 232655 231574 230849 230591 230781 231341 232019 232566 233030
54252 233030 233626 234337 234750 234330 232889 230931 229490 229337 230172 230835 230473 229336 228267 227705 227486 227460 227869
54235 227869 228912 230223 231025 230851 229945 228965 228433 228579 229425 230653 231518 231412 230632 230146 230418 230866 230691 229706
54217 229706 228042 225687 222913 220649 219663 219619 219660 219656 220109 221009 221698 221825 221659 221409 221065 220934 221449 222254 222376
54198 222376 221625 220972 221185 221897 222491 223100 224089 225168 225739 225751 225585 225418 225179 224895 224584 224050 223187 222227 221377
54179 221377 220435 219154 217759 216780 216552 217031 217777 217988 217019 215175 213545 212782 212519 212287 212290 212754 213127 212804
54161 212804 212234 212451 213597 214738 215150 215088 215115 215327 215592 216103 217226 218857 220281 220822 220622 220576 221387 222817
54143 222817 224095 224912 225620 226549 227657 228916 230450 232043 233072 233268 233132 233273 233758 234438 235360 236457
54127 236457 237315 237806 238539 240056 241930 243238 243754 244090 244834 246091 247738 249627 251620 253774 256341 259209
54111 259209 261640 263065 263835 264643 265468 265803 265686 265723 266032 265969 265107 263878 262974 262584 262468 262392 262254 262155 262545
54092 262545 264013 266781 270600 275247 280802 287381 294992 303854 314538 327499 342662 359598 377892
54079 377892 396975 415699 432347 445196 452970 454817 450222 439363 423664 405545 387224 369745
54067 369745 353375 338626 326292 316482 308302 300839 294006 288091 283008 278532 274929 272726 271938 271946
54053 271946 272088 272086 272009 272207 273169 275086 277562 279970 282006 283787 285672 288215 291920 296676 301738 306656
54037 306656 311902 318162 325359 332968 341019 350063 360287 371368 383145 395691 408548 420566 430768
54024 430768 438927 445080 449013 450518 449771 447131 442867 437312 431037 424567 418018 411188 403915 396274
54010 396274 388573 381204 374395 368034 361794 355387 348664 341700 334930 328963 323955 319384 314739 310270
53996 310270 306655 304103 302225 300619 299010 296996 294278 291249 288707 286869 285261 283734 282902 283142 283714
53981 283714 283458 282085 280287 278763 277608 276607 275708 275072 274868 275122 275716 276524 277509 278600 279473 279728 279428
53964 279428 279231 279754 280830 281642 281619 281056 280742 281088 281771 282345 283036 284674 287778 291909 296083 299671 302801
53947 302801 306047 309944 314635 319761 324753 329395 334013 339050 344717 351254 359110 368347 378060 387010
53933 387010 394958 402943 412058 422360 433203 444392 456722 471438 489341 510354 533776 558740
53921 558740 584236 608845 630889 649039 662492 670409 671793 666585 656586 644547 632234 619870
53909 619870 607385 595408 584689 575116 565878 556378 546683 537261 528625 521118 514734 509072 503638
53896 503638 498239 492995 487952 482766 476904 470210 463179 456434 449909 442810 434503 425193 415603 406282
53882 406282 397496 389461 382281 375840 370091 365273 361478 358171 354551 350248 345343 339942 334219 328659
53868 328659 323688 319169 314871 311233 308924 307649 306233 304096 301904 300424 299435 298230 296611 294813
53854 294813 292870 290706 288634 287155 286245 285264 283697 281760 280161 279377 279187 279011 278714 278825 279700 280738
53838 280738 280957 280295 279674 279673 279827 279547 279121 279185 279698 280068 280082 280048 280068 279811 279164 278591 278571 278997 279432 279798 280467
53817 280467 281619 282815 283456 283579 283882 284946 286738 289098 292297 296603 301476 305875 309420 312742 316489
53802 316489 320591 324866 329861 336400 344376 352583 359865 366117 371923 377472 382200 385547 387791 389812
53788 389812 392054 394052 395130 395239 394770 393789 391996 389413 386627 384130 381761 379004 375633 371825 367786
53773 367786 363481 358760 353654 348497 343654 339127 334610 330040 325789 322135 318795 315390 312128 309547
53759 309547 307730 306231 304715 303119 301293 299130 297096 295955 295696 295391 294396 293168 292453 292201 291824 291207
53743 291207 290871 291123 291486 291099 289555 287330 285427 284470 284117 283517 282291 280884 280003 280010 280806 281942 282794
53726 282794 283031 283014 283441 284564 286168 288192 290744 293352 294953 295066 294508 294464 295176 295979 296391 296708 297619
53709 297619 299543 302339 305529 308862 312576 316897 321385 325252 328316 331090 333886 336448 338687 341031
53695 341031 343723 346410 348914 351798 355540 359594 362914 365110 366533 367547 368315 369087 370039 370908 371272
53680 371272 371139 370922 370950 371415 372550 374420 376579 378308 379107 378809 377562 375986 374931 374553 373996 372515
53664 372515 370590 369313 368948 368790 368268 367404 366255 364731 363074 361864 361301 360932 360215 358943 357109 354898
53648 354898 352947 352077 352514 353715 355038 356199 357067 357559 357936 358739 360104 361528 362555 363382 364492 365995
53632 365995 367613 369146 370677 372423 374492 376682 378482 379506 380004 380658 381806 383153 384436 385996 388391
53617 388391 391658 395310 398945 402500 405997 409404 412893 416906 421769 427306 432973 438253 442831 446533
53603 446533 449392 451807 454403 457591 461389 465770 470926 476986 483635 490330 496837 503239 509525 515504
53589 515504 521238 527171 533713 540824 547975 554236 558528 560260 559779 557759 554195 548630 541497 534329
53575 534329 528161 522393 515963 509124 503219 498969 495799 492846 489878 487055 484430 481970 479742 477847
53561 477847 476354 475317 474668 474082 473252 472269 471550 471401 471770 472310 472507 471961 470844 469883 469620 469870 470208 470682
53543 470682 471612 472955 474398 475950 477801 479672 480959 481685 482749 485011 488451 492436 496436 500308 504200
53528 504200 508415 513262 518969 525781 534028 543757 554367 565004 575413 586141 597867 610787 624681
53515 624681 639240 654205 669473 685191 701612 718788 736523 754655 773264 792579 812756
53504 812756 833623 854610 875177 895534 916644 939207 962854 986667 1010226 1033767 1057551
53493 1057551 1081609 1105949 1130486 1154785 1178394 1201415 1224328 1247307 1270118 1292549 1314409
53482 1314409 1335200 1354450 1372408 1389827 1407027 1423819 1440404 1457602 1475812 1494344 1512160
53471 1512160 1528829 1544390 1558694 1571370 1582270 1591608 1599650 1606344 1611116 1613105 1611853 1607762 1601548
53458 1601548 1593399 1583105 1570912 1557579 1543502 1528452 1512368 1495752 1478879 1461206 1442005
53447 1442005 1421265 1399627 1377730 1355908 1334167 1312225 1289900 1267662 1246384 1226372 1207107
53436 1207107 1188187 1169942 1152835 1136920 1122436 1110259 1100967 1093844 1087610 1081974 1077722 1075363
53424 1075363 1074482 1074606 1076070 1079682 1085835 1094118 1103637 1113609 1123787 1134429 1145924 1158623 1173005
53411 1173005 1189555 1208142 1227858 1247839 1268104 1289281 1311863 1336141 1362558 1391392 1422179
53400 1422179 1454098 1487059 1521886 1559298 1599207 1641178 1685115 1731217 1779564 1830063 1882493
53389 1882493 1936370 1991033 2046197 2102227 2159568 2218028 2276877 2335509 2393608 2450704 2506008
53378 2506008 2558963 2609771 2659115 2707360 2754202 2799037 2841479 2881400 2918633 2952807 2983452
53367 2983452 3010123 3032378 3049774 3061967 3068749 3069825 3064492 3051679 3030571 3001383 2965489 2924605
53355 2924605 2879831 2831535 2780076 2726301 2671227 2615473 2559201 2502451 2445370 2388257 2331603
53344 2331603 2276025 2221986 2169620 2118857 2069490 2020991 1972615 1924082 1876004 1829362 1784637
53333 1784637 1741763 1700638 1661308 1623822 1588452 1555959 1527094 1501764 1479111 1458434 1439572
53322 1439572 1422378 1406368 1391069 1376186 1361291 1345881 1330043 1314612 1300311 1287117 1274818
53311 1274818 1263746 1254437 1246741 1239796 1232987 1226610 1221500 1218185 1216464 1215779 1215881 1217068 1219761 1224144
53297 1224144 1230373 1238822 1249731 1262813 1277614 1294073 1312177 1331325 1350764 1370709 1392202 1415734
53285 1415734 1440736 1466614 1493449 1521167 1548820 1575326 1600441 1624438 1647351 1669149 1690169
53274 1690169 1710649 1730099 1747811 1763688 1777866 1789765 1798301 1803061 1804589 1803455 1799632 1792913
53262 1792913 1783368 1771101 1755881 1737266 1715034 1689480 1661344 1631324 1599609 1566154 1531558
53251 1531558 1497183 1463992 1431606 1399057 1366221 1333943 1302959 1273351 1244968 1217705 1191222
53240 1191222 1164931 1138457 1111692 1084340 1055943 1026577 997155 968744 941856 916477 892476
53229 892476 869767 848279 828017 809035 791362 775133 760725 748426 737879 728150 718480 708739
53217 708739 699018 689122 678669 667508 655816 643904 632063 620473 609022 597290 584961 572351
53205 572351 560346 549707 540400 531754 523263 515087 507690 501193 495318 489764 484299 478630 472631 466706
53191 466706 461377 456407 450910 444602 438382 433218 428939 424682 420122 415619 411402 407331 403477 400270
53177 400270 397904 395999 393964 391466 388489 385203 381776 378185 374374 370743 368036 366392 364924 362854
53163 362854 360714 359609 359471 358938 357052 354241 351407 348939 347009 346038 346115 346415 345881 344351 342549 341142
53147 341142 340245 339716 339391 338946 337890 335998 333722 331994 331482 331944 332465 332487 332499 333431 335525 338167 340726
53130 340726 343049 345085 346621 347704 348860 350457 352160 353377 354052 354638 355447 356341 356954 356922 356013 354382
53114 354382 352657 351460 350799 350127 348986 347365 345510 343694 342222 341337 340876 340216 338828 336838 334848
53099 334848 333256 332035 331192 331074 331826 332801 333024 332296 331409 331096 331240 331418 331755 332681 334107 335502 336673
53082 336673 337852 338930 339268 338601 337601 337143 337347 337665 337648 337206 336375 335322 334577 334753 335862 337120 337578
53065 337578 336850 335209 333177 331172 329391 327839 326402 325005 323726 322735 322112 321748 321477 321204 320910 320703
53049 320703 320927 321977 323769 325515 326383 326321 325864 325227 324147 322698 321611 321407 321713 321884 321864 321913 321906 321570
53031 321570 321145 321067 321162 320930 320589 321008 322460 324164 325352 326099 326817 327548 328208 329024 330170 331297 331895 331943
53013 331943 331807 331755 331952 332734 334423 336859 339389 341334 342388 342740 342993 343701 344737 345250 344524 342766 340845
52996 340845 339401 338473 337901 337732 338212 339507 341477 343638 345448 346700 347610 348495 349546 350941 352861 355190
52980 355190 357450 359268 360819 362588 364849 367537 370393 372976 374740 375487 375733 376325 377656 379450 381248
52965 381248 382811 384016 384617 384311 382953 380686 377909 375113 372562 370100 367349 364171 360956 358445 357265
52950 357265 357499 358588 359742 360556 361177 361819 362237 361975 361052 360094 359588 359246 358380 356850 355285 354337 353984
52933 353984 353779 353515 353279 353011 352448 351607 350897 350508 350046 349041 347558 345996 344554 343286 342485 342480 343132 343948
52915 343948 344694 345476 346217 346552 346340 345840 345234 344412 343413 342663 342459 342574 342660 342740 343010 343414 343813 344385 345480
52896 345480 347148 349116 351149 353157 355009 356573 357950 359311 360385 360395 358771 355893 352947 350969 350108
52881 350108 349802 349536 349219 348897 348422 347649 346723 345899 345177 344408 343651 343083 342659 342248 342089 342626 343829 345160
52863 345160 346382 347877 349898 351982 353546 354640 355614 356383 356659 356751 357407 358678 359493 358679 356096 352533
52847 352533 348819 345375 342432 340176 338504 336979 335258 333474 331949 330645 329244 327822 327049 327420 328539
52832 328539 329553 330130 330606 331242 331842 332199 332463 332865 333439 334315 335974 338842 342716 346885 350717 354053
52816 354053 357182 360614 364647 368753 371427 371018 367033 360648 353840 347941 342939 338081 333012 328221
52802 328221 324464 322056 320780 320206 319813 319077 317848 316523 315480 314516 313287 312133 311839 312526 313424 313963
52786 313963 314472 315419 316484 316960 316824 316882 317885 319746 321684 322949 323456 323723 324097 324196 323435 322033 320944
52769 320944 320684 320783 320663 320507 320786 321374 321717 321632 321422 321319 321325 321546 322204 323221 324113 324469 324341 324130 324168 324471
52749 324471 324880 325434 326476 328208 330276 332061 333353 334388 335283 335943 336577 337703 339404 341066 342145
52734 342145 342800 343525 344624 346306 348750 351654 354145 355575 356050 355867 354958 353340 351571 350128 348768
52719 348768 347076 345241 343661 342168 340372 338528 337307 336927 337119 337687 338416 338764 338510 338461 339555 341301
52703 341301 342140 341414 340014 338909 338074 337258 336855 337322 338359 339355 340280 341588 343468 345617 347528 348762
52687 348762 349184 349210 349587 350675 352066 353003 352937 351677 349462 347121 345722 345665 346281 346555 346069 345135 344308 344020
52669 344020 344443 345472 346835 348273 349503 350163 350164 350065 350677 352156 353918 355512 357119 359026 361122 363199
52653 363199 365280 367204 368299 367970 366456 364611 363056 361896 361082 360612 360350 359973 359268 358376 357755 357944
52637 357944 359227 361325 363497 365104 366065 366766 367645 368955 370649 372231 372890 372074 370010 367467 365024
52622 365024 362695 360257 357766 355558 353810 352253 350508 348678 347449 347396 348283 349217 349547 349420 349435 349852
52606 349852 350298 350240 349714 349471 350261 351948 353532 354164 353973 353769 354117 354932 355818 356512 357015 357530 358284 359309
52588 359309 360383 361306 362078 362694 362982 362832 362438 362135 362151 362663 363745 364985 365543 365041 364116 363605 363437 362922
52570 362922 361921 361004 360499 360149 359780 359644 359847 360028 359930 359826 360046 360421 360513 360107 359333 358507 358034 358116 358426
52551 358426 358283 357274 355533 353445 351397 349747 348648 347915 347387 347363 348185 349464 350335 350499 350436 350531 350676
52534 350676 350873 351462 352461 353314 353695 353981 354544 355171 355618 356179 357177 358379 359472 360712 362562 364952 367391
52517 367391 369541 371252 372385 373094 374017 375687 377959 380305 382333 383652 383770 382730 381429 380608 379807
52502 379807 378024 375164 372069 369321 366882 364888 363887 363989 364546 364986 365434 366110 366715 366878 366882 367406 368705
52485 368705 370475 372478 374834 377574 380229 382173 383230 383714 383886 383718 383338 383369 384376 386107 387737 388868
52469 388868 389866 391139 392562 393841 394906 395645 395634 394582 392776 390683 388319 385396 381936 378379 375121
52454 375121 372221 369498 366777 364171 362161 361116 360653 359891 358558 357359 356912 356860 356499 355835 355379 355273
52438 355273 355261 355294 355474 355554 355149 354361 353602 352905 352060 351389 351635 352976 354763 356333 357481 358075 357958 357524
52420 357524 357719 359005 360764 362141 363142 364526 366931 370494 375060 380392 386267 392711 400068 408645
52406 408645 418339 428741 439407 449807 459069 466000 469471 468840 464266 456713 447520 437837 428488 420194
52392 420194 413517 408397 404057 399752 395591 392375 390657 390101 389819 389177 388244 387590 387760 388935 390959 393593
52376 393593 396666 400010 403336 406280 408617 410336 411396 411580 410915 410210 410626 412394 414365 415347 415535 415993
52360 415993 416996 417782 417956 418147 418936 420023 420923 421743 422640 423208 423225 423521 425213 428281 431634 434414 436603
52343 436603 438518 440399 442413 444476 446200 447525 449166 451872 455518 459613 464318 470073 476448 482418
52329 482418 487780 493247 499099 504768 509999 515335 521069 526762 532326 538598 546140 554313 562336 570568
52315 570568 579840 590027 600288 610489 621518 634244 648806 664832 681701 698639 715132 731377
52303 731377 747905 764796 781670 798394 815221 832103 848300 863018 876216 888569 900709
52292 900709 912662 924043 934695 944949 955145 965073 974181 982269 989569 996129 1001632 1006055 1010020
52279 1010020 1014081 1017972 1021008 1022996 1024352 1025486 1026511 1027419 1028125 1028374 1028023 1027366 1026794 1026096 1024568 1021970
52263 1021970 1019031 1016820 1015910 1016449 1018743 1023246 1029899 1037882 1046353 1055254 1064989 1075404 1085594 1094987
52249 1094987 1104192 1114263 1125301 1136391 1146921 1157347 1168422 1180101 1191578 1202110 1211491 1219928
52237 1219928 1227798 1235436 1242955 1250230 1257088 1263365 1268732 1272798 1275486 1277075 1277702 1277158 1275397 1272917
52223 1272917 1270272 1267370 1263610 1258618 1252591 1246030 1239406 1233056 1227163 1221825 1217217 1213566 1210799 1208363
52209 1208363 1205663 1202679 1199987 1198185 1197391 1197298 1197604 1198340 1199741 1201804 1204197 1206797 1210085 1214508 1219526
52194 1219526 1223815 1226592 1228292 1229778 1231409 1233133 1234930 1236604 1237560 1237390 1236555 1235995 1236097 1236387 1236187 1235247
52178 1235247 1233799 1232237 1230660 1228600 1225372 1220868 1215768 1210822 1206274 1202206 1198923 1196525 1194482 1192163
52164 1192163 1189589 1187228 1185340 1183993 1183347 1183272 1182977 1181688 1179613 1177588 1176004 1174800 1174288 1175025 1176817
52149 1176817 1178750 1180374 1182027 1183782 1185019 1185401 1185463 1185665 1185606 1184792 1183579 1182650 1182055 1181493 1181177 1181643 1182840
52132 1182840 1184190 1185541 1187493 1190689 1195196 1200615 1206408 1212094 1217438 1222554 1227660 1232732 1237595 1242197
52118 1242197 1246677 1251330 1256748 1263708 1272473 1282413 1292757 1303621 1315776 1329458 1343996 1358760
52106 1358760 1373948 1390056 1406938 1423768 1439838 1455125 1470105 1485218 1500536 1515867 1531066
52095 1531066 1546110 1560820 1574748 1587583 1599556 1611133 1622264 1632258 1640480 1646956 1652172 1656473
52083 1656473 1659714 1661338 1660734 1657695 1652576 1645877 1637827 1628638 1619046 1609974 1601536 1593001 1584145 1576131
52069 1576131 1570422 1567079 1564810 1562617 1560771 1560113 1561037 1563391 1566814 1570808 1574818 1578669 1582744 1587400
52055 1587400 1592412 1597301 1602075 1607255 1613305 1620379 1628558 1637856 1647862 1657774 1667088 1675965 1684650 1692725
52041 1692725 1699320 1704088 1707701 1711213 1715028 1718560 1720826 1721331 1720385 1718643 1716359 1713166 1708501 1702253
52027 1702253 1694963 1687522 1680687 1674822 1669873 1665515 1661369 1657189 1652936 1648674 1644384 1639782 1634328 1627472
52013 1627472 1618936 1608677 1596542 1582145 1565295 1546515 1526874 1507150 1487330 1467020 1446188
52002 1446188 1425287 1404729 1384527 1364419 1344055 1322971 1300685 1277122 1252852 1228610 1204520
51991 1204520 1179967 1154336 1127799 1101268 1075591 1050848 1026447 1001863 977200 953037 930011
51980 930011 908712 889846 873972 860964 850073 840744 833047 827082 822314 817975 813832 809956 805843
51967 805843 800450 793215 784513 774971 764880 754564 744745 736083 728674 722385 717377 713852 711548 709952
51953 709952 708874 708450 708750 709896 712403 716934 723592 731789 740799 750104 759214 767544 774651 780420 784962
51938 784962 788464 791052 792650 793091 792543 791628 790799 789717 787602 784071 779306 773545 766933 759846 752933
51923 752933 746807 742086 739693 740555 744882 752144 761879 774119 788998 806484 826727 850203 877116
51910 877116 906835 937966 968597 996407 1019029 1034628 1041901 1039575 1026575 1003156 971457 934558
51898 934558 895160 855300 816676 780597 747838 718976 694723 675513 660978 650246 642702 638156
51886 638156 636447 637266 640276 645124 651360 658505 666026 673014 678190 680599 680167 677323 672396 665831 658747
51871 658747 652615 648149 644765 641246 636869 631990 627683 624706 622728 620784 618538 616571 615141 613283
51857 613283 609853 605068 600128 595398 589866 582637 574227 565930 558441 551561 544972 538899 534046 531074
51843 531074 530056 530353 531155 532215 533877 536345 539199 541744 543658 545157 546631 548204 549578 550328 550431
51828 550431 550413 550845 551796 553026 554488 556259 558062 559346 559880 559872 559384 558098 555869 553074 550105 546877
51812 546877 543264 539800 537436 536563 536603 536664 536379 536036 536061 536584 537435 538438 539635 541251 543475 546187 548815
51795 548815 550540 550833 549837 548135 546089 543656 540859 538133 535976 534478 533472 532975 533164 534104 535850
51780 535850 538740 543085 548524 554064 558885 562848 566158 568866 570816 571787 571520 569818 566791 562858 558465
51765 558465 554009 550050 547212 545616 544642 543567 542371 541706 542139 543601 545556 547538 549483 551617 554133
51750 554133 556955 559758 562134 563802 564794 565468 566166 566834 567241 567631 568833 571403 574952 578661 582219 585832
51734 585832 589468 592654 595045 596763 598162 599721 602158 606065 611206 616665 621855 626903 631781 635650
51720 635650 637544 637422 636161 634771 633965 634157 635287 636777 638124 639561 641712 644675 647819 650465 652263
51705 652263 652720 650945 646408 639854 633132 628028 625388 625236 627295 631081 635608 639429 641197 640204 636317
51690 636317 629654 620572 609921 598947 588760 579827 571994 564851 558114 551830 546329 541930 538696
51677 538696 536516 535374 535425 536757 539215 542544 546719 552191 559742 569939 582578 596741 611416 625772
51663 625772 638749 648865 654983 657186 656468 653620 648862 642491 635296 628123 621524 615995 612149 610207
51649 610207 609608 609442 609149 608558 607452 605425 602154 597655 592263 586448 580509 574410 568029 561560 555451
51634 555451 549923 544880 540382 536779 534173 532085 530046 528210 527015 526373 525635 524291 522295 519718 516588
51619 516588 513275 510666 509535 509713 510193 510150 509742 509793 510840 512720 515003 517515 520274 523237 526353 529688
51603 529688 533286 537120 541484 547165 554787 564098 574337 585132 596436 607578 617024 623303 625769
51590 625769 624519 620362 615134 611210 610017 611323 614455 619793 628555 641449 658168 677955 699911
51577 699911 722779 745116 766008 785375 803412 819943 834317 845747 853780 858773 862058 865615
51565 865615 871414 880855 894414 911687 931936 954657 979205 1003703 1024857 1039516 1046397 1046145
51553 1046145 1040047 1029090 1013901 994791 971714 944641 914191 881671 848488 815791 784594
51542 784594 755802 729900 706816 686233 667941 651935 638294 626914 617212 608312 599707 591663
51530 591663 584724 579011 574309 570560 567783 565528 562995 559911 556988 555281 555271 556564 558284 559718 560862
51515 560862 562392 564939 568323 571653 574108 575415 575696 575236 574408 573465 572278 570532 568275 566011 564182
51500 564182 562828 561752 560758 559622 558189 556603 555145 553696 551652 548572 544631 540179 535191 529507
51486 529507 523497 518027 513621 509906 506026 501519 496684 492112 488028 484235 480693 477920 476530 476482 477002
51471 477002 477291 477077 476498 475778 475217 475200 475897 477060 478363 479883 481952 484560 487270 489862 492839 497025
51455 497025 502816 510058 518555 528310 539261 551182 564130 578647 595127 613025 630956 647375
51443 647375 660864 670147 674619 675184 674019 673055 672814 672691 671843 669399 664284 655584 643252 628230 611869
51428 611869 595399 579751 565556 553158 542715 534218 527474 522272 518614 516515 515560 515067 514855 515351
51414 515351 516650 517971 518568 518787 519654 521587 524069 526458 528648 531062 534417 539332 545636 552222 558043
51399 558043 563146 568266 573716 579347 585403 592521 600798 609642 618790 628835 640571 654443 670903
51386 670903 690585 713685 739675 768053 799011 832963 869721 908412 947797 986393 1022565
51375 1022565 1054850 1081912 1102078 1113507 1115228 1107681 1091945 1068888 1039482 1005393 968474 929862
51363 929862 890147 850376 812202 776959 745013 716106 690031 666786 646364 628554 612945
51352 612945 599167 587172 577064 568616 561230 554602 549043 544806 541378 537968 534493 531479 528987
51339 528987 526268 522643 518230 513553 508902 504491 500783 498080 495862 493056 489156 484785 481045 478490
51325 478490 476903 475845 475196 475226 476243 478154 480332 482090 483452 485248 488221 492182 496414 500724 505558
51310 505558 511012 516380 521008 525069 529023 532681 535306 536392 535774 533299 529049 523859 518918 514715
51296 514715 510826 506724 502339 497776 493119 488696 485068 482549 481105 480783 481741 483716 486091 488680 491938
51281 491938 496048 500348 504020 506874 509109 510788 511985 513015 514029 514764 515203 516105 518280 521612 525310
51266 525310 528883 532270 535235 537354 538591 539300 539607 539260 538099 536215 533623 530270 526496 523043 520403
51251 520403 518504 517089 516101 515498 515054 514624 514452 515016 516527 518535 520020 520085 518805 517245 516362 516029 515475
51234 515475 514473 513521 512866 512045 510654 509034 507723 506670 505542 504623 504713 506070 507992 509759 511542 513906
51218 513906 516688 519001 520469 521787 523766 526319 528969 531957 536010 541080 546146 550507 554522 558711
51204 558711 562792 566098 568395 569629 569382 567375 564262 561169 558546 556176 554128 552845 552267 551758 551134
51189 551134 550926 551218 551022 549489 547201 545504 544834 544427 543560 542365 541325 540539 539823 539129 538510 537887 537201
51172 537201 536749 537058 538302 540035 541646 542949 544162 545370 546250 546436 545917 545020 544133 543596 543573 543813 543688
51155 543688 542788 541485 540644 540813 541908 543636 545866 548496 551122 553015 553446 552192 549935 547971 547102
51140 547102 546757 545608 543162 540318 538169 536754 535460 534272 533893 534613 535673 536099 535793 535497 535911 537207
51124 537207 539192 541499 543615 545157 546253 547305 548319 548928 549311 550493 553188 556729 559887 562525 565549
51109 565549 569235 572576 574676 575912 577139 578453 579468 580236 581007 581419 580825 579255 577261 574959 572113
51094 572113 569139 567034 566075 565457 564563 563747 563422 563159 562397 561437 560940 560814 560396 559566 558984 559201 560088 561190
51076 561190 562147 562756 563088 563728 565471 568603 572664 577012 581393 585933 590868 596444 602880 610266 618608
51061 618608 627967 638444 649987 662408 675582 689383 703300 716389 727938 738168 748159 759047
51049 759047 771288 784529 797842 809978 819564 825526 827654 826787 824131 820123 814044 804988 793208
51036 793208 780278 767940 757066 747721 739703 732557 725410 717464 708853 700601 693626 688136 684110
51023 684110 681864 681724 683491 686754 691557 698216 706581 716055 726461 738306 751911 766727 781848
51010 781848 796938 812296 828238 844748 861579 878356 894671 910275 925073 938818 951038
50999 951038 961514 970522 978280 984412 988423 990550 991607 992055 991681 990243 987889 984861 981268 977480
50985 977480 974412 973111 974220 977992 984538 993821 1005561 1019388 1035012 1052136 1070421 1089836 1111060
50972 1111060 1135343 1163769 1196586 1233238 1273130 1316342 1363392 1414205 1467649 1522403 1578033
50961 1578033 1634673 1691741 1747618 1800835 1850993 1898152 1941729 1980548 2013803 2041590 2064560
50950 2064560 2083449 2098959 2111856 2123026 2133450 2143937 2154787 2165751 2176354 2185890 2192947 2195427
50938 2195427 2191681 2181606 2166292 2146753 2123522 2097309 2069134 2039312 2006811 1970218 1929191
50927 1929191 1884504 1836905 1786599 1733968 1680181 1626663 1574224 1523031 1473214 1425129 1379156
50916 1379156 1335686 1295303 1258587 1225585 1195786 1168732 1144430 1123009 1104319 1088042 1073907
50905 1073907 1061500 1050176 1039545 1029917 1021864 1015438 1010199 1005921 1002780 1000803 999594 998792 998421 998560
50891 998560 999001 999549 1000431 1002124 1004876 1008648 1013372 1018974 1025153 1031401 1037429 1043484 1050170 1057868 1066346
50876 1066346 1074963 1083398 1092119 1101986 1113395 1126025 1139524 1154258 1171157 1190913 1213498 1238495
50864 1238495 1265769 1295763 1329261 1366961 1409307 1456596 1509168 1567504 1632247 1704070 1783381
50853 1783381 1870137 1964072 2065070 2173084 2287575 2407342 2531057 2657735 2786446 2915755
50843 2915755 3043723 3168234 3286993 3397424 3497066 3584210 3657906 3717396 3761947 3791377
50833 3791377 3806619 3809765 3803629 3791063 3774385 3755452 3736254 3719054 3705579 3696399 3691434 3690536
50821 3690536 3692847 3695878 3696176 3690934 3678254 3656028 3621771 3574025 3513057 3439683 3354194 3257077
50809 3257077 3150150 3036293 2918419 2799205 2681273 2566882 2457631 2354942 2260473 2175528
50799 2175528 2100424 2035072 1979866 1935383 1901446 1877098 1861334 1853166 1851197 1853896 1860347 1870123
50787 1870123 1882421 1895873 1909209 1921486 1931704 1938841 1942490 1942954 1940576 1935478 1927993 1918737 1907897
50774 1907897 1894928 1879180 1860432 1838582 1813366 1784810 1753653 1720849 1686819 1651554 1615336
50763 1615336 1578979 1543387 1509141 1476541 1445831 1417361 1391698 1369661 1352123 1339589 1331841
50752 1331841 1328064 1327466 1329750 1334825 1342215 1351263 1362121 1376038 1394183 1416557 1442665 1472981 1508905
50739 1508905 1551198 1599246 1652171 1709990 1773140 1841353 1913599 1988881 2066446 2145256 2223792
50728 2223792 2300577 2374592 2444981 2510559 2569859 2621695 2665516 2701079 2727772 2744428 2749995
50717 2749995 2744485 2729298 2706750 2679295 2648995 2617441 2586167 2557184 2532801 2514544 2502298
50706 2502298 2494869 2491250 2490861 2492483 2493689 2491814 2485184 2472979 2454181 2427299 2391318 2346576 2294573
50693 2294573 2237157 2176011 2112781 2049360 1987907 1930589 1879263 1835261 1799266 1771319 1751082
50682 1751082 1738269 1732913 1735290 1745784 1764802 1792585 1828888 1872949 1923887 1980875 2042751 2107780
50670 2107780 2174159 2240471 2305237 2366317 2421464 2469501 2510414 2544372 2571389 2592013 2607475
50659 2607475 2618608 2625144 2626524 2622843 2614513 2601544 2583903 2562277 2537779 2511052 2482376 2452620
50647 2452620 2423434 2396398 2372543 2352773 2338154 2329465 2326833 2330008 2338644 2352095 2369246 2388845
50635 2388845 2409889 2431675 2453779 2476073 2498480 2520587 2541766 2561732 2580555 2597799 2611894
50624 2611894 2620432 2620702 2609983 2586379 2550507 2506306 2459343 2413956 2372128 2334699 2302685 2277050
50612 2277050 2257912 2244543 2235982 2231206 2228923 2227611 2225848 2222459 2216459 2207029 2193408 2174664 2149775
50599 2149775 2118224 2080433 2037421 1990247 1940019 1888223 1836481 1785871 1736768 1689422 1644423
50588 1644423 1602539 1564357 1530138 1499753 1472629 1447990 1425304 1404355 1384941 1366847 1350245
50577 1350245 1335757 1323829 1314257 1306459 1300068 1295073 1291754 1290857 1293582 1300882 1312693 1328149 1346572
50564 1346572 1367950 1392420 1419723 1449546 1482149 1518263 1558211 1601417 1646979 1694561 1744329
50553 1744329 1795941 1848022 1898999 1948249 1995998 2042192 2085986 2126492 2163607 2197882 2229946
50542 2229946 2260367 2289852 2319243 2349315 2380593 2413163 2446718 2481162 2517229 2556057 2598000
50531 2598000 2642473 2689287 2739511 2794428 2854095 2917594 2984265 3053813 3125259 3196608 3265622
50520 3265622 3330401 3389219 3440471 3482880 3515159 3535430 3541677 3533122 3510689 3475873 3429585 3372301
50508 3372301 3304853 3228792 3146398 3060645 2974784 2891599 2813188 2741474 2678478 2625894 2584713
50497 2584713 2555392 2537951 2531792 2535975 2549899 2573080 2603800 2638508 2673089 2704348 2729752 2746329
50485 2746329 2750774 2740704 2715252 2674522 2619161 2550596 2471180 2383690 2290875 2195439 2100048
50474 2100048 2007000 1917849 1833398 1754045 1680266 1612855 1552563 1499346 1452182 1409894 1372074
50463 1372074 1339056 1311176 1288396 1270449 1256987 1247527 1241524 1238450 1237657 1238272 1239547 1241146 1242819
50450 1242819 1243964 1244001 1243207 1242690 1243441 1245752 1249624 1255190 1262412 1270746 1279587 1288921 1299153 1310313 1321836
50435 1321836 1333276 1345001 1357929 1372628 1388878 1406154 1424293 1443537 1464040 1485631 1508035
50424 1508035 1531009 1554153 1576942 1599201 1621385 1644132 1667703 1692189 1718124 1746411 1777601
50413 1777601 1811494 1847530 1885266 1924349 1964329 2004731 2045122 2084871 2122898 2157836 2188511
50402 2188511 2214287 2235095 2251145 2262362 2267885 2266082 2255282 2234638 2204428 2165764 2120132 2069099
50390 2069099 2014161 1956711 1898185 1840244 1784683 1733025 1686246 1644976 1609905 1581825 1561247
50379 1561247 1548175 1542364 1543584 1551400 1564729 1581856 1600896 1620101 1637774 1652190 1661717 1664890
50367 1664890 1660403 1647381 1625905 1597181 1563045 1525266 1485226 1443906 1401927 1359727 1317891
50356 1317891 1277270 1238728 1202814 1169682 1139150 1110840 1084497 1060352 1038972 1020690 1005397
50345 1005397 993001 983758 977940 975508 976452 981123 989764 1001769 1015815 1030772 1046118 1061426 1075706
50332 1075706 1087322 1094400 1095417 1089831 1078498 1063486 1047316 1032142 1019253 1009051 1001521 996739
50320 996739 994804 995253 996996 999224 1002164 1006514 1012290 1018748 1025440 1032775 1041374 1051236 1061706 1072012
50306 1072012 1081658 1090612 1099262 1107985 1116564 1124190 1130113 1134119 1136363 1137050 1136443 1134883 1132534 1129214
50292 1129214 1124629 1118627 1111187 1102380 1092580 1082552 1073105 1064717 1057625 1052135 1048656 1047529 1048960 1053049
50278 1053049 1059704 1068549 1079126 1091219 1104962 1120564 1137933 1156476 1175234 1193264 1209955 1224995
50266 1224995 1238241 1249846 1260463 1271028 1282156 1293828 1305674 1317374 1328709 1339498 1349671
50255 1349671 1359339 1368733 1378272 1388794 1401454 1417136 1436083 1458298 1484209 1514650 1550212 1590793
50243 1590793 1635781 1684470 1736177 1790012 1844597 1898163 1949113 1996696 2041069 2082744 2122072
50232 2122072 2159202 2194025 2225633 2251882 2269871 2277074 2272084 2254593 2225131 2184941 2135806 2079860
50220 2079860 2019682 1958463 1899516 1845188 1796224 1752249 1712566 1676220 1641522 1606100 1567789
50209 1567789 1525585 1479841 1431782 1382911 1334693 1288499 1245511 1206496 1171625 1140570 1112769
50198 1112769 1087547 1064216 1042488 1022881 1006291 992904 981743 971589 962040 953362 945706 939085
50186 939085 933963 930972 929872 929500 929121 929257 930786 933713 937345 941200 945152 949016 952724 956723 961521
50171 961521 966878 972074 976920 981851 987021 991993 996511 1000947 1005763 1011088 1017105 1024287 1032915 1042783
50157 1042783 1053669 1065626 1078434 1091238 1103122 1113711 1122907 1130508 1136536 1141545 1146067 1150125
50145 1150125 1153737 1157513 1162156 1167772 1174494 1183592 1197134 1216452 1241562 1272117 1308250 1350278
50133 1350278 1398226 1452067 1512141 1579092 1653507 1735623 1825113 1921106 2022589 2128600 2237595
50122 2237595 2346880 2453488 2555875 2654359 2749744 2842047 2930589 3014507 3092461 3162116 3220310
50111 3220310 3263576 3288318 3291134 3269828 3224335 3156490 3069047 2965261 2849106 2725097 2597392
50100 2597392 2469190 2343151 2222111 2108893 2005190 1910870 1824691 1745712 1673766 1608572
50090 1608572 1548983 1493570 1441738 1393748 1349787 1309581 1272959 1240116 1211048 1185164 1161885
50079 1161885 1141318 1123954 1109886 1098643 1089676 1082630 1077226 1073188 1070409 1068977 1068932 1070007 1071648
50066 1071648 1073346 1075084 1077477 1081349 1087003 1093894 1100935 1107097 1111849 1115348 1118269 1121277 1124533 1127743
50052 1127743 1130581 1132870 1134450 1135246 1135589 1136187 1137660 1140192 1143661 1147807 1152242 1156552 1160577 1164505 1168689
50037 1168689 1173563 1179613 1187097 1195736 1205024 1214874 1225598 1237223 1249318 1261706 1274854 1289246
50025 1289246 1304729 1320810 1337245 1353936 1370538 1386648 1402306 1418018 1434422 1452301 1472837
50014 1472837 1497367 1526728 1560938 1599507 1641913 1687787 1736802 1788479 1842191 1897436 1953936
50003 1953936 2011191 2068026 2122935 2174916 2223504 2268005 2307312 2340770 2368611 2391011 2406993
49992 2406993 2414652 2412015 2397224 2368422 2324406 2265508 2193414 2110270 2018555 1921718 1824041 1729369
49980 1729369 1640092 1557381 1481978 1414555 1355591 1305097 1262376 1226047 1194660 1167448 1144400
49969 1144400 1125659 1111031 1100102 1092546 1088177 1086757 1087747 1090197 1093069 1095859 1098696 1101610 1103892
49956 1103892 1104497 1102956 1099427 1093970 1086238 1075980 1063449 1049194 1033750 1017583 1001028 984220
49944 984220 967390 951223 936538 923491 911457 899830 888570 877855 867707 858235 849763 842287
49932 842287 835189 828040 821447 816453 813132 810445 807659 805320 804471 805403 807743 811431 816812 823730 831250
49917 831250 838672 846288 854639 863411 871768 879622 887828 896955 906483 915470 923421 930116 935118 938090
49903 938090 939402 939833 939551 937696 932983 924576 912588 898074 882507 866963 851819 837229 823580
49890 823580 811216 800037 789885 781102 774243 769257 765396 761875 758243 754234 749775 745172 740886
49877 740886 737101 733891 731677 731002 731821 733571 736055 739656 744516 750109 756000 762507 770187 778947 788032
49862 788032 796632 804183 810386 815302 819257 822355 824267 824734 824021 822515 820157 816667 812144 806977 801216
49847 801216 794556 787043 779417 772581 766928 762291 758294 754634 751274 748595 747235 747556 749214 751361
49833 751361 753344 755188 757498 760916 765676 771542 778096 785024 792111 798998 805123 810109 814262 818425
49819 818425 823109 827815 831441 833278 833397 832149 829720 826292 822263 817997 813616 809207 804957 800805
49805 800805 796294 791219 786308 782835 781471 781677 782180 781897 780653 779242 778595 778733 778922 779212 781170 786286
49789 786286 793929 801805 808455 814424 820872 828001 835294 842501 849694 856798 863640 870247 876639 882527
49775 882527 887495 891215 893244 893019 890483 886417 881693 876309 869592 861190 851508 841185 830491 819281
49761 819281 807399 795075 782967 771725 761507 752117 743528 735963 729448 723754 718908 715299 713052
49748 713052 711737 710939 710644 710824 711139 711465 712167 713327 714194 714091 713548 713847 715581 718332 721633 725523 730075
49731 730075 734991 739887 744592 749098 753486 757872 762121 765770 768656 771373 774507 777477 778777 777469
49717 777469 773905 768972 763281 757288 751456 745902 740354 734815 729848 725853 722509 719401 716826 715497
49703 715497 715698 717176 719587 722507 725178 726959 728198 730184 733979 739571 746266 753520 761048 768391
49689 768391 774926 780448 785479 790836 796968 803816 811200 819055 827246 835360 842819 849177 854230 857931
49675 857931 860290 861258 860591 857962 853447 847834 842177 836934 831753 826167 820338 814971 810612 807201 804192
49660 804192 800913 796827 791748 786017 780383 775461 771170 766787 761662 755864 750116 745220 741625 739425
49646 739425 738513 738678 739710 741383 743245 744510 744489 743252 741606 740269 739191 737808 735757 733148 730271
49631 730271 727264 724123 720910 717926 715623 714228 713483 712870 712103 711209 710248 709209 708195 707375 706727 706206
49615 706206 706149 707004 708470 709510 709535 709055 708791 708702 708427 708130 708148 708152 707544 706554 706145 706813 708197 709853 711634
49596 711634 713225 714159 714590 715344 716762 718128 718706 718799 719288 720539 722300 724383 726789 729303 731489 733135
49580 733135 734357 735275 735900 736391 737179 738767 741453 745242 749968 755545 762074 769553 777507 785229 792573
49565 792573 800230 808954 818597 828130 836452 843025 847866 851222 853310 854237 854071 852907 850748 847426 842904
49550 842904 837716 832833 828935 825974 823547 821476 819915 819063 818984 819591 820738 822437 824976 828651 833362
49535 833362 838778 844936 852367 861576 872755 886094 901896 920149 940348 961958 984612 1007553
49523 1007553 1029459 1049359 1067372 1084029 1099240 1112576 1124219 1134755 1144075 1151383 1156512 1160377
49511 1160377 1163628 1165258 1163086 1155449 1142274 1124850 1105013 1084343 1063731 1043551 1024189 1006191
49499 1006191 989807 974728 960595 947698 936863 928580 922449 917522 913114 909174 905968 903615 902116
49486 902116 901701 902750 905163 908153 911050 914154 918320 923761 929741 935513 941077 946756 952480 957854
49472 957854 962680 967050 971113 974965 978569 981525 983194 983411 982804 981925 980275 976767 971111 964143 956651
49457 956651 948538 939481 929891 920700 912486 905252 898842 893105 887771 882694 878226 874933 872855 871483
49443 871483 870604 870766 872675 876418 881528 887517 894046 900779 907439 913949 920303 926423 932433 938877 946253
49428 946253 954288 962088 969100 975546 981697 986992 990266 990823 989095 986260 983440 981304 980274 980846 983556
49413 983556 988650 995975 1005239 1016268 1028898 1042843 1057845 1073821 1090519 1107200 1123103 1138256
49401 1138256 1153416 1169015 1184528 1199070 1212238 1224091 1234635 1243769 1251515 1257865 1262472 1264872
49389 1264872 1264985 1263059 1259217 1253458 1246077 1237591 1228178 1217645 1206163 1194591 1183755 1173824 1164757
49376 1164757 1156968 1151004 1146767 1143687 1141618 1140999 1142042 1144410 1147903 1152770 1158820 1164696 1168752 1170442
49362 1170442 1170207 1168089 1163336 1155581 1145774 1135518 1125828 1116907 1108710 1101236 1094437 1088283 1082830 1077997
49348 1077997 1073438 1068926 1064609 1060592 1056540 1052169 1047838 1044065 1040654 1036978 1033047 1029466 1026333 1023070
49334 1023070 1019680 1017214 1016363 1016307 1015807 1014934 1014843 1016058 1018027 1020446 1024118 1029992 1037881 1046632 1055323 1063940
49318 1063940 1072954 1082646 1092999 1104136 1116605 1130958 1147127 1164556 1183142 1203660 1226827 1252162
49306 1252162 1278235 1303897 1328619 1351504 1370628 1383815 1389916 1389098 1382179 1370123 1354068 1335446
49294 1335446 1315786 1296406 1278288 1262238 1249084 1239603 1234087 1232102 1232873 1235895 1240870 1246987 1252665
49281 1252665 1256348 1257561 1257027 1255854 1254768 1254073 1254073 1255303 1258302 1263232 1269818 1277774 1287245 1298740 1312736
49266 1312736 1329546 1349504 1372931 1399755 1429353 1460908 1493581 1525999 1555755 1579992 1596697
49255 1596697 1605224 1605507 1597202 1580010 1554583 1522589 1485824 1445748 1404032 1362978 1324788 1290497
49243 1290497 1260046 1233228 1210023 1189992 1172173 1156065 1142272 1131640 1124016 1118377 1114071 1111378
49231 1111378 1110914 1113006 1117684 1124753 1133614 1143379 1153390 1163383 1173074 1182097 1190535 1199024 1207823 1216203
49217 1216203 1223290 1229345 1235616 1243068 1251849 1261987 1273850 1287576 1302667 1318572 1335338 1353174
49205 1353174 1371692 1390178 1408447 1426789 1445041 1462393 1478317 1493123 1507205 1520215 1531491
49194 1531491 1540953 1549041 1555968 1561707 1566643 1571643 1577380 1584183 1592614 1603599 1617700 1634790 1654862
49181 1654862 1678721 1707525 1742041 1782689 1829734 1882601 1939099 1995909 2049729 2097454 2135530
49170 2135530 2160362 2170125 2166029 2151602 2130916 2107380 2083486 2060866 2040399 2022380 2006757 1993405
49158 1993405 1982438 1974276 1969204 1966993 1967246 1970050 1975839 1984545 1995328 2007317 2020195 2033898 2048120
49145 2048120 2062419 2076546 2090396 2103910 2117268 2130891 2144979 2159304 2173721 2188589 2204288
49134 2204288 2220558 2236759 2252586 2268177 2283614 2298786 2313763 2328982 2345045 2362576 2382185
49123 2382185 2404266 2428898 2456245 2486920 2521660 2560830 2604894 2655366 2714568 2784008 2863394
49112 2863394 2951527 3047728 3151818 3262763 3377583 3491505 3599147 3696276 3781234 3854411
49102 3854411 3915186 3958802 3977044 3963450 3918712 3850994 3770637 3684068 3592107 3493193 3387673
49091 3387673 3279302 3173633 3075688 2988772 2914315 2851915 2799678 2755384 2717815 2686807 2661938
49080 2661938 2641610 2623885 2607998 2594526 2584056 2576171 2569865 2564431 2559610 2555225 2551145 2547440 2544146
49067 2544146 2540925 2537314 2533296 2529294 2525550 2521732 2517245 2511689 2505073 2497834 2490707 2484247 2478415 2472861
49053 2472861 2467702 2463705 2461537 2461073 2461650 2462828 2464710 2467629 2471674 2476399 2480837 2483841 2484486 2482187 2476642
49038 2476642 2468054 2457465 2446506 2436600 2428573 2423011 2420469 2421015 2423924 2428286 2433738 2440297 2447707 2455365
49024 2455365 2462784 2469747 2476118 2481934 2487750 2494417 2502340 2511148 2520237 2529406 2538836 2548607 2558426 2567922
49010 2567922 2577165 2586736 2597103 2607862 2617902 2626490 2634011 2641470 2649561 2658500 2668424 2679382 2690988
48997 2690988 2702536 2713620 2724315 2734730 2744661 2753664 2761199 2766731 2770089 2771739 2772300 2771743 2769500
48984 2769500 2765515 2760685 2755907 2751007 2744992 2737209 2727957 2717997 2707666 2696508 2683738 2669259 2654211
48971 2654211 2640314 2628580 2618906 2610866 2604508 2600091 2597464 2596197 2596206 2597852 2601353 2606347 2612159 2618461
48957 2618461 2625685 2634699 2645860 2658304 2670435 2681272 2691085 2700658 2710274 2719706 2728845 2737838 2746754
48944 2746754 2755576 2764550 2774148 2784662 2796197 2809128 2824266 2842397 2863761 2887900 2913875 2940733
48932 2940733 2968200 2997017 3028305 3062494 3099075 3137423 3177518 3219754 3264346 3311173 3359948
48921 3359948 3410291 3461860 3514722 3569498 3626820 3686607 3748076 3810476 3873620 3937615 4002247
48910 4002247 4066826 4130687 4193771 4256655 4319959 4383793 4447784 4511505 4574634 4636745 4697216
48899 4697216 4755501 4811360 4864738 4915522 4963526 5008481 5049937 5087344 5120488 5149777 5175905
$$ [...]
##END NTUPLES=NMR SPECTRUM
##END=
