##TITLE=AC1713_3097_8749698_3jzR5BpbZs
##JCAMPDX= 6.0         $$ Bruker NMR JCAMP-DX V2.0
##DATA TYPE= NMR SPECTRUM
##DATA CLASS= NTUPLES
##ORIGIN= BRUKER
##OWNER= Administrator
$$ 1.72 TOPSPIN		Version 2.1
$$ 2015-08-12 09:55:29.914 -0700  Administrator@X
$$ Compression mode = diff/dup
##.OBSERVE FREQUENCY= 400.02188249412
##.OBSERVE NUCLEUS= ^1H
##.ACQUISITION MODE= SIMULTANEOUS (DQD)
##.ACQUISITION SCHEME= undefined
##.AVERAGES= 64
##.DIGITISER RES= 22
##SPECTROMETER/DATA SYSTEM= spect
##.PULSE SEQUENCE= noesygpps1d.comp
##.SOLVENT NAME= COFFEE_meoh
##.SHIFT REFERENCE= INTERNAL, COFFEE_meoh, 1, 14.961
##AUDIT TRAIL= $$ (NUMBER, WHEN, WHO, WHERE, PROCESS, VERSION, WHAT)
$$ ##TITLE= Audit trail, TOPSPIN		Version 2.1
$$ ##JCAMPDX= 5.01
$$ ##ORIGIN= Bruker BioSpin GmbH
$$ ##OWNER= Administrator
$$ $$ E:\/data/COFFEE/nmr/AC1713_3097_8749698_3jzR5BpbZs/82/pdata/1/auditp.txt
$$ ##AUDIT TRAIL=  $$ (NUMBER, WHEN, WHO, WHERE, PROCESS, VERSION, WHAT)
(   1,<2015-08-11 23:44:09.664 -0700>,<Administrator>,<X>,<go>,<TOPSPIN 2.1>,
      <created by zg
	started at 2015-08-11 23:32:40.007 -0700,
	POWCHK enabled, PULCHK disabled,
       configuration hash MD5:
       21 0F 79 D6 B3 7B B4 F6 88 20 88 DB 03 48 BD 9F
       data hash MD5: 64K
       60 95 14 50 47 3D A1 27 FF 9E 26 30 50 02 05 BD>)
(   2,<2015-08-11 23:44:16.445 -0700>,<Administrator>,<X>,<audit>,<TOPSPIN 2.1>,
      <user comment:
       ICON-NMR User ID: COFFEE
       data hash MD5: 64K
       60 95 14 50 47 3D A1 27 FF 9E 26 30 50 02 05 BD>)
(   3,<2015-08-12 09:55:27.507 -0700>,<Administrator>,<X>,<proc1d>,<TOPSPIN 2.1>,
      <Start of raw data processing
       efp LB = 0.3 FT_mod = 6 PKNL = 1 PHC0 = 0 PHC1 = 0 SI = 128K 
       data hash MD5: 128K
       58 46 33 C5 0C FF DE 69 6F 51 11 54 C4 5E 9A A5>)
(   4,<2015-08-12 09:55:28.523 -0700>,<Administrator>,<X>,<proc1d>,<TOPSPIN 2.1>,
      <pk PHC0 = 269.0662 PHC1 = 0 
       data hash MD5: 128K
       93 22 CF 0F 90 F0 2D A1 D4 95 16 1C 1C B4 9C C3>)
(   5,<2015-08-12 09:55:29.039 -0700>,<Administrator>,<X>,<proc1d>,<TOPSPIN 2.1>,
      <abs ABSG = 1 
       data hash MD5: 128K
       A6 3A 2F 01 CF B2 66 0E BD 11 21 33 67 A1 15 7C>)
(   6,<2015-08-12 09:55:29.242 -0700>,<Administrator>,<X>,<proc1d>,<TOPSPIN 2.1>,
      <abs ABSG = 2 
       data hash MD5: 128K
       BA 90 94 83 AB 05 4D 40 A1 AC 97 97 56 68 74 D3>)
(   7,<2015-08-12 09:55:29.335 -0700>,<Administrator>,<X>,<proc1d>,<TOPSPIN 2.1>,
      <abs ABSG = 3 
       data hash MD5: 128K
       28 EC 80 FA 0F 4F 5D C4 F5 A7 D2 21 EA F6 4C A3>)
(   8,<2015-08-12 09:55:29.539 -0700>,<Administrator>,<X>,<proc1d>,<TOPSPIN 2.1>,
      <abs ABSG = 4 
       data hash MD5: 128K
       02 55 D2 D7 4D A1 05 78 D7 D7 D5 1A 16 8C 01 C9>)
(   9,<2015-08-12 09:55:29.648 -0700>,<Administrator>,<X>,<proc1d>,<TOPSPIN 2.1>,
      <abs ABSG = 5 
       data hash MD5: 128K
       C9 10 2B DA F8 54 28 B6 DE 4E A0 DA 35 B8 CB FE>)
$$ ##END=
$$ 
$$ $$ hash MD5
$$ [...]
150 150 150 150 150 150 150 150
##$TP07= 0
##$TPNAME0= <>
##$TPNAME1= <>
##$TPNAME2= <>
##$TPNAME3= <>
##$TPNAME4= <>
##$TPNAME5= <>
##$TPNAME6= <>
##$TPNAME7= <>
##$TPOAL= (0..7)
0.5 0.5 0.5 0.5 0.5 0.5 0.5 0.5
##$TPOFFS= (0..7)
0 0 0 0 0 0 0 0
##$TUNHIN= 0
##$TUNHOUT= 0
##$TUNXOUT= 0
##$USERA1= <user>
##$USERA2= <user>
##$USERA3= <user>
##$USERA4= <user>
##$USERA5= <user>
##$V9= 5
##$VALIST= <valist>
##$VCLIST= <CCCCCCCCCCCCCCC>
##$VD= 0
##$VDLIST= <DDDDDDDDDDDDDDD>
##$VPLIST= <PPPPPPPPPPPPPPP>
##$VTLIST= <TTTTTTTTTTTTTTT>
##$WBST= 2048
##$WBSW= 25
##$XGAIN= (0..3)
0 0 0 0
##$XL= 0
##$YL= 0
##$YMAX_a= 6462066
##$YMIN_a= -12355765
##$ZGOPTNS= <>
##$ZL1= 120
##$ZL2= 120
##$ZL3= 120
##$ZL4= 120
##$ABSF1= 14.961
##$ABSF2= -5.597181
##$ABSG= 5
##$ABSL= 3
##$ALPHA= 0
##$AQORDER= 0
##$ASSFAC= 0
##$ASSFACI= 0
##$ASSFACX= 0
##$ASSWID= 0
##$AUNMP= <proc_prof1d_extract.lims>
##$AXLEFT= 0
##$AXNAME= <>
##$AXNUC= <1H>
##$AXRIGHT= 0
##$AXTYPE= 0
##$AXUNIT= <>
##$AZFE= 0.1
##$AZFW= 0.1
##$BCFW= 0
##$BC_mod= 0
##$BYTORDP= 0
##$COROFFS= 0
##$CY= 15
##$DATMOD= 1
##$DC= 0
##$DFILT= <>
##$DTYPP= 0
##$F1P= 0
##$F2P= 0
##$FCOR= 0.5
##$FTSIZE= 131072
##$FT_mod= 6
##$GAMMA= 0
##$GB= 0
##$INTBC= 1
##$INTSCL= 1
##$ISEN= 128
##$LB= 0.3
##$LEV0= 0
##$LPBIN= 0
##$MAXI= 10000
##$MC2= 0
##$MEAN= 0
##$ME_mod= 0
##$MI= 0
##$NCOEF= 0
##$NC_proc= -2
##$NLEV= 6
##$NOISF1= 0
##$NOISF2= 0
##$NSP= 0
##$NTH_PI= 0
##$NZP= 0
##$OFFSET= 14.961
##$PC= 1
##$PHC0= 269.0662
##$PHC1= 0
##$PH_mod= 1
##$PKNL= yes
##$PPARMOD= 0
##$PPDIAG= 0
##$PPIPTYP= 0
##$PPMPNUM= 2147483647
##$PPRESOL= 1
##$PSCAL= 4
##$PSIGN= 0
##$PYNMP= <proc.py>
##$REVERSE= no
##$SF= 400.020009638204
##$SI= 131072
##$SIGF1= 0
##$SIGF2= 0
##$SINO= 400
##$SIOLD= 131072
##$SPECTYP= <>
##$SREGLST= <1H.CDCl3>
##$SSB= 0
##$STSI= 131072
##$STSR= 0
##$SW_p= 8223.68421052631
##$SYMM= 0
##$S_DEV= 0
##$TDeff= 65536
##$TDoff= 0
##$TI= <>
##$TILT= no
##$TM1= 0
##$TM2= 0
##$TOPLEV= 0
##$USERP1= <user>
##$USERP2= <user>
##$USERP3= <user>
##$USERP4= <user>
##$USERP5= <user>
##$WDW= 1
##$XDIM= 131072
##$YMAX_p= 417439391
##$YMIN_p= -11496
##$CURPLOT= <Network HP LaserJet P1505>
##$CURPRIN= <$Network HP LaserJet P1505>
##$DFORMAT= <normdp>
##$LAYOUT= <+/1D_H.xwp>
##$LFORMAT= <normlp>
##$PFORMAT= <normpl>
##$SURQMSG= 1
$$ End of Bruker specific parameters
$$ ---------------------------------
##NTUPLES= NMR SPECTRUM
##VAR_NAME=  FREQUENCY,     SPECTRUM/REAL,   SPECTRUM/IMAG
##SYMBOL=    X,             R,               I
##VAR_TYPE=  INDEPENDENT,   DEPENDENT,       DEPENDENT
##VAR_FORM=  AFFN,          ASDF,            ASDF
##VAR_DIM=   131072,        131072,          131072
##UNITS=     HZ,            ARBITRARY UNITS, ARBITRARY UNITS
##FACTOR=    0.0627417313425164, 1,          1
##FIRST=     8223.62146879497, 2774,         -61327
##LAST=      0,             4475,            -61718
##MIN=       0,             -11496,          0
##MAX=       8223.62146879497, 417439391,    0
$$ Real data points
##PAGE= N=1
##DATA TABLE= (X++(R..R)), XYDATA
$$ [...]
61630E27991p084o722o380n661m133k231r55n71k68O28J632J738P80l50q17q20
$$ 527991 520907 514185 507805 502144 498011 495780 494825 494254 493986 494614 496246 497984 498764 498414 497597 496777
61614D96777j256k579m280n681o771p831q474p935o447n396n551n985n469m270
$$ 496777 495521 492942 488662 482981 476210 468379 459905 451970 445523 440127 434576 428591 423122 418852
61600D18852l599l759l958l745l481l357k978k197j501j275j333j396j410j247
$$ 418852 415253 411494 407536 403791 400310 396953 393975 391778 390277 389002 387669 386273 384863 383616
61586C83616o92P3N48N82M41J06p33j869k522k362j941j746j535r56k56J74M34
$$ 383616 382924 382997 383545 384127 384568 384674 383941 382072 379550 377188 375247 373501 371966 371010 370754 370928 371362
61569C71362Q00J120J026N64J93K77P14J025P83J55j22L91J158J322R28P91J168
$$ 371362 372162 373282 374308 374872 375065 375342 376056 377081 377864 378019 377897 378288 379446 380768 381696 382487 383655
61552C83655J420J115O85N97O07M11M18J254K771M125M666M448L956L639L557
$$ 383655 385075 386190 386875 387472 388079 388490 388908 390162 392933 397058 401724 406172 410128 413767 417324
61537D17324L343K683J787J122P12J59o10j252j674k160k640k563j841j216j230
$$ 417324 420667 423350 425137 426259 426971 427130 426520 425268 423594 421434 418794 416231 414390 413174 411944
61522D11944j435j180o55m78o58o99m40j99j37j74m06j043j803j918j009L29J009
$$ 411944 410509 409329 408674 408196 407538 406839 406399 406200 406063 405889 405483 404440 402637 400719 399710 400039 401048
61505D01048M99p29j675j682q64K27J145J700J808J505J137J169J729K492L014
$$ 401048 401547 400818 399143 397461 396597 396824 397969 399669 401477 402982 404119 405288 407017 409509 412523
61490D12523L016K397J342L58m9J67O71J168J488J431R54M29K42K43P0j19J52
$$ 412523 415539 417936 419278 419636 419587 419754 420425 421593 423081 424512 425466 425895 426137 426380 426450 426331 426483
61473D26483P82J081P22P9n13j059j339q62K29R52P48L26O49J528J929J358L42
$$ 426483 427265 428346 429068 429147 428634 427575 426236 425374 425603 426555 427303 427629 428278 429806 431735 433093 433435
61456D33435l30l02K95J074J583J616J392J305J578K185K930L520L787L952M440
$$ 433435 433105 432803 433098 434172 435755 437371 438763 440068 441646 443831 446761 450281 454068 458020 462460
61441D62460N316O183O712O975P077O860O232N520N151N130N078M711M130L649
$$ 462460 467776 473959 480671 487646 494723 501583 507815 513335 518486 523616 528694 533405 537535 541184
61427E41184L447L372L122K633K124J690J078J26r03j726k466l276l826l743l253
$$ 541184 544631 548003 551125 553758 555882 557572 558650 558776 557873 556147 553681 550405 546579 542836 539583
61412E39583k838k519k138k081k836l957m365l790l024k676k492k161j901j928
$$ 539583 536745 534226 532088 530007 527171 523214 518849 515059 512035 509359 506867 504706 502805 500877
61398E00877k048k039j872j433p01k54p07j572j600n53L95L50j26j08M30R69J286
$$ 500877 498829 496790 494918 493485 492784 492530 491823 490251 488651 488098 488493 488843 488717 488609 489039 490008 491294
61381D91294J288Q12K24M26J595K607K446J596J312K035L190M026M123L496K851
$$ 491294 492582 493394 493618 494044 495639 498246 500692 502288 503600 505635 508825 512851 516974 520470 523321
61366E23321L148M403N437N431N062N463O682P956Q971J0044J1364J2822J4307
$$ 523321 526469 530872 536309 541740 546802 552265 558947 566903 575874 585918 597282 610104 624411
61353F24411J5644J6539J6999J7339J7436J6552J4422J1737R072O214L154P79
$$ 624411 640055 656594 673593 690932 708368 724920 739342 751079 760151 766365 769519 770298
61341G70298m55j636l959o795q477q560q128q062q236q261p963p163n936m962
$$ 770298 769843 768207 764248 757453 748976 740416 732288 724226 715990 707729 699766 692603 686667 681705
61327F81705m800m951m526l587k940k800k680k379k046j398L6J855L083L612M342
$$ 681705 676905 671954 667428 663841 660901 658101 655421 653042 650996 649598 649634 651489 654572 658184 662526
61312F62526N854P869J0089J2505J4623J5488J4896J3682J2417J0615P706L981
$$ 662526 668380 676249 686338 698843 713466 728954 743850 757532 769949 780564 788270 792251
61300G92251J48l492o851r565j1182j1607j1080j0013q988q437q153p526o427
$$ 792251 792399 788907 782056 772491 761309 749702 738622 728609 719621 711184 703031 695505 689078
61287F89078n386m707l924k526p93N12J102J420J981K746L301L590M175N582P523
$$ 689078 683692 678985 675061 672535 671742 672254 673356 674776 676757 679503 682804 686394 690569 696151 703674
61272G03674R156J0128J0836J1603J2270J2823J3800J5590J7891K0249K2509K4261
$$ 703674 712830 722958 733794 745397 757667 770490 784290 799880 817771 838020 860529 884790
61260H84790K4552K2818J9486J5021R202K245m281q929j2138j5216j8024j9250
$$ 884790 909342 932160 951646 966667 975869 978114 973833 964904 952766 937550 919526 900276
61248I00276j8739j7830j7286j6392j4537j2259j0262q475o701n149l872k527
$$ 900276 881537 863707 846421 830029 815492 803233 792971 784496 777795 772646 768774 766247
61236G66247j193m60l59j43M31O47K05PP39J679J797J286J000R45M56m64j017
$$ 766247 765054 764594 764235 764092 764523 765170 765375 765382 766121 767800 769597 770883 771883 772828 773284 772820 771803
61219G71803p62l1Q14J823K936L655L545K773J963J617J874K650L834N253O604
$$ 771803 771041 771010 771824 773647 776583 780238 783783 786556 788519 790136 792010 794660 798494 803747 810351
61204H10351P655Q554R691J1138J2575J3893J5458J7414J9146J9895J9547J8272
$$ 810351 818006 826560 836251 847389 859964 873857 889315 906729 925875 945770 965317 983589
61192I83589J5860J2162P916M266J515q83l216n185o581p494p885p830q091r528
$$ 983589 999449 1011611 1019527 1023793 1025308 1024425 1021209 1016024 1009443 1001949 994064 986234 978143 968615
61178I68615j1778j3512j4187j4599j5446j6383j6863j7080j7433j7819j7972
$$ 968615 956837 943325 929138 914539 899093 882710 865847 848767 831334 813515 795543
61167G95543j7882j7467j6365j4521j2453j0506q465o210m117k433q51Q21K203
$$ 795543 777661 760194 743829 729308 716855 706349 697884 691674 687557 685124 684273 685094 687297
61154F87297L052L857N147O643P586P519O374M206J299j794m637o982q363q250
$$ 687297 690349 694206 699353 705996 713582 721101 727475 731681 732980 731186 726549 719567 711204 702954
61140G02954o890n289l915k078Q09M019O238P189P784Q960J0833J2840J4231J4549
$$ 702954 696064 690775 686860 684782 685591 689610 695848 703037 710821 719781 730614 743454 757685 772234
61126G72234J4015J3398J3347J3976J5077J6301J7059J6797J5606J4154J2898
$$ 772234 786249 799647 812994 826970 842047 858348 875407 892204 907810 921964 934862
61115I34862J1818J0923J0241R226P063L995J462M39K90k30j561l495n967q944
$$ 934862 946680 957603 967844 977070 984133 988128 989590 990029 990319 990089 988528 985033 979066 970122
61101I70122j2058j5008j7903k0684k2725k3561k3459k2753k1264j9000j6755
$$ 970122 958064 943056 925153 904469 881744 858183 834724 811971 790707 771707 754952
61090G54952j5215j4066j2701j1291j0268r364q073o677n754n068m005k821k381
$$ 754952 739737 725671 712970 701679 691411 682047 673974 667297 661543 656475 652470 649649 647268
61077F47268k661k581j470J60J388J777J440R09J006K124L590M339M292M402N287
$$ 647268 644607 642026 640556 640716 642104 643881 645321 646230 647236 649360 652950 657289 661581 665983 671270
61062F71270O598P851R206J0954J2813J4169J4843J5275J5995J7044J7958J8363
$$ 671270 677868 685719 694925 705879 718692 732861 747704 762979 778974 796018 813976 832339
61050H32339J8511J8957J9690K0078J9860J9615J9834K0126J9954J9600J9721
$$ 832339 850850 869807 889497 909575 929435 949050 968884 989010 1008964 1028564 1048285
61039A048285K0313K0921K1474K2131K2546K2356K2209K3329K5932K8956L1523
$$ 1048285 1068598 1089519 1110993 1133124 1155670 1178026 1200235 1223564 1249496 1278452 1309975
61028A309975L3786L6111L8285L9978M1396M3052M5335M8584N3223N9538O7545
$$ 1309975 1343761 1379872 1418157 1458135 1499531 1542583 1587918 1636502 1689725 1749263 1816808
61017A816808P7044Q7539R8291J09085J20941J35571J54325J78471K10447K53764
$$ 1816808 1893852 1981391 2079682 2188767 2309708 2445279 2599604 2778075 2988522 3242286
61007C242286L11272L84147M72530N76352O95839Q32902R92434J180154J397242
$$ 3242286 3553558 3937705 4410235 4986587 5682426 6515328 7507762 8687916 10085158
60998A0085158J635852J875589K075997K169616K076034J748872J228048O44498
$$ 10085158 11721010 13596599 15672596 17842212 19918246 21667118 22895166 23539664
60990B3539664J57655j27721j97732j04250P3365K38587K78724R9376l14287q70002
$$ 23539664 23697319 23569598 23371866 23267616 23340981 23579568 23858292 23957668 23643381 22773379
60980B2773379j414520j818748k030979k068288j976967j804210j590495j368159
$$ 22773379 21358859 19540111 17509132 15440844 13463877 11659667 10069172 8701013
60972H701013j158296r70487q07442o69169n53687m57402l77249l11902k60269
$$ 8701013 7542717 6572230 5764788 5095619 4541932 4084530 3707281 3395379 3135110
60963C135110k19885j87682j61539j40180j22292j06693r3100q1716p2158o3458
$$ 3135110 2915225 2727543 2566004 2425824 2303532 2196839 2103739 2022023 1949865 1886407
60953A886407n5154m7700m1639l6979l3504l1249l0207k9899k9510k8349k6117
$$ 1886407 1831253 1783553 1741914 1704935 1671431 1640182 1609975 1580076 1550566 1522217 1496100
60942A496100k2995j9660j6883j4803j2790j0279p505n128l388k071j071n01k89
$$ 1496100 1473105 1453445 1436562 1421759 1408969 1398690 1391185 1386057 1382669 1380598 1379527 1379026 1378737
60929A378737j31J08L57O35R70J042L88j004k710m454o164p516q140q454r460
$$ 1378737 1378606 1378714 1379071 1379706 1380676 1381718 1382106 1381102 1378392 1373938 1367774 1360258 1352118 1343664 1334204
60914A334204j1385j3205j4029j4303j5023j6308j7489j8219j8604j8612j8183
$$ 1334204 1322819 1309614 1295585 1281282 1266259 1249951 1232462 1214243 1195639 1177027 1158844
60903A158844j7855j8324j9295j9587j8610j7066j5927j5326j4842j4314j3775
$$ 1158844 1140989 1122665 1103370 1083783 1065173 1048107 1032180 1016854 1002012 987698 973923
60892I73923j3037j1885j0602r741r317q730p621o491o158o729p424p491p036
$$ 973923 960886 949001 938399 928658 919341 910611 902990 896499 890341 883612 876188 868697 861661
60879H61661o787p156p861q453q885r328r649r413q489p381o810o996p494p717
$$ 861661 854874 847718 839857 831404 822519 813191 803542 794129 785640 778259 771449 764453 756959 749242
60865G49242p482o987o357n554m721m342m723n502n989n974n827n855n869n550
$$ 749242 741760 734773 728416 722862 718141 713799 709076 703574 697585 691611 685784 679929 674060 668510
60851F68510m881m060l184k235j318p97j137k488m366n900o606o756o766o557
$$ 668510 663629 659569 656385 654150 652832 652035 650898 648410 644044 638144 631538 624782 618016 611459
60837F11459n899n167m991n176m683k988q64N49J051J347K018K917L525L621L553
$$ 611459 605560 600393 595402 590226 585543 582555 581691 582240 583291 584638 586656 589573 593098 596719 600272
60822F00272L825M346M297L071J206r1l11oK09L69O48P89M12m42j446k315k785
$$ 600272 604097 608443 612740 615811 617017 616926 616615 616609 616818 617187 617835 618624 619036 618594 617148 614833 612048
60805F12048k614j897j135q53j297k416l770m579m446m016m303n285n905n599
$$ 612048 609434 607537 606402 605549 604252 601836 598066 593487 589041 585025 580722 575437 569532 563933
60791E63933m939m581m410m236m393n069n718n796n531n405n419n378n333n165
$$ 563933 558994 554413 550003 545767 541374 536305 530587 524791 519260 513855 508436 503058 497725 492560
60777D92560m376k933j712j384j414r04J13J003J615K211K667K711K634K967L657
$$ 492560 488184 485251 483539 482155 480741 479837 479950 480953 482568 484779 487446 490157 492791 495758 499415
60762D99415M264M688N005M973M465M126M622N493N703N154M670M539M085K955
$$ 499415 503679 508367 513372 518345 522810 526936 531558 537051 542754 547908 552578 557117 561202 564157
60748E64157J858J620K065K232J367m83k620m305n398o358p452q271q288p599
$$ 564157 566015 567635 569700 571932 573299 572816 570196 565891 560493 554135 546683 538412 530124 522525
60734E22525o700n891n352n371n934o342n896m818l931l682l929m358m546l987
$$ 522525 515825 509934 504582 499211 493277 486935 481039 476221 472290 468608 464679 460321 455775 451788
60720D51788k698j490r59o73n7L92k08j527k274j960j375j188j120p11p6M65Q16
$$ 451788 449090 447600 446641 445968 445911 446303 446095 444568 442294 440334 438959 437771 436651 435940 435864 436329 437145
60703D37145R02N92P9j71M1M95J043J743K480K970L164L312L586L969M415M836
$$ 437145 438047 438639 438718 438547 438588 439083 440126 441869 444349 447319 450483 453795 457381 461350 465765 470601
60687D70601N091N322N941O901P420O916N869N150N016N266N843O461O284M913
$$ 470601 475692 481014 486955 493856 501276 508192 514061 519211 524227 529493 535336 541797 548081 552994
60673E52994L225K245J637L97j410k810l481l864l968l464k892l296m535n268
$$ 552994 556219 558464 560101 560498 559088 556278 552797 548933 544965 541501 538609 535313 530778 525510
60659E25510m849m015l420k809j990j473j571j871j940j764j267l75K52l92k207
$$ 525510 520661 516646 513226 510417 508427 506954 505383 503512 501572 499808 498541 498166 498418 498026 495819
60644D95819l927m749m998m941m236l018k285k533k974k787k168j605j002j76
$$ 495819 491892 487143 482145 477204 472968 469950 467665 465132 462158 459371 457203 455598 454596 454420
60630D54420N75R92J236J299Q66J87P8N89O85j28q58m86N54J166J088P40L19j48
$$ 454420 454995 455987 457223 458522 459388 459575 459653 460242 460927 460799 459941 459455 460009 461175 462263 463003 463322 463174
60612D63174m01l70n12j097j637j606j170p20k82J11J28k12l18M8K90J8j85K98
$$ 463174 462773 462403 461891 460794 459157 457551 456381 455661 455379 455490 455618 455406 455088 455136 455426 455444 455259 455557
60594D55557J107J524J432J051M22j96j08Q59J844K056J776J589J333O87J06K09
$$ 455557 456664 458188 459620 460671 461093 460897 460789 461648 463492 465548 467324 468913 470246 470933 471039 471248
60578D71248P38R85R10J021J530K336L402M517N134N151N362O381P657Q254Q145
$$ 471248 471986 472971 473881 474902 476432 478768 482170 486687 491821 496972 502334 508715 516372 524626 532771
60563E32771P969P951P810P343O368M557K026l33j755k395k595k061n53J164K052
$$ 532771 540740 548691 556501 563844 570212 574769 576795 576462 574707 572312 569717 567656 567103 568267 570319
60548E70319K100K056K282K678L301M288N498O906Q903J1472J3698J4914J5652
$$ 570319 572419 574475 576757 579435 582736 587024 592522 599428 608331 619803 633501 648415 664067
60535F64067J6505J6754J5291J2336R064N895K470j028l848n859p544q970r751
$$ 664067 680572 697326 712617 724953 734017 739912 742382 741354 737506 731647 724103 715133 705382
60522G05382r856r397p947n366k943k189k600k213n31Q31Q08N18J390K991L895
$$ 705382 695526 686129 678182 672816 669873 667684 665084 662871 662340 663171 663979 664497 665887 668878 672773
60507F72773L825L911N235P919J1289J4446J6965J9386K2645K6793L0767L3679
$$ 672773 676598 680509 685744 693663 704952 719398 736363 755749 778394 805187 835954 869633
60495H69633L5686L7301L8420L8493L7133L4101K9091K1972J3086L047p454j7575
$$ 869633 905319 942620 981040 1019533 1056666 1090767 1119858 1141830 1154916 1157963 1150509 1132934
60483A132934k6415l3432l8465m1299m1743m0253l7950l5626l3188l0297k7173
$$ 1132934 1106519 1073087 1034622 993323 951580 911327 873377 837751 804563 774266 747093
60472G47093k4348k1990j9877j7869j6006j4290j2667j1200j0044r269q746q228
$$ 747093 722745 700755 680878 663009 647003 632713 620046 608846 598802 589533 580787 572559
60460E72559p478o443n297m266l465k963k839l006l095k814k330k069k181k393
$$ 572559 565081 558638 553341 549075 545610 542647 539808 536802 533707 530893 528563 526494 524313 521920
60446E21920k351j979j507j260j343j428j111m41J19L08L10K27j44p94j264j251
$$ 521920 519569 517590 516083 514823 513480 512052 510941 510500 510619 510927 511237 511464 511320 510526 509262 508011
60430E08011j056r92q67m93k08l10l95N4P55R81O11J91J18M02J022J850K301J718
$$ 508011 506955 505963 505096 504603 504395 504085 503690 503744 504499 505480 506091 506282 506400 506802 507824 509674 511975 513693
60412E13693K31j212j759j290l17M14M65J46K23Q87J452J456J441K055K911L189
$$ 513693 513924 512712 510953 509663 509346 509760 510225 510371 510594 511481 512933 514389 515830 517885 520796 523985
60396E23985K905K719K794K816K919L556M480M777M128L213K769K869L214L480
$$ 523985 526890 529609 532403 535219 538138 541694 546174 550951 555079 558292 561061 563930 567144 570624
60382E70624L300K551J724J467J762K089K204K204J954J271M88J08k1l18m91R6
$$ 570624 573924 576475 578199 579666 581428 583517 585721 587925 589879 591150 591638 591746 591725 591407 590916 591012
60366E91012J102J425Q26K89M23O29L14k1M30J654L161M793O520P902Q441Q266
$$ 591012 592114 593539 594365 594654 595077 595706 596020 595999 596429 598083 601244 606037 612557 620459 628900 637166
60350F37166P954P807P679P277O407M972K973N16k149m447n648n557m925m649
$$ 637166 645120 652927 660606 667883 674290 679262 682235 682751 680602 676155 670507 664950 660025 655376
60336F55376m722m487l800l252l242l527l768l910l872l458k777k200j854j611
$$ 655376 650654 646167 642367 639115 635873 632346 628578 624668 620796 617338 614561 612361 610507 608896
60322F08896j608k084k627k324q97Q58K009K349K266K319L135N017P454R526J1009
$$ 608896 607288 605204 602577 600253 599356 600214 602223 604572 606838 609157 612292 617309 624763 634289 645298
60307F45298J2467J4129J5410J5841J5780J5721J5372J3971J1229P555L532n47
$$ 645298 657765 671894 687304 703145 718925 734646 750018 763989 775218 782773 786305 785758
60295G85758m744r144j3327j6406j7849j8091j7835j7100j5513j3308j1154r195
$$ 785758 781014 771870 758543 742137 724288 706197 688362 671262 655749 642441 631287 622092
60283F22092p156n407m750n018m980m031k936k443k135j349l95L6L7K16O03O47
$$ 622092 614936 609529 604779 599761 594781 590750 587814 585371 583236 581887 581492 581528 581565 581781 582384 583031
60267E83031J13n75q85o67k00M4j41m02k71J49L26J97K43N72N65k03j267j906
$$ 583031 583144 582569 581684 581017 580817 580861 580720 580318 580047 580196 580522 580719 580962 581534 582099 581896 580629 578723
60249E78723j972j749j466j224j030n98L57J439J757J165O44J051K038K710K839
$$ 578723 576751 575002 573536 572312 571282 570684 571041 572480 574237 575402 576046 577097 579135 581845 584684
60234E84684K805K834K843K825K863K859K644K292K082K298L089M241N077N038
$$ 584684 587489 590323 593166 595991 598854 601713 604357 606649 608731 611029 614118 618359 623436 628474
60220F28474M421M061M176M190L790L410L324L088K385J732J697J912J587O84
$$ 628474 632895 636956 641132 645322 649112 652522 655846 658934 661319 663051 664748 666660 668247 668931
60206F68931o7j14M40J092J288O65o12j869k507k473k116j853j983k415k525j795
$$ 668931 668864 668750 669190 670282 671570 672235 671623 669754 667247 664774 662658 660805 658822 656407 653882 652087
60190F52087p01k61o68j023p12j88j8K2L18O10N71N54R98J567J583J061N55L16
$$ 652087 651386 651125 650457 649434 648722 648534 648516 648538 648856 649466 650037 650591 651589 653156 654739 655800 656355 656671
60172F56671K57M85J207K167K775K701J982Q27l45r53q82p11q63q97k12Q66J431
$$ 656671 656928 657413 658620 660787 663562 666263 668245 669072 668727 667774 666892 666181 665318 664421 664209 665075 666506
60155F66506J273J075J418K213L129L953M449M373L878L520L695M238M631M433
$$ 666506 667779 668854 670272 672485 675614 679567 684016 688389 692267 695787 699482 703720 708351 712784
60141G12784L476K036Q21N74J475K965M217M762M620L920K577N48j650l148l650
$$ 712784 716260 718296 719117 719691 721166 724131 728348 733110 737730 741650 744227 744775 743125 739977 736327
60126G36327l776m109m316l804k911k556k847k943k418j938k215l033l654l636
$$ 736327 732551 728442 724126 720322 717411 714855 712008 709065 706647 704709 702494 699461 695807 692171
60112F92171k913j678n08m2j95k11K43O41N53L59N59R54J075R68J060J558K369
$$ 692171 689258 687580 687072 687030 686835 686624 686867 687508 688061 688420 688979 689933 691008 691976 693036 694594 696963
60095F96963L318M141M596M741M750M476L661K621J949J536P80j37k53M84O98
$$ 696963 700281 704422 709018 713759 718509 722985 726646 729267 731216 732752 733532 733395 733142 733626 734324
60080G34324o02k696m393n685p231q961j0173j0537j0179r216p947o955o352n484
$$ 734324 733722 731026 726633 720948 713717 704756 694583 684046 673867 664651 656704 649749 643397 637913
60066F37913m120l162l344l927l756l028k768k999k667j308L52J528K121K287
$$ 637913 633793 630631 627287 623360 619604 616576 613808 610809 608142 606834 607186 608714 610835 613122
60052F13122K144J995K187K640L014L229L258K683J136r29k647l783m751n683
$$ 613122 615266 617261 619448 622088 625102 628331 631589 634272 635408 634479 631832 628049 623298 617615
60038F17615o230o256o046n861n709n571n370m909m303m185m915n876o135n572
$$ 617615 611385 605129 599083 593222 587513 581942 576572 571663 567360 563175 558260 552384 546249 540677
60024E40677m725l903l137k686k661k405j171O09J654J487Q70M99J87l61q43q82
$$ 540677 535952 532049 528912 526226 523565 521160 519989 520598 522252 523739 524609 525108 525295 524934 524091 523209
60008E23209p03p54r50p75J0J030J706J925K105K568K947K647J889J626K246K967
$$ 523209 522506 521752 520802 520027 520037 521067 522773 524698 526803 529371 532318 534965 536854 538480 540726 543693
59992E43693K987K536K215J893J076m8q53j257j618j839j448n94j23m75j187j672
$$ 543693 546680 549216 551431 553324 554400 554352 553499 552242 550624 548785 547337 546743 546620 546145 544958 543286
59976E43286j900k119k326k266j798j057l36K10P27J399K059K479K885L604M173
$$ 543286 541386 539267 536941 534675 532877 531820 531484 531694 532421 533820 535879 538358 541243 544847 549020
59961E49020L674K274J395J817K506K181J117M32K48k42j220j968k006j631j391
$$ 549020 552694 554968 556363 558180 560686 562867 563984 564416 564664 564422 563202 561234 559228 557597 556206
59946E56206j653k436l086k542o80J072J346N95K92Q67J588K095K777L641L989
$$ 556206 554553 552117 549031 546489 545809 546881 548227 548822 549114 549981 551569 553664 556441 560082 564071
59931E64071L467K576K013K176L131M354M784M045L271L735N032N745N641N728
$$ 564071 567538 570114 572127 574303 577434 581788 586572 590617 593888 597623 602655 608400 614041 619769
59917F19769O284O390N681N066N152N202M339K867J597O27m91j852l052l657l601
$$ 619769 626053 632443 638124 643190 648342 653544 657883 660750 662347 662974 662483 660631 657579 653922 650321
59902F50321l270l263l651l628k414m00J303K203K658K912K854K714L051L887
$$ 650321 647051 643788 640137 636509 634095 633695 634998 637201 639859 642771 645625 648339 651390 655277
59888F55277M650N106N582O204O679O878O938O720N912M675L488K445J412N97
$$ 655277 659927 665033 670615 676819 683498 690376 697314 704034 709946 714621 718109 720554 721966 722563
59874G22563J01p91k667m646n241m542m063m397m598m158l940m455m789m203l492
$$ 722563 722664 721873 719206 714560 709319 704777 700714 696317 691719 687561 683621 679166 674377 670174 666682
59859F66682l683m363m412l604k451j086O95K674M399N867P346Q764R773J0225
$$ 666682 662999 658636 654224 650620 648169 647083 647778 650452 654851 660718 668064 676828 686601 696826
59845F96826J0131R393P943N953L787J999J295J953L299M377N064N676N640L772
$$ 696826 706957 716350 724293 730246 734033 736032 737327 739280 742579 746956 752020 757696 763336 767108
59831G67108J28l621o171p850r309j0190r955r110q511q126p403o366n425m564
$$ 767108 767236 763615 757444 749594 740285 730095 720140 711030 702519 694393 686990 680624 675199 670635
59817F70635l573k775k638k935l030k783k527k340k057j876k240l064l541k994
$$ 670635 667062 664287 661649 658714 655684 652901 650374 648034 645977 644101 641861 638797 635256 632262
59803F32262j663n84o40j684k624k605k003j778k088k198j785j433j498j332k48
$$ 632262 630599 630015 629375 627691 625067 622462 620459 618681 616593 614395 612610 611177 609679 608347 608099
59788F08099J288K141J861J060O06Q38J443J804J599J102P53N20J26j80K55J461
$$ 608099 609387 611528 613389 614449 615055 615893 617336 619140 620739 621841 622594 623114 623240 623060 623315 624776
59772F24776K608L006K830K630K677L005L500L713L196K290J956K471K890K306
$$ 624776 627384 630390 633220 635850 638527 641532 645032 648745 651941 654231 656187 658658 661548 663854
59758F63854J117N26J071K155K895L064L233M040N341O269O261N672M996M009
$$ 663854 664971 665497 666568 668723 671618 674682 677915 681955 687296 693565 699826 705498 710494 714503
59744G14503K422R05M87J040J376Q50j06j019j851k356k045j142o02q37j274j400
$$ 714503 716925 717830 718317 719357 720733 721583 721477 720458 718607 716251 714206 713064 712462 711625 710351 708951
59728G08951j344j195p62k69k94p07o53P4O96P84Q58J276J684J972K584L349L300
$$ 708951 707607 706412 705650 705381 705087 704380 703727 703801 704497 705281 706139 707415 709099 711071 713655 717004 720304
59711G20304K318J756K550L849M466M582N013N668N872N507M853L922K803K018
$$ 720304 722622 724378 726928 730777 735243 739825 744838 750506 756378 761885 766738 770660 773463 775481
59697G75481J765J435N93k67p00j122j882k445k402k438l147l804l491k779k964
$$ 775481 777246 778681 779274 779007 778307 777185 775303 772858 770456 768018 764871 761067 757576 754797 751833
59682G51833m131n272n918o423o896p038o969p172p559p479o665n526m560l982
$$ 751833 747702 742430 736512 730089 723193 716155 709186 702014 694455 686976 680311 674785 670225 666243
59668F66243l745l407k364o96N99Q06M19K91M10L23J80M98J194J653J558J025
$$ 666243 662498 659091 656727 656031 656630 657436 657855 658146 658556 658879 659059 659557 660751 662404 663962 664987
59652F64987J98p15j360j726k283l179l768l502k729k048j454p42r7L39Q00J215
$$ 664987 665185 664470 663110 661384 659101 655922 652154 648652 645923 643875 642421 641679 641582 641921 642721 643936
59636F43936R63k0p84q19j051k386m142n071n137n097n037m607m123m088m138
$$ 643936 644899 644879 644095 643276 642225 639839 635697 630626 625489 620392 615355 610748 606625 602537 598399
59621E98399l719l337l764m463m205k964j730o91Q49K756L776L269K025J140J052
$$ 598399 594680 591343 587579 583116 578911 575947 574217 573526 574375 577131 580907 584176 586201 587341 588393
59606E88393J773L030M017L969L155K491K220J848J350J285J683J821J343O86
$$ 588393 590166 593196 597213 601182 604337 606828 609048 610896 612246 613531 615214 617035 618378 619064
59592F19064K43j08m81p42q68q49l40Q01J780J573L50p77j361j980k899l534l541
$$ 619064 619307 619199 618718 617976 617108 616259 615919 616720 618500 620073 620423 619646 618285 616305 613406 609872 606331
59575F06331l383l416l313k822k404k494k773k637j989j182m67P0L08J23l88q38
$$ 606331 602948 599532 596219 593397 590993 588499 585726 583089 581100 579918 579451 579521 579829 579952 579564 578726
59559E78726p43N0J122J824J995K015K175K479L172M624O445P550P719Q196J0039
$$ 578726 577983 578033 579155 580979 582974 584989 587164 589643 592815 597439 603884 611434 619153 627349 637388
59544F37388J2692J5038J7042J9119K0448J9237J4672P776N56m970p511p289n890
$$ 637388 650080 665118 682160 701279 721727 740964 755636 763412 763968 758998 751487 744198 738308
59531G38308m583l177j181P11J522J605K007K589K230P16r58k094k886l548m129
$$ 738308 733725 730548 729367 730078 731600 733205 735212 737801 740031 740747 739789 737695 734809 731261 727132
59516G27132n043o660q303q887q421p843p450o794n979n715n965n861n105m285
$$ 727132 722089 715429 707126 698239 689818 681975 674525 667731 661752 656037 650072 644211 639106 634821
59502F34821l646k762j637r62j046j508k117k884l258k486q98K68N24M80M89K51
$$ 634821 631175 628413 626776 625814 624768 623260 621143 618259 615001 612515 611617 611885 612409 612889 613378 613629
59486F13629n1L86J683L026L992M936N814O014N686N785O300N882L906J579J77
$$ 613629 613578 613964 615647 618673 622665 627601 633415 639429 645115 650900 657200 663082 666988 668567 668744
59471F68744m89r55q26K93J570J954J739K024L148M618O124P604Q651Q833Q453
$$ 668744 668255 667300 666474 666767 668337 670291 672030 674054 677202 681820 687944 695548 704199 713032 721485
59456G21485Q266Q467Q510P889O701N432M440L563K137l76l675o760q792r578
$$ 721485 729751 738218 746728 754617 761318 766750 771190 774753 776890 776514 772839 766079 757287 747709
59442G47709r392q736q180p881p288n874m029k647j856r36N37K180L553M754O167
$$ 747709 738317 729581 721401 713520 706232 700358 696329 693682 691826 690890 691427 693607 697160 701914 708081
59427G08081Q108J0678J3434J5399J6057J6157J6798J7961J8800J9086J9237J8871
$$ 708081 716189 726867 740301 755700 771757 787914 804712 822673 841473 860559 879796 898667
59415H98667J6558J1365L900m254j1400j6055j7455j6039j2902q774l986R11N215
$$ 898667 915225 926590 930490 926236 914836 898781 881326 865287 852385 843611 839625 840536 845751
59402H45751Q352R197O019j455j0313j6509j8664j8397j7274j5373j2892j0884
$$ 845751 854103 863300 869319 867864 857551 841042 822378 803981 786707 771334 758442 747558
59390G47558r646q158n960m044l041k173r30k80r64j862j384L18J775K121J597
$$ 747558 737912 729754 723794 719750 716709 714536 713606 713326 712362 710500 709116 709434 711209 713330 714927
59375G14927P59J47K85J188K222K848L134L230L065K902L373M500N536O200P171
$$ 714927 715686 715833 716118 717306 719528 722376 725510 728740 731805 734707 738080 742580 748116 754316 761487
59360G61487Q827J0416J1071J0974J0917J1355J2326J3656J4824J5294J5200J5065
$$ 761487 770314 780730 791801 802775 813692 825047 837373 851029 865853 881147 896347 911412
59348I11412J4777J3712J1910R994P859M760R23k343m565o707r349j1717j3214
$$ 911412 926189 939901 951811 961805 969664 974424 975347 973004 968439 961732 952383 940666 927452
59335I27452j4414j5675j6146j5205j3678j2578j1730j0622r585r058q650p936
$$ 927452 913038 897363 881217 866012 852334 839756 828026 817404 807819 798761 790111 782175
59323G82175p338p254p192o662o109o014n986n530m887m300l462k449k079k417
$$ 782175 774837 767583 760391 753729 747620 741606 735620 730090 725203 720903 717441 714992 712913 710496
59309G10496k176o92P61R21P05J903M580P303R317J0966J2443J3441J3726J2850
$$ 710496 708320 707628 708389 709310 710015 711918 716498 723801 733118 744084 756527 769968 783694 796544
59295G96544R763L997l055r107j2965j4732j4703j3164j0894q621o295l728j464
$$ 796544 806307 810304 807249 798142 785177 770445 755742 742578 731684 723063 716768 713040 711576
59282G11576k5J154K933N094O833Q131R427J0370J0251R477R292R945J0363R715
$$ 711576 711551 712705 715638 720732 727565 735696 745123 755493 765744 775221 784513 794458 804821 814536
59268H14536Q337O847N334L730K266J178L43n62j761l242m756n977o828p402p648
$$ 814536 822873 829720 835054 838784 841050 842228 842571 842009 840248 837006 832250 826273 819445 812043 804395
59253H04395p478p148o948o480n113l168j744j152m99P57K012K722L267L949M211
$$ 804395 796917 789769 782821 776341 771228 768060 766316 765164 764665 765422 767434 770156 773423 777372 781583
59238G81583L650K795K143J357J96p90j357k270l969n498n880n604n718o180o225
$$ 781583 785233 788028 790171 791528 791724 790934 789577 787307 783338 777840 771960 766356 760638 754458 748233
59223G48233n698m990m307l833l952m510m631m042l593l791l922l561l554m409
$$ 748233 742535 737545 733238 729405 725453 720943 716312 712270 708677 704886 700964 697403 693849 689440
59209F89440m958m049k431j479j140o62k84m94n38N05J856K127J634J805K740
$$ 689440 684482 680433 678002 676523 675383 674721 674437 673943 673405 673910 675766 677893 679527 681332 684072
59194F84072L253K963K662K738K892L234M105M973M995M467M338M515M187L449
$$ 684072 687325 690288 692950 695688 698580 701814 705919 710892 715887 720354 724692 729207 733394 736843
59180G36843L101L013K411J628J927L467N018N773O100O420O673O994P550P704
$$ 736843 739944 742957 745368 746996 748923 752390 757408 763181 769281 775701 782374 789368 796918 804622
59166H04622O641M798L342K260M91k053m127n106n754o730p617p932p874p652
$$ 804622 811263 816061 819403 821663 822154 820101 815974 810868 805114 798384 790767 782835 774961 767309
59152G67309p116o417o135o372o626o742p112p725p970p590o985o459n879n189
$$ 767309 760193 753776 747641 741269 734643 727901 720789 713064 705094 697504 690519 684060 678181 672992
59138F72992m507l705k638j660j116n03Q99K745L997M509N143O254P142P313P368
$$ 672992 668485 664780 662142 660482 659366 658863 659762 662507 666504 671013 676156 682410 689552 696865 704233
59123G04233Q295J0439J3347J6233J8515K0272K2003K3732K4884K5357K5893K6829
$$ 704233 712528 722967 736314 752547 771062 791334 813337 837069 861953 887310 913203 940032
59111I40032K7294K6484K4822K2964K0613J7425J4093J1178P773K873k591o769
$$ 940032 967326 993810 1018632 1041596 1062209 1079634 1093727 1104905 1112678 1115551 1112960 1106191
59099A106191r285j1093j2396j2513j1491j0172q778o954n064l963l646l490l562
$$ 1106191 1096906 1085813 1073417 1060904 1049413 1039241 1030463 1023509 1018445 1014482 1010836 1007346 1003784
59086A003784m299n246n684o114p508r408j0441j0452j0373j0278r421q119p639
$$ 1003784 999485 994239 988555 982441 974933 965525 955084 944632 934259 923981 914560 906441 898802
59073H98802q147q565q533q696q998q521p259o327o106n843n265m926m802m197
$$ 898802 890655 882090 873557 864861 855863 847342 840083 833756 827650 821807 816542 811616 806814 802617
59059H02617l247k830k819k215j151r09j695k203j795j237j006o38k15n32j329
$$ 802617 799370 796540 793721 791506 790355 789446 787751 785548 783753 782516 781510 780872 780657 780125 778796
59044G78796j258j62N28L04N03J987L795N066O456Q565J0597J1697J2294J3105
$$ 778796 777538 777376 777904 778208 778711 780698 784493 789559 796015 804580 815177 826874 839168 852273
59030H52273J4076J5139J6597J8013J8130J6743J5184J4138J2488R301N473K332
$$ 852273 866349 881488 898085 916098 934228 950971 966155 980293 992781 1002082 1007555 1009887
59018A009887o9k129l473l723l431l135k365n53J867M170O265Q170R431R824R812
$$ 1009887 1009818 1007689 1004216 1000493 997062 993927 991562 991009 992876 997046 1003311 1011481 1020912 1030736 1040548
59003A040548R712R161P923O329M522K274j36j946l190m762o858q625r701j0702
$$ 1040548 1050260 1059421 1067344 1073673 1078195 1080469 1080333 1078387 1075197 1070435 1063577 1054952 1045251 1034549
58989A034549j1730j1940j1144j0293r721q472o151l848k255m64K258M932O326
$$ 1034549 1022819 1010879 999735 989442 979721 971249 965098 961250 958995 958531 960789 965721 972047
58976I72047O769P240P727P739P548P756Q282Q703R064R605J0336J1348J2744
$$ 972047 978816 986056 993783 1001522 1009070 1016826 1025108 1033811 1042875 1052480 1062816 1074164 1086908
58963A086908J3883J3631J1783R253O583L465k9l175n982r304j3026j5727j6725
$$ 1086908 1100791 1114422 1126205 1135458 1142041 1145506 1145477 1142302 1136320 1127016 1113990 1098263 1081538
58950A081538j6815j6346j4415j0927p624n813m716l324k318k630l550l916m042
$$ 1081538 1064723 1048377 1033962 1023035 1015411 1009598 1004882 1001558 999240 996610 993060 989144 985102
58937I85102m897o211o945o924o709o453n971n440n051m646m313m520m996m567
$$ 985102 980205 973994 967049 960125 953416 946963 940992 935552 930501 925855 921542 917022 912026 907459
58923I07459k842q91N13K133M744P697J0025J1863J3581J4622J4423J3589J3058
$$ 907459 904617 903726 904239 906372 911116 918813 928838 940701 954282 968904 983327 996916 1009974
58910A009974J2883J2756J2750J2710J1920J0346R126Q965R061Q534P771P372
$$ 1009974 1022857 1035613 1048363 1061073 1072993 1083339 1092465 1101430 1110491 1119025 1126796 1134168
58898A134168P031O583P006R180J2545J6014J9224K2000K3705K4114K3908K3281
$$ 1134168 1141199 1147782 1154788 1163968 1176513 1192527 1211751 1233751 1257456 1281570 1305478 1328759
58886A328759K1221J7076J1662N892l44o882j2313j5589j7486j9254k0956k2211
$$ 1328759 1349980 1367056 1378718 1384610 1384266 1377384 1365071 1349482 1331996 1312742 1291786 1269575
58874A269575k3286k4237k4307k3349k2568k2630k2412k0939j9158j8346j8124
$$ 1269575 1246289 1222052 1197745 1174396 1151828 1129198 1106786 1085847 1066689 1048343 1030219
58863A030219j7584j7076j7216j7353j6613j5435j4504j3325j1395r682r259r530
$$ 1030219 1012635 995559 978343 960990 944377 928942 914438 901113 889718 880036 870777 861247
58851H61247r500r673j0964j2700j3478j3229j2757j2046j0629q898p513o181
$$ 861247 851747 842074 831110 818410 804932 791703 778946 766900 756271 747373 739860 733679
58839G33679m400k624j354j33J238J705O92l48J19J402J928J795K106K800L087
$$ 733679 729279 726655 725301 725168 726406 728111 728803 728455 728574 729976 731904 733699 735805 738605 741692
58824G41692L214L799M244L682K693K262J818K42j948l385m079m939n724n537
$$ 741692 744906 748705 752949 756631 759324 761586 763404 763646 761698 758313 754234 749295 743571 738034
58810G38034m807m770n359n459m837m119l331k192j384j791k889l483l476l432
$$ 738034 733227 728457 723098 717639 712802 708683 705352 703160 701776 699985 697096 693613 690137 686705
58796F86705l150k337j882k582l381k663o63J241K786M405N486N240M643N201
$$ 686705 683555 681218 679336 676754 673373 670710 670047 671288 674074 678479 683965 689205 693848 699049
58782F99049O368O439N509N247N968O312N732N028M443L305J694N40k7p48j652
$$ 699049 705417 711856 717365 722612 728580 734892 740624 745652 750095 753400 755094 755634 755607 754859 753207
58767G53207k120k319k943l691l733l429l900n140o122o434o172m851k249K65
$$ 753207 751087 748768 745825 742134 738401 734972 731072 725932 719810 713376 707204 702353 700104 700369
58753G00369J170J064J541K531K948L297N024P683R409J0191J1886J4856J7161
$$ 700369 701539 702603 704144 706675 709623 712920 717944 725627 735036 745227 757113 771969 789130
58740G89130J7648J7419J7568J7658J7214J6789J6681J6116J4506J2193R525O342
$$ 789130 806778 824197 841765 859423 876637 893426 910107 926223 940729 952922 962447 968789
58728I68789K696r71m391p262q873r106r206j0123j0903j0392r607j0233j1531
$$ 968789 971485 970514 966123 958861 949988 940882 931676 921553 910650 900258 890651 880418 868887
58715H68887j1259r337p991q286r031r315r725j0611j1358j1911j3072j4817j6059
$$ 868887 857628 848291 840300 832014 822983 813668 803943 793332 781974 770063 756991 742174 726115
58702G26115j6400j6462j6342j5462j3987j2691j1450r604p620o553o049m942
$$ 726115 709715 693253 676911 661449 647462 634771 623321 613717 606097 599544 593495 588553
58690E88553l567l316m017m096l292k815k762j872j44Q75R00J569L700O153Q037
$$ 588553 584986 581670 577653 573557 570265 567450 564688 562816 562672 563547 564447 566016 569716 575869 583906
58675E83906R883J1929J3336J3951J4904J6784J8851K0603K2229K3076K1569J7353
$$ 583906 593789 605718 619054 633005 647909 664693 683544 704147 726376 749452 771021 788374
58663G88374J1871O275M79n353j0193j3537j5831j7107j6815j5283j3712j2422
$$ 788374 800245 806520 806999 801646 791453 777916 762085 744978 728163 712880 699168 686746
58651F86746j0688q419o413m820l082j377m00J65J147K098J959J204J117J270
$$ 686746 676058 667639 661226 656406 653324 651947 651547 651712 652859 654957 656916 658120 659237 660507
58637F60507J22j952k835j906o71R0J147K576L301L293L770M843N348N390O440
$$ 660507 660629 658677 655842 653936 653265 653355 654502 657078 660379 663672 667442 672285 677633 683023 689463
58622F89463Q424R373Q576P606P538P514O730N538L975J514j216k796l510n024
$$ 689463 697887 707260 715836 723442 730980 738494 745224 750762 754737 756251 755035 752239 748729 743705
58608G43705p257q201p324o448o553o491n590m876m803m344l175k318j833l91
$$ 743705 736448 728247 720923 714475 707922 701431 695841 690965 686162 681818 678643 676325 674492 674101
58594F74101K222M703O878J0047J4096J7048J8200J8805J9015J7274J3662J0627
$$ 674101 676323 681026 687904 697951 712047 729095 747295 766100 785115 802389 816051 826678
58582H26678R189P479M331J267l84j325j878p06K466N765Q254J1306J5423J8670
$$ 826678 835867 843346 847677 848944 848560 847235 845357 844651 847117 852882 861136 872442 887865 906535
58568I06535J9989K1137K3443K5368K5242K3877K2515K0614J7566J4319J1578
$$ 906535 926524 947661 971104 996472 1021714 1045591 1068106 1088720 1106286 1120605 1132183
58557A132183Q568N161K809J791M3l560p199r103j0118j1655j3367j4554j5635
$$ 1132183 1140751 1145912 1148721 1150512 1150555 1146995 1139796 1130693 1120575 1108920 1095553 1080999 1065364
58544A065364j6681j6677j5645j5115j5343j4676j2846j1960j2755j3000j1277
$$ 1065364 1048683 1032006 1016361 1001246 985903 971227 958381 946421 933666 920666 909389
58533I09389r218q144o610l472l63J215K485M849P312Q696R762J1054J1194R464
$$ 909389 900171 892027 885417 881945 881582 882797 885282 890131 897443 906139 915901 926955 938149 947613
58519I47613P424N984L689j17l388m865o442r602j2491j3106j2543j2503j2382
$$ 947613 955037 961021 964710 964593 961205 956340 949898 940296 927805 914699 902156 889653 877271
58506H77271j1495j1245j2345j2691j0838q813q638q891p625n905n238m288j467
$$ 877271 865776 854531 842186 829495 818657 809844 801206 792315 784690 778785 773547 769259 767792
58493G67792J729L314M321O474Q692R363R820J2109J5287J7232J8208J9334J9585
$$ 767792 769521 772835 777156 783630 792322 801685 811505 823614 838901 856133 874341 893675 913260
58480I13260J7568J4451J1962R371N441J376j332l814p401j0355j0369q481p185
$$ 913260 930828 945279 957241 966612 972053 973429 972097 968283 960882 950527 940158 931677 924492
58467I24492o540n322m140m138m407l727l075l317k703J13K831K721R43P3m90
$$ 924492 917952 912630 908490 904352 899945 896218 893143 889826 887123 887236 890067 892788 893731 893804 893314
58452H93314k801o007p663p774p861p534n708l625l088l052j510Q29K096K812
$$ 893314 890513 884506 876843 869069 861208 853674 847966 844341 841253 838201 836691 837520 839616 842428
58438H42428M327N520M753L461M044N737O270O088P176R113J0075J0350J1195
$$ 842428 846755 852275 857028 860489 864533 870270 876540 882628 889804 898917 908992 919342 930537
58425I30537J1549R524N957L021O54k262m800n645o205q433j1084j1729j0911
$$ 930537 942086 951610 957567 960588 961242 958980 954180 948535 942330 933897 922813 911084 900173
58412I00173j0680j0613r097o927n832m963k560L67J751K238L624N173N208M611
$$ 900173 889493 878880 869783 862856 857024 852061 849501 849868 851619 853857 857481 862654 867862 872473
58398H72473N010N324L822J751J120Q98o32k020j235J14m93j765j060O21P58K75
$$ 872473 877483 882807 886629 888380 889500 890398 889766 887746 886511 886625 886132 884367 883307 883928 884686 884961
58382H84961J500L217K761J228J530K953K641R68M53Q82M41J17K022M886O045
$$ 884961 886461 889678 892439 893667 895197 898150 900791 901759 902212 903094 903535 903652 905674 910560 916605
58367I16605O248P654Q926P490M784L992M294K733j4j140j155k367l681k577m59
$$ 916605 922853 930507 939433 946923 951707 955699 959993 962726 962712 961572 960417 958050 954369 951792 951333
58352I51333l37j005P56M043N809O976J0404J4668J6289J6316J8148K0559J9738
$$ 951333 950996 949991 950747 954790 960599 967575 977979 992647 1008936 1025252 1043400 1063959 1083697
58339A083697J6630J5295J5325J2943Q466N589M256J352k531m013l692m950p009
$$ 1083697 1100327 1115622 1130947 1143890 1152356 1157945 1162201 1163553 1161022 1157009 1153317 1148367 1141358
58326A141358o270l557k785l490j960J233K354K044M032P358P754O014O881J0268
$$ 1141358 1135088 1131531 1128746 1125256 1123296 1124529 1126883 1128927 1132959 1140317 1148071 1154085 1160966 1171234
58312A171234J1578J0324J0275J1664J1307R954J1280J4092J3816J1076J0396
$$ 1171234 1182812 1193136 1203411 1215075 1226382 1236336 1247616 1261708 1275524 1286600 1296996
58301A296996J1212R062M906M090O525P176N847P028J0372J1105R683J1147J5064
$$ 1296996 1308208 1317270 1322176 1326266 1332791 1339967 1345814 1352842 1363214 1374319 1384002 1395149 1410213
58288A410213J6199J4960J6810K1343K2668K0801K1689K5635K6862K5101K6122
$$ 1410213 1426412 1441372 1458182 1479525 1502193 1522994 1544683 1570318 1597180 1622281 1648403
58277A648403L0060L0898K8546K9582L4723L7521L6815L8384M2772M3900M1404
$$ 1648403 1678463 1709361 1737907 1767489 1802212 1839733 1876548 1914932 1957704 2001604 2043008
58266B043008M1814M5638M5946M1684L9534M0619L8598L3028L1016L3435L3247
$$ 2043008 2084822 2130460 2176406 2218090 2257624 2298243 2336841 2369869 2400885 2434320 2467567
58255B467567K9833L0770L7046M1095M1921M6971N6336O1000N9883O2431P0834
$$ 2467567 2497400 2528170 2565216 2606311 2648232 2695203 2751539 2812539 2872422 2934853 3005687
58244C005687P6249P6419P9987Q9147R5486R7343J03481J15052J22290J23865
$$ 3005687 3081936 3158355 3238342 3327489 3422975 3520318 3623799 3738851 3861141 3985006
58234C985006J30411J44019J54062J58454J68178J85262J98208K05309K19508
$$ 3985006 4115417 4259436 4413498 4571952 4740130 4925392 5123600 5328909 5548417
58225E548417K43301K62818K74416K92216L20995L47585L68338L97935M40940
$$ 5548417 5791718 6054536 6328952 6621168 6942163 7289748 7658086 8056021 8496961
58216H496961M82787N19752N68482O34411P01955P68316Q53881R65954J087713
$$ 8496961 8979748 9499500 10067982 10702393 11404348 12172664 13026545 13992499 15080212
58207A5080212J217646J381714J590675J827564K096320K438507K883114L432766
$$ 15080212 16297858 17679572 19270247 21097811 23194131 25632638 28515752 31948518
58199C1948518M126859N062426O315770P892034R780820J2002885J4577237J7525921
$$ 31948518 36075377 41137803 47453573 55345607 65126427 77129312 91706549 109232470
58191A09232470K0951841K5002250K9652858L4545850L8980685M1812461M1294208
$$ 109232470 130184311 155186561 184839419 219385269 258365954 300178415 341472623
58184C41472623L5532462K3859780Q030812q286867k1614106l0425247l5098657
$$ 341472623 377005085 400864865 408895677 400608810 378994704 348569457 313470800
58177C13470800l6666708l5945627l3562408l0184991k6432392k2702192j9209142
$$ 313470800 276804092 240858465 207296057 177111066 150678674 127976482 108767340
58170A08767340j6094902j3423952j1163967r258360p685150o416807n384598
$$ 108767340 92672438 79248486 68084519 58826159 51141009 44724202 39339604
58163C9339604m525669l821254l257721k793821k395859k065350j804189j587264
$$ 39339604 34813935 30992681 27734960 24941139 22545280 20479930 18675741 17088477
58155A7088477j393379j229821j103095r95608q92400q02430p33168o70604o03352
$$ 17088477 15695098 14465277 13362182 12366574 11474174 10671744 9938576 9267972 8664620
58146H664620n41730m94846m52042m04101l60610l29812l02117k69652k42282
$$ 8664620 8122890 7628044 7176002 6771901 6411291 6081479 5779362 5509710 5267428
58137E267428k28659k19761k06049j93436j88027j81938j68357j54942j48827
$$ 5267428 5038769 4819008 4612959 4419523 4231496 4049558 3881201 3726259 3577432
58128C577432j43148j31200j19578j14759j10479j00565r1087q7984q5217p6793
$$ 3577432 3434284 3303084 3183506 3068747 2958268 2857703 2766616 2678632 2593415 2516622
58118B516622o8512o6536o5848o0798n6085n6659n7434n3277m9007m9507m9941
$$ 2516622 2448110 2381574 2315726 2254928 2198843 2142184 2084750 2031473 1982466 1932959 1883018
58107A883018m5396m0636m0739m1433l7982l4556l5631l6850l3389k9005k8120
$$ 1883018 1837622 1796986 1756247 1714814 1676832 1642276 1606645 1569795 1536406 1507401 1479281
58096A479281k7278k2868j9158k0149k1376j8116j4119j4072j4954j2908j1300
$$ 1479281 1452003 1429135 1409977 1389828 1368452 1350336 1336217 1322145 1307191 1294283 1282983
58085A282983j3921j7236j7293j7411k1312k5333k5206k3932k5387k6505k3482
$$ 1282983 1269062 1251826 1234533 1217122 1195810 1170477 1145271 1121339 1095952 1069447 1045965
58074A045965j9512j8838j9043j6505j3660j3703j3888j1197q880j0293j1926
$$ 1045965 1026453 1007615 988572 972067 958407 944704 930816 919619 910739 900446 888520
58063H88520r666o388o242o893m774k576m142o813o397n006o678r521r547q188
$$ 888520 878854 872466 866224 859331 854557 851981 847839 841026 834629 829623 822945 813424 803877 795689
58049G95689q905j0151q708o408o798q413p874o404p060q636q284p022o985o545
$$ 795689 786784 776633 767925 761517 754719 746306 738432 732028 724968 716332 708048 701026 694041 687496
58035F87496l810j445k335m007l007j274k241m208l665j986k635m657m864l815
$$ 687496 683686 682241 679906 675899 672892 671618 669377 665169 661504 659518 656883 652226 647362 643547
58021F43547l913m166k427k87l22j082N0J731J563J218L289N857N603L695L244
$$ 643547 639634 635468 633041 632754 632432 631350 631400 633131 634694 635912 639201 645058 650661 654356 657600
58006F57600L549K270P07J377K740J858j4J52J411R09m87r8J057N5k453l753m297
$$ 657600 661149 663419 664126 665503 668243 670101 670087 670239 671650 672559 672072 671974 673031 673086 670633 666880 662583
57989F62583o222q453q485p339p749q997q559p250p641q906q298o381n824o279
$$ 662583 656361 647908 639423 632084 624335 615338 606779 599529 591888 582982 574684 568303 562479 556200
57975E56200n423l813l882n106m914l366k544k368j389m08j016j812m76J830K456
$$ 556200 550777 546964 543082 537976 533062 529696 527152 524784 523395 522987 521971 520159 519683 521513 523969
57960E23969K152L398N342N253L677L290L785K719N51LJ112J585J417K603M828
$$ 523969 526121 529519 534861 540114 543791 547081 550866 553585 554136 554139 555251 556836 558253 560856 565684
57945E65684N906O048P322R509J0636J1043J2675J4987J5702J4970J4664J4394
$$ 565684 571590 577638 584960 594469 605105 616148 628823 643810 659512 674482 689146 703540
57933G03540J2419R608Q175P300M487M88j855k887n414r086j0519r053p669p810
$$ 703540 715959 725567 733742 741042 745529 746017 744162 741275 735861 726775 716256 707203 699534 691724
57919F91724p830o997o702p189p021o281o517p270o461m378l495m142m187l177
$$ 691724 683894 676897 670195 663006 655985 649704 643187 635917 629456 625078 621583 617441 613254 610077
57905F10077k979m016m640m463m687m935l482p97P77R63J535K431J844K33J24
$$ 610077 607098 603082 598442 593979 589292 584357 580875 580078 580855 581818 583353 585784 587628 587861 587985
57890E87985J585J910L32r56r77j239k152k108r81p43j753j999r51n05j268j431
$$ 587985 589570 591480 591812 590856 589879 588640 586488 584380 583399 582656 580903 578904 577953 577448 576180 574749
57874E74749l52K56k97m98J70K52n14l59J155K208K175K692M254N076M449L964
$$ 574749 574397 574653 574356 573858 574028 574280 573766 573407 574562 576770 578945 581637 585891 590967 595416 599380
57858E99380M198L482J330j76J28N59k88j382j728k284l796n245n905o617p749
$$ 599380 603578 607060 608390 608214 608342 608901 608613 607231 605503 603219 599423 594178 588273 581656 573907
57843E73907q230p812p858q787r140q242p301o833n613l379j910k021j979l68
$$ 573907 565677 557865 550007 541220 532080 523838 516537 509704 504091 500712 498802 496781 494802 494434
57829D94434J791L131L902M443L914K065L34j61l8jL42J065J284Q61Q98J621J696
$$ 494434 496225 499356 503258 507701 511615 513680 514014 513853 513815 513814 514156 515221 516505 517366 518264 519885 521581
57812E21581N12q75j733k563l304k833j106L59R75J909L647M940M983M498L919
$$ 521581 522093 521218 519485 516922 513618 510785 509679 510038 511013 512922 516569 521509 526492 530990 534909
57797E34909K766J556J845L479M281L426K684L223L755L161K448K603K790K193
$$ 534909 537675 539231 541076 544555 548836 552262 554946 558169 561924 565085 567533 570136 572926 575119
57783E75119J593J655J574P87J38R7l12j669l097m090n440p247q132p540o857
$$ 575119 576712 578367 579941 580728 580866 580963 580651 578982 575885 571795 566355 559108 550976 543436 536579
57768E36579p101p554p599p792q097p397n852n317o135o067l905j610j087j242
$$ 536579 529478 521924 514325 506533 498436 491039 485187 479870 473735 467668 463763 462153 461066 459824
57754D59824j89J717L114L985M810N106M644M589N592O350N628M176L068J908
$$ 459824 459635 461352 464466 468451 473261 478367 483011 487600 493192 499542 505170 509346 512414 514322
57740E14322J86j272j889k653m173n204m784m168m766n815n960n572n566n408
$$ 514322 514508 513236 511347 508694 504521 499317 494533 490365 485599 479784 473824 468252 462686 457278
57726D57278m275k961k668l013k955k618k550k398j843j733k703l846m178m163
$$ 457278 453003 450042 447374 444361 441406 438788 436238 433840 431997 430264 427561 423715 419537 415374
57712D15374m425m347l490k847l114l170j952l50M34Q96J858K570K172J578J904
$$ 415374 410949 406602 403112 400265 397151 393981 392029 391679 392113 393009 394867 397437 399609 401187 403091
57697D03091K308J539L19M0K21n05j848k499k502k747k832j596P51K976M867P077
$$ 403091 405399 406938 407257 407297 407518 407013 405165 402666 400164 397417 394585 392989 393740 396716 401583 408660
57681D08660R520J1765J4569J9102K5014L1001L7034M4309N3425O4097P6227Q9480
$$ 408660 418180 429945 444514 463616 488630 519631 556665 600974 654399 718496 794723 884203
57669H84203J01778J09475J08910R7082P2155L5555o582m5833p5926r4649j02604
$$ 884203 985981 1095456 1204366 1301448 1373603 1409158 1402576 1356743 1280817 1186168 1083564
57658A083564j01809r5039q4898p3143o1316n1131m3332l6917l0728k5006k0470
$$ 1083564 981755 886716 801818 728675 667359 616228 572896 535979 505251 480245 459775
57647D59775j6836j3593j1198j0097r449q206o693n711m998m024l292l281l058
$$ 459775 442939 429346 418148 408051 398602 390396 383703 377992 372994 368970 365678 362397 359339
57634C59339j751m61p78k084k400j444p78j125j550j352j004j010j284j814k696
$$ 359339 357588 357127 356349 354265 351865 350421 349643 348518 346968 345616 344612 343602 342318 340504 337808
57619C37808l433l344k656k207k263k496k785l100l062k535k132k186j932q51
$$ 337808 334375 331031 328375 326168 323905 321409 318624 315524 312462 309927 307795 305609 303677 302826
57605C02826J48J13k51K30J131J190M67R6L41N71O77R02O25r02k901l770l333
$$ 302826 302974 303087 302836 303066 304197 305387 305854 305950 306291 306862 307539 308441 309066 308164 305263 301493 298160
57588B98160k846k927l040k857k666k413j787j165j238j746j871j674j876k357
$$ 298160 295314 292387 289347 286490 283824 281411 279624 278459 277221 275475 273604 271930 270054 267697
57574B67697k277j553r50q38r87j391k083k419j852j023q17p89L8J209J366M80
$$ 267697 265420 263867 262917 262079 261092 259701 257618 255199 253347 252324 251507 250718 250756 251965 253331 253811
57558B53811j00K01O20O83P84J013R03N81P70J420J651J250J014J396K017K619
$$ 253811 253711 253912 254532 255215 255999 257012 257915 258496 259266 260686 262337 263587 264601 265997 268014 270633
57542B70633L294L651L003J618N88K89k1q19j641j945j750j316r51j146j990k596
$$ 270633 273927 277578 280581 282199 282787 283076 283055 282236 280595 278650 276900 275584 274633 273487 271497 268901
57526B68901k065q06M2J81J28M0j96K1J383L184L879L192K336K116K132J984J845
$$ 268901 266836 266030 266072 266253 266381 266421 266225 266246 267629 270813 274692 277884 280220 282336 284468 286452 288297
57509B88297J698J225P35R30J521J301q6j574k206k155j946j681j479j671k247
$$ 288297 289995 291220 291955 292885 294406 295707 295621 294047 291841 289686 287740 286059 284580 282909 280662
57494B80662k747k919k851k461j650q90q18j254j464j321j340j616j658j299q94
$$ 280662 277915 274996 272145 269684 268034 267144 266326 265072 263608 262287 260947 259331 257673 256374 255480
57479B55480o52n62p73j272j424o94L77Q40O39M24M29N04P22R95O59m22j011j29
$$ 255480 254828 254266 253493 252221 250797 250103 250480 251320 251959 252383 252812 253316 254038 255033 255692 255270 254259 254130
57461B54130J205J366O17M84J149J456J199J267J578J020l22q64J7J113J470J591
$$ 254130 255335 256701 257318 257802 258951 260407 261606 262873 264451 265471 265149 264285 264302 265415 266885 268476
57445B68476J942J941J234N28L79L49%m03o68j058j403j082k36K03N6J45O83Q01
$$ 268476 270418 272359 273593 274121 274500 274849 274849 274446 273778 272720 271317 270235 269999 270202 270258 270403 271086 271887
57427B71887J77k71L3L72N4m58n22l30k85k69j36o5JL78P75M70l31m90L11R14
$$ 271887 272064 271793 271826 272198 272252 271794 271272 270942 270657 270388 270252 270187 270188 270566 271341 271811 271480 270990 271301 272215
57407B72215L82p13j252q83N3J008J249L83p60p69M73J590J600R20K62j91j61
$$ 272215 272597 271884 270632 269749 269802 270810 272059 272442 271682 270913 271386 272976 274576 275496 275758 275567 275406
57390B75406P79K150K646J937J226J438K011K065J653J216Q33P02J331K601L512
$$ 275406 276185 278335 280981 282918 284144 285582 287593 289658 291311 292527 293360 294062 295393 297994 301506
57375C01506L458K926K572K463K588L123L881M389M749N357N807N341M479M607
$$ 301506 304964 307890 310462 312925 315513 318636 322517 326906 331655 337012 342819 348160 352639 357246
57361C57246N722O262N637N054N217N036L651J963J065N77j90q57r75j154j886
$$ 357246 362968 369230 374867 379921 385138 390174 393825 395788 396853 397430 397240 396383 395408 394254 392368
57346C92368k424k111j716k129k750k504j610j023q56o25m31o71j153j509j950
$$ 392368 389944 387833 386117 383988 381238 378734 377124 376101 375245 374620 374189 373518 372365 370856 368906
57331C68906k687l208k995k444k189k160k041j975k051j729o47O98J694K309K478
$$ 368906 366219 363011 360016 357572 355383 353223 351182 349207 347156 345427 344780 345478 347172 349481 351959
57316C51959J748L46m51J40J338K089K467K929L192K881K449K413K496K413K588
$$ 351959 353707 354053 353602 353742 355080 357169 359636 362565 365757 368638 371087 373500 375996 378409 380997
57301C80997L215L597L373L370M126M723M286L518L316L040J766L55L61J530K181
$$ 380997 384212 387809 391182 394552 398678 403401 407687 411205 414521 417561 419327 419682 420043 421573 423754
57286D23754J706R98O16K83P8N52J516K091K077K118K484K767K811K802K518J597
$$ 423754 425460 426458 427074 427357 427435 427987 429503 431594 433671 435789 438273 441040 443851 446653 449171 450768
57270D50768N41L29R58J464J454J574K236K907L012K711K473K511K864L495M099
$$ 450768 451309 451638 452596 454060 455514 457088 459324 462231 465243 467954 470427 472938 475802 479297 483396
57255D83396M261L956L556L369L446L706L939L868L539L373L541L687L574L509
$$ 483396 487657 491613 495169 498538 501984 505690 509629 513497 517036 520409 523950 527637 531211 534720
57241E34720L698L796L640L772M596N519N745N430N289N482N598N433N045M445
$$ 534720 538418 542214 545854 549626 554222 559741 565486 570916 576205 581687 587285 592718 597763 602208
57227F02208L878M012N057O153O436O278O592P304P570P238P101P576Q119Q132
$$ 602208 606086 610098 615155 621308 627744 634022 640614 647918 655488 662726 669827 677403 685522 693654
57213F93654P750P523P740Q274Q827R228R630J0206J0729J0751J0355J0198J0623
$$ 693654 701404 708927 716667 724941 733768 742996 752626 762832 773561 784312 794667 804865 815488
57200H15488J1232J1579J1685J1648J1494J1652J2660J4055J4480J3509J2455
$$ 815488 826720 838299 849984 861632 873126 884778 897438 911493 925973 939482 951937
57189I51937J2587J3497J4051J4103J4305J4862J5565J6490J7673J8549J8725
$$ 951937 964524 978021 992072 1006175 1020480 1035342 1050907 1067397 1085070 1103619 1122344
57178A122344J8900K0081K2167K4230K5863K7377K8896L0211L1370L2682L4123
$$ 1122344 1141244 1161325 1183492 1207722 1233585 1260962 1289858 1320069 1351439 1384121 1418244
57167A418244L5446L6695L8095L9582M0852M1721M2123M2035M1758M1829M2322
$$ 1418244 1453690 1490385 1528480 1568062 1608914 1650635 1692758 1734793 1776551 1818380 1860702
57156A860702M2733M2788M2813M3024M3201M3500M4738M7320N0573N3706N6718
$$ 1860702 1903435 1946223 1989036 2032060 2075261 2118761 2163499 2210819 2261392 2315098 2371816
57145B371816N9805O2641O4910O6824O8489O9459O9602O9807P1054P3213P5233
$$ 2371816 2431621 2494262 2559172 2625996 2694485 2763944 2833546 2903353 2974407 3047620 3122853
57134C122853P6003P4690P1130O6446O2557O0397N9267N8321N7884N8652O0429
$$ 3122853 3198856 3273546 3344676 3411122 3473679 3534076 3593343 3651664 3709548 3768200 3828629
57123C828629O2481O4772O8370P4854Q5308R9116J13706J26349J36472J45650
$$ 3828629 3891110 3955882 4024252 4099106 4184414 4283530 4397236 4523585 4660057 4805707
57113D805707J55736J68094J84222K05364K31235K60395K92086L26836L66020
$$ 4805707 4961443 5129537 5313759 5519123 5750358 6010753 6302839 6629675 6995695
57104F995695M12562M71746N49441O50041P78046R41048J148843J410590J735337
$$ 6995695 7408257 7880003 8429444 9079485 9857531 10798579 11947422 13358012 15093349
57095A5093349K133349K611432L165446L779762M433469N104202N768439O403769
$$ 15093349 17226698 19838130 23003576 26783338 31216807 36321009 42089448 48493217
57087D8493217O989456P498872P894369Q139130Q209769Q077870P672586O884256
$$ 48493217 55482673 62981545 70875914 79015044 87224813 95302683 102975269 109859525
57079A09859525N634550L953788J989249n6104j993624l688784n076537o157234
$$ 109859525 115494075 119447863 121437112 121381008 119387384 115698600 110622063 104464829
57071A04464829o965190p525829p840911p911362p761220p433459o972514o418828
$$ 104464829 97499639 89973810 82132899 74221537 66460317 59026858 52054344 45635516
57063D5635516n812374n189848m578160l995314l455438k968568k538060k162929
$$ 45635516 39823142 34633294 30055134 26059820 22604382 19635814 17097754 14934825
57055A4934825j841596j570785j343645j152870r93919q62720p52928o58858n78828
$$ 14934825 13093229 11522444 10178799 9025929 8032010 7169290 6416362 5757504 5178676
57046E178676n12399m56270m06107l60526l20177k84528k52386k23970j99597
$$ 5178676 4666277 4210007 3803900 3443374 3123197 2838669 2586283 2362313 2162716
57037B162716j77637j56326j36175j18149j01131q3666o6609n1374l6932k1218
$$ 2162716 1985079 1828753 1692578 1574429 1473298 1389632 1323023 1271649 1234717 1213499
57027A213499m377J1696K5682L6071L9267L1453J2302j4633m4259p1154r0289
$$ 1213499 1209122 1220818 1246500 1282571 1321838 1353291 1365593 1350960 1306701 1235547 1145258
57016A145258r9417j00457r6915r0605q2088p2651o3726n5423m7543m0995l6456
$$ 1145258 1045841 945384 848469 757864 675776 603125 539399 483976 436433 395438 358982
57005C58982l2820k8818k5018k2420k0439j8110j5978j4784j3561j1159q448o818
$$ 358982 326162 297344 272326 249906 229467 211357 195379 180595 167034 155875 147427 140609
56993A40609n660l482m72K225M791Q001J1194J3334J5258J8582K2726K5197K4278
$$ 140609 134949 131467 130995 133220 138011 146012 157206 170540 185798 204380 227106 252303 276581
56980B76581J9745J1778J351q946j6511k0996k3340k3597k1515j8355j5832j3829
$$ 276581 296326 308104 309455 300509 283998 263002 239662 216065 194550 176195 160363 146534
56968A46534j1160p926n103k416J166N300Q841J2078J6303K1440K6105K9598L1710
$$ 146534 135374 127448 122345 119929 121095 126395 135236 147314 163617 185057 211162 240760 272470
56955B72470L0941K5237J4744K066j0191k0542k7772l1098l1224k9588k6542k1826
$$ 272470 303411 328648 343392 345458 335267 314725 286953 255855 224631 195043 168501 146675
56943A46675j6438j2150r253o445k879J293O125J1886J7986K3522K8818L4857
$$ 146675 130237 118087 108834 102389 99510 100803 106928 118814 136800 160322 189140 223997
56931B23997M1210M5818M6476M1326K8970J0290j0179k6825l7199m2372m3773
$$ 223997 265207 311025 357501 398827 427797 438087 427908 401083 363884 321512 277739
56920B77739m1861l7639l3022k9076k5451k1880j8731j5927j2893r803p522o233
$$ 277739 235878 198239 165217 136141 110690 88810 70079 54152 41259 31456 23934 17701
56908A7701n327m574C709C05a642l36L98M98eB226L121L623M420N636O977Q834
$$ 17701 12374 7800 3709 305 -1642 -1978 -1580 -1082 -5 2226 5347 8970 13390 19026 26003 34837
56892C4837J1702J4922J7633K0492K4652K9459L3031L4610L4324L1112K3469J2292
$$ 34837 46539 61461 79094 99586 124238 153697 186728 221338 255662 286774 310243 322535
56880C22535P19r047j6739k1939k3560k1870j8795j5529j1659p037k513J788O908
$$ 322535 323254 314207 297468 275529 251969 230099 211304 195775 184116 177079 174566 176354 183262
56867A83262J3148J9513K5645L2569M0797M9468N7990O6661P4523P7972P2828
$$ 183262 196410 215923 241568 274137 314934 364402 422392 489053 563576 641548 714376
56856G14376N7327L3144M824k1653m1486n3305n8498n8512n4049m6387l7493k8335
$$ 714376 771703 804847 809671 788018 746532 693227 634729 576217 522168 475781 438288 409953
56844D09953j8613q310K013J2504K3932L6195M8588O1619P6590R3054J08428J20032
$$ 409953 391340 383030 385043 397547 421479 457674 506262 567881 644471 737525 845953 965985
56832I65985J25240J19557R7942O0170J3459l1698o7627r1476j03746j06632j02721
$$ 965985 1091225 1210782 1308724 1368894 1382353 1350655 1283028 1191552 1087806 981174 878453
56821H78453r3849q1329o7184n3680m1372k9084j6280l871P699J9411L1998M4919
$$ 878453 784604 703275 636091 582411 541039 511955 495675 491804 499503 518914 550912 595831
56809E95831N7653P0253Q1555Q8110Q5944P2592M7713J3873k2592n3682p4564
$$ 595831 653484 723737 805292 893402 979346 1051938 1099651 1113524 1090932 1037250 962686
56798I62686q5578q9234q7003p9914p0117n9922n0113m0441l0969k1964j3365
$$ 962686 877108 787874 700871 620957 550840 490918 440805 400364 369395 347431 334066
56787C34066n209K175R041J6323K4349L2331L9351M4535M5899M0695K7965R846
$$ 334066 328857 331032 340073 356396 380745 413076 452427 496962 542861 583556 611521 621367
56775F21367j0059k8481m2681n0793n3067n1562m7981m2880l7098l2042k7956
$$ 621367 611308 582827 540146 489353 436286 384724 336743 293863 256765 224723 196767
56764A96767k3706j9102j5612j3912j2580j0352q028o902o792o789o627o137m815
$$ 196767 173061 153959 138347 124435 111855 101503 93475 86573 79781 72992 66365 60228 55413
56751E5413k975j981k256k455j631o61m35k78N32J179P35j89o21p96j146j020
$$ 55413 52438 50457 48201 45746 44115 43454 43019 42741 43273 44452 45187 44998 44377 43581 42435 41415
56735D1415Q4J164J067L06Q0M16O11O36Q88J228J401J624J888J628R32Q37J538
$$ 41415 41499 42663 43730 44036 44116 44532 45143 45779 46667 47895 49296 50920 52808 54436 55368 56205 57743
56718E7743J668M20r37r07K04J284K129K783K585J396N73J104J852J246k81j164
$$ 57743 59411 59831 58894 57987 58191 59475 61604 64387 66972 68368 68941 70045 71897 73143 72862 71698
56702G1698j144j163j515j621j207m39N47J296R25n68j821j845j321j179j090
$$ 71698 70554 69391 67876 66255 65048 64609 65156 66452 67377 66809 64988 63143 61822 60643 59553
56687E9553n60j91n11p25j04N37K02n07n04m4J60M88J403J914R79l72k15J505
$$ 59553 58993 58802 58291 57566 57462 57999 58201 57694 57190 57146 57306 57794 59197 61111 62090 61718 61503 63008
56669F3008L146L793L853L679L214K772K744K853K726K809L519M148L862L081
$$ 63008 66154 69947 73800 77479 80693 83465 86209 89062 91788 94597 98116 102264 106126 109207
56655A09207K691K635K486K562L142L407K595J459J138J408J476J620K406L109
$$ 109207 111898 114533 117019 119581 122723 126130 128725 130184 131322 132730 134206 135826 138232 141341
56641A41341K611J303L66k47j439l040l992m117m177m385m323m055l977l853l246
$$ 141341 143952 145255 145621 145374 143935 140895 136903 132786 128609 124224 119901 115846 111869 108016 104770
56626A04770k577k505k692k399j872j853k169k016j303n98j36J02q4n83n97J90
$$ 104770 102193 99688 96996 94597 92725 90872 88703 86687 85384 84786 84650 84752 84668 84085 83488 83678
56610H3678Q73P01K49K29K33j32j15Q03J558J111K99M63J217J322Q32O24N95Q6
$$ 83678 84551 85252 85501 85730 85963 85831 85716 86519 88077 89188 89487 89950 91167 92489 93321 93945 94540 94626
56592I4626n46n03lK98O11J260J563R32J91K85O72O03O55J388J780R59K12J053
$$ 94626 94080 93577 93574 93872 94483 95743 97306 98238 98429 98714 99386 99989 100644 102032 103812 104771 104983 106036
56574A06036K602L085K784L088L741L571L031L385M254M621N326P723J0545J1176
$$ 106036 108638 111723 114507 117595 121336 124907 127938 131323 135577 140198 145524 153247 163792 174968
56560A74968R583Q026P212N797L720K790L607M549M413L663K690J163n44j425
$$ 174968 184551 192577 199789 205586 209306 212096 215703 220252 224665 228328 231018 232181 231637 230212
56546B30212j647k289l249l445k997l028l479l388l138l948n202m942l081j620
$$ 230212 228565 226276 223027 219582 216585 213557 210078 206690 203552 199604 194402 189460 186379 184759
56532A84759j471j649j734k400l186k524o61P6j310l122l721l400k905k255j717
$$ 184759 183288 181639 179905 177505 174319 171795 171134 171210 169900 166778 163057 159657 156752 154497 152780
56517A52780j906k376k086j485j983l191l165j713q49j409j881j322q12j058j092
$$ 152780 150874 148498 146412 144927 142944 139753 136588 134875 134026 132617 130736 129414 128602 127544 126452
56502A26452m20j20o59p76K55J282J314J037J193J297R55P45R23Q46M28N23J160
$$ 126452 126032 125912 125253 124477 124732 126014 127328 128365 129558 130855 131810 132555 133478 134324 134752 135275 136435
56485A36435J223M62J7L68O27M17M93R50P94j00n76l31m47j191j431q06l51l56
$$ 136435 137658 138120 138137 138505 139132 139549 140042 140992 141786 141686 141110 140779 140332 139141 137710 136904 136553 136197
56467A36197J96J373J744Q73J49L52N97M46P76J670J735N34m90m47k21m34l50
$$ 136197 136393 137766 139510 140383 140532 140884 141481 141927 142703 144373 146108 146642 146152 145705 145484 145050 144700
56450A44700K31K91l00k14Q79J512J006N40P75P40P7p6N87P30m3l27L60N95j20
$$ 144700 144931 145222 144922 144708 145587 147099 148105 148645 149420 150160 150237 150161 150748 151478 151435 151108 151468 152063 151943
56431A51943k56P11R90l24j499j195n86p78p48L54J384J516J853K894K984J244
$$ 151943 151687 152398 153388 153064 151565 150370 149784 149006 148258 148612 149996 151512 153365 156259 159243 160487
56415A60487m48n06j21o01q16L19J317O90j79N14J701J416K60J45J035J584J673
$$ 160487 160039 159533 159412 158811 157995 158314 159631 160321 160142 160656 162357 163773 164033 164178 165213 166797 168470
56398A68470J875J651M49n78j77Q34J061Q72J266J746J443J006J367J837J441
$$ 168470 170345 171996 172445 171867 171690 172524 173585 174457 175723 177469 178912 179918 181285 183122 184563
56383A84563Q29R73J264Q35L75O80Q82R9o31j30O35J95p90p03M45J587K557L489
$$ 184563 185392 186365 187629 188464 188839 189519 190401 190500 189869 189739 190374 190569 189779 189076 189521 191108 193665 197154
56365A97154L502K023L17j98n4l99r45r42q82j304j294p7J297J604J423J660J705
$$ 197154 200656 202679 202996 202798 202744 202345 201400 200458 199576 198272 196978 196901 198198 199802 201225 202885 204590
56348B04590R24M29J219K170J852R72Q94J245J033O63Q47R55M70M83J694K648
$$ 204590 205514 205943 207162 209332 211184 212156 213050 214295 215328 215991 216838 217793 218263 218746 220440 223088
56332B23088K028J034J237J863J483O97O59P12ok96J037K506K125Q12P78J829
$$ 223088 225116 226150 227387 229250 230733 231430 232089 232801 232795 232499 233536 236042 238167 238979 239757 241586
56316B41586K119J395Q16N58J93L15J396K200J740J353K467L835L729L112L703
$$ 241586 243705 245100 245916 246474 246667 246982 248378 250578 252318 253671 256138 259973 263702 266814 270517
56301B70517M508L555J775J691L205M026L591L382L842L998L777M018M567M677
$$ 270517 275025 278580 280355 282046 285251 289277 292868 296250 300092 304090 307867 311885 316452 321129
56287C21129M712N225N326M245L388M358O129O692O282O360O753O594O763Q417
$$ 321129 325841 331066 336392 340637 344025 348383 354512 361204 367486 373846 380599 387193 393956 402373
56273D02373J0411J1068J1281J2782J4728J5299J5453J7520K1067K3660K5067
$$ 402373 412784 423852 435133 447915 462643 477942 493395 510915 531982 555642 580709
56262E80709K7200L0520L3831L7145M1537M6594N1049N5486O1447O8489P4907
$$ 580709 607909 638429 672260 709405 750942 797536 848585 904071 965518 1034007 1108914
56251A108914Q0676Q6670R1921R4724R5650R6334R6072R2768Q6418P8519O8907
$$ 1108914 1189590 1276260 1368181 1462905 1558555 1654889 1750961 1843729 1930147 2008666 2077573
56240B077573N6472M2081K7583J2756l462j9733l3699m5551n6750o6352p2319
$$ 2077573 2134045 2176126 2203709 2216465 2213003 2193270 2159571 2114020 2057270 1990918 1918599
56229A918599p5486p8254q0258p9398p6466p4497p3936p2512o9593o6601o3407
$$ 1918599 1843113 1764859 1684601 1605203 1528737 1454240 1380304 1307792 1238199 1171598 1108191
56218A108191n8498n2632m8329m5636m2296l8108l5205l3888l2031k8896k5936
$$ 1108191 1049693 997061 948732 903096 860800 822692 787487 753599 721568 692672 666736
56207F66736k3568k0686j7517j5572j4638j3006j0658r042q103o727n540n842
$$ 666736 643168 622482 604965 589393 574755 561749 551091 542049 533946 527219 521679 515837
56195E15837o463n253l021k227k641k162j087j322k208j521O8J1j251j065M15
$$ 515837 509374 504121 501100 498873 496232 494070 492983 491661 489453 487932 488000 488011 486760 485695 486110
56180D86110P26J53J222L478L850K252J765L026L520K724K947M505N023M149M267
$$ 486110 486836 486989 488211 491689 495539 497791 499556 502582 506102 508826 511773 516278 521301 525450 529717
56165E29717N879O862O877P966J0229J1468J1496J2415J4377J5503J6053J8042
$$ 529717 535596 542458 549335 557301 567530 578998 590494 602909 617286 632789 648842 666884
56153F66884K0868K2172K2839K6014L1376L5794L9479M5805N5025O4085P2872
$$ 666884 687752 709924 732763 758777 790153 825947 865426 911231 966256 1030341 1103213
56142A103213Q4495R8968J12735J24963J37849J49889J55368J51881J42373J28887
$$ 1103213 1187708 1286676 1399411 1524374 1662223 1812112 1967480 2119361 2261734 2390621
56132B390621J10919R1069P5423O6200N9951N4271M9795M4333L2552J4130m234
$$ 2390621 2501540 2592609 2668032 2734232 2794183 2848454 2898249 2942582 2975134 2989264 2985030
56121B985030j7618k7673l6820m4373n1153o1414p6918r4423j11298j27895j42421
$$ 2985030 2967412 2939739 2902919 2858546 2807393 2745979 2669061 2574638 2463340 2335445 2193024
56110B193024j49831j48520j42330j33748j21203j05095q9734p6863o3709m9920
$$ 2193024 2043193 1894673 1752343 1618595 1497392 1392297 1302563 1225700 1161991 1112071
56100A112071l9651l4141k9039k1989j6160j3379j0681o771m914o168o550m204
$$ 1112071 1072420 1038279 1009240 987251 971091 957712 947031 940260 935346 929178 922628 918424
56088I18424k564l228k743K42J897P79J108M835P785P607Q095J1532J4163J3545
$$ 918424 915860 912632 909889 910131 912028 912807 913915 918750 926535 934142 942237 953769 967932 981477
56074I81477J3037J4603J4597J1123Q204Q073O881K687pJ416K563L59j180J197
$$ 981477 994514 1009117 1023714 1034837 1043041 1051114 1057995 1060682 1060675 1062091 1064654 1065013 1063833 1065030
56060A065030L967M089M721Q132J0438Q964P580R198J0458R179R292J2888J5281
$$ 1065030 1068997 1073086 1077807 1085939 1096377 1105341 1112921 1122119 1132577 1141756 1151048 1163936 1179217
56047A179217J3729J2944J6173J9023J8066J7248J9603K1178J9324J8423K1044
$$ 1179217 1192946 1205890 1222063 1241086 1259152 1276400 1296003 1317181 1336505 1354928 1375972
56036A375972K2402J9949J9278K3821K8216K8685L0038L5209L8177L5181L2586
$$ 1375972 1398374 1418323 1437601 1461422 1489638 1518323 1548361 1583570 1621747 1656928 1689514
56025A689514L5343L8056L6095L4897L9113M3220M2388M2082M7092N1786N1254
$$ 1689514 1724857 1762913 1799008 1833905 1873018 1916238 1958626 2000708 2047800 2099586 2150840
56014B150840N1269N6887O2224O2076O2384O8271P3443P2743P3221Q0794Q8213
$$ 2150840 2202109 2258996 2321220 2383296 2445680 2513951 2587394 2660137 2733358 2814152 2902365
56003B902365Q8718Q9136R6474J04261J05786J07816J17025J26014J27576J29419
$$ 2902365 2991083 3080219 3176693 3280954 3386740 3494556 3611581 3737595 3865171 3994590
55993C994590J39526J50679J55354J61572J77395J94421K03933K14268K34219
$$ 3994590 4134116 4284795 4440149 4601721 4779116 4973537 5177470 5391738 5625957
55984E625957K55127K68315K83623L10767L39814L61142L86341M26873M71428
$$ 5625957 5881084 6149399 6433022 6743789 7083603 7444745 7831086 8257959 8729387
55975H729387N08527N51112O12945O82313P47098Q23123R27336J047106J169407
$$ 8729387 9237914 9789026 10401971 11084284 11831382 12654505 13581841 14628947 15798354
55966A5798354J315003J507717J737517J994876K313519K735661L268120L926661
$$ 15798354 17113357 18621074 20358591 22353467 24666986 27402647 30670767 34597428
55958C4597428M792602N963724P472064R304594J1470157J3986600J6856499K0143080
$$ 34597428 39390030 45353754 52825818 62130412 73600569 87587169 104443668 124586748
55950A24586748K4010275K8550031L3549517L8430265M2206126M3276007L9537068
$$ 124586748 148597023 177147054 210696571 249126836 291332962 334608969 374146037
55943C74146037K9487738J3805616m263933k0521889l2100538l8406208m0345957
$$ 374146037 403633775 417439391 413175458 392653569 360553031 322146823 281800866
55936B81800866l9161701l5953971l1701971k7203841k2937370j9107933j5809487
$$ 281800866 242639165 206685194 174983223 147779382 124842012 105734079 89924592
55929H9924592j3069937j0822496q961958p430724o200734n211566m391409l712544
$$ 89924592 76854655 66032159 57070201 49639477 43438743 38227177 33835768 30123224
55921C0123224l170850k734378k360763k042649j789646j584490j398264j230608
$$ 30123224 26952374 24217996 21857233 19814584 18024938 16440448 15042184 13811576
55913A3811576j095843r85228q78801p79607p02090o39816n76127n14468m68358
$$ 13811576 12715733 11730505 10851704 10072097 9370007 8730191 8154064 7639596 7171238
55904G171238m32723l93046l52423l23075l01100k74658k47586k30952k20154
$$ 7171238 6738515 6345469 5993046 5669971 5368871 5094213 4846627 4615675 4395521
55895D395521k03363j84010j72882j66268j53297j37110j28019j23124j12733
$$ 4395521 4192158 4008148 3835266 3668998 3515701 3378591 3250572 3127448 3014715
55886C014715r9862r3787r0983q1716o9311o4188o4566o1373n6806n9866o8073
$$ 3014715 2914853 2821066 2730083 2648367 2579056 2514868 2450302 2388929 2332123 2272257 2204184
55875B204184p1196o9251p0154p3169p0927o4612o1584o0874n5793m8092m5169
$$ 2204184 2132988 2063737 1993583 1920414 1849487 1784875 1723291 1662417 1606624 1558532 1513363
55864A513363m5931m3239l7732l5807l6577l3914k8904k7604k8839k6674k2431
$$ 1513363 1467432 1424193 1386461 1350654 1314077 1280163 1251259 1223655 1194816 1168142 1145711
55853A145711k2067k4191k2681j8784j8646k1283k0805j8350j9890k4199k4653
$$ 1145711 1123644 1099453 1076772 1057988 1039342 1018059 997254 978904 959014 934815 910162
55842I10162k1376k0246k1405j9930j6479j6121j7831j5967j1287r876j1991j2236
$$ 910162 888786 868540 847135 827205 810726 794605 776774 760807 749520 739644 727653 715417
55830G15417r976r434j0185p755l105j709l478l235p75r51l990n100l697l944
$$ 715417 705441 696007 685822 678067 674962 673253 669775 666540 665765 664814 660824 655724 652027 648083
55816F48083o048n876l298k336k963j256K301L075R34K74J378L7l883n864n177
$$ 648083 642035 636159 632861 630525 627562 626306 628607 631682 632616 632890 634268 634305 630422 624558 619381
55801F19381n827q460r222p466p009q754r371q183q224r690r179o249m076l169
$$ 619381 613554 605094 595872 588406 581397 572643 563272 555089 546865 537175 527996 521747 517671 514502
55787E14502j057J454O14l177n316m614m256m890l600m89N96j117k182j605k284
$$ 514502 513445 514899 515513 512336 507020 502406 498150 493260 489660 489171 489767 488650 486468 484863 482579
55772D82579m897o621o864q259j0961j1923j0693j0166j0810r941p343n812n529
$$ 482579 477682 471061 464197 455938 444977 433054 422361 412195 401385 391444 384101 378289 372760
55759C72760l777q11M0j380j759q41k029n705q238q549r398j1140j0582p449n676
$$ 372760 368983 368172 368212 366832 365073 364232 362203 356498 348260 339711 330313 319173 308591 301142 295466
55744B95466o643p138n725n098o285o416m320k724k786j907Q43K481J495M80J073
$$ 295466 288823 281685 275960 270862 264577 258161 253841 251117 248331 246424 247267 249748 251243 251723 252796
55729B52796J247k40j392j131j337k686k962j461o32j472j717n26l19k007k887
$$ 252796 254043 253803 252411 251280 249943 247257 244295 242834 242202 240730 239013 238487 238168 236161 233274
55714B33274j384L26N53O81J521J335m03j316k51P50N26Q01K309K948J805R79
$$ 233274 231890 232216 232769 233450 234971 236306 235903 234587 234336 235086 235612 236413 238722 241670 243475 244454
55698B44454J403Q86j521l240k507j239j287j463o03n3p30j060m8P59M66P50K563
$$ 244454 245857 246743 245222 241982 239475 238236 236949 235486 234883 234830 234100 233040 232992 233751 234217 234967 237530
55681B37530M118M104L823M188L832K121Q64J073J113o5r83p81j039k527l319
$$ 237530 241648 245752 249575 253763 257595 259716 260580 261653 262766 262701 261718 260937 259898 257371 254052
55666B54052k263j204j645k210j517o84p93o87N04J229J16j687k676l161l628
$$ 254052 251789 250585 248940 246730 245213 244529 243736 243049 243553 244782 244898 243211 240535 237374 233746
55651B33746l369k408k310l556m481m225m136m902n099m024l166l321l041j585
$$ 233746 230377 227969 225659 222103 217622 213397 209261 204359 199260 195236 192070 188749 185708 184123
55637A84123n21q24j088k56N46M96O08J246R45p04j785j287p69j291j523o25j3
$$ 184123 183602 182778 181690 181434 181980 182476 183084 184330 185275 184571 182786 181499 180730 179439 177916 177291 177278
55620A77278n11n98O14J462O40o48j182j661k459k296r45l92j429k017r22Lp86
$$ 177278 176767 176169 176783 178245 178885 178237 177055 175394 172935 170639 169694 169302 167873 165856 164934 164937 164151
55603A64151j768j237j97n2j03M52N67l60q15K8L91j006k420k041r51p83q50j0
$$ 164151 162383 161146 160949 160897 160794 161246 161813 161453 160638 160666 161057 160051 157631 155590 154639 153856 153006 152996
55585A52996R04R14J008K070K895K509K306L562M987N045M603M968N412M978M637
$$ 152996 153900 154814 155822 157892 160787 163296 165602 169164 174151 179196 183799 188767 194179 199157 203794
55570B03794N325N832M928L684L366L012J395n80j684k649m393n833n721m923
$$ 203794 209119 214951 219879 223563 226929 229941 231336 230756 229072 226423 222030 216197 210476 205553
55556B05553m696m592m004l892m753m964l305j212l77j18P35J443J094O44J021
$$ 205553 200857 196265 192261 188369 183616 178652 175347 174135 173758 173640 174375 175818 176912 177556 178577
55541A78577J177K65m53p6j17j610k666j599j54p01k307k774k530l241m257l820
$$ 178577 179754 180019 179566 179490 179373 177763 175097 173498 173344 172643 170336 167562 165032 161791 157534 153714
55525A53714k473k069k523k442j877j727j538n69J35o45j839j787j124j323j808
$$ 153714 151241 149172 146649 144207 142330 140603 139065 138496 138631 137986 136147 134360 133236 131913 130105
55510A30105j195j84l53j169j007p6K52R4L90P17K22l02J62O09k31j214n59R23
$$ 130105 128910 128726 128373 127204 126197 126121 126373 126467 126857 127574 127796 127494 127656 128265 128034 126820 126261 127184
55492A27184J173L48R0M15J85k93j3L38m43j413q90M55P77L59P15J347O68o41
$$ 127184 128357 128705 128795 129210 129395 129102 129089 129427 128984 127571 126681 127136 127913 128272 128987 130334 131002 130361
55474A30361n52N73N20q07j249j84P34P85J013J659J609P75M55Q82Q80K09m1L24
$$ 130361 129809 130382 130902 130095 128846 128662 129396 130181 131194 132853 134462 135237 135692 136574 137454 137663 137622 137946
55456A37946K86l73p89q73j328j829j305j3O97N40L36J14o46j252n65P26Q93M2
$$ 137946 138232 137859 137070 136197 134869 133040 131735 131722 132419 132959 133295 133409 132763 131511 130946 131672 132565 132607
55438A32607j69M80N80r6j64P70J437J200Q60Q53O40K27L22Q04Q18N23R35J975
$$ 132607 132438 132918 133498 133402 133238 134008 135445 136645 137505 138358 138998 139225 139547 140351 141169 141692 142627 144602
55420A44602K552K483K528K659K279J891K475L306K670P12p11j045j564k707l241
$$ 144602 147154 149637 152165 154824 157103 158994 161469 164775 167445 168157 167446 166401 164837 162130 158889
55405A58889k589j802j680j792j827k084k318j834j039j109j924k163j547j083
$$ 158889 156300 154498 152818 151026 149199 147115 144797 142963 141924 140815 138891 136728 135181 134098
55391A34098r38j46J221J689P57k76m40l30n92p95n26j90j67k38k95m98o57n15
$$ 134098 133160 133014 134235 135924 136681 136405 135965 135635 135043 134248 133722 133532 133365 133127 132832 132334 131677 131162
55373A31162n00j060j546j138m55o94j551j765j297j129j209o01M90Q86N49N61
$$ 131162 130662 129602 128056 126918 126463 125769 124218 122453 121156 120027 118818 118217 118707 119593 120142 120703
55357A20703J015R59L76K19M78K79j97R3R01R14J11l01k30o81j398r83L96R65
$$ 120703 121718 122677 123053 123272 123750 124029 123832 123925 124826 125740 125851 125550 125320 124639 123241 122258 122654 123619
55339A23619L68J34O53M12j026j871j063J06M29O03J309J570N63p28j088q54q58
$$ 123619 123987 124121 124774 125186 124160 122289 121226 121332 121761 122364 123673 125243 125806 125078 123990 123136 122278
55322A22278r16n99k32j25Q2N28O86M58M86R01J022P39P41J016O75k66o26m9M18
$$ 122278 121362 120763 120531 120406 120488 121016 121702 122160 122646 123547 124569 125308 126049 127065 127740 127474 126848 126799 127217
55303A27217L44O34J563J955J243N34O36O50k61j321j465r64n67k37K53N30L59
$$ 127217 127561 128195 129758 131713 132956 133490 134126 134776 134515 133194 131729 130765 130198 129961 130214 130744 131103
55286A31103J99L01K67L1J02L71K9q36j037l10Q2n31j063n90J23N9m00m03o3J25
$$ 131103 131302 131603 131870 131901 132003 132374 132403 131567 130530 130220 130302 129771 128708 128118 128241 128300 127900 127497 127434 127559
55266A27559K47M54M73L20N73J218J399R03P30J387J894J321J92n60r43j375j725
$$ 127559 127806 128260 128733 129053 129626 130844 132243 133146 133876 135263 137157 138478 138670 138110 137167 135792 134067
55249A34067j746j621j418q70j64j1m34n59p3K61J7k28j14j95p14r23l08N58J011
$$ 134067 132321 130700 129282 128412 128248 128237 127803 127244 127171 127432 127449 127221 127107 126912 126198 125275 124967 125525 126536
55230A26536J136J066N62j97n22l30k39k90J77J023J214O28L78Q43J008M05J8
$$ 126536 127672 128738 129300 129103 128581 128251 128012 127722 127899 128922 130136 130764 131142 131985 132993 133398 133416
55213A33416M30O85K0p39n72K52J037J745K261J883N25o47p76l95k27j56j05n88
$$ 133416 133846 134531 134551 133812 133240 133492 134529 136274 138535 140418 140943 140296 139520 139125 138898 138742 138637 138049
55195A38049j540j891j260p53j145j584j104j70L71O81J172J445J044L76Nj07
$$ 138049 136509 134618 133358 132605 131460 129876 128772 128602 128973 129654 130826 132271 133315 133691 133696 133589
55179A33589K2O35J339J138Q6n17j82j3o58j117n75J81L52N50J365J962J457M71
$$ 133589 133611 134246 135585 136723 136809 136292 136110 136097 135439 134322 133747 133928 134280 134830 136195 138157 139614 140085
55161A40085Om8j42j1L96K71n61q34J55J125Q15O9K22P29J76j305k342k361j703
$$ 140085 140091 140043 139901 139890 140286 140557 139996 139162 139317 140442 141257 141326 141548 142277 142453 141148 138806 136445 134742
55142A34742n27R39J683J031j11m12O5L89L93M80N09J09l38l03q0j76l18n7L36
$$ 134742 134215 135154 136837 137868 137757 137345 137410 137799 138192 138672 139181 139290 138952 138649 138569 138393 138075 138018 138354
55123A38354M52N18O88M81k20n82k18L5l71n10L86J427J488J014R34R51M08q1
$$ 138354 138806 139324 140012 140493 140273 139691 139473 139508 139137 138627 139013 140440 141928 142942 143876 144827 145235 145154
55105A45154L70J176J091J49o62r95j018n09N40J164O80k2J75Q03P76L09L25O82
$$ 145154 145524 146700 147791 147940 147278 146283 145265 144756 145296 146460 147140 147118 147293 148096 148872 149181 149506 150188
55087A50188O01J82K3m2l70m02K85P02j50j353j356m92k84p83o71K92Q87N48N3
$$ 150188 150789 150971 150994 150952 150582 150180 150465 151167 151017 149664 148308 147816 147532 146749 146078 146370 147257 147805 147858
55068A47858l0l5k07l45m91p75o62L94J711K039J296N24K79K31J25j7m18j180
$$ 147858 147828 147793 147586 147241 146750 145975 145313 145707 147418 149457 150753 151277 151556 151787 151912 151895 151477 150297
55050A50297j678j427r85j061j252q77l79n14p85k18Q24J160P34N16P73R71J061
$$ 150297 148619 147192 146207 145146 143894 143017 142638 142124 141339 141121 141945 143105 143839 144355 145128 146099 147160
55033A47160J313J215J31j190j348l65M69O21O70Q21O82M27P06J342J532J265
$$ 147160 148473 149688 149819 148629 147281 146916 147385 148006 148676 149497 150179 150606 151312 152654 154186 155451
55017A55451J189J210O06n42j382j632j617j244l12M66K87j91K24J082Q14o20
$$ 155451 156640 157850 158456 157914 156532 154900 153283 152039 151727 152193 152480 152289 152513 153595 154409 153789
55001A53789j561j185m19l5M02J177J677J504J055N99l1n53l31M20P35M30K79
$$ 153789 152228 151043 150624 150589 150991 152168 153845 155349 156404 157003 156972 156419 156088 156508 157243 157673 157952
54984A57952N25N00j7l75k72j94l44k69K22P80J251J660J597P47r7J19J013J319
$$ 157952 158477 158977 158960 158585 158313 158119 157775 157506 157728 158508 159759 161419 163016 163763 163666 163785 164798 166117
54966A66117R31R29J609K147K239K387K393J377m16j538j412q88m76K95J312J557
$$ 166117 167048 167977 169586 171733 173972 176359 178752 180129 179713 178175 176763 175875 175399 175694 177006 178563
54950A78563Q64L65N25N00R4N07K194L684L714L088L148L834M459N262O747Q439
$$ 178563 179427 179792 180317 180817 180911 181418 183612 187296 191010 194098 197246 201080 205539 210801 217548 225987
54934B25987R576J0326J1209J1900J1628J0224P946M823J034k649n562p819r684
$$ 225987 235563 245889 257098 268998 280626 290850 298796 303619 304653 302004 296442 288623 278939
54921B78939j0852j1013j0557j0012r289q163o992o299o005n581m703l429k048
$$ 278939 268087 257074 246517 236505 227216 219053 212061 205762 199757 194176 189473 186044 183996
54908A83996j030o78o53k46O98J608K023K020J821J623J896L047M666N824O235
$$ 183996 182966 182288 181635 181389 182087 183695 185718 187738 189559 191182 193078 196125 200791 206615 212850
54893B12850O483P063P959R144J0569J1607J1408R953P936N591K550j110m706
$$ 212850 219333 226396 234355 243499 254068 265675 277083 287036 294972 300563 303113 302003 297297
54880B97297p821j0376j1866j1762j0705r991r801r176p905o881o363n483m033
$$ 297297 289476 279100 267234 255472 244767 234776 224975 215799 207894 201013 194650 189167 185134
54867A85134l116l269l435k670j540q70l46N33J239J112N92M75O05L37l12q82
$$ 185134 182018 178749 175314 172644 171104 170234 169888 170421 171660 172772 173364 173839 174444 174781 174469 173587
54851A73587j234j338r78l74m07j421k454k459j670j012q11q98j291j872j913
$$ 173587 172353 171015 170037 169663 169256 167835 165381 162922 161252 160240 159429 158531 157240 155368 153455
54836A53455r23M66J271J445J614J898J909J682J743K161K253J396j72j499j721
$$ 153455 152532 152998 154269 155714 157328 159226 161135 162817 164560 166721 168974 170370 170198 168699 166978
54821A66978q94j4k5p29j056m02P45J579J795J502R19M03L54Q33J498J900J641
$$ 166978 166084 166070 166045 165316 164260 163858 164603 166182 167977 169479 170398 170801 171155 171988 173486 175386 177027
54804A77027N19r09j426n50N41M63l85m96M02J177J349J623K169K113J373J313
$$ 177027 177546 176637 175211 174661 175202 175665 175280 174784 175186 176363 177712 179335 181504 183617 184990 186303
54788A86303K707M424N174N304N796O657P500Q707J0665J2528J3106J2525J1859
$$ 186303 189010 193434 198608 203912 209708 216365 223865 232572 243237 255765 268871 281396 293255
54775B93255J1418J0549Q924P019N181L121N19k355m834o466p367p933q168p512
$$ 293255 304673 315222 324146 331165 336346 339467 339986 337631 332797 326331 318964 311031 302863 295351
54761B95351n751l849l248m348o287q103r328r589q641o981n539m587l672k729
$$ 295351 289600 285751 282503 278155 271868 263765 254437 244848 236207 229226 223687 219100 215428 212699
54747B12699k181j917j178K00J516K345K999L653M169M965O758R072J0365J0159
$$ 212699 210518 208601 207423 207623 209139 211484 214483 218136 222305 227270 234028 243100 253465 263624
54733B63624R652R628R114O963L590J89k730n180o986q180r248j0238j0430r526
$$ 263624 273276 282904 292018 298981 302571 302760 300030 294850 287864 279684 270436 260198 249768 240242
54719B40242q316p504o831n984n359n172m842l997l131k538j714n14J87j07n52
$$ 240242 231926 224422 217591 211607 206248 201076 196234 192237 189106 186568 184854 184340 184527 184420 183868
54704A83868l56m6l23p41o10k98m50q13q56q37j134j320r23l87l02l99k18J2J4
$$ 183868 183512 183466 183143 182402 181792 181494 181044 180231 179375 178538 177404 176084 175161 174774 174472 174073 173855 173867 173881
54685A73881J14L83P7j097k132k145j638j340r60j94J84l41p63q3Q99R31M45O38
$$ 173881 173995 174378 174455 173358 171226 169081 167443 166103 165143 164949 165133 164792 164029 163946 164845 165776 166221 166859
54667A66859J287J254N47M3k74r47j416n98J051J922J541Q67M25j79q47q45k45
$$ 166859 168146 169400 169947 169990 169716 168769 167353 166755 167806 169728 171269 172136 172561 172382 171535 170690 170445
54650A70445K1k46k22M03R12Q23M51M1n21r84q44l81m29r87j109l86M86P72M71
$$ 170445 170466 170220 169998 170401 171313 172136 172587 172628 172107 171123 170279 169898 169469 168482 167373 166987 167473 168245 168716
54631A68716j32p41q75l15K89J48l97l83J81M13K11M77J461K149J723O20l59r76
$$ 168716 168584 167843 166968 166653 166942 167090 166693 166310 166491 166904 167115 167592 169053 171202 172925 173545 173186 172210
54613A72210j222q83k3P52R56P39M88L68L94M54K38l86r12p24mM25J60m10q05
$$ 172210 170988 170105 170082 170834 171790 172529 173017 173385 173779 174233 174471 174085 173173 172449 172445 172870 173030 172620 171815
54594A71815r00p16k67L33R27J392J423O92m22q90l25L86L98J61M39Q99P65L18
$$ 171815 170915 170199 169932 170265 171192 172584 174007 174699 174277 173387 173062 173448 173846 174007 174446 175345 176110 176428
54576A76428M13R15R02K59k38k94l39m31j48M13O11L30kl19q51j191o75L42P77
$$ 176428 176841 177756 178658 178917 178679 178385 178046 177615 177467 177880 178491 178821 178819 178500 177649 176458 175783 176125 176902
54557A76902N01M67J075J616J628J570J775J862J617J422J383R70M2o95p25m66
$$ 176902 177403 177870 178945 180561 182189 183759 185534 187396 189013 190435 191818 192788 192830 192135 191410 190944
54541A90944m86o68o32l68p1J76K62K3l95o70q33j134j401j181n46q3k0n5q0l22
$$ 190944 190458 189790 189158 188790 188719 188895 189157 189180 188785 188115 187282 186148 184747 183566 183020 182937 182917 182862 182782 182460
54521A82460o41n02J70P60P92M32O2j02P2M92O40J17o55r20o25k97j08J83M48
$$ 182460 181819 181317 181487 182247 183039 183471 183533 183431 183503 183995 184635 184752 184097 183177 182552 182255 182147 182330 182778
54502A82778L16k0l6J27j32o47n66K44Q62P46M61O18R14P81K85n6L6M45Q61J003
$$ 182778 183094 183074 183038 183165 183033 182386 181820 182064 182926 183672 184133 184751 185665 186446 186731 186675 186711 187156 188017 189020
54482A89020R20R87J282J278O42j3R0P19J069J006R55Q56L48k27j90K10Q0n98
$$ 189020 189940 190927 192209 193487 194129 194116 194206 194925 195994 197000 197955 198811 199159 198932 198742 198952 199032 198434
54464A98434r33o62m84o75o44j16L36L11R2j11m46o83k31P44J183N17o61j497
$$ 198434 197501 196839 196355 195680 195036 194920 195256 195567 195659 195548 195102 194419 194188 194932 196115 196632 195971 194474
54446A94474j602q38O09J767J572K95p44r84j010j030m09P94J329N64m34m69J03
$$ 194474 192872 192034 192643 194410 195982 196277 195533 194549 193539 192509 192100 192894 194223 194787 194353 193884 193987
54429A93987J59n01j121j061k81P63J354J144P59J069J817J945J355J108J574
$$ 193987 194146 193645 192524 191463 191182 191945 193299 194443 195202 196271 198088 200033 201388 202496 204070
54414B04070J739R68J31J11L48q7r04j079l22P78J574J631P88l89q73l92J89K15
$$ 204070 205809 206777 206908 207019 207367 207280 206376 205297 204975 205753 207327 208958 209746 209357 208484 208092 208281 208496
54396B08496J00L14M50N4m24l95j78m07r12j033n99J01Q58J436J381O25j80m60
$$ 208496 208596 208910 209360 209414 208990 208595 208417 208010 207098 206065 205466 205567 206425 207861 209242 209867 209687 209227
54378B09227m44n55o25l16J98N22O19O13M98N00J037J883K076J282N34Q58J828
$$ 209227 208783 208228 207603 207287 207485 208007 208626 209239 209737 210237 211274 213157 215233 216515 217049 217907 219735
54361B19735K344K236K156K226J941J309J152K018L392M216L962L038K248J874
$$ 219735 222079 224315 226471 228697 230638 231947 233099 235117 238509 242725 246687 249725 251973 253847
54347B53847J428M20r06k014k910l818m299l690k431j841k277k621j998j007o50
$$ 253847 255275 255695 254789 252775 249865 246047 241748 238058 235627 233786 231509 228888 226890 225883 225233
54332B25233j000j538j988k117j561m82J93p1o97r58r56j013q84l16J97P7m05
$$ 225233 224233 222695 220707 218590 217029 216547 216740 216669 215972 215014 214058 213045 212161 211845 212042 212119 211714
54315B11714n26j12M22O24K22o90j382j062n6L37l50j051q19k12j88n33m08J83
$$ 211714 211188 211076 211498 212122 212344 211654 210272 209210 209154 209491 209141 208090 207271 207059 206871 206338 205930 206113
54297B06113N78N95N74N69M20K75L32K92j71o80o12J7P02J188J503J489R73J81
$$ 206113 206691 207286 207860 208429 208849 209124 209456 209748 209577 208897 208285 208302 209004 210192 211695 213184 214157 214338
54279B14338m44p06o72m73l09k64n5N29R20L76o45p14N71J921K159J620J141P77
$$ 214338 213894 213188 212516 212043 211734 211470 211415 211944 212864 213240 212595 211881 212452 214373 216532 218152 219293 220070
54261B20070L71L34Q17R92J98r10j271q19j13O12J121Q17k34p68pR17O11l35l64
$$ 220070 220441 220775 221592 222584 222782 221872 220601 219782 219669 220281 221402 222219 221985 221217 221210 222127 222738 222403 222039
54242B22039L91K55j221k476k233j111l60j46J50O53P95J72q48j380q69K69J046
$$ 222039 222430 222685 221464 218988 216755 215644 215284 215138 215288 215941 216736 216908 216060 214680 213811 214080 215126
54225B15126R94N85M06M24L66K13m7n89j296j608j315q91p22n98m20n74j140j485
$$ 215126 216120 216705 217111 217535 217901 218114 218067 217478 216182 214574 213259 212368 211646 211048 210628 210054 208914 207429
54207B07429j188o94m43k09J92M27M81R32J764K002J322P96J017Q51o17k140j944
$$ 207429 206241 205547 205104 204895 205087 205514 205995 206927 208691 210693 212015 212811 213828 214679 214062 211922 209978
54190B09978m41M88K44j17Q6M58N92M56j39j190j908j641j024j032j339r84j65
$$ 209978 209537 210025 210269 210152 210238 210696 211288 211744 211605 210415 208507 206866 205842 204810 203471 202487 202322
54173B02322P0l54n21j52J73K71M71O74N58M69Q25R74Q1j127j124J19J202J463
$$ 202322 202392 202038 201517 201365 201538 201809 202280 202954 203512 203981 204806 205780 205861 204734 203610 203729 204931 206394
54155B06394J473J432Q93J69K30R31J024K50k53N8L76K99N60J333J567Q41M23
$$ 206394 207867 209299 210192 210361 210591 211522 212546 212796 212543 212601 212977 213276 213836 215169 216736 217577 218000
54138B18000J317K535K510J316K96K26P98J419J615J051q5r17o30P23K329L211
$$ 218000 219317 221852 224362 225678 225974 226200 226998 228417 230032 231083 230998 230081 229451 230174 232503 235714
54122B35714K809J433K16K1M72O12K96J40L30M85N72Q92J198R33L89M49J086J307
$$ 235714 238523 239956 240172 240193 240665 241277 241573 241713 242043 242528 243100 243992 245190 246123 246512 246961 248047 249354
54104B49354Q17M70Q00J303J540J732J830J224j0p30k14R00J811K727M165N994
$$ 249354 250171 250641 251441 252744 254284 256016 257846 259070 259060 258330 258116 259016 260827 263554 267719 273713
54088B73713P863R907J2301J4793J7123J9367K1393K2476K1821J8979J3669O042
$$ 273713 281576 291483 303784 318577 335700 355067 376460 398936 420757 439736 453405 459447
54076D59447k633j0432j6230k0052k1998k1844j9955j7418j4883j2166r356p172
$$ 459447 456814 446382 430152 410100 388102 366258 346303 328885 314002 301836 292480 285308
54064B85308n852m753l586k937l019l002k282j348p84l19L33P52O76O64J054J226
$$ 285308 279456 274703 271117 268180 265161 262159 259877 258529 257745 257426 257759 258511 259187 259851 260905 262131
54048B62131P99O58J717L395M399M531M685N400O351P061P382P489P884R120J1012
$$ 262131 262930 263588 265305 268700 273099 277630 282315 287715 294066 301127 308509 315998 323882 333002 344014
54033C44014J2533J2946J2597J2157J1639J0594Q793O248L072k05k706m072m775
$$ 344014 356547 369493 382090 394247 405886 416480 425273 431521 434593 434388 431682 427610 422835
54020D22835n322n670n742n807n974n980n857o064o598o849o703o867p508p622
$$ 422835 417513 411843 406101 400294 394320 388340 382483 376419 369821 362972 356269 349402 341894 334272
54006C34272o449m720l660l503l776m278m922n219m792l920k995k001j133j040
$$ 334272 327823 323103 319443 315940 312164 307886 302964 297745 292953 289033 286038 284037 282904 281864
53992B81864j797k332j775o79r4j97o44j477k618l196k549j287m30qL80L72m82
$$ 281864 280067 277735 275960 275281 275187 274990 274346 272869 270251 267055 264506 263219 262789 262781 263161 263533 263051
53975B63051j425j283l07K32Q7K68J127J617Q91m48j199r47j57M96N69R2l50l9
$$ 263051 261626 260343 260036 260268 260355 260623 261750 263367 264258 263810 262611 261664 261507 262003 262572 262664 262314 262275
53957B62275J166K680L662L576K602J676J685K379K669K297K318L395M541M633
$$ 262275 263441 266121 269783 273359 275961 277637 279322 281701 284370 286667 288985 292380 296921 301554
53943C01554M278M897O495P755Q192Q707R878J1112J1849J2510J3685J5245J6833
$$ 301554 305832 310729 317224 324979 333171 341878 351756 362868 374717 387227 400912 416157 432990
53930D32990J8618K1048K4164K7433K9921L0529K8424K3364J5557N593m975j3483
$$ 432990 451608 472656 496820 524253 554174 584703 613127 636491 652048 657641 652666 639183
53918F39183j7710j7730j5569j3067j0804q880p601o947o331n484m955n223n829
$$ 639183 621473 603743 588174 575107 564303 555423 547822 540875 534544 529060 524105 518882 513053
53905E13053n972n532n041m864m867m793m609m513m738n301n869o051n874n762
$$ 513053 507081 501549 496508 491644 486777 481984 477375 472862 468124 462823 456954 450903 445029 439267
53891D39267o071o785p616q145p977p176o544o930q066q579p461n321l768l718
$$ 439267 433196 426411 418795 410650 402673 395497 388953 382023 373957 365378 357917 352596 348828 345110
53877C45110m613n260n074m362l699l279k975k704k564k627k826l037l177l231
$$ 345110 340497 335237 330163 325801 322102 318823 315848 313144 310580 307953 305127 302090 298913 295682
53863B95682l290l478l675l437k495j224l18q0l39r68j893k683k675j812q52n49
$$ 295682 292392 288914 285239 281802 279307 278083 277765 277685 277346 276378 274485 271802 269127 267315 266463 265914
53847B65914r37j531j812j424m27N07P09M67P42J688K239J576L06m54n30n67r05
$$ 265914 264977 263446 261634 260210 259783 260290 260999 261466 262208 263896 266135 267711 268017 267563 267033 266466 265561
53830B65561j268j352j056m10K74M48O9r8N58J499J704J075M36L41N89R41J565
$$ 265561 264293 262941 261885 261475 261749 262197 262266 262168 262726 264225 265929 267004 267440 267781 268370 269311 270876
53813B70876K516L384L720L595L449L600L947M155M109M208N013O522P984Q623
$$ 270876 273392 276776 280496 284091 287540 291140 295087 299242 303351 307559 312572 319094 327078 335701
53799C35701Q328P532O649N846N117M383L596K816K035J023l25j560k118k089
$$ 335701 344029 351561 358210 364056 369173 373556 377152 379968 382003 383026 382701 381141 379023 376934
53785C76934k018j983j589r39p36j219j860k403l280m592n566n696n515n618n661
$$ 376934 374916 372933 371344 370405 369669 368450 366590 364187 360907 356315 350749 345053 339538 333920 328259
53770C28259n168m496m208m088l689l265l200l089k379j515j409k055k631k730
$$ 328259 323091 318595 314387 310299 306610 303345 300145 297056 294677 293162 291753 289698 287067 284337
53756B84337k575k228j539p46l01j81j32l78j230k152k165j206k27P1j26m08o61
$$ 284337 281762 279534 277995 277249 276948 276767 276635 276257 275027 272875 270710 269504 269277 269348 269222 268814 268153
53739B68153p67m78J86Q61J277J403J255R21O80P30R20J049J143J098N52m27j019
$$ 268153 267386 266908 267094 267955 269232 270635 271890 272811 273491 274221 275141 276190 277333 278431 278983 278556 277537
53722B77537o44K31R33J625K683L572L447K598K097K235K319K002J747J930K399
$$ 277537 276893 277124 278057 279682 282365 285937 289384 291982 294079 296314 298633 300635 302382 304312 306711
53707C06711L013L695L958L286K100J435J570J814J759J773K029K070J690J445
$$ 306711 309724 313419 317377 320663 322763 324198 325768 327582 329341 331114 333143 335213 336903 338348
53693C38348J754K224K297K040J848J842J902J967J964J747J321Q77N12J88j8
$$ 338348 340102 342326 344623 346663 348511 350353 352255 354222 356186 357933 359254 360131 360643 360831 360813
53678C60813K6K36M13N62P51P75M19q0k60r1M1r2l98p35r78r68p73p13p77m54
$$ 360813 360839 361075 361488 362050 362801 363576 363995 363915 363655 363564 363605 363513 363115 362380 361402 360434 359661 358948 358171 357717
53658C57717L85R46M78o86j713k407k876k677j319N69J721J678R60O6p17q65j51
$$ 357717 358102 359048 359526 358840 357127 354720 351844 349167 347848 348417 350138 351816 352776 352842 352125 351260 351109
53641C51109O21M93j95l76nJ01o9L09J219J663J479J688K588L033K242J047N16
$$ 351109 351730 352223 352028 351652 351647 351748 351679 351988 353207 354870 356349 358037 360625 363658 365900 366947 367463
53624C67463O30J023J928L415M678N045M946N006M959M295L426L228L854M682
$$ 367463 368093 369116 371044 374459 379137 384182 389128 394134 399093 403388 406814 410042 413896 418578
53610D18578N158N133M734M368M492N023N415N476N577N866O003N921O068O475
$$ 418578 423736 428869 433603 437971 442463 447486 452901 458377 463954 469820 475823 481744 487812 494287
53596D94287O520O028N748O133O500O083N135M292L525K501J308P8j561l760n689
$$ 494287 500807 506835 512583 518716 525216 531299 536434 540726 544251 546752 548060 548138 546577 542817 537128
53581E37128o421o193n996o222o475o440o162n565m503l239k347k033k013j929
$$ 537128 530707 524514 518518 512296 505821 499381 493219 487654 483151 479912 477565 475532 473519 471590
53567D71590j622j201j034j457k120k110j062J78M63l11j258j555j076k52K63
$$ 471590 469968 468767 467733 466276 464156 462046 460984 461162 461625 461314 460056 458501 457425 457173 457436
53552D57436%q42j446j164q6J266K435L000K591J402L05K4M40J046J684K389K913
$$ 457436 457436 456594 455148 453984 453898 455164 457599 460599 463190 464592 464897 464921 465361 466407 468091 470480 473393
53535D73393L028L083L723N051O510P586Q281Q831R239R264Q881Q644R330J1015
$$ 473393 476421 479504 483227 488278 494788 502374 510655 519486 528725 537989 546870 555514 564844 575859
53521E75859J2778J3692J3888J4206J4930J5521J5589J5419J5455J5882J6788
$$ 575859 588637 602329 616217 630423 645353 660874 676463 691882 707337 723219 740007
53510G40007J8126J9435K0222K0703K1504K2595K3297K3472K3806K4643K5380
$$ 740007 758133 777568 797790 818493 839997 862592 885889 909361 933167 957810 983190
53499I83190K5468K5194K5022K4947K4864K4885K4840K4284K3414K3157K3775
$$ 983190 1008658 1033852 1058874 1083821 1108685 1133570 1158410 1182694 1206108 1229265 1253040
53488A253040K4231K3598K2360K1525K1194K0759K0046J9347J8770J8250J7910
$$ 1253040 1277271 1300869 1323229 1344754 1365948 1386707 1406753 1426100 1444870 1463120 1481030
53477A481030J7837J7796J7622J7432J7078J6049J4353J2763J1537R815P069M239
$$ 1481030 1498867 1516663 1534285 1551717 1568795 1584844 1599197 1611960 1623497 1633312 1640381 1644620
53465A644620K376Q74j700n432r029j1715j3846j5673j6727j6781j6511j6720
$$ 1644620 1646996 1647870 1646170 1640738 1631709 1619994 1606148 1590475 1573748 1556967 1540456 1523736
53453A523736j7533j8606j9659k0578k1387k2229k3124k3792k3965k3737k3315
$$ 1523736 1506203 1487597 1467938 1447360 1425973 1403744 1380620 1356828 1332863 1309126 1285811
53442A285811k2748k2142k1789k1602k0898j9255j7222j5523j3975j1941r492
$$ 1285811 1263063 1240921 1219132 1197530 1176632 1157377 1140155 1124632 1110657 1098716 1089224
53431A089224p290n507l743j958o06K21J060K287L719N144O706Q492J0242J1688
$$ 1089224 1081934 1076427 1072684 1070726 1070120 1070341 1071401 1073688 1077407 1082551 1089257 1097749 1107991 1119679
53417A119679J2828J3764J4556J5384J6506J7981J9597K1136K2551K3919K5396
$$ 1119679 1132507 1146271 1160827 1176211 1192717 1210698 1230295 1251431 1273982 1297901 1323297
53406A323297K7118K9059L1134L3461L6150L8721M0331M1010M2136M4993M9144
$$ 1323297 1350415 1379474 1410608 1444069 1480219 1518940 1559271 1600281 1642417 1687410 1736554
53395A736554N2890N5167N6297N7041N7670N8222N8994O0271O1814O2958O3245
$$ 1736554 1789444 1844611 1900908 1957949 2015619 2073841 2132835 2193106 2254920 2317878 2381123
53384B381123O2728O1668O0097N7911N5393N3208N1608M9958M7491M4355M1284
$$ 2381123 2443851 2505519 2565616 2623527 2678920 2732128 2783736 2833694 2881185 2925540 2966824
53373B966824L8457L5390L1896K8366K4884K0965J6350J1262N561j512j0277j9990
$$ 2966824 3005281 3040671 3072567 3100933 3125817 3146782 3163132 3174394 3179955 3178443 3168166 3148176
53361C148176k9614l8504m6026n1483n4999n7585n9760o0937o0825o0414o0712
$$ 3148176 3118562 3080058 3034032 2982549 2927550 2869965 2810205 2749268 2688443 2628029 2567317
53350B567317o1296o1138o0056n8454n6375n3886n1800n0887n0808n0812n0888
$$ 2567317 2506021 2444883 2384827 2326373 2269998 2216112 2164312 2113425 2062617 2011805 1960917
53339A960917n1155n0802m8938m6108m3563m1319l8321l4461l1013k8845k7417
$$ 1960917 1909762 1858960 1810022 1763914 1720351 1679032 1640711 1606250 1575237 1546392 1518975
53328A518975k5789k3678k1205j8594j6336j4981j4508j4469j4692j5213j5623
$$ 1518975 1493186 1469508 1448303 1429709 1413373 1398392 1383884 1369415 1354723 1339510 1323887
53317A323887j5296j4226j2912j1543j0035q726q102p861p133n648l871j981L20
$$ 1323887 1308591 1294365 1281453 1269910 1259875 1251149 1243047 1235186 1228053 1222405 1218534 1216553 1216873
53304A216873K889M942O008O430O798P545R061J1420J4006J6080J7791J9824K2162
$$ 1216873 1219762 1224704 1230712 1237142 1243940 1251485 1260546 1271966 1285972 1302052 1319843 1339667 1361829
53291A361829K4037K5125K5936K6919K7953K8851K9554K9752K9067K7699K6220
$$ 1361829 1385866 1410991 1436927 1463846 1491799 1520650 1550204 1579956 1609023 1636722 1662942
53280A662942K4774K3230K1913K1282K0894J9743J7671J5357J2901R672N732K202
$$ 1662942 1687716 1710946 1732859 1754141 1775035 1794778 1812449 1827806 1840707 1850379 1856111 1858313
53268A858313l72k819n933r266j2093j4781j8254k2587k6869l0210l2428l3898
$$ 1858313 1857941 1855122 1849189 1839923 1827830 1813049 1794795 1772208 1745339 1715129 1682701 1648803
53256A648803l5097l6107l6589l6437l6260l6593l6811l5727l3233l0571k8824
$$ 1648803 1613706 1577599 1541010 1504573 1468313 1431720 1394909 1359182 1325949 1295378 1266554
53245A266554k8021k7814k8094k8584k8774k8654k8794k9417l0027l0172k9790
$$ 1266554 1238533 1210719 1182625 1154041 1125267 1096613 1067819 1038402 1008375 978203 948413
53234I48413k8703k6701k4318k2487k1185j9472j7199j5413j4572j3646j1782
$$ 948413 919710 893009 868691 846204 825019 805547 788348 772935 758363 744717 732935
53223G32935r699q426p753p072o866q011j0110j1797j2417j2345j2020j1685j1843
$$ 732935 723236 714810 707057 699985 693119 685108 674998 663201 650784 638439 626419 614734 602891
53210F02891j2813j3824j3556j1804r800q757q652q640q051o894n785n495o128
$$ 602891 590078 576254 562698 550894 541094 532337 523685 515045 506994 500100 494315 488820 482692
53197D82692o817o605n627m985n404o445p109o857n915m895m314m308m617m865
$$ 482692 475875 469270 463643 458658 453254 446809 439700 432843 426928 422033 417719 413411 408794 403929
53183D03929m825m531m191m022m007l847l278k432j753j561j845k357k675k401
$$ 403929 399104 394573 390382 386360 382353 378506 375228 372796 371043 369482 367637 365280 362605 360204
53169C60204j643j141j439k113k353k142k151k462k358j611j065j461k332k670
$$ 360204 358561 357420 355981 353868 351515 349373 347222 344760 342402 340791 339726 338265 335933 333263
53155C33263k201j431p91l60j72k78n88r52j302j549j513j173p54m52k63j97k79
$$ 333263 331062 329631 328840 328480 328308 328030 327442 326490 325188 323639 322126 320953 320199 319747 319484 319287 319008
53138C19008k84J93J177K203K839L006K726K061J356J053J071R43O36O23J006
$$ 319008 318724 318917 320094 322297 325136 328142 330868 332929 334285 335338 336409 337352 337988 338611 339617
53123C39617J236R84N80L07n1n67q15p05q62j541j919j295l63l37j175j719j435
$$ 339617 340853 341837 342417 342724 342673 342106 341291 340586 339724 338183 336264 334969 334606 334269 333094 331375 329940
53106C29940j025j247j952k526k620k181j282k78K76J53k13j88L91J064J283R44
$$ 329940 328915 327668 325716 323190 320570 318389 317107 316829 317105 317258 317045 316857 317248 318312 319595 320539
53090C20539L93J1q9R3N77J138J233O40mJ38R32J385R72K33j54k71n70j130j700
$$ 320539 320932 320943 320854 320947 321524 322662 323895 324535 324531 324669 325601 326986 327958 328191 328037 327766 327196 326066 324366
53071C24366k050j992j449q28q47j641k445k548k127j718j345p16LK87ml92l34
$$ 324366 322316 320324 318875 318047 317200 315559 313114 310566 308439 306721 305376 304660 304663 304950 304946 304554 304220
53054C04220L12J261J930J745O43o81j254o41P12J804J831P86n46j361j503j262
$$ 304220 304532 305793 307723 309468 310111 309430 308176 307535 308247 310051 311882 312668 312122 310761 309258 307996
53038C07996p18J98J214J771J673J169M52l78r30p88k58j07m43n48o0M27L61Q2
$$ 307996 307278 307476 308690 310461 312134 313303 313755 313377 312447 311659 311401 311294 310851 310303 310243 310670 311031 311113
53020C11113K17P77J324J638J737J610J312J024P78M40J21J95P10J267J518J370
$$ 311113 311330 312107 313431 315069 316806 318416 319728 320752 321530 321970 322091 322286 322996 324263 325781 327151
53004C27151O82n20j455j133K42J222R17j1n32n33l61PN84Q18L13l20j15J030
$$ 327151 327833 327313 325858 324725 324967 326189 327106 327095 326563 326030 325669 325676 326260 327078 327391 327071 326956 327986
52986C27986K329L021K933K396K008K166K640K925L020L229L279K549J326O48
$$ 327986 330315 333336 336269 338665 340673 342839 345479 348404 351424 354653 357932 360481 361807 362455
52972C62455O58L28o47j095l29M94N7j179j959k159k384k482j919j097q57j081
$$ 362455 363113 363441 362794 361699 361370 361864 361921 360742 358783 356624 354240 351758 349839 348742 347885 346804
52956C46804j065q92j126j508j325q17q73j441j539q64j60P4J27J98O4k26k12
$$ 346804 345739 344847 343721 342213 340888 340071 339198 337757 336218 335354 335194 335268 335395 335593 335657 335431 335219
52939C35219K05O43Q59Q17K76q60j896j989j274n20P7P19R53J40j096j264j11
$$ 335219 335424 336067 336926 337743 338019 337159 335263 333274 332000 331480 331557 332276 333229 333369 332273 331009 330898
52922C30898R68R29K66j92m41o72n31J28N85J41q83j655j883j787j432o98K43
$$ 330898 331866 332795 333061 332869 332428 331756 331225 331353 331938 332079 331196 329541 327658 325871 324439 323741 323984
52905C23984R30J024O39L10N60J276J678J249M44K7%j13k68n2L03J21n27q27n53
$$ 323984 324914 325938 326577 326887 327447 328723 330401 331650 332094 332121 332121 332008 331740 331688 331991 332112 331585 330758 330205
52886C30205l79o12o42j40K00k10q23p83j91K64M33O98J078J132O78P8k51k27
$$ 330205 329826 329214 328572 328432 328632 328422 327599 326816 326625 326889 327322 328020 329098 330230 330908 330986 330735 330508
52868C30508PL23O26Q75J040J081R67Q01Q17J219J931K452K069N41j393k618k910
$$ 330508 330515 330838 331464 332339 333379 334460 335427 336228 337045 338264 340195 342647 344716 345257 343864 341246 338336
52851C38336l113l764m200l590k292j374j131j026q30q72j118r69j88O22Q19M75
$$ 338336 335223 331459 327259 323669 321377 320003 318872 317846 317016 316144 315026 314057 313869 314491 315310 315785
52835C15785J76L48Q99J242P62m04j303j256o25oP83K143L538M076M009M449N555
$$ 315785 315961 316309 317208 318450 319212 318808 317505 316249 315624 315618 316401 318544 322082 326158 330167 334616 340171
52818C40171O113N196L205R52j296l427n056o028o647o962o500n135l603k657
$$ 340171 346284 351480 354685 355637 354341 350914 345858 339830 333183 326221 319721 314586 310983 308326
52804C08326k248j932j546j067l60N48J245J390J041M10l18q04p72n41p44j327
$$ 308326 306078 304146 302600 301533 301173 301721 302966 304356 305397 305807 305489 304685 303913 303372 302628 301301
52788C01301j470p93R1N37P12R93J193R94O64P28J178J516J321M64r55k440l139
$$ 301301 299831 299038 299129 299666 300378 301371 302564 303558 304222 304950 306128 307644 308965 309429 308474 306034 302895
52771C02895k565j200o0L13K18K58O40J086J285J361J664K042J794O69m80o44
$$ 302895 300330 299130 299070 299383 299601 299859 300499 301585 302870 304231 305895 307937 309731 310400 309920 309276
52755C09276M0N79N68N48R39J425J500J062K38p13j253q68K37J254J668J597J302
$$ 309276 309316 309895 310463 311011 311950 313375 314875 315937 316175 315462 314209 313341 313578 314832 316500 318097 319399
52738C19399R27P96J235K017K558K714K777K658J807J42j638k829l245k892j868
$$ 319399 320326 321122 322357 324374 326932 329646 332423 335081 336888 337030 335392 332563 329318 326426 324558
52723C24558p27k57n69r96j012p16l41K5J28l06r92j250q97l93q4Pk19o80o26
$$ 324558 323831 323574 323005 322009 320997 320281 319940 319965 320093 319787 318795 317545 316648 316255 316171 316178 315959 315279 314653
52704C14653N77K190K698J860R37Q34J167J455J825K145J725N94j37Q8M13L3n05
$$ 314653 315230 317420 320118 321978 322915 323749 324916 326371 328196 330341 332066 332660 332523 332611 333024 333057 332552
52687C32552l68J53K73o4l98n80o38m83l02n15q54m17P82J426P79j70l67k83p64
$$ 332552 332184 332337 332610 332546 332148 331568 330930 330447 330145 329630 328776 328359 329141 330567 331346 331176 330809 330526 329762
52668C29762j291q58K38Q68Q22Q02J106J488J995K785L394L199K362J386J98j358
$$ 329762 328471 327613 327851 328719 329541 330343 331449 332937 334932 337717 341111 344310 346672 348058 348256 346898
52652C46898k601k731k138j861j971j710r25k21K66R96J872K099J506J020J470
$$ 346898 344297 341566 339428 337567 335596 333886 332961 332740 333006 334002 335874 337973 339479 340499 341969
52637C41969K581L401L272K201P59l58r08j171j287j016m89n10j399k239k091
$$ 341969 344550 347951 351223 353424 354183 353825 352917 351746 350459 349443 348954 348444 347045 344806 342715
52622C42715j398j218j551j500p94p2K31K08q6n99q00k46M96N13OnO13Q75L14
$$ 342715 341317 340099 338548 337048 336254 336182 336413 336621 336535 335936 335136 334890 335386 335899 335905 335900 336513 337388 337702
52603C37702l02k21K31L23o5m98n56j15N80R94Q79O54Q03J090J025P54P78J010
$$ 337702 337400 337179 337410 337733 337668 337170 336614 336499 337079 338073 338952 339606 340409 341499 342524 343278 344056 345066
52585C45066R23M93J08k54q23j169o13N02J051P36L97N44O84L89j6k38n57j084
$$ 345066 345989 346482 346590 346336 345513 344344 343731 344233 345284 346020 346417 346961 347645 348034 348018 347780 347223 346139
52567C46139j354j155r98j236j461j214p19l64j36M4j6k65j89L74P75M50k09n09
$$ 346139 344785 343630 342632 341396 339935 338721 338002 337638 337502 337546 337530 337265 337076 337450 338225 338675 338466 337957
52549C37957n19q11j403j663j211m30N9N6j18j9N20J213J599J441R13M74N36J092
$$ 337957 337438 336627 335224 333561 332350 331920 331979 332035 331917 331898 332418 333631 335230 336671 337584 338058 338594 339686
52531C39686J593J425O96J69K61N81P31R57J491J853J604J182J141J087M83Q5
$$ 339686 341279 342704 343400 343569 343830 344411 345142 346099 347590 349443 351047 352229 353370 354457 354940 355025
52515C55025J075K891L501K199O23L51P73L13j239k719l294l150k798k578k667
$$ 355025 356100 358991 362492 364691 365314 365665 366438 366751 365512 362793 359499 356349 353551 350973 348306
52500C48306k915k798j951o46N77J476J975J895J307P77P50R27P52L40L22P97
$$ 348306 345391 342593 340642 339996 340573 342049 344024 345919 347226 348003 348753 349680 350432 350772 351094 351891
52484C51891J069O19n2M1J136K338K655K168J793J908J842J027M4j56L41N89K10
$$ 351891 352960 353579 353527 353568 354704 357042 359697 361865 363658 365566 367408 368435 368479 368323 368664 369253 369463
52467C69463k57m64p54j325j718j602j385j580k044k333k429k574k710k527j946
$$ 369463 369206 368742 367988 366663 364945 363343 361958 360378 358334 356001 353572 350998 348288 345761 343815
52452C43815j210n85k03j03k52n51q74j033q34m29l72r66j666j592o39M37R03
$$ 343815 342605 342020 341817 341714 341462 340911 340037 339004 338170 337741 337369 336403 334737 333145 332506 332943 333846
52435C33846O29j07p76p26J13P49J44j213j672n68R12J358Q03K80M28J156K090
$$ 333846 334475 334368 333592 332866 332979 333728 333872 332659 330987 330419 331331 332689 333492 333772 334200 335356 337446
52418C37446K766K887K815L433N058O964Q387R469J0751J2186J3233J3422J2393
$$ 337446 340212 343099 345914 349347 354405 361369 369756 379225 389976 402162 415395 428817 441210
52405D41210R785N780J374k488n796q871j1242j1878j0532q285o561n924n907
$$ 441210 450995 456775 458149 455661 449865 440994 429752 417874 407342 399057 392496 386572 380665
52392C80665n706m950l842k658j317K56J560J911J448J069J176J200P67N33J198
$$ 380665 374959 370009 366167 363509 362192 362448 364008 365919 367367 368436 369612 370812 371579 372112 373310
52377C73310K290K770K524K382K793L196K855J757N43j58j86J34L67L96L88M14
$$ 373310 375600 378370 380894 383276 386069 389265 392120 393877 394420 394262 394076 394210 394577 394973 395361 395775
52361C95775M59P47J552K466K573J679P96Q42J437J602J164P29O18O92R67J542
$$ 395775 396234 396981 398533 400999 403572 405251 406047 406889 408326 409928 411092 411821 412439 413131 414098 415640
52345D15640J991J722J013Q66J616K471K742K786L291M127M583M392M012M005
$$ 415640 417631 419353 420366 421232 422848 425319 428061 430847 434138 438265 442848 447240 451252 455257
52331D55257M542N526O709P677P952P414O507N944O103O791P519Q031Q463R043
$$ 455257 459799 465325 472034 479711 487663 495077 501584 507528 513631 520422 527941 535972 544435 553478
52317E53478R743J0338J0751J1226J2034J3093J4010J4589J5121J6009J7154J8047
$$ 553478 563221 573559 584310 595536 607570 620663 634673 649262 664383 680392 697546 715593
52305G15593J8512J8896J9383J9492J8727J7377J6206J5494J4899J4176J3405
$$ 715593 734105 753001 772384 791876 810603 827980 844186 859680 874579 888755 902160
52294I02160J2508J1155R390P841P057O904O832O459N739M831L901K919J752N95
$$ 902160 914668 925823 935213 943054 950111 957015 963847 970306 976045 980876 984777 987696 989448 990043
52280I90043M7L44P51M23m16q62p89r11j392j504r95p16j243j855j612o72L02
$$ 990043 990090 990434 991185 991608 991192 990330 989541 988630 987238 985734 984739 984023 982780 980925 979313 978641 978943
52263I78943J405L160N352P151Q243R028R874J0819J1874J2862J3143J2210J0588
$$ 978943 980348 983508 988860 996011 1004254 1013282 1023156 1033975 1045849 1058711 1071854 1084064 1094652
52250A094652R515R674J0670J1695J2193J1914J0918R658Q690Q191P951P735P332
$$ 1094652 1104167 1113841 1124511 1136206 1148399 1160313 1171231 1180889 1189579 1197770 1205721 1213456 1220788
52237A220788O490N192L901L067K543J845Q48k39j370k589l600m030m132m610
$$ 1220788 1227278 1232470 1236371 1239438 1241981 1243826 1244674 1244435 1243065 1240476 1236876 1232846 1228714 1224104
52223A224104n632o584o955o961o993o885o100m548k922k220k856m196n003m488
$$ 1224104 1218472 1211888 1204933 1197972 1190979 1184094 1177994 1173446 1170524 1168304 1165448 1161252 1156249 1151761
52209A151761k927j179J97J204K102L175M561N990O764O451N482M686M350M154
$$ 1151761 1148834 1147655 1147852 1149056 1151158 1154333 1158894 1164884 1171648 1178099 1183581 1188267 1192617 1196771
52195A196771L864L589L237K399J026k68q87r59j005j133j027o64n99j351k669
$$ 1196771 1200635 1204224 1207461 1209860 1210886 1210618 1209731 1208772 1207767 1206634 1205607 1204943 1204344 1202993 1200324
52180A200324l704l890l457l049l007l230l523l752l692l182k471k142k412k810
$$ 1200324 1196620 1192730 1189273 1186224 1183217 1179987 1176464 1172712 1169020 1165838 1163367 1161225 1158813 1156003
52166A156003k742k183j601j390j517j671j554j160p80o00l52L16J199J726J793
$$ 1156003 1153261 1151078 1149477 1148087 1146570 1144899 1143345 1142185 1141405 1140805 1140453 1140769 1141968 1143694 1145487
52151A145487J855J999J652N52o52j322j817k817m056m539l898k753j748r07j00
$$ 1145487 1147342 1149341 1150993 1151545 1150893 1149571 1147754 1144937 1140881 1136342 1132444 1129691 1127943 1127036 1126936
52136A126936N46R33J291J867K637L491M486N640O648P029O617N876N560N947
$$ 1126936 1127482 1128415 1129706 1131573 1134210 1137701 1142187 1147827 1154475 1161504 1168121 1173997 1179557 1185504
52122A185504O472O439O012O134P260Q726R688J0243J1097J2487J4070J5678J7516
$$ 1185504 1191976 1198415 1204427 1210561 1217821 1226547 1236235 1246478 1257575 1270062 1284132 1299810 1317326
52109A317326J9487K0962K1433K0993K0010J8624J6822J4826J3225J2593J2990
$$ 1317326 1336813 1357775 1379208 1400201 1420211 1438835 1455657 1470483 1483708 1496301 1509291
52098A509291J3786J4145J3686J2577J1054R210P374O191N902N861N141L493J402
$$ 1509291 1523077 1537222 1550908 1563485 1574539 1583749 1591123 1597314 1603216 1609077 1614218 1617711 1619113
52085A619113n84k234l537m688o049p816r684j1041j1435j0771r345p857o935
$$ 1619113 1618529 1616295 1612758 1608070 1602021 1594205 1584521 1573480 1562045 1551274 1541929 1534072 1527137
52072A527137o394n336l370j286K8Q49K076L733M924N198N191N629O412O976P131
$$ 1527137 1520743 1515407 1512037 1510751 1510779 1511628 1513704 1517437 1522361 1527559 1532750 1538379 1544791 1551767 1558898
52057A558898P143P252P394P361P104O926P264Q151R041R335Q976Q335P723P230
$$ 1558898 1566041 1573293 1580687 1588048 1595152 1602078 1609342 1617493 1626534 1635869 1644845 1653180 1660903 1668133
52043A668133O816O221N064L376J798Q38J16j133k987m722n791o446p269q361
$$ 1668133 1674949 1681170 1686234 1689610 1691408 1692246 1692362 1691229 1688242 1683520 1677729 1671283 1664014 1655653
52029A655653r120q801p460o201o115o821o804n373l661l088l631m420n400p219
$$ 1655653 1646533 1637732 1630272 1624071 1617956 1611135 1604331 1598958 1595297 1592209 1588578 1584158 1578758 1571539
52015A571539r803j2258j4225j6202j8397k0213k1121k1232k0714j9518j8005
$$ 1571539 1561736 1549478 1535253 1519051 1500654 1480441 1459320 1438088 1417374 1397856 1379851
52004A379851j7055j7085j7594j8071j8809k0262k2156k3724k4570k4842k4815
$$ 1379851 1362796 1345711 1328117 1310046 1291237 1270975 1248819 1225095 1200525 1175683 1150868
51993A150868k4711k4730k4995k5490k6135k6788k7147k6885k5931k4402k2359
$$ 1150868 1126157 1101427 1076432 1050942 1024807 998019 970872 943987 918056 893654 871295
51982H71295j9927j7487j5371j3396j1186q803o602m631k834j737k002l230m118
$$ 871295 851368 833881 818510 805114 793928 785125 778523 773892 771058 769321 767319 764089 759971
51969G59971m178m451n919p979r116q760p704o984o920p101o883n875m251k619
$$ 759971 755793 751342 745423 737444 728328 719568 711864 704880 697960 690859 683976 678101 673850 671231
51955F71231j362k85J049K772M606O074O756O649O360O585P264P643P285O571
$$ 671231 669869 669584 670633 673405 678011 684085 690841 697490 703850 710435 717699 725342 732627 739198
51941G39198N934N177M004K833K361K483K231Q99j195l254m971o593q159r144
$$ 739198 745132 750309 754313 757146 759507 761990 764221 765120 763925 760671 755700 749107 740948 731804
51927G31804r081q284p499o825n442k694J008M770Q340J2103J6134J9910K3039
$$ 731804 722723 714439 706940 700115 694673 691979 692987 697757 706097 718200 734334 754244 777283
51914G77283K5716K8363L1074L3472L4716L3701K9604K2343J2348J96j3039k5383
$$ 777283 802999 831362 862436 895908 930624 964325 993929 1016272 1028620 1028816 1015777 990394
51902I90394l4776m0409m2837m2834m0848l7440l3385k9011k4144j8985j4325
$$ 990394 955618 915209 872372 829538 788690 751250 717865 688854 664710 645725 631400
51891F31400j0549p146l636l65K115L967N722P378Q355Q183O843M644K063m98
$$ 631400 620851 613705 610069 609704 611819 615786 621508 628886 637241 645424 652267 656911 658974 658476
51877F58476k994n515p717q892q794p899o658n044l173j744j267j336j170o20
$$ 658476 655482 649967 642250 633358 624564 616665 610007 604963 601790 600046 598779 597443 596273 595653
51863E95653j53j46p64k114l990n733o922p931r149r971r427p736o293n859n615
$$ 595653 595500 595354 594590 592476 588486 582753 575831 567900 558751 548780 539353 531617 525324 519465 513850
51848E13850m454k562j037l82r0L17P00R02J319K314L437L832L294K412J655R92
$$ 513850 509396 506834 505797 505415 505325 505642 506342 507244 508563 510877 514314 518146 521440 523852 525507 526499
51832E26499M74M72R66J257R85Q46J599K792L310K847J946P78r61k919l996l784
$$ 526499 526973 527445 528411 529668 530653 531499 533098 535890 539200 542047 543993 544771 543810 540891 536895 533111
51816E33111l184l082l243l013k392j733j003q2O65Q36P13Q61J203J154O08K00
$$ 533111 529927 526845 523602 520589 518197 516464 515461 515379 516044 516880 517593 518454 519657 520811 521419 521619
51800E21619M31J016J252Q32R1m79q10j249j983k699l029l095l229l281k712j390
$$ 521619 522050 523066 524318 525150 525241 524762 523952 522703 520720 518021 514992 511897 508668 505387 502675 501285
51784E01285K08J673L064M531N953P116P820P787O842N239L370J238j222l363
$$ 501285 501493 503166 506230 510761 516714 523830 531650 539437 546279 551518 554888 556126 554904 551541
51770E51541m229l877l465l700l940l338k094j100q04r75j190j086m79M26J212
$$ 551541 547312 543435 539970 536270 532330 528992 526898 525798 524994 524019 522829 521743 521264 521690 522902
51755E22902J792K300K476J906R81P19J294J700J314Q38J014J475J720K254L604
$$ 522902 524694 526994 529470 531376 532357 533076 534370 536070 537384 538222 539236 540711 542431 544685 548289
51740E48289M994N262M618M135L898K985J240k26n22J54J310K908M882O585P189
$$ 548289 553283 558545 563163 567298 571196 574181 575421 575195 574673 574827 576137 579045 583927 590512 597701
51725E97701O320M187J480q37k068k181j490j61J470K517K317J483J449K716M203
$$ 597701 604021 608208 609688 608851 606783 604602 603112 602951 604421 606938 609255 610738 612187 614903 619106
51710F19106M444K961L25k539m820n997n963m928l177r86J343L464M852M702K385
$$ 619106 623550 626511 626836 624297 619477 613480 607517 602589 599412 598426 599769 603233 608085 612787 615172
51695F15172j611n692q543j0088j0781j0588r437q103p517p429o791n458m465
$$ 615172 613561 607869 599326 589238 578457 567869 558432 550329 542812 535383 528592 523134 518669
51682E18669m407m591m136l110k006q05Q30K860M939O970R153J1585J4050J6116
$$ 518669 514262 509671 505535 502425 500419 499614 500444 503304 508243 515213 524366 535951 550001 566117
51668E66117J7264J7053J5281J2031P613K643j987n505p709q864r221q806p569
$$ 566117 583381 600434 615715 627746 635359 638002 636015 630510 622801 613937 604716 595910 588341
51655E88341n565l080p13Q88J557J599J028n93l156n411o205n896n736o066o096
$$ 588341 582776 579696 578983 579871 581428 583027 584055 583462 580306 574895 568690 562794 557058 550992 544896
51640E44896n440m825m908n327n346m833m132l438k738k015j225l54L03L50o1
$$ 544896 539456 534631 529723 524396 519050 514217 510085 506647 503909 501894 500669 500315 500618 500968 500907
51625E00907l22l28p78j994l047k778j405k92j59k62L37J395J913J602J202J320
$$ 500907 500585 500257 499479 497485 494438 491660 490255 489963 489804 489542 489879 491274 493187 494789 495991 497311
51609D97311J652J657J539J912K864M004N433P774J0935J3557J4241J2888J0361
$$ 497311 498963 500620 502159 504071 506935 510939 516372 524146 535081 548638 562879 575767 586128
51596E86128P226L513m99l963o058o532n641l799j274J948N914J0259J4255J7434
$$ 586128 593354 596867 596368 592405 586347 579815 574174 570375 569101 571049 576963 587222 601477 618911
51582F18911J9778K1186K1305K0299J9206J8817J8553J6979J3297P874J722l813
$$ 618911 638689 659875 681180 701479 720685 739502 758055 775034 788331 796205 797927 794114
51570G94114p170p301m366P04P190J4592K1854K7409L0116K9745K6711K1845J6311
$$ 794114 786944 779643 775277 775981 783171 797763 819617 847026 877142 906887 933598 955443 971754
51557I71754J1041O167J376l371p950j2630j7736k2782k6676k8865k9764l0029
$$ 971754 982795 988962 990338 986967 979017 966387 948651 925869 899193 870328 840564 810535
51545H10535k9941k9459k8339k6218k3159k0016j7619j5789j3791j1598r890q859
$$ 810535 780594 751135 722796 696578 673419 653403 635784 619995 606204 594606 584716 575857
51533E75857p982p010o275n801n070l972l120k867k674k049j332j008p25K58J947
$$ 575857 567875 560865 554590 548789 543719 539747 536627 533760 531086 529037 527705 526697 525972 526230 528177
51518E28177L528M364M633M890N204M938L547J475j23p43j123j996k892k841j960
$$ 528177 531705 536069 540702 545592 550796 555734 559281 560756 560633 559890 558767 556771 553879 551038 549078
51503E49078j332j497j917j966j649j221r30j213k419m178n687o618p117p018
$$ 549078 547746 546249 544332 542366 540717 539496 538566 537353 534934 530756 525069 518451 511334 504316
51489E04316o030m633l861l990m329m389m299l952k948j636j094j516j786j191
$$ 504316 498286 493653 489792 485802 481473 477084 472785 468833 465885 464249 463155 461639 459853 458662
51475D58662m96n95j089j081n89k16n0J75L14O7k74k4J013K436L751M658N137
$$ 458662 458166 457571 456482 455401 454812 454596 454546 454721 455035 455102 454828 454804 455817 458253 462004 466662 471799
51458D71799N569O403P528Q501R502J1342J4197J7158J9379K0807K1218J9508
$$ 471799 477368 483771 491299 499800 509302 520644 534841 551999 571378 592185 613403 632911
51446F32911J4936Q546K560j335k672j884j87P40k72l214p455j2261j6490j8739
$$ 632911 647847 656393 658953 657618 654946 653062 652875 653615 653343 650129 642674 630413 613923 595184
51432E95184j8662j7456j6245j4715j2158r145o906n604m432l096k111j720j561
$$ 595184 576522 559066 542821 528106 515948 506803 499897 494293 489861 486765 484654 482934 481373
51419D81373j352r77r4J488L093L749L416K877K598K506K685L286L842L708L172
$$ 481373 480021 479044 478950 480438 483531 487280 490696 493573 496171 498677 501362 504648 508490 512198 515370
51404E15370L151L711L997L742L746M468N202N197M808M825N327N899O550P746
$$ 515370 518521 522232 526229 529971 533717 538185 543387 548584 553392 558217 563544 569443 575993 583739
51390E83739R769J2510J5769J9373K3089K6653K9891L2794L5564L8472M1359M3179
$$ 583739 593508 606018 621787 641160 664249 690902 720793 753587 789151 827623 868982 912161
51378I12161M2545L8814L2546K4824J6492Q066r3p804j5101k2010k8298l3448
$$ 912161 954706 993520 1026066 1050890 1067382 1075448 1075355 1067551 1052450 1030440 1002142 968694
51366I68694l6875l8347l8359l7880l7421l6470l4175l0495k6295k2431j9129
$$ 968694 931819 893472 855113 817233 779812 743342 709167 678672 652377 629946 610817
51355F10817j6284j3926j2189j1089j0380r586q238o311m336k917k291k451l356
$$ 610817 594533 580607 568418 557329 546949 537363 529125 522814 518478 515561 513270 510819 507463
51342E07463m659n515n290m349l659l614l739l535l154l020l210l411l309k862
$$ 507463 502804 497289 491999 487650 483991 480377 476638 473103 469949 466929 463719 460308 456999 454137
51328D54137k225j532p33J98R81J199R45Q81J443K323L044L618M204M582M526
$$ 454137 451912 450380 449647 449845 450826 452025 452970 453851 455294 457617 460661 464279 468483 473065 477591
51313D77591M471M988N818O079N429M357L267J917J6k125l877m948n575o183o870
$$ 477591 482062 487050 492868 498947 504376 508733 512000 513917 513933 511808 507931 502983 497408 491225 484355
51298D84355p152o446m962l732l365l166k134m60P63J189J622K698M018M902N248
$$ 484355 477203 470757 465795 462063 458698 455532 453398 452938 453701 454890 456512 459210 463228 468130 473378
51283D73378N258M881M015K863J677M87o14j241j093l22O96J702K530L051L383
$$ 473378 478636 483517 487532 490395 492072 492559 491945 490704 489611 489289 489985 491687 494217 497268 500651
51268E00651L779M082L707K462J034J91j71p25j663k520l020l444l955m130l545
$$ 500651 504430 508512 512219 514681 515715 515906 515735 515010 513347 510827 507807 504363 500408 496278 492733
51253D92733k500j633r08K96K024L270L113J952R74O51M01k60j039j485j684j870
$$ 492733 490233 488600 487692 487988 490012 493282 496395 498347 499321 499972 500373 500113 499074 497589 495905 494035
51237D94035j954j838j788j991k118j839j431j344j411j091l54K79N18O33R10
$$ 494035 492081 490243 488455 486464 484346 482507 481076 479732 478321 477230 476876 477155 477673 478306 479216
51222D79216J294J627J968K449L018L375L234K767K633L225M009M205M120M856
$$ 479216 480510 482137 484105 486554 489572 492947 496181 498948 501581 504806 508815 513020 517140 521996
51208E21996O402P161N980L716J822L17j498l164l518k801k559l318l886l369
$$ 521996 528398 535559 541539 545255 547077 547394 545896 542732 539214 536413 533854 530536 526650 523281
51194E23281k408j880j619j181p91o58k85O42J371J023j12j015j282j222j076
$$ 523281 520873 518993 517374 516193 515402 514744 514459 515101 516472 517495 517383 516368 515086 513864 512788
51179E12788q38o32n47k94L05P54M72j93j93R04K388L234L017J972O97j59k71
$$ 512788 511950 511318 510771 510477 510782 511536 512008 511815 511622 512526 514914 518148 521165 523137 523834 523675 523404
51162E23404N4J21m15j224j728j683j270p21o0P69J581J943J595P89M0m35q09
$$ 523404 523458 523579 523164 521940 520212 518529 517259 516538 516478 517247 518828 520771 522366 523155 523195 522760 521951
51145E21951j307j993k833l598l766k981j721j022j304j832j609n66M74Q20N81
$$ 521951 520644 518651 515818 512220 508454 505473 503752 502730 501426 499594 497985 497419 497893 498713 499294
51130D99294M13Q43J840K836L223K878K191J562J072O68M49O19J229K066K759
$$ 499294 499707 500550 502390 505226 508449 511327 513518 515080 516152 516820 517269 517888 519117 521183 523942
51115E23942K993K751K358K109J922J514R81Q57J432K222K319J324k16j319j470
$$ 523942 526935 529686 532044 534153 536075 537589 538570 539427 540859 543081 545400 546724 546508 545189 543719
51100E43719j042p78j042j632k234k723l034l092k976k788k315j239J02P73M47
$$ 543719 542677 541899 540857 539225 536991 534268 531234 528142 525166 522378 520063 518824 518926 519699 520146
51085E20146k9K67J103J555J301P67L63K86P91J861K756K746K173K005K489L065
$$ 520146 520117 520384 521487 523042 524343 525110 525473 525759 526550 528411 531167 533913 536086 538091 540580 543645
51069E43645L576M483N832O950P539Q177R381J0899J2235J3200J3589J3110J2021
$$ 543645 547221 551704 557536 564486 572025 580202 589583 600482 612717 625917 639506 652616 664637
51056F64637J1256J1456J2375J3467J4469J5051J4656J3167J1163R051O505L153
$$ 664637 675893 687349 699724 713191 727660 742711 757367 770534 781697 790748 797253 800406
51044H00406o80m409p846j0888j3000j3584j2673j0962r381q784r432j0592j1122
$$ 800406 799726 795317 787471 776583 763583 749999 737326 726364 716983 708199 698767 688175 677053
51031F77053j0713r990r210p757n301k605m85J234L032M646N622O336P481Q977
$$ 677053 666340 656350 647140 639383 634082 631477 630992 632226 635258 639904 645526 651862 659343 668320
51017F68320J0232J1202J2237J3162J3456J3277J3435J4258J5293J6115J6762
$$ 668320 678552 689754 701991 715153 728609 741886 755321 769579 784872 800987 817749
51006H17749J7233J7305J6967J6492J5856J4633J2660J0454Q696P528O520N134
$$ 817749 834982 852287 869254 885746 901602 916235 928895 939349 948045 955573 962093 967227
50994I67227L215J101p95k403l782m511l927k203m39P55K107M416P088Q926R939
$$ 967227 970442 971543 970748 968345 964563 960052 956125 953922 953483 954238 956345 960761 967849 976775 986714
50979I86714J1290J3554J6188J8811K1923K5939L0426L4742L8803M2732M6341
$$ 986714 998004 1011558 1027746 1046557 1068480 1094419 1124845 1159587 1198390 1241122 1287463
50968A287463M9461N2346N5247N7909N9788O0526N9922N7775N4143M9558M4628
$$ 1287463 1336924 1389270 1444517 1502426 1562214 1622740 1682662 1740437 1794580 1844138 1888766
50957A888766L9601L4463K9286K4240J9506J5427J2507J0932J0372J0497J1419
$$ 1888766 1928367 1962830 1992116 2016356 2035862 2051289 2063796 2074728 2085100 2095597 2107016
50946B107016J3061J4267J3216R046K730l921r778j4688j8698k1746k4094k6449
$$ 2107016 2120077 2134344 2147560 2156606 2159336 2155415 2145637 2130949 2112251 2090505 2066411 2039962
50934B039962k9262l2292l5161l8084m1608m5790n0025n3597n6002n6914n6333
$$ 2039962 2010700 1978408 1943247 1905163 1863555 1817765 1767740 1714143 1658141 1601227 1544894
50923A544894n4769n2866n0791m8337m5463m2322l8810l4753l0571k7060k4355
$$ 1544894 1490125 1437259 1386468 1338131 1292668 1250346 1211536 1176783 1146212 1119152 1094797
50912A094797k1775j8912j6206j4115j2411j0732r289q386p821p234o674o214
$$ 1094797 1073022 1054110 1037904 1023789 1011378 1000646 991357 982971 975150 967916 961242 955028
50900I55028n490m226k856k018j660j236n26K95J117J870K336K511K897L815M782
$$ 955028 949538 945312 942456 940438 938778 937542 937016 937311 938428 940298 942634 945145 948042 951857 956639
50885I56639N227N463O140O985P143O704O866Q267J0077J1107J1236J1268J1917
$$ 956639 961866 967329 973469 980454 987597 994301 1001167 1009434 1019511 1030618 1041854 1053122 1065039
50872A065039J3319J5190J7151J9040K1096K3612K6481K9493L3002L7701M3599
$$ 1065039 1078358 1093548 1110699 1129739 1150835 1174447 1200928 1230421 1263423 1301124 1344723
50861A344723M9865N5936O2222O9327P7005Q4415R1240R8011J05365J13203J20673
$$ 1344723 1394588 1450524 1512746 1582073 1659078 1743493 1834733 1932744 2038109 2151312 2271985
50850B271985J26824J31288J34291J36053J36274J34263J29430J21450J10237
$$ 2271985 2398809 2530097 2664388 2800441 2936715 3070978 3200408 3321858 3432095
50841C432095R6193Q0363O3924M7532L1444J6246K908p918j6202k2004k5044k5080
$$ 3432095 3528288 3608651 3672575 3720107 3751551 3767797 3770705 3762787 3746585 3724581 3699537 3674457
50829C674457k2335j7352j0707l170M100R733J2520J1552O403k572j4283k7578
$$ 3674457 3652122 3634770 3624063 3620893 3624993 3634726 3647246 3658798 3665201 3662629 3648346 3620768
50817C620768m1928n7242p3013q7878j00326j09823j17032j22731j26681j27830
$$ 3620768 3578840 3521598 3448585 3360707 3260381 3150558 3033526 2910795 2784114 2656284
50807B656284j25508j19983j11873j01688r0189p8556o7597n7099m6544l6157
$$ 2656284 2530776 2410793 2298920 2197232 2107043 2028487 1960890 1903791 1857247 1821090
50797A821090k6643j8147j0197k637M027R317J3220J5768J6816J6399J4923J2761
$$ 1821090 1794447 1776300 1766103 1763466 1767493 1776810 1790030 1805798 1822614 1839013 1853936 1866697
50785A866697R966O524K665j208m638p225r027j0768j3210j6247j9093k1440k3849
$$ 1866697 1876663 1883187 1885852 1884644 1880006 1872781 1863754 1852986 1839776 1823529 1804436 1782996 1759147
50772A759147k6838l0123l3069l5405l7152l8203l8457l8085l7227l5557l2557
$$ 1759147 1732309 1702186 1669117 1633712 1596560 1558357 1519900 1481815 1444588 1409031 1376474
50761A376474k8307k3659j9577j6329j3463j0422p126l889q94K011M932P692J0182
$$ 1376474 1348167 1324508 1304931 1288602 1275139 1264717 1257591 1253702 1252808 1254819 1259751 1267443 1277625
50748A277625J2687J5542J8753K2344K6798L2531L9073M5431N1305N7344O3936
$$ 1277625 1290312 1305854 1324607 1346951 1373749 1406280 1445353 1490784 1542089 1599433 1663369
50737A663369P0414P5713P9394Q1684Q2915Q3237Q2558Q0524P6802P1636O5673
$$ 1663369 1733783 1809496 1888890 1970574 2053489 2136726 2219284 2299808 2376610 2448246 2513919
50726B513919N9035N0974M0850K9131J6994N235n945j6297k5178l1850l5734l6479
$$ 2513919 2572954 2623928 2664778 2693909 2710903 2716138 2710193 2693896 2668718 2636868 2601134 2564655
50714B564655l4216k9791k4349j8539j2397o051k31M134O485O642M477j07o938
$$ 2564655 2530439 2500648 2476299 2457760 2445363 2439312 2439081 2443215 2449700 2456342 2460819 2460712 2453774
50701B453774j5548k5384l5802m5921n4757o1612o6221o8513o8502o6421o2671
$$ 2453774 2438226 2412842 2377040 2331119 2276362 2214750 2148529 2080016 2011514 1945093 1882422
50690A882422n7446n0721m2821l4566k6438j7999q736Q70R847J8184K6816L6107
$$ 1882422 1824976 1774255 1731434 1696868 1670430 1652431 1643695 1644565 1654412 1672596 1699412 1735519
50678A735519M5212N3261O0244O6205P0452P2286P1855O9576O5352N9174N1993
$$ 1735519 1780731 1833992 1894236 1960441 2030893 2103179 2175034 2244610 2309962 2369136 2421129
50667B421129M4918L7939L0490K3028J6889J2480Q658M160j168o747j2119j6938
$$ 2421129 2466047 2503986 2534476 2557504 2574393 2586873 2595531 2599691 2598523 2591776 2579657 2562719
50655B562719k0872k3879k6204k7830k8342k7487k5399k2106j7377j1327m687
$$ 2562719 2541847 2517968 2491764 2463934 2435592 2408105 2382706 2360600 2343223 2331896 2327209
50644B327209J862Q225J4515K0503K5672K9544L1765L2224L1296K9644K7722K5673
$$ 2327209 2329071 2337296 2351811 2372314 2397986 2427530 2459295 2491519 2522815 2552459 2580181 2605854
50632B605854K3790K2605K2294K2083K0248J4566L403j2734l0600m5864n5767
$$ 2605854 2629644 2652249 2674543 2696626 2716874 2731440 2734843 2722109 2691509 2645645 2589878
50621B589878n9988n9335n4676m7258l8919l1056k3848j6971j0580n056l62L678
$$ 2589878 2529890 2470555 2415879 2368621 2329702 2298646 2274798 2257827 2247247 2242191 2241829 2245507
50609B245507O628P642O236K549l127j0528j9225k8446l7235m4710n0449n4685
$$ 2245507 2252135 2259777 2266013 2268562 2265435 2254907 2235682 2207236 2170001 2125291 2074842 2020157
50597B020157n7863n9889o0160n8485n5522n2049m8198m3756l8912l4295l0360
$$ 2020157 1962294 1902405 1842245 1783760 1728238 1676189 1627991 1584235 1545323 1511028 1480668
50586A480668k7171k4656k2734k1209j9820j8496j7429j6708j5867j3990j0636
$$ 1480668 1453497 1428841 1406107 1384898 1365078 1346582 1329153 1312445 1296578 1282588 1271952
50575A271952o658l528j582N14M017Q343J1930J4433J6970K0353K4143K7781L1434
$$ 1271952 1265294 1261766 1260184 1260698 1264715 1273058 1284988 1299421 1316391 1336744 1360887 1388668 1420102
50562A420102L5341L9177M2684M6153M9775N3075N5498N6887N6995N5299N1896
$$ 1420102 1455443 1494620 1537304 1583457 1633232 1686307 1741805 1798692 1855687 1910986 1962882
50551A962882M7930M4378M0999L7139L3098K9916K8219K8018K9198L1436L3888
$$ 1962882 2010812 2055190 2096189 2133328 2166426 2196342 2224561 2252579 2281777 2313213 2347101
50540B347101L5765L7146L8680M0680M3094M6100N0039N4921O0558O6988P4138
$$ 2347101 2382866 2420012 2458692 2499372 2542466 2588566 2638605 2693526 2754084 2821072 2895210
50529B895210Q1184Q6986R1138R3989R5613R5369R2571Q7008P8732O7803N4489
$$ 2895210 2976394 3063380 3154518 3248507 3344120 3439489 3532060 3619068 3697800 3765603 3820092
50518C820092L9330K2824N257j3049l1521m9444o6131q0951r3316j02727j08813
$$ 3820092 3859422 3882246 3887503 3874454 3842933 3793489 3727358 3646407 3553091 3450364 3341551
50507C341551j11441j10709j06670r9156q8259p4933o0574m5831l0451j4507Q53
$$ 3341551 3230110 3119401 3012731 2913575 2825316 2750383 2689809 2643978 2613527 2599020 2599873
50496B599873J4396K6013L6259M5030N1232N3524N0941M3030K9990J2764p252
$$ 2599873 2614269 2640282 2676541 2721571 2772803 2826327 2877268 2920298 2950288 2963052 2955800
50485B955800k8535m9486o8635q5037r8158j07266j11708j12013j09947j06852
$$ 2955800 2927265 2877779 2809144 2724107 2625949 2518683 2406975 2294962 2185015 2078163
50475B078163j02594r6708q9716q2454p4942o6987n9333n2896m7181m0858l3774
$$ 2078163 1975569 1878861 1789145 1706691 1631749 1564762 1505429 1452533 1405352 1364494 1330720
50464A330720k7193k1902j7337j2827q551m918j958J91J032N28m98j302j874k320
$$ 1330720 1303527 1281625 1264288 1251461 1242910 1237992 1236034 1236225 1237257 1237785 1237287 1235985 1234111 1231791
50450A231791k137q07J302L202M313M923N718P037Q520R429R473R218R408J0101
$$ 1231791 1229654 1228847 1230149 1233351 1237664 1242587 1248305 1255342 1263862 1273291 1282764 1291982 1301390 1311491
50436A311491J0931J1999J3772J6172J8498K0369K2043K3637K4722K5000K4799
$$ 1311491 1322422 1334421 1348193 1364365 1382863 1403232 1425275 1448912 1473634 1498634 1523433
50425A523433K4558K4438K4665K5626K7232K8823L0168L1979L4906L8520M1910
$$ 1523433 1547991 1572429 1597094 1622720 1649952 1678775 1708943 1740922 1775828 1814348 1856258
50414A856258M4860M7678N0224N1884N2405N2102N1135M9195M5996M1613L6136
$$ 1856258 1901118 1948796 1999020 2050904 2103309 2155411 2206546 2255741 2301737 2343350 2379486
50403B379486K9415K1419J2559L254o650j7613k9484m1111n1208n9405o6156p1550
$$ 2379486 2408901 2430320 2442879 2446133 2439483 2421870 2392386 2351275 2300067 2240662 2174506 2102956
50391B102956p4780p4992p2261o7384o1059n3748m6040l8341l0235k0916j0496
$$ 2102956 2028176 1953184 1880923 1813539 1752480 1698732 1652692 1614351 1584116 1563200 1552704
50380A552704k79Q513J5748K1787K6435K8989K9004K6492K1571J4388N324n035
$$ 1552704 1552425 1560938 1576686 1598473 1624908 1653897 1682901 1709393 1730964 1745352 1750676 1745641
50368A745641j6012k6649l5597m1803m5342m7242m8359m8723m8072m6674m5224
$$ 1745641 1729629 1702980 1667383 1625580 1580238 1532996 1484637 1435914 1387842 1341168 1295944
50357A295944m4048m2788m0928l8400l5469l2264k8751k5033k1296j7418j3045
$$ 1295944 1251896 1209108 1168180 1129780 1094311 1062047 1033296 1008263 986967 969549 956504
50346I56504q291l940n49K355N712R702J3579J6684J8935K0141J9442J5991R991
$$ 956504 948213 944273 943724 946079 951791 961493 975072 991756 1010691 1030832 1050274 1066265 1076256
50333A076256K632m842j1582j6733j9251j8687j5954j2736r966p260m032p26J716
$$ 1076256 1078888 1074046 1062464 1045731 1026480 1007793 991839 979103 969137 961877 957845 957119 958835
50320I58835L216M540N950O791O761O688P380Q400Q782Q572Q636R232R697R563
$$ 958835 962051 966591 972541 979332 986093 992781 1000161 1008561 1017343 1025915 1034551 1043783 1053480 1063043
50306A063043R084Q483P504N988M271K683J189k16j253j898k652l891n355o603
$$ 1063043 1072127 1080610 1088114 1094102 1098373 1101056 1102245 1102029 1100776 1098878 1096226 1092335 1086980 1080377
50292A080377p661q774r831j0468j0541j0147r165p252m338r06K289M812O875
$$ 1080377 1072716 1063942 1054111 1043643 1033102 1022955 1013790 1006538 1002200 1001294 1003583 1008395 1015270
50279A015270R148J2047J5212J7757J9144J9616J9622J9042J7375J4671J1991
$$ 1015270 1024418 1036465 1051677 1069434 1088578 1108194 1127816 1146858 1164233 1178904 1190895
50268A190895J0537J0466J0799J0695J0359J0341J0344R504P812O390N983O023
$$ 1190895 1201432 1211898 1222697 1233392 1243751 1254092 1264436 1273940 1281752 1288142 1294125 1300148
50256A300148N793N795P038R475J2247J5252J9373K5013L1371L7536M3373M8923
$$ 1300148 1305941 1311736 1318774 1328249 1340496 1355748 1375121 1400134 1431505 1469041 1512414 1561337
50244A561337N3610N6652N7844N7491N5912N3448N0628M7962M5744M4156M3128
$$ 1561337 1614947 1671599 1729443 1786934 1842846 1896294 1946922 1994884 2040628 2084784 2127912
50233B127912M1766L8382L1633K1534R069m866j9742l4745m8371n8902o5183o7125
$$ 2127912 2169678 2208060 2239693 2261227 2270296 2265430 2245688 2210943 2162572 2103670 2038487 1971362
50221A971362o5605o1818n6602n0373m3715l7852l4291l4006l6880m1758m6952
$$ 1971362 1905757 1843939 1787337 1736964 1693249 1655397 1621106 1587100 1550220 1508462 1461510
50210A461510n0901n2653n1980m9246m5248m0905l6787l2930k9314k6258k4048
$$ 1461510 1410609 1357956 1305976 1256730 1211482 1170577 1133790 1100860 1071546 1045288 1021240
50199A021240k2310k0267j7669j5076j3098j1694j0359q795p160n861n126m677
$$ 1021240 998930 978663 960994 945918 932820 921126 910767 901972 894812 888951 883825 879148
50187H79148l830k100K76K529L983M398M046L678M080N194N912N297L843K933
$$ 879148 875318 873218 873494 876023 880006 884404 888450 892128 896208 901402 907314 912611 916454 919387
50173I19387L152L824M170M198M256M356M383M510N055O069P331Q524R451J0268
$$ 919387 922539 926363 930533 934731 938987 943343 947726 952236 957291 963360 970691 979215 988666 998934
50159I98934J1431J3049J4349J4264J2515R790O906M346K467J444Q82J19q29j109
$$ 998934 1010365 1023414 1037763 1052027 1064542 1074332 1081238 1085584 1088051 1089495 1090377 1090496 1089667 1088558
50145A088558OK420N620R257J3253J7772K3146K9388L5724M1304M6296N1705N8090
$$ 1088558 1088564 1090984 1096604 1105861 1119114 1136886 1160032 1189420 1225144 1266448 1312744 1364449 1422539
50132A422539O5286P3345Q2615R2554J01448J07924J11959J13923J13564J10745
$$ 1422539 1487825 1561170 1643785 1736339 1837787 1945711 2057670 2171593 2285157 2395902
50122B395902J06521J02502R9400R6922R4631R2112Q8295Q1322O9370N1541K8335
$$ 2395902 2502423 2604925 2704325 2801247 2895878 2987990 3076285 3157607 3226977 3278518 3306853
50111C306853J533k6491n3690p8545r9643j15734j26459j32531j34862j33911
$$ 3306853 3308386 3281895 3228205 3149660 3050017 2934283 2807824 2675293 2540431 2406520
50101B406520j30003j23692j15519j05915r5667q5901p7334p0008o3922n9226
$$ 2406520 2276517 2152825 2037306 1931391 1835724 1749823 1672489 1602481 1538559 1479333
50091A479333n5530n1883m7867m3963m0394l6480l1733k6777k2431j8615j4929
$$ 1479333 1423803 1371920 1324053 1280090 1239696 1203216 1171483 1144706 1122275 1103660 1088731
50080A088731j1579q923o696m552k818j828j125j63P09R60J017J606K418K556
$$ 1088731 1077152 1068229 1061533 1056981 1054163 1052335 1051210 1051047 1051756 1052716 1053733 1055339 1057757 1060313
50066A060313K077J904K357K827K932K916K867K520J963J636J534J161M01k78
$$ 1060313 1062390 1064294 1066651 1069478 1072410 1075326 1078193 1080713 1082676 1084312 1085846 1087007 1087408 1087130
50052A087130o19q52j003o47N02K185L898N167N590N185M630M688N457O615Q089
$$ 1087130 1086511 1085659 1084656 1084009 1084511 1086696 1090594 1095761 1101351 1106536 1111166 1115854 1121311 1127926 1136015
50037A136015R860J1414J2213J2520J2957J3417J3297J2726J2597J3291J4213
$$ 1136015 1145875 1157289 1169502 1182022 1194979 1208396 1221693 1234419 1247016 1260307 1274520
50026A274520J4726J4804J4635J4262J3778J3299J2816J2570J3428J6066J9965
$$ 1274520 1289246 1304050 1318685 1332947 1346725 1360024 1372840 1385410 1398838 1414904 1434869
50015A434869K4120K8510L3775L9556M4526M8260N1821N5955N9920O2540O3423
$$ 1434869 1458989 1487499 1521274 1560830 1605356 1653616 1705437 1761392 1821312 1883852 1947275
50004A947275O2543N9680N5064M9756M4613L9611L4665L0236K6246K1218J3439
$$ 1947275 2009818 2069498 2124562 2174318 2218931 2258542 2293207 2323443 2349689 2370907 2384346
49993B384346K514j1023k6873m4661o2857p9150r1945j00672j04937j04384r9602
$$ 2384346 2386860 2375837 2348964 2304303 2241446 2162296 2070351 1969679 1864742 1760358 1660756
49982A660756r2266q3994p5466o6811n8245n0087m2473l5466k9270k4102j9909
$$ 1660756 1568490 1484496 1409030 1342219 1283974 1233887 1191414 1155948 1126678 1102576 1082667
49971A082667j6328j3013r887p008m157q82K722N561O401N242L314J621O8j786
$$ 1082667 1066339 1053326 1043439 1036431 1032274 1031392 1034114 1039675 1046076 1051318 1054632 1056253 1056321 1054535
49957A054535l749n321o571q032r904j1748j3031j3695j4174j4942j5962j6559
$$ 1054535 1050786 1045465 1038894 1030862 1020958 1009210 996179 982484 968310 953368 937406 920847
49945I20847j6039j4492j2718j1361j0467r955r964j0481j1049j1130j0510r192
$$ 920847 904808 890316 877598 866237 855770 845815 835851 825370 814321 803191 792681 783489
49933G83489p279n175l471k368j581q86k43P26K616N177P109P566P190P027P010
$$ 783489 776210 771035 767564 765196 763615 762729 762486 763212 765828 771005 778114 785680 792870 799897 806907
49918H06907O448N534N280O123P570R107J0448J0939R786P310M999L827L268K343
$$ 806907 813355 818889 824169 830292 837862 846969 857417 868356 878142 885452 890451 894278 897546 899889
49904H99889R02p97k965n913r185j1941j4011j5717j6809j6502j4739j2551j0806
$$ 899889 900791 899994 897029 891116 881931 869990 855979 840262 823453 806951 792212 779661 768855
$$ [...]
##END NTUPLES=NMR SPECTRUM
##END=
