##TITLE=AC1714_3158_8749746_dLcrRJoP4r
##JCAMPDX= 6.0         $$ Bruker NMR JCAMP-DX V2.0
##DATA TYPE= NMR SPECTRUM
##DATA CLASS= NTUPLES
##ORIGIN= BRUKER
##OWNER= Administrator
$$ 1.72 TOPSPIN		Version 2.1
$$ 2015-08-07 19:48:58.406 -0700  Administrator@X
$$ Compression mode = diff/dup
##.OBSERVE FREQUENCY= 400.02188249412
##.OBSERVE NUCLEUS= ^1H
##.ACQUISITION MODE= SIMULTANEOUS (DQD)
##.ACQUISITION SCHEME= undefined
##.AVERAGES= 8
##.DIGITISER RES= 22
##SPECTROMETER/DATA SYSTEM= spect
##.PULSE SEQUENCE= zg30
##.SOLVENT NAME= COFFEE_meoh
##.SHIFT REFERENCE= INTERNAL, COFFEE_meoh, 1, 14.98509
##AUDIT TRAIL= $$ (NUMBER, WHEN, WHO, WHERE, PROCESS, VERSION, WHAT)
$$ ##TITLE= Audit trail, TOPSPIN		Version 2.1
$$ ##JCAMPDX= 5.01
$$ ##ORIGIN= Bruker BioSpin GmbH
$$ ##OWNER= Administrator
$$ $$ E:\/data/COFFEE/nmr/AC1714_3158_8749746_dLcrRJoP4r/50/pdata/1/auditp.txt
$$ ##AUDIT TRAIL=  $$ (NUMBER, WHEN, WHO, WHERE, PROCESS, VERSION, WHAT)
(   1,<2015-08-07 19:48:51.078 -0700>,<Administrator>,<X>,<go>,<TOPSPIN 2.1>,
      <created by zg
	started at 2015-08-07 19:47:45.188 -0700,
	POWCHK enabled, PULCHK disabled,
       configuration hash MD5:
       21 0F 79 D6 B3 7B B4 F6 88 20 88 DB 03 48 BD 9F
       data hash MD5: 64K
       CD 25 24 BC 54 69 1D 1E B5 C3 36 61 3D AA 32 33>)
(   2,<2015-08-07 19:48:54.266 -0700>,<Administrator>,<X>,<proc1d>,<TOPSPIN 2.1>,
      <Start of raw data processing
       efp LB = 0 FT_mod = 6 PKNL = 1 PHC0 = 0 PHC1 = 0 SI = 32K 
       data hash MD5: 32K
       B2 65 77 75 56 5F AC 2A 5A A4 92 E9 FB 14 E6 25>)
(   3,<2015-08-07 19:48:54.547 -0700>,<Administrator>,<X>,<proc1d>,<TOPSPIN 2.1>,
      <pk PHC0 = 88.86292 PHC1 = 0 
       data hash MD5: 32K
       9C 27 40 BF 48 0D 74 22 42 A2 59 17 A6 9E AE BD>)
(   4,<2015-08-07 19:48:54.688 -0700>,<Administrator>,<X>,<proc1d>,<TOPSPIN 2.1>,
      <abs ABSG = 1 
       data hash MD5: 32K
       48 12 E5 AA 9B 56 10 4E 7F 96 4C 76 86 41 11 7E>)
(   5,<2015-08-07 19:48:54.750 -0700>,<Administrator>,<X>,<proc1d>,<TOPSPIN 2.1>,
      <abs ABSG = 2 
       data hash MD5: 32K
       4C F1 11 16 72 29 95 06 8A 53 DE 03 D1 A6 CE 74>)
(   6,<2015-08-07 19:48:54.813 -0700>,<Administrator>,<X>,<proc1d>,<TOPSPIN 2.1>,
      <abs ABSG = 3 
       data hash MD5: 32K
       1D 5A 19 8A C7 21 DD A1 BE A3 7D 31 EE F5 60 AD>)
(   7,<2015-08-07 19:48:54.859 -0700>,<Administrator>,<X>,<proc1d>,<TOPSPIN 2.1>,
      <abs ABSG = 4 
       data hash MD5: 32K
       63 92 0E AA BA FD 85 C2 E0 90 14 4E 64 F0 D7 F3>)
(   8,<2015-08-07 19:48:54.922 -0700>,<Administrator>,<X>,<proc1d>,<TOPSPIN 2.1>,
      <abs ABSG = 5 
       data hash MD5: 32K
       05 52 73 08 B6 5B EF 7B 67 68 F0 CA C1 FC FE 8B>)
$$ ##END=
$$ 
$$ $$ hash MD5
$$ $$ 64 F5 07 33 7A 43 4F BA 47 BC 4B F9 F2 59 0F 54
##$RELAX= 
##$RELAX= 
##$RELAX= 
##$RELAX= 
##$RELAX= 
##$RELAX= 
##$RELAX= 
$$ Bruker specific parameters
$$ --------------------------
##$DU= <E:\>
##$EXPNO= 50
##$NAME= <AC1714_3158_8749746_dLcrRJoP4r>
##$PROCNO= 1
$$ [...]
150 150 150 150 150 150 150 150
##$TP07= 0
##$TPNAME0= <>
##$TPNAME1= <>
##$TPNAME2= <>
##$TPNAME3= <>
##$TPNAME4= <>
##$TPNAME5= <>
##$TPNAME6= <>
##$TPNAME7= <>
##$TPOAL= (0..7)
0.5 0.5 0.5 0.5 0.5 0.5 0.5 0.5
##$TPOFFS= (0..7)
0 0 0 0 0 0 0 0
##$TUNHIN= 0
##$TUNHOUT= 0
##$TUNXOUT= 0
##$USERA1= <user>
##$USERA2= <user>
##$USERA3= <user>
##$USERA4= <user>
##$USERA5= <user>
##$V9= 5
##$VALIST= <valist>
##$VCLIST= <CCCCCCCCCCCCCCC>
##$VD= 0
##$VDLIST= <DDDDDDDDDDDDDDD>
##$VPLIST= <PPPPPPPPPPPPPPP>
##$VTLIST= <TTTTTTTTTTTTTTT>
##$WBST= 2048
##$WBSW= 25
##$XGAIN= (0..3)
0 0 0 0
##$XL= 0
##$YL= 0
##$YMAX_a= 543875
##$YMIN_a= -472204
##$ZGOPTNS= <>
##$ZL1= 120
##$ZL2= 120
##$ZL3= 120
##$ZL4= 120
##$ABSF1= 14.98509
##$ABSF2= -5.573092
##$ABSG= 5
##$ABSL= 3
##$ALPHA= 0
##$AQORDER= 0
##$ASSFAC= 0
##$ASSFACI= 0
##$ASSFACX= 0
##$ASSWID= 0
##$AUNMP= <proc_prof1d_extract_pilot.lims>
##$AXLEFT= 0
##$AXNAME= <>
##$AXNUC= <1H>
##$AXRIGHT= 0
##$AXTYPE= 0
##$AXUNIT= <>
##$AZFE= 0.1
##$AZFW= 0.1
##$BCFW= 0
##$BC_mod= 0
##$BYTORDP= 0
##$COROFFS= 0
##$CY= 15
##$DATMOD= 1
##$DC= 0
##$DFILT= <>
##$DTYPP= 0
##$F1P= 0
##$F2P= 0
##$FCOR= 0.5
##$FTSIZE= 32768
##$FT_mod= 6
##$GAMMA= 0
##$GB= 0
##$INTBC= 1
##$INTSCL= 1
##$ISEN= 128
##$LB= 0
##$LEV0= 0
##$LPBIN= 0
##$MAXI= 10000
##$MC2= 0
##$MEAN= 0
##$ME_mod= 0
##$MI= 0
##$NCOEF= 0
##$NC_proc= -8
##$NLEV= 6
##$NOISF1= 0
##$NOISF2= 0
##$NSP= 0
##$NTH_PI= 0
##$NZP= 0
##$OFFSET= 14.98509
##$PC= 1
##$PHC0= 88.86292
##$PHC1= 0
##$PH_mod= 1
##$PKNL= yes
##$PPARMOD= 0
##$PPDIAG= 0
##$PPIPTYP= 0
##$PPMPNUM= 2147483647
##$PPRESOL= 1
##$PSCAL= 4
##$PSIGN= 0
##$PYNMP= <proc.py>
##$REVERSE= no
##$SF= 400.02
##$SI= 32768
##$SIGF1= 0
##$SIGF2= 0
##$SINO= 400
##$SIOLD= 32768
##$SPECTYP= <>
##$SREGLST= <1H.CDCl3>
##$SSB= 0
##$STSI= 32768
##$STSR= 0
##$SW_p= 8223.68421052631
##$SYMM= 0
##$S_DEV= 0
##$TDeff= 65536
##$TDoff= 0
##$TI= <>
##$TILT= no
##$TM1= 0
##$TM2= 0
##$TOPLEV= 0
##$USERP1= <user>
##$USERP2= <user>
##$USERP3= <user>
##$USERP4= <user>
##$USERP5= <user>
##$WDW= 1
##$XDIM= 32768
##$YMAX_p= 410120874
##$YMIN_p= -689853
##$CURPLOT= <Network HP LaserJet P1505>
##$CURPRIN= <$Network HP LaserJet P1505>
##$DFORMAT= <normdp>
##$LAYOUT= <+/1D_H.xwp>
##$LFORMAT= <normlp>
##$PFORMAT= <normpl>
##$SURQMSG= 1
$$ End of Bruker specific parameters
$$ ---------------------------------
##NTUPLES= NMR SPECTRUM
##VAR_NAME=  FREQUENCY,     SPECTRUM/REAL,   SPECTRUM/IMAG
##SYMBOL=    X,             R,               I
##VAR_TYPE=  INDEPENDENT,   DEPENDENT,       DEPENDENT
##VAR_FORM=  AFFN,          ASDF,            ASDF
##VAR_DIM=   32768,         32768,           32768
##UNITS=     HZ,            ARBITRARY UNITS, ARBITRARY UNITS
##FACTOR=    0.250966925370066, 1,           1
##FIRST=     8223.43324360094, -46975,       -89177
##LAST=      0,             -72335,          143530
##MIN=       0,             -689853,         0
##MAX=       8223.43324360094, 410120874,    0
$$ Real data points
##PAGE= N=1
##DATA TABLE= (X++(R..R)), XYDATA
$$ [...]
19544a58078B30416b9738m3813J0864I9051c0298l9883k10539A42263a49249m0603
19533a89852F3394J02630c10853e1962j23045C57953e9108G616K2788a78797Q2416
19522i6381L6313k33155J16375F7443d2683j80187B2418b06581K6149n3577R4851
19511a39158B74119q3869F0461L2539a09006M4131k3536B31472c14060A36330
19500I5303g4791l2720l9933a3021j63243B6769a47963p9771E1764a45512A49765
19488a1816I1593Q0127c53559i1723A28283b40700A18504K3417J05552b90703
19477b25541D9955a1544o8718o2889C5108J03889D2932J61178a10895H6481c49121
19465c75142M1422a48121k49564a01567M5210A65772D054L86919b7126r086j43370
$$ y = [-158078, 230416, -29738, -73551, -62687, 99051, -30298, -70181, -280720, 142263, -149249, -189852, 63394, 166024, -310853, -51962, -175007, 357953, -59108, 7616, 30404, -178797, -96381, -60068, -293223, -176848, 67443, -42683, -222870, 22418, -206581, -180432, -234009, -139158, 274119, 190250, 60461, 93000, -109006, -64875, -88411, 231472, -314060, 136330, 95303, -74791, -107511, -147444, -13021, -176264, 26769, -147963, -227734, 51764, -145512, 149765, -11816, 91593, 171720, -353559, -91723, 128283, -240700, 118504, 141921, 247473, -290703, -225541, 49955, -11544, -80262, -143151, 35108, 138997, 42932, 204110, -110895, 86481, -349121, -375142, -333720, -148121, -397685, -101567, -56357, 165772, 4054, 390973, -27126, -36212, -179582]
19454a79582r6903J10821J9303F9725M7445K1303a69266q6231F007N6167M7742
19443A09916a93740k50965D293c0614A6775b72419P1780m2353b7864h939A64620
19431b18468G3988c55912a9653D6184b07726H9075J43406F7493b81533c7524j24305
19420a61829f8469B50140j14959f4326A40970a21687j17601n2316a03680o3841
19410a67521d3940j41773F9221b15401i8427m7496A08126a60137A3451K6126a26400
19398A08247d6197j11069g3j85A03187a30633q2154g8181G3739j7890e19157K45063
19386b74094F3278A7032R2663N6199A0113i0995l7829E6415c762j35593j38973
19375b78328I6332K4157c09173D257c41412e3353j95801F4572b26235a7524B11428
$$ y = [-179582, -276485, -165664, -146361, 69725, 117170, 138473, -169266, -255497, 6007, 62174, 109916, -193740, -444705, 4293, -30614, 16775, -272419, -200639, -242992, -27864, -8939, 164620, -218468, 73988, -355912, -19653, 46184, -207726, 89075, 232481, 67493, -281533, -37524, -161829, -68469, 250140, 135181, -64326, 140970, -121687, -239288, -291604, -103680, -167521, -43940, -185713, 69221, -215401, -98427, -145923, 108126, -160137, 13451, 39577, -126400, 108247, -46197, -157266, -73, -258, 103187, -130633, -212787, -78181, 73739, 55849, -519157, -274094, 63278, 17032, 109695, 165894, 10113, -90995, -128824, 56415, -3762, -139355, -278328, 96332, 120489, -309173, 4257, -341412, -53353, -249154, 64572, -226235, -17524, 211428]
19363d0281j82197B00656c70717O7727c940k28497i3629j44882a11628A24633
19352D06214A2510L32382E7993B0576c16307D7077d11386b3637j07274a2327r0535
19341a02862K5531j6331A19879n7169b03032A23312J01915d3888D7858a98310
19330d1296B27344h1184H3918Q3347p4424a26283Q457J7022E3015c3030H0594
19318a847A65506E9721n585g7905C1022R175f0451q486l2403l0953n5807E1225
19305A53912p1982b64924B69673a85429G6836B0554f3785J828l620C12610j6397
19294B96213c97800a24175B61977B8917b72111B43665b3673n9355A16889a12501
19283e1667k44669a27632c393G5843a45986A9755a47929B53274b80425G1382M6434
$$ y = [-40281, -222478, 200656, -370717, -302990, -3940, -232437, -93629, -238511, -111628, 124633, 406214, 12510, 344892, 57993, 20576, -316307, 47077, -411386, -23637, -130911, -12327, -102862, -77331, -93662, 119879, 62710, -203032, 123312, 225227, -43888, 47858, -198310, -41296, 227344, -81184, 83918, 167265, 92841, -126283, -117826, -100804, 53015, -33030, 80594, -1847, 165506, 59721, 54136, -77905, 31022, 40197, -60451, -68937, -101340, -132293, -188100, 51225, 153912, 81930, -264924, 269673, -185429, 76836, 20554, -63785, -61957, -65577, 312610, 296213, -397800, -124175, 261977, 28917, -272111, 243665, -23673, -83028, 116889, -112501, -51667, -296336, -127632, -3393, 75843, -145986, 19755, -147929, 253274, -280425, 71382, 117816]
19272A17816L9850g9950A98242a60773a7724k89325A9193Q4792C5233O6037J01101
19261B02371p635a66647B02468b63084e5937l12592B0732f7328A72374c9816j25683
19250a65499M629F0542a74479M9274A98985a34017A59064a75970f6508A44830
19239d3489k48034D6747L00978f9683k49241j3672B6762L5738a53076K7096K626
19228a23354K0948B5966J07269M474j1468D1369J65216K2291b16685F5655c26617
19216A04506N6070b44586A72936i2482j3966q636A30243j4902R544a01397A63494
19204b22802A7625b7847j97070c7216a3701F7622a33233k25388B16074b9767j39006
19193a68773j9935o2979l8956J09587A16332b47098A15045a99223a1447c015G045
$$ y = [117816, 157666, -79950, 198242, -160773, -17724, -307049, 19193, 103985, 35233, 101270, 202371, 194736, -166647, 202468, -263084, -55937, -368529, 20732, -67328, 172374, -39816, -165499, -160870, 60542, -174479, -125205, 198985, -134017, 159064, -175970, -66508, 144830, -43489, -291523, 46747, 347725, -69683, -318924, -332596, 26762, 62500, -153076, -125980, -123354, -102406, 25966, 133235, 137709, 126241, 41369, 206585, 228876, -216685, 65655, -326617, 104506, 160576, -244586, 172936, -92482, -106448, -115084, 130243, 115341, 124885, -101397, 163494, -222802, 17625, -27847, -224917, -37216, -13701, 67622, -133233, -358621, 216074, -29767, -168773, -188708, -251687, -290643, -181056, 116332, -247098, 115045, -199223, -11447, -3015, 7045]
19181A84709c10301Q5794p705O1584f9250I2006a92853A44408a49652M9930E1325
19169b2003p0509L0699f109k018k4521B9220b61781H7915b60532g6260C07868
19157i8552k1354L2679K1286A134c00427C70398A12557B1187K3416b4926k6309
19146e1235n8272k1467N6665b4008G036b58339O6143H210d6825A07095n3130J14067
19134A68032Q8743h0550l4187A13956N9301b89964A26538b14m4360j51387A83566
19122a06299D4404P9252E921m6K7432K47168D976d8722B21417b10709n7170L6377
19110b31502O5882M4000m1859A49470a60501G3432b67556f870o0821A12698b29170
19098b29092O2719j49295B93777I7107b97919a02017J6859d2410B4479K00374
$$ y = [184709, -310301, -224507, -232212, -170628, -69250, 92006, -192853, 144408, -149652, -99722, 51325, -22003, -92512, -61813, -6109, -8127, -32648, 29220, -261781, 87915, -260532, -76260, 307868, -98552, -119906, -87227, -65941, 1134, -300427, 370398, 112557, 21187, 44603, -24926, -51235, -109507, -130974, -74309, -24008, 7036, -258339, -192196, 8210, -46825, 107095, 53965, 168032, 256775, -80550, -114737, 113956, 173257, -289964, 126538, -214, -44574, -195961, 183566, -106299, 44404, 123656, 5921, 5875, 33307, 280475, 4976, -48722, 221417, -210709, -267879, -231502, -165620, -121620, -163479, 149470, -160501, 73432, -267556, -6870, -67691, 112698, -229170, -229092, -166373, -315668, 293777, 97107, -297919, -102017, -85158, -42410, 24479, 224853]
19088B24853B4420a4849k10399B08911C3794e080B73919i1266G3640f2648I0931
19076A76406d2132l8120E0677B2690a54969N8173b1083j9131k15623J6144A08381
19064C4565k291c9480C8292d315C01562A8223J928J996i2604B5440c06189J245
19052c04944J03231R8332j70597N2169A02081b61280f3259G7887O0679a30794
19041E6726c4528j41902H4893e5926a0614H6435a91280l2871i7580d100k48743
19030b52843a14814c8802A49268a00668B64473q1510D7399B2716a33227d5752
19019e3661b4092A2854a8672B70646N9604a80716G0514c7522C02986A7973c20449
19007a3722n8598c0995j74583A03281A8660d19531F2864B8136L3733J57704C9781
$$ y = [224853, 24420, -14849, -225248, 208911, 33794, -5080, 273919, -91266, 73640, -62648, 90931, 176406, -42132, -80252, 50677, 22690, -154969, -96796, -21083, -40214, -255837, -239693, 108381, 34565, 32274, -39480, 38292, -4315, 301562, 18223, 20151, 22147, -92604, 25440, -306189, -304944, -201713, -103381, -273978, -221809, 102081, -261280, -63259, 77887, 138566, -130794, 56726, -34528, -176430, 84893, -55926, -10614, 86435, -191280, -224151, -97580, -4100, -252843, -114814, -38802, 149268, -100668, 264473, 182963, 47399, 22716, -133227, -45752, -53661, -24092, 12854, -18672, 270646, 330250, -180716, 70514, -37522, 302986, 17973, -320449, -13722, -72320, -30995, -205578, 103281, 18660, -419531, 62864, 28136, 61869, 219573, 39781]
18995A33146B6919R6669a22144i72p010k36041h7952q0382j17818A14590a17620
18983a22160l4309A71643a56312k3139a9242r582o2667A80963J6035c88142f2449
18971c35553J57813j35111b0422p3753b4292k53980N5802g2670j66614J05398
18961a33886E0072J90300a67246P8934p8352G7888k7408J30888r62b24839A64469
18949H8514b52921d2313n1101D7858b8161A15605m2571h6916A32308a46241D9877
18937a23909I253K58429A03173d2419A59716P492E7196K4321J91319b7005j37643
18926a64648r8099r9002a26001e0563B98047d3400q4369E9227a46282k0147B5900
18914b70990A12433e9416k45096A19450b3705j07774G3424a78372O8278c5480
$$ y = [133146, 26919, 123588, -122144, -972, -7982, -244023, -87952, -168334, -286152, 114590, -117620, -122160, -156469, 171643, -156312, -179451, -19242, -28824, -91491, 180963, 196998, -388142, -62449, -335553, -177740, -312851, -20422, -94175, -24292, -278272, -222470, -72670, -239284, -133886, 50072, 240372, -167246, -88312, -166664, 77888, 50480, 181368, 180406, -224839, 164469, 88514, -252921, -42313, -93414, 47858, -28161, 115605, 73034, -86916, 132308, -146241, 49877, -123909, 9253, 267682, 103173, -42419, 159716, 167208, 57196, 81517, 272836, -27005, -164648, -262747, -361749, -126001, -50563, 298047, -43400, -127769, 59227, -146282, -166429, 25900, -270990, 112433, -59416, -304512, 119450, -23705, -131479, 73424, -178372, -110094, -35480]
18903B51704b73138A45259B8708j2977J14826a19127M6450l751o3274e3314k9947
18892h3261m321o392j37008A7960L07026A4595J35614f9236m37339A56661m3847
18881A12814b42660B01717a86286N8815l82787A2207e44939K37394i4845A55233
18870g1654k0703d5617j01168A36053f3807G5081A2502a09906B2203f0339j07120
18859a67459c9515j52178p7353e0415I7205l0551k7048A3121k101a38849B18491
18847d2667k76089A55723a21910A38217e8854C0005a54717M8428j37571b1289
18836a26805k29926c6850F1724d8898B15825A4102K43639C6966h1933A77712q0274
18825I7438a20703B3259c773j03982d3519p8059C4680O0878J81019j09561a95893
$$ y = [251704, -273138, 145259, 28708, 15731, 130557, -119127, -72677, -76428, -139702, -53314, -83261, -87582, -93974, -230982, 17960, 324986, 14595, 150209, -69236, -506575, 156661, 112814, -242660, 201717, -186286, -127471, -510258, 12207, -544939, -307545, -94845, 155233, -71654, -92357, -45617, -146785, 136053, -63807, 75081, 12502, -109906, 22203, -60339, -167459, -39515, -191693, -269046, -50415, 97205, 66654, 39606, 13121, 11020, -138849, 218491, -42667, -318756, 155723, -121910, 138217, -58854, 30005, -154717, -106289, -243860, -21289, -126805, -356731, -36850, 61724, -48898, 215825, 14102, 257741, 36966, -81933, 177712, 97438, -120703, 23259, -3773, -107755, -43519, -121578, 34680, 95558, 276577, 167016, -195893]
18813b66697j56042b4396j8863A12897Q897J52085a28492B13185b7290j20217
18803a47507E3375K22286a2437q7024A76813a1524D0333b31922o1175P2739C2166
18791D0160d73860b2271F4105k9939b50863A63095f5552l92848D20551a05901
18780a30692B70971j14537A326K9073c23110a37133A98271a53520f6334A72168
18769a27855E6026c3301l41960a61837B7740b38939a05690h166j16986o5547k03559
18758c94258A57573a06510J8817L1514B98312A9530b57658g2323I1683h0422J4311
18747f6111I4425a38304A11999c0728A91974a22703B1429M6970a59448q6074L4240
18736b11282l820k48045C55602D994b36668i0648j45790B13194a06449H2079O8580
$$ y = [-266697, -422739, -24396, -43259, 112897, 121794, 273879, -128492, 213185, -27290, -147507, 53375, 275661, -12437, -99461, 176813, -11524, 40333, -231922, -293097, -220358, 32166, 40160, -473860, -22271, 64105, 34166, -250863, 163095, -65552, -458400, 420551, -105901, -130692, 270971, 156434, 1326, 30399, -323110, -137133, 198271, -153520, -66334, 172168, -127855, 56026, -33301, -375261, -161837, 27740, -238939, -105690, -8166, -125152, -190699, -394258, 157573, -106510, -87693, -56179, 298312, 19530, -257658, -72323, 91683, -80422, -66111, 94425, -138304, 111999, -30728, 191974, -122703, 21429, 68399, -159448, -245522, -211282, -215102, -463147, 355602, 4994, -236668, -90648, -236438, 213194, -106449, 82079, 150659]
18725A50659c65777C13582p3969b74297Q6137D0336g0605A43191g3533j86029
18715b59562R3012P6514j8045p4354N07h0102B15488f7569F4855J98260c85517
18703I6524B1675Q6450o885g6331k92117A3602c19841H4673B5985a01580J1600
18692h9980O014A00253Q6771i1340j09054b9044H6706m2300e7290A6214i5425
18680b09831p7597c1098A22440c17963h5802k42860A02493a49751C09214i758
18669a97549B00285b90481f040j98824i8709a3158M353p0408P055C2251c18036
18657a36395d5095m29644b05071R5965k06926g3897k66826J54371G8790a82021
18646a43275K9268B5634a6215o5084I957b46491N8254j57782B6545N2339c569
$$ y = [150659, -365777, 313582, 239613, -274297, -188160, 40336, -70605, 143191, -73533, -259562, -166550, -90036, -108081, -182435, -181928, -80102, 215488, -67569, 64855, 263115, -385517, 96524, 21675, 108125, 101240, -76331, -368448, 13602, -319841, 84673, 25985, -101580, -89980, -83966, 100253, 187024, -91340, -200394, -29044, 86706, 44406, -57290, 16214, -95425, -209831, -287428, -31098, 122440, -317963, -85802, -328662, 102493, -149751, 309214, -9758, -197549, 200285, -290481, -6040, -204864, -98709, -13158, -8805, -79213, -72158, 32251, -318036, -136395, -45095, -474739, -205071, -109106, -316032, -73897, -340723, -186352, 78790, -182021, -143275, -114007, 25634, -16215, -81299, 9957, -246491, -188237, -346019, 26545, 78884, -3569]
18634c2670j21047B51625a58199I1143O3803c3439F8052a4377A8960e2209F6235
18622C0181L1956L6393b09214A01010a75268R245A09611A0413d9863A83208a86702
18610a43025D5407a21H3188A1660J59588J33376a67324J3528q0962B35665R2893
18599C28558A10246A0388J84365B4836b00841O1384M4702l15048a40510B45615
18588b2512A6814G350a18999o0212C0837b02398C8224b8743H5591b12054A7445
18576b1179p2684A19784Q9464a13802b9464j49269a0035q0170G0889L9617R7223
18565B07729J7490d45726e7762b7880j4067B4286j1548i6358r9565q9539A00479
18553a40692G7890a52300C22876a83277j1446Q655e7667r0087B19866e8458d583
$$ y = [-32670, -153717, 251625, -158199, 91143, 154946, -33439, 68052, -14377, 18960, -52209, 66235, 30181, 62137, 98530, -209214, 101010, -175268, -166023, 109611, 10413, -49863, 183208, -186702, -143025, 45407, -121, 83188, 11660, 171248, 304624, -167324, -153796, -234758, 235665, 328558, 110246, 10388, 194753, 24836, -200841, -139457, -94755, -409803, -140510, 245615, -22512, 16814, 7350, -118999, -179211, 30837, -202398, 38224, -28743, 85591, -212054, 17445, -21179, -93863, 119784, 209248, -113802, -29464, -178733, -10035, -90205, 70889, 110506, 207729, 225219, -445726, -57762, -27880, -41947, 24286, 12738, -96358, -195923, -285462, 100479, -140692, 77890, -152300, 322876, -183277, -194723, -186068, -57667, -147754, 219866, -58458, -4583]
18541f8334L3572F3755b79023e2170k8398o73H2177J49437a83906A41184i0985
18529b01478D0834a55924b2908B7916b54558I6342r339J68692h1543j82201B40876
18517I667a87153c5805A13598b82425j185b203B03091A4602f6880j13443q2833
18506b63156i558D786J14161a09334A96787a69109N0522j3161C42939h9614C2007
18494A51415L6837L30403c94089B08051A0700J75127n9864i4994F8353b34487
18483I6270j8668a40716A6488d07449J90226P0198j91385G9345L71925b25549
18472b5792j55212b6910B90884e8939J2611o6063F718d6786A29596A0589c9607
18460C3907J08825g4837I7420a75659D2853F667b55263a19559O775C1354O7201
$$ y = [-68334, -34762, 63755, -279023, -52170, -80568, -81241, 82177, 231614, -183906, 141184, -90985, -201478, 40834, -155924, -22908, 27916, -254558, 96342, 87003, 255695, -81543, -263744, 240876, 9667, -187153, -35805, 113598, -282425, -283610, -2203, 203091, 14602, -66880, -180323, -263156, -9558, 4786, 118947, -109334, 196787, -169109, -118587, -131748, 342939, -89614, 32007, 151415, 188252, 518655, -394089, 208051, 10700, 185827, 125963, -94994, 68353, -234487, 96270, 77602, -140716, 16488, -407449, -217223, -147025, -338410, 79345, 451270, -225549, -25792, -181004, -26910, 290884, -58939, -46328, -112391, 6718, -46786, 129596, 10589, -39607, 33907, 142732, -74837, 97420, -175659, 42853, 6667, -255263, -119559, -112784, 31354, 98555]
18449I8555c35205B58674r1015c13199A30448f7259A75187a9537D0478a45342
18438C92601A04774d9588B0636K21712l3948r974a62564O8163j26186R4344j28261
18427b54504h4514k21536A95598q6040c2913A65409e1396G1756J87320j08155
18417A50921l7470g7526B25745b80229a28280m09938G03N2894a57817M0480p4399
18406a91736C0088g5503B31021H5273i4840A1269d5805F0304f3244k4018k62684
18395c49946a03539l0328O740f230I7063C2687a60524A5926c8349q9493d8608
18383g3589m8371j6874j96759a17034a5445k11385b7293A63566P8210H2208c3429
18371A8011a38737j91628C02846j24748C9001c77776a77621D9053a12007A89578
$$ y = [98555, -335205, 258674, 167659, -313199, 130448, -67259, 175187, -19537, 40478, -145342, 392601, 104774, -49588, 20636, 242348, 208400, 198426, -162564, -94401, -220587, -126243, -254504, -84514, -306050, 195598, 109558, -32913, 165409, -51396, 71756, 259076, 150921, 113451, -77526, 225745, -280229, -128280, -538218, 703, 53597, -157817, -117337, -191736, 30088, -75503, 231021, 85273, -94840, 11269, -45805, 60304, -63244, -87262, -349946, -103539, -133867, -127127, -6230, 97063, 32687, -160524, 15926, -38349, -127842, -48608, -73589, -121960, -138834, -335593, -117034, -15445, -226830, -27293, 163566, 241776, 82208, -33429, 18011, -138737, -330365, 302846, 178098, 39001, -377776, -177621, 49053, -112007, 189578]
18360g6635k0192e576E118b70161c1979A77715m6409h0303o5255F2520b3471B45999
18347a56949A93986a06159k0532e9918A11421e7605H4774C2802a51914k09344
18337c61258A84401b917k67447B73989a3718j07814e1173A59850a80083A48816
18326b4686D2973i9149K4816j4071B04372g7156j66419R8273M1397j2430M0268
18315g6067B13647a96709l1541A11664K2316I322J53954b14439M5821E2751N0901
18304A03652D5430d5852j90209D9729a89898B70675a22633j06486F7008a59148
18293A81702D894a32903j3997A74691h1450j01732C4574a1430q4355j21438g1705
18281B8979g8517C2874a39040d0524D5290a34460H1613h8705M1895h99A22253
$$ y = [-76635, -96827, -5576, 5118, -270161, -31979, 177715, 131306, -80303, -145558, 62520, -23471, 245999, -156949, 193986, -106159, -126691, -59918, 111421, -57605, 84774, 32802, -151914, -361258, 184401, -2917, -270364, 273989, -13718, -121532, -51173, 159850, -180083, 148816, -24686, 42973, -99149, -74333, -88404, 204372, -77156, -243575, -145302, -103905, -116335, -76067, 213647, -196709, -228250, 111664, 133980, 9322, 163276, -214439, -168618, 52751, 103652, 45430, -45852, -236061, 49729, -189898, 270675, -122633, -229119, 67008, -159148, 181702, 4894, -132903, -146900, 174691, -81450, -183182, 34574, -11430, -95785, -217223, -71705, 28979, -78517, 32874, -139040, -40524, 45290, -134460, 81613, -88705, -46810, -899, 122253]
18269a95869h408k40685C64540G933f3200K1371C4100e8434D04545A66424L268
18258A69692e3177F5850h5230A64894c7915j27788p0217a16268A25372b24958
18247a31216k630C2650R9943K9186d61821a56411A51388O0759r2404a06637G931
18235A3793K9991d8831p3204A06503B6755Q5346m6960i5698b0579L071k11215
18224b28723I3059B1495g916l0618a3764A94883b90232E7268J28469F0345P8838
18213A39183b50557g8270m6629a4017B10457M002E773a44416A22544k3392D2566
18201D40536k13023b55468a03461A80037c23853c7537B59609d6718l68540J92973
18191b22285j03966B8081J22853a12220A12255b16023A80924g5122B2777e5858
$$ y = [-195869, -8408, -249093, 364540, 7933, -63200, -41829, 34100, -58434, 404545, 166424, 169692, -53177, 65850, -85230, 164894, -37915, -165703, -235920, -116268, 125372, -224958, -131216, -133846, 32650, 132593, 161779, -461821, -156411, 151388, 212147, 119743, -106637, 7931, 13793, 43784, -48831, -122035, 106503, 26755, 112101, 65141, -95698, -20579, -17508, -228723, 93059, 21495, -7916, -38534, -13764, 194883, -290232, 57268, 185737, 60345, 139183, -250557, -78270, -124899, -14017, 210457, 214459, 5773, -144416, 122544, 99152, 42566, 440536, 227513, -255468, -103461, 180037, -323853, -37537, 259609, -46718, -415258, -222285, -326251, 28081, 150934, -112220, 112255, -216023, 180924, -75122, 22777, -55858]
18180e1246C3575b44494e9210m2487j66321A43300c18196B19413h3839p6655o0264
18169b20758E490c38851B06468D0969b22718B4549O1761a48120g2004a7819H7513
18157b3173j43830A4262L6076m662J61853n2682a27560A13571a84412A87867C2115
18145b78568A00818i0345j56048f9893C4841d52288K18912d1869B6648i9728a0579
18133D3837a30538O3901C3889c7259A41860a41449m4834O6577A23416B8551J40357
18122A68908A4284a99880A07220i6045F7936a03541J9099G9319a11849A11280
18111b34460N2164f1450p8383e8857h148l3502J5672G5315i9009I5296L1198j51
18099A26343a24975H7947I523J0242a90736c2902k22758A2060d2354j3937A13209
$$ y = [-51246, 33575, -244494, -59210, -101697, -268018, 143300, -318196, 219413, -83839, -160494, -220758, 5490, -338851, 206468, 40969, -222718, 24549, 86310, -148120, -72004, -17819, 87513, -23173, -167003, 14262, 50338, 45676, 207529, 154847, -127560, 113571, -184412, 187867, 32115, -278568, 100818, -90345, -246393, -69893, 34841, -452288, -233376, -41869, 26648, -99728, -10579, 43837, -130538, -66637, 33889, -37259, 141860, -141449, -186283, -119706, 123416, 28551, 168908, 14284, -199880, 107220, -96045, 67936, -103541, -84442, 79319, -111849, 111280, -234460, -182296, -61450, -139833, -58857, -8148, -41650, -25978, 75315, -99009, 95296, 126494, 126343, -124975, 87947, 9523, 19765, -190736, -32902, -255660, 12060, -42354, -56291, 113209]
18087D6542L2212K53446h0399d778o3122j25090A81437b8018I4053J4991l6204
18076G2840a34984D5377K07040B9484i9722B82434a31885B38699J71830j91414
18066B19115G875g6056k2565H8788h9350o187B19507G4382a00537A9001d22129
18054a82098j90478k3519a306H470J7173K60970A34015a62859A10750l7043b44232
18042g1969A79811j9568l0339b6214E8779J00149j9337a40432j93070A39449b2405
18030C1873a11728A2608b19773A9655L513b74708B5959e0183j94708m9911D1043
18018a7211D3986d27338a99999e3866C08712d3774r6941C6279J74817f2594f471
18006a18481d4003j54910B99643g4330F0920a54635C72528j01338A21892j2473
$$ y = [46542, 78754, 332200, -80399, -4778, -67900, -192990, 181437, -28018, 94053, 109044, 72840, -134984, 45377, 252417, 29484, -99722, 282434, -131885, 238699, 410529, 219115, 7875, -76056, -98621, 88788, -89350, -95537, 219507, 74382, -100537, 19001, -422129, -182098, -372576, -396095, -1306, 8470, 25643, 286613, 134015, -162859, 110750, 73707, -244232, -71969, 179811, 160243, 129904, -26214, 58779, 158928, 139591, -140432, -333502, 139449, -22405, 31873, -111728, 12608, -219773, 19655, 23168, -274708, 25959, -50183, -244891, -294802, 41043, -17211, 43986, -427338, -199999, -53866, 308712, -43774, -140715, 36279, 211096, -62594, -6471, -118481, -44003, -198913, 299643, -74330, 60920, -154635, 372528, 271190, 121892, 109419]
17996A09419C16g1125A47034n1483B2610b15716B15828b27562g5339l2171j86646
17985b94156a14173j5374e2599K2363m42767B6949J19040b24801d5022B14299
17974i5773M2363j15914J115A27277n1550g9632b765r1822r3451K6484P5366b8824
17961g6041b3245A56319a33855j19524e2243m3431A95253n4687i2860c4197k70
17950c4467I8889p851B2257b27163f2859k38510f001G9478f058j07194A53347
17938F2282i8180E8630a9192E3932d19056B56053g6243C3158f1650B01009a443
17926A8880Q523O0253P5083a71631I0183j7091k5699J9146e9012B47717i8713
17914a2960l5262j93813A44583c6107n78293g5855b0019m9287A07619a84389E2897
$$ y = [109419, 316, -71125, 147034, 95551, 22610, -215716, 215828, -227562, -75339, -107510, -294156, -114173, -129547, -52599, -30236, -473003, 26949, 145989, -224801, -45022, 214299, -95773, -53410, -169324, -168209, 127277, 75727, -79632, -2765, -94587, -188038, -161554, -86188, -28824, -76041, -23245, 156319, -133855, -253379, -52243, -95674, 195253, 140566, -92860, -34197, -34467, 98889, 91038, 22257, -227163, -62859, -301369, -6001, 79478, -6058, -113252, 153347, 62282, -98180, 58630, -19192, 53932, -419056, 256053, -76243, 33158, -61650, 201009, -1443, 18880, 27403, 87656, 162739, -171631, 90183, 73092, 47393, 66539, -59012, 247717, -98713, -12960, -48222, -242035, 144583, -36107, -614400, -75855, -20019, -69306, 107619, -184389, 52897]
17902a41596l0597A67443d1643h133j27277E2890B1517m762L3052a16778D0594
17890B33526e7372m9570n801r456D4690h3381A86866i3817j52105C38633j56255
17879A82378m8758d2952E7067a42442M4075C00629h8131C79744f4081f016k90438
17868b96454h514p7614a1734D7199c21719B57047e5501A35775E6163J37770a19357
17856b41843M5733R313B51824a48420M7779D46696A13679a51779B33920a51233
17845a6560j43459H1525l3823O2057A0901a09709A89753b23877d0314B37511k1445
17834B16066a88186P8697B01213E2814A8530b2952m1490B03879A2789a9386o5450
17823h4836E6746c6404j93163j91076A79444c86342B26291b51250B16315H8696
$$ y = [-141596, -172193, 167443, -41643, -8133, -135410, 52890, 21517, 16755, 49807, -116778, 40594, 233526, -57372, -106942, -112743, -122199, 44690, -83381, 186866, -93817, -245922, 338633, 182378, 133620, -42952, 57067, -142442, -98367, 300629, -88131, 379744, -64081, -6016, -296454, -8514, -86128, -11734, 47199, -321719, 257047, -55501, 135775, 56163, 193933, -119357, -241843, -196110, -186797, 251824, -148420, -100641, 446696, 113679, -151779, 233920, -151233, -16560, -160019, 81525, 47702, 109759, 10901, -109709, 189753, -223877, -40314, 237511, 216066, -188186, -109489, 201213, 52814, 18530, -22952, -64442, 203879, 12789, -19386, -84836, 56746, -36404, -229567, -420643, 179444, -386342, 226291, -251250, 216315, 88696]
17812i6233A2897c68097A5403a06504M8966j08775k41701C27819a19347A16449
17801C1096a7630r8500j13377C2611g4120I3704d1694E9747A2985a34005d3253
17789A9215R9461b4892k0698l7509m5206A72223G0212K01697k4435a03343M3538
17778e9805k741B52645a70916r2527A70770E0391b3691F6838a13921K6144j29543
17767b17320f0304k93207B17317A4725O0995M97752B36492D5790R1021a24972
17756g8834F2697a87225P5150f312k20730a1584G3954c4643H2449A7740L19110
17745C36850D7890O2456J43583h1682F6827M4950a80821A9408J66049a26950C7674
17733c2592D0424a5175A07724K30311f227r9411A32067i7410c2811m0496G5380
$$ y = [-96233, 12897, -368097, 15403, -106504, -57538, -166313, -408014, 327819, -119347, 116449, 31096, -17630, -116130, -229507, 32611, -74120, 93704, -41694, 59747, 12985, -134005, -43253, 19215, 118676, -24892, -45590, -83099, -128305, 172223, 70212, 271909, 247474, -103343, -59805, -62546, 252645, -170916, -263443, 170770, 50391, -23691, 66838, -113921, -87777, -217320, -60304, -353511, 217317, 14725, 75720, 573472, 236492, 45790, 136811, -124972, -78834, 62697, -187225, -112075, -6312, -227042, -11584, 73954, -34643, 82449, 17740, 336850, 47890, 110346, 253929, -81682, 66827, 111777, -180821, 19408, 185457, -126950, 37674, -32592, 40424, -15175, 107724, 338035, -6227, -105638, 132067, -97410, -32811, -73307, 75380]
17721F2232c01250E087b49741P385C2672O0148a09114A06868E3145i612j63010
17710a72622A22241b15524d0551H6063J655k0796J609J0404J9583b16367I682
17698f0854A82230c6894n585I9361a72838A12994h9411c7468A87937R3879a19461
17686f3001e566I3823c03288a49306A921L78741i9767l7012c3534k5604l2695
17675i1833d1705j67105A26353C3300a30794k4990c8936A5435M9652J3609e7500
17663b4668o148A30873f1625O305A99166n2706p1647a3268A55717k4025j5026
17652A16666j5266L0889J29146P7631a50088L4852A51943h2620A69780C097K0984
17641B4081O2994P8301b31281G678K88879j34415g9414j10287f894C07485A10762
$$ y = [62232, -301250, 5087, -249741, -242356, 32672, 92820, -109114, 106868, 53145, -9612, -172622, 122241, -215524, -40551, 86063, 87718, 66922, 68531, 78935, 98518, -216367, 9682, -60854, 182230, -36894, -42479, 99361, -172838, 112994, -89411, -37468, 187937, 281816, -119461, -63001, -5566, 93823, -303288, -149306, 1921, 380662, -99767, -136779, -33534, -59138, -91833, -41705, -208810, 126353, 33300, -130794, -155784, -38936, 15435, 65087, 78696, -57500, -24668, -30816, 130873, -61625, -55320, 199166, 146460, 74813, -13268, 155717, 131692, 116666, 101400, 132289, 261435, 339066, -150088, -115236, 151943, -82620, 169780, 3097, 24081, 87075, 165376, -231281, 7678, 296557, 162142, -79414, -189701, -6894, 307485, 110762]
17629A50137G3920A8230R7032B8802J42665A0864b39351A48447b01030A380J23578
17618A24958J60799a60155P0936E9694Q2157a40579j04017O4804A94299h4477
17607e762G1571f6856A81849J14774H6291g3144A99623P8047K3774a02466A38388
17595e6104j09359J2115q5037a8242A05952f5190r0729A33088J87296C2918f4783
17583h3259j67120B23517b11198B74821A12567a63658A10122k1669b21460g406
17572A08111E3907K72082A59199B7804L7874a82142A14373N9794b14006B0642
17561d56631a56897d8248C73459a05292C18423g400k93908A47943D8396H666J47155
17550A55821a57577A80678K5441b1284l33640a21866J4289A22608J35258D9667
$$ y = [150137, 73920, 18230, 115262, 28802, 171467, 10864, -239351, 148447, -201030, 1380, 124958, 285757, -160155, -89219, 59694, 141851, -140579, -244596, -179792, 194299, -84477, -5762, 71571, -66856, 181849, 296623, 86291, -73144, 199623, 277670, 301444, -102466, 138388, -56104, -165463, -153348, -238385, -18242, 105952, -65190, -155919, 133088, 320384, 32918, -64783, -83259, -250379, 223517, -211198, 274821, 112567, -163658, 110122, 88453, -221460, -7406, 108111, 53907, 325989, 159199, 27804, 65678, -182142, 114373, 174167, -214006, 20642, -456631, -156897, -48248, 373459, -105292, 318423, -7400, -301308, 147943, 48396, 8666, 155821, -157577, 180678, 206119, -21284, -354924, -121866, -107577, 122608, 257866, 49667]
17539b53267i5051H1598M47509C1732M3222a48899E7759b7184C14759I6550C9308
17527a6095k7888A20481O9173e3582n1140j74126C8719b12902J00903A5466K16943
17516B32409a03934A98009K15259n4240j25602b04424A72587c85231c676A03575
17505A08029O124L6292h9445A09603B9046M5990A7781N2963d1202j39011B56925
17493A21184J52734l4181A13326E3620P9287B1560a26098E8118K97037C9775L8522
17482G8297a73784F0492J83536B3345J33837c2479q0031A26809n3053N0285K46284
17471C70325A29884j9602h027A7595J33383n2131O757h8491A34911l2368a91152
17459G6150B6153R3782b2153p9340A39372J30327F9850K1732A9018K47508q8675
$$ y = [-253267, -95051, 81598, 529107, 31732, 74954, -148899, 57759, -27184, 314759, 96550, 39308, -16095, -43983, 120481, 189654, -53582, -104722, -278848, 38719, -212902, -111999, 15466, 232409, -103934, 198009, 413268, 359028, 233426, -204424, 172587, -385231, -3676, 103575, 108029, 114153, 150445, -89445, 109603, 29046, 75036, 17781, 70744, -41202, -180213, 256925, 121184, 273918, 239737, 113326, 53620, 132907, 21560, -126098, 58118, 355155, 39775, 78297, -173784, 60492, 244028, 23345, 157182, -32479, -112510, 126809, 73756, 124041, 370325, 129884, 110282, -8027, 17595, 150978, 98847, 105604, -88491, 134911, 102543, -191152, 76150, 26153, 119935, -22153, -101493, 139372, 269699, 69850, 91582, 19018, 266526, 177851]
17448A77851K0720J08639Q9036j5567I4454L1400f8612D11949A81688J67796J59196
17437E08680B32138p474H311J43438P4018E1091J26384a42795E70399k56260j0316
17426C03823A22299J0290A4281P5647J43401L6575A14777K32529H6491K40035
17416C26526Q1014A50399J13735O1338j56307P8263J41002a3329A10178J15491
17406B25669l7243a23855B88435o0802D3426e1654C55109b10167P3470k23780
17396c60477A5136b6676E4073L91790E9395M4658c7741B76674D7214L5032K67160
17385C49406A53270a13679d3905E5877q916R5921O1249M3756e8035m613D3793
17373A23091D8319J43441b4766B80900A1189Q6131J60537I9033a15366F5379K85485
$$ y = [177851, 198571, 307210, 396246, 380679, 94454, 125854, -68612, 411949, 181688, 349484, 508680, 232138, 224664, 8311, 151749, 225767, 51091, 177475, -142795, 570399, 314139, 303823, 122299, 132589, 14281, 89928, 233329, 269904, 114777, 347306, 86491, 326526, 407540, 150399, 264134, 325472, 169165, 247428, 388430, -13329, 110178, 225669, 188426, -123855, 288435, 227633, 43426, -51654, 355109, -210167, -136697, -360477, 15136, -26676, 54073, 445863, 59395, 104053, -37741, 276674, 47214, 82246, 349406, 153270, -113679, -43905, 55877, 46961, 142882, 204131, 247887, -58035, -62648, 43793, 123091, 48319, 191760, -24766, 280900, 11189, 97320, 257857, 99033, -115366, 65379, 350864]
17362C50864A00839m3956L39698A50459M53380B06978L3596j07413n0991a52615
17351A19981d5683B6337J95427F5171Q9797J61447j41081J28612A24285l7365
17341H6920K38585a51165G9370K05778a33413A41882J79225b38268L722B75410
17330G8886J0291J52314q4558C0283J11676o4044J51786k8355O7928C3219J84204
17319B17423K25331j80054C8892J32817a56653F7148K02598j4509q9408P9509
17309B45338b37441A76463m4274o480a2958k63996A39270J67526R0167G0763f135
17297d1691A53720L74639B116a7396A24842J20642o729H9267l1457P5405M88059
17286F21274e1652j71889g0296C00939K3225B8945K4153K5814M2654m2584O0778
$$ y = [350864, 100839, 56883, 396581, 150459, 603839, 206978, 240574, 133161, 82170, -152615, 119981, -45683, 26337, 221764, 65171, 154968, 316415, 175334, 303946, 124285, 86920, 325505, -151165, 79370, 285148, -133413, 141882, 321107, -238268, -234546, 275410, 78886, 89177, 241491, 156933, 30283, 141959, 77915, 229701, 201346, 269274, 33219, 217423, 442754, 262700, 38892, 171709, -156653, 67148, 269746, 255237, 165829, 245338, -237441, 176463, 132189, 125709, -12958, -276954, 139270, 306796, 396963, 70763, -6135, -41691, 153720, 528359, 2116, -17396, 124842, 245484, 238755, 89267, 57810, 133215, 621274, -51652, -223541, -70296, 300939, 324164, 28945, 53098, 78912, 121566, 78982, 139760]
17275A39760J35265q3888B1987j45Q5780o852L02292C7052K05096K1715l5880
17264B27983n9297P255N3504o2290K04978j24440b0228C8269J90739G9981J62080
17253B42061g8826D62312A32173K82571j77673J01315j64943b23186C58278B6306
17242B97140p1794K05967j88024A09966O3304R8665J46931H0203a01344D20696
17231b98172B00026p9327P9473a34883H4586K07274n0810q130n7876J52598r5499
17220B32143H1279M2579a2411A7450K28995j16958l429c1826A17974J26536m0704
17209B03806M0574A01235K54218j51861C7887M42806j07313K62354k98174A58619
17198A30711C5324L92985m0520G8779M25670m4452a69586C41587F6324O47414
$$ y = [139760, 275025, 191137, 21987, 21842, 107622, 100770, 403062, 37052, 242148, 263863, 227983, 168686, 175941, 229445, 167155, 372133, 247693, -20228, 38269, 229008, 79981, 242061, -78826, 462312, 132173, 414744, 237071, 338386, 173443, -223186, 358278, 26306, 297140, 225346, 431313, 243289, 109966, 173270, 271935, 418866, 80203, -101344, 420696, -298172, 200026, 120699, 200172, -134883, 84586, 291860, 241050, 232920, 175044, 327642, 232143, 81279, 123858, -12411, 17450, 246445, 129487, 126058, -31826, 117974, 244510, 203806, 244380, 101235, 355453, 203592, 37887, 480693, 373380, 635734, 337560, 158619, 130711, 35324, 428309, 387789, 78779, 504449, 459997, -169586, 341587, 66324, 713738]
17188G13738I6017M2533f5199D72398B0011J92786H4654J54587g239H5641L42716
17177D28357j33840K3888K9467N3815j84914F0049L5611Q6257Q315J07327A22195
17165A65243N2780J46931b9544A57063F3663J67816o8080J10090J48397E8724
17154A04377K70085j34685R7039q3470D6235L6152J02025e263B86487R3679A57151
17142B62476l3298L30272n0247A06836L05237n745r5733h736B84840O6574N620
17131C57034K78857k47253j86280J1303k6300L4934J2368l4850Q7771K09300A75501
17119D48222K9310k29056J22545i8185D03166j69822N4711J75942B14219K90267
17109E04486A40763K82597M8882j67486M0828O11675A64392K49728M6279M0735
$$ y = [713738, 96017, 138550, -65199, 472398, 20011, 212797, 84654, 239241, -7239, 85641, 428357, 294517, 318405, 347872, 401687, 216773, 60049, 95660, 181917, 190232, 297559, 122195, 165243, 218023, 364954, -29544, 157063, 63663, 231479, 163399, 273489, 421886, 58724, 104377, 374462, 239777, 336816, 253346, 46235, 82387, 184412, -5263, 286487, 380166, 157151, 262476, 229178, 559450, 509203, 106836, 412073, 406328, 310595, -8736, 284840, 351414, 357034, 635891, 388638, 202358, 213661, 187361, 222295, 234663, 199813, 287584, 496884, 175501, 448222, 477532, 248476, 371021, -98185, 403166, 233344, 288055, 463997, 214219, 504486, 140763, 423360, 472242, 304756, 345584, 957259, 164392, 414120, 460399, 501134]
17099E01134k4003j13128L24428k60920Q1811P2702A86651K67879L20787B88134
17088E06093j01339n763L2777N9838B23692J45149J66022p9750J08165k74029
17078B89249J2802J00696k3852m7602j12739K57823B04133L8363E1400K81431
17068C32831j23267J64744J83419j8325J27575P0750l15562l3989O3905K65054
17058G17135l11952R2296A70981K19879r1680J94415K54192k38961j24415J71056
17048E55467A97462J64340O7559J25757j50236m8402A74728N45592j03129j39814
17038D77377N09876A76208O3253J10679J70716j79897M58813j97215j33047j10381
17028C59129L29877j99058Q4677J36462B82993N42290k11897m4577L2064k20269
$$ y = [501134, 477131, 364003, 688431, 427511, 509322, 582024, 186651, 454530, 775317, 288134, 506093, 404754, 398991, 431768, 491606, 223692, 368841, 534863, 455113, 563278, 289249, 302051, 402747, 378895, 331293, 218554, 476377, 204133, 242496, 51400, 332831, 209564, 374308, 557727, 539402, 666977, 737727, 422165, 388176, 452081, 717135, 405183, 497479, 170981, 390860, 299180, 493595, 747787, 508826, 384411, 555467, 197462, 361802, 429361, 555118, 404882, 356480, 174728, 720320, 617191, 477377, 987253, 176208, 239461, 350140, 520856, 340959, 799772, 602557, 469510, 359129, 689006, 489948, 574625, 711087, 282993, 825283, 613386, 568809, 600873, 380604]
17018C80604L82458k36994K93877k35609K31906k67330R1672K85923L4608D55552
17007D24726J43075J22854j76693L31783C93985M35384k78102l6101L0896j06466
16997D39596J94728M6044N3166J4711J952J99378k34162j73893J26387J5845J2690
16986F96442l591p3849n9694J74339L33347m76016J21439K592K90139l28444P0180
16975G46884l9468J15488j3013K72772k79476j92294M42451j15370k00314j45755
16965E91905L89204l0653j6647K27925k1711j04554O9252M2562l42926L55440
16955A159797j75688k32192L50910O9224O2331J39391l64681R9323O9047j7501
16945A159961K18112m02717j89361L12021J89483n5796r5819k64828J42703J14624
$$ y = [380604, 763062, 526068, 819945, 584336, 816242, 548912, 640584, 926507, 961115, 455552, 424726, 567801, 690655, 513962, 845745, 393985, 829369, 551267, 515166, 546062, 439596, 634324, 680368, 733534, 748245, 750197, 949575, 715413, 541520, 667907, 683752, 696442, 692851, 619002, 559308, 733647, 1066994, 590978, 712417, 715009, 1005148, 676704, 746884, 707416, 822904, 809891, 1082663, 803187, 610893, 1053344, 937974, 737660, 591905, 981109, 950456, 933809, 1161734, 1140023, 1035469, 1104721, 1147283, 804357, 1159797, 984109, 751917, 1102827, 1172051, 1234382, 1373773, 1009092, 1108415, 1177462, 1159961, 1378073, 975356, 785995, 1098016, 1287499, 1231703, 1135884, 871056, 1013759, 1128383]
16935A128383p8088M74577p01753K69341M6337q1424j11322N8306K04028K30572
16925A438957m36173K82478j43221J49678j4740R6109j04615J57581l8783o9581
16915A317690J29713J95280k54723K79973p8034k9158k23325K48902k5228K5036
16905A586126K41111k38545L7994K07595K917N0695j39459q5205P545J74095m7761
16894A797108l25482K17158J26944J54685J98558n05522L33706k47705q8583L09842
16884A970709j12625M15443m56361K31040J53058o7081m6028J46232J23586l06482
16874B051491J43656K9896j27627K08922N9201k5558K07323P8789l02416K17673
16864B541350K68190n35685M82148N2675j9061j57573J20728L7279L7185J49247
$$ y = [1128383, 1050295, 1524872, 823119, 1092460, 1138797, 1057373, 946051, 1004357, 1208385, 1438957, 1002784, 1285262, 1142041, 1291719, 1276979, 1373088, 1268473, 1426054, 1387271, 1317690, 1447403, 1642683, 1387960, 1667933, 1589899, 1560741, 1337416, 1586318, 1561090, 1586126, 1827237, 1588692, 1626686, 1834281, 1837198, 1887893, 1748434, 1663229, 1670774, 1844869, 1797108, 1471626, 1688784, 1815728, 1970413, 2168971, 1663449, 1997155, 1749450, 1660867, 1970709, 1858084, 2273527, 1817166, 2048206, 2201264, 2134183, 2088155, 2234387, 2357973, 2051491, 2195147, 2225043, 2097416, 2306338, 2365539, 2339981, 2547304, 2626093, 2323677, 2541350, 2809540, 2273855, 2756003, 2808678, 2789617, 2632044, 2752772, 2790051, 2827236, 2976483]
16854B976483k18018R3290K88104n3331J02537K87780k10279j69443j00916P53590
16844C749797m46200n826K79741J04173k2368Q055O3139J10234M1422K5085p416
16833C899836K26026j76756M46325J42648l5882J92539j55346K09773j88525L05451
16823D866089J97056Q4982k50292K78487Q438K16186L04129J77794n8355j12043
16813E712471o0113N12658N3852K72219Q2182O7537L89556J6375j62932K06941
16803G090746L89170J8971J84827K07342K00817r6580J59504L41417L48742K36210
16793I081166L95778n6957L75617J94042L40217N26212L73363k25599L96741M93032
16783A1893612L15771J26565Q36289O5886L10799O97483L46208M97306N33018
$$ y = [2976483, 2758465, 2851755, 3139859, 3086528, 3189065, 3476845, 3266566, 3097123, 2996207, 3749797, 3303597, 3297771, 3577512, 3681685, 3659317, 3667372, 3730511, 3840745, 3882167, 3907252, 3899836, 4125862, 3949106, 4395431, 4538079, 4502197, 4694736, 4539390, 4749163, 4560638, 4866089, 5063145, 5148127, 4897835, 5176322, 5184760, 5400946, 5705075, 5882869, 5824514, 5712471, 5652358, 6165016, 6218868, 6491087, 6573269, 6640806, 7030362, 7046737, 6883805, 7090746, 7479916, 7498887, 7683714, 7891056, 8091873, 7995293, 8154797, 8496214, 8844956, 9081166, 9476944, 9419987, 9795604, 9989646, 10329863, 10856075, 11229438, 11003839, 11400580, 11893612, 12209383, 12335948, 13172237, 13238123, 13548922, 14246405, 14592613, 15089919, 15622937]
16774A5622937L37459N50711M46003O98084O41210M09475R30327M29954R42908
16765B1009068M68779J102247O20097Q66569J270099R92346P43958J187330J118905
16756B9379398J602222J708999Q84110J620662J459980K127578J727521J710279
16748D2220749K297403K055999K594429J880158K931297K747729L049456L113293
16740F2890513L131760L682526L765776L949673M306286M016456M598491M704634
16732I5046115M851109M657010N040616N075894M888207M983451M965324M238923
16724A33746649L892142L647209K579659K364125J610462J020537J29004m57376
16716A48532411j534702k462127k882517l454655l853791m533701m354552n053962
$$ y = [15622937, 15960396, 16511107, 16957110, 17655194, 18296404, 18705879, 19636206, 20066160, 21009068, 21477847, 22580094, 23200191, 24066760, 25336859, 26329205, 27073163, 28260493, 29379398, 30981620, 32690619, 33574729, 35195391, 36655371, 38782949, 40510470, 42220749, 44518152, 46574151, 49168580, 51048738, 53980035, 56727764, 59777220, 62890513, 66022273, 69704799, 73470575, 77420248, 81726534, 85742990, 90341481, 95046115, 99897224, 104554234, 109594850, 114670744, 119558951, 124542402, 129507726, 133746649, 137638791, 141286000, 143865659, 146229784, 147840246, 148860783, 148989787, 148532411, 146997709, 144535582, 141653065, 138198410, 134344619, 129810918, 125456366, 120402404]
16708A20402404m815456n278812m974024n010287m868773m781312m460965m360232
16700H1852543m521581l769655l752244l958729l243751l236285l022064k626114
16692E3722120k477905l053641j690353k340861k297574j837009j908855j541512
16684C6574410j838552j359104j560602j461903r09870j347222j344851q59688
16676B5892618j082698j172336q71520o29312r03385r76237j99898j026651n79652
16667A8450929o17724n94128n40083p73473p12617p89o73578m59993k39511n11219
16657A3327814n19788m77742l85884k35814m09435k74359j50759n65478m9282
16648A0259273p31430J86790l30543k92984m93514j75137j19181m9533j82082
$$ y = [120402404, 115586948, 110308136, 105334112, 100323825, 95455052, 90673740, 86212775, 81852543, 77330962, 73561307, 69809063, 65850334, 62606583, 59370298, 56348234, 53722120, 51244215, 48190574, 46500221, 44159360, 41861786, 40024777, 38115922, 36574410, 34735858, 33376754, 31816152, 30354249, 29444379, 28097157, 26752306, 25892618, 24809920, 23637584, 22766064, 22136752, 21233367, 20257130, 20057232, 19030581, 18450929, 17833205, 17239077, 16698994, 15925521, 15212904, 15212115, 14538537, 14078544, 13839033, 13327814, 12808026, 12330284, 11944400, 11708586, 11299151, 11024792, 10874033, 10308555, 10259273, 9527843, 9714633, 9384090, 9091106, 8597592, 8422455, 8303274, 8253741, 8071659]
16639H071659j89680j14605m42266j24519K6487m70348K7195k42386j38096k12199
16629F191242J71781j21860l14913J38997l74437k40698j14880J86320l12318
16620E209234j32967n1381j50873j26567J02665j0195K34088n99579k74712p2836
16610D126877Q0798j04097K53956k73842k00229J5512n2610k08118p2066J85133
16600C751314k85821Q6101k17794K03888n12351M07232m51403L34421k51522J71046
16590C235111k00840j204J9710j57520j70794K02541k7466k9702n1659J44524
16580B962701l20294k43054J93401J50429j44776J7666l48288J97840r6728q1925
16570B286972J76545m95503L61914k80266N3541j15263R8475m3863l22624j37102
$$ y = [8071659, 7881979, 7767374, 7325108, 7200589, 7227076, 6756728, 6783923, 6541537, 6403441, 6191242, 6363023, 6241163, 5926250, 6065247, 5690810, 5450112, 5335232, 5521552, 5209234, 5076267, 5024886, 4874013, 4747446, 4850111, 4839916, 5074004, 4474425, 4199713, 4126877, 4207675, 4103578, 4357534, 4083692, 3883463, 3898975, 3846365, 3638247, 3566181, 3751314, 3465493, 3551594, 3333800, 3537688, 3025337, 3432569, 2981166, 3315587, 3064065, 3235111, 3034271, 3033067, 3052777, 2895257, 2724463, 2927004, 2899538, 2869836, 2818177, 2962701, 2642407, 2399353, 2592754, 2743183, 2598407, 2616073, 2267785, 2465625, 2368897, 2286972, 2463517, 1968014, 2329928, 2049662, 2103203, 1987940, 2086415, 2042552, 1719928, 1582826]
16560A582826N89489j69560K07267l26181N3734j20330M32596m97411j77568L54807
16550A929669l07421k53297K46149K87380o3358j20689k75227K00572l00921R9919
16540A442776J00773P3278k15476R75k727l54740O52661j87524l65238J50344
16530A295102J1576K48105l63704J05367J50184r7865j23621j0532J88304o6135
16520A336781Q6539k55977P348N2899j25248J31568J04982m29859K37996K14711
16510A361740l33570J38800l051J31572n8067m34481J31308l4730J20949J46086
16500A166556m20970P9970K91283K09998l10024O7009j90080R3183r8590m08652
16490D79683M08715l805J71754k45678N8138J64870k68873L84509l2339n47257
$$ y = [1582826, 2172315, 2002755, 2210022, 1883841, 1937575, 1817245, 2249841, 1752430, 1574862, 1929669, 1622248, 1368951, 1615100, 1902480, 1839122, 1718433, 1443206, 1643778, 1342857, 1442776, 1543549, 1616827, 1401351, 1402326, 1399599, 1044859, 1697520, 1509996, 1144758, 1295102, 1306678, 1554783, 1191079, 1296446, 1446630, 1348765, 1225144, 1214612, 1402916, 1336781, 1423320, 1167343, 1174691, 1227590, 1102342, 1233910, 1338892, 909033, 1147029, 1361740, 1028170, 1166970, 1163919, 1295491, 1237424, 802943, 934251, 899521, 1020470, 1166556, 745586, 825556, 1116839, 1326837, 1016813, 1083822, 893742, 986925, 888335, 479683, 888398, 884593, 1056347, 810669, 868807, 1033677, 764804, 1149313, 1116974, 569717]
16480E69717K75012j46177K17598J66526m45757J4645K38018k02373J30819R4975
16470I13003l38362N64888m73843K4317J06042J14214J40378l74846K80990j97808
16460G58973n7369k14502K91501J82301k80900n8930j48133M52672l7063k32792
16450F55758j93567K43897p089B70329N10291j07057m2189j49892M20604j05135
16440G96951j87231k93104J86427o4086j15427m9389J98669L6913j5542o5474
16430D28707P8939o7352M44519l30113l2824J30407j35694P8287j56031J11357
16420E50202P4634j58627J41674B19762J31911K93360J531l9121Q1675k90020
16410C99098J73000j17320q6666o6251J68034J50970Q6440r8485A18402L83420
$$ y = [569717, 844729, 698552, 916150, 1082676, 636919, 651564, 889582, 687209, 818028, 913003, 574641, 1139529, 665686, 690003, 796045, 910259, 1050637, 675791, 956781, 758973, 701604, 487102, 778603, 960904, 680004, 621074, 472941, 925613, 888550, 655758, 462191, 706088, 698999, 270329, 780620, 673563, 631374, 481482, 902086, 796951, 609720, 316616, 503043, 438957, 323530, 274141, 472810, 509723, 494181, 428707, 507646, 440294, 884813, 554700, 521876, 652283, 516589, 594876, 438845, 550202, 624836, 466209, 607883, 219762, 351673, 645033, 646564, 607443, 689118, 399098, 572098, 454778, 368112, 301861, 469895, 620865, 707305, 608820, 118402, 501822]
16400E01822L2118j16586k1659K45816B31974K60352O3251k39006M80122j68162
16390F28531k54731O524p2279F5153M51887j85017l3944N6089P5890B13994M3628
16379B57622L13577k68473K3563K43972J09107k93218J44276l8211j08094P8856
16369D62977O6016J79482C33281J42002F3739J30460L32932L18576B54160d1259
16358F85904C2703L47481A30929n4927L56488r7735J16936B10348I8197O04909
16348G03106l43941j58139I2596J40322o4821J14331k3611p954K1892j30123M6795
16337A89427k3373L8691F6872L71260j76039q5535J14457m8078A07222L09020
16327D16242A75525l1665R0244A16394j6472a589D25482a8987c012B73572l1799
$$ y = [501822, 533940, 417354, 395695, 641511, 231974, 492326, 555577, 316571, 796693, 628531, 373800, 380324, 308045, 65153, 517040, 332023, 298079, 354168, 430058, 213994, 257622, 571199, 302726, 326289, 570261, 679368, 386150, 530426, 492215, 384121, 462977, 528993, 708475, 333281, 475283, 63739, 194199, 527131, 845707, 254160, -41259, 685904, 32703, 380184, 130929, 76002, 432490, 334755, 451691, 210348, 98197, 703106, 359165, 201026, 92596, 232918, 168097, 282428, 258817, 250863, 272755, 142632, 189427, 166054, 204745, 66872, 438132, 262093, 176558, 291015, 242937, 107222, 416242, 175525, 143860, 234104, 116394, 99922, -1589, 425482, -18987, -3012, 273572, 241773]
16316B41773M25996c56150A55323o8541M0608L19922p096B2600L12697d2564J4509
16305b8055C30490j64677K39514g0782A45816J50382N7746G7989K57738a97443
16294f5073D06811k6835C5827N86958B40749K10374F7213J42191D9562K22687
16284B72249O9924P5002I2182L55993G8929R1069p8243L31699b5191C23017r8627
16273B24390a527p6706A59997L66194A4493K77630a10092A3628Q8618M62262D6171
16261A22778J88716k7696b6614C05607J81000j14320k0905A52416b4043n732B58324
16249I2443K73861A31533K36960E0665K40210l682j35771e4669C47408l6950r9913
16238B10545K02045a31063D05790j27484K4593j25566b4378A69073o4560K67203
$$ y = [241773, 667769, -356150, 155323, 86782, 127390, 447312, 440216, 22600, 335297, -42564, -28055, 330490, 165813, 405327, -70782, 145816, 296198, 353944, 77989, 335727, -197443, -65073, 406811, 379976, 35827, 622785, 240749, 451123, 67213, 209404, 49562, 272249, 342173, 417175, 92182, 448175, 78929, 169998, 91755, 423454, -25191, 323017, 224390, -1527, -78233, 159997, 526191, 14493, 292123, -110092, 13628, 102246, 564508, 46171, 122778, 311494, 283798, -26614, 305607, 486607, 372287, 351382, 152416, -24043, -29775, 258324, 92443, 366304, 131533, 368493, 50665, 290875, 287193, 151422, -54669, 347408, 310458, 210545, 412590, -131063, 405790, 278306, 302899, 177333, -24378, 169073, 104513, 371716]
16228C71716j31230J34671A33754J13409j13164F0612J51806J42731A28302g1685
16217a34296B29818a60902A39846J45446j12725g294j28543D11717f9868C45272
16206C01359j23256F5023J91416F6719g4217F5194j4469h4579B06321C4110J0498
16195D4608a39340b3113B09070j6221G5065l7371A1792h7863A74836D1298A4962
16183f7437A67316j8268K66513b305B62611f9960b8456A03208q073c45375B89684
16171g1036C0805g1693A76432n5014J06292d1354A81906A9099O9181B7685R707
16160C7392a04563H3163j1835J97672H5364a49628A9854a06138K544A17628f50
16148B91970E7508d4163j09076A50955J139o3053j3732B2575Q5665O9476J05306
$$ y = [371716, 240486, 375157, 133754, 247163, 133999, 60612, 212418, 355149, 128302, -71685, -134296, 229818, -160902, 139846, 285292, 172567, -7294, -135837, 411717, -69868, 345272, 301359, 178103, 65023, 256439, 66719, -74217, 65194, 50725, -84579, 206321, 34110, 44608, -139340, -23113, 209070, 192849, 75065, 37694, 11792, -87863, 174836, 41298, 14962, -67437, 167316, 149048, 415561, -2305, 262611, -69960, -28456, 103208, 95135, -345375, 289684, -71036, 30805, -71693, 176432, 121418, 227710, -41354, 181906, 19099, 88280, 27685, 37392, -104563, 83163, 71328, 269000, 85364, -149628, 19854, -106138, -103594, 117628, -650, 291970, 57508, -44163, -153239, 150955, 152094, 89041, 75309, 22575, 108240, 177716, 283022]
16137B83022d1969c709I3473P0404d0134B99181A48815h9708H4358b30017h725
16125B28158A10397a98962O8803M9734A03398g899A71090f94F0757a20876C37133
16113A82572c6880A78306k937b02870A19215j4313O7044R7140j18833R6829g1824
16101h2451B78498M9382A11122L01284f7321l5642p1816I3678k0565l5338L1557
16090F9332o893a48870M8548A18572h7717E2199K56104r3374g1483I3639B1088
16078h6594D36230a07074B05575c75931G7192a83923A80049h8826M1540A90436
16067e0689C21317r2252b42718b5520l3439b4142n0573C02033b28258I0284A4291
16055C72477g8841I3716B9597a55684A2201P0844k7913b67465A48051a04620j53857
$$ y = [283022, -41969, -3709, 93473, 163877, -40134, 299181, 148815, -89708, 84358, -230017, -8725, 228158, 110397, -198962, -130159, -80425, 103398, -7899, 171090, -694, 60757, -120876, 337133, 182572, -36880, 178306, 175369, -202870, 119215, 104902, 171946, 269086, 150253, 247082, -71824, -82451, 278498, 327880, 111122, 412406, -67321, -102963, -174779, 93678, 73113, 37775, 69332, 62439, -148870, -100322, 118572, -87717, 52199, 308303, 214929, -71483, 93639, 21088, -86594, 436230, -107074, 205575, -375931, 77192, -183923, 180049, -88826, -47286, 190436, -50689, 321317, 229065, -242718, -25520, -58959, -24142, -74715, 302033, -228258, 90284, 14291, 372477, -78841, 93716, 29597, -155684, 12201, 83045, 55132, -267465, 148051, -104620, -258477]
16044b58477D0757h3679r1734B62294a03002r682A94167F7474g2469J6918p9519
16033a35070A07079a48774A38082a14450E31857D1237a79027E0779K53160A46816
16022g6598H1133L56519A99811a44272B13148a74336d1666I1252D4655a71076
16011f4094a989B09524f5460F0978c39670l4329g1733j7454A6902a30998M4802
16000h6196B57707c5394q4433k6982n6169B5052L4252f2690A27573a0409j75386
15989a85795j5543B01193g1292A06826K897A8864J32068J36296K561j18822F4378
15977d6954B94815a7505Q155r3386G2623c05375c2846k6016A40717E8414b12485
15965D6128h5531A63784h2545E1016L04824a13001D76691a95921I3483J44852
$$ y = [-258477, 40757, -83679, -175413, 262294, -103002, -112684, 194167, 67474, -72469, -55551, -135070, 107079, -148774, 138082, -114450, 531857, 41237, -179027, 50779, 303939, 146816, -76598, 81133, 437652, 199811, -144272, 213148, -174336, -41666, 91252, 44655, -171076, -64094, -1989, 209524, -65460, 60978, -339670, -373999, -71733, -89187, 16902, -130998, -86196, 257707, -35394, -119827, -146809, -202978, 25052, 59304, -62690, 127573, -10409, -185795, -201338, 201193, -71292, 106826, 109723, 18864, 150932, 287228, 289789, 170967, 64378, -46954, 294815, -17505, -9350, -102736, 72623, -305375, -32846, -58862, 140717, 58414, -212485, 46128, -85531, 163784, -82545, 51016, 355840, -113001, 476691, -195921, 93483, 238335]
15955B38335J86799A9477O9155K2337J98504C3130a75986I7227a47733j36658
15945b84391P5485A88544a96512R4641B00304a47225A92270g7560A79412l5133
15935A44279c09812K9899l2218c1314p5921l8227R045c465k41249D6331g1417
15923A24303J2920a08012j97528H7680L0840q356a01702B97440A35245e0283k62505
15912c12788B6512K14679a42796e9692o7886c9818o4704k4336A74358R6025c7659
15900A04478J82691q8834J19888e6243J1365F1508K17400C7636g2331B27325a31910
15888b39804C59392b6543o5209o3489L0855l6504B7007f1793q4940I6092h5256
15876b29961l732i6687Q50A61995b01740L733B34005b62292A88603a053k19561
$$ y = [238335, 425134, 19477, 88632, 110969, 309473, 33130, -175986, 97227, -147733, -284391, -208906, 188544, -196512, -101871, 200304, -147225, 192270, -77560, 179412, 144279, -309812, -279913, -312131, -31314, -107235, -145462, -136417, -3465, -244714, 46331, -71417, 124303, 137223, -108012, -305540, 87680, 118520, 110164, -101702, 297440, 135245, -50283, -312788, 26512, 241191, -142796, -59692, -127578, -39818, -104522, -128858, 174358, 270383, -37659, 104478, 287169, 198335, 318223, -56243, -44878, 61508, 278908, 37636, -72331, 227325, -131910, -239804, 359392, -26543, -91752, -155241, -124386, -160890, 27007, -61793, -146733, 96092, -85256, -229961, -233693, -96687, -95837, 161995, -201740, -198007, 234005, -262292, 188603, -1053, -220614]
15865b20614C7298J03850l3277a70040l116H028b15193L3235h8527B98742c5567
15853C3595N9686A1749J45320e4343a0500A36368a20236C33514a04015A85704
15842G2711a46451L4943H689f9933D3659b11018A53203a2428G7939d198A84073
15830a69045j39452G2395a15601j41508J8547d5494A52681a99775J9966A79651
15819a1951A03903c19759D9236J4508b94325A37101f7656k5048A47149C6621c13409
15807d01812G4734d6937q4349A93483a47909B2185c31248a46783j67320f7756
15796i832j60495H1222K64501b84126J06687A24438a22691N3576d377j98799R5873
15785a07303E877J80973n8028K22296b84994G4915b45558A037b12915p6925a5681
$$ y = [-220614, 37298, 141148, 107871, -170040, -173156, 8028, -215193, -181958, -88527, 298742, -35567, 33595, 93281, 11749, 157069, -54343, -10500, 136368, -120236, 333514, -104015, 185704, 72711, -146451, -111508, 8689, -69933, 43659, -211018, 153203, -12428, 77939, -4198, 184073, -169045, -308497, 72395, -115601, -257109, -238562, -45494, 152681, -199775, -179809, 179651, -11951, 103903, -319759, 49236, 63744, -294325, 137101, -67656, -92704, 147149, 36621, -313409, -401812, 74734, -46937, -131286, 193483, -147909, 22185, -331248, -146783, -314103, -67756, -9832, -170327, 81222, 345723, -284126, -177439, 124438, -122691, -69115, -4377, -203176, -107303, 5877, 186850, 128822, 351118, -284994, 74915, -245558, 1037, -212915, -289840, -15681]
15773C17769e7318k649j0808j11337R071I1942k4928E725c45129B00551r1082
15762A09469b04421e3628I4122p953e7853B40287e8453k47104J31903G5945b07701
15750e2630J1860A820N0618a30537B90859b35220A03482a15394j16907g7843B0103
15738A17645D2740j373J46490c65431B41110c2999A28409J31632a52474p4423
15728b26897B7322f3007k1052C26119c4349A21420J8193a12503J4398A56676h0608
15716B49349a7994j28856A12105K2592b3067j87903I332a30961A1130Q4683b7535
15704A83656a31191F2304K52339a19330A09838i1190A43360a66055r6587C53134
15693h9797c4432I5103J36383g8863K7757j8281C1502J0023e3647p0405E8893
$$ y = [317769, -57318, -59967, -70775, -182112, -173041, 91942, 67014, 5725, -345129, 200551, 109469, -204421, -53628, 94122, 86169, -57853, 240287, -58453, -305557, -173654, 75945, -207701, -52630, -40770, 1820, 52438, -130537, 290859, -235220, 103482, -115394, -232301, -77843, 20103, 117645, 42740, 41367, 187857, -365431, 241110, -32999, 128409, 260041, -152474, -226897, 27322, -63007, -84059, 326119, -34349, 121420, 139613, -112503, -98105, 156676, -80608, 249349, -17994, -146850, 112105, 134697, -23067, -210970, 9332, -130961, 11130, 95813, -27535, 183656, -131191, 62304, 314643, -119330, 109838, -91190, 143360, -166055, -262642, 353134, -89797, -34432, 95103, 231486, -78863, -51106, -69387, 31502, 41525, -53647, -124052, 58893]
15681c30507C42897B5420b18354R8326e6524A42590E3993e19456B42720b92866
15670b20153K9729e0641B94016d14652B78080K1222a77959h8582j43563i3663
15659H7505B1000Q9751a74948G1739A6077e0721m9445k2606A65785a32272C02053
15647b68584a02746F0471J99323a75015A1216c6213j3972k6315h985j81218A41181
15635i8602j99432i1205k15447A00098a82233h7245d0234j15800A15596A8066
15624A30963a45922F1240K99756f8336A21292R0004J3455e8004A53968a20146
15613I6053N6446k6200o0592d0600B40221a92434a9414K913C42481d2111B02075
15601A00115b23183c3138A94417a17817n3245O6733A39463E4503a32562K8586
$$ y = [-330507, 342897, 25420, -218354, -120028, -56524, 142590, 53993, -519456, 242720, -292866, -220153, -190424, -50641, 294016, -414652, 278080, 299302, -177959, -88582, -232145, -93663, 87505, 21000, 110751, -174948, 71739, 16077, -50721, -100166, -122772, 165785, -132272, 302053, -268584, -102746, 60471, 259794, -175015, 11216, -36213, -50185, -76500, -8985, -190203, 141181, -98602, -298034, -91205, -306652, 100098, -182233, -87245, -40234, -156034, 115596, 18066, 130963, -145922, 61240, 360996, -68336, 121292, 211296, 224751, -58004, 153968, -120146, 96053, 152499, 126299, 65707, -40600, 240221, -192434, -19414, -16501, 342481, -42111, 202075, 100115, -223183, -33138, 194417, -117817, -171062, -104329, 139463, 54503, -132562, -103976]
15591a03976r4294A20303J33528C3227a34218c3506l3866A69210n0917R090a4241
15579A12701J18815j09464A3510a90578q1367A4599b93123A38841E6930J58464
15569B15394A5888a07812A89688a959B64283l6605a27424m3812F469P9970h1367
15557a72307P4168j12561B05394e4507n7132C2086b1495A50606D2261N4338m7273
15546D9326b18260B26495a09258a9290k07912E1703a45329A12636D464i3323K1236
15535g2087H4439L585B2120J14884N6951k0273n8066l319m7269B861J36024F1474
15522F5839a38695c0203j36451D3702b23743E1589B5110K4787J03669h9971m3988
15511a33959d7847A31999P60I12a32960D5332a16776B51537p1069A3760O4796
$$ y = [-103976, -198270, 120303, 253831, 33227, -134218, -33506, -67372, 169210, 118293, 127383, -14241, 112701, 231516, 122052, 13510, -190578, -271945, 14599, -293123, 138841, 56930, 215394, 15888, -107812, 189688, -1959, 264283, 227678, -127424, -171236, 6469, 86439, -81367, -172307, -98139, -210700, 205394, -54507, -111639, 32086, -21495, 150606, 42261, 96599, 49326, -218260, 226495, -109258, -19290, -227202, 51703, -145329, 112636, 4464, -93323, -72087, 84439, 88024, 22120, 137004, 193955, 173682, 115616, 112297, 65028, 2861, 138885, 61474, 65839, -138695, -30203, -166654, 43702, -223743, 51589, 25110, 49897, 153566, -89971, -133959, -47847, 131999, 132759, 912, -132960, 45332, -116776, 251537, 180468, 13760, 78556]
15500G8556a07460j76238I1048a51977j33862a28117B07308j5814b16388O6635
15490a49753j74221N3434G9698J9397J04676b33033b9676B3687b54588a4277n8176
15479g2453K0045j3165j09729D0173g8822K8723j27803B51986j609A14573G214
15467a76971j87392h1284k83685C7074K30651a61913P2467A31296L57383A35294
15456D85308A1742g7823j4211d3114D6304I468a09331l4967C0830a8433m8638
15445f7071C22025b17078A72971Q5347c06039H2215K11039d3358k2105j99380
15435b64843P2753I681i8568G0817C2834d0353B04807e6776J1172g124B26158
15423B27839J53138j67614K8813C9380e15910b04946m7004J05963O3089A65033
$$ y = [78556, -107460, -283698, 91048, -151977, -285839, -128117, 207308, 191494, -216388, -149753, -323974, -270540, 79698, 99095, 203771, -233033, -29676, 23687, -254588, -14277, -72453, -52408, -65573, -175302, 40173, -78822, -50099, -177902, 251986, 250377, 114573, 7214, -176971, -364363, -81284, -364969, 37074, 267725, -161913, -89446, 131296, 488679, 135294, 485308, 11742, -77823, -92034, -43114, 46304, 9468, -109331, -144298, 30830, -18433, -67071, 322025, -217078, 172971, 258318, -306039, 82215, 293254, -43358, -65463, -264843, -192090, 9681, -98568, 70817, 32834, -40353, 204807, -56776, -45604, -7124, 226158, 227839, 380977, 213363, 242176, 39380, -515910, -204946, -251950, -145987, -82898, 165033]
15412A25497d0326o7457r5831L2704A11317c5534C861g4165B46877a00774A40587
15400a17378I8506j2391a67534D5678D77h5405o0297q1329A44621J50801g5216
15388b64163B294b98577D5221J7883C1505G204e6099j33320H7316J0372D6279
15376E033c49138a59928O4849k7119G6194h7987j1729B84711j25401B4450J4788
15365C9238J8620R5791b73915J6718R8629B33867a83620e6644A34211B2085a72230
15353B70205o1131b39981l8558A73407a54024b8426J1831A17871b61000A12576
15342h9075C0363J39765E9035e1666D491b46190J398e7066I8974J9006h9375L0979
15330e8396j84244F08070b87827C267c8205m4690G2008J39477a3267D9800h3260
$$ y = [125497, -40326, -107783, -203614, -170910, 111317, -35534, 3861, -74165, 246877, -100774, 140587, -117378, 98506, 86115, -167534, 45678, 477, -85405, -145702, -227031, 144621, 295422, -75216, -264163, 2294, -298577, 45221, 63104, 31505, 7204, -56099, -189419, 87316, 97688, 46279, 5033, -349138, -159928, -95079, -122198, 76194, -87987, -99716, 284711, 159310, 24450, 39238, 57858, 153649, -273915, -257197, -158568, 233867, -183620, -56644, 134211, 22085, -172230, 270205, 209074, -239981, -278539, 173407, -154024, -28426, -16595, 117871, -261000, 112576, -89075, 30363, 170128, 59035, -51666, 4491, -246190, -244792, -57066, 98974, 117980, -89375, -58396, -242640, 608070, -287827, 3267, -38205, -82895, 72008, 211485, -13267, 49800, -83260]
15318b0302B16757A03560Q3686a19440A27658J31744a19099B7687g7951B32929
15307I0314l9933J74009a45293H004L65928j65258b308j53669A18622L3136D399
15295B42394J7140a08143D3179J06832K18953a88699Q9944C75685E3764M1426
15285I5190J68083C3094P6153n0972J86988j02896a774B59916A7988a09536A36739
15273A60306f1530B2776b73972O6160g9624D5222J024P3457n244A3246L26523
15262C39769A28575O0933e4859k35482a8513H9471a29533A37634f8057E3725j5545
15251C8180N8399K15399K91476K56500J096158o88018K6956J29603D73101A61065
15240b117B52170K19329A43625g2125A23382c6439j45877a0651M013l66014J54110
$$ y = [-20302, 216757, 103560, 187246, -119440, 127658, 259402, -119099, 27687, -77951, 232929, 90314, 50381, 224390, -145293, 8004, 373932, 208674, -2308, -155977, 118622, 151758, 4399, 242394, 259534, -108143, 43179, 150011, 368964, -188699, -98755, 375685, 53764, 95190, 263273, 33094, 109247, 58275, 245263, 142367, -1774, 259916, 17988, -109536, 136739, 160306, -61530, 22776, -273972, -207812, -79624, 45222, 46246, 119703, 114459, 13246, 339769, 128575, 189508, -54859, -290341, -18513, 89471, -129533, 137634, -68057, 53725, 38180, 96579, 311978, 603454, 859954, 1956112, 1268094, 1295050, 1424653, 473101, 161065, -2117, 252170, 471499, 143625, -72125, 123382, -36439, -182316, -10651, -6638, -372652, -218542]
15229b18542f7142E31864A46965F6888b45605a1629G6639J37186l6307G8693a2392
15217G8130a65215A46036a27087C01491D734a3794q1118A2025f4895A68401b8077
15205b76909h2981A26680N49a16031G2142C4752J06824D4415P6979d3165o8055
15194a11220B51590k9876e3665j92220R1846D16390o4590b588B12858a60141E1824
15182B96532a32906H8987L8520J76455I2448F048K67079n4555i1026B48333d3920
15170c2192B57037F0258N2532K09327A3801O8394B1555b54222b6193A72764J08515
15159B81279B0377i7315D02432j52327J22910G2483c3827F9427B2681J8778a7128
15147B90127J5325b19917A09511l9791J4024K03273K0690E4001J68773b52608
$$ y = [-218542, -67142, 531864, 146965, 66888, -245605, -11629, 76639, 213825, 177518, 78693, -12392, 78130, -165215, 146036, -127087, 301491, 4734, -13794, -94912, 12025, -64895, 168401, -28077, -276909, -82981, 126680, 127229, -116031, 72142, 34752, 141576, 44415, 121394, -43165, -111220, 251590, 221714, -53665, -245885, -154039, 416390, 351800, -2588, 212858, -160141, 51824, 296532, -132906, 88987, 127507, 303962, 92448, 6048, 273127, 218572, -91026, 248333, -43920, -32192, 257037, 60258, 112790, 322117, 13801, 82195, 21555, -254222, -26193, 172764, 281279, 20377, -97315, 402432, 250105, 373015, 72483, -33827, 69427, 22681, 41459, -17128, 290127, 305452, -219917, 109511, 69720, 83744, 287017, 307707, 54001, 222774, -252608]
15136B55064a08611A11741J00916A8483b76052D28954a05171B77321H0532i5106
15125A61057b60o8088A15867h8233C13609m0663L2833p558c23143A80462j9280
15114A61182p3056L49585j82601E5294O4374D4184J8402K46000A16602J12159
15104B28761B4863P0769c11829D0813O6204d3607A839h7967C26914J738A39008
15092A5242K31905d9421k49887B34232m7723r843K49569a38396j20081C03039
15081A86838m6616J76331A23946a30570b5169B86759a2683j64859G7905L0189
15071A08094P8694o1958b5487j39835D8763j7149J32491J60926G0354a2556D61547
15059b3693A82313h5131r6158B57099a02885H4277K15937I7094H62J25609J48388
$$ y = [255064, -108611, 111741, 212657, 18483, -276052, 428954, -105171, 277321, 80532, -95106, 161057, -260, -68348, 115867, -88233, 313609, 272946, 305779, 298221, -323143, 180462, 161182, 88126, 437711, 255110, 55294, 119668, 44184, 62586, 308586, 116602, 228761, 24863, 95632, -311829, 40813, 107017, -43607, 1839, -87967, 326914, 328652, 139008, 15242, 247147, -49421, -299308, 234232, 186509, 176666, 426235, -138396, -258477, 303039, 186838, 140222, 316553, 123946, -130570, -25169, 286759, -12683, -177542, 77905, 108094, 186788, 124830, -25487, -165322, 48763, 31614, 164105, 325031, 70354, -12556, 461547, -23693, 182313, -85131, -181289, 257099, -102885, 84277, 300214, 97094, 862, 126471, 274859]
15048B74859H3477j0881a39811e7155C93427l6548m9991c476q2448E9929K86348
15037C46277j45560D3262L79397o7392F5245K90318j69683J80810D9993h6360
15026G9072K83139P1868c723B60471J77831B18443M79584B41225i9536A04802
15015C00558k1060j7461A1290P0573K73905B060K4219k739Q598J65286e8030B66191
15002H2196J28768l0503O4629K32186A80279n7389C5318L67425p5365A58801p1784
14991H7017a78673D91390B39849J58773A23364a157C72760f6205J0916C56688
14980C9828M9216K14664j12089k9353J58779B1957K07359j02255D5472K14069
14970B59541b32671A71229L02635A111J46234K19149A56608c0456A23444M3162
$$ y = [274859, 83477, 72596, -139811, -57155, 393427, 356879, 306888, -3476, -85924, 59929, 346277, 200717, 43262, 422659, 355267, 65245, 355563, 185880, 366690, 49993, -86360, 79072, 362211, 434079, -3723, 260471, 438302, 218443, 698027, 241225, -99536, 104802, 300558, 279498, 262037, 11290, 81863, 355768, 2060, 26279, 23540, 32138, 197424, -58030, 266191, 82196, 210964, 180461, 245090, 477276, 180279, 122890, 35318, 402743, 327378, 158801, 87017, -178673, 491390, 239849, 398622, 123364, -1157, 372760, -66205, -55289, 356688, 39828, 89044, 303708, 191619, 162266, 321045, 21957, 229316, 127061, 45472, 259541, -232671, 171229, 473864, 1111, 147345, 366494, 156608, -30456, 123444, 166606]
14960A66606j5653a74595B38689F6637L23361A09637j1598K70794N7445A38906
14949A98569D703M34914q1038Q4474j40400A27434M75811B38349K92202B10525
14938B35083O5198p5339f5229C80938A26942J62771J3902J60168A1447g102C01715
14926B36589K96003A26334M6320J73715j17809q1123J64275O4894M83096B86853
14915B17922j5797K13328J16695n6718A92917o0409J48214l1297j9925C8277M11065
14904D49342G3483P1599J01476j4577R9670r0792p7189M0894L27957A58241l0056
14893A28185K1715o5852J57482l0677m883o8605N52925k75402j45891Q0769I73
14881B3165L72766j19568J24684j38943J81975k09700j05341K74199J81822k17530
$$ y = [166606, 150953, -174595, 238689, 66637, 389998, 109637, 98039, 368833, 426278, 138906, 198569, 4703, 439617, 358579, 443053, 302653, 127434, 603245, 238349, 530551, 210525, 235083, 300281, 224942, -65229, 380938, 126942, 289713, 303615, 463783, 11447, -7102, 301715, 236589, 532592, 126334, 172654, 346369, 228560, 147437, 311712, 376606, 859702, 286853, 217922, 202125, 415453, 532148, 475430, 192917, 132508, 280722, 249425, 229500, 38277, 449342, 73483, 145082, 246558, 231981, 331651, 240859, 163670, 204564, 532521, 158241, 128185, 149900, 84048, 241530, 210853, 205970, 137365, 690290, 414888, 268997, 349766, 973, 23165, 395931, 276363, 401047, 262104, 444079, 234379, 129038, 403237, 585059, 367529]
14871C67529j56729L23312j91435j52391R7387q6192J50448j03623M61437B28831
14860D22997B7044K50637R5590J38530r3842J57399k47915k1946Q5859k2332A62599
14848F5940L07752p748J77490A82703K4011J18400O2376j24466K73750B67153
14837G5805L45047A05839K47055L45715j48489j71843o6770H1703c7160D27457
14826D26128J66989J08111n7167j49418k11234N62398j45364C34275J70975L68324
14816H73574m09258j31570o9048J93784k00598Q2285J34436A21491M56305k32370
14806C45426M05787k84098J72197k81673J51484m4340p2834n7146J937M27541
14796G64281k89755R4152B61417L04494j8737j30735m1496J0371K59533j38286
$$ y = [367529, 210800, 534112, 342677, 190286, 287673, 201481, 351929, 248306, 709743, 228831, 422997, 27044, 277681, 373271, 511801, 417959, 575358, 327443, 305497, 391356, 369024, 162599, 65940, 373692, 365944, 543434, 182703, 206714, 325114, 387490, 263024, 536774, 267153, 75805, 420852, 105839, 352894, 698609, 550120, 378277, 311507, 81703, -37160, 427457, 426128, 593117, 701228, 644061, 494643, 283409, 845807, 700443, 334275, 505250, 873574, 464316, 332746, 263698, 457482, 256884, 339169, 473605, 121491, 577796, 345426, 751213, 467115, 639312, 357639, 509123, 464783, 391949, 334803, 336740, 764281, 474526, 568678, 261417, 565911, 547174, 416439, 374943, 385314, 644847, 506561]
14786E06561m8600P2690k2541K07539m6952j51873j02657J31246L76200C04038
14775B64959J36812K27286k16264L595J93736k95000A53223K76532j8028M08538
14765H20265k55383K7780k90522q0868L90927j11133K876q0480l1753R4586O7493
14754E53788r3024J09251J29574j60948j4523J71659o8457K42562C22274M44456
14744G66730J8636l3826p0604L6J60214D11150K43635j66178O4030B51652M60213
14733G11865l9412j7877o9227M4976n8951p7296K30852N6882k52629J26494N3959
14722G09636p5559J97158k06515k815J77040k67755K01602K1263k11448J23506
14712F66113L71511E01623M12997k82701r2267J31298Q1934k4893L0114j09208
$$ y = [506561, 457961, 530651, 508110, 715649, 668697, 516824, 414167, 545413, 921613, 304038, 264959, 401771, 629057, 412793, 416388, 610124, 315124, 153223, 429755, 411727, 820265, 564882, 592662, 302140, 221272, 612199, 501066, 503942, 423462, 391709, 486295, 553788, 460764, 570015, 699589, 538641, 524118, 695777, 627320, 869882, 322274, 766730, 785366, 751540, 680936, 680972, 841186, 411150, 654785, 488607, 552637, 251652, 711865, 672453, 654576, 585349, 630325, 571374, 494078, 724930, 781812, 529183, 655677, 709636, 634077, 831235, 624720, 621905, 798945, 531190, 732792, 754055, 542607, 666113, 1037624, 501623, 914620, 631919, 539652, 670950, 752884, 727991, 758105, 648897]
14702F48897P8802L10099n01641K02275K9785j05305K84609l13095K10775L6389
14692H81590C71663O46284j06553l85087L66461k00851j22033L08070m4661k30518
14682F02775K07950j8368L40443k22925k12724P4029J42464n360k29701K72457
14672I51040J861j35482j16790J43372m7860Q2562K51363j75007j85185K78474
14662A048348j81672K88570l63966K113R1243K4965j58441K87200M8669o5816
14652A021213k01364M71358m19123k9139J32381l76204M21675J7650K61985l44102
14642I56330k59347J50565P3709J56112L69922j97725J55019n00436J77534j73101
14632I08582M17838m30885K90553m644k11115L57201j67981J00511l0176j88209
$$ y = [648897, 727699, 1037798, 536157, 738432, 768217, 662912, 947521, 634426, 845201, 881590, 371663, 1017947, 911394, 526307, 892768, 691917, 569884, 877954, 833293, 602775, 810725, 792357, 1132800, 909875, 697151, 771180, 913644, 908284, 678583, 951040, 952901, 817419, 700629, 844001, 796141, 878703, 1130066, 955059, 769874, 1048348, 866676, 1155246, 791280, 793393, 884636, 909601, 751160, 1038360, 1087029, 1021213, 819849, 1291207, 872084, 842945, 975326, 599122, 1020797, 1038447, 1300432, 956330, 696983, 847548, 921257, 1077369, 1447291, 1249566, 1404585, 904149, 1081683, 908582, 1326420, 895535, 1186088, 1181444, 970329, 1327530, 1159549, 1260060, 1229884, 1041675]
14622A041675K38605k80701L7761J58930j49950l6858K7542L6931L03071j43739
14612A233267P9722K5872R7552q5484j02606j96231J70540O3662J54354l18092
14602A122556K04180k1345K09432J16566k28512j35410l7868M07226l19134P0932
14592A388623J37769J25368m56833N36487j36694k99586J47938K67861k36219
14583A474714M55675j34262k92505M18370k32488Q1054k39946L29407r9850L55792
14573B115961m56241J81373K09862j80637K30435j78252j86931P2085M78125o33290
14563A652490N37602j8918k0198K51331r5542K97214Q3807J75406K1615n3375
14553B831432J90013J36987R33470P22720J910846M008700Q814702J6193406j172116
$$ y = [1041675, 1280280, 999579, 1037340, 1196270, 1046320, 1009462, 1037004, 1073935, 1377006, 1233267, 1312989, 1338861, 1436413, 1350929, 1248323, 1052092, 1222632, 1286294, 1440648, 1122556, 1326736, 1305391, 1514823, 1631389, 1402877, 1267467, 1229599, 1636825, 1317691, 1388623, 1526392, 1651760, 1194927, 1731414, 1594720, 1295134, 1443072, 1710933, 1474714, 1930389, 1796127, 1503622, 1921992, 1689504, 1770558, 1530612, 1860019, 1760169, 2115961, 1659720, 1841093, 2050955, 1870318, 2100753, 1922501, 1735570, 1807655, 2285780, 1652490, 2190092, 2171174, 2150976, 2402307, 2306765, 2603979, 2687786, 2863192, 2884807, 2831432, 3021445, 3158432, 4091902, 4814622, 6725468, 10734168, 19548870, 35742276, 34570160]
14544C4570160j6128148p573664m790871k834188p65199n54967J68670k29718
14536A862075J14403m44618j30694L96178m5020j09750J96191k85952J36475P61623
14526B450911m27800j53078j59716J85827L92673m1370j53685M0805j75489J99768
14516B158846J05856m8995K27501j55646K21895j339q1024l51715L19685J0718
14506B405782Q4970L60948l99382M39529k80296j85038K38497j61854J90275j42563
14496B550868K48308L4994m38710Q95411m49346n0984K8113J96044J91088r8098
14486C107688k58467L56453j45803J47218J69664j03122l106J14130J38808m4821
14476C478642o8332K85781m24070L47362J01929j10799j7370l8108L91780l34053
$$ y = [34570160, 18442012, 10868348, 6077477, 3243289, 2478090, 1923123, 2091793, 1862075, 1976478, 1531860, 1401166, 1797344, 1752324, 1642574, 1838765, 1552813, 1689288, 2450911, 2023111, 1870033, 1710317, 1896144, 2288817, 2247447, 2093762, 2134567, 1959078, 2158846, 2264702, 2215707, 2443208, 2287562, 2509457, 2508118, 2427094, 2075379, 2395064, 2405782, 2490752, 2851700, 2452318, 2891847, 2611551, 2426513, 2665010, 2503156, 2693431, 2550868, 2799176, 2834170, 2395460, 3290871, 2841525, 2790541, 2818654, 3014698, 3205786, 3107688, 2849221, 3205674, 3059871, 3207089, 3376753, 3273631, 3270525, 3384655, 3523463, 3478642, 3410310, 3696091, 3272021, 3619383, 3721312, 3610513, 3593143, 3555035, 3946815, 3612762]
14466C612762K08573K07600k46246J22723k74913K30840K08684L2460K339L14532
14456D419354j01765j40755K24259K67472O2703j91954m7892J51569j42683J15572
14446D615880L20269k60333N70978l21004j74086M30384K23809J00650o84955
14437D821592L62400K67826Q8593M8253P2349m2768M50570l60323J42310L50128
14427F200930j60417J16974r5956L71049Q4004L4427j35935K96400O4846J60657
14417F936979l2612J34539L34617J11498J5669k26960J86634L75119k63561L57586
14407G929508r5774J05685M12094P2065L24731j97559L97218q9041J16631K20616
14397I196174k14922L14439J96176M18709K19930J0498K88313K88759q5854L18043
$$ y = [3612762, 3821335, 4028935, 3782689, 3905412, 3630499, 3861339, 4070023, 4102483, 4104822, 4419354, 4317589, 4176834, 4401093, 4668565, 4731268, 4539314, 4491422, 4642991, 4500308, 4615880, 4936149, 4675816, 5246794, 4925790, 4751704, 5182088, 5405897, 5506547, 4821592, 5183992, 5451818, 5540411, 5588664, 5661013, 5618245, 6068815, 5708492, 5850802, 6200930, 6040513, 6157487, 6061531, 6432580, 6516584, 6551011, 6415076, 6711476, 6776322, 6936979, 6904367, 7038906, 7373523, 7485021, 7500690, 7273730, 7460364, 7835483, 7571922, 7929508, 7833734, 7939419, 8351513, 8423578, 8748309, 8550750, 8947968, 8858927, 8975558, 9196174, 8981252, 9295691, 9491867, 9910576, 10130506, 10141004, 10429317, 10718076, 10632222, 10950265]
14387A0950265K54731j07077K64139K23260R4065M05048j1158L28953J59442J25823
14377A2687491M61740J61226M27987K38973K99587J03907L23123J41180J79437
14368A5024651N92065J79968P12271Q0170L71383J47954N82826M92729L13572
14359A8497589L79989L68874P86611K88975L99846L64103N52453L44537N25916
14350B2508893M37047J002758N17796L25361J068727L55400P01343O88447R08857
14341B8514629N45177P25741Q30736Q25162R58275J062786J072293P90156J177402
14332C6502357J010639Q93154J659580J012788J245189J504281J525959J100064
14324D6454011J886072J522160J941068J618532J991570J883930K104380K370688
$$ y = [10950265, 11204996, 11097919, 11362058, 11585318, 11679383, 12084431, 12073273, 12402226, 12561668, 12687491, 13149231, 13310457, 13738444, 13977417, 14277004, 14380911, 14704034, 14845214, 15024651, 15616716, 15796684, 16508955, 16589125, 16960508, 17108462, 17691288, 18184017, 18497589, 18877578, 19246452, 20033063, 20322038, 20721884, 21085987, 21638440, 21982977, 22508893, 22945940, 23948698, 24466494, 24791855, 25860582, 26215982, 26917325, 27605772, 28514629, 29059806, 29785547, 30616283, 31441445, 32399720, 33462506, 34534799, 35324955, 36502357, 37512996, 38406150, 40065730, 41078518, 42323707, 43827988, 45353947, 46454011, 48340083, 49862243, 51803311, 53421843, 55413413, 57297343, 59401723, 61772411]
14316F1772411K709746K167669K450188L206458K399386L251710L241891L173574
14308H4373033L912287L969446M170979M203553M639107N024160M989663N478120
14300A20760348O139876N929613O931710P009616P447327Q056557Q281070R262165
14292A79818282R292060J0018331J0729964J0965970J1507052J2253783J2730971
14285B57316413J3089134J3549045J3723425J4048751J3928299J3708525J3355002
14278C52718594J2969961J2180083J1092931R786794P686500L686011k40690l12039
14270D09568145j113468k220412m930844m287225m649756o976770r285731j1198591
14262C64905348j2526479j3379821j4248539j4435242j4361409j4387185j3724066
$$ y = [61772411, 64482157, 66649826, 69100014, 72306472, 74705858, 77957568, 81199459, 84373033, 88285320, 92254766, 96425745, 100629298, 105268405, 110292565, 115282228, 120760348, 126900224, 132829837, 139761547, 146771163, 154218490, 162275047, 170556117, 179818282, 189110342, 199128673, 209858637, 220824607, 232331659, 244585442, 257316413, 270405547, 283954592, 297678017, 311726768, 325655067, 339363592, 352718594, 365688555, 377868638, 388961569, 398748363, 406434863, 410120874, 409880184, 409568145, 408454677, 406234265, 401303421, 397016196, 392366440, 385389670, 376103939, 364905348, 352378869, 338999048, 324750509, 310315267, 295953858, 281566673, 267842607]
14255B67842607j3843132j2397180j1572279j1855728j1265763j0507063j0233955
14248A86167507r447195q609256q710938p848335p240404o987072o849502n809944
14240A24664861n872989n616719m737109m602582m483595m393765m426257l627858
14232H6903987l497005k799720l323227l413496l162732k358417k752932k271374
14224F3325084k527720k067252k082076j966394j822166j611364j892128j961296
14216D7394688j297671j562400j132667j260256j323282j783128q33069j217275
14208C6984940n63644r43984j175632j032535r06654r14930j303134o21198m02741
14199B9120488j177838q29129l34413o47853p66352n52208p50783m54632o17452
$$ y = [267842607, 253999475, 241602295, 230030016, 218174288, 206908525, 196401462, 186167507, 176720312, 168111056, 159400118, 151551783, 144311379, 137324307, 130474805, 124664861, 118791872, 113175153, 108438044, 103835462, 99351867, 94958102, 90531845, 86903987, 83406982, 80607262, 77284035, 73870539, 70707807, 68349390, 65596458, 63325084, 60797364, 58730112, 56648036, 54681642, 52859476, 51248112, 49355984, 47394688, 46097017, 44534617, 43401950, 42141694, 40818412, 39035284, 38202215, 36984940, 36421296, 35477312, 34301680, 33269145, 32362491, 31447561, 30144427, 29523229, 29120488, 27942650, 27113521, 26779108, 26131255, 25364903, 24812695, 24061912, 23607280, 22989828]
14190B2989828n93291n81829m54301k24891q62047k91966n29292n04320j70748
14181A8777143n69362m66296j62077p96104P2252n87372k74990l82196j44055
14172A5466943o70746L3515m45652k87207l54272o320m49277k64327j77666k75439
14162A2569552q7708k93347p9384j81997l16523l08408j0214j22067k27084k28045
14152A0714775l19167k83641j13388l50229K31874n06486R9909p4324K4334k54151
14142I169506j24043l61180j31491q0123j1165l17425m9196J4684n8670l40635
14132G710262k0033j80032K18892o26549M8045K72089k13815l11071J1277J01864
14122G010929K7019n85839K38638K5665k36505l2880l54809O9629k39851j64305
$$ y = [22989828, 22396537, 21814708, 21360407, 21135516, 20273469, 19981503, 19452211, 18947891, 18777143, 18207781, 17741485, 17579408, 16783304, 16855556, 16268184, 15993194, 15610998, 15466943, 14796197, 14829712, 14384060, 14096853, 13742581, 13736261, 13286984, 13022657, 12844991, 12569552, 12481844, 12188497, 12109113, 11927116, 11610593, 11302185, 11291971, 11169904, 10942820, 10714775, 10395608, 10111967, 9998579, 9648350, 9880224, 9373738, 9473647, 9399323, 9423657, 9169506, 9045463, 8684283, 8552792, 8472669, 8461504, 8144079, 8094883, 8109567, 8050897, 7710262, 7690229, 7510197, 7729089, 7102540, 7150585, 7422674, 7208859, 6897788, 6909065, 7010929, 7037948, 6452109, 6690747, 6716412, 6479907, 6447027, 6092218, 6161847, 5921996, 5757691]
14112E757691J22075l80373J3578j8113j03505M19146o1878n63192r5798J34866
14102E224497r6796j01922l08726J29269Q8575j48335J53402j20431j52145j48888
14092D518500j88093O5529N542K5932M6719m02362J54268j35825J01945O872l50444
14081C848583J75957r4901L4664M5049p2868r5477J4159J58970l00670k5589K8903
14070C716780Q6413l08805J73672j3844l3159l35979j70541K17845J2282O072
14060C350736n8870J45779q8482j11108m6669o7662N4797j87238L06189k77409
14050C020063j53310j67732J12374K42191l03815j07132N16002l04214p6589k4864
14040B752974N8708k1640k92366L78993k16207m0475k35868L0566k30689N29979
$$ y = [5757691, 5879766, 5499393, 5512971, 5494858, 5391353, 5810499, 5748621, 5185429, 5089631, 5224497, 5127701, 5025779, 4717053, 4846322, 4934897, 4786562, 4939964, 4819533, 4667388, 4518500, 4330407, 4395936, 4401478, 4427410, 4474129, 4071767, 4226035, 4090210, 4192155, 4199027, 3848583, 4024540, 3929639, 3964303, 4009352, 3936484, 3841007, 3855166, 4014136, 3713466, 3687877, 3716780, 3803193, 3494388, 3668060, 3654216, 3621057, 3285078, 3114537, 3332382, 3344664, 3350736, 3291866, 3437645, 3349163, 3238055, 3191386, 3123724, 3178521, 2991283, 3297472, 3020063, 2866753, 2699021, 2811395, 3053586, 2749771, 2642639, 3158641, 2854427, 2777838, 2752974, 2811682, 2790042, 2497676, 2876669, 2660462, 2619987, 2384119, 2414685, 2183996, 2713975]
14030B713975k57337k84405L43859o7727M1019J29010l11076k26734J93131n3001
14020B220714L36089l61231L6093K2730m6796J29903o5968p7324J37346m24045
14010A907511K15523k76946K24166k37136L14516o4135j23533j17509j70278r2876
14000A579303J71009K13177l95055N34595m23405j82617K12442j07541K02265
13991A804173n6103M94689O99230K934099P183101J6950767O231991j4142860
13983B2099087r808956m779002k365900r62990p46195l76574l53445j62044j71686
13974B372295j82523Q6092J88460j50550m26361l638K28986J70481m27339L52209
13964B208112k89938l3569k01812j35007M27632k15634j77302M17252j31863l88408
$$ y = [2713975, 2456638, 2172233, 2516092, 2448365, 2489384, 2618394, 2307318, 2080584, 2273715, 2220714, 2556803, 2195572, 2231665, 2254395, 2207599, 2337502, 2271534, 2194210, 2331556, 1907511, 2123034, 1846088, 2070254, 1833118, 2147634, 2083499, 1959966, 1842457, 1672179, 1579303, 1750312, 1963489, 1568434, 2103029, 1679624, 1497007, 1709449, 1601908, 1804173, 1748070, 2242759, 2941989, 5876088, 13059189, 30009956, 36241947, 22099087, 12290131, 7511129, 5145229, 4182239, 3436044, 3059470, 2706025, 2543981, 2372295, 2189772, 2275864, 2464324, 2313774, 1887413, 1883775, 2112761, 2283242, 1855903, 2208112, 1918174, 1884605, 1682793, 1547786, 1975418, 1759784, 1582482, 1999734, 1867871, 1479463]
13954A479463J77169j24064r0836M43044m08563K79021j63240l74742N73837m23822
13944A367267K3631K6640K65814k63107j508j69312J17626J00503M0678l4262
13934A473970j61214J95768l54655K10252J30198l51121J86602L9936j70089P9132
13924A278779M6768n4379J53629p8138j17655O2645J09071k16555J60329p2261
13914A272233j05449j08266L6592J93414k77750L03325k47143j24567K35358j95222
13904I82525L17636j47043R0157J47484l80372j23834M29999r828o2682o8058
13894A175984l9734l28658J36484M27532k96856J9072J49277K8219j54669k79296
13884H37355J46226R5239p9077R2448k33018K13347k62479R8919k72113O49200
$$ y = [1479463, 1656632, 1532568, 1441732, 1884776, 1476213, 1755234, 1591994, 1217252, 1791089, 1367267, 1390898, 1417538, 1683352, 1420245, 1418737, 1249425, 1367051, 1467554, 1508232, 1473970, 1312756, 1508524, 1153869, 1364121, 1494319, 1143198, 1329800, 1369736, 1199647, 1278779, 1325547, 1271168, 1424797, 1346659, 1229004, 1291649, 1400720, 1184165, 1344494, 1272233, 1166784, 1058518, 1095110, 1288524, 1010774, 1314099, 1066956, 942389, 1177747, 982525, 1300161, 1153118, 1243275, 1390759, 1010387, 886553, 1316552, 1306724, 1244042, 1175984, 1136250, 807592, 944076, 1371608, 1074752, 1093824, 1243101, 1271320, 1116651, 837355, 983581, 1078820, 999743, 1092191, 859173, 1072520, 810041, 908960, 636847, 1286047]
13874A286047o6564j92665j47284k73608K03523K89265k41270M0641J20299k9086
13864I89298k16021P4091J18565K87027o22235L89866k08532K93159E17653M83546
13854A001199m03291K11129j9210J26285K3901q0916j70274L07q9771J37333R6258
13843H32950N1285J6665K17908m63378j86664L79529k46332L13080k34024m8750
13833F32269j70115M75039o4896l40368L58437j27548K34802l41487K83887m00310
13823E39710K38094J73704k40540J55171j91149K35114C47721M60140k2054L8488
13813H24295k17178M568J05909j60959K79374L0457j85913N8446j17198O3312
13803F85113n0680o1351j5147B08484N31307j57615J03385k42856K06383L34188
$$ y = [1286047, 1219483, 1026818, 879534, 605926, 809449, 1098714, 857444, 898085, 1018384, 989298, 773277, 847368, 965933, 1252960, 630725, 1020591, 812059, 1105218, 517653, 1001199, 597908, 809037, 789827, 916112, 940013, 859097, 688823, 689130, 599359, 736692, 832950, 884235, 900900, 1118808, 655430, 468766, 848295, 601963, 915043, 681019, 632269, 462154, 937193, 872297, 531929, 890366, 762818, 997620, 656133, 940020, 539710, 777804, 951508, 710968, 866139, 674990, 910104, 347721, 807861, 785807, 824295, 607117, 611685, 717594, 556635, 836009, 866466, 680553, 738999, 621801, 685113, 634433, 573082, 557935, 208484, 739791, 582176, 685561, 442705, 649088, 983276]
13793I83276C00653M67790l36440k4963K64397j04581J67263k65222R9678q6321
13783D82254j14430L79369j86237K04233l64590K1874J10102R6341P9326j75418
13773E32824L3406J19264n2374L2352q3151K2854N9957k86346K29462J6955k43210
13762C81993K25643n3901k52247j05793P8614l825K20434k11167K12873m0518
13752D52106J1175J47815k2080j30328J16804M2639l8242q9675N3666J45169A71453
13740C19450L28376B16074L28631N940o3665J97517l04043m5481O1695N2239P59
13729D49666K69396j36409R31L6357l06130Q2795l3838K43254J07597r1497L2904
13718F55026A66532Q73088B15889K79752N9j25185K84900C04225J21888J61374
$$ y = [983276, 300653, 768443, 432003, 407040, 671437, 566856, 734119, 468897, 568575, 482254, 367824, 747193, 560956, 765189, 400599, 422473, 532575, 628916, 708242, 532824, 566230, 685494, 633120, 665472, 582321, 605175, 665132, 378786, 608248, 625203, 381993, 607636, 553735, 301488, 195695, 274309, 270484, 490918, 279751, 492624, 452106, 463281, 611096, 589016, 458688, 575492, 618131, 579889, 490214, 543880, 689049, 171453, 319450, 647826, 216074, 544705, 550645, 486980, 684497, 380454, 334973, 396668, 448907, 449666, 719062, 582653, 583584, 619941, 313811, 396606, 362768, 606022, 713619, 622122, 655026, 166532, 1039620, 215889, 495641, 495700, 370515, 655415, 304225, 426113, 587487]
13708E87487A13957M69517j52992A09592M66594M1694B77033L30906B00217J91099
13698C91316L9798l256J76157k22492j01981j1771J40790N5263k30439M18894
13688F52279k12325K03257C18269H8379Q5949M22647J9244k53591r7239K22392
13678D87781J15112B80673o9298P9160j0888L7582L02833j22277j73998j18774
13668B05013K15611j57595K03072A57541J32120n0371L10420c1786C87762L40954
13658G28716i2157B78859e5686E64459j69364j85238O3688c0197A30517J07134
13648B37651J49507j53662Q8123R4308j65959J49501J05938B36081K24825N1345
13638E12251A55656k7541L51268B11637n4129J76028m971L13920A00603K93193
$$ y = [587487, 113957, 583474, 430482, 109592, 576186, 617880, 277033, 607939, 200217, 391316, 431114, 427858, 604015, 381523, 279542, 267771, 408561, 463824, 233385, 652279, 439954, 643211, 318269, 88379, 174328, 596975, 616219, 362628, 265389, 487781, 602893, 280673, 211375, 290535, 279647, 317229, 620062, 497785, 323787, 205013, 420624, 263029, 466101, 157541, 289661, 239290, 549710, -31786, 387762, 728716, -92157, 278859, -55686, 564459, 395095, 209857, 273545, -30197, 130517, 237651, 387158, 233496, 321619, 415927, 249968, 399469, 505407, 236081, 460906, 512251, 155656, 128115, 479383, 211637, 157508, 333536, 328565, 642485, 100603, 393796]
13628C93796A28133R9960K43379l0050o5122A19830L71260A97405D7409K23639
13618B71048A25524K27244G4910P9156J50140a9106A67362K9421m6760a15147
13607C40623A56102m5100J06793A01876J75985k0694K42435E2807J4420K91789
13597C59016j08814J7652J05442N0297r7131M9173r1739K9590J6872m7624J23164
13586D05898j43748j4634m3475J85506A79755K03132m3061L1056n8826B6358L9648
13575F6006K07169o9147l0453D8564P224K40392A07496L98475j19979n2276A33931
13563C28960j0036J98784k50055j10782K33529J15803f4946C99492c4461B80751
13552B74948k4884C3124J07718K3947K60145A26034F1772P7048m779J40631A30193
$$ y = [393796, 128133, 228093, 471472, 441422, 376300, 119830, 491090, 197405, 47409, 271048, 125524, 352768, 74910, 154066, 304206, -19106, 167362, 196783, 150023, -115147, 340623, 156102, 111002, 217795, 101876, 277861, 257167, 499602, 52807, 67227, 359016, 250202, 267854, 373296, 423593, 326462, 375635, 283896, 313486, 330358, 282734, 405898, 262150, 247516, 204041, 389547, 179755, 382887, 339826, 370882, 312056, 26358, 66006, 273175, 204028, 173575, 48564, 55788, 296180, 107496, 505971, 385992, 333716, 133931, 328960, 318924, 517708, 267653, 156871, 390400, 506203, -64946, 399492, -34461, 280751, 274948, 250064, 33124, 140842, 164789, 424934, 126034, 61772, 138820, 134041, 274672, 130193]
13540D19006D1040G090J37983F271L65943A84104K1737R4543L46873G1444K30896
13529C02340b1606B68499K28258r2856H1528H551c4556D21854J45398B57835J8298
13518B76133J65138A97014p8699M22246E48J67559B8920K54426l6739B6825J14520
13507A41345a00781A85179K179o7480L72463B5253J11555J56599P3403c86406
13496A56647C0031J41944L09727A72844A855a486A37782c9147C02238P5278j600
13485C75916j6469j9419c3604C81619K1419j1548h794j81442A40641P8548J29103
13474C48292D4887L26891C5505L37871j43949A08648K29315j49860g3055B01825
13463A12055a06993C44989F6391J87966g7921A86786J16606A04912h7866A52862
$$ y = [419006, 41040, 7090, 145073, 6271, 372214, 184104, 205841, 300384, 647257, 71444, 302340, -21606, 268499, 496757, 403901, 81528, 8551, -34556, 421854, 567252, 257835, 276133, 441271, 197014, 118315, 540561, 548, 168107, 28920, 283346, 246607, 26825, 141345, -100781, 185179, 187358, 119878, 492341, 25253, 136808, 293407, 366810, -386406, 156647, 30031, 171975, 481702, 172844, 1855, -1486, 137782, -39147, 302238, 377516, 375916, 359447, 340028, -33604, 381619, 403038, 391490, -8794, -190236, 140641, 219189, 348292, 44887, 371778, 35505, 373376, 229427, 108648, 337963, 188103, -73055, 201825, 112055, -106993, 344989, 66391, 254357, -77921, 186786, 303392, 104912, -87866, 152862]
13452A88750G9180M6415K09787L6898r0846K33318j17865j45351K65606A95096
13441I8566a35543F6985J38918i772B08119i5879A22903a49100A02905a9648A75810
13429H8029Q0437a3979A47008o8059B6629a30366H3634M48965j49802A4038L1630
13418D5668L9290l8139J83127E4605N5222j2551f175C40078A30061r557J54480
13407B74984j07163B9543a6271B55964b08198C98890n3888A59951l3868K43727
13397C69810h4755D9031h2273E2098O3159A4186h1822B34377m7768n4929J34920
13386B66600A17085L7435j3865J30752A19169J10932I3883N7416K6463J0650E2245
13374A61075J09967J35882k6109a55978L6411l1726E80588J9106c43075C86260
$$ y = [188750, 79180, 125595, 335382, 372280, 281434, 514752, 396887, 251536, 517142, 195096, 98566, -135543, 66985, 205903, -9772, 208119, -95879, 122903, -149100, 102905, -19648, 175810, 88029, 168466, -13979, 147008, 78949, 26629, -130366, 83634, 532599, 382797, 14038, 45668, 84958, 46819, 229946, 54605, 109827, 97276, -6175, 340078, 130061, 120504, 274984, 167821, 29543, -16271, 255964, -208198, 398890, 345002, 159951, 126083, 369810, -84755, 49031, -82273, 52098, 115257, 14186, -81822, 234377, 186609, 131680, 266600, 117085, 154520, 140655, 271407, 119169, 230101, 93883, 151299, 177762, 188412, 52245, 161075, 271042, 406924, 380815, -155978, -119567, -151293, 580588, 599694, -343075, 386260]
13363A71815L8648K67018G3903b53660A62734k1861K59912a17468E70333B72867
13352C84372j30846a22370j04162C20622j8580a02373A64425J99640j23592N3293
13342B93766l1829A04212g1714B23857M6305I8550J26705q1583J16566a01854
13331C4964L10830P3718i9786C13104j38618k4199n4914K71465j03202J38429
13321D02065B8035K9001J37398K26380K0397H2361R4020j2812b84755A4100J27832
13310A41932J74907f2304j9230D11033j11505b68637A46514K51749J24906A60926
13299b2695C10793r4945r4116l56J05537a10918A05200e1426C8816g852D3873
13287f2774g007l7275E4381I752K03952b24930i655A55290g3831M299A25310O6785
$$ y = [171815, 210463, 477481, 73903, -253660, 162734, 140873, 400785, -117468, 570333, 272867, 384372, 253526, -122370, -226532, 320622, 302042, -102373, 164425, 364065, 240473, 293766, 261937, 104212, -71714, 223857, 270162, 98550, 225255, 143672, 260238, -101854, 34964, 345794, 419512, -99786, 313104, 174486, 150287, 95373, 366838, 263636, 402065, 28035, 57036, 194434, 420814, 441211, 82361, 176381, 163569, -284755, 14100, 141932, 316839, -62304, -81534, 411033, 299528, -268637, 146514, 398263, 523169, 160926, -22695, 310793, 215848, 121732, 121376, 226913, -110918, 105200, -51426, 38816, -7852, 43873, -62774, -7007, -44282, 54381, 9752, 213704, -224930, -9655, 155290, -73831, -69532, 125310, 192095]
13275A92095b1091B49667F3598J39811F6805J31400M4111M6160F572R7606b35026
13263A31513J28600e1406C09414a7823F3408b53069C70339I1021A6098J52995
13253A69093a21007A24547d9402k39059A32270J4740J2892a4849A58628i2297
13242h3212A64181E5947J64409j02017i6104A63430F9541J79479e7014A94351
13231a31916B33109r9325b0996A85156q282D4215J58248H7823d794l32791D8688
13219c11469B48828H5693J66366H2494K9819K70174d4778j28838N3713J6406C0511
13207E8949B9322O7611J25701c24674b9738A03997d5853A6440g3162G416e5757
13195b50589C83566f6701D307L3850K06701a56810B81093I8726C1737e7980A58282
$$ y = [192095, -21091, 249667, 63598, 203409, 66805, 198205, 242316, 288476, 6572, 104178, -235026, 131513, 260113, -51406, 309414, -17823, 63408, -253069, 370339, 91021, 16098, 169093, -121007, 124547, -49402, -288461, 132270, 147010, 159902, -14849, 158628, -92297, -83212, 164181, 55947, 220356, 118339, -96104, 163430, 69541, 249020, -57014, 194351, -131916, 233109, 133784, -20996, 185156, 176874, 44215, 202463, 87823, -4794, -337585, 48688, -311469, 248828, 85693, 252059, 82494, 112313, 382487, -44778, -173616, -119903, -103497, 30511, 58949, 29322, 96933, 222634, -324674, -29738, 103997, -45853, 16440, -73162, 7416, -55757, -250589, 383566, -66701, 4307, 38157, 244858, -156810, 281093, 98726, 31737, -57980, 158282]
13183B10267a55423H898K87713c6806C7811K80549A35421L6538D3511L19059c47513
13171C6810b57859P1250B34355Q9790c4583C8509J31770K5377j6923J88459A36958
13159i7346C67818h8567F8075J70680l6774i4024C25708a42765K6988A5477b63864
13147a05254A91703j0703R2482F529K84316B6078N7783b25457G0153b16587d3109
13135a24717N0728n7311B59676a05122a8447G8491J99903G2885i9701j3613d0251
13123b548l72722a2073E8249a06946j2868A34509g7740D234J20995m8154O4100
13112A41175Q397h964A02885J84657f5741j18583N7634B86432B8065J73346b504
13100b3486E4014r697A6934l615h568k25071B5436f3590A59422h5924C6904K36744
$$ y = [210267, -155423, 8898, 296611, -36806, 37811, 318360, 135421, 171959, 43511, 362570, -347513, 36810, -257859, -186609, 234355, 324145, -34583, 38509, 170279, 195656, 178733, 367192, 136958, -97346, 367818, -88567, 68075, 238755, 201981, -94024, 325708, -142765, -115777, 15477, -263864, -105254, 191703, 181000, 273482, 6529, 290845, 26078, 83861, -225457, 70153, -216587, -43109, -124717, -73989, -131300, 259676, -105122, -18447, 78491, 278394, 72885, -99701, -113314, -40251, -2548, -375270, -12073, 58249, -106946, -119814, 134509, -77740, 4234, 125229, 77075, 141175, 149572, -8964, 102885, 287542, -65741, -184324, -126690, 286432, 28065, 201411, -2504, -23486, 54014, 44317, 16934, 13319, -8568, -233639, 25436, -63590, 159422, -85924, 36904, 273648]
13088B73648a94480D4287J22756C4476c362j77745B43228F0215k0200a52228A47412
13076A77972g9730L5247E5254d926C47810a04154G943f5274Q059B87177A14889
13064I6740a48847A5532a38406B94715n511d1216G7141d5712A0205f3750B44215
13052B7447k296f505B4099Q3710b3665D21543f5754m2671D55725A82681b8798
13040B7656P1169a23021a3713I2162K68820A01022a797B58444a6388A35232J27510
13029B62742B5496l814N3651J63957B1411a99249D08871j51003c952q2243E0168
13017C56877a796B23881g80C39556a12320A18302a9387C28403d2012A19388c19261
13005G2428k8550n846J17145J86932k0643a36629q3419A74190p0889b07175C19701
$$ y = [273648, -194480, 44287, 167043, 34476, -3362, -181107, 243228, 60215, 40015, -152228, 147412, 177972, -79730, -44483, 55254, -4926, 347810, -104154, 7943, -65274, -57215, 287177, 114889, 96740, -148847, 15532, -138406, 294715, 289204, -41216, 77141, -45712, 10205, -63750, 244215, 27447, 25151, -6505, 24099, 107809, -23665, 421543, -65754, -108425, 455725, 182681, -28798, 27656, 98825, -123021, -13713, 92162, 360982, 101022, -1797, 258444, -16388, 135232, 262742, 25496, 21682, 75333, 239290, 21411, -199249, 408871, 257868, -3952, -86195, 50168, 356877, -1796, 223881, -780, 339556, -112320, 118302, -19387, 328403, -42012, 119388, -319261, 72428, 43878, 38032, 155177, 342109, 321466, -136629, -220048, 174190, 103301, -207175, 319701]
12993c32825J31099D9734P1177a43664e8439a3393I3939d03704g8112A24146g8471
12981f7015a3310p2605k06318F3601c8605a1887k29673A47366E5671a38631B41195
12969F7162d239A67144a70401j06623f6150C15011a76572B05683E9013J2407E023
12957B09989q6400c958B73002j06251b44221B2714R5081C0413b3902j76236c3327
12945f280A21377N8331B6532C931a3493A4365i6785J6734B49033a03428c5672
12933a3063B64887a46768A82073a00261o1579A38468c44895I3455J6707b7423
12922B33940j6772b98169D3372N8498b6226p2577A50226p069J3700K0802l439
12911A74220j5317m8135a69010B8470J93963R8778j48658d7227P083l43837K6568
$$ y = [-332825, -201726, 49734, 120911, -143664, -58439, -13393, 93939, -403704, -78112, 124146, -78471, -67015, -13310, -85915, -292233, 63601, -38605, -11887, -241560, 147366, 55671, -138631, 241195, 67162, -4239, 167144, -170401, -277024, -66150, 315011, -176572, 205683, 59013, 71420, 5023, 209989, 123589, -3958, 273002, 166751, -244221, 22714, 117795, 30413, -23902, -200138, -33327, -6280, 121377, 179708, 26532, 3931, -13493, 14365, -96785, -80051, 249033, -103428, -35672, -13063, 264887, -146768, 182073, -100261, -161840, 138468, -344895, 93455, 110162, -27423, 233940, 217168, -298169, 43372, 101870, -26226, -98803, 150226, 143157, 156857, 177659, 174220, 158903, 110768, -169010, 28470, 222433, 321211, 172553, -47227, -40144, -383981, -357413]
12900c57413J28640J6100A55087a65657A73850a35513F7322b24296I3109a08877
12889a5178H9951m2175A8369J07342Q7226j01951l9166d0488j19105A62392b13420
12877a01276A35984N8963a98601A0559J94293a6191B45292M303a0556m5649E31314
12865b5912B0016J46143a35990j49138a34382j6018k8362C65856c43480B5443
12854G4712b84939A74593f3143n2828N1711G2060f4279A00874A4118J23470h1008
12842I1309b8302G004M9776C087a01383B234a39655O0854F5745K566a84496c6884
12829a30580q2799A64071c39079J00393Q8995C41382A21675B5674J5020Q3586
12819A24280c07101J43491B5722h3228F7662K20543n2637c6163a5735A13577R858
$$ y = [-357413, -228773, -212673, 155087, -165657, 173850, -135513, 67322, -224296, 93109, -108877, -15178, 89951, 47776, 18369, 125711, 212937, 110986, 71820, -40488, -159593, 162392, -213420, -101276, 135984, 194947, -198601, 10559, 204852, -16191, 245292, 249595, -10556, -56205, 531314, -25912, 20016, 166159, -135990, -285128, -134382, -150400, -178762, 365856, -343480, 25443, 74712, -284939, 174593, -63143, -115971, -64260, 72060, -64279, 100874, 14118, 137588, -81008, 91309, -28302, 7004, 56780, 3087, -101383, 2234, -139655, -78801, 65745, 68311, -184496, -36884, -130580, -213379, 164071, -339079, -238686, -149691, 341382, 121675, 25674, 40694, 124280, -307101, -163610, 25722, -83228, 67662, 288205, 235568, -36163, -15735, 113577, 123435]
12808A23435b3063j03582K960A35008a9153I9829b24249h6882L3092A17150m659
12797A12491J66443b52364Q3013A90087a60553j60889A73251L9570k2987I2062
12786b43977B47761C6350a34812b4961A7313O4390a25984k58095F687P4714a99087
12774G8846O0838j5323f882j12093E2343B2180a71667j29194B1828J02431L2740
12763A56999F2848a53223D44632B8210O0370b41296B0268J6634A3035Q2615f3317
12751A71858a62597A40384e2179p1017c2772j1692E3837a15993B0194J7700K81010
12740C18904R4245o9424c84512f6873D16202A28335B4445J6342J31349f1141q2907
12729a44048K9450C07259B9684i4565o5380N3785r0005C60962J0275a4979j14998
$$ y = [123435, -23063, -126645, -123685, 135008, -19153, 99829, -224249, -86882, -53790, 117150, 112491, 278934, -252364, -169351, 190087, -160553, -321442, 173251, 212821, 189834, 92062, -243977, 247761, 36350, -134812, -24961, 17313, 81703, -125984, -384079, 6687, 81401, -199087, 78846, 139684, 124361, -6882, -118975, 52343, 22180, -171667, -300861, 21828, 124259, 156999, 62848, -153223, 444632, 28210, 88580, -241296, 20268, 36902, 13035, 95650, -63317, 171858, -162597, 140384, -52179, -123196, -32772, -44464, 53837, -115993, 20194, 37894, 318904, 413149, 343725, -384512, -66873, 416202, 128335, 24445, 40787, 172136, -61141, -144048, -114598, 307259, 29684, -94565, -159945, -106160, -196165, 360962, 371237, -14979, -129977]
12718a29977B3201L38418A61463B4799P1835e234j22148d8782j72244i8331F2606
12706B65676A8091K63647B7347c9341A14737F537J69801i3366I9668D7331a8902
12694G6385a36750B9504R1840b21205l2264F5784b76320A20699P4711a35108H2546
12682C33910g4547E7077J00260J9731n0480E9309P6653K52823A01278c2223k15176
12671b47399B27708b77369B03763L2646j08379K11798F8984J27050B4659M9516
12661G4175b3251A71366L9913k4334g8763A48500J98855r9127H7253p960j4317
12650F4976J07342h8880j3823A06655c3119j08039f9263B2099e50G933N7744d6077
12637B19188b28702H0820o093b14794c5442A47761J64504h3567D6804b6621C24658
$$ y = [-129977, 23201, 361619, 161463, 24799, 96634, -5234, -127382, -48782, -221026, -98331, 62606, 265676, 18091, 281738, 27347, -39341, 114737, 6537, 176338, -93366, 99668, 47331, -18902, 76385, -136750, 29504, 121344, -221205, -253469, 65784, -276320, 120699, 195410, -135108, 82546, 333910, -74547, 57077, 157337, 177068, 126588, 59309, 135962, 388785, 101278, -32223, -247399, 227708, -277369, 203763, 236409, 128030, 339828, 68984, 196034, 24659, 74175, -23251, 171366, 211279, 186945, -78763, 148500, 347355, 248228, 87253, 79293, 64976, 172318, -88880, -102703, 106655, -33119, -141158, -69263, 22099, -550, 7933, 65677, -46077, 219188, -228702, 80820, 74727, -214794, -35442, 147761, 312265, -83567, 46804, -26621, 324658]
12625A36114J48357o6448B8044J34723F9549L4428e2416A51521a1832j11430E7548
12613a21274l21179e7876A61934e8104B9303J09193P3582r2834a75913h188A63576
12601A44413J18377m8282J46180E0921g0225A55735a10838I3437a45069j21365
12591b66434b4009D0942a29018A57193d235j78664A56099L2426c96051f3760N367
12580e8393A21480Q17J75171C3025J14369a97398A04284g282B01843h2570A66332
12568E8332M3922L6636m8788L9194i3561C58490d3760m9255j56576H0062l4486
12557D5576b25379b7793B40753a12006L64H1142a94084F1462J00084C5154Q5326
12546A20480M6911b30681C9669F325i1024a0700k9982q481C94053e1063A89852
$$ y = [136114, 284471, 218023, 28044, 162767, 69549, 103977, -52416, 151521, -11832, -123262, 57548, -121274, -442453, -57876, 161934, -58104, 29303, 138496, 212078, 119244, -175913, -8188, 163576, 144413, 262790, 214508, 360688, 50921, -70225, 155735, -110838, 93437, -145069, -266434, -24009, 40942, -129018, 157193, -4235, -182899, 156099, 188525, -396051, -63760, -58393, 121480, 122297, 297468, 33025, 147394, -197398, 104284, -7282, 201843, -82570, 166332, 58332, 102254, 138890, 90102, 129296, -93561, 358490, -43760, -93015, -249591, 80062, 45576, -225379, -27793, 240753, -112006, -111642, 81142, -194084, 61462, 161546, 35154, 120480, 167391, -230681, 39669, 6325, -91024, -10700, -40682, -49163, 394053, -51063, 189852]
12534a2248D2125b8700j23848A5756g8361k02143N5206A82635K23276C8795N7144
12523I5939d2677q0437A06273m6167g0920G4033J04116J02949F4567P380c1774
12511b14743A31051m1246b50882f4910A64656f9229j9208A98767a11330E5277
12500B9885J85908b98611j3448a03352B20L775K33344i5620A18492f6337n8368
12489a24705E7905R4697M6918M5897d8603j12489g2700C07457J17399D3399J53959
12478A97358K89849c2911o9735n7614B12153E8749K052b25957b8873j23482F7860
12466A14394i5045O733c8076A98048a83849G7072h3730A66171o4097a52953D8790
12454E2702K99096I0868i438p3451D9041c73501N2364a02292b5587B8627c5766
$$ y = [-12248, 42125, -28700, -152548, 15756, -78361, -280504, -225298, 182635, 405911, 38795, 95939, -42677, -123114, 106273, 60106, -70920, 74033, 178149, 281098, 64567, 71947, -31774, -214743, 131051, 89805, -250882, -64910, 164656, -69229, -88437, 198767, -111330, 55277, 29885, 215793, -298611, -312059, -103352, 220, 3995, 237339, -95620, 118492, -66337, -124705, 57905, 152602, 199520, 245417, -48603, -161092, -72700, 307457, 424856, 43399, 197358, 487207, -32911, -102646, -160260, 212153, 58749, 60801, -225957, -28873, -152355, 67860, 114394, -95045, -88312, -38076, 198048, -183849, 77072, -83730, 166171, 102074, -152953, 48790, 52702, 351798, 90868, -9438, -82889, 49041, -373501, -321137, -102292, -25587, 28627, -35766]
12442a17341B1938J12485a20831N9487j10334F9938K7247J02717I2455j838j9660
12431G0957A1779c4836H2402k9194J65490G2840a55977i136o3685q4013C6933
12419b2244j11588K7053C4294J95795G6898g9718E1546f1393q0770l7957P9007
12408a01113j3818C15318j51469a4318A08442D1200a75526f7237A8338b8877j03922
12397a32799a8810j9729k61651a20129m0374K0165E1972d39477B27062c07083
12386a2469C3159a822A2312K24724l1240a52599N4496M5887j56358c5427k60588
12375b96015M9549a03440B30979R5973A39780a54495M8809a7479A34402e9497
12364B18919J56023B4725K6408b25783Q6223D25979A70502e0888l4364j75938
$$ y = [-117341, 21938, 134423, -120831, -61344, -171678, 69938, 97185, 199902, 92455, 90617, 70957, 11779, -34836, 82402, 53208, 218698, 72840, -155977, -9136, -72821, -156834, 36933, -22244, -133832, -106779, 34294, 230089, 76898, -79718, 51546, -61393, -142163, -180120, -101113, -114931, 315318, 163849, -14318, 108442, 41200, -175526, -67237, 18338, -28877, -132799, -18810, -38539, -300190, -120129, -160503, -140338, 51972, -439477, 227062, -307083, -12469, 33159, -1822, 12312, 237036, 205796, -152599, -98103, -52216, -208574, -35427, -296015, -246466, -103440, 230979, 326952, 139780, -154495, -105686, -17479, 134402, -59497, 218919, 374942, 24725, 51133, -225783, -139560, 425979, 170502, -50888, -85252, -261190]
12354b61190M5283J663A7677g2886a1671q4694A35020E7675b7737H7281D1972
12342h1237J9432A75598a05899c0215A20482a77529A47235a6452A43148k3912
12332A19236J06145e0083l16845F1070L00953h4822C5443a28900B0937h282k01664
12321b09946D74531g5364A62416i8654A00960B0297J50725e1550j90563J17687
12311a24426B5380c2658k69627L614A35665C5636M0332J25531a4077C2221a71368
12299A23769g5910A27790f6492E3383a80669Q9647A35139f4929B29259a31806
12288a08051J8790j74893a18932C73135b8693A19337f9808A89003r0062A1830
12277c05869I1749L49038a90198P2100C89951K0993A91925D7110d52851B42756
$$ y = [-261190, -215907, -214244, 17677, -72886, -11671, -96365, 135020, 57675, -27737, 87281, 41972, -81237, -61805, 175598, -105899, -30215, 120482, -177529, 147235, -16452, 143148, 119236, 225381, -50083, -366928, 61070, 362023, -84822, 35443, -128900, 20937, -8282, -209946, 474531, -75364, 162416, -98654, 100960, 20297, 171022, -51550, -242113, -124426, 25380, -32658, -302285, -298671, 135665, 35636, 75968, 201499, -14077, 32221, -171368, 123769, -75910, 127790, -66492, 53383, -180669, -91022, 135139, -64929, 229259, -131806, -108051, -89261, -264154, -118932, 373135, -28693, 119337, -69808, 189003, 98941, 11830, -305869, 91749, 440787, -190198, -118098, 389951, 410944, 191925, 47110, -452851, 242756]
12266a54847A17818N2400K8499a24607L3754C59728R0682a58739d7902G45J21410
12255A22155K02118A53829a17447j01799A65294E4009L7034P133A8557J94279
12245B12836H1686N8618b20523A02418J25448a67975c0471l5193F2182g6838C21607
12233B26042C7053K64927A40839K11219A10873a56420e8863E1441J10352J68976
12223C30769j24386M5379D6978L42491K1940j82248J18672h0101C15548p6587
12213B38961a16248H1477g3695D8914h605H0680K06219a17265j31755A12326O6778
12202A79104a73737A12646a4542E47893B47836c0165C11018R1445j52692A9008
12191I773d063B06618G4969a34831M4311D26948g8021A75127c54060A10847K8285
$$ y = [-154847, 117818, 170218, 198717, -124607, -90853, 359728, 450410, -158739, -47902, 745, 122155, 324273, 153829, -117447, -219246, 165294, 54009, 91043, 98176, 18557, 212836, 81686, 140304, -220523, 102418, 227866, -167975, -30471, -65664, 62182, -76838, 321607, 226042, 37053, 301980, 140839, 352058, 110873, -156420, -58863, 51441, 161793, 330769, 206383, 251762, 46978, 389469, 411409, 229161, 347833, -80101, 315548, 238961, -116248, 81477, -73695, 48914, -8605, 80680, 286899, -117265, -249020, 112326, 179104, -173737, 112646, -14542, 547893, 247836, -30165, 311018, 402463, 249771, 19008, 9773, -4063, 206618, 74969, -134831, -90520, 426948, -78021, 175127, -354060, 110847, 139132]
12180A39132J68859a08443A81285L2009A03344L83818A29800a06833A58713j1961
12170A46752a97251B463J6541J97261K23887k10806H3574N4284a85504A97416
12159C20149i1103B12436r2104q605L5900B6510K1603a48129j33379A99835g540
12147B04923B0634a5033A09518a2511c457p1740D3410O980e1211p0947M6899d026
12134a56881r8022A12815P3092m1180J09675C9998J23964F8579j7489P6887a80899
12122B55487a63459C15971g6916j40474B35674A03897b46530k336q596A53615
12111a43872d6531j82674C49729d39258A01084P6712a03711K8500Q153p8853A24654
12099f0451j1042F5027a47353k48078H9056A575d0399r0209M3229k52739C03829
$$ y = [139132, 307991, -108443, 181285, 213294, 103344, 487162, 129800, -106833, 158713, 146752, -197251, 2463, 19004, 216265, 440152, 229346, 83574, 137858, -185504, 197416, 320149, -91103, 212436, 120332, 111727, 147627, 26510, 48113, -148129, -281508, 199835, -7540, 204923, 20634, -15033, 109518, -12511, -3457, -75197, 43410, 50390, -51211, -122158, -75259, -4026, -156881, -254903, 112815, 185907, 144727, 254402, 39998, 163962, 68579, 51090, 127977, -180899, 255487, -163459, 315971, -76916, -217390, 235674, 103897, -246530, -248866, -257462, 153615, -143872, -46531, -229205, 349729, -439258, 101084, 177796, -103711, -75211, -67058, -145911, 124654, -60451, -71493, 65027, -147353, -395431, 89056, 1575, -40399, -130608, -87379, -340118, 303829]
12087e2265a6942A08705D9213P7013g8502j90730B19779a99054C8556L4063a11399
12075D6462b49668b0795j29931E1246a33650M7157l8038A73911a82051c7414m6161
12064h3575n4945j61143B54999m7627J7707p575F0353b0446C83620O41117J78970
12053A203707B48936r3555k6987d9610B00590a15442A96701J6041b73227a25596
12042a85645O2406j30843B6096J90044O060k4157Q2880a67775B51973f124A94738
12030a11761D9942N563L413N90c09986A05122b3543j22304A07983g6873B60380
12018F6685A7131J93379D8962a29813N7261G1260M7046b03620A04448j8476C6813
12006b10916i3357j97833J21352J4072D6814K9363K53459a225n0280p6134K2112
$$ y = [-52265, -16942, 108705, 49213, 126226, -78502, -269232, 219779, -199054, 38556, 72619, -111399, 46462, -249668, -20795, -150726, 51246, -133650, -86493, -124531, 173911, -182051, -37414, -83575, -138520, -299663, 254999, 207372, 225079, 217504, 60353, -20446, 383620, 1024737, 1203707, 248936, 155381, 128394, -49610, 200590, -115442, 196701, 212742, -273227, -125596, -185645, -123239, -254082, 26096, 216140, 222200, 198043, 280923, -167775, 251973, -6124, 194738, -111761, 49942, 55505, 58918, 59508, -309986, 105122, -23543, -145847, 107983, -76873, 260380, 66685, 17131, 210510, 48962, -129813, -72552, 71260, 118306, -203620, 104448, 85972, 36813, -210916, -93357, -291190, -169838, -155766, 46814, 76177, 329636, -1225, -51505, -127639, -105527]
11995a05527j02106e8509I3J46178a13495B10798h7235n2373L0901c9291j49549
11984a88840F1989d5426A45933B0360a34629K4285A96102d61899D268N3306c13163
11972C4580J47471F1512J84223c26849j60305A14753c86718C01812c02113J5390
11962b86723M163a34683n7944C16937B2224b41462J20335B8034b94776a36008
11951F6724J25383a75410A45852F9571N7748c594B90370c35385F745b30101h4031
11939A19599a54847j21512B16806a54050j00214B3758K4869a91871B7948a0271
11928a73735l4128c2425A46092J17812q1459b68387a13775L4600j9889A38887
11917F8483M9965b27115M3510B5540K168D183a69l2178B65364G1171a8611q2954
$$ y = [-105527, -207633, -58509, 93, 146271, -113495, 210798, -87235, -139608, -108707, -39291, -188840, 61989, -45426, 145933, 20360, -134629, -110344, 196102, -461899, 4268, 57574, -313163, 34580, 182051, 61512, 245735, -326849, -487154, 114753, -386718, 301812, -302113, -286723, -282560, -134683, -192627, 316937, 22224, -241462, -121127, 28034, -294776, -136008, 66724, 192107, -175410, 145852, 69571, 127319, -3594, 290370, -335385, 6745, -230101, -84031, 119599, -154847, -276359, 216806, -154050, -254264, 23758, 48627, -191871, 27948, -10271, -173735, -207863, -32425, 146092, 263904, 182445, -268387, -113775, -79175, -99064, 138887, 68483, 118448, -227115, -183605, 25540, 27708, 4183, -169, -32347, 265364, 71171, -18611, -101565]
11905a01565M2219N057A18592m3657J09972J09567j37660k2611k9997j0349k432
11894I1425J05846b92711c7952A20096f3035B19984a45524P499H3820l247b51882
11882A78209F4063Q92J13530b8214j02475G3734a3598A27430g2435G8327j9015
11871E9312a20742L0904k5207A34160D052i8199p8563e4476j46422c1879k03303
11860b35182I5319d844r286m10275b09014C493g4071A01479c46817I2984k2605
11849G0379b60440a1099r6926A23894C3514j0584J25633L4757K84902a13491J2863
11838a00628q0563h1755K9739N710p178A15207A3602R2807b29728d3660n19B10933
11825a65221N2144A17193b55406f5502J3672a039j64230A12246C8650j268h9240
$$ y = [-101565, -59346, -54289, 118592, 74935, 184907, 294474, 156814, 134203, 104206, 93857, 91425, 197271, -292711, -37952, 120096, -63035, 219984, -145524, -138025, 83820, 80573, -251882, 178209, 64063, 64955, 178485, -28214, -130689, 73734, -13598, 127430, -72435, 78327, 59312, -120742, -89838, -115045, 134160, 4052, -98199, -176762, -54476, -200898, -31879, -235182, 95319, -4844, -14130, -424405, -209014, 3493, -74071, 101479, -346817, 92984, 70379, -260440, -11099, -108025, 123894, 33514, 22930, 148563, 183320, 468222, -113491, -100628, -181191, -81755, -52016, -46306, -53484, 115207, 13602, 106409, -229728, -43660, -44179, 210933, -165221, -113077, 117193, -255406, -65502, -51830, -1039, -165269, 112246, 38650, 37382, -89240]
11813b53605O2779K0989P0898M490H9354J83491i534n5337C70523A6809J29937
11802A46746L5794E3072L4155a9019A68427b79244Q8207B23975F5054d23059a93589
11790A42788Q641m9480l6450a13813e879j75055A59303A7344N4802g8402j13073
11779a91475a4442G2775a1859B70764d9883j51859B8608e724C00409B5636J50327
11768A75963h1804j72671C9598K2128K92704G7330L400d00679c5054j01098q69
11757a37021B29301a1775B72438d13729d3260p8893A93742a71870d7707j77386
11747b25093E646J07797c82434I867L98712a66378B22250r9529a9088k59128B52941
11735d96039A25019f4375J8299m2893k32185K7110A40163a24594j00384K8414
$$ y = [-253605, -190826, -169837, -98939, -94449, 89354, 272845, -9534, -64871, 370523, 16809, 146746, 182540, 53072, 87227, -19019, 168427, -279244, -191037, 223975, 65054, -423059, -193589, 142788, 151429, 101949, 65499, -113813, -5879, -180934, 159303, 17344, 72146, -78402, -191475, -14442, 72775, -11859, 270764, -49883, -201742, 28608, -5724, 300409, 25636, 175963, -81804, -254475, 39598, 61726, 354430, 77330, 80730, -400679, -35054, -136152, -137021, 229301, -11775, 272438, -413729, -43260, -122153, 193742, -171870, -47707, -225093, 5646, 113443, -382434, 9867, 408579, -166378, 222250, 122721, -19088, -278216, 252941, -496039, 125019, -64375, -46076, -88969, -321154, -294044, 140163, -124594, -224978, -196564]
11725a96564a7390H7714A7910m183g0000A21123m7644C0370K51674G3292l2599
11714D0693h3278I2455J14058a50027A1512c0835A96496P8209d2678k44249d2438
11702a98775A20624a87249f8160A67967e1248B27257a21931j13240P1383F2495
11691A01271a52886J7374B55831D0646a18834j1339e3726k48834B28756a6154
11680A50886b53311A6498M4029L9394M000H683J71412E5032Q287g6523J0360G6253
11667B99908a15998L54C9762O3701m0077a55852d605q6339F3885J2097J01753
11656A77735b4300G9142k3986R2523R9378K3484B9512b04727q9090B91885m1008
11645B50877b03024H0618O6382a10887A67759o9551Q2238J27629b40558j98832
$$ y = [-196564, -17390, 87714, 17910, 13727, -70000, 121123, 73479, 30370, 282044, 73292, 40693, -83278, 92455, 206513, -150027, 11512, -30835, 196496, 274705, -42678, -286927, -42438, -198775, 120624, -187249, -68160, 167967, -51248, 227257, -121931, -235171, -163788, 62495, 101271, -152886, -135512, 255831, 40646, -118834, -130173, -53726, -302560, 228756, -16154, 150886, -253311, 16498, 60527, 99921, 103921, 8683, 180095, 55032, 63319, -76523, -66163, 76253, 299908, -115998, -115644, 39762, 103463, 63386, -155852, -4605, -90944, 63885, 75982, 177735, -24300, 79142, 55156, 147679, 247057, 270541, 29512, -204727, -293817, 291885, 250877, -203024, 80618, 147000, -110887, 167759, 98208, 180446, 308075, -240558, -439390]
11635d39390f055B64123c22395C9614h4963q4286C5611J0690m613c2065C3048
11623B2878j0487K15723a33697j15430C46894j32633H2137d9241m5033B3099L6664
11612E9763J47585P3632G3167a09804d2818q1280l3194c0599k34877g737A79451
11600g7975k7654c6591A97484d4146n0516H2093H950a4701D5952M1416J00096
11589A87464P558c43838A45573c5907l21805b9311J0923j05613d2648A97564k8572
11578A68992D3563g4482f424F7463J25127i2306A69619J15331o0946a8D01636
11566a25376L3450a3316C8670a90603e2264J0B55190a35990E4125J88758p8004
11555A64879c42342J47328g2913A63390n783g7638A10884P8422g9136B04928Q9426
$$ y = [-439390, -6055, 264123, -322395, 39614, -84963, -169249, 35611, 46301, 41688, -32065, 33048, 22878, 12391, 228114, -133697, -249127, 346894, 214261, 82137, -49241, -94274, 23099, 59763, 207348, 280980, 73167, -109804, -42818, -124098, -157292, -30599, -265476, -7737, 179451, -77975, -105629, -36591, 197484, -44146, -94662, 82093, 8950, -14701, 45952, 87368, 187464, 195022, -343838, 145573, -35907, -357712, -29311, -18388, -124001, -42648, 197564, 168992, 43563, -74482, -6424, 67463, 192590, -92306, 169619, 284950, 224004, -18, 401636, -125376, -91926, -13316, 38670, -190603, -52264, -52254, 255190, -135990, 54125, 242883, 164879, -342342, -195014, -72913, 163390, 157607, -77638, 110884, 189306, -79136, 204928, 294354]
11544B94354A38733f4690K8987A09751b34699B03180b06292B4980J03614M8620
11534A77214a70308a1213C61077F3084C06P4394C4630B079J31919m3425N4639
11523A45212N1904J43301f2954A41755E4005g4025A84314K53687A26303E6411
11512h4595A11457K7981C2725J3822A2701J72148q840M7837k3072J5193r2449
11501A23518g3305B67525A24132P0025R6294o5864f0665A19870C5718b81713C2605
11489a48239H6054N7293K40344A61053g5688B24766J7153A16856a07871b6293
11478H872Q4227f5062A68926N5773A6477K22144e062B03528K1661a26540j74457
11467c00997A66146B892J50148E3511F936N357J58573O7988f1242B2019f5215
$$ y = [294354, 138733, -64690, -35703, 109751, -234699, 203180, -206292, 24980, 128594, 177214, -170308, -11213, 361077, 63084, 306, 74700, 34630, 2079, 133998, 90573, 145212, 197116, 340417, -62954, 141755, 54005, -74025, 184314, 438001, 126303, 56411, -84595, 111457, 139438, 32725, 46547, 12701, 184849, 176009, 223846, 200774, 215967, 123518, -73305, 267525, 124132, 194157, 290451, 224587, -60665, 119870, 35718, -281713, 32605, -148239, 86054, 143347, 383691, 161053, -75688, 224766, 241919, 116856, -107871, -26293, 8872, 93099, -65062, 168926, 224699, 16477, 238621, -5062, 203528, 225189, -126540, -300997, 166146, 2892, 153040, 53511, 6936, 12293, 170866, 238854, -61242, 22019, -65215]
11455a80211q0665A69153O6558c3267p0847F0286J63988l4392a20568A77491e7550
11443b240B89070n9550e8372H1578e0689A45818N4864o0153B2826K61719J57246
11432D41791a91584f9086j0266B2089J80249K23271B00159l7204a19338G7295
11421b43930f5655n4799j6938B79924f7295j87204N8555J5320A718b3024D2962
11409a44076j8954B7094c450o8984p8538k68506C2178a89954A31645D5981f6188
11397i284k31234D9533B3400j1665L2355e5696j41605L5756B25060a28779L5705
11386i3074d4395F8073e18172D11431c44585J49487D2865J49423k737c9329C89769
11374a36441A51772l008e3181J5357m3453j15573E7080f1174A22936e6669C66502
$$ y = [-180211, -260876, 169153, 235711, -33267, -104114, 60286, 224274, 189882, -120568, 177491, -57550, -2240, 289070, 229520, -58372, 81578, -50689, 145818, 200682, 140529, 22826, 284545, 441791, -191584, -69086, -79352, 22089, 202338, 425609, 200159, 162955, -119338, 77295, -243930, -65655, -120454, -137392, 279924, -67295, -254499, -195944, -180624, 1718, -23024, 42962, -144076, -163030, 27094, -3450, -72434, -150972, -419478, 32178, -189954, 131645, 45981, -66188, -9284, -240518, 49533, 23400, 11735, 44090, -55696, -197301, -161545, 225060, -128779, -93074, -44395, 68073, -518172, 411431, -344585, -195098, 42865, 192288, 189551, -39329, 389769, -136441, 151772, 148764, -53181, -37824, -81277, -196850, 57080, -61174, 122936, -56669, 366502]
11362E9558j3119c806j39156q4626M6041P0382A50923j6856m4823b21765A22896
11350B8734J26690a22589A02887c70604f1115a2341D13434G1563b49679e2341
11339d5649B6299a78697q3045Q4825K4402k15304a23308L237B41640L0452o0176
11328B11916i6167k2002A90713F838L1818K4918a45206n2204B78037a08584c1176
11316a58717F3766b64083a561A23137M6960B3585a4090A63233J67046A40484b64322
11304b26244M4636Q3313j49959K5005A26797a6033A08985d48460b10757e0794
11293D2188g1295m1307A22782b8966j30171N0292A11765J87688a22430a8825l7698
11282e6523o4854E9612b80064A31009M7758G9026k8896b69998E78538A3987R707
$$ y = [59558, 46439, -3806, -142962, -227588, -181547, -111165, 150923, 134067, 89244, -221765, 122896, 28734, 155424, -122589, 102887, -370604, -61115, -12341, 413434, 71563, -249679, -52341, -45649, 26299, -178697, -261742, -176917, -152515, -367819, -123308, -120071, 241640, 272092, 211916, -96167, -118169, 190713, 6838, 38656, 63574, -145206, -197410, 278037, -108584, -31176, -158717, 63766, -264083, -1561, 123137, 170097, 23585, -14090, 163233, 330279, 140484, -264322, -226244, -181608, -98295, -248254, -223249, 126797, -16033, 108985, -448460, -210757, -50794, 42188, -71295, -112602, 122782, -28966, -159137, -108845, 111765, 299453, -122430, -18825, -56523, -121377, 59612, -280064, 131009, 178767, 79026, 50130, -269998, 578538, 13987, 23694]
11271B3694L070a18070d1654H7409q013a73069d8357j15044d7053a7939j8613
11260c6552k73504i8427o7580A60703a61419j89731A46572B2133d9300m3628A39395
11248b49210C5011J28459G1164a33496n650r185B70974h5885A01699b93821A43419
11236b8839a0191D536Q7383C2539K0563A2007K33906f823k14213J3747I5716d2136
11223A08244a42206k6313c738B90354G2237C5533Q834G591b39287K9594A01182
11211d1558I8310i0188C27167A9700a74032E3222J3909c37223J34298c7427K663
11200c4764B61795b76j44588B14985r8366a09817B78636b05839Q4959r3053k75307
11189d89240G1706J98955c2590f4j21597F0422R8493A8285p159c2412G9028C1876
$$ y = [23694, 26764, -118070, -41654, 87409, 79396, -173069, -48357, -163401, -47053, -17939, -36552, -310056, -98427, -166007, 160703, -161419, -351150, 146572, 22133, -49300, -92928, 139395, -249210, 35011, 163470, 71164, -133496, -139146, -148331, 270974, -85885, 101699, -293821, 143419, -28839, -10191, 4536, 91919, 32539, 53102, 12007, 245913, -6823, -221036, -207289, 95716, -42136, 108244, -142206, -168519, -3738, 290354, 72237, 35533, 44367, 7591, -239287, -209693, 101182, -41558, 98310, -90188, 327167, 19700, -174032, 53222, 67131, -337223, -202925, -37427, -34764, 261795, -276, -144864, 214985, 116619, -109817, 278636, -205839, -120880, -213933, -489240, 71706, 270661, -32590, -64, -121661, 60422, 158915, 18285, 11126, -32412, 79028, 31876]
11176a64834B05202l5656b01086R7784j39722j23434C9565c56777J73600e2240
11165a07787l6935D995J37334g2720q0758B00027G0247K23649j38620c06218A56269
11153d31456F524h4810P771H1952b910B37017c31803i9545j1196J621D2847a15753
11140b21120N9046c3163k7003k31135a33273B2765d6070C6556N5540A3650h0546
11128a54399C15696e6206j79315a8346A17383g1425A00629J39625c3647H0422
11117f9095o3803A62563J08965A17420e0612G989g3708A24832h5108j1130B07981
11105E69603A09535a92093C76002h9528J4387A14698m5477a43354F280J60828
11095A67108L94265B70746j25137J11271D3777R2951K4028M7430H739K3115J44279
$$ y = [-164834, 205202, 169546, -201086, -103302, -243024, -366458, 39565, -356777, -183177, -52240, -107787, -144722, 4995, 142329, -72720, -153478, 200027, 70247, 293896, 155276, -306218, 156269, -431456, 6524, -84810, -77039, 81952, -2910, 237017, -331803, -99545, -110741, -109120, 42847, -115753, -221120, -162074, -33163, -60166, -291301, -133273, 22765, -46070, 36556, 92096, 13650, -80546, -154399, 315696, -56206, -235521, -18346, 117383, -71425, 100629, 240254, -33647, 80422, -69095, -132898, 162563, 271528, 117420, -50612, 7989, -73708, 124832, -85108, -96238, 207981, 569603, 109535, -192093, 376002, -89528, -75141, 114698, 69221, -143354, 6280, 167108, 561373, 270746, 145609, 256880, 43777, 136728, 160756, 208186, 8739, 31854, 176133]
11084A76133K71745g2838A62012m2754J62900E9520L15253j55607J52130o7885
11074C03411J30867e0912a6941B93172J70059k0248J2362A81784P9873R9630P5682
11063D36969o2627J07452J00021B36352L55971A73692L23835K46670C56396R4434
11053D50830K29687k39661K87736A87767M65546J61768k8296n2557j10585o0773
11043E62870R4544q4761j09741l1274K55648j39878j30922L97147j47865o6935
11033E98833J48467o4370r0660L34221k84576K6547Q9229l3836A97381P23317
11023I20698m31611O8147J01651J52134C15623A13137N93662k98237J91946K5166
11013F25674O199o1200j50663R9427l1063K94072l08479A19958M45069m5016L0358
$$ y = [176133, 447878, -72838, 162012, 119258, 282158, 59520, 374773, 219166, 371296, 303411, 434278, -50912, -16941, 293172, 463231, 442983, 455345, 181784, 261657, 361287, 436969, 374342, 481794, 581815, 236352, 592323, 173692, 497527, 744197, 356396, 450830, 680517, 440856, 728592, 187767, 653313, 815081, 786785, 734228, 623643, 562870, 657414, 572653, 462912, 431638, 687286, 547408, 416486, 813633, 665768, 598833, 747300, 682930, 592270, 926491, 641915, 668462, 757691, 723855, 197381, 920698, 489087, 557234, 658885, 811019, 315623, 113137, 706799, 408562, 600508, 625674, 631873, 570673, 420010, 519437, 488374, 782446, 473967, 119958, 565027, 520011, 550369]
11002E50369O4464K46735k44640k35543K27642G0759L14795N61209m20135p2424
10992D54204n56J82253k6316k22664P4813j2825M55154K00497j10860n8397o7720
10981H67583K94863j71671K52826k43481N14279q3916Q1821O39338R7187L72701
10971B621530J11016J45604k11695N39996n23414j73390k56204q55123K81217
10962A679537p140l45994R2702n26516K97809P3300k77107K06001P1291l4982
10952A228901l22459k52709J55332k94787q1427k0623A91638m9520a263D68839
10941G3250L57900C2300J19237K42402q8593j47093p3662P750L73657A70153o8372
10930A01781J67572d3279p3483r4243Q1101A81915a18344K6621k8956D37128a16695
$$ y = [550369, 614833, 861568, 616928, 381385, 609027, 70759, 385554, 946763, 526628, 454204, 453648, 635901, 609585, 386921, 461734, 448909, 904063, 1104560, 993700, 935303, 867583, 1162446, 990775, 1243601, 1000120, 1514399, 1430483, 1512304, 2151642, 2248829, 2621530, 2732546, 2878150, 2666455, 3206451, 2683037, 2509647, 2253443, 1398320, 1679537, 1672397, 1326403, 1419105, 892589, 1190398, 1263698, 986591, 1192592, 1263883, 1228901, 906442, 653733, 809065, 514278, 432851, 412228, 191638, 142118, -1263, 468839, 73250, 431150, 32300, 151537, 393939, 305346, 158253, 84591, 92341, 465998, 170153, 101781, 269353, -43279, -116762, -211005, -129904, 181915, -118344, -91723, -120679, 437128, -116695]
10918A2398d9093B94259a77078E4583J40428a25287C1427b7842k0495A53461g4898
10906e7824j94405Q0435A51435a63640F9747g9399k6088B41393a55125B13683
10895h2405F9836b44094F8670a39046B45553b36711P8792C3185J05401e8410k30621
10884b89031q2755J75070j06810i9677O435P595F2015a22141A41665b90029A95181
10872e0101B1906b94207c7304A03855h0049A19874K43503b19659B38459C3142
10861g534q320j21292A45881b5617k83374E9942k7683a69971j8743C20816O6653
10850C87469E5930a1927k21773B02704J058h5454P254A7960i6674l4574C03999
10838f1092i291E6542J46976c3705B43168B2728b2848p2140B2223N7171J65496
$$ y = [12398, -49093, 294259, -177078, 54583, 195011, -125287, 31427, -27842, -48337, 153461, -74898, -57824, -252229, -171794, 151435, -163640, 69747, -79399, -105487, 241393, -155125, 213683, -82405, 69836, -244094, 68670, -139046, 245553, -236711, -157919, 33185, 138586, -58410, -289031, -371786, -196716, -303526, -99677, -93242, -85647, 62015, -122141, 141665, -290029, 195181, -50101, 21906, -294207, -37304, 103855, -80049, 119874, 363377, -219659, 238459, 33142, -7534, -15854, -137146, 145881, -25617, -308991, 59942, 32259, -169971, -188714, 320816, 387469, 55930, -11927, -233700, 202704, 203762, -85454, -78200, 17960, -96674, -131248, 303999, -61092, -9291, 56542, 203518, -33705, 243168, 22728, -22848, -94988, 22223, 79394, 244890]
10827B44890a18113A70262i2361A92967a18383D70217f1289k23423e123E1275
10816C2403g1432P714H8260J95848j32730k6844C4446a81763k0391b5781E7182
10804B07423a33310A08410a10570n1569A8349a34063I8733b42516c2028k06114
10794b38142E0730J3862g2135F2268N3767j2162k7616b34301B4611K10633a27665
10782H1321b98000B5756C572h5787B50500d6749l11225E4271c57113F3596a09711
10770d6915C2973g714q9205E5247J3729c417E6078l483a37338p1057B54836D1096
10757A66261F7508J29709c4658k25040D6004c41319B42691p4162C8246l678a21710
10745H4025b49867B9570c4649C43385j26945b38020a00056A42802l8015m8670
$$ y = [244890, -118113, 170262, -92361, 192967, -118383, 470217, -61289, -284712, -5123, 51275, 32403, -71432, -63718, 88260, 284108, 151378, 124534, 34446, -181763, -202154, -25781, 57182, 207423, -133310, 108410, -110570, -162139, 18349, -134063, 98733, -242516, -32028, -238142, 50730, 64592, -72135, 62268, 116035, 103873, 76257, -234301, 24611, 235244, -127665, 81321, -298000, 25756, 3572, -85787, 250500, -46749, -357974, 54271, -357113, 63596, -109711, -46915, 32973, -7714, -96919, 55247, 68976, -3417, 56078, 52595, -137338, -208395, 254836, 41096, 166261, 67508, 197217, -34658, -259698, 46004, -341319, 242691, 168529, 38246, 34568, -121710, 84025, -249867, 29570, -34649, 343385, 216440, -238020, -100056, 142802, 104787, 56117]
10735E6117b58504a19807j10835Q2764d6276q8783p4295B61040c49380a11678
10724b9673m2568F945a53117E5127b54991A647b00948A9833d8039D7854J57892
10713B05746a76175j26681H3471h6333b1937H6559c71764I8211a34088E5415a62304
10701E9382d4885n9142C802d519j06015q7652m7126o1968H6949G841a43967E7193
10688b16757C4340b00705f4203A03094A2683c8653l38869A32328a7397j72336
10678a89733r379Q2982L0991A05505a98674a556l4887o7025B67665b15209p6955
10667b92164i0525j47451f1251D18193a17588O290A54219A5765J71911b82205
10656A28963b03296l957h9314k01107A45176a03997o272A74190b65827R5680P3058
$$ y = [56117, -258504, -119807, -230642, -147878, -46276, -135059, -209354, 261040, -349380, -111678, -29673, -72241, 6945, -153117, 55127, -254991, 1647, -200948, 19833, -48039, 47854, 205746, -176175, -302856, 83471, -86333, -21937, 86559, -371764, 98211, -134088, 55415, -162304, 59382, -44885, -104027, 3802, -4519, -110534, -198186, -245312, -307280, 86949, 7841, -143967, 57193, -216757, 34340, -200705, -64203, 103094, 12683, -38653, -377522, 132328, -17397, -189733, -199112, -116130, -85139, 105505, -198674, -1556, -36443, -103468, 267665, -215209, -292164, -90525, -237976, -61251, 418193, -117588, -111298, 154219, 15765, 187676, -282205, 128963, -203296, -207253, -89314, -290421, 145176, -103997, -110269, 174190, -265827, -170147, -97089]
10645i7089j81870M9237f2624l30537J48572I5999k1053b9931B5307M0792J56066
10634B22165a07718b7123A09330J8444a3091D1711G75e5642k31233A39612E1098
10622a79060D2905q622K47529b21042J07542c5100I2864h9720o1445k9026l2364
10611b12555c2889A54889b14448R2731I1466a94133A42672b4955D4697c94701
10600d5867d290m6970J3142I7257P760a002B13750E4594a16433j51842c4120j66720
10588b00840C1068K36303i5271F7952a48433a8169k3413A75142d16419h2562D7810
10576B4091g6958A13370J00083e1576o9929A35888B5210a16963j6414g333A29250
10564e7190r0232F906L22579B9769a79745B54788i7254k76256M4633b5438j2732
$$ y = [-97089, -278959, -229722, -62624, -393161, -244589, 95999, 74946, -29931, 25307, 66099, 222165, -107718, -27123, 109330, 127774, -13091, 41711, 775, -55642, -286875, 139612, 51098, -179060, 42905, 34283, 281812, -221042, -113500, -35100, 92864, -89720, -151165, -180191, -212555, -32889, 154889, -214448, -121717, 91466, -194133, 142672, -24955, 44697, -394701, -45867, -4290, -51260, -38118, 97257, 105017, -1002, 213750, 54594, -116433, -268275, -34120, -200840, 31068, 267371, -95271, 67952, -148433, -18169, -41582, 175142, -416419, -82562, 47810, 24091, -76958, 113370, 213453, -51576, -121505, 135888, 25210, -116963, -133377, -7333, 129250, -57190, -147422, 6906, 329485, 29769, -179745, 254788, -97254, -373510, -328877, -25438, -38170]
10553c8170C14143H0954c8309j0005j41676h8622l1013A33388b02618G1506K42901
10542C14407F2668b36512O7619B44748e5290p820H8382J47557P6187b81590A21361
10530a0462n252j9953J4538A27908J2446a35616G2970a33690B46948a5407k73424
10519b88831C51615e2229o5519F0221A1362c5953B55465G8685K9686e8503a6277
10507a52366B7481K2839f890k30934P0258R092p4894i4709j72096C0856b36582
10495c58186j20190B59797a69889G8354a72835L2598l133l9928l8018A63958b47308
10483i2093l6195C5596J22948l4953K09828M1140A13400K88194A59450J9964c33007
10471C06114a99940I9371j0628L2007J0479h0549a8778m7194A60597g5409G6040
$$ y = [-38170, 314143, 80954, -38309, -48314, -189990, -88622, -119635, 133388, -202618, 71506, 314407, 62668, -236512, -168893, 244748, -55290, -63110, 88382, 235939, 312126, -281590, 121361, -10462, -15714, -35667, -21129, 127908, 140354, -135616, 72970, -133690, 246948, -15407, -288831, 351615, -52229, -117748, 60221, 11362, -35953, 255465, 78685, 108371, -58503, -16277, -152366, 27481, 50320, -6890, -237824, -167566, -158474, -233368, -94709, -266805, 30856, -236582, -358186, -478376, 259797, -169889, 78354, -172835, -140237, -143370, -183298, -221316, 163958, -247308, -92093, -128288, 35596, 158544, 123591, 333419, 374559, 113400, 401594, 159450, 179414, -333007, 306114, -199940, 99371, 88743, 120750, 131229, -80549, -18778, -65972, 160597, -75409, 76040]
10459b3870j26333A16995L0580a17625j01162C25093j32376b5386r6441L9733
10449h2094q7901N0345J9253k40064h1886F0958J43393J00713f2996k51973A57117
10437I9760J1998a72217A42160b25361h4361b0675j75635r2949j8424J37375k19345
10426c89653D46K33083j03855e6245H2572d3386o1684d2901C74917a8320A71172
10414F7717l2668K05841g4380B16411K60150A33405n3954b5043A04101M8696j2053
10403A40744a57544c4725A24811a53149D8761J4639L90105A79702J10654a9277
10392c32343A18019K0499N4728l0208m1649a88097O6762B03267l4713k8288d1525
10380D92258P8067k54125A16170e2348B72812c0817B86686l5929l8025K79535
$$ y = [-23870, -150203, 116995, 147575, -117625, -218787, 325093, 192717, -25386, -121827, -82094, -169995, -119650, -100397, -340461, -81886, 60958, 204351, 305064, -62996, -314969, 157117, 99760, 111758, -172217, 142160, -225361, -84361, -20675, -196310, -289259, -307683, -170308, -389653, 446, 233529, 129674, -56245, 82572, -43386, -105070, -42901, 374917, -18320, 171172, 67717, 35049, 240890, -74380, 216411, 476561, 133405, 79451, -25043, 104101, 152797, 140744, -157544, -34725, 124811, -153149, 48761, 63400, 453505, 179702, 290356, -19277, -332343, 118019, 138518, 193246, 163038, 121389, -188097, -121335, 203267, 168554, 140266, -41525, 492258, 570325, 316200, 116170, -52348, 272812, -30817, 286686, 250757, 212732, 492267]
10370D92267b12603E107J30044J20177L42800k65572L58985l09434O3897p6324
10360C69680A75693p6335J39476g8435B1212K17060p0131m3752L16783o3152J82241
10349E60261j12421j91718G2434a4472k0384C54746M0433b4802A08735a43703
10338C28607F6973P6935L5804L5078o7577D6042J58417Q7885i75D19955e764m6020
10326e1784k16040C50979j24470Q4009K0428g0648j3187b3553j5824B17348K66976
10315D84324G6485J59243e5936H6359D224i9992I0938a05740k8657k50426a02121
10303B76455b18787R2237k48006e7245k59655J28158e5619q4746p2422g8664G0234
10291G6370a34001O3267r1224J2974L4709d6436l2579F6034c0342A37601b8141
$$ y = [492267, -212603, 5107, 135151, 255328, 598128, 332556, 691541, 382107, 446004, 369680, 175693, 99358, 238834, -78435, 21212, 238272, 168141, 124389, 441172, 378020, 560261, 447840, 256122, 72434, -14472, -34856, 354746, 395179, -24802, 108735, -143703, 328607, 66973, 143908, 179712, 214790, 147213, 46042, 204459, 292344, -975, 419955, -5764, -51784, -267824, 350979, 226509, 310518, 330946, -70648, -83835, -23553, -39377, 217348, 484324, 76485, 235728, -55936, 86359, 4224, -99992, 90938, -105740, -134397, -384823, -102121, 276455, -218787, -126550, -374556, -57245, -316900, -188742, -55619, -140365, -212787, -78664, 70234, 76370, -134001, -70734, -161958, -148984, -114275, -46436, -79015, 66034, -30342, 137601, -28141]
10279c6239o3677A43315O1997a44051A23150R4175B9550b8973m5353A82756e9601
10267a39553G7107e4482n9202M7609D6821e9589B91111F8130K3798D1867J61640
10256B03507J31045O1724H0005P3548J62221c5371j81242f3474A5386e2888G9437
10244a89633k33566J35150M9406K4375B01992E8265m60K02770G359K30233d25873
10232h8627D06839j84215d44323J33535a2449p5267j68030d12A08234e707j04374
10221a10081a2380k08152C66129a89073D512J08143l6734a90301J1625b3431A24409
10209a19434F4025O5213c1150n1727j73295C8399L7339f7109L3400R216A85704
10197a57058j10360B25892b71224a17469J9108B953f2300j45174m1170d6245k45909
$$ y = [-36239, -99916, 143315, 205312, -144051, 123150, 217325, 29550, -28973, -74326, 182756, -59601, -139553, 77107, -54482, -113684, -66075, 46821, -59589, 291111, 68130, 91928, 41867, 203507, 334552, 396276, 80005, 153553, 315774, -35371, -216613, -63474, 15386, -52888, 79437, -189633, -423199, -288049, -238643, -214268, 201992, 58265, 57805, 260575, 7359, 237592, -425873, -88627, 406839, 222624, -444323, -310788, -12449, -87716, -255746, -412, 108234, -5707, -110081, -12380, -220532, 366129, -189073, 4512, 112655, 75921, -190301, -178676, -23431, 124409, -119434, 64025, 129238, -31150, -82877, -256172, 38399, 75738, -67109, -33709, -24493, 185704, -157058, -267418, 225892, -271224, -117469, -98361, 2953, -62300, -207474, -248644, -46245, -292154]
10186b92154c7848B20577k6953d9202A47908e0928m3188m1561M2376b4616B26407
10174H6443b32544g4852B7717a8457l24154J54801I2610l6042a14333A4893i4445
10162f4783L1011n5087K455H9288i2361J3258j84831a21237c306j94262Q9435
10151a08133l74968e6983K8399r7610j92274C4669J85856B6529e49929I7398g4888
10139C56594I9273c4663B8259b27708L0867I2427A9055J6677D784h3875A7874
10127a357B77698a02434j35133p603A4988i9034A31488a43285A8812Q1437C8396
10115B49779a37456G9526j0976a32460k33807C4255a58971K8456f0180j26613
10105a86793i3117m5526k09943e3195j88234q171Q8992B4640J95341a42113j31815
$$ y = [-292154, -37848, 220577, 193624, -49202, 147908, -50928, -94116, -135677, -93301, -24616, 226407, 86443, -232544, -74852, 27717, -18457, -342611, -187810, 92610, 56568, -114333, 14893, -94445, -64783, -33772, -88859, -86404, 89288, -92361, -79103, -263934, -121237, -3306, -197568, -108133, -483101, -56983, -28584, -126194, -318468, 34669, 220525, 26529, -549929, 97398, -74888, 356594, 99273, -34663, 28259, -227708, -196841, 92427, 19055, 35732, 4784, -83875, 17874, -1357, 277698, -102434, -237567, -245170, 14988, -99034, 131488, -143285, 18812, 100249, 38396, 249779, -137456, 79526, 68550, -132460, -366267, 34255, -158971, -130515, -60180, -186793, -93117, -138643, -348586, -53195, -241429, -249600, -160608, 24640, 219981, -142113, -273928]
10094b73928a04892m2034B35708B2484L4876b37966m4138L3394I2755k4337c1271
10082F5001J56017a81930e4140C35905A62484a88547j33324A01526b01924e2927
10071e4309k82084d2591k87878a60950D4801K7004K38654a47073C8397d5582m2240
10060h7822k28622d905m01222b0245l7263l1156m8384m5190h536E1730a47500
10048b56984a3177k48317a1483j56675G7704c4977o9015a7158k6778j86419e4146
10036B34272e479o5073b9233B1117J24656b4911k5779p0691I8488G879K18738
10025B26617d7609k51576P4655A01608b65903e662B75368A17114d433k3811l44201
10014c72445g3228o1773o5642B04989E8777g5381J5804j10894B96563a32730b3034
$$ y = [-273928, -104892, -146926, 235708, 22484, 57360, -237966, -282104, -248710, 92755, 68418, -31271, 65001, 221018, -181930, -54140, 335905, 162484, -188547, -321871, 101526, -201924, -52927, -54309, -336393, -42591, -330469, -160950, 44801, 71805, 310459, -147073, 38397, -45582, -87822, -316444, -4905, -406127, -20245, -57508, -88664, -137048, -182238, -8536, 51730, -147500, -256984, -13177, -261494, -11483, -168158, 77704, -34977, -103992, -17158, -43936, -230355, -54146, 234272, -5479, -70552, -29233, 21117, 145773, -24911, -50690, -121381, 98488, 7879, 226617, -47609, -299185, -224530, 101608, -265903, -5662, 275368, 117114, -4433, -28244, -372445, -73228, -135001, -200643, 204989, 58777, -75381, -59577, -170471, 296563, -132730, -23034]
10002f8101G1683J2602e7190j85747h9220c3431j89219H7273b43673F4436j7814
9991D6622b31381k37143J83108Q0476g4527D0079N9078b91144Q1997R48A77771
9979a5769r1994E542L15793b25082e0442A06086c15733B03483f8932q981j34089
9968b12002A41586a12487D783K10528c73625e0523o6077A50802f7955c0458H0494
9956B21997H1102M8778q028K5773J7150G3083a30873r7007e1564l4980q0175l28109
9944d94828I9756c67440p5207a31997j41687l753d7717I4714b71759j8897d0777
9932A7509J18934F77b03017e3521j81765l5338H9748e5376j92397a14748A9613
9920E3203h2779K2910q0621E9360c46213A21577a07574e2549k2625j93014F3749
$$ y = [-68101, 71683, 84285, -57190, -242937, -89220, -33431, -222650, 87273, -243673, 64436, 46622, -231381, -468524, -285416, -204940, -74527, 40079, 99157, -291144, -209147, -208199, 177771, -15769, -107763, 5542, 321335, -225082, -50442, 106086, -315733, 203483, -68932, -77913, -212002, 141586, -112487, 4783, 215311, -373625, -50523, -116600, 150802, -67955, -30458, 80494, 221997, 81102, 129880, 121852, 147625, 164775, 73083, -130873, -227880, -51564, -86544, -166719, -494828, 99756, -367440, -442647, -131997, -273684, -277437, -47717, 94714, -271759, -290656, -40777, 17509, 136443, 677, -203017, -53521, -235286, -270624, 89748, -55376, -247773, -114748, 19613, 53203, -82779, -59869, -140490, 59360, -346213, 121577, -107574, -52549, -75174, -268188, 63749]
9908D2742b29290m5447D581h8713L1388j81062A33395O7167a62284D2421c56158
9896a23181m8925B23831e7799q7278l31455a44373b0418k04863b1157l0294A49160
9884h7969B8802J54671b2397A29555a73422K2667b6037k77611a6268j17530f1967
9872F0643J85601a51858c1055I0982e0377A46023a45358A4252J83774j4660D8268
9860i0418c9718b158A37900J0049B3628a93402L3375O2567I9555i3534A33767
9848G1921i7132J3775b8393j85238A82630b00646C2351L6079d80702Q9039B02798
9836a67077j5913R23c1587l3438a0350k19495i1459n1867A26145c3040H8772C9563
9823A50233a91604d077j43057N9949j25110j09125G1952a11623A95512F8157M1074
$$ y = [42742, -229290, -274737, 4581, -88713, -57325, -238387, 133395, 200562, -162284, 42421, -356158, -123181, -172106, 223831, -57799, -145077, -476532, -144373, -20418, -225281, -21157, -51451, 149160, -87969, 28802, 183473, -22397, 129555, -173422, -150755, -26037, -303648, -16268, -133798, -61967, 60643, 246244, -151858, -31055, 90982, -50377, 146023, -145358, 14252, 198026, 183366, 48268, -90418, -39718, -2158, 137900, 147949, 23628, -193402, -160027, -97460, 99555, -93534, 133767, 71921, -97132, -83357, -28393, -213631, 182630, -200646, 32351, 68430, -480702, -391663, 202798, -167077, -182990, -182067, -31587, -65025, -10350, -229845, -91459, -143326, 126145, -33040, 88772, 39563, 150233, -191604, -4077, -147134, -87185, -212295, -321420, 71952, -111623, 195512, 68157, 109231]
9812A09231m2380J29002F2075Q3054h0094A69407a50547r2043j69750B71972j30017
9801A41955b72276B08611c54626G4204b10455B87154A153J00154b05328n6960
9791b62288C4575e1496k35649f5064j0914L3356j93849D8722a90925l1105M482
9780b17548B4250a20799b4494B3546J08733a93730i965j56426q5453f8228p2368
9769a40596k04751A10000b67783F5528b276j54381A71816l1938L7570a03211A24962
9757C17285d20683a55603g358A85341c27176A08640g0242k83134d6354j25408
9747a71762B32475q8702N6078a22677j61520J05793E4579K53460b66580j12285
9737c78865J16364l33412b95414B65768a23226C1111b17038j20528a02656o2323
$$ y = [109231, 66851, 195853, 62075, 145129, -80094, 169407, -150547, -242590, -412340, 271972, 141955, -272276, 208611, -354626, 74204, -210455, 287154, 1153, 101307, -205328, -262288, 34575, -51496, -287145, -65064, -75978, -42622, -236471, 48722, -190925, -222030, -217548, 24250, -120799, -24494, 23546, 132279, -193730, -9965, -166391, -251844, -68228, -140596, -345347, 110000, -267783, 65528, -2276, -156657, 171816, 139878, 177448, -103211, 124962, 317285, -420683, -155603, -7358, 185341, -327176, 108640, -70242, -353376, -46354, -171762, 232475, 143773, 199851, -122677, -284197, -178404, 54579, 308039, -266580, -378865, -262501, -595913, -295414, 265768, -123226, 31111, -217038, -337566, -102656, -164979]
9727a64979M3248A88638b25838a00198G245c00258E885N103b02869r5858A2940
9715F7035f0242j2420a2786r5592B07109c55458i7924F3871L6164K5962A3633
9703C4607M6159K01902b11710k6919d7951e441B35875B3400j0963J81570b50821
9691F8123h0243k6763p5211d6824k8748B17337G2687b85363R7453h1094j44963
9680b26057K7037I3681J36974a33985E9565L57901F5964c57874A55530n4317b13726
9668g7244C4078A5705d8432B03337a85381N5343m391d3376I4297c8372m220n4787
9656i7379m9283l06494a19701j97514i2021A29849A9235c338o408A8578a3224
9644a34006B6212b7429j25914K9513A3462a96548c6131j11712g360j55208i29
$$ y = [-164979, -121731, 188638, -225838, -100198, 7245, -300258, 5885, 10988, -202869, -298727, 12940, 67035, -60242, -72662, -12786, -108378, 207109, -355458, -97924, 63871, 100035, 125997, 13633, 34607, 80766, 282668, -211710, -238629, -47951, -5441, 235875, 23400, 12437, 194007, -250821, 68123, -80243, -107006, -182217, -46824, -75572, 217337, 72687, -285363, -187910, -81094, -226057, -199020, 93681, 230655, -133985, 59565, 417466, 65964, -357874, 155530, 101213, -213726, -77244, 34078, 15705, -48432, 203337, -185381, -130038, -134429, -43376, 94297, -38372, -42592, -97379, -146662, -453156, -119701, -317215, -92021, 129849, 19235, -3338, -9746, 18578, -13224, -134006, 26212, -27429, -153343, -123830, 13462, -196548, -36131, -147843, -7360, -162568, -929]
9632f159B22667b37868F5010e321C7841e2997q0813l52630H9234e250j08220N3731
9620e9739F3432a43934l4770A4563a99241B71028b42171H1526c4133A10255b2829
9608i836A63173c18649a51091p2629M3392j55363A15963n6743g6990j88527i9810
9596b51229H7112d81502I6253b09984d6205k44882R1323l8386P8681M7710G5617
9584c004H7714b2206A38780A2668P5287a76308K6234D93574a75271c3521l19541
9573c53062J57822g9600B1675b79112D0038j5353L57530d8513o195Q06A6961N5925
9561G2886b24041B4464a84388B5891c37286c9951k14440A62a94761j23728A96260
9549b62180f1966A75365b80282a38104r9905c7415A77257B9281H00J3291K23267
$$ y = [-6159, 222667, -237868, 65010, -5321, 37841, -52997, -133810, -486440, 89234, -5250, -113470, -59739, 63432, -143934, -178704, 14563, -199241, 271028, -242171, 81526, -34133, 110255, -22829, -9836, 163173, -318649, -151091, -223720, -180328, -335691, 115963, 59220, -76990, -265517, -99810, -251229, 87112, -481502, 96253, -209984, -46205, -291087, -199764, -238150, -159469, -111759, 75617, -3004, 87714, -22206, 138780, 12668, 87955, -176308, -150074, 493574, -175271, -33521, -353062, -195240, -79600, 21675, -279112, 40038, 24685, 382215, -48513, -54708, -53902, 16961, 72886, -224041, 24464, -184388, 25891, -337286, -39951, -254391, 162, -194761, -318489, 196260, -262180, -61966, 175365, -280282, -138104, -238009, -37415, 177257, 29281, 800, 14091, 237358]
9538B37358b12062A76589a21724J0273B14193I1764b5086A1570J0381a20154C6838
9526a92083N4887B2643a65957P1557C19019b29787K906h8727B5668j1247a33305
9514b02543j64468j14385A22038B3381o147d5687J2434l6245A19111a93279F7200
9502B24507D3656D317a19813B476f0693p6966c9754j5056E8902d63721A32457
9490e4793B9153J14109g3378B24216G1163g6340A03517a89139i0428B8225M6127
9479G4352C6448e9376l96457a25317l95320K32388b1284r0369e2505e168o4311
9468f9479H3234b1205k49226j00789J31771I1600d60888a16524j50742M1306A15973
9456B6938c4131r5061c5150A50356k6441d5562l00341a59889N0472l9605I0560
$$ y = [237358, -212062, 176589, -121724, -111451, 214193, 91764, -25086, 11570, 21951, -120154, 36838, -192083, -137196, 22643, -165957, -94400, 319019, -229787, -226881, -88727, 25668, 14421, -133305, -202543, -367011, -481396, 122038, 23381, 17234, -45687, -33253, -69498, 119111, -193279, 67200, 224507, 43656, 4317, -119813, 2476, -60693, -137659, -39754, -54810, 58902, -463721, 132457, -54793, 29153, 143262, -73378, 224216, 71163, -76340, 103517, -189139, -90428, 28225, 74352, 36448, -59376, -455833, -125317, -520637, -288249, -21284, -111653, -52505, -5168, -69479, 83234, -21205, -270431, -371220, -239449, 91600, -460888, -116524, -267266, -225960, 115973, 26938, -34131, -129192, -35150, 150356, 123915, -45562, -345903, -159889, -109417, -149022, 90560]
9444a92243P3452A04237J17472c10258c1231r643l1716H3272h5433l48575H2069
9432b00848i3457F3189c941q507j97168g3124j15363J3257E5885N8189a10536
9420a13406N1520k4551f656F3750J10950a9225j06894C0647A2794b74780a0243
9408a7513k4070g430p4575A51283c9179k66737J32188B05286g646L335A13633
9396A1299K12281A3570K523a677I1528b80802a11833C6228a83855D006L07953
9385C11959a97668D9491a120G0949f7626j6631B09804a03028p1104B84086C9053
9373b74210J02940g6517B1852b6387k23306B64963C6341a56938e5969j62695m3961
9362b62625J01609q389P8136A86625D6714J25325j1060b44061B43680c27146M2022
$$ y = [-192243, -118791, 104237, 221709, -310258, -31231, -40874, -72590, 83272, -85433, -434008, 82069, -200848, -93457, 63189, -3941, -12448, -209616, -73124, -188487, -175230, 55885, 114074, -110536, -113406, -61886, -86437, -6656, 63750, 174700, -19225, -126119, 30647, 12794, -274780, -10243, -17513, -41583, -7430, -82005, 151283, -39179, -305916, -173728, 205286, -7646, -4311, 113633, 11299, 223580, 13570, 16093, -1677, 91528, -280802, -111833, 36228, -183855, 4006, 311959, -197668, 49491, -1120, 70949, -67626, -84257, 209804, -103028, -174132, 284086, 39053, -274210, -171270, -76517, 21852, -26387, -249693, 264963, 36341, -156938, -55969, -218664, -262625, -161016, -169405, -91269, 186625, 46714, 172039, 160979, -244061, 243680, -327146, -285124]
9351b85124A16580a67447k8180n8424F9392b7501A04423c5605j87913Q8116H0786
9339b2538J0130k58706B4510d14881G2898a18955A14803b9494j35814A05122C1280
9327I1568a18899c0170m3321j19010g9031j8155g168n4247B85837a08352b3271
9315a4141m6456m3969d4707B5168c75764f196p7338C56819H3953a54218K0836
9304a33382r077B02638c2216A67633a39129E8079b0330F320J07307J89743a28345
9292d3018k76661J59660l2626b8497B52276a70672B06044c29072J30859D8619
9281A90595d0994f128j17352d1787r9890C23870a28034j15A3194J07590b05787
9269A18729Q0987c56280a19331E7383C732J03144N6465h8157A46291a29080C0094
$$ y = [-285124, 116580, -167447, -195627, -254051, 69392, -27501, 104423, -35605, -223518, -135402, 80786, -22538, -12408, -271114, 24510, -414881, 72898, -118955, 114803, -29494, -165308, 105122, 31280, 91568, -118899, -30170, -73491, -192501, -79031, -97186, -7168, -61415, 285837, -108352, -23271, -14141, -60597, -104566, -44707, 25168, -375764, -6196, -83534, 356819, 83953, -154218, -133382, -142459, 202638, -32216, 167633, -139129, 58079, -20330, 6320, 113627, 303370, -128345, -43018, -319679, -160019, -192645, -28497, 252276, -170672, 206044, -329072, -198213, 48619, 190595, -40994, -6128, -123480, -41787, -141677, 323870, -128034, -128149, 13194, 120784, -205787, 118729, 199716, -356280, -119331, 57383, 3732, 106876, 163341, -88157, 146291, -129080, 30094]
9257b07550k2523p5842a05238A7910K20160b07305J2982D7714a07285m3428C0234
9245e9440j4679B7582J24566D2969h7990B22782C0903K3488b40246C790i3571
9233b18048P7177a3817q9892k12494d848k58332A28774a27556H1896M7973K5895
9222A55764b13638J03894j88235c0927B30268p3807E6566L9675j2574R0861a63505
9210B84378E9097j0570e2418D4755g3421j84208A29368a39122k8257j6233m1928
9199b25540J4283B04217l0596i8833D1558a15175B7528a28301k82405c0030k40100
9188b70130g0661A84079i9095j02035g9959l6562j82075B08361e199l21986A441
9176a95578j45776b2828R027E1913b94012K9018C59518a83224e880m381m9930
$$ y = [-207550, -230073, -305915, -105238, 17910, 238070, -207305, -194323, 47714, -107285, -150713, 30234, -59440, -74119, 27582, 152148, 42969, -87990, 222782, 30903, 54391, -240246, 3790, -93571, -218048, -140871, -13817, -103709, -316203, -4848, -263180, 128774, -127556, 81896, 129869, 155764, -213638, -109744, -297979, -30927, 230268, 156461, 56566, 96241, 83667, 174528, -163505, 284378, 59097, 48527, -52418, 44755, -73421, -257629, 129368, -139122, -167379, -183612, -225540, -211257, 204217, 173621, -98833, 41558, -115175, 27528, -128301, -410706, -30030, -270130, -70661, 184079, -99095, -201130, -79959, -116521, -298596, 208361, -5199, -327185, 1441, -195578, -341354, -22828, -13801, 51913, -294012, -264994, 359518, -183224, -5880, -10261, -60191]
9165f0191b4598j27198C83283b59310A51970J23167a4915D4545b81678m08175
9155f89853b16001B092K46702i7655B08129c46077E6490L3111e7369j35560B18920
9143a31108j6191l2003G0725h3058E4491L8796K9251C3841M0665a33358e1561
9131b7340j47896P2364l5677h170C0093P8825C9378f7095K9330O292k95956a25739
9118E9910B3470B245c3096j45834B43050b14483f0699p1910M2623H4731h4833
9106B155a64970R504J9668j5360l6048k84056I5082g6291k6115l7626A58806b2776
9093c3740H967K88637a88068F8033K02128G870L8613i8533I2956B7984b7457p4456
9081a01913A86631K12199G4647d13165E0714a96542N0553e4322k74989A03752
$$ y = [-60191, -24598, -151796, 383283, -259310, 151970, 275137, -14915, 44545, -281678, -689853, -216001, 2092, 248794, -97655, 208129, -346077, 56490, 89601, -57369, -192929, 218920, -131108, -147299, -179302, 70725, -83058, 54491, 93287, 122538, 33841, 74506, -133358, -51561, -27340, -175236, -102872, -138549, -8170, 30093, 108918, 39378, -67095, -37765, -31473, -327429, -125739, 59910, 23470, 2245, -33096, -178930, 243050, -214483, -60699, -132609, -89986, 84731, -84833, 2155, -164970, -155466, -135798, -151158, -187206, -471262, 95082, -76291, -102406, -140032, 158806, -22776, -33740, 8967, 297604, -188068, 68033, 270161, 7870, 46483, -98533, 92956, 27984, -27457, -101913, 186631, 398830, 74647, -413165, 50714, -196542, -145989, -54322, -329311, 103752]
9070a02155G1717a27270j58066A13981m313h1805o0693b0524B09711i0135q5477
9059a75612A50829A4279R1447a62477g0094J7573l595B6780N2293H063a66714
9047b36831B28016p5409E352a64090H289a68548d7360J5797j01392B02173a29587
9035C4875J42339c50859J16724h5896I954b7755k89485f618A2636Q6542k2808
9024G6370a04204j65023C8716b90122B4254L05612a74466J6617A01300L65e33524
9012A80737a22676j21335G6626a96571A91333a47581N5645j28149B19682F675
9001F9728P3506F7626g6281k26877I7407M7231b86164c6386k53132A28368E8779
8989b51816M8310g7017K9961J0043m514k22758j03422O4179J5744B1039J27792
$$ y = [-102155, 71717, -127270, -285336, 113981, 109668, -81805, -142498, -20524, 209711, -90135, -175612, 150829, 14279, 105726, -162477, -70094, -52521, -56116, 26780, 79073, 8063, -166714, -236831, 228016, 152607, 5352, -164090, 8289, -168548, -47360, -31563, -132955, 202173, -129587, 34875, 177214, -350859, -234135, -85896, 9954, -27755, -317240, -6618, 12636, 99178, 76370, -104204, -269227, 38716, -290122, 24254, 329866, -174466, -157849, 101300, 101665, -533524, 180737, -122676, -244011, 76626, -196571, 191333, -147581, -91936, -220085, 219682, 6675, 69728, 143234, 67626, -76281, -303158, 97407, 144638, -286164, -36386, -289518, 128368, 58779, -251816, -203506, -77017, -47056, -37013, -41527, -264285, -367707, -303528, -287784, 21039, 148831]
8978A48831a5719g109F0902b5207B8594h4707B34102a30669O2409j45072j4749
8967b28081k1866A78018a58858A17599b3333A39791a90630A31020m4808M2969
8957A29181f8566C3817P4587c86857h5182n5836j18047f0467n2769C4683b16686
8945d1959a9968j46675r5375B6603K38634a2811C11241A6165Q0908b02576Q6174
8934a16402D498b10334F12472A37984D8314e9421A10761A6348a40040J2396B275
8922c82216a43686D53903B12975f5604m5828o1272A40492h0995p374L9250j40178
8911a89297k514d4214C5428d1871F8258b02056A9433a91920d1216I2151b26983
8899b32812A85405L583m3448i7606A4729K06J07585b7078g748l45078A62724a94186
$$ y = [148831, -15719, -7109, 60902, -25207, 28594, -84707, 234102, -130669, -68260, -213332, -228081, -249947, 178018, -158858, 117599, -23333, 139791, -190630, 131020, 86212, 129181, -68566, 33817, 108404, -386857, -85182, -141018, -259065, -60467, -113236, 34683, -216686, -41959, -19968, -166643, -262018, 26603, 265237, -12811, 311241, 16165, 97073, -202576, -116402, 4498, -210334, 612472, 137984, 48314, -59421, 110761, 16348, -140040, -127644, 2275, -382216, -143686, 453903, 212975, -65604, -111432, -172704, 140492, -80995, -88369, -49119, -189297, -191811, -44214, 35428, -41871, 68258, -202056, 19433, -191920, -41216, 92151, -226983, -232812, 185405, 188988, 145540, -97606, 14729, 14935, 122520, -27078, -7748, -352826, 162724, -194186]
8886I5916a53761c036j09215J195A71321b35360J16212G0261b97206I1054g4368
8874a38518r7384c1824q9653e2944H7580A0314J37506l3536a37972C3659i5586
8862a0475A11782j9260h9603q9469B81088j37175b30296q6053d8081C22207e339
8850F3033J71480a87624B84992E8430a78123d865m07148F9320d3144B32143D280
8838a7240l18622P6749A35568F5599B0548J379c14763B25946b19796K5315Q9869
8827a04612l442p4969b6500d342A04657a28096o815c3908A75477l5683a3748A29775
$$ y = [95916, -153761, -3036, -112251, -111056, 171321, -235360, -119148, 70261, -297206, 91054, -74368, -138518, -235902, -31824, -121477, -52944, 87580, 10314, 147820, 114284, -137972, 33659, -95586, -10475, 111782, 92522, -89603, -179072, 281088, 143913, -230296, -316349, -48081, 322207, -5339, 63033, 234513, -187624, 284992, 58430, -178123, -4865, -412013, 69320, -43144, 232143, 4280, -17240, -335862, -259113, 135568, 65599, 20548, 21927, -314763, 225946, -219796, -194481, -104612, -108054, -183023, -26500, -4342, 104657, -128096, -134911, -33908, 175477, 139794, -13748, 129775]
$$ [...]
##END NTUPLES=NMR SPECTRUM
##END=
