##TITLE=AC1714_3158_8749746_dLcrRJoP4r
##JCAMPDX= 6.0         $$ Bruker NMR JCAMP-DX V2.0
##DATA TYPE= NMR SPECTRUM
##DATA CLASS= NTUPLES
##ORIGIN= BRUKER
##OWNER= Administrator
$$ 1.72 TOPSPIN		Version 2.1
$$ 2015-08-07 20:02:01.688 -0700  Administrator@X
$$ Compression mode = diff/dup
##.OBSERVE FREQUENCY= 400.02188249412
##.OBSERVE NUCLEUS= ^1H
##.ACQUISITION MODE= SIMULTANEOUS (DQD)
##.ACQUISITION SCHEME= undefined
##.AVERAGES= 64
##.DIGITISER RES= 22
##SPECTROMETER/DATA SYSTEM= spect
##.PULSE SEQUENCE= noesygpps1d.comp
##.SOLVENT NAME= COFFEE_meoh
##.SHIFT REFERENCE= INTERNAL, COFFEE_meoh, 1, 14.96104
##AUDIT TRAIL= $$ (NUMBER, WHEN, WHO, WHERE, PROCESS, VERSION, WHAT)
$$ ##TITLE= Audit trail, TOPSPIN		Version 2.1
$$ ##JCAMPDX= 5.01
$$ ##ORIGIN= Bruker BioSpin GmbH
$$ ##OWNER= Administrator
$$ $$ E:\/data/COFFEE/nmr/AC1714_3158_8749746_dLcrRJoP4r/52/pdata/1/auditp.txt
$$ ##AUDIT TRAIL=  $$ (NUMBER, WHEN, WHO, WHERE, PROCESS, VERSION, WHAT)
(   1,<2015-08-07 20:01:56.375 -0700>,<Administrator>,<X>,<go>,<TOPSPIN 2.1>,
      <created by zg
	started at 2015-08-07 19:50:26.859 -0700,
	POWCHK enabled, PULCHK disabled,
       configuration hash MD5:
       21 0F 79 D6 B3 7B B4 F6 88 20 88 DB 03 48 BD 9F
       data hash MD5: 64K
       7E 4F C8 60 3E 06 16 5A C6 63 03 CA ED 5C B0 56>)
(   2,<2015-08-07 20:01:59.594 -0700>,<Administrator>,<X>,<proc1d>,<TOPSPIN 2.1>,
      <Start of raw data processing
       efp LB = 0.3 FT_mod = 6 PKNL = 1 PHC0 = 0 PHC1 = 0 SI = 128K 
       data hash MD5: 128K
       93 81 89 0E 65 F3 58 B3 1F 06 BD F5 40 5B 5C 09>)
(   3,<2015-08-07 20:02:00.469 -0700>,<Administrator>,<X>,<proc1d>,<TOPSPIN 2.1>,
      <pk PHC0 = -86.83594 PHC1 = 0 
       data hash MD5: 128K
       39 A1 D7 2A 52 B1 72 8F 58 5E BC 9A 97 00 39 38>)
(   4,<2015-08-07 20:02:00.891 -0700>,<Administrator>,<X>,<proc1d>,<TOPSPIN 2.1>,
      <abs ABSG = 1 
       data hash MD5: 128K
       C7 FB C6 CE C1 34 90 35 FF B9 D7 1B EA 50 F0 84>)
(   5,<2015-08-07 20:02:00.984 -0700>,<Administrator>,<X>,<proc1d>,<TOPSPIN 2.1>,
      <abs ABSG = 2 
       data hash MD5: 128K
       4B 4D AE A6 25 81 D8 76 C6 0E 5D 68 07 8E E6 39>)
(   6,<2015-08-07 20:02:01.063 -0700>,<Administrator>,<X>,<proc1d>,<TOPSPIN 2.1>,
      <abs ABSG = 3 
       data hash MD5: 128K
       C4 F3 97 B9 17 99 7B 52 EE B2 BB 70 59 00 CA 16>)
(   7,<2015-08-07 20:02:01.141 -0700>,<Administrator>,<X>,<proc1d>,<TOPSPIN 2.1>,
      <abs ABSG = 4 
       data hash MD5: 128K
       82 3F 7B EC CC D0 D7 CF 27 6D C0 5E 07 38 43 28>)
(   8,<2015-08-07 20:02:01.266 -0700>,<Administrator>,<X>,<proc1d>,<TOPSPIN 2.1>,
      <abs ABSG = 5 
       data hash MD5: 128K
       E1 05 EA A7 E8 7E E5 81 57 7F 7C AB 97 8A FD 97>)
$$ ##END=
$$ 
$$ $$ hash MD5
$$ $$ AE 66 A3 BC C5 FC B4 B7 41 99 88 30 58 12 B6 73
##$RELAX= 
##$RELAX= 
##$RELAX= 
##$RELAX= 
##$RELAX= 
##$RELAX= 
##$RELAX= 
##$RELAX= 
$$ Bruker specific parameters
$$ --------------------------
##$DU= <E:\>
##$EXPNO= 52
$$ [...]
##$TP07= 0
##$TPNAME0= <>
##$TPNAME1= <>
##$TPNAME2= <>
##$TPNAME3= <>
##$TPNAME4= <>
##$TPNAME5= <>
##$TPNAME6= <>
##$TPNAME7= <>
##$TPOAL= (0..7)
0.5 0.5 0.5 0.5 0.5 0.5 0.5 0.5
##$TPOFFS= (0..7)
0 0 0 0 0 0 0 0
##$TUNHIN= 0
##$TUNHOUT= 0
##$TUNXOUT= 0
##$USERA1= <user>
##$USERA2= <user>
##$USERA3= <user>
##$USERA4= <user>
##$USERA5= <user>
##$V9= 5
##$VALIST= <valist>
##$VCLIST= <CCCCCCCCCCCCCCC>
##$VD= 0
##$VDLIST= <DDDDDDDDDDDDDDD>
##$VPLIST= <PPPPPPPPPPPPPPP>
##$VTLIST= <TTTTTTTTTTTTTTT>
##$WBST= 2048
##$WBSW= 25
##$XGAIN= (0..3)
0 0 0 0
##$XL= 0
##$YL= 0
##$YMAX_a= 6301157
##$YMIN_a= -12060094
##$ZGOPTNS= <>
##$ZL1= 120
##$ZL2= 120
##$ZL3= 120
##$ZL4= 120
##$ABSF1= 14.96104
##$ABSF2= -5.597142
##$ABSG= 5
##$ABSL= 3
##$ALPHA= 0
##$AQORDER= 0
##$ASSFAC= 0
##$ASSFACI= 0
##$ASSFACX= 0
##$ASSWID= 0
##$AUNMP= <proc_prof1d_extract.lims>
##$AXLEFT= 0
##$AXNAME= <>
##$AXNUC= <1H>
##$AXRIGHT= 0
##$AXTYPE= 0
##$AXUNIT= <>
##$AZFE= 0.1
##$AZFW= 0.1
##$BCFW= 0
##$BC_mod= 0
##$BYTORDP= 0
##$COROFFS= 0
##$CY= 15
##$DATMOD= 1
##$DC= 0
##$DFILT= <>
##$DTYPP= 0
##$F1P= 0
##$F2P= 0
##$FCOR= 0.5
##$FTSIZE= 131072
##$FT_mod= 6
##$GAMMA= 0
##$GB= 0
##$INTBC= 1
##$INTSCL= 1
##$ISEN= 128
##$LB= 0.3
##$LEV0= 0
##$LPBIN= 0
##$MAXI= 10000
##$MC2= 0
##$MEAN= 0
##$ME_mod= 0
##$MI= 0
##$NCOEF= 0
##$NC_proc= -2
##$NLEV= 6
##$NOISF1= 0
##$NOISF2= 0
##$NSP= 0
##$NTH_PI= 0
##$NZP= 0
##$OFFSET= 14.96104
##$PC= 1
##$PHC0= -86.83594
##$PHC1= 0
##$PH_mod= 1
##$PKNL= yes
##$PPARMOD= 0
##$PPDIAG= 0
##$PPIPTYP= 0
##$PPMPNUM= 2147483647
##$PPRESOL= 1
##$PSCAL= 4
##$PSIGN= 0
##$PYNMP= <proc.py>
##$REVERSE= no
##$SF= 400.020009621539
##$SI= 131072
##$SIGF1= 0
##$SIGF2= 0
##$SINO= 400
##$SIOLD= 131072
##$SPECTYP= <>
##$SREGLST= <1H.CDCl3>
##$SSB= 0
##$STSI= 131072
##$STSR= 0
##$SW_p= 8223.68421052631
##$SYMM= 0
##$S_DEV= 0
##$TDeff= 65536
##$TDoff= 0
##$TI= <>
##$TILT= no
##$TM1= 0
##$TM2= 0
##$TOPLEV= 0
##$USERP1= <user>
##$USERP2= <user>
##$USERP3= <user>
##$USERP4= <user>
##$USERP5= <user>
##$WDW= 1
##$XDIM= 131072
##$YMAX_p= 390742677
##$YMIN_p= -11149
##$CURPLOT= <Network HP LaserJet P1505>
##$CURPRIN= <$Network HP LaserJet P1505>
##$DFORMAT= <normdp>
##$LAYOUT= <+/1D_H.xwp>
##$LFORMAT= <normlp>
##$PFORMAT= <normpl>
##$SURQMSG= 1
$$ End of Bruker specific parameters
$$ ---------------------------------
##NTUPLES= NMR SPECTRUM
##VAR_NAME=  FREQUENCY,     SPECTRUM/REAL,   SPECTRUM/IMAG
##SYMBOL=    X,             R,               I
##VAR_TYPE=  INDEPENDENT,   DEPENDENT,       DEPENDENT
##VAR_FORM=  AFFN,          ASDF,            ASDF
##VAR_DIM=   131072,        131072,          131072
##UNITS=     HZ,            ARBITRARY UNITS, ARBITRARY UNITS
##FACTOR=    0.0627417313425164, 1,          1
##FIRST=     8223.62146879497, 2253,         -57569
##LAST=      0,             4176,            -57531
##MIN=       0,             -11149,          0
##MAX=       8223.62146879497, 390742677,    0
$$ Real data points
##PAGE= N=1
##DATA TABLE= (X++(R..R)), XYDATA
$$ [...]
63854A685001P8506P5374P0540O4544N7810N0198M1319L1283K0849J0628M34j0180
63842B176306k0941l0979l9944m8338n6487o3729o9164p2845p5563p7643p8637
63831A542036p8231p6913p5388p3785p1672o8628o4612n9957n5199n0721m6434
63820H20496m2010l7508l3446l0125k7179k4079k0775j7557j4629j2177j0580
63809E50431j0110j0475j1075j1593j2011j2247j2236j2334j2963j3830j3998
63798D17559j3033j1594j0638j0374j0263r789q871p773o879o459o354o043n220
63785C04269m168l350k759j955p99J84K96m85j313j295n16K7l52j173j494j224
63769B83893j133j605k076j945j377q93o07l62k76o45j479k455l129l026j876
$$ y = [1685001, 1763507, 1838881, 1909421, 1973965, 2031775, 2081973, 2123292, 2154575, 2175424, 2186052, 2186486, 2176306, 2155365, 2124386, 2084442, 2036104, 1979617, 1915888, 1846724, 1773879, 1698316, 1620673, 1542036, 1463805, 1386892, 1311504, 1237719, 1166047, 1097419, 1032807, 972850, 917651, 866930, 820496, 778486, 740978, 707532, 677407, 650228, 626149, 605374, 587817, 573188, 561011, 550431, 540321, 529846, 518771, 507178, 495167, 482920, 470684, 458350, 445387, 431557, 417559, 404526, 392932, 382294, 371920, 361657, 351868, 342997, 335224, 328345, 321886, 315532, 309489, 304269, 300101, 296751, 293992, 292037, 291238, 291422, 291718, 291233, 289920, 288625, 288109, 288136, 287784, 286611, 285117, 283893, 282760, 281155, 279079, 277134, 275757, 274864, 274257, 273895, 273619, 272974, 271495, 269040, 265911, 262885, 261009]
63754B61009j68R84J003N23M75P89P10R1l89k62K45Q18J470K121K391K142J769
63737B75721J689J920K382L143M007M311L700K828K765L725M856N381N468N733
63723C27629O229O481O403O558P203P606O911N427M227L558K462L01k172l876
63709C84947m761n452o037o224o251o620o972o307m466k548j479j035n49J08O93
63694C27047J183J639J951K111K355K668K538J649M97j75k33j02n5RK31O16J123
63677C45052J662K116K520L039L664M146M456M895N587O137O210O014N860N469
63663D06827M294K391M62r35j836k589l495m766o352p795q494q275p491o569n720
63648C49657n049m599m179l496k516j495n23O03J816K519K256J508J294J975K933
$$ y = [261009, 260841, 261825, 262828, 263351, 263826, 264615, 265325, 265416, 265027, 264765, 265010, 265828, 267298, 269419, 271810, 273952, 275721, 277410, 279330, 281712, 284855, 288862, 293173, 296873, 299701, 302466, 306191, 311047, 316428, 321896, 327629, 333858, 340339, 346742, 353300, 360503, 368109, 375020, 380447, 384674, 388232, 390694, 390995, 388823, 384947, 380186, 374734, 368697, 362473, 356222, 349602, 342630, 336323, 331857, 329309, 327830, 326795, 326246, 326354, 327047, 328230, 329869, 331820, 333931, 336286, 338954, 341492, 343141, 343638, 343463, 343230, 343128, 343073, 343082, 343313, 343929, 345052, 346714, 348830, 351350, 354389, 358053, 362199, 366655, 371550, 377137, 383274, 389484, 395498, 401358, 406827, 411121, 413512, 413974, 413039, 411203, 408614, 405119, 400353, 394001, 386206, 377712, 369437, 361946, 355377, 349657, 344608, 340009, 335830, 332334, 329818, 328323, 327800, 328403, 330219, 332738, 334994, 336502, 337796, 339771, 342704]
63633C42704L544L922M395M741M589M324M804O122P387Q029Q599R811J1400J2601
63619D36972J3384J4376J5806J7248J8426J9545K0776K2011K3265K4694K6122
63608F52625K7030K7151K6542K4993K2013J7689J2912Q474M430O80k469m699o184
63595H11187p148p411o957o547p154q941j1285j3693j6116j8414k0042k0477j9703
63582F47299j8218j6634j5217j3741j1874r761p999o885o001m698k817p95P73
63569E33432J608K030K748M058N358N907N944O341P136P515P470Q356J1024J4445
63555F23372J7169J9397K2396K6558L1337L6717M3073M9336N2794N1319M5050
63544A018518L5495K3956J1488m70j0309j7010k0327k0637j8958j6644j4500j2309
$$ y = [342704, 346248, 350170, 354565, 359306, 363895, 368219, 373023, 379145, 386532, 394561, 403160, 412971, 424371, 436972, 450356, 464732, 480538, 497786, 516212, 535757, 556533, 578544, 601809, 626503, 652625, 679655, 706806, 733348, 758341, 780354, 798043, 810955, 819429, 823859, 824539, 822070, 817371, 811187, 804039, 796628, 789671, 783124, 775970, 767029, 755744, 742051, 725935, 707521, 687479, 667002, 647299, 629081, 612447, 597230, 583489, 571615, 561854, 553855, 546970, 540969, 536271, 533454, 532659, 533432, 535040, 537070, 539818, 543876, 549234, 555141, 561085, 567426, 574562, 582077, 589547, 597903, 608927, 623372, 640541, 659938, 682334, 708892, 740229, 776946, 820019, 869355, 922149, 973468, 1018518, 1054013, 1077969, 1089457, 1088987, 1078678, 1061668, 1041341, 1020704, 1001746, 985102, 970602, 958293]
63532I58293r671p037n524n768p364r475j1765j4584j8189k1918k4458k5119k4557
63519G72864k3933k3627k3294k2849k2539k2085k0726j8466j6411j5355j4731
63508E48848j3617j2124j0983j0206r198p953p132o890o566n796n069m779m492
63495D44043l800l140l045l007k063l39R79J251J077J163J395J491J805K746M012
63480D44568N064N967O942P558P227O297N607N112L993K160M89p01k216m460o467
63465D87140p265p314p576p908p483o347n362m844m333l648l087k511j272O86
63451D18876K518L657M529N758P283Q794J0465J2705J5484J8423K1500K5269L0385
63438E85646L6986M4303N0647N3939N2641M6484L6485K4370J1868L33r199j5841
$$ y = [958293, 948622, 941585, 936061, 930293, 922929, 913454, 901689, 887105, 868916, 846998, 822540, 797421, 772864, 748931, 725304, 702010, 679161, 656622, 634537, 613811, 595345, 578934, 563579, 548848, 535231, 523107, 512124, 501918, 492720, 484767, 477635, 470745, 464179, 458383, 453314, 448535, 444043, 440243, 437103, 434058, 431051, 428988, 428649, 429628, 430879, 431956, 433119, 434514, 436005, 437810, 440556, 444568, 449632, 455599, 462541, 470099, 477326, 483623, 489230, 494342, 498335, 500495, 500984, 500283, 498067, 493607, 487140, 479875, 472561, 464985, 457077, 449594, 443247, 437885, 433041, 428708, 425060, 421973, 419462, 418190, 418876, 421394, 425051, 429580, 435338, 442621, 451415, 461880, 474585, 490069, 508492, 529992, 555261, 585646, 622632, 666935, 717582, 771521, 824162, 870646, 907131, 931501, 943369, 943702, 934503, 918662]
63426I18662j9096j9307j7399j3936q918k689L544Q736J3110J7476K1642K4315
63414I26140K4505K2279J8193J2808O926J555k729n942q100r053r044q867r147
63401I59524r957j1267j3224j5784j8592k1498k4567k7375k8929k8775k7635k6419
63389G05502k5082k3006k0174j7340j5131j3514j2123j0715r241p744o218m542
63377E40672k605n20J428L069M412N519O590Q043J0079J2137J3324J3549J3744
63364F29441J4844J6930J9492K2019K4163K5895K7673K9889L1920L2379L0624
63353I05269K7375K3506J9051J3921Q782M418P55k590n315o854p443p839q240
63340I64796q482r092j0955j3928j6811j8924k0710k2446k3410k2955k1499j9709
$$ y = [918662, 899566, 880259, 862860, 848924, 840006, 837317, 840861, 849597, 862707, 880183, 901825, 926140, 950645, 972924, 991117, 1003925, 1010851, 1012406, 1009677, 1003735, 995635, 986582, 977538, 968671, 959524, 949567, 938300, 925076, 909292, 890700, 869202, 844635, 817260, 788331, 759556, 731921, 705502, 680420, 657414, 637240, 619900, 604769, 591255, 579132, 568417, 559176, 551432, 545214, 540672, 538067, 537547, 538975, 542044, 546456, 551975, 558565, 566608, 576687, 588824, 602148, 615697, 629441, 644285, 661215, 680707, 702726, 726889, 752784, 780457, 810346, 842266, 874645, 905269, 932644, 956150, 975201, 989122, 997904, 1002322, 1003077, 1000487, 995172, 988318, 980875, 973036, 964796, 956314, 947222, 936267, 922339, 905528, 886604, 865894, 843448, 820038, 797083, 775584, 755875]
63328G55875j7291j3488q345k641L115Q672J2929J3897J0333L016n933j4681k2268
63315G23190k8067l1437l2128l0619k7761k4296k0796j7779j5549j3996j2762
63304D68000j1590j0363r003p603o513n993n777n365m740m420m617m773m232l136
63290C79875k338k471l296l995l937l226k520k322k452k388j965j465j041n20
63276C45939O0K26k78r02q39n2O84P29K10l59p20r24r50o22L0N59M96o0m92l75
63256C42360M6L41M88P39J061J212J292J692K428L022L230L397L827M210M092
63241C73437L624L476M086N268O535P618Q653R856J1019J1552J1235J0732J0859
63228D77950J1525J1949J1875J1859J2189J2348J1922J1428J1630J2464J3179
$$ y = [755875, 738584, 725096, 716751, 714110, 717225, 725897, 738826, 752723, 763056, 766072, 760139, 745458, 723190, 695123, 663686, 631558, 600939, 573178, 548882, 528086, 510307, 494758, 480762, 468000, 456410, 446047, 437044, 429441, 422928, 416935, 411158, 405793, 401053, 396633, 392016, 387243, 383011, 379875, 377537, 375066, 371770, 367775, 363838, 360612, 358092, 355770, 353318, 350930, 348965, 347500, 346459, 345939, 345999, 346225, 345947, 345045, 344206, 344154, 344838, 345567, 345777, 345418, 344698, 343774, 342824, 342202, 342232, 342791, 343287, 343227, 342735, 342360, 342406, 342747, 343235, 343974, 345035, 346247, 347539, 349231, 351659, 354681, 357911, 361308, 365135, 369345, 373437, 377061, 380537, 384623, 389891, 396426, 404044, 412697, 422553, 433572, 445124, 456359, 467091, 477950, 489475, 501424, 513299, 525158, 537347, 549695, 561617, 573045, 584675, 597139, 610318]
63217F10318J3269J2817J2214J1944J2305J2985J3149J2268J0551Q248N128J140
63205G36336k945o246q776j1099j3300j5005j6154j7013j7513j7280j6306j4953
63193E79746j3330j1273q865o450m166j997j82J086K240L948O094P889Q992R811
63179E73543J0569J0957J0986J1397J2688J4292J5223J5152J4459J3640J3074
63168G15980J2983J3109J2648J1028Q613O296M396K319o74m589q668j2088j4679
63155G46674j6880j9034k0873k1870k1957k1569k1077k0440j9476j8139j6525
63144E28834j4880j3525j2521j1415r749p770o235n416m830m027l151k504k047
63131D30764j643j393j387j430j372j359j449j243l58R14J834K037J764J357R67
$$ y = [610318, 623587, 636404, 648618, 660562, 672867, 685852, 699001, 711269, 721820, 730068, 735196, 736336, 733391, 727145, 718369, 707270, 693970, 678965, 662811, 645798, 628285, 611005, 594699, 579746, 566416, 555143, 546278, 539828, 535662, 533665, 533483, 534569, 536809, 540757, 546851, 554740, 563732, 573543, 584112, 595069, 606055, 617452, 630140, 644432, 659655, 674807, 689266, 702906, 715980, 728963, 742072, 754720, 765748, 774361, 780657, 785053, 787372, 786698, 782109, 773441, 761353, 746674, 729794, 710760, 689887, 668017, 646060, 624491, 603414, 582974, 563498, 545359, 528834, 513954, 500429, 487908, 476493, 466744, 458974, 452739, 447323, 442493, 438466, 435315, 432811, 430764, 429121, 427728, 426341, 424911, 423539, 422180, 420731, 419488, 419130, 420044, 421878, 423915, 425679, 427036, 428003]
63116D28003P72J067J886K698K795K019J025O63J162J964K355K093J430P53L92
63101D51077N10R18J195J285J735K886M088M313L507K616K277K235K254K692L620
63086D87208M136L414K038J338J600J751R67k49q63o41j89k2m9Q7N05J013J386
63069E03430J658K073K769L604M360N028N721O430P076P812Q926J0354J1558J2145
63055E92944J2473J3342J5158J7594K0041K2195K4118K5924K7548K8775K9437
63044H29549K9624K9760L0253L1035L1603L1596L1195L0763L0397L0116L0182
63033A166073L0740L1275L0983K9763K8185K6357K3441J8711J2532N876p10p151
63021A396075j3281j8932k4306k9565l4172l7300l8828l9366l9222l8049l5563
$$ y = [428003, 428775, 429842, 431728, 434426, 437221, 439240, 440265, 440928, 442090, 444054, 446409, 448502, 449932, 450685, 451077, 451587, 452505, 453700, 454985, 456720, 459606, 463694, 468007, 471514, 474130, 476407, 478642, 480896, 483588, 487208, 491344, 494758, 496796, 498134, 499734, 501485, 502452, 502203, 501340, 500699, 500510, 500488, 500439, 500526, 501031, 502044, 503430, 505088, 507161, 509930, 513534, 517894, 522922, 528643, 535073, 542149, 549961, 558887, 569241, 580799, 592944, 605417, 618759, 633917, 651511, 671552, 693747, 717865, 743789, 771337, 800112, 829549, 859173, 888933, 919186, 950221, 981824, 1013420, 1044615, 1075378, 1105775, 1135891, 1166073, 1196813, 1228088, 1259071, 1288834, 1317019, 1343376, 1366817, 1385528, 1398060, 1403936, 1403226, 1396075, 1382794, 1363862, 1339556, 1309991, 1275819, 1238519, 1199691, 1160325, 1121103, 1083054, 1047491]
63010A047491l2089k8198k4283k0535j6867j2842q231l685j64K470N481R475J3414
62997I31437J5911J7025J7941J9374K1002K2347K3426K4432K5315K5869K5920
62986A169999K5342K4108K2390K0427J8307J5942J3113R439M539j505q032j4359
62974A299710k0220k5522l0022l3643l6704l9345m1014m1101l9917l8400l6956
62963I16866l5309l3448l1860l0630k9080k6795k4304k2304k0701j9017j7239
62952F26179j5688j4338j2944j1624j0674r952r145q472q407q718q595p860p266
62939D92496p307p506p252o642o000n244m382l943m131m110l065j607j092j734
62925D28481k479k607k390k095j561j045j322k326k839k135j065o87p30l34M50
$$ y = [1047491, 1015402, 987204, 962921, 942386, 925519, 912677, 904446, 900761, 900597, 903067, 908548, 918023, 931437, 947348, 964373, 982314, 1001688, 1022690, 1045037, 1068463, 1092895, 1118210, 1144079, 1169999, 1195341, 1219449, 1241839, 1262266, 1280573, 1296515, 1309628, 1319067, 1323606, 1322101, 1314069, 1299710, 1279490, 1253968, 1223946, 1190303, 1153599, 1114254, 1073240, 1032139, 992222, 953822, 916866, 881557, 848109, 816249, 785619, 756539, 729744, 705440, 683136, 662435, 643418, 626179, 610491, 596153, 583209, 571585, 560911, 550959, 541814, 533342, 524935, 516217, 507622, 499762, 492496, 485189, 477683, 470431, 463789, 457789, 452545, 448163, 444220, 440089, 435979, 432914, 431307, 430215, 428481, 426002, 423395, 421005, 418910, 417349, 416304, 414982, 412656, 409817, 407682, 406617, 405930, 405200, 404866, 405316]
62910D05316J054J582K454L187K879J787J192J588K186K387K670L504M335M350
62896D40471L620K914K690K736K598K046J274P43O83Q04Q31J117K102L329L718
62881D71676K977J963J418J051K64q83j909k597k970l000k842k988l673m417m544
62866D49526m021l336k826k465k178j954j735j469j222j052r09p55n86k92L01
62851D25027J065J583J627J402J236J261J485J798J835J248K55m76n65j92M36
62836D39025J278K025K146J652J218J189J123P00L78N65P86M49JM02J714K925
62820D57576L219K769K216J943J905J851J591J225J028J028J025J080J572K428
62806D82456K895K515J854J691J978K259K670L612M682M878L987L041L185M599
$$ y = [405316, 406370, 407952, 410406, 413593, 416472, 418259, 419451, 421039, 423225, 425612, 428282, 431786, 436121, 440471, 444091, 447005, 449695, 452431, 455029, 457075, 458349, 459092, 459775, 460579, 461410, 462527, 464629, 467958, 471676, 474653, 476616, 478034, 479085, 479349, 478466, 476557, 473960, 470990, 467990, 465148, 462160, 458487, 454070, 449526, 445505, 442169, 439343, 436878, 434700, 432746, 431011, 429542, 428320, 427268, 426359, 425604, 425018, 424726, 425027, 426092, 427675, 429302, 430704, 431940, 433201, 434686, 436484, 438319, 439567, 439822, 439346, 438781, 438589, 439025, 440303, 442328, 444474, 446126, 447344, 448533, 449656, 450356, 450734, 451299, 452085, 452534, 452535, 452937, 454651, 457576, 460795, 463564, 465780, 467723, 469628, 471479, 473070, 474295, 475323, 476351, 477376, 478456, 480028, 482456, 485351, 487866, 489720, 491411, 493389, 495648, 498318, 501930, 506612, 511490, 515477, 518518, 521703, 526302]
62792E26302O619Q504R895J0935J2088J3652J5508J7460J9624K2187K5075K8164
62780G16013L1431L4587L7016L8655M0446M3136M6057M7893M8401M8342M7947
62769A179924M6504M3556L9436L4359K7973K0226J1868L603m660j3200k1657k9207
62757A338725l5250l9666m2801m5313m7617m9263m9379m7879m5635m3355m0948
62746H51619l8236l5550l3150l0642k7594k4286k1370j9068j7143j5379j3702
62735E75499j2082j0567r214p875o425n298n140n727n927n067l682k454j260J00
62721D94881J044J099J027J964L694M919N129N114N568O277O980Q091R930J1990
62707E67707J3548J4597J5694J7177J9050K1285K3834K6382K8562L0484L2753
$$ y = [526302, 532921, 541425, 551320, 562255, 574343, 587995, 603503, 620963, 640587, 662774, 687849, 716013, 747444, 782031, 819047, 857702, 898148, 941284, 987341, 1035234, 1083635, 1131977, 1179924, 1226428, 1269984, 1309420, 1343779, 1371752, 1391978, 1403846, 1407449, 1402789, 1389589, 1367932, 1338725, 1303475, 1263809, 1221008, 1175695, 1128078, 1078815, 1029436, 981557, 935922, 892567, 851619, 813383, 777833, 744683, 714041, 686447, 662161, 640791, 621723, 604580, 589201, 575499, 563417, 552850, 543636, 535761, 529336, 524038, 518898, 513171, 507244, 502177, 498495, 496041, 494781, 494881, 495925, 497024, 498051, 500015, 503709, 508628, 513757, 518871, 524439, 530716, 537696, 545787, 555717, 567707, 581255, 595852, 611546, 628723, 647773, 669058, 692892, 719274, 747836, 778320, 811073]
62696H11073L5870L9657M3354M6276M8325M9745N0399M9609M6897M2612L7428
62685A301245L1500K4542J6603Q139n99r595j8391k6092l2375l7768m2568m6087
62673A168554m7570m7395m6594m5538m3804m1226l8370l5828l3709l1830k9964
62662G26726k7716k4834k1727j9256j7740j6649j5491j4381j3487j2468j0986
62651E31991r356q110p248o447n747n424n342n068m503l809k852j449j27J67o09
62636D66067j292r59p3K62l08j245j968k283k164j703j202r28p87n09q6K65M67
62619D51554O67J010J502J968K039J448N39J45O17J319J512J397J781K872M060
62604D74430M797N184N606O288P309Q607R867J0809J1664J3014J5071J7441J9617
$$ y = [811073, 846943, 886600, 929954, 976230, 1024555, 1074300, 1124699, 1174308, 1221205, 1263817, 1301245, 1332745, 1357287, 1373890, 1382029, 1381430, 1371835, 1353444, 1327352, 1294977, 1257209, 1214641, 1168554, 1120984, 1073589, 1026995, 981457, 937653, 896427, 858057, 822229, 788520, 756690, 726726, 699010, 674176, 652449, 633193, 615453, 598804, 583313, 568932, 555445, 542977, 531991, 522635, 514525, 507277, 500830, 495083, 489659, 484317, 479249, 474746, 470937, 468085, 466636, 466509, 466676, 466067, 464775, 463816, 463743, 464005, 463697, 462452, 460484, 458201, 456037, 454334, 453132, 452204, 451417, 450908, 450822, 451087, 451554, 452221, 453231, 454733, 456701, 458740, 460188, 460727, 460872, 461489, 462808, 464320, 465717, 467498, 470370, 474430, 479227, 484411, 490017, 496305, 503614, 512221, 522088, 532897, 544561, 557575, 572646, 590087, 609704]
62591F09704K1397K2707K3518K3955K4191K4005K2873K0612J7658J4490J1143
62580H36253P352K963j906o808j1094j4413j7141j9844k2298k3637k3605k3008
62568F82814k2563k1989k0756j9133j7791j6805j5760j4636j3732j2824j1276
62557D95549r151p473o984p184o985n930m419l117k471k587l134l444l058k149
62543D27463j194l95L11Q36R66P66N55M19J84k6K83J155J799J579J111J618L250
62526D40680M795N291N213N602O626P694Q711J0322J2781J5312J6963J7723J8417
62513E76130J9663K1326K2969K4451K5941K7444K8535K8727K7953K6522K4567
62502H54228K1835J8148J3838R420N041N66l798p377r693j0961j1725j2185j2115
$$ y = [609704, 631101, 653808, 677326, 701281, 725472, 749477, 772350, 792962, 810620, 825110, 836253, 843605, 846568, 844662, 837854, 826760, 812347, 795206, 775362, 753064, 729427, 705822, 682814, 660251, 638262, 617506, 598373, 580582, 563777, 548017, 533381, 519649, 506825, 495549, 486398, 478925, 471941, 464757, 457772, 451842, 447423, 444306, 441835, 439248, 436114, 432670, 429612, 427463, 426269, 425874, 426185, 427021, 427987, 428753, 429308, 429727, 429911, 429885, 430168, 431323, 433122, 434701, 435812, 437430, 440680, 445475, 450766, 455979, 461581, 468207, 475901, 484612, 494934, 507715, 523027, 539990, 557713, 576130, 595793, 617119, 640088, 664539, 690480, 717924, 746459, 775186, 803139, 829661, 854228, 876063, 894211, 908049, 917469, 922510, 923076, 919278, 911901, 902208, 891247, 879522, 867337, 855222]
62489H55222j1369j0221r014p639n618k905l65R28Q65K98k13j078k826n115p231
62474G93719r170j1451j4028j6275j8046j9879k1854k3091k2955k2088k1561k1437
62462E71884k0960j9809j8363j6776j4672j2041r667q204p310o208m806l624k807
62449D26637j919q32j50l32q38p33O7P14N73j21p86j142j114n96K90J012J118
62432D21848P62M23L06K84K51J42j96p91j336j476j228q05k55L76O97L47m62j155
62414D17732j569j949k288k172j444m83K95P93R33N39k39p56n05L09J043J332
62398D11571J359J597K368L506M419M699M585M594M794M904N028N726P105Q431
62384D74686Q972Q818Q513Q198P591O658N879N770O386P344Q204Q787R160R373
$$ y = [855222, 843853, 833632, 824618, 816979, 811361, 808456, 808091, 809019, 809884, 810182, 809969, 808891, 806065, 800950, 793719, 784549, 773098, 759070, 742795, 724749, 704870, 683016, 659925, 636970, 614882, 593321, 571884, 550924, 531115, 512752, 495976, 481304, 469263, 459596, 451392, 444082, 437874, 433068, 429444, 426637, 424718, 423886, 423736, 423404, 422566, 421833, 421900, 422614, 423187, 423066, 422280, 421138, 420024, 419428, 419718, 420730, 421848, 422610, 423033, 423339, 423623, 423874, 424016, 423820, 423029, 421693, 420217, 418989, 418184, 417929, 418305, 419002, 419349, 418887, 417732, 416163, 414214, 411926, 409754, 408310, 407827, 408122, 408915, 409848, 410387, 410148, 409392, 408887, 409196, 410239, 411571, 412930, 414527, 416895, 420401, 424820, 429519, 434104, 438698, 443492, 448396, 453424, 459150, 466255, 474686, 483658, 492476, 500989, 509187, 516778, 523436, 529315, 535085, 541471, 548815, 557019, 565806, 574966, 584339]
62370E84339R418R556J0351J2029J4034J5702J7294J9723K3269K7194L0838L4427
62358H08174L8394M2483M6036M8735N0492N0872M9246M5584M0614L5107K9291
62347A285028K3024J6321R498K918l260r023j4269j8844k2887k6813l0685l3762
62335A177246l5182l5046l4406l4057l3794l3005l1653l0324k9465k8839k7848
62324H23627k6241k4489k3228k2446k1549k0303j9138j8200j6802j4584j2541
62313F04106j1877j2120j1634r925q182p336o836n899m728l828k986j852p90l10
62299E15803j95J53Q52J624K239K391J746O43J18O16J343J537J631K293L029K891
62283E38714K063J589J748J836J459R96P03M03J69M98J505K650L526M379N683
$$ y = [584339, 593757, 603313, 613664, 625693, 639727, 655429, 672723, 692446, 715715, 742909, 773747, 808174, 846568, 889051, 935087, 983822, 1034314, 1085186, 1134432, 1180016, 1220630, 1255737, 1285028, 1308052, 1324373, 1333871, 1336789, 1333529, 1324506, 1310237, 1291393, 1268506, 1241693, 1211008, 1177246, 1142064, 1107018, 1072612, 1038555, 1004761, 971756, 940103, 909779, 880314, 851475, 823627, 797386, 772897, 749669, 727223, 705674, 685371, 666233, 648033, 631231, 616647, 604106, 592229, 580109, 568475, 558550, 550368, 543032, 536196, 530297, 525569, 521741, 518755, 516903, 516113, 515803, 515608, 515761, 516613, 518237, 520476, 522867, 524613, 525256, 525374, 525990, 527333, 528870, 530501, 532794, 535823, 538714, 540777, 542366, 544114, 545950, 547409, 548405, 549108, 549511, 549680, 550178, 551683, 554333, 557859, 562238, 567921]
62268E67921P637J0106J2753J5190J7442K0034K3238K6515K9315L2091L5733M0234
62256H38209M4718M8648N2018N4315N4373N1552M6375L9678L1877K3349J4835
62245A299947O985m7o380j2183j7844k3775k9810l5297l9889m3663m6318m7122
62233A004604m5980m3851m1591l8981l5508l1603k8321k6053k4180k1976j9381
62222F47179j6855j4876j3554j2544j1336r786q311p362o923o683o444o122n492
62209E20891m416l252k673k890l262k938j749k99P96J502K108K727L338M112N228
62194E19223O401P126P493Q249R767J1415J2321J2359J2073J1974J2242J2723
62182F43366J2830J1825R714P456N847M573L011J451Q32J537L252N818R279J3216
$$ y = [567921, 575558, 585664, 598417, 613607, 631049, 651083, 674321, 700836, 730151, 762242, 797975, 838209, 882927, 931575, 983593, 1037908, 1092281, 1143833, 1190208, 1229886, 1261763, 1285112, 1299947, 1306932, 1306885, 1300505, 1288322, 1270478, 1246703, 1216893, 1181596, 1141707, 1098044, 1051726, 1004604, 958624, 914773, 873182, 834201, 798693, 767090, 738769, 712716, 688536, 666560, 647179, 630324, 615448, 601894, 589350, 578014, 568228, 559917, 552555, 545632, 538949, 532505, 526383, 520891, 516475, 513223, 510550, 507660, 504398, 501460, 499711, 499412, 500208, 501710, 503818, 506545, 509883, 513995, 519223, 525624, 532750, 540243, 548492, 558259, 569674, 581995, 594354, 606427, 618401, 630643, 643366, 656196, 668021, 677735, 685191, 691038, 695611, 698622, 700073, 700905, 702442, 705694, 711512, 720791, 734007]
62168G34007J6892K0204K3740K7770L1767L4945L6684L6496L4304L0775K6694
62157A054278K1994J6190R747M048k46l961q181j3003j7810k2066k5428k7722
62145I87840k9158l0173l0781l0587k9481k7712k5286k2114j8790j6213j4222
62134G13323j1708q422n418l149m67L482P583J0309J2083J4475J7687K0469K2353
62121G92600K4224K6470K8090K8309K7888K7901K8025K7023K4378K0624J6184
62110A071716J0820M388k410q379j2692j5165j6000j5645j4881j4540j4833j5180
62098I57199j4990j4360j3668j2739j0974q218m986j758J330M014N843O852P800
62085I01345R269J1004J2461J3595J4676J5711J6590J7521J8863K0641K2500K4023
$$ y = [734007, 750899, 771103, 794843, 822613, 854380, 889325, 926009, 962505, 996809, 1027584, 1054278, 1076272, 1092462, 1102209, 1106257, 1106011, 1102050, 1093869, 1080866, 1063056, 1040990, 1015562, 987840, 958682, 928509, 897728, 867141, 837660, 809948, 784662, 762548, 743758, 727545, 713323, 701615, 693193, 687775, 684626, 684159, 687641, 695224, 705533, 717616, 732091, 749778, 770247, 792600, 816824, 843294, 871384, 899693, 927581, 955482, 983507, 1010530, 1034908, 1055532, 1071716, 1082536, 1086924, 1084514, 1076135, 1063443, 1048278, 1032278, 1016633, 1001752, 987212, 972379, 957199, 942209, 927849, 914181, 901442, 890468, 882250, 877264, 875506, 876836, 880850, 886693, 893545, 901345, 910614, 921618, 934079, 947674, 962350, 978061, 994651, 1012172, 1031035, 1051676, 1074176, 1098199]
62073A098199K4922K5206K5313K5687K6029K5444K3646K1496J9944J8951J7889
62062A352726J6531J5018J3223J0858P929M585Q12l138o419q413r617j1000j2757
62049A370338j4448j6148j8446k1370k4210k6551k8618l0466l1731l2420l3142
62038A092788l4114l4732l4581l4102l3703l2886l1015k8384k5690k2896j9588
62027G61097j6233j4004j3171j2643j1520j0346j0171j0960j1653j1587j1078
62016F27731j0621j0249r838r435q934p856n925l618j709m17O53J938L622N732
62002E71074P966R534R808R195Q765Q824Q439O710M041J611o2j523l459n885q261
61987F26777j0091j1271j2014j2512j2711j2456j1811j1026j0231r384q509p669
$$ y = [1098199, 1123121, 1148327, 1173640, 1199327, 1225356, 1250800, 1274446, 1295942, 1315886, 1334837, 1352726, 1369257, 1384275, 1397498, 1408356, 1416285, 1420870, 1421682, 1418544, 1412125, 1403712, 1394095, 1383095, 1370338, 1355890, 1339742, 1321296, 1299926, 1275716, 1249165, 1220547, 1190081, 1158350, 1125930, 1092788, 1058674, 1023942, 989361, 955259, 921556, 888670, 857655, 829271, 803581, 780685, 761097, 744864, 730860, 717689, 705046, 693526, 683180, 673009, 662049, 650396, 638809, 627731, 617110, 606861, 597023, 587588, 578654, 570798, 564873, 561255, 559546, 559129, 559782, 561720, 565342, 571074, 579040, 588574, 598382, 607577, 616342, 625166, 633605, 640315, 644356, 645967, 645905, 644382, 640923, 635038, 626777, 616686, 605415, 593401, 580889, 568178, 555722, 543911, 532885, 522654, 513270, 504761, 497092]
61975D97092o667n235l582k344j749j294n76L3j9n34p84m24K58Q92J359J682J968
61958D80076K457L256M107M758N410O458P821R066J0145J1525J3436J5461J7159
61945E91135J8833K1252K4665K8437L1763L4483L6964L9263M0912M1702M2206
61934I51615M3037M3856M3685M2144L9709L6745L3037K8502K3568J8445J2727
61923A317070O348K68m488q009j0970j3373j4624j4582j3578j1520p977l237J672
61910A223000O186J0687J5470J9997K3522K5781K6530K5062K0924J4854Q264J791
61898A422068n116j3031k1346k8521l3437l6308l8138l9437l9793l8834l7158
61887A090949l5844l5111l4109l2171k9730k7667k6187k4837k3445k2402k1891
$$ y = [497092, 490425, 485190, 481608, 479264, 477515, 476221, 475645, 475678, 475659, 475125, 474341, 473917, 474175, 475067, 476426, 478108, 480076, 482533, 485789, 489896, 494654, 500064, 506522, 514343, 523409, 533554, 545079, 558515, 573976, 591135, 609968, 631220, 655885, 684322, 716085, 750568, 787532, 826795, 867707, 909409, 951615, 994652, 1038508, 1082193, 1124337, 1164046, 1200791, 1233828, 1262330, 1285898, 1304343, 1317070, 1323418, 1323686, 1319198, 1311189, 1300219, 1286846, 1272222, 1257640, 1244062, 1232542, 1224565, 1221328, 1223000, 1229186, 1239873, 1255343, 1275340, 1298862, 1324643, 1351173, 1376235, 1397159, 1412013, 1420277, 1422068, 1416952, 1403921, 1382575, 1354054, 1320617, 1284309, 1246171, 1206734, 1166941, 1128107, 1090949, 1055105, 1019994, 985885, 953714, 923984, 896317, 870130, 845293, 821848, 799446, 777555]
61876G77555k1343j9949j7508j4535j1614q987o620m396k139K30K409L907M790
61863F81800N972Q355J1817J5485J8960K2711K7144L1854L6191M0217M4665M9979
61851I95150N5724O0961O4988O7718O9411P0131O9602O7592O4125N9038N1756
61840A696196M2025L0760J9431Q756j335j0348j6856j9904k0057j8461j5430j0589
61828A684188l987L534J0809J6751K0639K2419K2474K0760J6580R604N80r408
61816A814943j9867l0517m0595m9273n6352o1880o5470o6797o6390o5061o2886
61805A229855n9573n5497n1352m7042m2011l6586l1904k8380k5250k1909j8734
61794H11617j6270j4429j2922j1779j1039j0457r805r064q147p015o074n812n958
$$ y = [777555, 756212, 736263, 718755, 704220, 692606, 683619, 676999, 672603, 670464, 670694, 673103, 677010, 681800, 687772, 696127, 707944, 723429, 742389, 765100, 792244, 824098, 860289, 900506, 945171, 995150, 1050874, 1111835, 1176823, 1244541, 1313952, 1384083, 1453685, 1521277, 1585402, 1644440, 1696196, 1738221, 1768981, 1788412, 1797168, 1795833, 1785485, 1768629, 1748725, 1728668, 1710207, 1694777, 1684188, 1680201, 1683735, 1694544, 1711295, 1731934, 1754353, 1776827, 1797587, 1814167, 1823771, 1824351, 1814943, 1795076, 1764559, 1723964, 1674691, 1618339, 1556459, 1490989, 1424192, 1357802, 1292741, 1229855, 1170282, 1114785, 1063433, 1016391, 974380, 937794, 905890, 877510, 852260, 830351, 811617, 795347, 780918, 767996, 756217, 745178, 734721, 724916, 715852, 707705, 700690, 694616, 688804, 682846]
61781F82846n716n056m858n505o195o210o009o349o911o697n511m317m074m696
61767F04742n190m542k605l17J088J200O38K36L13P93J501K073K079J503Q24M50
61751F04786L80N29Q89J219J116O52M15O32Q10O28N66J108J804J824J120L54p2
61734F18760k42r2O92K015L194L690L661L613L835M372N215O227P020P243O977
61719F76180O671O574O423N808M787L888L456L239K801K109J464R56L48m87j291
61704G22926j680j562j221j086j319j666j768j663j701j950k083j975j939k066
61690F99247j981j702k090l622n245n496m523l926m529n486n788n618n702o085
61676F37454o209n660m436k842j519j132j705k536k988l017k839k536k125j636
$$ y = [682846, 677130, 672074, 667216, 661711, 655516, 649306, 643297, 636948, 630037, 623340, 617829, 613512, 609438, 604742, 599552, 595010, 592405, 592088, 593176, 594376, 595014, 595250, 595563, 596356, 597857, 599930, 602009, 603512, 604336, 604786, 605166, 605695, 606584, 607803, 608919, 609571, 609986, 610618, 611428, 612056, 612622, 613730, 615534, 617358, 618478, 618832, 618760, 618518, 618426, 619118, 621133, 624327, 628017, 631678, 635291, 639126, 643498, 648713, 654940, 661960, 669203, 676180, 682851, 689425, 695848, 701656, 706443, 710331, 713787, 717026, 719827, 721936, 723400, 724356, 724704, 724217, 722926, 721246, 719684, 718463, 717377, 716058, 714392, 712624, 710961, 709260, 707310, 705227, 703252, 701313, 699247, 697266, 695564, 693474, 689852, 684607, 679111, 674588, 670662, 666133, 660647, 654859, 649241, 643539, 637454, 631245, 625585, 621149, 618307, 616788, 615656, 613951, 611415, 608427, 605410, 602571, 600035, 597910, 596274]
61662E96274j044n31o17j415j964j221L26J172J032J254K678M303M873M580M354
61647F14054M427M617N105N837N895M699L231K806L056K473O99j097k118k906
61633F50778m120n416o091o107o090o572p447p947p280n637m182l598l156j912
61619E75223l22M19K83L82J108J610J333P76K36r82l309n820p227p357o866o164
61603E43323n404n048n431o023o000n444n183n464n635n280m881n038n566n859
61589D67067n733n447n141m712m214l888l784l657l417l326l569l912m018l920
61575D08329l859l836l666l392l239l154k830k252j795j639j506j160q25p84r58
61560C73434j161j422j705j620r51k03r5n71q34m07L34P46O05J40l22n50m89l15
$$ y = [596274, 595230, 594699, 594082, 592667, 590703, 589482, 589808, 590980, 592012, 593266, 595944, 600247, 605120, 609700, 614054, 618481, 623098, 628203, 634040, 639935, 644634, 647865, 650671, 653727, 656200, 656899, 655802, 653684, 650778, 646658, 641242, 635151, 629044, 622954, 616382, 608935, 600988, 593708, 588071, 583889, 580291, 577135, 575223, 574901, 575320, 575603, 575985, 577093, 578703, 580036, 580812, 581048, 580066, 576757, 570937, 563710, 556353, 549487, 543323, 537919, 532871, 527440, 521417, 515417, 509973, 504790, 499326, 493691, 488411, 483530, 478492, 472926, 467067, 461334, 455887, 450746, 446034, 441820, 437932, 434148, 430491, 427074, 423748, 420179, 416267, 412249, 408329, 404470, 400634, 396968, 393576, 390337, 387183, 384353, 382101, 380306, 378667, 377161, 376001, 375176, 374392, 373434, 372273, 370851, 369146, 367526, 366575, 366372, 366277, 365706, 364872, 364465, 364799, 365545, 366150, 366290, 365968, 365418, 364929, 364614]
61542C64614k62l04j66L42J141K099L178M280N036M930L729J856K52l74k42l36
61526C89773j355k924l990l866k810j696j237j414j612j416j179j497k172k245
61512C60360j285o6M64L60K43J31m68j470k125k114j987k184k282j691o30J15
61496C45371J91n3j72j04L0K09M52O42N86K72n6j03J29K77Jn35o86m1J015J608
61476C49033J343O76K50J19l4j88ON17P67M22j44m26m07k55J23O96R56N68M9J58
61456C54229Q00J240J196R45N74M2j80M51J363J304J47p66n31K37P67J381K569
61439C65768L773M186M069M263M902N512N932O119N576M043K478K206L237M375
61425D26439M892N044N060M712M105L868M232M595M368L608K632J562M58o24j887
$$ y = [364614, 364352, 364048, 363882, 364224, 365365, 367464, 370642, 374922, 379958, 384888, 388617, 390473, 390725, 390351, 390109, 389773, 388418, 385494, 381504, 377638, 374828, 373132, 371895, 370481, 368869, 367453, 366274, 364777, 362605, 360360, 359075, 359009, 359473, 359833, 360076, 360207, 359739, 358269, 356144, 354030, 352043, 349859, 347577, 345886, 345256, 345371, 345562, 345509, 345337, 345233, 345263, 345472, 345924, 346566, 347152, 347424, 347368, 347265, 347394, 347671, 347672, 347137, 346451, 346410, 347425, 349033, 350376, 351052, 351302, 351421, 351387, 351199, 351205, 351722, 352489, 352911, 352767, 352341, 351934, 351679, 351802, 352498, 353454, 354022, 354071, 354229, 355029, 356269, 357465, 358410, 358984, 359026, 358846, 359297, 360660, 361964, 362111, 361345, 360814, 361051, 361818, 363199, 365768, 369541, 373727, 377796, 382059, 386961, 392473, 398405, 404524, 410100, 414143, 416621, 418827, 422064, 426439, 431331, 436375, 441435, 446147, 450252, 454120, 458352, 462947, 467315, 470923, 473555, 475117, 475575, 474951, 473064]
61410D73064l540n188o049n965n631n605n641n312m714m209l854l498l180l056
61396D07622l141l342l573l676l380k622j749j254j255j360j028j65O77Q44M04
61381C83002J41N89J369J732J451Q60L27J34N45J548K610L157L149K843K300J559
61365D07316J036J179J870K707L635M729N598N737N438N588O538P787Q885R956
61351D77999J1201J2470J3628J4830J6231J7669J8775J9118J8323J6423J4071
61340F50738J1949J0024P850N524L655K389J050j000l620o157q088r254r837j0160
61326F45063j0326j0034r098p911p007o373n696n079m854m850m565m010l644l488
61312E58128l086k329j568p70N60K381L919M752N411O476P720Q557Q780Q425P376
$$ y = [473064, 469524, 464336, 458287, 452322, 446691, 441086, 435445, 430133, 425419, 421210, 417356, 413858, 410678, 407622, 404481, 401139, 397566, 393890, 390510, 387888, 386139, 384885, 383630, 382270, 381242, 381077, 381754, 382598, 383002, 383143, 383732, 385101, 386833, 388284, 389144, 389471, 389605, 390150, 391698, 394308, 397465, 400614, 403457, 405757, 407316, 408352, 409531, 411401, 414108, 417743, 422472, 428070, 433807, 439245, 444833, 451371, 459158, 468043, 477999, 489200, 501670, 515298, 530128, 546359, 564028, 582803, 601921, 620244, 636667, 650738, 662687, 672711, 680561, 686085, 689740, 692129, 693179, 692179, 688559, 682402, 674314, 665060, 655223, 645063, 634737, 624703, 615605, 607694, 600687, 594314, 588618, 583539, 578685, 573835, 569270, 565260, 561616, 558128, 555042, 552713, 551145, 550375, 550935, 553316, 557235, 561987, 567398, 573874, 581594, 590151, 598931, 607356, 614732]
61297F14732N542L095L12k511m858o266o920p428p833p476o115m495l375k613
61283E63791j689n72M60J445K498L340L600L509L772M797O324P788Q771R220R378
61268F26432R561R897J0380J1019J1796J2514J3041J3711J5124J7546K0633K3719
61256G95373K6059K6964K6108K3662J9957J5230R969M966N35l852q461j2349j4495
61243I09666j5427j6490j7765j8018j6781j5087j3837j2738j1396j0202r486q808
61231G43631p818o877o219n353m015k815k175j432J17J963L014K968K258J230
61217G18477R8o70p48m33j46J54N61P46N02K18K59L88M44R57K299L848M923O067
61199G37944Q288J1374J4145J6254J8603K1709K4706K6487K7117K7506K8055K8220
$$ y = [614732, 620274, 623369, 623681, 621170, 616312, 610046, 603126, 595698, 587865, 580389, 574274, 569779, 566404, 563791, 562102, 561530, 561990, 563435, 565933, 569273, 572873, 576382, 580154, 584951, 591275, 599063, 607834, 617054, 626432, 635993, 645890, 656270, 667289, 679085, 691599, 704640, 718351, 733475, 751021, 771654, 795373, 821432, 848396, 874504, 898166, 918123, 933353, 943322, 948288, 948823, 944971, 936510, 924161, 909666, 894239, 877749, 859984, 841966, 825185, 810098, 796261, 783523, 772127, 761925, 752439, 743631, 735813, 728936, 722717, 717364, 713349, 710534, 708359, 706927, 707044, 709007, 712021, 714989, 717247, 718477, 718575, 717905, 717157, 716724, 716578, 716732, 717293, 718039, 718541, 718759, 719018, 719406, 719850, 720807, 723106, 726954, 731877, 737944, 746232, 757606, 771751, 788005, 806608, 828317, 853023, 879510, 906627, 934133, 962188, 990408]
61187I90408K7287K5132K2076J8446J4651J1545R975R693R317P890N911M157K208
61174A158696o80l801n692o516q069j1065j4087j5939j7366j9413k1541k2681
61162A011846k3061k3586k4184k4143k3409k2329k0609j7834j4573j1817r682
61151G96619p716n980m721l385j211J466L573M659M825L769J241j788l800m565
61137G82986n056n598n417m142k425p03J449M199O734Q350R567J1502J4520J7966
61123H33932K0973K3203K4955K6658K8259K9303K9739L0150L0852L1291L0891
61112A140206L0022K9362K8742K7440K5301K2686J9696J6276J2975J0462Q408
61101A371576N706J891k461o720j0847j4986j9191k3481k7590l0719l2236l2573
$$ y = [990408, 1017695, 1042827, 1064903, 1083349, 1098000, 1109545, 1119520, 1129213, 1138530, 1146420, 1152331, 1156488, 1158696, 1158016, 1154215, 1148523, 1142007, 1133938, 1122873, 1108786, 1092847, 1075481, 1056068, 1034527, 1011846, 988785, 965199, 941015, 916872, 893463, 871134, 850525, 832691, 818118, 806301, 796619, 788903, 782923, 778202, 774817, 773606, 775072, 778645, 783304, 788129, 791898, 793139, 791351, 787551, 782986, 777930, 772332, 766915, 762773, 760348, 759645, 761094, 765293, 772027, 780377, 789944, 801446, 815966, 833932, 854905, 878108, 903063, 929721, 957980, 987283, 1017022, 1047172, 1078024, 1109315, 1140206, 1170228, 1199590, 1228332, 1255772, 1281073, 1303759, 1323455, 1339731, 1352706, 1363168, 1371576, 1377282, 1379173, 1376712, 1369992, 1359145, 1344159, 1324968, 1301487, 1273897, 1243178, 1210942, 1178369]
61089A178369l2725l2998l2909l2147l0911k9368k7537k5613k3890k2419k1199
61078H66653k0335j9503j7835j5048j2087r876q136o358n077m875m952m179l000
61065G35392k505k146l71K546M479M542M264N116O627P795Q791J0258J2039J3578
61051H10405J4828J6090J7514J9124K0786K2106K3059K4467K6817K8947K9326
61040A053469K8464K8359K9531L0537L0609L0752L1571L2055L1516L1001L1599
61029A389463L2802L3727L4708L6450L8659M0496M1573M1826M1436M1401M3066
61018A815607M6563N1128N7169O6245P8325R1188J03389J15992J30526J47701
61008B703833J69373J99307K40423K93622L60582M44233N44428O57828P86308
$$ y = [1178369, 1145644, 1112646, 1079737, 1047590, 1016679, 987311, 959774, 934161, 910271, 887852, 866653, 846318, 826815, 808980, 793932, 781845, 771969, 763833, 757475, 752398, 747523, 742571, 738392, 735392, 732887, 730741, 730370, 732916, 737395, 741937, 746201, 751317, 757944, 765739, 774530, 784788, 796827, 810405, 825233, 841323, 858837, 877961, 898747, 920853, 943912, 968379, 995196, 1024143, 1053469, 1081933, 1110292, 1139823, 1170360, 1200969, 1231721, 1263292, 1295347, 1326863, 1357864, 1389463, 1422265, 1455992, 1490700, 1527150, 1565809, 1606305, 1647878, 1689704, 1731140, 1772541, 1815607, 1862170, 1913298, 1970467, 2036712, 2115037, 2206225, 2309614, 2425606, 2556132, 2703833, 2873206, 3072513, 3312936, 3606558, 3967140, 4411373, 4955801, 5613629, 6399937]
60999F399937R42101J139907J387591J688398K040369K411706K712045K812177
60991B1534231K622669K164627J559709R52715M49980J19001N172J06975L30437
60982B9845516N00490M53044J32663l92642r98425j574451k044736k357516k487360
60973B1076583k449059k293017k076912j841161j607099j386676j186715j008518
60965G227426q50638p13044n96631n00212m20776l55999l04380k63590k30635
60956B991521k03328j80227j59732j40686j23391j08687r6451q6043p7635p1745
60946A743596o7881o4986o2898o2097o2154o1589n9403n5934n2220m9197m7195
60935A098042m5515m2794l8618l4393l1790l0607k9260k7016k4599k2667k0936
$$ y = [6399937, 7342038, 8481945, 9869536, 11557934, 13598303, 16010009, 18722054, 21534231, 24156900, 26321527, 27881236, 28833951, 29283931, 29402932, 29408104, 29515079, 29845516, 30346006, 30799050, 30931713, 30539071, 29540646, 27966195, 25921459, 23563943, 21076583, 18627524, 16334507, 14257595, 12416434, 10809335, 9422659, 8235944, 7227426, 6376788, 5663744, 5067113, 4566901, 4146125, 3790126, 3485746, 3222156, 2991521, 2788193, 2607966, 2448234, 2307548, 2184157, 2075470, 1979019, 1892976, 1815341, 1743596, 1675715, 1610729, 1547831, 1485734, 1423580, 1361991, 1302588, 1246654, 1194434, 1145237, 1098042, 1052527, 1009733, 971115, 936722, 904932, 874325, 845065, 818049, 793450, 770783, 749847]
60924G49847j9087j7377j5916j4245j2096r970q496p731p376p110o469n028l082
60911F15864j569r28n41K24R61Q52l6p69p69m18l88q17j347j627j651j676j925
60894F03440k311k527k438k298k372k486k219j579j157j471k337l120l492l639
60880E69994l754l660l203k804l178m373n451n433m454l597l650m341m881m897
60866E12318m551m040l349k476j544o45K07R92J746K603L564M234M173L578L227
60851E20037L537M100M344M321M473M948N502N963O333O507O311N719M730L177
60837E90002J097q12j682j465r69p98p99o64m95m57l69l8K83J90k56n88m49P5
60819E81806N09K70r08k611m034m795n222n758o413o925p152p079o815o726p165
$$ y = [749847, 730760, 713383, 697467, 683222, 671126, 661156, 652660, 644929, 637553, 630443, 623974, 618946, 615864, 614295, 613367, 612826, 613050, 614011, 614863, 614827, 614058, 613289, 612871, 612483, 611666, 610319, 608692, 607041, 605365, 603440, 601129, 598602, 596164, 593866, 591494, 589008, 586789, 585210, 584053, 582582, 580245, 577125, 573633, 569994, 566240, 562580, 559377, 556573, 553395, 549022, 543571, 538138, 533684, 530087, 526437, 522096, 517215, 512318, 507767, 503727, 500378, 497902, 496358, 495713, 495920, 496912, 498658, 501261, 504825, 509059, 513232, 516810, 520037, 523574, 527674, 532018, 536339, 540812, 545760, 551262, 557225, 563558, 570065, 576376, 582095, 586825, 590002, 591099, 590287, 588605, 587140, 586171, 585373, 584574, 583910, 583415, 582958, 582589, 582551, 582834, 583024, 582768, 582180, 581731, 581806, 582315, 582585, 581677, 579066, 575032, 570237, 565015, 559257, 552844, 545919, 538767, 531688, 524873, 518147, 510982]
60804E10982p808p752o653n317m695m701m621m280m094m143l957l286k411j575
60790D45689o85J92N59Q4p98j212p60J28O70N42J59J74P77J637K474L297M077
60773D57004M550M630M660M929N302N676O447P962R764J0906J0940J0146Q935
60760E51851P585O472N952N915N865N522N057M636M188L596K832J885Q83K77M61
60745F12977J212J809J731Q79o81k696m478n357n536n958p113q400q964q654p912
60730E52859p104o368n845n598n393m836l759k368j057j33L93P58J128J412J554
60715E15643J868K714L945N065N954O904P940Q613Q708Q656Q934R438R841J0227
60701F14450J0885J1712J2255J2372J2426J2768J3259J3503J3373J3208J3406
$$ y = [510982, 503174, 495422, 488769, 483452, 478757, 474056, 469435, 465155, 461061, 456918, 452961, 449675, 447264, 445689, 445004, 445196, 445755, 445839, 445041, 443829, 443069, 443197, 443867, 444409, 444568, 444742, 445519, 447156, 449630, 452927, 457004, 461554, 466184, 470844, 475773, 481075, 486751, 493198, 501160, 510924, 521830, 532770, 542916, 551851, 559436, 565908, 571860, 577775, 583640, 589162, 594219, 598855, 603043, 606639, 609471, 611356, 612239, 612516, 612977, 614189, 615998, 617729, 618608, 617927, 615231, 610753, 605396, 599860, 593902, 586789, 578389, 569425, 560771, 552859, 545755, 539387, 533542, 527944, 522551, 517715, 513956, 511588, 510531, 510398, 510791, 511549, 512677, 514089, 515643, 517511, 520225, 524170, 529235, 535189, 542093, 550033, 558646, 567354, 576010, 584944, 594382, 604223, 614450, 625335, 637047, 649302, 661674, 674100, 686868, 700127, 713630, 727003, 740211, 753617]
60690G53617J3916J4231J3978J3402J3065J3187J3566J4140J5123J6476J7536
60679I12237J7594J6711J5596J4681J3593J1696Q990O185L806J496j465n069q419
60666A007632j0907j2994j5406j7847j9281j9417j9215j9637k0480k0824k0286
60655H11338j9320j8428j7527j6198j4363j2491j1154j0388r657q556p366o733
60643F59157o903p546q218q624q463p554o254n308n020m857m134k790j227K59
60629E82518J500K201K199J902K007K653L212L090K449J916J731J501P73m15j724
60614F07513l048m534o099p286p745p661p442p171o702o194o106o613p288p527
60600E16097p073o109n026m217l860l816l781l576l190k642k085j946k546l481
$$ y = [753617, 767533, 781764, 795742, 809144, 822209, 835396, 848962, 863102, 878225, 894701, 912237, 929831, 946542, 962138, 976819, 990412, 1002108, 1011098, 1017283, 1021089, 1022585, 1021120, 1016051, 1007632, 996725, 983731, 968325, 950478, 931197, 911780, 892565, 872928, 852448, 831624, 811338, 792018, 773590, 756063, 739865, 725502, 713011, 701857, 691469, 681812, 673256, 665890, 659157, 652254, 644708, 636490, 627866, 619403, 611849, 605595, 600287, 595267, 590410, 586276, 583486, 582259, 582518, 584018, 586219, 588418, 590320, 592327, 594980, 598192, 601282, 603731, 605647, 607378, 608879, 609652, 609237, 607513, 604465, 599931, 593832, 586546, 578801, 571140, 563698, 556527, 549825, 543631, 537525, 530912, 523624, 516097, 509024, 502915, 497889, 493672, 489812, 485996, 482215, 478639, 475449, 472807, 470722, 468776, 466230, 462749]
60586D62749l782k932j463k84K52L60K00k46p83r61n95j7L69N71R45J699K666
60569D58748L509M050M429N032O239Q065R952J1073J1055J0339R709R369Q743
60556E60312P186M758K150K4j422k365l056l589l823l525k619j288J85J571K703
60541E57202L565M394N479O735P732Q269Q596Q880Q734P713N991M101K238K47
60527F39876j719l115l643l636l643l870m119m053l427k284j000JN88R20J178
60512F08054J541K243L374M641N611O164O438O445O063N482N332O181Q100J0702
60498F86371J3511J6344J9457K3245K7697L2190L6003L8785M0325M0212L7995
60487A012135L3544K6870J7948P173m262j4966k4303l2192l8239m1793m2863m2240
$$ y = [462749, 458967, 456035, 454572, 454288, 454540, 454900, 455100, 454854, 454071, 453110, 452515, 452498, 452867, 453438, 454383, 456082, 458748, 462257, 466307, 470736, 475768, 482007, 490072, 500024, 511097, 522152, 532491, 542200, 551569, 560312, 567498, 572256, 574406, 574430, 573008, 570643, 567587, 563998, 560175, 556650, 554031, 552743, 552928, 554499, 557202, 560767, 565161, 570640, 577375, 585107, 593376, 601972, 610852, 619586, 627299, 633290, 637391, 639629, 639876, 638157, 635042, 631399, 627763, 624120, 620250, 616131, 612078, 608651, 606367, 605367, 605368, 605956, 606876, 608054, 609595, 611838, 615212, 619853, 625464, 631628, 638066, 644511, 650574, 656056, 661388, 667569, 675669, 686371, 699882, 716226, 735683, 758928, 786625, 818815, 854818, 893603, 933928, 974140, 1012135, 1045679, 1072549, 1090497, 1097670, 1093408, 1078442, 1054139, 1021947, 983708, 941915, 899052, 856812]
60475H56812m0618l8116l4848l1270k7726k4174k0689j7747j5712j4346j3127
60464E78439j1855j0723r978r623r304q597p527o610o069n391m220l238l320m008
60450D77976l986l089k563l053l517k836j444m71j36pj74j037k242k853k575j942
60434D46051j436j179j358k126l033l301k792k097j583r96j82M43M90J74oJ50
60418D27219N21R64J342J516J495J478J605J808J994K204K370K194J466M62j51
60403D48487N3Q14J410J376Q83L72l6n89j303j715j381m65M84J167J692K098K140
60386D55487J644R01M19L86N75P79J069J492J739J443P88M63R27J944K932L470
60370D76458L382K647J565P09L75L31L11M22P48R80R18R12J252J507J210Q20J086
$$ y = [856812, 816194, 778078, 743230, 711960, 684234, 660060, 639371, 621624, 605912, 591566, 578439, 566584, 555861, 545883, 536260, 526956, 518359, 510832, 504222, 498153, 492762, 488542, 485304, 481984, 477976, 473990, 470901, 468338, 465285, 461768, 458932, 457488, 457017, 456881, 456874, 456700, 455663, 453421, 450568, 447993, 446051, 444615, 443436, 442078, 439952, 436919, 433618, 430826, 428729, 427146, 426150, 425968, 426411, 426901, 427075, 427069, 427219, 427740, 428704, 430046, 431562, 433057, 434535, 436140, 437948, 439942, 442146, 444516, 446710, 448176, 448638, 448487, 448540, 449354, 450764, 452140, 453023, 453395, 453359, 452770, 451467, 449752, 448371, 447906, 448390, 449557, 451249, 453347, 455487, 457131, 458032, 458451, 458837, 459412, 460191, 461260, 462752, 464491, 465934, 466722, 467185, 468112, 470056, 472988, 476458, 479840, 482487, 484052, 484761, 485136, 485467, 485778, 486200, 486948, 487928, 488846, 489758, 491010, 492517, 493727, 494547, 495633]
60353D95633J710J723J098Q85J589K518L109L730M626N154M840M386M709N571
60339E41281O041N785N114M188K940J576L43r90k711m420n365n391m968m423l733
60324E35267k972k386k049j880j903k031j802q36N15J509J906K113K518L170M063
60309E35202N163O213O921P405Q124R377J1158J3377J5764J7668J8449J8120J7263
60296F90204J6172J4392J1214O449P44m754r099j2045j3840j4577j4093j2572
60284F58195j0732r163p882o858o462o922p751q228q182p855p400o964o865p063
60270E49868o879n890m743m285m227l588k249j096n58p8P77J524J479O15n60j509
60254E18601j749j084qN75L45j03q0M24R79J256J127O52J62P9M16P49Q33R15J323
$$ y = [495633, 497343, 499066, 500164, 501049, 502638, 505156, 508265, 511995, 516621, 521775, 526615, 531001, 535710, 541281, 547322, 553107, 558221, 562409, 565349, 566925, 567268, 566278, 563567, 559147, 553782, 548391, 543423, 539000, 535267, 532295, 529909, 527860, 525980, 524077, 522046, 520244, 519408, 519923, 521432, 523338, 525451, 527969, 531139, 535202, 540365, 546578, 553499, 560904, 569028, 578405, 589563, 602940, 618704, 636372, 654821, 672941, 690204, 706376, 720768, 731982, 738431, 739175, 734421, 725322, 713277, 699437, 684860, 670767, 658195, 647463, 638300, 630418, 623560, 617098, 610176, 602425, 594197, 586015, 578160, 570760, 563796, 556931, 549868, 542989, 537099, 532356, 528071, 523844, 520256, 518007, 516911, 516353, 516275, 517052, 518576, 520055, 520670, 520110, 518601, 516852, 515768, 515760, 516335, 516680, 516577, 516497, 516921, 517900, 519156, 520283, 520935, 521097, 521176, 521592, 522341, 523174, 524089, 525412]
60235E25412J985K556K710K283J458P72O57R21J066J032J174J491J535J140O90
60220E46882M66L40L11P47J717K596K808K556K420K586K877L220L607L775L430
60205E80338K680J930J430J210J257J417J270N15n76j385j656j685j786j857j612
60190E81490j060n70n04q33j167j153q63o95q40r90p26j04L21J11n56j085j096
60173E69680p16l00J4L38Q15J438K046K344K062J301O74P53J459K209K682K984
60157E89783L124K884K391K256K696K998K400J185L94N85J402K289L028L559L778
60142F24752L732L744M079M615M986N089N351O357Q041R399R388Q109O656N707
60128G10005M707K658p11m724q184r830r139p129n764n939o567o203m903l734
$$ y = [525412, 527397, 529953, 532663, 534946, 536404, 537176, 537833, 538754, 539820, 540852, 542026, 543517, 545052, 546192, 546882, 547348, 547688, 547999, 548746, 550463, 553059, 555867, 558423, 560843, 563429, 566306, 569526, 573133, 576908, 580338, 583018, 584948, 586378, 587588, 588845, 590262, 591532, 592047, 591471, 590086, 588430, 586745, 584959, 583102, 581490, 580430, 579860, 579356, 578523, 577356, 576203, 575340, 574645, 573805, 572815, 572089, 571985, 572306, 572417, 571861, 570776, 569680, 568964, 568664, 568678, 569016, 569831, 571269, 573315, 575659, 577721, 579022, 579696, 580449, 581908, 584117, 586799, 589783, 592907, 595791, 598182, 600438, 603134, 606132, 608532, 609717, 610111, 610696, 612098, 614387, 617415, 620974, 624752, 628484, 632228, 636307, 640922, 645908, 650997, 656348, 662705, 670746, 680145, 689533, 697642, 704298, 710005, 714712, 717370, 716659, 711935, 703751, 693921, 684782, 677653, 671889, 665950, 659383, 653180, 648277, 644543]
60114F44543l076k557k192k391k853k702j893j490k169l203l447k712j791j451
60100F10616j783k197j986j029M4N97P57J076J771K773M205O113P871Q705Q711
60085F46244Q688Q970R153Q975Q661Q362P867O956N422K968k96l368n310o456
60071G06836p714q883q947q029p609q325q989q416p124o359o374o572o552o218
60057F00725n505m705m526n124n676n471m838m377l946l127k032r55K52J682K783
60042E55160K988K537K004J516J051Q84R74M91j109k935l516k550j094l06p29
60027E55366k373m627o336o861o822p124p628p641p263p139p170o626n468m420
60013D67868l676k691j400n53n01o42m61k07j34J00P25J302J406J267J209J083
$$ y = [644543, 641467, 638910, 636718, 634327, 631474, 628772, 626879, 625389, 623220, 620017, 616570, 613858, 612067, 610616, 608833, 606636, 604650, 603621, 603665, 604262, 605019, 606095, 607866, 610639, 614844, 620957, 628828, 637533, 646244, 654932, 663902, 673055, 682030, 690691, 699053, 706920, 713876, 719298, 722266, 721970, 718602, 713292, 706836, 699122, 690239, 681292, 673263, 665654, 657329, 648340, 639924, 632800, 626441, 620067, 613495, 606943, 600725, 595220, 590515, 585989, 580865, 575189, 569718, 564880, 560503, 556557, 553430, 551398, 550443, 550695, 552377, 555160, 558148, 560685, 562689, 564205, 565256, 566140, 567114, 567605, 566496, 563561, 560045, 557495, 556401, 556095, 555366, 552993, 548366, 542030, 535169, 528347, 521223, 513595, 505954, 498691, 491552, 484382, 477756, 472288, 467868, 464192, 461501, 460101, 459548, 459047, 458405, 457944, 457737, 457603, 457703, 458428, 459730, 461136, 462403, 463612, 464695]
59997D64695P55O42J112J794K109K149K445L046L491L513L329L168L030K871K740
59982E00889K640K453K012J160j21j468k236k160j687j411j315j010n01j81j05
59967D96959J48P23J134J007O79O19O70M47J97N31J310J629J103M57L71M19j86
59950E08217j309k067k109j881j711j458j135j144j643k267k768l337l934l967
59936D77487l139k159j958k429k589j892q43k40l31p27q94n71J24Q16J242J490
59920D63387J794K142K315K220K111K308K817L286L396L216L049L022K947K699
59906E00709K342J894J268P91J229K670L845L397J778R07J718K979L006J780O70
59891E30983O25J451K589L753M762N353N438N267N174N366N881O576P079O935
$$ y = [464695, 465450, 466092, 467204, 468998, 471107, 473256, 475701, 478747, 482238, 485751, 489080, 492248, 495278, 498149, 500889, 503529, 505982, 507994, 509154, 509033, 507565, 505329, 503169, 501482, 500071, 498756, 497746, 497245, 497064, 496959, 497107, 497830, 498964, 499971, 500650, 501269, 501939, 502386, 502583, 503114, 504424, 506053, 507156, 507613, 507984, 508403, 508217, 506908, 504841, 502732, 500851, 499140, 497682, 496547, 495403, 493760, 491493, 488725, 485388, 481454, 477487, 474348, 472189, 470231, 467802, 465213, 463321, 462478, 462238, 461907, 461180, 460286, 459715, 459839, 460655, 461897, 463387, 465181, 467323, 469638, 471858, 473969, 476277, 479094, 482380, 485776, 488992, 492041, 495063, 498010, 500709, 503051, 504945, 506213, 507004, 508233, 510903, 514748, 518145, 519923, 520830, 522548, 525527, 528533, 530313, 530983, 531608, 533059, 535648, 539401, 544163, 549516, 554954, 560221, 565395, 570761, 576642, 583218, 590297, 597232]
59877E97232O000M638L439K620J753L66j262k280k471k718l858n468o469o535
59863E84987o154n579m705l859l613l679l054j575k75K16O25J733L075L776L966
59848E65885M509N785P585R682J1767J3089J2995J1640R663P420N077L072J900
59835F70069J651K201L410M700M920L367N92k362n172q020j0602j2226j2769j2808
59821F26951j2803j2667j2162j1247j0139r249q822q463p467n947m944m968n097
59808E12976m246k684j512j108j043j066j197j138n95J3l7o92j277j507j618j715
59792D91554j806k159k833l121k456j501j283j540j154r7M71J22k03J18M26O7
59776D74605m05j77N32R00P66P48J350K354K980K528J151m3l1J039K215K928L212
$$ y = [597232, 603232, 607870, 611309, 613929, 615682, 616048, 614786, 612506, 610035, 607317, 603459, 597991, 591522, 584987, 578833, 573254, 568549, 564690, 561077, 557398, 554344, 552769, 552494, 552710, 553335, 555068, 558143, 561919, 565885, 570394, 576179, 583764, 593446, 605213, 618302, 631297, 642937, 652600, 660020, 665097, 668169, 670069, 671720, 673921, 677331, 682031, 686951, 690318, 690910, 688548, 683376, 675356, 664754, 652528, 639759, 626951, 614148, 601481, 589319, 578072, 567933, 558684, 549862, 541399, 533932, 527985, 523041, 518073, 512976, 508730, 506046, 504534, 503426, 502383, 501317, 500120, 498982, 498387, 498400, 498363, 497671, 496394, 494887, 493269, 491554, 489748, 487589, 484756, 481635, 479179, 477678, 476395, 474855, 473701, 473604, 474075, 474197, 473994, 474112, 474538, 474605, 474200, 474023, 474555, 475455, 476221, 476969, 478319, 480673, 483653, 486181, 487332, 487289, 487258, 488297, 490512, 493440, 496652]
59759D96652L061K479K028K252K628K190J285J413L019M703N169M794M541M455
59745E40669M110L660L396K959J978R88P26Q94N94k70r13q28l40Jp4o02j363j871
59727E53714j803j405j052o84r1M54M72P6j48j9L0k08k89J81Q24Q90K65l04n0
59708E50853R67K043K662K888K917K645J927J018L58R3J13M25J030J552J501R24
59692E73916L69J13j20n90j148j483j452j050m62j42m36j043j312j129r87j154
59676E61890j333j350j579k339l398m381n232n907o031n350m219l302k879k724
59662E11866k484j966j253o74m93n38l58J99R12J669K565L432L810L598L300L268
59646E26853L141K351Q88p77k217l173l418k866j779n67M73J216J626J772J785
$$ y = [496652, 499713, 502192, 504220, 506472, 509100, 511290, 512575, 513988, 517007, 521710, 526879, 531673, 536214, 540669, 544779, 548439, 551835, 554794, 556772, 557760, 558486, 559380, 559974, 559704, 558791, 557963, 557623, 557624, 557550, 556948, 555585, 553714, 551911, 550506, 549454, 548770, 548679, 549133, 549605, 549681, 549533, 549514, 549544, 549336, 549047, 549228, 550052, 550942, 551207, 550903, 550853, 551820, 553863, 556525, 559413, 562330, 564975, 566902, 567920, 568278, 568371, 568484, 568909, 569939, 571491, 572992, 573916, 574285, 574398, 574278, 573688, 572540, 571057, 569605, 568555, 568093, 567951, 567515, 566472, 565160, 564031, 563044, 561890, 560557, 559207, 557628, 555289, 551891, 547510, 542278, 536371, 530340, 524990, 520771, 517469, 514590, 511866, 509382, 507416, 506163, 505489, 504996, 504458, 504100, 504299, 505211, 506880, 509445, 512877, 516687, 520285, 523585, 526853, 529994, 532345, 533233, 532456, 530239, 527066, 523648, 520782, 519003, 518436, 518909, 520125, 521751, 523523, 525308]
59631E25308J681J359P91J69j54J44R83J619J243J09m81J15P98J97j314k183k006
59614E28378j855k263k329j319J24J113J773K576L292L495L405L367L035J948
59600E44740M74o28j185j478j531j305j128j185r40R9J313J614R61L76M22N44
59584E41163R9p72j565k167k747l292l561l432l075k850k997l418l799l944l857
59569D99786l498k786j857j001k52N99J441J831J731J728K173K614K497K035J819
59554E08860J915J911J608J222J061J380K308L530M341M446M416M940N953P085
59540E54976Q635J1342J5075J8396J9607J8050J4373R840N477J744j101k520k027
59527F71867L2K553M774O759Q586R660R418Q144O486M480J840j134l613n192o228
$$ y = [525308, 526989, 528348, 529139, 529308, 529154, 529298, 530281, 531900, 533143, 533252, 532771, 532886, 533684, 533881, 532567, 530384, 528378, 526523, 524260, 521931, 520612, 520736, 521849, 523622, 526198, 529490, 532985, 536390, 539757, 542792, 544740, 545214, 544586, 543401, 541923, 540392, 539087, 537959, 536774, 535834, 535933, 537246, 538860, 539821, 540197, 540619, 541163, 541262, 540490, 538925, 536758, 534011, 530719, 527158, 523726, 520651, 517801, 514804, 511386, 507587, 503643, 499786, 496288, 493502, 491645, 490644, 490392, 490991, 492432, 494263, 495994, 497722, 499895, 502509, 505006, 507041, 508860, 510775, 512686, 514294, 515516, 516577, 517957, 520265, 523795, 528136, 532582, 536998, 541938, 547891, 554976, 563611, 574953, 590028, 608424, 628031, 646081, 660454, 670294, 675771, 677515, 676414, 673894, 671867, 671899, 674452, 679226, 685985, 694571, 704231, 713649, 721793, 728279, 732759, 734599, 733465, 729852, 724660, 718432]
59512G18432p292q768j0870j3359j5274j5545j4073j1884j0104r047q315p439
59500E86462o325n263m543m073l478k711k203k256k568k619k274j704j046m01
59486E44998P7M83J165K107K678K502K232K845M375N893O675O757O448N881N166
59471F00282M542M097L595K748J581N20J14N32J429K476L930O249R119J1494J2824
59456F65532J3614J4473J5224J5462J5456J5818J6606J7282J7273J6120J3486
59445H36346R484M771j52n263j0285j4231j6389j7212j7522j7291j6096j4267
59433G21893j2636j1309r674p584n604m116k901j612L8K444N691R082J1923J4562
59419G10197J7697K0757K2265K2101K2061K3481K5210K4768K0897J4216N950k903
$$ y = [718432, 711140, 702372, 691502, 678143, 662869, 647324, 633251, 621367, 611263, 602216, 593901, 586462, 580137, 574874, 570331, 566258, 562780, 560069, 557866, 555610, 553042, 550423, 548149, 546445, 545399, 544998, 545075, 545558, 546723, 548830, 551508, 554010, 556242, 559087, 563462, 569355, 576030, 582787, 589235, 595116, 600282, 604824, 608921, 612516, 615264, 616845, 617365, 617479, 618011, 619440, 621916, 625846, 632095, 641214, 652708, 665532, 679146, 693619, 708843, 724305, 739761, 755579, 772185, 789467, 806740, 822860, 836346, 845830, 850601, 850449, 845186, 834901, 820670, 804281, 787069, 769547, 752256, 736160, 721893, 709257, 697948, 688274, 680690, 675086, 670970, 668069, 666457, 666495, 668939, 674630, 683712, 695635, 710197, 727894, 748651, 770916, 793017, 815078, 838559, 863769, 888537, 909434, 923650, 929600, 926697]
59407I26697j1264j7809k1621k2677k1421j8111j2947o935k115m42k345o662j1902
59394G70446j7045k1208k3467k3611k2549k1213j9486j6831j3535j0565q416o880
59382E65640n789n170m723l963k850j714o35M92J376J566J230R55Q52O06L26N02
59366E48701J075J451J550J981K984M085M985N981P156Q035Q456R015J0236J1963
59352F27654J3986J6429J9136K1357K2688K3606K4504K4883K4216K2983K1957
59341H63399K0868J8660J4934J0324N558Q83l567p545j0968j3970j6591j8713
59329H63272k0391k1907k3363k4499k4905k4228k2255j9161j5684j2752j0764
59318F43363r423q266p128o072n145m391l879l539l044k118q98J80Q55J245J611
$$ y = [926697, 915433, 897624, 876003, 853326, 831905, 813794, 800847, 793912, 791797, 791355, 789010, 782348, 770446, 753401, 732193, 708726, 685115, 662566, 641353, 621867, 605036, 591501, 580936, 572520, 565640, 559851, 554681, 549958, 545995, 543145, 541431, 540796, 541288, 542664, 544230, 545460, 546415, 547267, 547873, 548199, 548701, 549776, 551227, 552777, 554758, 557742, 561827, 566812, 572793, 579949, 587984, 596440, 605455, 615691, 627654, 641640, 658069, 677205, 698562, 721250, 744856, 769360, 794243, 818459, 841442, 863399, 884267, 902927, 917861, 928185, 933743, 934626, 931059, 923514, 912546, 898576, 881985, 863272, 842881, 820974, 797611, 773112, 748207, 723979, 701724, 682563, 666879, 654127, 643363, 633940, 625674, 618546, 612474, 607329, 602938, 599059, 595520, 592476, 590358, 589460, 589640, 590495, 591740, 593351]
59303E93351K156L064M455O103P549Q748J0354J3005J6450J9783K2261K3300K1982
59290G52561J7533J0553L032l265p893j1060j2664j2622j1401r609p377m716j986
59277G01086O16L505O915J0079J2022J2889J3675J4795J5737J6005J5561J4316
59265H37201J2023Q838N394K114j102m454p921j1279j4058j5673j6100j6208j6830
59252G61945j7659j7735j6766j5237j3405j1094q501o272m581k873p89J372L256
59239F51661M943O619Q290R937J1394J2010J1104Q897O399M227K140j89k629n047
59225G29756p549j0034j2092j3610j4830j5596j5208j3484j1362r983r522r301
59213E87185q693p596o254n012m110l561l250l071k847k364j753j531j758j594
$$ y = [593351, 595507, 598571, 603026, 609129, 616678, 625426, 635780, 648785, 665235, 685018, 707279, 730579, 752561, 770094, 780647, 783679, 780414, 772521, 761461, 748797, 736175, 724774, 715165, 707788, 703072, 701086, 701702, 705207, 712122, 722201, 734223, 747112, 760787, 775582, 791319, 807324, 822885, 837201, 849224, 858062, 863456, 865570, 864468, 860014, 852093, 840814, 826756, 811083, 794983, 778775, 761945, 744286, 726551, 709785, 694548, 681143, 670049, 661548, 655276, 650695, 647822, 647033, 648405, 651661, 656604, 663223, 671513, 681450, 692844, 704854, 715958, 724855, 731254, 735481, 737621, 737432, 734803, 729756, 722207, 712173, 700081, 686471, 671641, 656045, 640837, 627353, 615991, 606008, 596486, 587185, 578492, 570896, 564642, 559630, 555520, 551959, 548709, 545638, 542791, 540427, 538674, 537143, 535385, 533791]
59199E33791l61J256J931J443Q05P00Q23Q96J243K044K890L514M179M995N552
59184E65701N642N679O031O543P019P539Q007Q045P720P689Q281R035R570J0207
59170F72708J1307J2573J3471J3860J3839J3475J2969J2584J2075J0839Q877O909
59158H15486N164K865n13m167o880q474r685j0965j2106j2852j3264j3537j3725
59145G17347j3627j2828j1177r241p897p407p340p335p306o881n566l709k396
59132F14637k029j794r39K21J136J960L061M262N350O681Q569J0514J1787J2433
59118F75849J3069J4010J5141J6313J7390J8180J8750J9360J9845J9627J8701
59107H66235J7875J7558J7051J5699J3948J2409J0604P725M125R76j341l378n248
$$ y = [533791, 533430, 534686, 536617, 538060, 538865, 539565, 540388, 541284, 542527, 544571, 547461, 550975, 555154, 560149, 565701, 571343, 577022, 583053, 589596, 596615, 604154, 612161, 620206, 627926, 635615, 643896, 652931, 662501, 672708, 684015, 696588, 710059, 723919, 737758, 751233, 764202, 776786, 788861, 799700, 808577, 815486, 820650, 823515, 823002, 818835, 811955, 803481, 793796, 782831, 770725, 757873, 744609, 731072, 717347, 703720, 690892, 679715, 670474, 662577, 655170, 647830, 640495, 633189, 626308, 620742, 617033, 614637, 612608, 610814, 609875, 610096, 611232, 613192, 616253, 620515, 625865, 632546, 641115, 651629, 663416, 675849, 688918, 702928, 718069, 734382, 751772, 769952, 788702, 808062, 827907, 847534, 866235, 884110, 901668, 918719, 934418, 948366, 960775, 971379, 979104, 983229, 984205, 982864, 979486, 974238]
59094I74238o291o236n766n537n376m890m340m425n362o632p629q344r271j0669
59080H83470j2148j3197j3856j4484j5001j4861j3841j2377j1026j0081r722r913
59068G32963j0032r271p690o280n723n695n613n373m963m132k937k068k016k433
59054F58737k774l065l520l884l716l053k305j775j593j702j735j257l88L06P02
59039F28978J266K228L258M232N431O725P445P488P698Q635R792J0636J1533J2978
59025G28323J4700J6193J7466J8541J8971J8549J7728J6668J4675J1387P686M543
59013I05430J751j256m009n518n580m691l115j018J057K785M619O917R070J0397
58999I16839J1204J1881J1767J0138P750N957M718K869J82k356m336o545r506
$$ y = [974238, 967947, 961711, 955945, 950408, 945032, 940142, 935802, 931377, 926015, 919383, 911754, 903410, 894139, 883470, 871322, 858125, 844269, 829785, 814784, 799923, 786082, 773705, 762679, 752598, 742876, 732963, 722931, 713660, 705970, 699690, 693967, 688272, 682659, 677286, 672323, 668191, 665254, 663186, 661170, 658737, 655963, 652898, 649378, 645494, 641778, 638725, 636420, 634645, 633052, 631350, 629615, 628358, 627970, 628276, 628978, 630244, 632472, 635730, 639962, 645393, 652118, 659563, 667051, 674749, 683384, 693176, 703812, 715345, 728323, 743023, 759216, 776682, 795223, 814194, 832743, 850471, 867139, 881814, 893201, 900887, 905430, 907181, 905925, 901916, 896398, 890818, 886127, 883012, 881994, 883051, 885836, 890455, 897372, 906442, 916839, 928043, 939924, 951691, 961829, 969579, 975536, 980254, 983123, 983305, 980949, 976613, 970068, 960562]
58986I60562j2555j4768j5991j6581j6716j6235j4817j2353r443p165n902m857
58974H13179l250j450j47Q79K181L515M404N385P298R692J1250J1761J2309J3376
58960H90382J4053J3366J1332Q398M810Q87k917o478r896j2761j4354j4714j4706
58947H67402j4810j4539j3358j1419r105o413l295k60J730J911L00k240m671o638
58933G84595q438j0071j0911j0605r682q742p722o502n579n352n369n060m671
58920F85891m536m096k645o02J052K182L330M497N259N800O683P762Q479Q998
58906G28054R969J1276J2147J2472J2954J3838J4481J4266J3270J1975J1065J1178
58894H76945J2241J3433J4462J6304J9714K3718K6785K8860L0729L1913L0933
$$ y = [960562, 948007, 933239, 917248, 900667, 883951, 867716, 852899, 840546, 831103, 823938, 818036, 813179, 809929, 808479, 808332, 809211, 811392, 814907, 819311, 824696, 831994, 841686, 852936, 864697, 877006, 890382, 904435, 917801, 929133, 937531, 942341, 943228, 940311, 933833, 923937, 911176, 896822, 882108, 867402, 852592, 838053, 824695, 813276, 804171, 797758, 794463, 794203, 795933, 797844, 798144, 795904, 791233, 784595, 776157, 766086, 755175, 744570, 734888, 726146, 718424, 711922, 706343, 700991, 695622, 690562, 685891, 681355, 677259, 674614, 674012, 675064, 677246, 680576, 685073, 690332, 696132, 702815, 710577, 719056, 728054, 738023, 749299, 761446, 773918, 786872, 800710, 815191, 829457, 842727, 854702, 865767, 876945, 889186, 902619, 917081, 933385, 953099, 976817, 1003602, 1032462, 1063191, 1095104, 1126037]
58883A126037K7532K3038J8468J3711Q624L397k339r185j6514k2659k6817k9566
58871A113727l1271l1456l0073k8106k6359k4748k3076k1443j9605j7188j4808
58860H45594j3779j4339j5309j5778j5877j5653j4581j2753j1263j0713j0388
58849F95161r488q159o828n601m869n400p078q540q753q117p446o742n652m368
58835E98120l303k510j986j977k478k889k611j614k62R50J480J213Q97J426K694
58820E87150L844M412M428L694K091M44j92n7k24p25o05J28K10q79k167k890l364
58803E95298l692l192j844q63r02j010l17M69K87n73j034p56j15O78J621K520
58787E86575L177L653M005M309M921N959O612O017M796M506N333N786M938L543
$$ y = [1126037, 1153569, 1176607, 1195075, 1208786, 1217410, 1220807, 1218468, 1209283, 1192769, 1170110, 1143293, 1113727, 1082456, 1051000, 1020927, 992821, 966462, 941714, 918638, 897195, 877590, 860402, 845594, 831815, 817476, 802167, 786389, 770512, 754859, 740278, 727525, 716262, 705549, 695161, 685673, 677514, 670686, 665085, 660216, 654816, 647738, 639198, 630445, 622328, 614882, 608140, 602488, 598120, 594817, 592307, 590321, 588344, 585866, 582977, 580366, 578752, 578490, 579440, 580920, 582133, 583030, 584456, 587150, 590994, 595406, 599834, 603528, 605619, 606063, 605871, 605814, 605590, 604865, 604260, 604388, 604598, 603719, 601552, 598662, 595298, 591606, 588414, 586570, 585707, 584805, 583795, 583478, 583947, 584234, 583661, 582627, 581871, 581756, 582434, 584055, 586575, 589752, 593405, 597410, 601719, 606640, 612599, 619211, 625228, 630024, 634530, 639863, 645649, 650587, 654130]
58773F54130K451J414R4j101j871k529l054k925k462k880m330n306m755l396k121
58758F21359o39J256K628K817K693L192L790L660L273L496M053M164L945L968
58744F63655M176M340M831N933P084P849Q771J0322J1777J2296J2297J2686J3413
58731G79430J3846J3926J3900J3505J2423J0921R259P138M611K678K112K340K429
58718H88518K396K686L178L576L961M117L232J191p63j756k639m522o912q623
58704H87640r674j1015j2914j4979j7097j9212k0667k0919k0440j9870j8894j6975
58692F84984j4560j2460j0695q977p672p177o937o274n557n446n582n195m452
58679E84000l988l626k747j552p81n10j49O57J958L871O191Q224R796J1710J4338
$$ y = [654130, 656581, 657995, 658089, 656988, 655117, 652588, 649534, 646609, 644147, 641267, 636937, 631631, 626876, 623480, 621359, 620720, 621976, 624604, 627421, 630114, 633306, 637096, 640756, 644029, 647525, 651578, 655742, 659687, 663655, 667831, 672171, 677002, 682935, 690019, 697868, 706639, 716961, 728738, 741034, 753331, 766017, 779430, 793276, 807202, 821102, 834607, 847030, 857951, 867210, 874348, 878959, 881637, 883749, 886089, 888518, 890914, 893600, 896778, 900354, 904315, 908432, 911664, 912855, 912092, 910336, 907697, 903175, 896263, 887640, 877966, 866951, 854037, 839058, 821961, 802749, 782082, 761163, 740723, 720853, 701959, 684984, 670424, 657964, 647269, 638292, 630620, 623443, 616506, 610232, 604675, 599229, 593647, 588452, 584000, 580012, 576386, 573639, 572087, 571306, 570796, 570647, 571304, 573262, 577133, 583324, 591548, 601344, 613054, 627392]
58664F27392J6563J7131J6287J4953J3041R842N547J207k414n010o368o806p376
58651F93989q558r382q788p179n664m499l374k439j918j344l34N80Q74J039J546
58636F44549J733R62n6l72m54j228k293k558k048j560j136k97P08J321J857K996
58620F42124M640O518R179J2981J6700J8789J9399J9709J9837J8960J7014J4584
58608H20434J1515P314K665j012l365n139o604p427p817q436r256r686r604r219
58594G64363q307o755n316m595l767j618J652M828P434R774J1784J3099J3727
58581G96303J3625J2290R875P779O822N898L866J646P81J038J347K023M015O820
58567H74128R333J1922J5453J8998K0849K1270K1788K2326K1436J9133J6941J5228
$$ y = [627392, 643955, 661086, 677373, 692326, 705367, 715209, 720756, 721963, 719549, 714539, 708171, 701365, 693989, 685431, 676049, 667261, 660082, 654418, 649919, 646545, 644106, 642188, 640844, 640510, 641090, 641964, 643003, 644549, 646282, 647244, 647188, 646816, 646362, 645134, 642841, 640283, 638235, 636675, 635539, 635242, 635950, 637271, 639128, 642124, 646764, 653282, 662461, 675442, 692142, 710931, 730330, 750039, 769876, 788836, 805850, 820434, 831949, 839263, 841928, 840916, 837551, 832412, 825808, 818381, 810564, 802128, 792872, 783186, 773582, 764363, 756056, 749301, 743985, 739390, 735623, 734005, 735657, 740485, 747919, 757693, 769477, 782576, 796303, 809928, 822218, 832093, 839872, 846694, 852592, 856458, 858104, 858885, 859923, 861270, 863293, 867308, 874128, 883461, 895383, 910836, 929834, 950683, 971953, 993741, 1016067, 1037503, 1056636, 1073577, 1088805]
58555A088805J2924R834O965M470J535j609l817n210p075r466j1118j1869j2920
58542A061449j4458j5232j4908j4643j4923j4897j4263j3812j3637j2803j1244
58531I06629j0047r405q231o279m720m026l152j392O15K285L863N287N941N961
58517H83329O307P115P493P196O993P170P250P358Q212R587J0428J0606J0824
58504I89868J0849R620P150M497J750j959o362r954j2229j4055j5663j6270j5838
58491I31404j5258j4500j2692j0182q454p715o602m539k256P5L018N960P346P194
58477H72799P131P669P673O766N716M178P44m151p974r481j0013j0750j1254j1320
58463H47733j1659j1894j0436p380n009m419m055k607r29m8M49R39Q70L85N51
$$ y = [1088805, 1101729, 1111563, 1118528, 1122998, 1124533, 1122924, 1119107, 1113897, 1106822, 1097356, 1086238, 1074369, 1061449, 1046991, 1031759, 1016851, 1002208, 987285, 972388, 958125, 944313, 930676, 917873, 906629, 896582, 887177, 878946, 872667, 867947, 863921, 860769, 859377, 859992, 862277, 866140, 871427, 877368, 883329, 889636, 896751, 904244, 911440, 918433, 925603, 932853, 940211, 948423, 958010, 968438, 979044, 989868, 1000717, 1010337, 1017487, 1021984, 1023734, 1021775, 1015413, 1005459, 993230, 979175, 963512, 947242, 931404, 916146, 901646, 888954, 878772, 870318, 862603, 856001, 851462, 849206, 849281, 852299, 858259, 865605, 872799, 879930, 887599, 895272, 902038, 907754, 911932, 912676, 908525, 900551, 891070, 881057, 870307, 859053, 847733, 836074, 824180, 813744, 806364, 801355, 796936, 792881, 790274, 789345, 789297, 789746, 790685, 791555, 791940, 792491]
58448G92491J185P10r34j737q62J28K62P08K195L555M171N257P301Q692Q354P396
58432H38872O817N969M736M676O467Q517R595J0493J1743J2239J1634J1456J2207
58419I55421J1937R432O315M213K424L14p10J40Q94l07k323l257l413l807l804
58404I73469k623j374j300j677j425j063j221j066j88mj378k755k736k443l314
58389I48902m559m951n166o074o657n880m794m584m362l186k283k875l630k766
58375H87135j002O2Q49K562M488N153M997N539O824P841Q488R275R952J0086R959
58360I72208R689Q735P306O552O380N132K524N29P7m39j893k553j284K27N10P37
58344A014437K041L306L920N681R415J2616J3285J3283J4914J6992J7382J6803
$$ y = [792491, 793676, 794386, 793452, 791715, 790853, 790981, 791243, 791951, 794146, 797701, 801872, 807129, 814430, 823122, 831476, 838872, 845689, 851658, 856394, 861070, 867537, 876054, 885649, 896142, 907885, 920124, 931758, 943214, 955421, 967358, 976790, 983105, 987318, 989742, 990056, 989346, 989486, 990380, 990073, 987750, 984493, 981080, 977273, 973469, 970846, 969472, 968172, 966495, 965070, 964007, 962786, 961720, 961532, 961528, 960150, 957395, 954659, 952216, 948902, 944343, 939392, 934226, 928152, 921495, 915615, 910821, 906237, 901875, 898689, 896406, 893531, 889901, 887135, 886133, 886195, 887044, 889606, 894094, 899247, 904244, 909783, 916607, 924448, 932936, 942211, 952163, 962249, 972208, 981897, 990632, 997938, 1004490, 1010870, 1016002, 1018526, 1019055, 1019132, 1018693, 1016800, 1014247, 1012963, 1013190, 1013700, 1014437, 1016478, 1019784, 1023704, 1029385, 1038800, 1051416, 1064701, 1077984, 1092898, 1109890, 1127272, 1144075]
58332A144075J6756J6183J3601J0387Q540P199M601J609J30j09k67J87J947L722
58318A228561M386N127O894Q129P766P802R927J2301J2815J2760J3957J5095J4492
58305A360012J3709J4773J6342J6305J5629J5943J6049J4534J3216J4038J5267
58294A525817J4709J3935J5320J7595J8480J8931K0575K1800K0786J9639K1002
58283A728589K3338K4018K4249K6299K8692K8951K8291K8852K9154K7131K4719
58272B022283K4564K5332K5147K6276L1098L6861L9989M2061M5953M9800N0742
58261B420106N0868N3120N5036N3269N0525N1073N3078N2574N1323N3170N6301
58250C000443N6946N7327O1869O8836P3742P7638Q3951R0793R4837R9006J07482
$$ y = [1144075, 1160831, 1177014, 1190615, 1201002, 1209542, 1216741, 1221342, 1222951, 1223081, 1222972, 1222705, 1222892, 1224839, 1228561, 1232947, 1238074, 1244968, 1253097, 1260863, 1268665, 1278592, 1290893, 1303708, 1316468, 1330425, 1345520, 1360012, 1373721, 1388494, 1404836, 1421141, 1436770, 1452713, 1468762, 1483296, 1496512, 1510550, 1525817, 1540526, 1554461, 1569781, 1587376, 1605856, 1624787, 1645362, 1667162, 1687948, 1707587, 1728589, 1751927, 1775945, 1800194, 1826493, 1855185, 1884136, 1912427, 1941279, 1970433, 1997564, 2022283, 2046847, 2072179, 2097326, 2123602, 2154700, 2191561, 2231550, 2273611, 2319564, 2369364, 2420106, 2470974, 2524094, 2579130, 2632399, 2682924, 2733997, 2787075, 2839649, 2890972, 2944142, 3000443, 3057389, 3114716, 3176585, 3245421, 3319163, 3396801, 3480752, 3571545, 3666382, 3765388, 3872870]
58239C872870J17088J22647J26737J34628J44110J50562J57293J69832J84479
58230E180246J94267K01898K14692K31139K45164K59233K79770L03970L25214
58221G435593L47051L77145M12161M44320M78096N23566N78223O33252O92811
58212A1922218P67925Q56420R49583J053686J182999J337269J510229J714900
58204B1295229J975167K299807K694511L192430L840025M659708N660082O868773
58196E2485732Q311641R981215J1894223J4174088J7000855K0474142K4577613
58189A58899509K9179845L3798366L7247475L7797212L4107185K6194324J5456007
58182C72679923L788944p213954j6385061k2839091k6150024k6675700k5453542
$$ y = [3872870, 3989958, 4112605, 4239342, 4373970, 4518080, 4668642, 4825935, 4995767, 5180246, 5374513, 5576411, 5791103, 6022242, 6267406, 6526639, 6806409, 7110379, 7435593, 7782644, 8159789, 8571950, 9016270, 9494366, 10017932, 10596155, 11229407, 11922218, 12690143, 13546563, 14496146, 15549832, 16732831, 18070100, 19580329, 21295229, 23270396, 25570203, 28264714, 31457144, 35297169, 39956877, 45616959, 52485732, 60797373, 70778588, 82672811, 96846899, 113847754, 134321896, 158899509, 188079354, 221877720, 259125195, 296922407, 331029592, 357223916, 372679923, 376468867, 369254913, 352869852, 330030761, 303880737, 277205037, 251751495]
58175B51751495k3613527k1853286k0373856j9122156j7992179j6877166j5676054
58168A16243271j4326695j2841198j1303286r822921q478388p291504o251641
58161D5927638n349268m578129l921494l358079k877928k477438k143730j859249
58153A9362323j617578j419662j258105j119865j001236r05465q27796p56950
58145A0455666o89844o31388n80897n31508m82314m38673m00689l62882l25119
58136F012352k92948k67105k43121k21178k06079j97201j88333j77898j70136
58127D048353j65598j59577j50585j42050j34870j26263j16545j09297j04364
58118B839204r7942q9977q4202q0757p5984o9771o5885o4657o2333n8173n5365
$$ y = [251751495, 228137968, 206284682, 185910826, 166788670, 148796491, 131919325, 116243271, 101916576, 89075378, 77772092, 67949171, 59470783, 52179279, 45927638, 40578370, 36000241, 32078747, 28720668, 25842740, 23365302, 21221572, 19362323, 17744745, 16325083, 15066978, 13947113, 12945877, 12040412, 11212616, 10455666, 9765822, 9134434, 8553537, 8022029, 7539715, 7101042, 6700353, 6337471, 6012352, 5719404, 5452299, 5209178, 4988000, 4781921, 4584720, 4396387, 4218489, 4048353, 3882755, 3723178, 3572593, 3430543, 3295673, 3169410, 3052865, 2943568, 2839204, 2741262, 2651285, 2567083, 2486326, 2410342, 2340571, 2274686, 2210029, 2147696, 2089523, 2034158]
58107B034158n4404n2277m8729m6822m6708m5225m2290m1422m3175m4168m3340
58096A525598m3081m3502m1580l6938l2758k9910k5870k0426j6883j6387j6219
58085A202044j4954j4390j5288j5951j6027j7119j8863j9004j7910j8374k0388
58074A013776k0991j9732j9286j9999j9049j5979j3912j4021j3753j1948j0867
58063H34239j1537j1675r997q371q037p703o886p189q821r636r002q852r727r663
58049G07143q182p406p897p435n332l985m578n186m791n158o898p552n774l805
58035F23164l635m057l675l631n018o500o710o494o795o862o314o412p520p819
58021E41722o302m597m165m151l582l292l892m188l267k051j335m01J097K073
$$ y = [2034158, 1979754, 1927477, 1878748, 1831926, 1785218, 1739993, 1697703, 1656281, 1613106, 1568938, 1525598, 1482517, 1439015, 1397435, 1360497, 1327739, 1297829, 1271959, 1251533, 1234650, 1218263, 1202044, 1187090, 1172700, 1157412, 1141461, 1125434, 1108315, 1089452, 1070448, 1052538, 1034164, 1013776, 992785, 973053, 953767, 933768, 914719, 898740, 884828, 870807, 857054, 845106, 834239, 822702, 811027, 801030, 792659, 784622, 776919, 770033, 762844, 754023, 744387, 735385, 726533, 716806, 707143, 698961, 691555, 683658, 676223, 670891, 666906, 662328, 657142, 652351, 647193, 640295, 632743, 626969, 623164, 619529, 615472, 611797, 608166, 603148, 596648, 589938, 583444, 576649, 569787, 563473, 557061, 549541, 541722, 535420, 530823, 526658, 522507, 518925, 515633, 511741, 507553, 504286, 502235, 500900, 500499, 501596, 503669]
58007E03669K150K524L556L809K798K182K869L408K697J912K190K690K502K330
57993E41286K745K888K309K020K362K064P79K54J444K748K685K095K044J742L55
57978E69820j130j679j993k843l462l266l290m269n070m745m382n154o209o247
57964E16081n663n446n379m927m507m434l979k877k260k787l380l182l072l834
57950D60354m525m198l547l305k684j026N75J094J433K723M293N129N951P866
57936D70133J0240J1772J2590J3533J4307J4173J3451J2753J1679R895Q406Q066
57924F10998P818O083L046p1l050o244q991j0293j0560j0994j1700j1910j1547
57911E42585j1194j0893j0337r767r476q953p703o480o414p340q056p982p544
$$ y = [503669, 505819, 508343, 511899, 515708, 518506, 520688, 523557, 526965, 529662, 531574, 533764, 536454, 538956, 541286, 544031, 546919, 549228, 551248, 553610, 555674, 556453, 556707, 558151, 560899, 563584, 565679, 567723, 569465, 569820, 568690, 567011, 565018, 562175, 558713, 555447, 552157, 547888, 542818, 538073, 533691, 528537, 522328, 516081, 510418, 504972, 499593, 494666, 490159, 485725, 481746, 478869, 476609, 473822, 470442, 467260, 464188, 460354, 455829, 451631, 448084, 444779, 442095, 441069, 441644, 442738, 444171, 446894, 451187, 456316, 462267, 470133, 480373, 492145, 504735, 518268, 532575, 546748, 560199, 572952, 584631, 594526, 602932, 610998, 618816, 624899, 627945, 627874, 624824, 618580, 609589, 599296, 588736, 577742, 566042, 554132, 542585, 531391, 520498, 510161, 500394, 490918, 481965, 474262, 467782, 461368, 454028, 445972, 437990, 430446]
57898D30446p304p447p793p718o595m780l355k501j289M06J175K23j076j034P9
57883C81437Q87J015R78Q59M32J9j5j26r17k105l017l524l681l220k213j503j608
57866C63698j846j340j66J115K254L090L415L597M390N610O195N939N861O372
57852D08184O714O789P635R118R225O983M282L136K888J863J76j073k058l579
57838D60283n163n847n977o407o753o280n614n784o284n916m826l964l225j999
57824C86244q45o92r17j70J333K192K159K229K681K896K993L802N131N767N270
57809D20073M339L314J755l77k435m051n328o090o073n700n659n848n739n476
57795C76705n566n852n817n583n486n175m303l551l747m429m517l951l314k429
$$ y = [430446, 423142, 415695, 407902, 400184, 393589, 388809, 385454, 382953, 381664, 382070, 383245, 383468, 382392, 381358, 381437, 382324, 383339, 384317, 385176, 385608, 385627, 385612, 385486, 384569, 382464, 379447, 375923, 372242, 369022, 366809, 365306, 363698, 361852, 360512, 360346, 361461, 363715, 366805, 370220, 373817, 378207, 383817, 390012, 395951, 401812, 408184, 414898, 421687, 429322, 438440, 447665, 454648, 458930, 462066, 464954, 466817, 466993, 465920, 463862, 460283, 455120, 449273, 443296, 436889, 430136, 423856, 418242, 412458, 406174, 400258, 395432, 391468, 388243, 386244, 385399, 384707, 383790, 383620, 384953, 387145, 389304, 391533, 394214, 397110, 400103, 403905, 409036, 414803, 420073, 424412, 427726, 429481, 429104, 426669, 422618, 417290, 411200, 405127, 399427, 393768, 387920, 382181, 376705, 371139, 365287, 359470, 353887, 348401, 343226, 338923, 335372, 331625, 327196, 322679, 318728, 315414, 312985]
57781C12985q33Q50J533J397J532K070K188J750J480J683K057K588L263L241J754
57766C39538l94j727k229l086m470n300n194n081n638o514p200p472o967n607
57752B72659m388m324m767m202k681j799k150k462j695m62K31L60L95L49k5p41
57736B44298j581k103j857j045o34j000j165l63M12q5j095q66N04J285R52P77
57720B36434J382J851J621J327J173L47j199k024j225K03Q76P35M93M77O98J160
57704B44329J509J339J103J653K639K775J958J651K550L464L267K494J981J250
57690B73962m23k435l562l549k977k127r88J59J056J955L151M519O121Q749J3052
57675B96663J8525K4009K9020L4149M0439M8718N9034P0109P9218Q2850P7918
$$ y = [312985, 312152, 313002, 314535, 315932, 317464, 319534, 321722, 323472, 324952, 326635, 328692, 331280, 334543, 337784, 339538, 339144, 337417, 335188, 332102, 327632, 322332, 317138, 312057, 306419, 299905, 292705, 285233, 278266, 272659, 268271, 263947, 259180, 254978, 252297, 250498, 248348, 245886, 244191, 243729, 243960, 244320, 244715, 245064, 245039, 244298, 242717, 240614, 238757, 237712, 237078, 236078, 234913, 234550, 234962, 234877, 233782, 232916, 233420, 234705, 235657, 236434, 237816, 239667, 241288, 242615, 243788, 244135, 242936, 240912, 239687, 239890, 240766, 241501, 241994, 242471, 243169, 244329, 245838, 247177, 248280, 249933, 252572, 255347, 257305, 258956, 261506, 264970, 268237, 270731, 272712, 273962, 273539, 271104, 267542, 263993, 261016, 258889, 257901, 258060, 259116, 261071, 264222, 268741, 274862, 283611, 296663, 315188, 339197, 368217, 402366, 442805, 491523, 550557, 620666, 699884, 782734, 860652]
57664H60652O3175M0350J3678j2487l5578n4163o6483p1227o9565o4709n9090
57653E44553n3111m6638m0264l4499k9177k4284k0323j7291j4409j1400q996p616
57641B36545o686n793n351n367m847l311j812j448j750j648j239j446k373l112
57627A90362k966k097j131o37p93j148j070o58p17j543k408k595k227j721j070
57612A67581k46L76M96L13Q8k53p50j205j554j835j691p24N84J201J008Q45R65
57595A65199O53k76r46j000j270k125k534j846j150j579k402k285j542j524k309
57580A43064k641j979j129q02p98q41j132j765k286k192j503o68j94k62n30n13
57564A23829k94l75p11n66K69R35P44J96O0R0m12j251j564j117m84q4J74M09O34
$$ y = [860652, 923827, 964177, 977855, 965368, 929790, 875627, 809144, 737917, 668352, 603643, 544553, 491442, 444804, 404540, 370041, 340864, 316580, 296257, 278966, 264557, 253157, 244161, 236545, 229859, 224066, 218715, 213348, 208501, 205190, 203378, 201930, 200180, 198532, 197293, 195847, 193474, 190362, 187396, 185299, 184168, 183531, 182738, 181590, 180520, 179862, 179145, 177602, 175194, 172599, 170372, 168651, 167581, 167335, 167711, 168207, 168520, 168608, 168355, 167605, 166400, 164846, 163011, 161320, 160596, 161180, 162381, 163389, 164234, 165199, 165852, 165576, 164630, 163630, 162360, 160235, 157701, 155855, 154705, 153126, 150724, 148439, 146897, 145373, 143064, 140423, 138444, 137315, 136513, 135715, 134874, 133742, 131977, 129691, 127499, 125996, 125328, 125134, 124872, 124342, 123829, 123535, 123160, 122449, 121883, 122152, 123087, 123831, 124027, 124087, 124177, 123765, 122514, 120950, 119833, 119349, 119265, 119439, 119848, 120482]
57545A20482J000J588K053K064J940K239K778K683J536k5r97j044o93o25q59q54
57529A33266m11j59o52j397j469q80m31l45o4M23L70k58l53N68J323O98o69j185
57511A28375l67Q64J532J324M17o51j186j037q07r25r49l27O91J444J670J365
57495A31433M08j035k213k533k160j530p80j46j20o78j007o49j82k58o53r71j390
57478A15536j957k005j186l09k48o94q70p25n36j12O16R46M54o5K19Q07Q55O82
57460A11408R94J344Q97J03R8P67J032O68L81K82j17n37k04N58N75k61p57l50
57442A16881K45M78P00J041R30J64o16q94p47j84Q24J506Q31p39j415m65P31P04
57424A19975j76o11k15M46Q98R69N00l73j019j002p15q22j346j700j433o84j0
$$ y = [120482, 121482, 123070, 125123, 127187, 129127, 131366, 134144, 136827, 138363, 138338, 137341, 136297, 135604, 134979, 134120, 133266, 132855, 132696, 132044, 130647, 129178, 128298, 127867, 127522, 127458, 127881, 128251, 127993, 127640, 128208, 129531, 130229, 129560, 128375, 128008, 128872, 130404, 131728, 132145, 131494, 130308, 129271, 128464, 127539, 126590, 126263, 126954, 128398, 130068, 131433, 131841, 130806, 128593, 126060, 123900, 122370, 121590, 121444, 121324, 120646, 119639, 118990, 118808, 118550, 117897, 116926, 115536, 113579, 111574, 110388, 110079, 109831, 109137, 108267, 107542, 107006, 106894, 107510, 108456, 108910, 108845, 109064, 109871, 110726, 111408, 112402, 113746, 114643, 114746, 114844, 115611, 116643, 117311, 117692, 117974, 117857, 117320, 117116, 117674, 118249, 117988, 117231, 116881, 117126, 117604, 118304, 119345, 120275, 120439, 119823, 118929, 118182, 117998, 118822, 120328, 121159, 120420, 119005, 118540, 119271, 119975, 119799, 119188, 118973, 119419, 120317, 121286, 121786, 121413, 120394, 119392, 118677, 117855, 116509, 114809, 113376, 112692, 112682]
57407A12682J52l9M6O04R68M82m71j008r99r80j082r43n86m06l25J00O85P15J78
57388A09773j22J90O74J047J464J686J098k2m87O7N05l8q37p45J15P95R53R68
57370A17084J036J033R87J031J046Q57O00N05N50O06O62O94N41J23n02j271j909
57353A23673j745m53R89J013n85k217k417j464n88l48m36n18n18l57pL56O06Q76
57335A15860J269J651J938K248K605K822K781K514J990J280R27J436K357K601
57321A44279J875J013O76N94L97L26N52O66M55M96J247K131K277J710J157J020
57305A60871J161J374J469J163M14l68q02r26p90j53R51J820J823J211O80M66
57289A70364L86L37K41j75q98j219m76R50J956J944J247M69r3l22j59L04Q66J372
$$ y = [112682, 112834, 112795, 112841, 113445, 114413, 114895, 114424, 113416, 112417, 111437, 110355, 109412, 108826, 108420, 108095, 108195, 108880, 109595, 109773, 109651, 109841, 110515, 111562, 113026, 114712, 115810, 115788, 115301, 115368, 115873, 115835, 114998, 114253, 114368, 115163, 116116, 117084, 118120, 119153, 120140, 121171, 122217, 123074, 123674, 124179, 124729, 125335, 125997, 126691, 127232, 127355, 126853, 125582, 123673, 121928, 121475, 122464, 123477, 122892, 120675, 118258, 116794, 116206, 115858, 115422, 114904, 114386, 114029, 114022, 114378, 114984, 115860, 117129, 118780, 120718, 122966, 125571, 128393, 131174, 133688, 135678, 136958, 137885, 139321, 141678, 144279, 146154, 147167, 147843, 148437, 148834, 149160, 149712, 150378, 150833, 151329, 152576, 154707, 156984, 158694, 159851, 160871, 162032, 163406, 164875, 166038, 166452, 166084, 165282, 164356, 163566, 163413, 164364, 166184, 168007, 169218, 169898, 170364, 170750, 171087, 171328, 171153, 170255, 169036, 168560, 169510, 171466, 173410, 174657, 175126, 175033, 174711, 174552, 174856, 175722, 177094]
57271A77094J733J865J832J854K017K102J908J569J315J165J046J048J313J815
57257A99676K346K659K563K162J980K452L257L577L149K632K667L047L146K802
57243B38115K440K472K850L145L014K651K649L164L534L125K382K249K805L288
57229B77883L423L810M707N489N665N576N612N550N242N169N651O144O036N560
57215C51517N323N419N679O254P272Q307Q848Q964Q999R034R137R636J0536J1114
57201D66039J0795J0095R888J0202J0414J0361J0464J0857J1170J1185J1114J1193
57189E93777J1475J2029J2894J3884J4702J5212J5445J5502J5581J5831J6095
57178G52427J6203J6554J7773J9623K0981K1278K1200K1548K2270K3171K4690
$$ y = [177094, 178827, 180692, 182524, 184378, 186395, 188497, 190405, 191974, 193289, 194454, 195500, 196548, 197861, 199676, 202022, 204681, 207244, 209406, 211386, 213838, 217095, 220672, 223821, 226453, 229120, 232167, 235313, 238115, 240555, 243027, 245877, 249022, 252036, 254687, 257336, 260500, 264034, 267159, 269541, 271790, 274595, 277883, 281306, 285116, 289823, 295312, 300977, 306553, 312165, 317715, 322957, 328126, 333777, 339921, 345957, 351517, 356840, 362259, 367938, 374192, 381464, 389771, 398619, 407583, 416582, 425616, 434753, 444389, 454925, 466039, 476834, 486929, 496817, 507019, 517433, 527794, 538258, 549115, 560285, 571470, 582584, 593777, 605252, 617281, 630175, 644059, 658761, 673973, 689418, 704920, 720501, 736332, 752427, 768630, 785184, 802957, 822580, 843561, 864839, 886039, 907587, 929857, 953028, 977718]
57167I77718K7033K9358L0873L2153L4257L6904L8737L9135L8735L8276L7989
57156A361168L8013L8378L8489L7597L5938L4553L3829L3046L1561K9675K8043
57145A740290K6918K6210K5817K5614K5526K5740K6439K7366K8078K8628K9474
57134B036100L0795L2505L4837L8167M2139M5606M7675M8286M7842M7117M7630
57123B498699N0969N6831O2215O3496N9482N2341M5836M2868M4241M9014N5775
57112C081767O3834P3440Q5074R8833J14660J32858J54217J79708K10391K47595
57102D442377K93169L49707M20749N10779O25029P69535R51563J179124J458436
57093A1000468J790438K169655K586838L032147L494494L956911M392744M766936
$$ y = [977718, 1004751, 1034109, 1064982, 1097135, 1131392, 1168296, 1207033, 1246168, 1284903, 1323179, 1361168, 1399181, 1437559, 1476048, 1513645, 1549583, 1584136, 1617965, 1651011, 1682572, 1712247, 1740290, 1767208, 1793418, 1819235, 1844849, 1870375, 1896115, 1922554, 1949920, 1977998, 2006626, 2036100, 2066895, 2099400, 2134237, 2172404, 2214543, 2260149, 2307824, 2356110, 2403952, 2451069, 2498699, 2549668, 2606499, 2668714, 2732210, 2791692, 2844033, 2889869, 2932737, 2976978, 3025992, 3081767, 3145601, 3219041, 3304115, 3402948, 3517608, 3650466, 3804683, 3984391, 4194782, 4442377, 4735546, 5085253, 5506002, 6016781, 6641810, 7411345, 8362908, 9542032, 11000468, 12790906, 14960561, 17547399, 20579546, 24074040, 28030951, 32423695, 37190631]
57085C7190631N042560N189868N194288N058465M794805M412261L908092L272124
57077G4063094K499495J602342O15480m04394j387844k270643l012075l600707
57069F8104748m045097m359951m557762m646408m629829m512187m304441m026927
57061C3022146l704272l358335l006302k662537k338611k041409j773480j535498
57053A2601702j327190j146552r90540q57001p44707o51533n74200n10012m57447
57044E342520m14731l79167l48232l20426k94678k69856k45312k21121j97547
57035B651450j74744j53023j32778j14111r6903q1137o6632n2698l8641k4304
57025A716479r482O967K6929N1874Q1286J10739J31198J32598J10511O9358J8394
$$ y = [37190631, 42233191, 47423059, 52617347, 57675812, 62470617, 66882878, 70790970, 74063094, 76562589, 78164931, 78780411, 78376017, 76988173, 74717530, 71705455, 68104748, 64059651, 59699700, 55141938, 50495530, 45865701, 41353514, 37049073, 33022146, 29317874, 25959539, 22953237, 20290700, 17952089, 15910680, 14137200, 12601702, 11274512, 10127960, 9137420, 8280419, 7535712, 6884179, 6309979, 5799967, 5342520, 4927789, 4548622, 4200390, 3879964, 3585286, 3315430, 3070118, 2848997, 2651450, 2476706, 2323683, 2190905, 2076794, 1979891, 1898754, 1832122, 1779424, 1740783, 1716479, 1706997, 1713964, 1740893, 1792767, 1874053, 1984792, 2115990, 2248588, 2359099, 2428457, 2446851]
57014B446851l4133q2042j19360j41394j48134j44123j34391j21911j08566r6034
57004A316763q4855p4405o4513n5862m8493m1561l4957k9715k6257k3706k1312
56993H11127j9155j7071j4429j1540r706r158q288n755k118J242L577M438L215
56980G26379j62m922j0327j5867k0314k2104k1244j9557j8331j7078j5241j3486
56968E47746j2299j0748p913m446j461J198M421Q389J2703J7202K1495K4338K4397
56955F25022K1280J5288O921k657j1593j8542k3342k6014k6204k4307k1941k0235
56943D93676j8498j5553j1503p272l228O55M115P240J1111J6643K3151K8909L2539
56930E61985L3150K9961K2935J3329K761p754j7311k4620k9002l1124l1779l0784
$$ y = [2446851, 2412718, 2330676, 2211316, 2069922, 1921788, 1777665, 1643274, 1521363, 1412797, 1316763, 1231908, 1157503, 1092990, 1037128, 988635, 947074, 912117, 882402, 856145, 832439, 811127, 791972, 774901, 760472, 748932, 739226, 730068, 721780, 716025, 713907, 715149, 718726, 723164, 726379, 726217, 721295, 710968, 695101, 674787, 652683, 631439, 611882, 593551, 576473, 561232, 547746, 535447, 524699, 516786, 512340, 510879, 512077, 516498, 524887, 537590, 554792, 576287, 600625, 625022, 646302, 661590, 668511, 665854, 654261, 635719, 612377, 586363, 560159, 535852, 513911, 493676, 475178, 459625, 448122, 440850, 437622, 438277, 442392, 449632, 460743, 477386, 500537, 529446, 561985, 595135, 625096, 648031, 661360, 664121, 656367, 639056, 614436, 585434, 554310, 522531, 491747]
56918D91747k8079k4920k2653k1023j8989j6609j4729j3360j1831j0138q780p492
56906B93144n579l344j894j553j600j541j462j247n06N80J430K100L227M907O539
56891B93201P911R516J1684J4162J6616J8761J9886J8973J5558J0157L824k245
56879D38004p005j0065j1820j2673j2435j0951q847o862m812k023J480N072Q629
56866C65692J2638J7327K2534K8387L5221M2533M8570N1168M8837M1347K9851
56855G44105J6422K971r395j9890k7511l1549l2285l0614k7299k2961j8238j3268
56843E30488p466m73P108J4549K2184L0981M1356N2954O4942P5509Q1509P9827
56831I93468O9373N1407K8433L453k0224l9732n3533o1316o3514o1412n7013n1740
$$ y = [491747, 463668, 438748, 416095, 395072, 376083, 359474, 344745, 331385, 319554, 309416, 300636, 293144, 287565, 284221, 282327, 280774, 279174, 277633, 276171, 274924, 274418, 274998, 276428, 278528, 281755, 286662, 293201, 301112, 310628, 322312, 336474, 353090, 371851, 391737, 410710, 426268, 436425, 440249, 438004, 430999, 420934, 409114, 396441, 384006, 373055, 364208, 357346, 352534, 350511, 351991, 357063, 365692, 378330, 395657, 418191, 446578, 481799, 524332, 572902, 624070, 672907, 714254, 744105, 760527, 763498, 754103, 734213, 706702, 675153, 642868, 612254, 584955, 561994, 543756, 530488, 523022, 522549, 529657, 544206, 566390, 597371, 638727, 691681, 756623, 832132, 913641, 993468, 1062841, 1114248, 1142681, 1146134, 1125910, 1086178, 1032645, 971329, 907815, 846403, 789390, 737650]
56819G37650m5493l7741k9066k0734j3121n629K097R935J8179K7566L8147M8568
56807G30358N6357N8646N3303M0405K2520K953j5986l2655m5115n1904n3507n1948
56795G13427m8946m5183m0883l6064l0439k4076j7967j3009q639l457L030J0130
56783D57924J7085K3373K8082K9970K8161K2323J2682P48j0666j9318k5164k9261
56771E35939l1730l2038l0643k8786k6865k4416k1572j9097j7129j5153j3184
56760B75326j1707j0560r137p613o733o451o027n307m656l862k555j460j711k910
56746A94637l478k914k218k043k036k061k429k754k197j080o14q11m52O67J283
56731A71500Q81M50N36L80k27k26O74J087K22o27j47R25J226R41J106J708J970
$$ y = [737650, 692157, 654416, 625350, 604616, 591495, 585866, 587963, 597898, 616077, 643643, 681790, 730358, 786715, 845361, 898664, 939069, 961589, 964542, 948556, 915901, 870786, 818882, 765375, 713427, 664481, 619298, 578415, 542351, 511912, 487836, 469869, 456860, 448221, 444764, 447794, 457924, 475009, 498382, 526464, 556434, 584595, 606918, 619600, 620348, 609682, 590364, 565200, 535939, 504209, 472171, 441528, 412742, 385877, 361461, 339889, 320792, 303663, 288510, 275326, 263619, 253059, 243922, 236309, 229576, 223125, 217098, 211791, 207135, 203273, 200718, 199258, 197547, 194637, 191159, 188245, 186027, 183984, 181948, 179887, 177458, 174704, 172507, 171427, 170813, 170002, 169550, 170217, 171500, 172381, 172831, 173367, 173747, 173520, 173294, 173968, 175055, 175277, 174650, 174503, 175428, 176654, 177595, 178701, 180409, 182379]
56714A82379J700J220N89j7QP23J083L94n15n70j00p8m70n52k86k09l09j70P6
56695A84896n5m64n90l21o3l8j29k83n15o72o27m84l47j47Nk08p51j096r67o43
56675A76501k98L38J237J713J248K78l59l26J68P68J112J004O85N61O05N43N09
56658A86287Q45J277J193P63P85J319J572J284J153J526J858J883K127K764L048
56643B09684K532J846J589J486J239J163J317R82j12j040j058p86j126j752j736
56628B14228j053m82m05n28n02j78M48J006R32K55k51m9N08Q51Q98P49L28l04
56610B16451p84q78o30n5O83R06J99o02l24P13J151Q36R89J866K138J217L66N47
56592B24789Q07K0j219j797j859k084k240j812j181q82n12L86J180J106O02N22
$$ y = [182379, 184079, 185299, 185888, 185871, 185879, 186602, 187685, 188079, 187564, 186994, 186894, 186816, 186346, 185794, 185508, 185299, 184990, 184820, 184896, 184841, 184377, 183787, 183466, 183403, 183365, 183236, 182953, 182438, 181766, 181139, 180655, 180308, 180161, 180166, 179958, 179207, 178111, 177144, 176501, 176203, 176541, 177778, 179491, 180739, 181017, 180658, 180332, 180500, 181268, 182380, 183384, 184069, 184630, 185235, 185778, 186287, 187132, 188409, 189602, 190365, 191150, 192469, 194041, 195325, 196478, 198004, 199862, 201745, 203872, 206636, 209684, 212216, 214062, 215651, 217137, 218376, 219539, 220856, 221838, 221726, 220686, 219628, 218842, 217716, 215964, 214228, 213175, 212693, 212288, 211760, 211258, 211080, 211528, 212534, 213466, 213721, 213470, 213421, 213929, 214780, 215678, 216427, 216755, 216451, 215667, 214789, 214159, 214104, 214787, 215693, 215892, 215290, 214966, 215679, 216830, 217666, 218655, 220521, 222659, 223876, 224242, 224789, 225596, 225616, 224397, 222600, 220741, 218657, 216417, 214605, 213424, 212542, 212030, 212416, 213596, 214702, 215304, 215826]
56576B15826O87M13j00l3P60J722K415K621K142J231P15J002J564J909K371L311
56560B38556M427N313N954O133N428M284L891M442M778M316L896L982L689K571
56546C01660J717J803J743O46m43l75K5n01j424j551j279j652k264k092j646k208
56530B92159l536m280m202m174m357m139l572l258l106k666k342k738l301l022
56516B43466k116j526j345j152j355k499l766l842k894k127j738r77J11P25Q15
56501B19780J007J139N30m68p31j52K36q9n98p76o01j43L79M34rq3O86J443J451
56482B23435J365J812J917R08jO72K050K167J091M61N53K41m50k75P69J245P18
56465B38678L05N08N41L3l92n36q46j107n39N94J175J024R29R79N82L0J80O94
$$ y = [215826, 216513, 216926, 216826, 216793, 217553, 219275, 221690, 224311, 226453, 227684, 228399, 229401, 230965, 232874, 235245, 238556, 242983, 248296, 254250, 260383, 265811, 270095, 273986, 278428, 283206, 287522, 291418, 295400, 299089, 301660, 303377, 305180, 306923, 307569, 307126, 306751, 306776, 306275, 304851, 303300, 302021, 300369, 298105, 296013, 294367, 292159, 288623, 284343, 280141, 275967, 271610, 267471, 263899, 260641, 257535, 254869, 252527, 249789, 246488, 243466, 241350, 239824, 238479, 237327, 235972, 233473, 229707, 225865, 222971, 220844, 219106, 218129, 218240, 218965, 219780, 220787, 221926, 222456, 221988, 221257, 221105, 221341, 221252, 220654, 219878, 219277, 219134, 219513, 219947, 219938, 219855, 220541, 221984, 223435, 224800, 226612, 228529, 229437, 229436, 230108, 232158, 234325, 235416, 235877, 236430, 236671, 236221, 235946, 236715, 237960, 238678, 238983, 239491, 240032, 240065, 239673, 239137, 238291, 237184, 236645, 237239, 238414, 239438, 240367, 241346, 241928, 241958, 242138, 242832]
56447B42832N27O2O30J891K016P33p3O29J574J507R21O05K60m67j043j030p63
56430B50811m50K35J130J419R07K89j56q57j654j574l17J190K056K181J692P76
56414B57678Q3J22L59R6j62M31J269J137M02M66J281J428O01p1k07n08q69l00
56396B63236R70J447P97K94N47Q17Q81J427K227K069R88M80R82J294R82J111J954
56379B82503K210J353O07P60J047R96J333K161K310J463R29J316J451N52l67l78
56363C00246o2k3J49N59L89l89n31K93P28R6l61K87J095J041O36N89N52L21O05
56344C06220J533J977J401P26N20Q0p86j028l19J98J22O72K189L014K221J321
56328C20061J721K445K142J423J425J694J347Q96J105J370Q92K51K86N36K66j03
$$ y = [242832, 243359, 243421, 244051, 245942, 247958, 248691, 248618, 249247, 250821, 252328, 253249, 253854, 254114, 253647, 252604, 251574, 250811, 250361, 250596, 251726, 253145, 254052, 254341, 254185, 253328, 251674, 250100, 249783, 250973, 253029, 255210, 256902, 257678, 257761, 257883, 258242, 258338, 258176, 258607, 259876, 261013, 261415, 261881, 263162, 264590, 265191, 265120, 264913, 264405, 263536, 263236, 264206, 265653, 266450, 266744, 267291, 268108, 268989, 270416, 272643, 274712, 275700, 276180, 277162, 278456, 279438, 280549, 282503, 284713, 286066, 286673, 287433, 288480, 289476, 290809, 292970, 295280, 296743, 297672, 298988, 300439, 300991, 300624, 300246, 300184, 300161, 300310, 300869, 301258, 300869, 300338, 300631, 301359, 301455, 301094, 301381, 302476, 303517, 304153, 304742, 305294, 305615, 306220, 307753, 309730, 311131, 311857, 312377, 312457, 311671, 310643, 310324, 310522, 310644, 311316, 313505, 316519, 318740, 320061, 321782, 324227, 326369, 327792, 329217, 330911, 332258, 333154, 334259, 335629, 336521, 336772, 337058, 337594, 337860, 337757]
56312C37757J28N93O66M65J73n27j390j371j99J114K007K976L911L753K626K155
56296C54837K691K512R16k46L96J487J406P96P91Q65L25Q8R89K028K167K210L056
56279C77314L841L648L349L830M086L089J886J846K356K304K320L394M759N244
56265D23266N459O523P868Q268P970P948Q220Q536R516J1343J2771J3083J3589
56252E44360J5441J7500J8233J8164J8552J9140J9311J9952K1926K3994K4384
56241G60957K3373K2359K1438J9792J7402J4641J1226P088L148k15l950q315j1802
56228H77142j3598j5125j7463j9364j9696j9733k0738k1356j9870j7301j5733
56217F77165j5210j4651j4174j4127j3429j1366r406q904q564o662m102k756k308
$$ y = [337757, 337885, 338478, 339144, 339609, 339782, 339255, 337865, 336494, 336295, 337409, 339416, 342392, 346303, 350056, 352682, 354837, 357528, 360040, 360956, 360710, 361106, 362593, 363999, 364795, 365586, 366451, 366776, 366864, 367853, 369881, 372048, 374258, 377314, 381155, 384803, 388152, 391982, 396068, 399157, 401043, 402889, 405245, 407549, 409869, 413263, 418022, 423266, 428725, 435248, 443116, 451384, 459354, 467302, 475522, 484058, 493574, 504917, 517688, 530771, 544360, 559801, 577301, 595534, 613698, 632250, 651390, 670701, 690653, 712579, 736573, 760957, 784330, 806689, 828127, 847919, 865321, 879962, 891188, 898276, 901424, 901209, 897259, 888944, 877142, 863544, 848419, 830956, 811592, 791896, 772163, 751425, 730069, 710199, 692898, 677165, 661955, 647304, 633130, 619003, 605574, 594208, 584802, 575898, 567334, 560672, 556570, 553814, 551506]
56204E51506j301J25R57J401J936J845Q79N96J811K709J852Q81J607K748K445
56189E71997J746K354L066K024N16Q71K189J942L64l25J15K83L31J336K584K656
56173E94049K238K739L453L142K907M190N621N306M609N914Q183Q650P582P372
56159F65955Q142Q223P967R034J0793J1381J1407J2821J4967J5720J5582J6784
56147H08776J9150K0856K2298K5274K9207L2260L5285M0623M7865N4985O2763
56136A199342P3801Q7780J01846J14782J26496J34323J34703J28321J19187J09134
56126B329715R7573Q5915P7321P1968O6867O0259N2114M1063K5609Q238o181j6153
56114B894308k3793l0205l5227m1093n1275o5566q0602r4781j08212j18630j22694
$$ y = [551506, 550205, 550330, 551287, 552688, 554624, 556469, 557348, 557944, 559755, 562464, 564316, 565197, 566804, 569552, 571997, 573743, 576097, 579163, 581187, 581703, 582574, 584763, 586705, 587069, 586744, 586859, 587142, 587473, 588809, 591393, 594049, 596287, 599026, 602479, 605621, 608528, 612718, 618339, 623645, 628254, 634168, 642351, 651001, 658583, 665955, 674097, 682320, 690287, 699321, 710114, 721495, 732902, 745723, 760690, 776410, 791992, 808776, 827926, 848782, 871080, 896354, 925561, 957821, 993106, 1033729, 1081594, 1136579, 1199342, 1273143, 1360923, 1462769, 1577551, 1704047, 1838370, 1973073, 2101394, 2220581, 2329715, 2427288, 2513203, 2590524, 2662492, 2729359, 2789618, 2841732, 2882795, 2908404, 2916642, 2910461, 2894308, 2870515, 2840310, 2805083, 2763990, 2712715, 2647149, 2566547, 2471766, 2363554, 2244924, 2122230]
56103B122230j20990j16910j10942j01101q8566p7334o8357n9265m9746m1908
56093A287111l5518k8382k1434j7771j6609j3946r331o199n295l724r64K71j74
56080A128035Q26L795N780O186P692J0608J2028J1460J1663J3178J3655J3163
56068A238069J4308J6574J6655J4915J5175J7471J7632J4895J3224J3963J3822
56057A406703J1579J0169J0710J0825J0271J1793J5183J6882J6664J8129K1573
56046A560481K3176K2296K2603K4957K6285K6480K8877L2867L3753L1053K9196
56035A862024K8943K6308K1191J8520J9450K0113K0364K4515L1834L5930L5702
56024B144894L7175M2293M5902M6260M8266N3224N5820N4631N5296N9827O3038
$$ y = [2122230, 2001240, 1884330, 1773388, 1672287, 1583721, 1506387, 1438030, 1378765, 1329019, 1287111, 1251593, 1223211, 1201777, 1184006, 1167397, 1153451, 1144120, 1137921, 1132626, 1128902, 1127938, 1128209, 1128035, 1128861, 1132656, 1138436, 1144622, 1152314, 1162922, 1174950, 1186410, 1198073, 1211251, 1224906, 1238069, 1252377, 1268951, 1285606, 1300521, 1315696, 1333167, 1350799, 1365694, 1378918, 1392881, 1406703, 1418282, 1428451, 1439161, 1449986, 1460257, 1472050, 1487233, 1504115, 1520779, 1538908, 1560481, 1583657, 1605953, 1628556, 1653513, 1679798, 1706278, 1735155, 1768022, 1801775, 1832828, 1862024, 1890967, 1917275, 1938466, 1956986, 1976436, 1996549, 2016913, 2041428, 2073262, 2109192, 2144894, 2182069, 2224362, 2270264, 2316524, 2364790, 2418014, 2473834, 2528465, 2583761, 2643588, 2706626]
56013B706626O3031O4793O9857P3113P3453P6591Q3681Q8509Q9711R3919J02836
56002C586120J09527J11836J16689J26473J34235J37466J43162J53897J62733
55993D782138J67458J75577J89395K00960K07960K19163K37594K54438K66500
55984F701183K82915L07274L30688L50432L76909M13776M50565M83975N26091
55975A0223808N81913O40411O98160P68843Q58217R54337J054796J177618J332189
55966A8290292J507951J706496J954780K271944K657853L132312L748234M546068
55958C9815930N534301O731011Q173149R866975J1802453J4057367J6812731K0212114
55950A33006031K4268515K8895378L3770948L7929939L9650618L7212008L0064201
$$ y = [2706626, 2769657, 2834450, 2904307, 2977420, 3050873, 3127464, 3211145, 3299654, 3389365, 3483284, 3586120, 3695647, 3807483, 3924172, 4050645, 4184880, 4322346, 4465508, 4619405, 4782138, 4949596, 5125173, 5314568, 5515528, 5723488, 5942651, 6180245, 6434683, 6701183, 6984098, 7291372, 7622060, 7972492, 8349401, 8763177, 9213742, 9697717, 10223808, 10805721, 11446132, 12144292, 12913135, 13771352, 14725689, 15780485, 16958103, 18290292, 19798243, 21504739, 23459519, 25731463, 28389316, 31521628, 35269862, 39815930, 45350231, 52081242, 60254391, 70121366, 81923819, 95981186, 112793917, 133006031, 157274546, 186169924, 219940872, 257870811, 297521429, 334733437, 364797638]
55943C64797638J9250889O694150n785514j6813177k5334965l0686743l2883280
55936B79238998l2608397l0777839k8125304k5127916k2100272j9226474j6572427
55929A04700369j4163263j2040124j0224464q682367p365888o255771n336288
55922D0632204m566319l907261l350773k893037k508623k173530j888816j658510
55914A7685335j466388j295301j148522j032033r34424q42831p61327o96172o38968
55905H869369n80634n26921m84659m46732m05172l65695l35431l09038k80082
55896E135005k53905k36399k21623k02818j84715j73132j63015j48304j33512
55887C417582j24319j16353j04054r1429q3385p5399o2113m7725l7769k8978j7295
$$ y = [364797638, 384048527, 390742677, 384957163, 368143986, 342809021, 312122278, 279238998, 246630601, 215852762, 187727458, 162599542, 140499270, 121272796, 104700369, 90537106, 78496982, 68272518, 59590151, 52224263, 45968492, 40632204, 36065885, 32158624, 28807851, 25914814, 23406191, 21232661, 19343845, 17685335, 16218947, 14923646, 13775124, 12743091, 11808667, 10965836, 10204509, 9508337, 8869369, 8288735, 7761814, 7277155, 6830423, 6425251, 6059556, 5724125, 5415087, 5135005, 4881100, 4644701, 4423078, 4220260, 4035545, 3862413, 3699398, 3551094, 3417582, 3293263, 3176910, 3072856, 2981427, 2898042, 2822643, 2760530, 2712805, 2675036, 2646058, 2628763]
55876B628763q176q767j6818k6543l8609n5083p1212q1414q7594r3272r5601r1375
55864A954299q4817q1135p8030p1545o4663o2000o1324n8176n3958n1902m9874
55853A236875m4661l8816l6104l4553l0814k6938k6128k6185k3829k1193k1431
55842I06223k2233k0204j7480j7487j8193j6187j3500j3908j5907j5775j4175
55831G21174j3718j3369j1202r299j0113j1288r818p809q447r772q467o380p106
55818E94386r205r047p470p536q237o642l975l506m402l386p57P85J482L448N928
55803E41866O682O501P456Q463P217M724L282J892j623n890q119r054j1066j3109
55789E39222j2474r894q189p337n555l786m382o623q052r001j1348j3971j4011
$$ y = [2628763, 2620587, 2611820, 2595002, 2568459, 2529850, 2474767, 2403555, 2322141, 2234547, 2141275, 2045674, 1954299, 1869482, 1788347, 1710317, 1638772, 1574109, 1512109, 1450785, 1392609, 1338651, 1286749, 1236875, 1192214, 1153398, 1117294, 1082741, 1051927, 1024989, 998861, 972676, 948847, 927654, 906223, 883990, 863786, 846306, 828819, 810626, 794439, 780939, 767031, 751124, 735349, 721174, 707456, 694087, 682885, 673586, 663473, 652185, 642367, 634558, 626111, 616339, 607872, 601492, 594386, 585181, 576134, 568664, 561128, 552891, 546249, 542274, 538768, 534366, 530980, 530223, 531008, 532490, 535938, 541866, 548548, 555049, 562505, 570968, 578185, 582909, 586191, 588083, 586460, 580570, 572451, 563397, 552331, 539222, 526748, 516854, 508665, 501328, 495773, 491987, 487605, 480982, 472930, 463929, 452581, 438610, 424599]
55776D24599j1651r425p752n284k642j611j516l42J337J353j17j296k387m676
55762C78590p105p553o606o469p020o557n464n525o451o602o374p363r025r450
55748B81026q672q152p866o980o226o552o612m825k559k095k770k428j237p34
55734B13318n29N48J436O37m48K83J553P20j432k009r97q15j730j959j651k549
55718B04376m069l788j789n82p97o53L04N56j44l50J48J37k59K14J084O48p95
55701A94241j303p75r15j844j970j213j286k473l133k523j515m48J080K415K450
55686A80788J866K205L151L344L283M442O108O197M854M092M133L378J792R95
55672B30628R83M9j809k646k023j623k070k109j306p94q43l56Q13J591J952K873
$$ y = [424599, 412948, 403523, 395771, 390487, 387845, 386234, 384718, 384376, 385713, 387066, 386949, 385653, 383266, 378590, 371485, 363932, 357326, 350857, 343837, 337280, 331816, 326291, 319840, 313238, 306864, 299501, 290476, 281026, 272354, 264202, 256336, 249356, 243130, 236578, 229966, 225141, 222582, 220487, 217717, 215289, 214052, 213318, 212789, 213337, 214773, 215410, 214962, 215245, 216798, 217518, 216086, 214077, 213080, 212265, 210535, 208576, 206925, 204376, 200307, 196519, 194730, 194148, 193351, 192698, 193002, 193558, 193414, 193064, 193212, 193349, 193090, 193304, 194388, 195036, 194241, 192938, 192163, 191248, 189404, 187434, 186221, 184935, 182462, 179329, 176806, 175291, 174843, 175923, 178338, 180788, 182654, 184859, 188010, 191354, 194637, 199079, 205187, 211384, 216238, 220330, 224463, 227841, 229633, 230628, 231611, 231660, 229851, 227205, 225182, 223559, 221489, 219380, 218074, 217280, 216437, 216081, 216894, 218485, 220437, 223310]
55656B23310L974L847K800K646L519L612K264O55p22k550m481n182m895n287o496
55641B17014o939o305n989o258n765m330l441l507l152j899j015j152j421j371
55627A64470j595j938j380q2O89Q12J254J711Q94o75q53O69J753J167P8m08p51
55610A65815j386j865k166k858l520l157k216k075k483j915m98L4n66p61j69p1
55594A40143o04l54P62J036K0o65k65M6k99l25K57M68L25J002K185K095P70M20
55576A47017J755K955L177L918N784P019O758O727Q009Q959Q005O102M584L006
55562B23775Q74p93j385k124l906n581o032n967o176o001n026m361m685m890m160
55547A63562l518l808m002l106j957j628j665j367j095j043m18Q39J306L53n96
$$ y = [223310, 227284, 231131, 233931, 236577, 240096, 243708, 245972, 246627, 245905, 243355, 238874, 233692, 228797, 223510, 217014, 210075, 203770, 197781, 191523, 185758, 181428, 177987, 174480, 171328, 169429, 168414, 167262, 165841, 164470, 162875, 160937, 159557, 159475, 160164, 160976, 162230, 163941, 164835, 164160, 163307, 163976, 165729, 166896, 166974, 166566, 165815, 164429, 162564, 160398, 157540, 154020, 150863, 148647, 146572, 144089, 142174, 141676, 141710, 141144, 140383, 140214, 140143, 139539, 139185, 139947, 140983, 141003, 140338, 140073, 140119, 139820, 139495, 139752, 140220, 140545, 141547, 143732, 145827, 146597, 147017, 148772, 151727, 154904, 158822, 164606, 171625, 178383, 185110, 193119, 202078, 210083, 216185, 220769, 223775, 224649, 223856, 222471, 220347, 216441, 210860, 204828, 198861, 192685, 186684, 181658, 177297, 172612, 167722, 163562, 160044, 156236, 152234, 149128, 147171, 145543, 143878, 142511, 141416, 140373, 139955, 140794, 142100, 142453, 141857]
55532A41857m28n5m47q79o50o11j406k012j581j019j136j132m22j44j047j798
55516A27090j225m79j003j998j962j242r59q02qO85K31o49o08K6M1m44m16J08
55498A16386L98N53J086J546J182L96R4J82nl52l31r6r1j62q0j67n44n87j1M51
55478A19848K82ONk37q14p59K61R88N03k93k83K08N11Q80J353R41o19j845j734
55459A19202j434k069k570j617j38K50m2L52J069Q09r8k20M55P27M84O93J401
55442A17254J680J387J187J028K77p49r67j99O27Q70N66k12j249j815j500r95
55426A17190r89r10PJ185J499J059Q24J025J291J731K602L381L468L203L061K555
55410A42182J253j0l16k79r23j731j558q35r68j961k475k037j467j165o50J00
$$ y = [141857, 141429, 141374, 140927, 140048, 139398, 138787, 137381, 135369, 133788, 132769, 131633, 130501, 130079, 129935, 128888, 127090, 125865, 125386, 124383, 122385, 120423, 119181, 118222, 117420, 117412, 118097, 118328, 117679, 117071, 117097, 117138, 116694, 116278, 116386, 116784, 117337, 118423, 119969, 121151, 121547, 121641, 121823, 121818, 121466, 121135, 121039, 120948, 120786, 120706, 120539, 119995, 119408, 119397, 119848, 120130, 120136, 120141, 119904, 119090, 118331, 118592, 119580, 120083, 119790, 119507, 119715, 120226, 121106, 122459, 123400, 122781, 120936, 119202, 117768, 115699, 113129, 111512, 111374, 111624, 111582, 111934, 113003, 113812, 113714, 113494, 113949, 114676, 115160, 115853, 117254, 118934, 120321, 121508, 122536, 122813, 122064, 121097, 120898, 121525, 122395, 122961, 122749, 121500, 119685, 118185, 117190, 116201, 115291, 115298, 116483, 117982, 119041, 119865, 120890, 122181, 123912, 126514, 129895, 133363, 136566, 139627, 142182, 143435, 143425, 143109, 142830, 141907, 140176, 138618, 137783, 136815, 134854, 132379, 130342, 128875, 127710, 127060, 127160]
55394A27160L70p7o89j073j204q37J82J207J468J212J177J229P34j08m52j52K20
55377A30367M67P96R66N13m00j165j537j478q08J87M87l25j240j353j329k002
55361A22146k574j838m07J04l34l23M67Q55K28n77p51m33J7N32R34J019J046J240
55343A21351J069O0j022j045k37J94q9l95m22n75r19j052r51q85o58L5P59R48
55325A16166R32J228J361O63j95o9O69N49o39j605j596j180q81m55J96P05R76
55308A16825J258J424J216J055J440J814J246Q7m50k23k15o86p52J6R26J367J445
55291A27793J228N14m14q50o60l15j2L71N90L59J17L86P07L95o2K33Q25N20n12
55272A31213r74o30m65o26j55R90J498Q11m0k38k50n22n51l5M73O33Q27J082P66
$$ y = [127160, 127530, 127453, 126764, 125691, 124487, 123650, 123832, 125039, 126507, 127719, 128896, 130125, 130859, 130751, 130299, 130147, 130367, 130834, 131630, 132596, 133109, 132709, 131544, 130007, 128529, 127721, 127908, 128395, 128070, 126830, 125477, 124148, 122146, 119572, 117734, 117327, 117431, 117097, 116774, 117241, 118096, 118324, 117747, 116996, 116563, 116580, 117112, 118046, 119065, 120111, 121351, 122420, 122480, 121458, 120413, 120176, 120370, 120281, 119886, 119464, 118889, 117970, 116918, 115967, 115082, 114424, 114459, 115218, 116166, 117098, 118326, 119687, 120350, 120155, 120086, 120755, 121304, 120665, 119060, 117464, 116284, 115403, 114948, 115144, 115849, 116825, 118083, 119507, 120723, 121778, 123218, 125032, 126278, 126365, 125915, 125692, 125477, 124791, 124039, 124055, 124981, 126348, 127793, 129021, 129535, 129121, 128271, 127611, 127296, 127284, 127655, 128245, 128604, 128721, 129107, 129814, 130209, 130147, 130380, 131205, 131725, 131213, 130239, 129609, 129144, 128518, 128363, 129353, 130851, 131662, 131622, 131384, 131134, 130612, 130061, 130026, 130499, 131132, 131959, 133041, 133807]
55253A33807j19o62n50n64r84q87J87J166R85P1n24n89m65k20O2p3p27j185q14
55234A27915P1P17P67K78m54q46n38j21m91j352j383j42J282J836J684J392J037
55217A31652O74O74R81R27K99k33k51j90l06n8Q47J699J805J461J212Q73R1q13
55199A41344j312j458j544j461r94l91n5m8j92m02n26l41P0K55Ol78m84j26O56
55180A32619J453J519N79m82n64J91P29O93O73Q84Q71O03O24Q59N10m58r42l01
55162A40060P50J379J639J714J337O21M22J031J504J050K54k0q2p54j847k371
55146A46687j924j027k99K3q7n05q87q94m88J44O52O03j35j018j333j089q21o82
55128A36920m14j72m16r40r13j42O06P79O25M21O9k42K5P45J042N98J56K59M77
$$ y = [133807, 133688, 133026, 132476, 131912, 130928, 130041, 130228, 131394, 132379, 132450, 131926, 131337, 130872, 130652, 130714, 130641, 129914, 128729, 127915, 127986, 128703, 129470, 129748, 129294, 128448, 127910, 127789, 127298, 125946, 124563, 124421, 125703, 127539, 129223, 130615, 131652, 132326, 133000, 133981, 134908, 135207, 134974, 134723, 134533, 134227, 134169, 135016, 136715, 138520, 139981, 141193, 142066, 142157, 141344, 140032, 138574, 137030, 135569, 134575, 134184, 134129, 134081, 133889, 133487, 132961, 132620, 132690, 132945, 132951, 132573, 132089, 131963, 132619, 134072, 135591, 136170, 135688, 135124, 135315, 136044, 136737, 137410, 138294, 139165, 139768, 140392, 141251, 141761, 141303, 140361, 140060, 140810, 142189, 143828, 145542, 146879, 147500, 147922, 148953, 150457, 151507, 151761, 151741, 151659, 150905, 149058, 146687, 144763, 143736, 143437, 143460, 143373, 142868, 141981, 141087, 140599, 140743, 141395, 141998, 141863, 140845, 139512, 138423, 137602, 136920, 136506, 136334, 135918, 134978, 134065, 133923, 134529, 135308, 135933, 136354, 136423, 136181, 136206, 136951, 137993, 138591, 138747, 139006, 139483]
55109A39483M06M25Q64J226R69L47j39m84q10q50l52M46J125J408J044Q5o97n14
55091A43982J98K55m24o50Q8Q00O68J88m5m10j182j623j171n92p97j305j053r6
55073A36831N55L58l94j253j819j670p97J57O66R16J234J528J679J845J856J161
55057A42853j75j137j068m73mM59R73Q85j12j103j184p77p27q19l07O43J191J098
55039A40216P43L36j6J15Q08J191N25m78n08M43J106P45q0n83o13l93j02P0Kj19
55019A43408l6J80L00L06L15K87K15K74M95O12N56O67J082J341J012K73m53j006
55001A49828j286j111o69m82n49j80Q89J878K003J490J016P64O02N01K83l66j063
54984A53548p55P49K109K139J342Q93Q39M01m73j034r24m50J20P49J233J298R68
$$ y = [139483, 139889, 140314, 141178, 142404, 143373, 143720, 143581, 143097, 142287, 141437, 141085, 141531, 142656, 144064, 145108, 145193, 144496, 143982, 144180, 144435, 144011, 143361, 143449, 144249, 144917, 145105, 145060, 144650, 143468, 141845, 140674, 140082, 139285, 137980, 136927, 136831, 137386, 137744, 137350, 136097, 134278, 132608, 131811, 131968, 132634, 133550, 134784, 136312, 137991, 139836, 141692, 142853, 142678, 141541, 140473, 140000, 139996, 140455, 141428, 142313, 142201, 141098, 139914, 139137, 138410, 137591, 137284, 137927, 139118, 140216, 140959, 141295, 141279, 141394, 142202, 143393, 143918, 143440, 142932, 143375, 144481, 145226, 145146, 144563, 143950, 143557, 143455, 143525, 143527, 143408, 143372, 143552, 143852, 144158, 144473, 144760, 144975, 145249, 145744, 146356, 146912, 147579, 148661, 150002, 151014, 151287, 150834, 149828, 148542, 147431, 146762, 146280, 145731, 145551, 146440, 148318, 150321, 151811, 152827, 153591, 154193, 154694, 154977, 154611, 153548, 152793, 153542, 155651, 157790, 159132, 160025, 160864, 161265, 160792, 159758, 158834, 158384, 158504, 159253, 160486, 161784, 162752]
54967A62752M52j05l94m4O89R54M85J0L1R2j13R0J199K411K640J972J115J80r43
54948A73473j725j610j001n69j84M99J004P40J95K40P38R20P71Q50J169J406J836
54931A78752K910M192M852M936N124N560N979O628P814Q872Q750P473N930M418
54917B62190K506J47k184m235n943o883o812o428o500o606n876m624m015m296
54903B00441m605m349l616k492j107k13m12j026r13j27M09N48Q61J291J394J662
54887A87746K977M825N712N405N151N613O269O931Q012Q956Q221N505K425L30
54873B64078j114k561l757m420n036n912o524o541o409o366n971n175m651m504
54859A95137l922k793k239k784l248k540j322q27j091j436j751k117k039j217
$$ y = [162752, 163204, 163099, 162705, 162661, 163350, 164304, 164789, 164799, 164830, 164922, 164809, 164899, 166098, 168509, 171149, 173121, 174236, 174416, 173473, 171748, 170138, 169137, 168568, 168384, 168883, 169887, 170627, 170822, 171062, 171800, 172720, 173491, 174341, 175510, 176916, 178752, 181662, 185854, 190706, 195642, 200766, 206326, 212305, 218933, 226747, 235619, 244369, 251842, 257772, 262190, 264696, 264843, 262659, 258424, 252481, 245598, 238786, 232358, 225858, 219252, 213376, 208752, 204737, 200441, 195836, 191487, 187871, 185379, 184272, 184059, 183647, 182621, 181708, 181581, 181990, 182538, 183399, 184690, 186084, 187746, 190723, 195548, 201260, 206665, 211816, 217429, 223698, 230629, 238641, 247597, 255818, 261323, 263748, 264078, 262964, 260403, 256646, 252226, 247190, 241278, 234754, 228213, 221804, 215438, 209467, 204292, 199641, 195137, 191215, 188422, 186183, 183399, 180151, 177611, 176289, 175462, 174371, 172935, 171184, 169067, 167028, 165811]
54845A65811m36n36j129j334j171j190j258q53j41K72L84O34J017J203J261J413
54829A63947J335N67n44j119q73l31j2J6q1j3N17J306J561Q22k60o89l97r2q8
54810A65572o2J66L10K05R6J64K58K15J57K44L95M09K46J02J80M07M15ln37o06
54790A68333l5P50J218J150O86K83M93J414K418K829K775K833L048L076L197M200
54774A98668O061P688Q375Q696R366J0125J0344J0075R696Q980P359M883K251
54761C02567L3j702l154m599o156p437p773p188o707p142p981q071p148o021n386
54746B16135n106m697l964l029k127j488j163r17m68J58P65J334K020K840L558
54731B03851L977M156M342M783N528O383P014P162O678N546M009K533J370J84
$$ y = [165811, 165375, 164839, 163710, 162376, 161205, 160015, 158757, 157904, 157763, 158035, 158419, 159053, 160070, 161273, 162534, 163947, 165282, 165849, 165305, 164186, 163313, 162982, 162970, 162986, 162905, 162892, 163409, 164715, 166276, 167098, 166838, 166149, 165752, 165660, 165572, 165510, 165676, 165986, 166191, 166287, 166451, 166709, 166924, 167081, 167325, 167720, 168129, 168375, 168477, 168657, 169064, 169479, 169476, 168939, 168333, 168298, 169048, 170266, 171416, 172102, 172385, 172878, 174292, 176710, 179539, 182314, 185147, 188195, 191271, 194468, 198668, 204729, 212417, 220792, 229488, 238854, 248979, 259323, 269398, 279094, 288074, 295433, 300316, 302567, 302600, 300898, 297744, 293145, 286989, 279552, 271779, 264591, 257884, 250742, 242761, 234690, 227542, 221521, 216135, 211029, 206332, 202368, 199339, 197212, 195724, 194561, 193644, 193176, 193334, 194099, 195433, 197453, 200293, 203851, 207828, 211984, 216326, 221109, 226637, 233020, 240034, 247196, 253874, 259420, 263429, 265962, 267332, 267516]
54717B67516j567l814n801o866p044o820o615o584o636o510n940m880l521k150
54703A92768j102o77q85j373j809k140k337k224j813j423j094m04O21J084M16
54688A77608m72k80P73J286P24k1j67Q1L46O68Q95O01k1j51L31N39j7o47p39p20
54668A80617j133j567j372p69m06l86m15m24l66N0Q08J259R81M19N3l95j238j858
54650A73858j377M6J413K075K032J395L80m58o87n91o57p71n55k50l97q24p74
54633A73858m6P21R60P01J70m79q93o45J34P07N79N4k65k06nJ55K97M96P33R51
54613A77977J105J117Q46K29m74q18o88n34p99j196r80M1J184J667J374P40J96
54596A80987j28l88q08j283j305n61N26J234J348J120O28j37p25n69R6M46K57
$$ y = [267516, 265949, 262135, 256334, 249468, 242424, 235604, 228989, 222405, 215769, 209259, 203319, 198439, 194918, 192768, 191666, 190989, 190104, 188731, 186922, 184782, 182445, 180221, 178408, 176985, 175891, 175487, 176108, 177192, 177608, 177136, 176856, 177629, 178915, 179639, 179618, 179451, 179532, 179878, 180546, 181441, 182042, 182021, 181870, 182201, 182740, 182723, 182076, 181337, 180617, 179484, 177917, 176545, 175776, 175370, 174984, 174569, 174145, 173779, 173829, 174637, 175896, 176877, 177296, 177349, 176954, 175716, 173858, 172481, 172527, 173940, 176015, 178047, 179442, 179822, 179364, 178677, 178086, 177429, 176658, 176103, 175853, 175456, 174632, 173858, 173812, 174533, 175493, 176194, 176364, 175885, 174992, 174347, 174481, 175188, 175767, 175821, 175556, 175350, 175345, 175500, 175797, 176293, 177026, 177977, 179082, 180199, 181045, 181274, 180800, 179982, 179294, 178760, 177961, 176765, 175785, 175826, 177010, 178677, 180051, 180791, 180987, 180859, 180471, 179663, 178380, 177075, 176514, 177040, 178274, 179622, 180742, 181370, 181233, 180508, 179939, 180035, 180481, 180738]
54579A80738R1K21K45n5l35m01m05j66P23J777J711K09j371j737j100k71N78J397
54561A81849J529O26m10n25RK81K93O65J194J024J17n33k84M92J162J459J274
54544A90222N88k81q20q26m34J55O53O90L17J59N73J033Q81L25O1J99L46L92N75
54525A94808Q73R73P41K33m94j184j359j013q34j180j358o17O03J215R56M33J14
54508A92910j8m4r9m58r73r05o2N23kq40o93J76M02j68k30Q54K087K349J684P06
54488A97199k24q21p69k10K69M53N80O49M12J09K77Q11J103J129J397J766J524
54471B05654Q03O17J171J449R56N17O72O41j03n52L23J667J817O75l73n80n33
54454B14821p57r33p19m26m33o04o32n08l74k81k39l31n93r67j371j654j596j119
$$ y = [180738, 180829, 181050, 181295, 181240, 180905, 180504, 180099, 179933, 180656, 182433, 184144, 184353, 182982, 181245, 180145, 179874, 180452, 181849, 183378, 184004, 183594, 183069, 183078, 183359, 183652, 184317, 185511, 186535, 186652, 186119, 185835, 186327, 187489, 188948, 190222, 190810, 190529, 189709, 188883, 188449, 188604, 189257, 189947, 190264, 190423, 190996, 192029, 192910, 193235, 193296, 193495, 193841, 194233, 194808, 195681, 196654, 197395, 197628, 197134, 195950, 194591, 193578, 192744, 191564, 190206, 189589, 190192, 191407, 192363, 192796, 192910, 192892, 192848, 192749, 192291, 191318, 190413, 190351, 190874, 190872, 190032, 189339, 189515, 189917, 189749, 189519, 190373, 192460, 194809, 196493, 197199, 196975, 196154, 195385, 195175, 195444, 195897, 196477, 197126, 197538, 197647, 197924, 198735, 199838, 200967, 202364, 204130, 205654, 206457, 207074, 208245, 209694, 210650, 211167, 211839, 212480, 212377, 211825, 212148, 213815, 215632, 216307, 215934, 215354, 214821, 214064, 213131, 212412, 211986, 211553, 210949, 210317, 209809, 209435, 209154, 208915, 208584, 207991, 207024, 205653, 203999, 202403, 201284]
54436B01284m46P2K49R2k32l76n7M88O16J59j80K45J017J169N51J6K21Q65J314
54417B07067J376J156N98k77r67r44l65J24K61L80O52P50M83K63M79Q48Q34M30
54399B13148j5m65j057j504j398r62p82p59k57O40J037P03N98J331K063J728N93
54382B14642l04o48p65n67K54J202J296M39m01n54l63m03o73q23o51k36J63K38
54364B11846K9N4O33J325J508J214Q73M98p4m21P5J099J545R61L1m90o45p50q03
54345B18508o80m58k41p0j54p01j422j663j221n65j95j66l11m84n06l03q6l0Q7
54326B09339M38N77Kr31j389j263j082q72r6J132J873J690J192Q68M18k74m60
54309B11162L99J607K072J662J026N42J81L4K51N98O86N27L98L21N3m46r30j174
$$ y = [201284, 200838, 200910, 201159, 201251, 201019, 200643, 200586, 201074, 201690, 201849, 201669, 201914, 202931, 204100, 204651, 204667, 204888, 205753, 207067, 208443, 209599, 210197, 209920, 208953, 208009, 207644, 207768, 208029, 208409, 209061, 209811, 210294, 210557, 211036, 211884, 212718, 213148, 213133, 212668, 211611, 210107, 208709, 207747, 206965, 206206, 205949, 206589, 207626, 208329, 208927, 210258, 212321, 214049, 214642, 214338, 213690, 212925, 212358, 212612, 213814, 215110, 215549, 215148, 214594, 214231, 213828, 213155, 212332, 211681, 211445, 211608, 211846, 211875, 211929, 212562, 213887, 215395, 216609, 217482, 217980, 217906, 217485, 217560, 218659, 220204, 221165, 221196, 220706, 220061, 219311, 218508, 217828, 217370, 217129, 217059, 216905, 216204, 214782, 213119, 211898, 211333, 211138, 210972, 210661, 210177, 209671, 209368, 209282, 209252, 209339, 209777, 210354, 210356, 209425, 208036, 206773, 205691, 204819, 204723, 205855, 207728, 209418, 210610, 211478, 211896, 211622, 211162, 211561, 213168, 215240, 216902, 217928, 218470, 218651, 218685, 218936, 219534, 220220, 220747, 221145, 221466, 221519, 221073, 220143, 218969]
54291B18969j187j123j160j328j457j425j388j460j326o33K55N18jn48n65l94
54275B05747n60q80q10l00J41J63m1O5P50J556J611O69m02o89m37n04q37o02K10
54256B04850N67J12j11O66J605J467M44k99l08j24j70k74k25p5J16L19L71J92
54238B09123N3K71O78P95L64m49j232j535j210o64m75o20n75k88l62r19j093k30
54220B01632R92J409Q57J37k21l64m77m60k48K3J98J58j98p19r69o94j66K05K83
54201B01378Q1l34o00k77L54L50n50j263p24O18J457J322P59J87m28q84p32o9
54183B00645M58N64O15P97P12Q8o00o86j99J49j66q29r84k27Q57J388J317J334
54165B05233J667J627O88o85j690k067j828p78Q45J899J479J84o25n55k50LN44
$$ y = [218969, 217782, 216659, 215499, 214171, 212714, 211289, 209901, 208441, 207115, 206482, 206737, 207255, 207254, 206706, 206141, 205747, 205187, 204307, 203497, 203197, 203338, 203501, 203460, 203525, 204275, 205831, 207442, 208111, 207709, 207020, 206583, 206079, 205242, 204640, 204850, 205417, 205529, 205418, 206084, 207689, 209156, 209600, 209301, 208993, 208869, 208699, 208425, 208200, 208125, 208241, 208560, 208931, 209123, 209176, 209447, 210125, 210920, 211284, 210835, 209603, 208068, 206858, 206194, 205719, 205099, 204524, 204236, 203874, 202955, 201862, 201632, 202624, 204033, 204890, 205027, 204806, 204442, 203965, 203505, 203257, 203280, 203478, 203636, 203438, 202719, 201750, 201056, 200890, 201095, 201378, 201459, 201125, 200525, 200248, 200602, 200952, 200402, 199139, 198415, 199033, 200490, 201812, 202571, 202758, 202330, 201446, 200714, 200645, 201103, 201667, 202282, 203079, 203791, 203879, 203279, 202593, 202394, 202543, 202377, 201548, 200564, 200337, 201194, 202582, 203899, 205233, 206900, 208527, 209215, 208530, 206840, 204773, 202945, 202167, 203012, 204911, 206390, 206574, 205949, 205394, 205144, 205147, 205691]
54148B05691J237J294N24j58O3R50J770K170K136J643Q13l3p28j300j577j244
54132B13251m79M7ll40o87j124j490j270m34K52K81J45M51Q65P33K76K97Q76J289
54113B12936J174R81J081J141P51O5m50n69l13K03O23M24m22j149j045l65N4l6
54095B15084j46l9j62q28j509j513r52n13m62l96lN47R23R95P16Q1o33q75l72
54076B09943M81R25M83o29j597j623p17K05L73J62N78J746K565K071O26o09r72
54059B14011o74k24J6r0l97m84l2Q19J551J688J152L87R5N40J137J063K98l29
54041B20527j89N94J617K616L200K936K128J852K642L642L709K848J952J529J490
54026B53093J801K498L166L228K733K159J553N89n01r56o08j95k04j66L80R15
$$ y = [205691, 206928, 208222, 208746, 208588, 208651, 209601, 211371, 213541, 215677, 217320, 218133, 218100, 217372, 216072, 214495, 213251, 212772, 212819, 212816, 212476, 211789, 210665, 209175, 207905, 207471, 207723, 208004, 208149, 208600, 209465, 210198, 210474, 210771, 211647, 212936, 214110, 215091, 216172, 217313, 218064, 218129, 217679, 217110, 216797, 217000, 217623, 218047, 217625, 216476, 215431, 215066, 215120, 215084, 214938, 214899, 214737, 213909, 212400, 210887, 209935, 209422, 208960, 208564, 208561, 209108, 210031, 211026, 211742, 211823, 211190, 210315, 209943, 210424, 211349, 211832, 211203, 209606, 207983, 207266, 207471, 207844, 208006, 208584, 210330, 212895, 214966, 215592, 214983, 214011, 213337, 213113, 213129, 213039, 212642, 212158, 212126, 212945, 214496, 216184, 217336, 217723, 217818, 218358, 219495, 220558, 220856, 220527, 220338, 220932, 222549, 225165, 228365, 231301, 233429, 235281, 237923, 241565, 245274, 248122, 250074, 251603, 253093, 254894, 257392, 260558, 263786, 266519, 268678, 270231, 270820, 270319, 269363, 268755, 268560, 268356, 268190, 268570, 269485]
54010B69485O61j63o37n51o92j537k426k499j933j581j638j412n55K42J80n75
53994B54369j230j432j322q66Q4J154J594J238O68L41J61L8J58M68N84N27Q75
53977B57409J818K755L278L926N376P497R736J1984J4401J6970J9887K3775K8534
53964D07346L2232L2187K7335J8958R216l62r050j6396k1945k5228k5962k4435
53952D03896k1615j8577j5885j3623j1739j0092q524p142o225n558m398k511o94
53939B77313K81O80J189J821K217K516L036L434L174K646K771L591M194M075L639
53924C16577L205K392Q70r42k203k370j468j35P02O80M57Q93J880K612K731K514
53908C28395K057J206K78k4L68P36N79R8m62j139j759j931j778j909k400k521
$$ y = [269485, 270146, 269983, 269346, 268795, 268103, 266566, 264140, 261641, 259708, 258127, 256489, 255077, 254522, 254764, 254944, 254369, 253139, 251707, 250385, 249519, 249603, 250757, 252351, 253589, 254257, 254598, 254759, 254797, 254955, 255423, 256007, 256534, 257409, 259227, 261982, 265260, 269186, 274562, 282059, 291795, 303779, 318180, 335150, 355037, 378812, 407346, 439578, 471765, 499100, 518058, 527274, 526912, 517862, 501466, 479521, 454293, 428331, 403896, 382281, 363704, 347819, 334196, 322457, 312365, 303841, 296699, 290474, 284916, 280518, 278007, 277313, 277594, 278274, 279463, 281284, 283501, 286017, 289053, 292487, 295661, 298307, 301078, 304669, 308863, 312938, 316577, 319782, 322174, 323044, 322102, 319899, 317529, 316061, 315926, 316628, 317308, 317765, 318658, 320538, 323150, 325881, 328395, 330452, 331658, 331936, 331912, 332280, 333016, 333595, 333693, 333231, 332092, 330333, 328402, 326624, 324715, 322315, 319794]
53892C19794j905j220j226j836k560l277l985m329m080l658l551l440k614j185
53878B80928k51n83j588j970j306n42o84j408j585j061r76j962k973k708j523
53863B59808q56j155j516j293q05l96J05O58P60K68l07o26r09j160r28j49M59
53846B51958L90K5j29j72l44n00m81m75n45l97m9o0n81q94m38K95N50L72K33J40
53826B48898r0j29L60Q67N76l28p24k6J105J716J588J125O41J48l17n08j59O26
53808B55369J377J678J575J357J148R83J199K202L771N104N666N691N779O392
53794B99291P748R636J1272J2047J2541J4117J7162K0472K2632K3229K2173J8810
53782D91130J2740M974k680r174j4357j7902j9229j8564j7160j6034j5052j3632
$$ y = [319794, 317889, 316669, 315443, 313607, 311047, 307770, 303785, 299456, 295376, 291718, 288167, 284727, 282113, 280928, 280677, 280094, 278506, 276536, 275230, 274688, 274004, 272596, 271011, 269950, 268974, 267012, 264039, 261331, 259808, 258952, 257797, 256281, 254988, 254183, 253787, 253892, 254550, 255310, 255578, 255271, 254645, 253736, 252576, 251648, 251499, 251958, 252348, 252373, 252244, 252072, 251728, 251228, 250747, 250272, 249727, 249330, 249281, 249221, 248640, 247746, 247308, 247603, 248153, 248525, 248758, 248898, 248808, 248679, 249039, 249906, 250482, 250154, 249430, 249404, 250509, 252225, 253813, 254938, 255579, 255727, 255410, 254902, 254743, 255369, 256746, 258424, 259999, 261356, 262504, 263487, 264686, 266888, 270659, 275763, 281429, 287120, 292899, 299291, 307039, 316675, 327947, 339994, 352535, 366652, 383814, 404286, 426918, 450147, 472320, 491130, 503870, 508844, 506164, 496990, 482633, 464731, 445502, 426938, 409778, 393744, 378692, 365060]
53770C65060j1843j0296r245q271o987n639m780m480m228l657l040k748k620k265
53756B84961j748j415j217q59n47p73j315j274l76N63Q81R85J516K309K808L088
53740B87587L638M564N559O503P455Q259Q635Q483P753O219L861J225j056k867
53726C55818m387n588o320o660o652o024m687l266k517k388k187j629j083p81
53712C01649l79M95J680K717L380L808M190M469M358L656K515J319L48k57l23
53697C33625J67Q20J116J095J303J944K511K472J881J151O31N37Q30R40K31j040
53681C50214j808j523p74k57J25O11P60P6j039j698j613j130n35Q6N68Q72J197
53664C44132J436R06o63k290k719j940r40k88K36O50M80l66j199j349r20m68l16
$$ y = [365060, 353217, 342921, 333676, 325405, 318418, 312779, 307999, 303519, 299291, 295634, 292594, 289846, 287226, 284961, 283213, 281798, 280581, 279722, 279175, 278402, 277087, 275813, 275437, 276000, 276881, 277866, 279382, 281691, 284499, 287587, 291225, 295789, 301348, 307851, 315306, 323565, 332200, 340683, 348436, 354655, 358516, 359741, 358685, 355818, 351431, 345843, 339523, 332863, 326211, 320187, 315500, 312234, 309717, 307329, 305142, 303513, 302430, 301649, 301270, 301765, 303445, 306162, 309542, 313350, 317540, 322009, 326367, 330023, 332538, 333857, 334205, 333948, 333625, 333792, 334612, 335728, 336823, 338126, 340070, 342581, 345053, 346934, 348085, 348716, 349253, 350083, 351023, 351254, 350214, 348406, 346883, 346109, 345852, 345977, 346588, 347348, 347424, 346385, 344687, 343074, 341944, 341409, 341495, 342063, 342935, 344132, 345568, 346474, 345811, 343521, 340802, 338862, 337922, 337634, 337870, 338520, 339000, 338634, 337435, 336086, 335166, 334698, 334382]
53647C34382k77P5Q79J592J404K97p36r00o12p27j175j147m19L41N43K67r2j86
53629C33509K43J097J726J578R81P45J117J738K435L272L889L674K781K155K336
53614C63276K895L290L592L965M161L963L662L593L585L361L176L498M130M205
53600D14352L281K118J951K974L920L568K326J692K132K420J451j57j017q69n65
53585D39577n79o53p14j115j761k016j734j615k147k843k912k242j389r37j111
53570D15809j716k288k505k457k279j763q29j19m39j556k247j705l33R45J510
53555C98028J193K72m31j40Q58J420J013M17N92J454K190K306J878J204O38N13
53539D13405Q50J393K151L398M911N765N455M803N004O050O807O674O465P337
$$ y = [334382, 334105, 334180, 335059, 336651, 338055, 338352, 337616, 336716, 336104, 335377, 334202, 333055, 332636, 332977, 333520, 333787, 333695, 333509, 333752, 334849, 336575, 338153, 339134, 339879, 340996, 342734, 345169, 348441, 352330, 356004, 358785, 360940, 363276, 366171, 369461, 373053, 377018, 381179, 385142, 388804, 392397, 395982, 399343, 402519, 406017, 410147, 414352, 417633, 419751, 421702, 424676, 428596, 432164, 434490, 436182, 438314, 440734, 442185, 442028, 441011, 440142, 439577, 438998, 438345, 437631, 436516, 434755, 432739, 431005, 429390, 427243, 424400, 421488, 419246, 417857, 416920, 415809, 414093, 411805, 409300, 406843, 404564, 402801, 401972, 401853, 401414, 399858, 397611, 395906, 395573, 396518, 398028, 399221, 399493, 399062, 398922, 399780, 401200, 402213, 402630, 403222, 404676, 406866, 409172, 411050, 412254, 412892, 413405, 414255, 415648, 417799, 421197, 426108, 431873, 437328, 442131, 447135, 453185, 459992, 466666, 473131, 480468]
53525D80468R280J1177J2135J2374J2685J3395J4209J4917J5741J6829J7908J8778
53513F49896J9868K1724K4156K6396K8096K9628L1302L2761L3316L2607L0807
53502I60557K8424K5942K3485K0886J8243J6274J5721J6511J7865J9062J9806
53491A182776K0078K0132K0521K1507K2435K2318K1111J9763J8962J8372J7411
53480A405386J6199J5443J5622J6554J7533J7833J7296J6404J5516J4297J2305
53469A580388R896P888O373M576J926j288m469p262r552j1402j3054j4566j5532
53456A533922j5828j6326j7993k0354k1983k2508k2946k3824k4316k3842k3223
53445A300779k3361k3781k3557k2864k2461k2265k1559k0227j8759j7318j5678
$$ y = [480468, 489748, 500925, 513060, 525434, 538119, 551514, 565723, 580640, 596381, 613210, 631118, 649896, 669764, 691488, 715644, 742040, 770136, 799764, 831066, 863827, 897143, 929750, 960557, 988981, 1014923, 1038408, 1059294, 1077537, 1093811, 1109532, 1126043, 1143908, 1162970, 1182776, 1202854, 1222986, 1243507, 1265014, 1287449, 1309767, 1330878, 1350641, 1369603, 1387975, 1405386, 1421585, 1437028, 1452650, 1469204, 1486737, 1504570, 1521866, 1538270, 1553786, 1568083, 1580388, 1590284, 1598172, 1604545, 1609121, 1611047, 1609759, 1605290, 1598028, 1588476, 1577074, 1564020, 1549454, 1533922, 1518094, 1501768, 1483775, 1463421, 1441438, 1418930, 1395984, 1372160, 1347844, 1324002, 1300779, 1277418, 1253637, 1230080, 1207216, 1184755, 1162490, 1140931, 1120704, 1101945, 1084627, 1068949]
53434A068949j3998j2628j1359r598p369n302l639j963j3J845L183M134N276P107
53420A024625R571J2001J3664J4579J5548J7114J8945K0531K1976K3572K5148
53409A217274K6453K7810K9605L1486L2905L4108L5755L7718L9305M0568M2353
53398A595340M4815M7024M8440M9879N2359N5673N8662O0512O1174O1004O0564
53387B195446O0527O1140O1876O1955O1129N9600N7468N4751N1810M9176M6887
53376B821765M4424M1468L8340L5482L2821K9860K6323K2391J8372J4287R795
53365C135328M423k183j0037j8743k7661l6155m3708m9913n4607n8078o0904o3425
53353B714337o5425o6463o6401o5519o4294o3248o2769o2766o2591o1640o0052
$$ y = [1068949, 1054951, 1042323, 1030964, 1021366, 1013997, 1008695, 1005056, 1003093, 1003080, 1004925, 1008108, 1012242, 1017518, 1024625, 1034196, 1046197, 1059861, 1074440, 1089988, 1107102, 1126047, 1146578, 1168554, 1192126, 1217274, 1243727, 1271537, 1301142, 1332628, 1365533, 1399641, 1435396, 1473114, 1512419, 1552987, 1595340, 1640155, 1687179, 1735619, 1785498, 1837857, 1893530, 1952192, 2012704, 2073878, 2134882, 2195446, 2255973, 2317113, 2378989, 2440944, 2502073, 2561673, 2619141, 2673892, 2725702, 2774878, 2821765, 2866189, 2907657, 2945997, 2981479, 3014300, 3044160, 3070483, 3092874, 3111246, 3125533, 3135328, 3139751, 3137568, 3127531, 3108788, 3081127, 3044972, 3001264, 2951351, 2896744, 2838666, 2777762, 2714337, 2648912, 2582449, 2516048, 2450529, 2386235, 2322987, 2260218, 2197452, 2134861, 2073221, 2013169]
53342B013169n8505n7370n6402n5215n3760n2204n0678m9185m7480m5033m1607
53331A445730l7843l4788l2570l0200k6949k3456k0815j9034j7211j5021j3249
53320A174594j2542j2367j1650j0203q882q339q124p255n466l509k192j469o69
53307A081927O44K277L854N249O592Q027R508J0810J1754J2624J4120J6619J9595
53294A203600K2099K3782K5071K6390K7660K8680K9510L0259L0765L0761L0177
53283A508754K9175K8007K6848K5614K3962K1829J9817J8616J7985J6794J4313
53272A751714J1035Q014N655L481Q22k455n882q892j1498j4274j7571k0942k3762
53259A675445k6107k8463l0752l2386l3282l4028l4949l5754l6264l6675l6842
$$ y = [2013169, 1954664, 1897294, 1840892, 1785677, 1731917, 1679713, 1629035, 1579850, 1532370, 1487337, 1445730, 1407887, 1373099, 1340529, 1310329, 1283380, 1259924, 1239109, 1220075, 1202864, 1187843, 1174594, 1162052, 1149685, 1138035, 1127832, 1118950, 1110611, 1102487, 1095232, 1089766, 1086257, 1084065, 1082596, 1081927, 1082571, 1084848, 1088702, 1093951, 1100543, 1108570, 1118078, 1128888, 1140642, 1153266, 1167386, 1184005, 1203600, 1225699, 1249481, 1274552, 1300942, 1328602, 1357282, 1386792, 1417051, 1447816, 1478577, 1508754, 1537929, 1565936, 1592784, 1618398, 1642360, 1664189, 1684006, 1702622, 1720607, 1737401, 1751714, 1762749, 1770763, 1776418, 1779899, 1780721, 1778266, 1772384, 1763492, 1751994, 1737720, 1720149, 1699207, 1675445, 1649338, 1620875, 1590123, 1557737, 1524455, 1490427, 1455478, 1419724, 1383460, 1346785, 1309943]
53248A309943l6208l4800l3542l3059l2877l2309l1477l0891l0667l0730l1103
53237I52280l1428l0898k9377k7884k7171k6563k5093k3137k1693k0663j9084
53226F69289j6857j4857j3433j1999j0300q910q201p900p897q512r522r895r123
53213E31883q044p752q255q837r145r265r108q452p455o620o258o311o561o707
53199D23113o405n608m766m437m720n237n554n469n007m369l859l651l684l767
53185C56580l737l470k952k409k198k366k436j924r76k60j78l87k98J77N66M78
53169C34210On39r42j017o27j2K31m2j56M29J094Q53k8k65M69R26K65m70J59J758
53149C36302K618K079J178Q93Q29J44j072j942j902j238o25m67o76r20j002r60
$$ y = [1309943, 1273735, 1238935, 1205393, 1172334, 1139457, 1107148, 1075671, 1044780, 1014113, 983383, 952280, 920852, 889954, 860577, 832693, 805522, 778959, 753866, 730729, 709036, 688373, 669289, 652432, 637575, 624142, 612143, 601843, 592933, 584732, 576832, 568935, 560423, 550901, 541006, 531883, 523839, 516087, 507832, 498995, 489850, 480585, 471477, 463025, 455570, 448950, 442692, 436381, 429820, 423113, 416708, 411100, 406334, 401897, 397177, 391940, 386386, 380917, 375910, 371541, 367682, 364031, 360347, 356580, 352843, 349373, 346421, 344012, 341814, 339448, 337012, 335088, 334112, 333852, 333674, 333287, 332989, 333166, 333732, 334210, 334216, 333677, 332735, 331718, 331091, 331079, 331310, 331268, 331112, 331541, 332635, 333488, 333460, 333195, 333664, 334590, 334855, 334385, 334544, 336302, 338920, 340999, 342177, 343070, 343899, 344043, 342971, 341029, 339127, 337889, 337264, 336797, 336121, 335201, 334199, 333239]
53133C33239q31o47o38j081j722j797r82OK35l08q73r59o58k05K05K75j48p29
53115C22382r91r58j013j222j380j541j942k414k486k075j597j324j173j128j274
53100B99864j422j214p32m06l12j54j6m00j265j729j170r5N89P08P36Q87R17O92
53082B95478M46L57K23k55r81j426j170l87L18N97N84L96j35r00j124k16J140
53065B92945J510L85j241k122k009j428p95k02K74N42O99R17J175J237R52M64
53049B93303J69L98J075J764K125K235K291K229J829J081K05o07j159j195p21
53034C05022k07j15l31m50m51o44j066j391j431j286j009n51m7K43K32nm26q45
53016B95242q63l98J3k1m4M41R01M82m24n62J89M81m15j439j341m02K54L78N85
$$ y = [333239, 332408, 331761, 331123, 330042, 328320, 326523, 325541, 325547, 325782, 325474, 324601, 323642, 322984, 322779, 322984, 323259, 323111, 322382, 321391, 320433, 319420, 318198, 316818, 315277, 313335, 310921, 308435, 306360, 304763, 303439, 302266, 301138, 299864, 298442, 297228, 296496, 296090, 295778, 295624, 295608, 295208, 293943, 292214, 291044, 290949, 291538, 292246, 292982, 293869, 294786, 295478, 295924, 296281, 296504, 296249, 295268, 293842, 292672, 292285, 292603, 293200, 293784, 294180, 294045, 293145, 292021, 291805, 292945, 294455, 294840, 293599, 291477, 289468, 288040, 287245, 287043, 287317, 287859, 288558, 289475, 290650, 291887, 292839, 293303, 293472, 293870, 294945, 296709, 298834, 301069, 303360, 305589, 307418, 308499, 308704, 308097, 306938, 305743, 305022, 304815, 304700, 304369, 303919, 303468, 302824, 301758, 300367, 298936, 297650, 296641, 296090, 296043, 296286, 296518, 296513, 296087, 295242, 294379, 293981, 293994, 293973, 293929, 294370, 295271, 295753, 295329, 294767, 294956, 295437, 295022, 293583, 292242, 291840, 292094, 292472, 293057]
52997B93057J078J333R09o6j100j548q77O72J881J645K27r93j016j14P44Q82L52
52980B97066l02n15j16N69J017R30M32n8j30K03N36N68N39Q35J345J583J357R29
52962C06788N39K17M9J41K79J28j80k31j29m23j131j604j579j573j843j751q48
52945B96849J03Pj010j784j643j008n10k30N2L38M58L96L36L87M01J88j00j1N59
52926B93778J048Q81K78j23k61n99j165j454j381j450j711j490n36L53N13L60
52910B87041N27P75N35k2l85o44j168j626j371n62k9j8M6M89R16R92J080J701
52892B88277K781L662L732K997K149J911K117J757L18j402k249k184k019k074
52878B99773j906j353r36r82j128r84o73l34L09J347K081J590r2j832k503k014
$$ y = [293057, 294135, 295468, 296377, 296311, 295211, 293663, 292786, 293458, 295339, 296984, 297211, 296218, 295202, 295088, 295832, 296714, 297066, 296764, 296249, 296133, 296702, 297719, 298649, 299081, 299023, 298893, 299096, 299632, 300200, 300739, 301574, 302919, 304502, 305859, 306788, 307327, 307544, 307593, 307734, 308013, 308141, 307961, 307730, 307601, 307178, 306047, 304443, 302864, 301291, 299448, 297697, 296849, 296952, 296959, 295949, 294165, 292522, 291514, 291004, 290774, 290826, 291164, 291622, 292018, 292354, 292741, 293142, 293330, 293230, 293219, 293778, 294826, 295707, 295985, 295862, 295601, 295002, 293837, 292383, 291002, 289552, 287841, 286351, 285815, 286168, 286681, 287041, 287568, 288343, 288878, 288856, 288471, 287827, 286659, 285033, 283662, 283100, 283071, 283053, 283099, 283588, 284504, 285496, 286576, 288277, 291058, 294720, 298452, 301449, 303598, 305509, 307626, 309383, 309701, 308299, 306050, 303866, 301847, 299773, 297867, 296514, 295578, 294596, 293468, 292484, 291811, 291477, 291786, 293133, 295214, 296804, 296712, 294880, 292377, 290363]
52862B90363j151n66j59M53J122J196M48m98q70o12j85J85O20J142J537J618J286
52845B95929M42p96j846k147j833j561j671j937k091k174k152j743q32K30R64
52830B76782J230J182J018R38J125J483J565R90j5p17o07R7P87J282K042L480
52814B92662N315O817P583P709P250N966L776J058j690m237o467q072q667q111
52800C00892o613m721l186k511k493k506k283k066j910j501q80p15j315j882j422
52785B64888j00R49J015M18j76n02o27o12l83J11O93R45O56K78M63J114J418J132
52767B71680J041J684K324K007J008L41J94m0m44l97J86N72L41l5j43l25r39j563
52749B77492j556j002n06k96K3Q07J786K283J934J152O83O94N85p7q60j112r52
$$ y = [290363, 289212, 288646, 288487, 288940, 290062, 291258, 291706, 291208, 290338, 289726, 289541, 289726, 290346, 291488, 293025, 294643, 295929, 296371, 295575, 293729, 291582, 289749, 288188, 286517, 284580, 282489, 280315, 278163, 276420, 275588, 275818, 276782, 278012, 279194, 280212, 281150, 282275, 283758, 285323, 286313, 286298, 285581, 284974, 285071, 285858, 287140, 289182, 292662, 297977, 304794, 312377, 320086, 327336, 333302, 337078, 338136, 336446, 332209, 325742, 317670, 309003, 300892, 294279, 289558, 286372, 283861, 281368, 278862, 276579, 274513, 272603, 271102, 270222, 269507, 268192, 266310, 264888, 264788, 265737, 266752, 267170, 266994, 266492, 265865, 265253, 264870, 264981, 265674, 266619, 267275, 267553, 268016, 269130, 270548, 271680, 272721, 274405, 276729, 278736, 279744, 280085, 280279, 280239, 279795, 279398, 279584, 280156, 280497, 280462, 280319, 279994, 279055, 277492, 275936, 274934, 274428, 274132, 274155, 274962, 276748, 279031, 280965, 282117, 282800, 283494, 284079, 284002, 283142, 282030, 281078]
52732B81078r20q81j08J423K632K585J628Q09N75M74k6q03j236r44k93p5o07j381
52714B83930j739j617j359j105q32o77o57l29O23J581J564N87l20n39n16o83o24
52697B77288J35J105J346P32R3J49P40J169J037N90L38L93L95J04j83p2L34O73
52679B86366R33J323J673J561J022N70M62M67M50N81Q59R99R39R08Q46L68m67
52662B99860r88q16l23J19O37J278J610J464J459K063K694K497J629R13M73l27
52646C14242j624k626k741k338k069j875j314m44J70L06L87P79J196J215J105
52631C04369J561K553L069K383J111M22M74L66m23j377j860j981k115k169j802
52616C04581j062l77j40n34j473k362k359j302q3L67K16K94P62R12L43l29k90
$$ y = [281078, 280158, 279277, 279169, 280592, 283224, 285809, 287437, 288246, 288821, 289295, 289269, 288466, 287230, 286286, 285993, 285918, 285311, 283930, 282191, 280574, 279215, 278110, 277278, 276601, 275944, 275615, 276238, 277819, 279383, 279970, 279650, 279111, 278595, 277912, 277288, 277423, 278528, 279874, 280606, 280699, 280848, 281588, 282757, 283794, 284384, 284722, 285115, 285510, 285614, 285431, 285359, 285693, 286366, 287299, 288622, 290295, 291856, 292878, 293448, 293910, 294377, 294827, 295408, 296267, 297266, 298205, 299113, 299959, 300327, 299860, 298872, 298056, 297733, 297852, 298489, 299767, 301377, 302841, 304300, 306363, 309057, 311554, 313183, 314096, 314569, 314242, 312618, 309992, 307251, 304913, 302844, 300969, 299655, 299211, 299381, 299687, 300074, 300853, 302049, 303264, 304369, 305930, 308483, 311552, 313935, 315046, 315468, 315942, 316308, 315885, 314508, 312648, 310667, 308552, 306383, 304581, 303519, 303142, 303002, 302468, 300995, 298633, 296274, 294972, 294889, 295256, 295472, 295766, 296528, 297440, 297783, 297454, 297164]
52599B97164L60P84N49J55L27J023J466J145M69K44O72J202J300J083J026J286
52583C10255J505J227M55k06p6Q23J680J818J479J407J800K191K308K409K670
52568C31745K785K444J764R63lj140k061k330j991j469j131j169j641k348k831
52553C21587k734k111j316o62l33l29m15l99m93j062j914k296j793q60j28L50
52537C05092Q28J247J345J131Q05M12k5k46q4J33k8m82p70p24n04j47M06Q44O59
52518C09892q3o28m26K83R99J678K525L319L455K694J572Q41P07P67N91J15m99
52501C27802j110j532j506j006m66l73o73r03q10n26j10N83J373J582P88m46r83
52484C21684k36J274K462K626J929J080N67L14J09J44O69J326J373P17J56L09
$$ y = [297164, 297524, 298308, 298857, 299012, 299339, 300362, 301828, 302973, 303442, 303686, 304358, 305560, 306860, 307943, 308969, 310255, 311760, 312987, 313442, 313236, 313160, 313983, 315663, 317481, 318960, 320367, 322167, 324358, 326666, 329075, 331745, 334530, 336974, 338738, 339701, 339698, 338558, 336497, 334167, 332176, 330707, 329576, 328407, 326766, 324418, 321587, 318853, 316742, 315426, 314764, 314431, 314102, 313687, 313288, 312795, 311733, 309819, 307523, 305730, 304870, 304742, 305092, 305920, 307167, 308512, 309643, 310448, 310860, 310835, 310589, 310505, 310638, 310610, 310128, 309358, 308634, 308130, 307983, 308389, 309233, 309892, 309809, 309181, 308755, 309038, 310037, 311715, 314240, 317559, 321014, 323708, 325280, 326121, 326828, 327595, 328186, 328301, 327802, 326692, 325160, 323654, 322648, 322182, 321809, 321136, 320233, 319423, 318897, 318787, 319370, 320743, 322325, 323113, 322667, 321684, 321448, 322722, 325184, 327810, 329739, 330819, 331386, 331700, 331809, 331953, 332622, 333948, 335321, 336038, 336194, 336503]
52468C36503Q49J141J178J369J701J774J523J282J131O78l18j506k380k868l214
52453C38843l380l010k093j316j381k010k140j279j86K02K5J05N78Q33O70N91
52437C25052P55N94j32p65p70n83p96j112r77o78r12j572j877j598j282j226j092
52420C11029o55k21JL28J088K125L098L872M376M446M110L788L962M786O111P665
52404C59909R045R740R497Q498P005M944K127j114l843n352n912o383p116p569
52390C73476p225o355n546m796l769k662k034j767j120j5O56M29Q7M13R53Q87
52374C41612N25Q10J764K489K610K620K732K429J492N63K88M55N18L70K06L4k55
52357C61262n14m62JP24J391J625J268O52L23M15O02P03R28J408J821J827J538
$$ y = [336503, 337352, 338493, 339671, 341040, 342741, 344515, 346038, 347320, 348451, 349129, 348811, 347305, 344925, 342057, 338843, 335463, 332453, 330360, 329044, 327663, 325653, 323513, 322234, 322048, 322250, 322275, 322380, 322958, 323791, 324461, 325052, 325807, 326401, 326269, 325504, 324734, 324151, 323355, 322243, 321266, 320588, 319676, 318104, 316227, 314629, 313347, 312121, 311029, 310374, 310153, 310154, 310482, 311570, 313695, 316793, 320665, 325041, 329487, 333597, 337385, 341347, 346133, 352244, 359909, 368954, 378694, 388191, 396689, 403694, 408638, 410765, 409651, 405808, 400456, 394544, 388161, 381045, 373476, 366251, 359896, 354350, 349554, 345785, 343123, 341089, 339322, 338202, 338187, 338843, 339272, 339359, 339772, 340725, 341612, 342137, 342947, 344711, 347200, 349810, 352430, 355162, 357591, 359083, 359646, 359934, 360389, 360907, 361277, 361483, 361517, 361262, 360748, 360286, 360287, 361011, 362402, 364027, 365295, 365947, 366270, 366685, 367287, 367990, 368918, 370326, 372147, 373974, 375512]
52340C75512J388J641K202K738K936K837K873L362L997M217M052M101M679N481
52326D22016O251P163Q207Q779Q422P587P068O969O783O312N926N889O017O122
52312E19511O321O764P364P966Q525Q974R290R734J0651J1786J2225J1504J0427
52299F41042J0217J0942J1454J0962R992R411R162Q567P577O820O497N938M593
52286G53174K889J773J679K243K816K977K717K278J805J099N5p99o92K57R22M99
52270G75692m88r82o70Q3J115K444L682M288M380M539M763M491L839L882N170
52255H16228O782P463P246P146P552P784P327O693O680P271P708P477O772O056
52241I16185N532N151M885M721M545M259L933L658L330K774K130J750J679J550
$$ y = [375512, 376900, 378541, 380743, 383481, 386417, 389254, 392127, 395489, 399486, 403703, 407755, 411856, 416535, 422016, 428267, 435430, 443637, 452416, 460838, 468425, 475493, 482462, 489245, 495557, 501483, 507372, 513389, 519511, 525832, 532596, 539960, 547926, 556451, 565425, 574715, 584449, 595100, 606886, 619111, 630615, 641042, 651259, 662201, 673655, 684617, 694609, 704020, 713182, 721749, 729326, 736146, 742643, 748581, 753174, 756063, 757836, 759515, 761758, 764574, 767551, 770268, 772546, 774351, 775450, 775505, 774706, 774014, 774271, 775193, 775692, 775204, 774222, 773552, 773635, 774750, 777194, 780876, 785164, 789544, 794083, 798846, 803337, 807176, 811058, 816228, 823010, 830473, 837719, 844865, 852417, 860201, 867528, 874221, 880901, 888172, 895880, 903357, 910129, 916185, 921717, 926868, 931753, 936474, 941019, 945278, 949211, 952869, 956199, 958973, 961103, 962853, 964532, 966082]
52227I66082J113N91K24j94j002k056k829l103l171l300l303k802j803p85j74
52212I43488K01R58K289L458L509K457J347R86J127J147J063J370K214L322M593
52197I73529O069P390P934P637P124O771O188M924L298K020J223L66q84k125k746
52182A028718k743k769l399m560n652o110n779m943m139l809m010m424m767m991
52168I66623n024m691m033l455l118k608j677r21r94j401j028J16Q17M72l7J62
52152I39203O37N75K00L69J290K434L292L528K881J592N03N3l63j322k250k256
52136I50366j595j227j325j318j157j360j827j759q59M09J803L540N410O702P257
52121I63060P662Q104Q007P226O661P112Q207Q987R117Q989R140R876J1121J2392
$$ y = [966082, 967195, 967786, 968010, 967816, 966814, 964758, 961929, 958826, 955655, 952355, 949052, 946250, 944447, 943662, 943488, 943689, 944647, 946936, 950394, 953903, 956360, 957707, 958693, 959820, 960967, 962030, 963400, 965614, 968936, 973529, 979598, 986988, 994922, 1002559, 1009683, 1016454, 1022642, 1027566, 1030864, 1032884, 1034107, 1034473, 1033589, 1031464, 1028718, 1025975, 1023206, 1019807, 1015247, 1009595, 1003485, 997706, 992763, 988624, 984815, 980805, 976381, 971614, 966623, 961599, 956908, 952875, 949420, 946302, 943694, 942017, 941096, 940102, 938701, 937673, 937789, 938606, 939078, 939041, 939203, 939840, 940415, 940615, 940984, 942274, 944708, 948000, 951528, 954409, 956001, 956504, 956557, 956194, 954872, 952622, 950366, 948771, 947544, 946219, 944901, 943744, 942384, 940557, 938798, 937939, 938348, 940151, 943691, 949101, 955803, 963060, 970722, 978826, 986833, 994059, 1000720, 1007832, 1016039, 1025026, 1034143, 1043132, 1052272, 1062148, 1073269, 1085661]
52107A085661J3244J3943J5179J7068J8904K0034K0414K0163J9244J7752J5979
52096A277585J3937J1368Q338N348K736N40j042j706j657j380q60J50J050P09
52082A315116q63k191k225j572j297j498j732k053k732l560m140m479m669m546
52068A277559m102l613k885j123J711M166M837M032L145K836K838L053L729M658
52054A300841N158M954M412L894L432L046K826K707K573K529K774L272L809M149
52040A350376L966L074J960J579K186K906K841K153J401M88j071l141m985o060
52026A357673o310n942n429n374n841o168n866n209m498l359j502M47J588J778
$$ y = [1085661, 1098905, 1112848, 1128027, 1145095, 1163999, 1184033, 1204447, 1224610, 1243854, 1261606, 1277585, 1291522, 1302890, 1311228, 1316576, 1319312, 1319852, 1318810, 1317104, 1315447, 1314067, 1313207, 1313357, 1314407, 1315116, 1314253, 1312062, 1309837, 1308265, 1306968, 1305470, 1303738, 1301685, 1298953, 1295393, 1291253, 1286774, 1282105, 1277559, 1273457, 1269844, 1266959, 1265836, 1267547, 1271713, 1276550, 1280582, 1283727, 1286563, 1289401, 1292454, 1296183, 1300841, 1305999, 1310953, 1315365, 1319259, 1322691, 1325737, 1328563, 1331270, 1333843, 1336372, 1339146, 1342418, 1346227, 1350376, 1354342, 1357416, 1359376, 1360955, 1363141, 1366047, 1368888, 1371041, 1372442, 1372930, 1371859, 1368718, 1363733, 1357673, 1351363, 1345421, 1339992, 1334618, 1328777, 1322609, 1316743, 1311534, 1307036, 1303677, 1302175, 1302622, 1304210, 1305988]
$$ [...]
##END NTUPLES=NMR SPECTRUM
##END=
