##TITLE=AC1714_3158_8749746_dLcrRJoP4r
##JCAMPDX= 6.0         $$ Bruker NMR JCAMP-DX V2.0
##DATA TYPE= NMR SPECTRUM
##DATA CLASS= NTUPLES
##ORIGIN= BRUKER
##OWNER= Administrator
$$ 1.72 TOPSPIN		Version 2.1
$$ 2015-08-08 01:53:50.141 -0700  Administrator@X
$$ Compression mode = diff/dup
##.OBSERVE FREQUENCY= 400.02188249412
##.OBSERVE NUCLEUS= ^1H
##.ACQUISITION MODE= SIMULTANEOUS (DQD)
##.ACQUISITION SCHEME= undefined
##.AVERAGES= 8
##.DIGITISER RES= 22
##SPECTROMETER/DATA SYSTEM= spect
##.PULSE SEQUENCE= zg30
##.SOLVENT NAME= COFFEE_meoh
##.SHIFT REFERENCE= INTERNAL, COFFEE_meoh, 1, 14.98509
##AUDIT TRAIL= $$ (NUMBER, WHEN, WHO, WHERE, PROCESS, VERSION, WHAT)
$$ ##TITLE= Audit trail, TOPSPIN		Version 2.1
$$ ##JCAMPDX= 5.01
$$ ##ORIGIN= Bruker BioSpin GmbH
$$ ##OWNER= Administrator
$$ $$ E:\/data/COFFEE/nmr/AC1714_3158_8749746_dLcrRJoP4r/40/pdata/1/auditp.txt
$$ ##AUDIT TRAIL=  $$ (NUMBER, WHEN, WHO, WHERE, PROCESS, VERSION, WHAT)
(   1,<2015-08-08 01:53:42.547 -0700>,<Administrator>,<X>,<go>,<TOPSPIN 2.1>,
      <created by zg
	started at 2015-08-08 01:52:36.844 -0700,
	POWCHK enabled, PULCHK disabled,
       configuration hash MD5:
       21 0F 79 D6 B3 7B B4 F6 88 20 88 DB 03 48 BD 9F
       data hash MD5: 64K
       A7 45 42 A7 F2 13 B8 D5 8D C2 F8 96 10 29 9A 6D>)
(   2,<2015-08-08 01:53:45.953 -0700>,<Administrator>,<X>,<proc1d>,<TOPSPIN 2.1>,
      <Start of raw data processing
       efp LB = 0 FT_mod = 6 PKNL = 1 PHC0 = 0 PHC1 = 0 SI = 32K 
       data hash MD5: 32K
       32 27 B0 1F 8F 75 1A 46 8B E5 55 39 38 D6 AB 65>)
(   3,<2015-08-08 01:53:46.266 -0700>,<Administrator>,<X>,<proc1d>,<TOPSPIN 2.1>,
      <pk PHC0 = 91.69739 PHC1 = 0 
       data hash MD5: 32K
       4F D8 B2 A2 2F AD 62 26 F1 8B EF 44 8B 41 FF F7>)
(   4,<2015-08-08 01:53:46.375 -0700>,<Administrator>,<X>,<proc1d>,<TOPSPIN 2.1>,
      <abs ABSG = 1 
       data hash MD5: 32K
       26 08 FE C5 18 CF 07 42 CC F5 ED C7 C8 67 5B 3C>)
(   5,<2015-08-08 01:53:46.438 -0700>,<Administrator>,<X>,<proc1d>,<TOPSPIN 2.1>,
      <abs ABSG = 2 
       data hash MD5: 32K
       CB A3 89 A0 CE 0D 7D C3 61 18 AD 21 8D 41 60 51>)
(   6,<2015-08-08 01:53:46.500 -0700>,<Administrator>,<X>,<proc1d>,<TOPSPIN 2.1>,
      <abs ABSG = 3 
       data hash MD5: 32K
       B6 D1 1F 9D 5B 86 B9 8F 15 B3 9F F0 79 2F 9B B9>)
(   7,<2015-08-08 01:53:46.563 -0700>,<Administrator>,<X>,<proc1d>,<TOPSPIN 2.1>,
      <abs ABSG = 4 
       data hash MD5: 32K
       16 0E CD 6B EB 6B AB 97 1A D4 2E C9 24 62 02 B1>)
(   8,<2015-08-08 01:53:46.625 -0700>,<Administrator>,<X>,<proc1d>,<TOPSPIN 2.1>,
      <abs ABSG = 5 
       data hash MD5: 32K
       03 7F 5F 54 8B 22 C8 70 07 01 22 D9 6C 99 74 DA>)
$$ ##END=
$$ 
$$ $$ hash MD5
$$ $$ CE 05 B4 73 07 87 A9 1C 5B B2 19 FA EE 8A 17 BF
##$RELAX= 
##$RELAX= 
##$RELAX= 
##$RELAX= 
##$RELAX= 
##$RELAX= 
##$RELAX= 
$$ Bruker specific parameters
$$ --------------------------
##$DU= <E:\>
##$EXPNO= 40
##$NAME= <AC1714_3158_8749746_dLcrRJoP4r>
##$PROCNO= 1
$$ [...]
150 150 150 150 150 150 150 150
##$TP07= 0
##$TPNAME0= <>
##$TPNAME1= <>
##$TPNAME2= <>
##$TPNAME3= <>
##$TPNAME4= <>
##$TPNAME5= <>
##$TPNAME6= <>
##$TPNAME7= <>
##$TPOAL= (0..7)
0.5 0.5 0.5 0.5 0.5 0.5 0.5 0.5
##$TPOFFS= (0..7)
0 0 0 0 0 0 0 0
##$TUNHIN= 0
##$TUNHOUT= 0
##$TUNXOUT= 0
##$USERA1= <user>
##$USERA2= <user>
##$USERA3= <user>
##$USERA4= <user>
##$USERA5= <user>
##$V9= 5
##$VALIST= <valist>
##$VCLIST= <CCCCCCCCCCCCCCC>
##$VD= 0
##$VDLIST= <DDDDDDDDDDDDDDD>
##$VPLIST= <PPPPPPPPPPPPPPP>
##$VTLIST= <TTTTTTTTTTTTTTT>
##$WBST= 2048
##$WBSW= 25
##$XGAIN= (0..3)
0 0 0 0
##$XL= 0
##$YL= 0
##$YMAX_a= 601470
##$YMIN_a= -512948
##$ZGOPTNS= <>
##$ZL1= 120
##$ZL2= 120
##$ZL3= 120
##$ZL4= 120
##$ABSF1= 14.98509
##$ABSF2= -5.573092
##$ABSG= 5
##$ABSL= 3
##$ALPHA= 0
##$AQORDER= 0
##$ASSFAC= 0
##$ASSFACI= 0
##$ASSFACX= 0
##$ASSWID= 0
##$AUNMP= <proc_prof1d_extract_pilot.lims>
##$AXLEFT= 0
##$AXNAME= <>
##$AXNUC= <1H>
##$AXRIGHT= 0
##$AXTYPE= 0
##$AXUNIT= <>
##$AZFE= 0.1
##$AZFW= 0.1
##$BCFW= 0
##$BC_mod= 0
##$BYTORDP= 0
##$COROFFS= 0
##$CY= 15
##$DATMOD= 1
##$DC= 0
##$DFILT= <>
##$DTYPP= 0
##$F1P= 0
##$F2P= 0
##$FCOR= 0.5
##$FTSIZE= 32768
##$FT_mod= 6
##$GAMMA= 0
##$GB= 0
##$INTBC= 1
##$INTSCL= 1
##$ISEN= 128
##$LB= 0
##$LEV0= 0
##$LPBIN= 0
##$MAXI= 10000
##$MC2= 0
##$MEAN= 0
##$ME_mod= 0
##$MI= 0
##$NCOEF= 0
##$NC_proc= -8
##$NLEV= 6
##$NOISF1= 0
##$NOISF2= 0
##$NSP= 0
##$NTH_PI= 0
##$NZP= 0
##$OFFSET= 14.98509
##$PC= 1
##$PHC0= 91.69739
##$PHC1= 0
##$PH_mod= 1
##$PKNL= yes
##$PPARMOD= 0
##$PPDIAG= 0
##$PPIPTYP= 0
##$PPMPNUM= 2147483647
##$PPRESOL= 1
##$PSCAL= 4
##$PSIGN= 0
##$PYNMP= <proc.py>
##$REVERSE= no
##$SF= 400.02
##$SI= 32768
##$SIGF1= 0
##$SIGF2= 0
##$SINO= 400
##$SIOLD= 32768
##$SPECTYP= <>
##$SREGLST= <1H.CDCl3>
##$SSB= 0
##$STSI= 32768
##$STSR= 0
##$SW_p= 8223.68421052631
##$SYMM= 0
##$S_DEV= 0
##$TDeff= 65536
##$TDoff= 0
##$TI= <>
##$TILT= no
##$TM1= 0
##$TM2= 0
##$TOPLEV= 0
##$USERP1= <user>
##$USERP2= <user>
##$USERP3= <user>
##$USERP4= <user>
##$USERP5= <user>
##$WDW= 1
##$XDIM= 32768
##$YMAX_p= 443972905
##$YMIN_p= -692231
##$CURPLOT= <Network HP LaserJet P1505>
##$CURPRIN= <$Network HP LaserJet P1505>
##$DFORMAT= <normdp>
##$LAYOUT= <+/1D_H.xwp>
##$LFORMAT= <normlp>
##$PFORMAT= <normpl>
##$SURQMSG= 1
$$ End of Bruker specific parameters
$$ ---------------------------------
##NTUPLES= NMR SPECTRUM
##VAR_NAME=  FREQUENCY,     SPECTRUM/REAL,   SPECTRUM/IMAG
##SYMBOL=    X,             R,               I
##VAR_TYPE=  INDEPENDENT,   DEPENDENT,       DEPENDENT
##VAR_FORM=  AFFN,          ASDF,            ASDF
##VAR_DIM=   32768,         32768,           32768
##UNITS=     HZ,            ARBITRARY UNITS, ARBITRARY UNITS
##FACTOR=    0.250966925370066, 1,           1
##FIRST=     8223.43324360094, -211313,      -128372
##LAST=      0,             1113,            -204461
##MIN=       0,             -692231,         0
##MAX=       8223.43324360094, 443972905,    0
$$ Real data points
##PAGE= N=1
##DATA TABLE= (X++(R..R)), XYDATA
$$ [...]
23851 -110228 429832 -68805 -152696 -219684 -90413 -285070 313125 245350 392239 -311335
23840 -203262 7793 170810 167958 -194452 87324 -111072 204137 127431 263719 -141667 158175
23828 -337909 112459 -85214 -121904 179874 113210 -227791 -151681 -184287 317757 189837
23818 189837 70778 246033 101200 130103 181169 332994 145621 117389 -19903 108062
23807 -34312 -159133 -107375 -116978 322947 138510 -39902 -65813 -94810 390161 21366 -41384
23795 215760 -192815 -119949 174912 20604 85324 -41108 319662 122774 -100291 57944
23784 -180830 -72198 229527 -46435 -99020 91435 -34808 -63058 -99022 -214414 -44101 54459
23772 12872 -142334 -329925 -320445 17669 131697 -5288 -84552 -126738 -29091 216062 -89053
23760 118984 -290867 5877 -34653 -331132 -29190 19974 43833 206843 -144209 -131104 205352
23748 122196 -45694 -66212 97913 188916 -133713 143962 -146991 12308 -352704 222065
23737 -10579 58043 69441 -117946 92892 -148793 -275247 -116480 201564 15173 -140389
23726 -51829 -401205 71785 211846 -3023 -38488 -257516 234344 223129 -305923 176211 -160305
23714 112979 209266 -52891 61638 84949 -39044 -244379 42812 67526 -101304 -9870 -240763
23703 -240763 -171095 88699 -149854 -92514 -100703 5928 -178538 -21890 211667 -22670 209711
23691 -25811 84716 -168063 72939 -341504 149996 1395 18077 13140 -114360 10851 118200
23680 118200 -211639 -32345 44828 -114724 -128351 105125 -328472 -115391 -201881 -176100
23670 -176100 -58897 -47442 -429206 213838 35963 60634 78322 46840 -27450 117351 -101965
23658 12089 -219640 79796 122525 215045 72251 -94217 37870 127286 65919 114477 380620
23647 380620 -49417 -268167 -79106 28535 116435 248178 -30377 -130799 -68157 -240786 91814
23635 -94642 265338 199092 -189233 -36675 -99174 -78668 221536 86574 -69046 251350 -151382
23623 -49438 87964 82453 71768 -188831 68149 246986 34044 -75172 304383 136381 -366239
23611 176211 -104096 30293 26546 149600 162316 107313 148167 -71750 103807 -198676 -263076
23600 -263076 -42763 72479 328748 193394 143898 -143837 -229808 -141449 -160031 -673856 -87679
23588 -150013 -80591 -37568 11540 102571 54279 -127078 91193 -200927 -69798 -54296 -169024
23577 -169024 236390 331154 -218557 42470 -184721 82834 229863 -296982 113964 -228826
23566 -151284 -2972 231419 117604 296671 110687 -430294 -444288 120280 103711 -164999
23555 144910 -88775 -173941 -509835 -77569 -226880 -332655 313524 103421 185008 -311374
23544 -186073 -125131 -89279 -296966 64966 28435 -428789 -161202 195667 40725 79526 -198039
23532 87146 97407 3985 288861 353522 -187577 -306378 -166395 111373 -142636 -176246 -86645
23520 -30752 -311360 -93234 172003 5533 25890 384861 -107811 -328073 -30493 -54892 -397073
23509 -397073 -145393 10980 -40442 211534 140379 -68554 -223809 -393546 -205985 114553
23498 -115534 -60285 -38588 247017 -102611 50418 -327084 -109552 124912 68995 27179
23487 -3941 381461 56321 220954 -28316 48443 -109511 50451 250831 30571 -155388 -46477
23475 -15284 -284199 -13682 -42216 -51249 -132842 40102 77647 -117952 -146048 -232526 6862 -2151
23462 -298440 167620 -140483 -24193 -136469 112969 -28170 27119 35706 251013 -67574 73571
23450 19769 140700 -129802 -71376 120657 29861 -116938 -210428 -137802 109629 56151 63950
23439 63950 100584 -136732 2275 -69310 219080 1019 -126448 -69619 106551 -50485 208104
23427 111385 180094 -36016 283257 -10516 58062 -91941 -261685 -31976 -28074 -53878 -4052
23415 -266327 -71067 -308005 175061 123473 -2217 193105 -83925 57957 172606 -63529 109891
23403 -1366 199131 356840 -163385 65591 312292 45639 -185108 381326 -191990 -262921
23393 -262921 -272250 158550 169942 -116892 234066 -269213 305283 -331814 -224688 318206
23382 -130134 128198 422442 -122210 -15395 110255 -10795 -10065 -196973 -88145 -91261 146306
23370 -109442 62143 59046 336121 -103235 104179 -368421 -227514 -40389 -186341 176840
23359 226379 -142507 95052 -148451 -376806 49733 135535 -49617 228764 112922 -106457
23348 -84446 -113051 252395 186656 -71512 -323174 21961 -37950 -234136 -129677 147084 -229831
23336 -41279 -69145 -90384 304069 -45924 -165327 352184 -146213 60953 -126076 -386406
23326 -386406 -82840 -18849 -49613 -134163 280983 -353338 25528 83100 85398 -12309 10451
23314 -72871 124239 163849 61366 -102257 -252909 -50932 43882 -117336 -173789 -125857 133256
23302 81772 55229 -208031 -284787 -58321 110428 -508799 -109138 20469 -240850 -218637 -134189
23291 -134189 -180873 48110 -27364 37401 2064 188570 -10249 -18440 71429 -14129 299854
23279 162681 81 174023 -76716 282116 -190759 -96511 -233801 -274695 -98832 110145 35370
23267 141771 -13406 -50668 -67465 -17168 -34616 -275708 -298503 -113755 90478 -9276 39436
23255 -14455 -75435 -86559 20208 -205292 732 277484 -71484 -186117 27888 268930 84106
23243 -37873 -234253 -180325 -69168 93318 26534 259847 116549 198040 -137873 67955 12600
23231 68313 326892 -162952 210966 -148370 -165039 111522 -243757 42607 -294509 63271
23220 -67790 -133536 -17199 -148519 -63097 -95227 21909 428685 -100697 -3184 19231 76625
23209 76625 -95101 -190774 18344 135780 74527 -108396 -50287 188402 -11526 23213 -365278
23197 -95825 295841 -120088 127695 -16017 -250777 272008 -124949 -50756 41072 112509
23187 112509 -122081 -212067 28986 -125551 155337 98911 -295958 -138988 -310210 -317361
23177 -317361 -108722 -421227 197007 -381850 151312 -101152 31278 27934 -76663 -239614
23167 -239614 17382 76010 -100837 -90030 -25521 -7754 -244461 132937 -218384 -104712 251069
23155 -128666 -93063 68476 54082 148312 -238652 -23884 434098 -12838 -262536 -435903 -57868
23143 -247831 82177 -23795 -65135 221483 53684 60702 -122357 -55114 -141897 27860 -3761
23131 -63010 5211 126364 -241037 85633 -105105 -149358 58994 421161 -114971 179384 -105737
23119 -68551 125391 -160135 -251735 108695 -122637 166102 -134192 49954 -169668 -147323
23109 -147323 86842 -189325 -123392 221755 4147 -124368 -195104 198570 -113867 -46222 -37040
23098 -37040 -59324 184447 -22404 90587 -9807 -350538 -57399 119092 -257077 -122969 -48246
23086 -58796 483231 -40041 84257 -28256 167717 -8883 -57541 -27392 -169905 -55688 -90505
23075 -90505 224860 196232 363029 -297795 10264 -59371 -20800 157929 -172670 -163375 19791
23063 -196663 223689 42946 -8550 -6604 156464 -146801 -92100 -18849 140990 95102 -193854
23051 28391 159986 -456837 -190763 120734 202245 236364 -29443 43614 104001 -217284 151251
23039 31561 70992 59803 5617 109600 46213 -51283 -54353 188155 200898 232550 -208491
23027 -154529 -34806 -173445 58024 198394 18889 364061 -283574 -181235 -270934 -3857 -9687
23016 -9687 -163461 -85117 55814 -95707 152169 20510 44072 110093 -99796 1864 -139374
23004 -90449 5102 -124188 63046 -248092 -5298 12315 171694 -225174 211350 204260 2179
22992 61197 128367 -308694 -386150 96219 17846 -297176 -66532 -45440 159383 39775 234239
22981 234239 15424 71239 -183484 -48673 -76251 -104445 -31683 -175493 -262039 181113 -261567
22969 -132857 172215 110691 28440 23292 23720 -98817 68585 132402 -122621 196837 -68081
22957 122741 -355324 42047 -184495 -127211 -147277 -31718 -118419 2830 -235067 -34972 -25002
22946 -25002 -185756 -61775 -61973 6991 -309797 -92756 4457 -158022 -326327 -132220 -121257
22935 -121257 -28761 -28365 -247826 -145572 13904 -119670 -69563 -101531 -6540 -168449 196751
22923 -27217 283248 -26100 -162171 -134730 21771 236317 55410 -7891 -462330 134712 112887
22912 112887 -125062 30496 98776 87085 -82681 125241 76803 -122941 -160961 234471 65421
22900 -124559 -55447 -255813 -148109 -189452 -71296 154878 -61378 76169 331509 123870
22889 32310 56530 -144123 -179300 81883 167936 71931 -430728 -160547 -213888 -226557 114131
22877 158705 141587 -162299 335056 -6629 77629 -112265 37474 41157 94525 -3883 65908
22865 192098 -127657 -104284 -324221 -207894 -116184 -11945 238868 132085 362547 -76263
22854 -171169 -18866 -351810 -213008 -107407 -122488 -6461 126584 -59815 -60367 -67356 -26572
22842 244232 -58946 48429 53021 360790 -76336 -77026 -141532 133546 -179603 -91502 -67388
22831 -67388 -79981 -58667 -25090 145147 286858 -5394 266851 -428 -182284 -55835 37131
22819 -188337 12976 162166 -87672 -234635 -45809 -95172 -35284 246026 -96757 281383 -281960
22807 -4864 339575 -57218 -105507 226331 2048 -84239 -86404 55232 57548 -37179 83240 189186
22795 189186 65455 -116622 11722 198147 292606 137785 -107077 115842 92694 -65721
22784 -136067 -96880 -200560 76786 -591113 -153530 -14800 108796 -73046 -140143 203187
22773 256982 87779 113969 -23836 143754 -139960 -252767 211126 -185850 -433437 -500503
22763 -500503 234348 86390 51450 84242 -184206 49877 -160923 60703 86070 -176370 -81719
22751 352839 -54599 239986 -75720 -268126 67665 -4741 -206446 -188920 -52262 -268759 223464
22739 -10901 101849 -172436 -121722 -363391 -281448 89153 -104126 172922 -265595 -318685
22729 -318685 -93467 -94980 -133274 -204967 -44642 243408 -181291 -112807 -39196 -270979 -174181
22718 -174181 -2526 -179020 85918 -294193 186032 -218648 149416 248504 38632 146759
22708 146759 -211894 -59036 75445 -84032 76790 71650 -126385 167602 -11946 -380093 -344808
22697 -344808 93548 58941 64171 217787 142995 -91593 -24664 -159682 72275 -39975 -243829
22686 -243829 1398 133209 46287 -15189 248399 -87978 -205512 -69211 123838 -235424 74411
22674 -157156 -235744 361098 -447512 47922 199474 -84234 -153579 -162543 -64308 106248 -103514
22662 -367628 -130565 -107894 -409896 -224299 109566 189684 -62577 39265 -95474 14096 -243340
22650 109386 -50666 -124405 197200 -77600 -55377 -59855 24388 184947 -75950 22148 -121278
22638 -159216 -93475 233518 23445 -42752 104813 80509 228934 224980 -286311 -42663 -84518
22627 -84518 -21831 170989 -333785 -37713 -221242 -95453 15319 150760 65498 42307 -175158
22615 -202604 263132 -20738 -168692 5954 -262183 18403 394876 -101465 -229101 337351
22604 70753 -21177 175020 75861 -113907 146234 8350 49154 234187 109841 168610 -358290
22592 -120208 179185 -42007 45740 193853 -96093 167486 -146556 316406 6676 -23502 -114385
22581 -114385 -188442 -232347 73644 29940 92452 -43469 -121996 -420278 -389090 147008 -143138
22569 191689 359512 130525 253865 -130848 22351 -192406 -32022 28540 -80411 73957
22558 40419 87830 -310556 -528275 -117002 24825 -60857 -57081 -76023 69959 97704 -16998
22546 13038 319403 142074 -87967 134568 60705 -239077 -169133 64044 -211143 17409 294557
22535 294557 -17285 -3461 -13467 -264924 -55214 10213 -113900 -33387 128486 -17214 -326086
22524 -326086 -77398 -27321 -166688 -168052 -89286 135445 -65768 -79738 266379 1941 169274
22513 169274 -347687 -180683 126658 211941 -65770 93613 167426 434434 -5964 81343 -126370
22501 64379 -59517 -209652 -133774 2314 -49674 -296121 38246 9744 -109253 -107486 109505
22489 -190707 231444 97492 -255262 -20153 -121999 -115408 -43126 -64487 -53628 139659 159638
22478 159638 -68369 -286509 -3125 195805 -324569 -34650 334501 -57124 31140 228793 -16922
22466 -11839 79729 150993 403234 -28008 -139350 140003 -263780 -180389 264578 -151841
22455 -149878 19229 -136325 280476 30698 170281 -93688 -144311 1177 49066 147492 -219153
22443 -151749 14095 -1631 -21704 -208128 -95724 -37466 27129 67386 -77080 143361 144926
22432 144926 -100962 -26051 45063 264113 -164283 -89202 -278286 -237546 20941 -114470
22421 -148569 -80089 102005 80795 9333 216685 107897 -10874 -235405 -227195 -107411 78575
22409 -134063 -30853 -89289 224711 162153 -17460 -218335 -100981 -164100 164389 -305488
22398 -152648 14293 -206950 -97956 -82961 232892 38808 -150878 -5319 155611 4307 372919
22387 372919 -167367 -248632 -63071 18236 -32197 -174144 105764 -83573 -254944 -195714 -124942
22376 -124942 -370011 -219549 -143435 280584 -13546 217975 -8308 176575 71666 261205
22366 261205 -190578 149460 151282 -151926 -18814 -269289 -146665 -45044 -261053 45707
22355 -138472 35035 -15055 161423 -185979 -49791 -162507 60098 -161100 91645 -126270
22344 34724 3352 -100512 -228329 161584 -484148 -225716 -314548 -303398 -109190 85575 -367092
22332 257120 389842 -278455 231987 -172715 -46365 57932 -234679 85730 -40587 -125339
22322 -125339 -270869 -279733 238546 84003 -87854 1390 -90563 -293023 -120113 258302 -123296
22310 37757 -211148 189656 -103192 -12674 351600 -136846 91804 -243754 131468 138948
22300 138948 60837 -179863 63038 -41698 -259890 126836 -199843 29450 -113630 172406
22289 -196240 -394323 -94674 72583 7418 188006 -104 -2907 -151911 52127 80077 -522 2003
22276 -30477 19215 -111101 -323594 -28092 -436114 -46916 -310418 -370693 155396 24007 125877
22265 125877 321344 572552 178533 -117051 -16970 -105556 89808 -307447 -170996 136668
22254 122366 -55812 67816 -132488 -21558 -108630 -102146 -25522 -209323 -82163 294643 210178
22243 210178 -26527 -149894 159723 -54824 217981 -146152 39406 -420904 -99329 151425
22232 -135319 239355 191911 -133654 -44389 140826 -83644 -194060 -356406 -226746 441316
22221 71081 -165443 26569 -195825 27987 -174313 -202001 -108806 -102887 33023 53195 30027
22210 30027 -75656 -217902 58208 174098 -236784 -58058 -82615 -62549 85064 -151122 -328503
22199 -328503 -235064 -46574 5916 151260 -295782 -214392 -71072 251791 -81320 -431674 -144529
22187 352700 156944 1276 -94707 -150261 -27640 368969 -388890 134511 436332 -104252
22176 -151933 -301199 68886 118044 91515 51835 94203 240291 38348 -220709 -82567 -178465
22165 -178465 55165 142996 -10732 -172554 -65178 -67949 94256 -54555 160461 -127062 32915
22153 -10956 -12759 -178260 -106375 -338805 -43395 -112824 -185538 -81423 -403903 72827 -297731
22141 -4582 -250858 257667 -287934 -114731 29220 36646 -121136 -210441 -11407 -16101 15816
22129 -37570 6494 -295188 -214201 214821 70411 -167321 24576 -115816 -382813 183784 -21295
22117 -135359 293700 54548 -169878 -285610 -159856 -190468 -320555 37552 69926 13585
22106 -70425 -39433 -250574 386158 99416 95188 63227 113175 13103 -91450 29202 30909 -188446
22093 63256 -70713 31835 -192118 -107408 423 -227473 88755 83101 -72937 -167284 486437 -130653
22080 253889 81262 34620 245571 -67684 12649 98506 119012 -138712 209935 -3179 -163370
22069 -163370 43524 8657 324205 -209562 95590 -101590 81540 -267305 -190544 -89664 -255249
22058 -255249 196949 -7901 127297 234985 196025 -81441 -41246 108803 -598 -181423 -41398
22046 -165537 88449 -236633 -83633 -11015 -13090 73893 -148750 -226076 -156233 -36103 234640
22034 32537 -40057 -127233 27989 -66005 42178 -147048 -153609 75950 -158202 -30541 -413473
22023 -413473 -54265 9746 -6693 -9519 -30755 -62820 77288 -80818 -309885 -202264 52283 -96704
22010 -71466 296519 -452441 -212765 244459 -52950 -21559 182159 35489 -54968 84758 -239766
21998 -25804 -1878 -76115 199042 -244424 -389865 -412303 -158841 -1754 -129142 -50028 79213
21986 -405975 110078 173564 -57519 -34107 -167836 -62151 28161 -72448 -190019 -52542 -79042
21975 -79042 159948 -263925 218248 6325 120279 22144 -171163 -114811 -116036 -251584 25443
21963 16244 54605 -124193 -277835 -217055 -66478 -31686 -133367 205622 -199677 -204350 17058
21951 -34337 -180337 -171607 173822 122139 -141888 -121013 194300 -131617 56639 -16620 143161
21939 -2184 67617 -119063 -326025 -280430 22430 -86455 91603 37128 130838 -503091 3445
21927 52888 36370 113459 -247232 -176644 -60427 -58536 1572 -159273 -254457 -73059 244152
21915 56730 -124000 -69207 46833 -54514 -10626 -23757 -200748 -77662 241353 76269 -286448
21903 -93991 305118 -97630 -69320 -208950 -179477 -33584 -198569 51075 -352401 34271 46999
21892 46999 28814 -124221 -114604 -56468 102499 -305684 -351101 -47475 -250162 105255 15819
21880 -44554 243572 10721 296237 64949 138255 210911 -470698 -157818 -32728 16908 80335
21869 80335 -225196 -5979 244668 106512 -183773 86438 -99160 47310 14493 -216222 24591
21857 197199 127615 -34104 302507 -124831 -103680 342408 -246311 -13500 256772 -58657
21846 -57878 117915 232979 191543 16577 -186821 -82029 176987 -124201 -141593 80637 -91852
21834 -72332 -16052 837 -146446 -32911 -40337 -132090 -87184 153444 -104347 -121588 184603
21822 34998 -288843 102922 -42412 160186 -107834 327809 198131 145885 -139281 -48627
21811 -125264 70305 -5537 -67855 93975 -360853 -139419 -71148 -26410 -248895 -183432 -31187
21799 -349702 -68123 42399 286781 -267369 -47167 54800 -166774 95778 -238257 -39091 -88002
21788 -88002 97580 -15333 113237 -186444 76886 -6432 -12828 -182322 234677 106780 -76341
21776 -59374 -29794 19856 78589 -248559 -349347 109930 -247695 -85904 36928 189790 -29847
21764 62540 48754 -10514 209439 80797 -293744 170705 -114815 -106186 28676 -115102 -185387
21753 -185387 71548 72306 85163 435073 -261849 45994 -52257 -15334 -91589 -91757 -142795 50575
21740 -310107 25925 -194213 -233931 58618 -3578 43564 23282 -137481 -80359 -6358 -24586
21729 -24586 229982 -480549 -43861 -167853 -274700 318222 -207625 -119470 -234721 10731
21718 -208745 -116053 87057 -2855 -99192 9256 463589 -77328 9993 210786 -55167 -1733 -2819
21706 -2819 -257460 -80209 -72363 -83848 -104257 -26694 -242005 42288 -17750 -47976 -61473 -75904
21694 -75904 33056 46440 -26356 -72344 193043 344351 106923 -252551 -47306 -223135 276410
21682 -39136 -42923 -107145 -116711 -96696 -167585 -166775 -383842 182095 -31974 214217 -146679 -106883
21670 -106883 66038 -67755 51521 104533 269071 245336 -217533 -175108 86648 -139564 25182
21658 -119987 -223293 -8300 -23833 1993 -189364 -271992 331505 55206 303101 107406 187292
21647 187292 189872 -144322 -103722 209635 131774 173247 -427335 -191488 -256798 -23315 -149343
21636 -149343 -123308 122145 -76568 19818 236924 -99338 186541 -120196 -1515 -219769 -15571
21624 -169226 -90499 -49801 232133 -288329 -171740 -408412 -9880 -18 -122062 -47478 -11335
21612 107715 48573 -268594 99382 46029 57731 9488 141577 -133122 -20379 -97993 31199
21600 9954 40472 167398 149019 35164 -1962 -124167 83599 -248166 340772 -268576 -356810
21589 -356810 33597 -231429 -252825 167994 28165 20422 -160050 -165239 -146215 177927 333120
21578 333120 -109184 -102890 -24994 -585 -84581 -83329 1064 -50016 -126900 -157153 90287 -110505
21565 -220401 -170418 -63827 -26783 -5099 -170591 -159773 135576 -258281 165278 -480996 8251
21553 127320 288665 -152606 -188561 -152923 14798 189443 65107 139693 78278 254342 -259622
21541 -66153 -207726 131426 210676 214033 -261538 -63827 -256023 -252552 91015 30914 -71636
21529 -62914 -202038 17099 85037 -824 -95457 -116560 64013 -143171 96931 -134874 -216507
21518 -216507 -141063 -112250 -274740 109392 -104828 -278466 79283 34405 -154554 44531
21507 47 -51208 -51352 50041 241429 -32770 -157434 2479 261953 -174047 -20225 -305897 -87101
21494 -288527 20105 -206988 -452739 -57177 -270834 83884 182898 -2900 -308970 25711 -27523
21482 -259901 37191 -96939 67194 83207 337956 -227717 -51190 -42862 -26213 155037 -174350
21470 -21104 -214708 121037 -4004 182010 43974 450377 210520 111115 -192747 -181831 -73218
21458 137569 4736 111643 -77385 -262888 -107039 426040 196619 94710 -271906 -50977
21447 -89813 -99750 -9404 -135256 181161 -120555 21250 338375 221404 105809 367024 19311
21435 82936 551693 403902 24183 -223712 -374004 142009 -249509 301129 142463 74228
21425 74228 4474 156531 -198609 180713 171941 214024 -214214 -229559 -153773 114063 -15667
21413 102875 3757 -295723 81605 27678 67719 -155334 40178 139493 -184563 151021 -227639
21401 -158977 108531 -332524 195159 44766 -43167 141707 16603 53290 -376092 22507
21390 18705 -268708 70717 151761 -96543 238477 -289124 60037 60816 189122 -50401 174165
21378 46634 -387527 17881 17110 129840 -46653 65572 -25365 -106664 97649 -246063 -30219
21366 -40183 -254115 -292092 11587 195890 122081 -27565 -180731 -46116 -59566 -202232 -202804
21355 -202804 -77094 -161285 -308100 -241849 -47645 262350 -187996 138565 -81784 -11664 132465
21343 146016 30253 -62997 -44108 315896 -76516 -389014 89244 -144548 299393 130296
21332 -67698 -161973 22174 -12456 -155076 -69192 -13490 27788 -88155 -251645 165668 -110290
21320 -27467 -229853 67638 -163082 -182107 -290238 154518 115053 27486 100105 -139957 -199160
21309 -199160 3365 -62112 -36380 -114486 -283959 -196724 -10625 307090 -12566 -40388 251555
21297 21946 -241901 -153402 -283782 51608 130009 193975 -342304 99183 147808 -97171 -268065
21286 -268065 -275913 -233581 209741 262172 76524 -23176 -157177 191412 350240 -55653 -99069
21275 -99069 182545 208247 -69274 -229697 -4471 -172712 -348021 -31865 -268752 -185620 69508
21263 -101495 -6244 -92083 -242145 -42612 54493 94446 276239 271167 -5235 6284 -498693 -411486
21251 -411486 -268024 143498 212658 -252231 -86718 -94825 199004 -5460 160799 -326890 -88548
21239 -166393 -100410 -108091 209087 -85028 -223355 -155672 10595 170189 44643 40311 5885
21227 -237711 17769 -422880 -312376 -33936 -437580 126130 -132858 47417 -103044 -16261
21216 130265 -267531 35538 82419 -153914 23091 -31126 118060 73590 29797 217493 111919
21205 111919 -219092 51435 -22926 66614 -11119 -10988 -175430 -88978 -20794 -126785 -111536
21194 -111536 100191 -10596 123969 -28768 -240542 95661 172579 -216431 -39126 -163401
21184 -163401 109353 206195 -158698 172158 -223 90256 -176357 36443 -1510 -88629 21370
21172 -105654 -109493 80900 120772 -11499 -98767 39811 123577 76087 -390829 97414 -31410
21160 140620 -153420 -293241 -25354 -79892 28154 -185732 -191036 -169276 17414 -403110 36570
21148 26735 289952 182194 -1333 80872 47435 228417 -95961 -133496 -227261 107863 -210545
21136 -107604 -190873 -283365 -155171 76985 47333 -25084 230582 31257 28653 -160779 79902
21124 -118651 -264900 186315 190049 -138077 -167420 87857 -33817 -29815 117993 61704 236702
21113 236702 -80350 -41720 -113215 -119173 -90942 -268225 119312 130703 -124960 190702 60776
21101 -116959 -134314 -72595 -179040 -188794 213804 -176694 221381 179128 -6503 39581 162775
21090 162775 -251807 176422 -252271 163081 -23404 -373728 -96720 127019 -57244 -20728
21079 -187730 67632 21946 14199 -352255 -194106 88756 -82696 -67211 201014 298727 274000
21068 274000 -98255 -61617 125299 330880 -149431 -324389 182739 -161373 -152408 -27547
21057 -330048 282602 10309 122346 -91756 25165 -295187 -26069 -453809 -181854 195283
21046 -253139 175069 -215871 19275 -228985 -47576 -75115 30903 -87351 -165372 3549 -242542
21034 -74983 -256035 -222706 -25067 203640 -97978 142762 -60337 121123 -304134 -132297
21023 -21231 -76451 -251460 -16567 -242421 -193613 -143304 139324 -111053 183355 197954 -334030
21011 -39368 -202063 -185809 -224329 -116831 14500 269307 -102131 56849 -90358 -106666 -32539
20999 -77183 266067 235504 129230 -119930 -178627 -15078 -130504 -256245 -92342 20940 -120859
20987 -18841 9706 198378 -211562 -72284 18393 156371 -155171 59789 -413859 -308196 -226199
20976 -226199 -162961 -12387 357420 -248893 93169 -385382 -96499 185807 146915 -243208
20965 -80990 -230342 -53529 73246 54212 55596 322773 300368 -21692 -156021 -111747 118856
20953 383234 -53175 -216709 -118098 -54312 60824 -120610 20748 -159252 -456671 53405 -383026
20941 59009 142763 -222117 -288818 85351 319783 2140 87294 53667 -363915 -238947 -293069
20930 -293069 180268 149030 9868 59958 -112086 210608 -341904 -90127 -368095 69620 -63234
20918 -184136 -26490 -193935 -121994 -388536 -58082 75770 24424 25839 -40528 -62986 -195912
20907 -195912 55248 -216952 -210841 102678 -210316 60035 -61002 -240718 -102444 -191495 -53835
20895 103664 70690 -207167 221627 787 24462 249778 -176390 -70500 -47569 -56936 -156188
20884 -156188 -50127 126592 -264645 -288170 73136 58376 -215584 197411 -113445 -189756
20874 -189756 -196910 -203779 168386 -222135 -122161 -115211 -170539 181486 -205224 35382 -163329
20862 96010 -73147 95420 -172604 19554 86690 83654 25727 -102033 109036 -1556 36729
20850 -55704 -286780 264549 -311899 4238 214152 -27343 104050 5341 -277471 -10314 -412412
20839 -412412 -241583 5446 141602 -360465 -144964 64110 -269591 77075 80187 -56665 -158483
20828 -158483 -136465 -309672 109301 -286559 171854 -285687 -80553 14418 10290 -95362 177978
20816 -115790 -29425 89635 -43711 -299564 -122723 70983 -117809 -67831 -20205 243847 59468
20804 237122 315661 -121371 438428 -82099 -113457 205994 -4151 -89273 -150298 -20113 147580
20792 -159602 136778 -17924 230159 80869 87600 -17047 -10567 236561 3358 -87573 82373
20780 -28576 -43796 83806 160909 -242004 145998 -78501 32766 -31009 55607 -160401 104295
20768 -266078 15673 265230 -234068 37612 77938 -82213 110663 -168503 2544 -197196 3355
20756 -235220 -129118 30235 -29873 51691 179393 281907 -36048 -91527 -104299 149021 -268506
20744 -18657 182653 -176320 -471270 -70756 -218791 183380 92025 -358086 -9060 -149569
20734 -149569 -202360 -46755 -57136 -64997 -255924 215217 -208948 -104981 -442124 255667
20723 -138345 -63190 179244 267353 -53148 -142318 -106862 -298792 -472047 -115020 -90941 -97125
20712 -97125 -179767 -102837 -87978 42238 -51270 210085 -58291 -129553 -194344 -362307 -16617
20700 -237371 -38381 154699 126565 20079 -180636 -250757 -245926 191049 12767 -248877 176644
20688 -187656 208081 -7201 -192205 87962 -253372 -53489 -58042 142504 -4537 -417734 -73532
20676 -113154 8520 -102008 -276323 295615 143433 165210 -235462 -17589 -32383 109876
20665 -245873 103349 3512 154722 41435 -230966 -244977 -471392 -140283 243683 95418
20654 372118 -93554 -263559 -299397 -95599 -103780 95872 -4129 82435 -229974 219203 -43503
20642 -57877 -145644 190626 -79804 291828 -179495 -14668 -310756 -246542 18733 113207 -204889
20630 -94128 -29103 -94252 -69736 93853 124814 328030 225566 -99792 431311 94026 -11461
20618 279233 34941 -151374 214614 -306068 47435 -188218 -261184 34831 -33096 213522
20607 -227441 -227985 -158578 -169489 -11579 173637 160837 -31690 -235486 -199611 -15016 35311
20595 87695 -28955 -147657 -39408 -97611 -134173 -43633 127022 207595 -97748 244941 128885
20584 128885 -90233 40816 -222035 -38283 37736 -220283 124031 -142667 -262203 -180034
20574 -180034 63627 -233874 36204 -203180 -206978 -181492 -171534 -323108 44721 -253749 190232
20562 139624 -207658 64739 -136643 88472 -146208 287534 -61174 -10451 -130244 47178
20551 -340185 -90352 -176875 193282 50912 -266390 -10296 -252146 -86425 -98102 -71928 885
20539 -14221 296040 114423 262030 -69434 -250941 180995 -197123 1544 -82000 -383099
20529 -383099 -112307 -246113 -146429 -63751 -322665 -104950 325996 -22679 70257 -82706
20518 26305 -13429 -279610 -54813 -101601 -84965 119363 -122843 -124696 16608 -15991 -130681
20507 -130681 49254 51407 -80824 -121827 -244363 -211918 -22626 -18622 -208961 83726 93908
20496 93908 -81017 -207186 -16955 -29743 149001 86665 -103537 -28755 95379 -65347 -93374
20485 -93374 106621 30196 -203256 153557 29781 -181046 159624 -249296 -157713 -308781
20475 -308781 -159370 -12815 80631 35974 -333770 102389 298779 87987 210339 73003
20464 -33948 -71941 134484 -19298 54245 65398 -151490 -101522 -221110 -105930 58368 99216
20453 99216 -77771 -14539 263254 -241148 72670 196453 318344 -174901 -36769 -324507
20443 -324507 -197589 78120 396323 36200 2446 -347468 -155850 60658 -195792 278441
20432 221715 -56362 156709 -296260 -13264 -118126 38368 132074 202940 -119035 59437 45803
20421 45803 -1088 185870 68990 -175058 -89011 -388842 -35167 -49508 -83397 -194801 73955
20409 -56333 -98968 -42844 247719 -253520 -193482 123104 -252859 91448 -272859 43288 -306101
20397 131516 -70242 -168607 132043 -239595 -325839 265211 -129480 -103105 -97940 -206951 23927
20385 140243 26842 14362 -2053 -195712 -14088 -146884 -178806 164322 -123418 19494 32792
20374 32792 254903 5866 -160532 -52090 -87909 -132619 136635 -338622 4285 38528 -14699
20362 -118511 -372071 -14397 -296550 253465 -115039 -241402 -170768 -288812 -108819 -68916
20352 -68916 -13488 -66314 -241880 -21983 12136 65373 -446734 -224871 -101208 -263966 91082
20340 114685 -300533 278619 -238200 -177593 119319 38981 -212684 -99254 -373733 2336
20329 -243021 -306137 134368 -112104 191073 -70103 -198946 -106630 -173268 94648 123173 166274
20318 166274 7908 -185044 -52503 -16561 -330157 157376 -167319 -46598 -252518 326840
20307 -352170 -76292 10443 -37373 431687 -172452 -68178 139696 104739 -481918 128769
20296 294448 -218209 -98639 -72850 -117244 91057 89256 -100787 -15535 -174700 -225814 -292098
20285 -292098 -26346 -203861 -42513 -131660 -247097 -122187 152691 149621 -130459 66565 -66187
20273 -149611 -330313 -12239 -20390 -122009 114097 -134908 -167948 -215717 -76781 -103219 32400
20261 -108211 203770 -133116 -127452 -124194 4282 -212817 -168125 -101503 397644 -52537 5387
20249 -193609 63659 -101635 52009 -443955 -277416 -98602 24331 -146678 -463309 -113882
20238 -242515 137202 -287638 39188 69112 178656 -75468 -94991 -256501 5842 -52815 116882
20226 -72957 40418 -111682 -151441 113059 22302 2060 -175892 -75548 -249621 -94983 -165299
20215 -165299 4854 -98228 175365 339775 -5142 -261701 -145781 -17265 161292 18322 -2043
20203 -16038 -110851 21916 -317478 -182708 -244368 66046 -210218 -131496 -158673 -87537 -81368
20192 -81368 -69661 -228465 -89226 -219299 -32857 -30612 -174900 58710 -149854 4848 66527
20181 66527 -172035 -26613 168391 89421 126674 51818 -68568 -132335 223691 364126 -32533
20169 313230 190170 -157337 99200 -35336 -49663 58495 -328094 -84778 145308 125972 152464
20158 152464 190748 -96235 -16346 -205979 -591997 -12815 216786 -307547 -169944 -48418
20147 25466 103201 -403754 96514 -17785 59296 97208 -239491 342965 71062 -410784 -399800
20136 -399800 467799 -195060 -134540 -119448 67301 66223 -285290 -256753 -46598 81474 -23526
20124 -314969 -5736 200466 80781 156398 -173847 -157666 -218415 -335338 -338803 58886 -10360
20112 -111960 -176193 191920 -74528 -232548 151889 -503652 75186 -33846 -184456 -41022
20101 -151515 81124 51533 -229224 -85194 -134523 -395317 -77642 99838 -35053 63467 -84937
20089 -409 -107708 182879 -301325 46648 136042 11489 -196096 234990 -98479 -58933 -114122
20078 -114122 -193503 -31916 106465 273775 -364186 -124361 39724 -662 -167896 -257314 -4460
20066 79823 -98729 -79131 66534 159890 -161593 -12315 -147195 -77326 -109674 -265218 -301205
20055 -301205 -155502 -24570 -272723 -224519 -319588 -233654 -227417 42433 -457018 92211 -123567
20043 -134343 -344505 13093 -293740 -104465 212863 117487 -268039 -16776 885 -396849 51250
20031 -104523 -85972 107444 -370282 193054 145015 -8640 -223623 -28931 21204 -142156 232610
20019 -151692 -8711 142874 152861 55244 -203274 -71781 162865 383484 -58979 -76154 -379662
20008 -379662 -72173 -271038 -129194 35230 -291220 -195162 -113748 -326777 60821 -118831
19997 359889 -38928 214127 -229849 -137260 -7725 -86325 8318 10407 73445 -318726 -148705
19985 -220231 -301888 134604 8200 62454 -98570 -98736 139721 -89521 -50112 656 -304204 307957
19972 206819 -207554 302767 83691 -348415 -174381 -69423 37087 161444 72028 294612
19962 294612 -222314 -154904 146363 26256 171815 -151629 -353552 -40034 -173458 196416
19951 -206613 55064 -275949 -3349 -37534 -90050 -105143 -223565 -306407 264568 -149223 104396
19939 81711 32064 -28532 -138250 -130887 -83885 -76889 -17410 -461661 186291 -184066 91026
19927 -58482 -59909 -65802 -346866 -1183 75833 -125458 -195694 34582 82787 104521 -25478 12096
19914 -13532 -57356 -395785 -40416 279423 -79007 120367 -43555 -337215 -82957 37496 280456
19903 280456 -94226 -212418 -36366 -118509 42336 -219107 -112061 -27119 -139699 126815
19892 -554 43495 151917 24160 -66018 318627 -151844 981 -132558 51712 16843 171995
19881 171995 55305 -169668 -161554 -1107 -301159 -58088 -279504 -42775 -183851 -81625 -163246
19870 -163246 -402551 89673 41168 -320372 -23195 -15168 -168068 -356587 -12094 -60995 -180615
19859 -180615 -13763 21893 -103343 -232657 154921 -202861 59516 166899 -161067 -57959
19848 -43349 -145372 5787 -3835 -165960 -93052 -91879 -415556 15547 -59496 -623329 -6536 -314605
19836 -314605 -73828 -58682 91377 37442 -44366 -113911 -28775 173912 99335 -286256 -295017
19825 -295017 173005 -59548 -5381 -186178 -318598 53965 145771 -294008 -115595 92295 188915
19814 188915 -401646 -10617 -351664 -13203 130124 -216416 11376 -4880 -157108 -8846 -321133
19803 -321133 -171979 324826 -49807 -261861 -98737 -108146 339967 -209227 -42387 -7875 -94466
19792 -94466 15221 -164999 4642 -172332 97354 150112 134211 30952 -251268 -108057 93663
19780 -98383 105044 -306060 -142659 -145107 121335 -27562 -164085 -108529 -131354 54926 256486
19769 256486 21768 -153841 -297524 -171554 -2126 -141670 229281 21270 93491 107293 -77752
19757 -135786 -141593 -28674 80317 170226 103829 206953 65842 129379 -234228 -25097 160698
19745 -169427 4662 -5652 -112770 -328289 -94161 -97473 -153414 -16620 130601 52328 -89066
19733 177840 -82742 -224813 -5547 -108325 -331270 207669 -14148 -168959 128298 -272301
19722 255914 -162405 -213678 -43898 -115356 296749 -162516 -319512 131750 -151920 -125780
19712 -125780 93785 17544 -479075 -66061 -103050 -350257 -219542 8291 107303 136891 12663
19700 33004 -400273 -12723 68904 -369839 -111724 -82395 201371 -120670 -225999 -328771
19690 -328771 -259126 38905 -237298 -474576 95843 -102968 -141626 -153617 -137093 45322 -75946
19678 149350 26872 -212419 53021 -551118 32205 180588 58070 -57718 -307636 36154 -221817
19666 -171857 -54835 178193 102326 -122475 -721 -135071 76707 -30953 -81711 -235995 -192961
19655 -192961 -166396 -60527 -43690 68042 -39053 -145802 -106141 -54242 93098 20923 370992
19644 370992 -212167 -12987 -53803 -111293 17513 -49975 -75222 61102 -36638 217200 -142697
19632 -254138 95300 -207101 225692 77845 50278 -69385 -71204 -79159 -191708 -226521 -112620
19620 -190252 132174 73335 43369 -93306 -345315 160435 67051 -41271 -65681 -60750 -298262
19609 -298262 55507 34076 -217504 837 23899 -23100 44668 233767 101622 24714 50037
19598 50037 -407355 14675 36964 99481 -212157 176066 -169730 -207957 69853 -289429 -108780
19586 -136074 248061 -103886 119452 -54635 -172895 -221591 18846 -133466 105213 223659
19576 223659 -155591 -147335 -54599 -248359 124371 280436 -158645 -110144 -48185 -279706
19566 -279706 15226 143198 105905 -48657 -35041 -284958 157610 -232713 306621 15322
19555 -135332 57709 -83595 -20909 -217189 -75194 -100554 -385501 113891 52045 -135301 -330862
19544 -330862 104092 -286091 -79746 28127 -270342 190480 43898 66690 -211756 -159590
19534 -159590 -121755 101703 67778 -157299 99825 30386 -121368 -14801 -84664 -74433 -186180
19523 -186180 -192029 127908 97932 2364 -314621 124191 -86398 105955 74613 -247936 -234355
19512 -234355 -14392 -127976 148335 23045 99603 187856 -96968 -100551 -205886 -129456 -199688
19501 -199688 107 -91769 -10627 -195583 184739 -165190 -308914 -124858 41285 -314120 5652
19489 -90434 238701 201722 84672 -333626 103803 -298510 209584 -498915 -31688 -125681
19479 -125681 -171505 57852 151531 163325 70683 156704 238514 -146346 83528 177487 -189504
19467 -201197 -255418 -250077 -127873 259324 -63176 -202931 -25418 -59243 60397 105928 101546
19456 101546 -282708 116893 -219719 -137640 112272 -135443 -120588 -40796 61583 97582
19446 97582 -3846 -80431 -222397 108267 -127323 -313118 239463 -44541 -157623 484299
19435 -56557 -68627 3232 -198373 -181956 -380735 -233729 202468 -158708 -315594 101571
19424 -109716 -36258 -246455 116268 -118442 -153316 -308413 57149 -116828 -340753 4402
19413 -144884 129060 -26532 -75246 -236547 -122800 -101946 421419 269259 201601 52695
19402 49848 -122913 -124822 237777 -332733 63204 206197 107400 -129098 -51676 -47933 -29435
19391 -29435 -337161 -39473 -284296 8109 106203 66351 -215336 -254641 -120341 157218 -116224
19379 -125551 -24930 103319 -186382 -68199 -152312 -62776 100170 -214495 -27891 33599 -262147
19367 202582 -76100 -163801 -213929 9691 -294091 -16954 106344 -211351 -205392 32782 -363294
19355 315431 -269161 -216940 262245 127230 143893 -146214 -454537 -284026 224640 1464
19344 -298864 -165641 27188 93798 -124747 -245179 -217751 -151132 168501 -269106 95066
19333 -62721 -224931 187248 -230226 212578 103599 -62217 -246168 -344835 -73989 97033
19322 -158764 -77688 -141921 -147315 -377272 -231545 -16571 296509 -179990 -108069 -270058 100095
19310 372370 -86859 -498339 -246124 93876 -133086 -164951 -184230 -243602 -179458 -68614 -214366
19299 -214366 12992 -101009 96449 179006 122485 -187594 -111834 -287918 3306 -122411 -236833
19288 -236833 -22011 -39555 -9036 -202056 39712 71941 -46971 -90103 -279387 -158493 18546
19276 57946 -283832 -210957 48233 376442 165038 191006 18620 -320369 -359564 219738 -161865
19264 12317 -46013 -61994 -246492 -215563 -190706 208975 -123353 8115 -76553 -166171 -299680
19253 -299680 -38412 -210022 238815 110653 -11890 -211097 7944 -213325 98764 98278 -319780
19241 -465523 -180611 1336 -29471 12688 94156 -209520 16299 -104997 211277 -270339 -204252
19230 -204252 24538 -32267 -47960 -46622 -301417 -22638 17156 -183608 -96318 42758 19194
19218 -4629 1727 41012 -54931 6696 31016 84275 -407244 164719 -47870 -21011 -297960 7535
19205 93924 -34763 -64291 -111238 -181612 -52451 -19177 -122812 -35722 -183374 -238468 -145418
19194 -145418 -310620 146926 56315 -73559 -61304 -154408 71079 -363766 134410 181073 -111052
19182 77992 -162438 -73310 -22477 -120263 -49048 24476 284562 -105220 -261496 64593 69118
19171 69118 -193786 193010 81802 -47347 215590 -326372 52497 -68253 -55848 209378 -32665
19159 54613 237684 -120648 -277338 -20588 49836 283378 -60387 244028 -217831 238022
19148 -59600 8162 -292155 -119866 104030 -316351 -151531 75499 -20713 -73843 50064 -198756
19136 -49231 -51916 186333 -282086 26927 306114 -133995 132666 1878 -248975 -318565 -158811
19124 -54104 287790 -182804 -199311 56507 -202046 -22083 201349 -109986 115339 -150608
19113 70664 -214044 181548 -261142 -218422 308557 -187999 24351 -57389 -78662 -130876 -16287
19101 -280470 -413421 -141334 -300674 -995 -50412 -150507 126870 115887 -371296 -297227 -152664
19090 -152664 145538 152767 -273799 11162 86198 19945 37919 -154366 -494306 -201044 -100233
19078 37797 113231 67941 -35712 -101725 -32674 -69733 -103551 188042 -377070 -39402 -71984
19067 -71984 258159 -265946 -8588 -191580 -13017 -92957 -14963 -127159 -158040 -77943 -98466
19056 -98466 -174023 -69465 -38333 -67098 -398286 276633 64804 -97313 -24305 -164393 -124044
19045 -124044 275446 -108846 -99639 -298100 101699 67539 62118 -223438 62328 172749 -248872
19033 -81930 -136344 209067 283308 40319 -125887 3440 -68011 -200711 176660 54201 -198663
19021 -102887 -33893 154535 -243354 68058 -37086 -298668 231088 -90550 -279824 -39309
19010 -63713 -215693 -34758 -83211 64142 229489 -308398 -247280 64022 269936 -190798 -264033
18999 -264033 186762 1308 -4818 -172717 50474 -88501 146544 -12533 -154918 -91639 88722
18987 141740 -240641 -270473 -181150 -11634 -168505 64232 -320536 -143538 96026 5283 -123730
18975 -227391 -153841 -197440 -241037 -59983 -212 41262 10654 -244851 113182 162941 30089
18963 69221 -16280 -182588 -155929 -145912 105289 -209347 -44113 -15785 595 170506 -215102
18951 -193096 32873 14766 283803 -32241 -96774 50346 -97603 116866 62242 136955 -2127
18939 41534 -300234 126260 -99701 -162931 -119338 185054 248712 64920 -167673 -26321 -158106
18928 -158106 27024 225446 -201135 21702 -18930 -272911 -48124 97553 -180891 -23245 -183833
18917 -183833 -65831 -220695 -87526 -466309 97347 -7169 -7332 130298 -194825 171089 20829
18905 -213649 -1695 -63322 -134580 -272107 -312524 68576 -308066 136085 -236851 -522216 -43890
18893 54734 37294 33810 -115327 23313 -23561 -80247 -53822 -82597 -202010 -88219 152826
18881 -138166 146507 -88566 85933 1450 -123000 -211872 -496603 150625 -177787 -39017 -163558
18870 -163558 -176949 -44724 39223 -46093 -225642 179291 -87349 61998 -125 -19665 57480
18858 -38578 69946 17208 -50204 -171392 -288053 15046 13545 211033 5364 86919 203539
18847 203539 111819 29355 206948 403977 -69913 97610 -203737 88583 161628 160092 213558
18836 213558 -163221 -153816 -431961 10068 -57354 88074 -213707 -115409 -67320 235521 190635
18825 190635 -313728 -71938 -321549 -203590 309882 -89589 33487 -31450 81528 49939 -343518
18813 29445 -30115 221327 138285 -13183 183073 -14431 239037 -13186 -299554 -154020 111052
18801 28224 -62989 -106229 -52221 -334873 -128026 227837 348008 41 162740 -215438 160739
18789 -1874 181003 -16996 -189335 -236032 -65039 162548 98435 -373247 -153024 83159 -252460
18777 60201 -33156 -113423 -397368 13664 -121885 20628 -111368 68924 -176677 -215992 -90595
18765 68490 -81735 -38993 253025 -366316 -207698 97238 -194422 -114605 45945 264358 -185690
18753 -165385 -90454 125786 82486 -44079 -220190 -129160 -174819 -273406 92472 -181612 -127833
18742 -127833 -7782 -71679 -253726 -12544 -280835 79966 148469 -48172 -104490 -214989 -104549
18730 255583 -136029 -1593 66676 -125857 -257969 66438 55147 -205200 -171576 -256700 127103
18718 -200398 -248410 -303079 -153811 -34673 300633 -11998 -218932 108808 104603 -29534 -240505
18707 -240505 -1774 12783 119356 15867 203152 -59949 141353 -328498 37989 24281 141772
18696 141772 193881 -240545 -69476 -16380 -88343 110296 -155846 125170 -76059 -214095
18686 -214095 245669 -303626 49133 -210720 -198180 -34572 -330994 -36217 -143347 -306456
18676 -306456 29519 -400806 256511 -67978 -41756 30123 -55713 -171961 59460 89369 -62825
18664 51263 227870 -189699 75054 17756 -69966 -141185 -24133 300455 -126212 -130864 -98856
18653 -98856 118891 -26117 26894 8938 -212156 -4581 -244911 -33136 -110485 -272764 -163351
18642 -163351 -52645 -31269 -182459 87051 -402238 -67706 -185037 -40171 -322847 -239741 -150210
18631 -150210 -71838 -39687 -86897 -227716 -27296 509587 -146651 -62885 417726 -302273
18620 83073 -177838 -325681 117926 -182527 -29507 -14008 224509 -242440 14142 -287569
18609 -173671 -63517 -282925 -231138 130624 153317 -243352 -107280 -158816 48979 312362
18599 312362 -36022 -278213 -185467 121739 65054 -243690 -73303 -14538 -53448 -193166 -190362
18588 -190362 -246527 134010 166272 -281618 -311891 -317902 94824 -157173 -28109 -31629 -302242
18577 -302242 84901 184389 -92082 250754 -40371 -135874 40266 -365491 -234184 187760 -172733
18565 -162030 -49496 -129769 103213 124422 213757 542176 -258778 -25037 -106030 186448 142478
18554 142478 -82107 -167582 52591 154372 -249396 -21696 85294 28580 -251840 -70400 -11597
18542 125210 -234158 -149361 -217906 -256796 -209709 115096 67901 86968 -73611 65922 -226743
18530 -367210 -294884 -224282 -119108 10685 68867 112146 -350821 -7195 -106263 -363114 -62365
18518 -230589 -57536 40745 173012 -167853 234363 241286 -38248 -164283 -33335 -47440 -36681
18507 -36681 82757 323293 377967 -305997 178461 188655 -168501 116034 41525 175522
18497 175522 195644 91497 -92797 -52740 -48949 67997 -292659 -222964 -462099 -266541 -165272
18486 -165272 160586 -46749 146263 63452 236241 -25169 9631 -52293 -33981 338016 -124411
18474 179379 33965 -125149 9075 27309 -134936 10875 -264837 15066 -186344 31846 -200699
18462 -314665 8128 -405019 -99369 -204689 -113063 -45997 -106570 -126143 -281064 95120 -22214
18450 -40401 101953 -165883 88411 -122431 43811 -124435 85514 -276241 48549 109447 -410849
18438 149881 -59981 109629 51153 -7672 -71789 -118962 -150753 -300917 192104 -205190 -50387
18426 -285068 -131681 -62399 141514 23622 95002 -75708 204277 -133525 -41732 -42277 238646
18414 22132 -293834 -222054 -240875 -104911 -29810 56723 -17180 204352 -64202 -142317 43448
18402 159176 40370 -169808 -27403 -199085 -127554 257819 -139391 -70575 138296 31616
18391 -194774 -131389 11735 -222817 -48961 160729 -416801 -137529 -69321 -156908 -167730 -199934
18380 -199934 85330 -25242 -175811 45862 217817 5385 342423 -88229 -305375 -277555 192720
18368 -75425 -30733 241854 -16641 56658 -51054 200405 138198 64836 67736 26011 301269
18357 301269 -172414 -113053 -304066 -349876 213 -98900 140266 576 35700 -2120 -109723 -221286
18345 -221286 -203245 -38061 132883 21394 -40421 -15050 257279 -175147 57027 213661 308510
18334 308510 96331 -40557 149979 -19935 -35345 133406 -229593 -405578 -174379 -106311
18324 -106311 -293078 18132 118983 -167396 -580351 65472 -633889 -29866 -203715 -166748
18314 -166748 -9276 101389 -121444 63258 201549 54296 -127671 -21174 -382209 254214
18303 -97924 -139201 57430 14336 -246504 6578 -23069 -86911 -99716 -11118 8446 12676 104656
18291 104656 -38855 -149506 148947 185150 -206160 -312233 -369134 -132550 93646 244581
18281 244581 -2986 -170134 -4591 68647 285490 133538 88270 -239329 265593 -177027 -150798
18270 -150798 -375197 -107136 -47686 -752 -238512 79792 -141128 161519 227551 -235486 -287437
18259 -287437 -67946 -90565 -88059 -17718 -14329 -63620 11725 -169958 174508 -171460 -25258
18247 -53072 -351797 -181764 -124351 -8994 -123567 219955 -170017 -464413 186672 -118652
18236 -92050 -5159 -150859 -274827 161379 194740 133328 -174378 120174 -64192 78584 229344
18225 229344 -191344 8797 188135 168646 -134112 72163 22728 -44423 117381 -58975 -41874
18214 -41874 -257402 87224 -56287 133334 -92689 -250646 -8347 -161315 -15369 -138197 3779
18202 26051 5801 -319696 134963 -87263 -302890 42326 43310 -251385 56568 452988 252282
18191 252282 253453 -31765 -107486 130623 41241 124291 -84562 -74917 -408159 -197314 -6973
18179 -6912 147467 -61264 250140 144558 414172 45264 -316381 220089 -173971 112870
18168 175748 116779 -206159 -25125 154079 188110 -117437 206775 -134632 42540 134302
18158 134302 -24173 -445140 -51117 -130754 -149905 -204974 251981 -12081 141778 -25486 83064
18146 -167034 -191793 -106350 -109248 -95068 -180645 190511 -312245 -122055 -9439 -126990 74270
18134 20738 -496414 -64222 -221872 504590 213548 -133576 81457 -235616 118215 189211
18124 189211 -416133 -160299 479479 231867 -136514 53498 -21613 -121290 -301997 -266478
18114 -266478 -162929 -413247 58049 -14998 -173222 174184 -397291 -138366 397188 -15233
18103 -63114 30696 81264 -219561 -132124 31357 21049 -200295 -132147 159011 107955 85799
18092 85799 21455 -93810 -16691 -121967 -147502 -48374 -413512 -140502 25405 97787 -80811
18080 -455052 172196 -241190 -170907 -124418 149270 -52280 206452 -53723 -132732 206521
18069 63089 60669 -61395 63379 -155077 17442 -125420 6163 -83258 39906 -32336 -64608 -77462
18057 -77462 262435 -128260 15664 -150290 -136643 -84786 -301558 -39619 63429 -95671 -41366
18045 55700 -158483 82070 -243596 129966 118862 -142092 -206166 41500 68703 30901 -212225
18033 -261602 -17470 -106569 -42141 -79003 188213 -94126 -11297 -10988 -220285 -278168 -134308
18021 -326780 6911 10202 -185002 -71264 150515 -176318 -16342 -76165 24072 89070 42766
18009 21000 218681 -220078 15388 142964 -77552 70413 -61722 -3171 -530377 -201467 -222570
17998 -222570 128880 57139 -150075 -280060 -180099 120689 -64615 -11121 -20161 23121 -140291
17986 232522 -351752 -95249 29333 -12904 -78022 113201 186970 -44206 -49402 -5369 -86164
17975 -86164 438588 -152008 33390 172369 55913 254937 314193 -313889 -371736 121056
17964 -83779 -123056 -120508 96121 -69988 -205055 -44581 -66906 -230612 -377915 212129 -308788
17952 -145448 -43552 4477 158668 121022 119801 -29347 -120864 -25845 8822 -81127 -112095 -17958
17939 -112607 -3254 53730 -15260 -14856 -195085 103421 -157082 138376 -159738 -1231 161238
17927 -179868 241973 139551 116408 116220 -52412 117623 199178 -19635 -133270 318775 -165190
17915 -107171 84848 -57759 2248 -138251 -25611 -145627 193634 -139773 266638 246132 -206812
17903 -15494 118029 84142 -184433 -53536 -58793 -38610 -217755 -20164 -353999 156051 -251572
17891 187596 28542 87084 -74211 355407 -162545 605 60595 302226 -3854 -26290 252740
17879 -3486 -25677 46116 -13454 350113 -112458 118636 -154319 -160608 24884 -49744 -316660
17868 -316660 -13941 -61430 175510 210743 -164135 -98658 2428 -151086 60867 14979 -86942
17856 -80718 350396 -30965 106043 -264263 -190924 73518 -143920 -126349 112546 -103046
17845 -253155 -150647 207441 -65654 -100738 17690 160378 -142099 -95483 -166750 -93122 -117500
17834 -117500 -75018 -23843 -39666 -142180 -207366 -164032 228540 250764 -7736 110474 -109969
17822 347236 -180238 -164231 263519 -110432 79683 -167611 8073 111226 22520 -186016
17811 -81136 -8904 -62458 -122698 123700 -184169 -234994 149377 -154967 -61300 -32440 -240666
17800 -240666 114716 72897 278783 299994 148141 123198 400442 294146 -168786 289238
17789 -33253 -102643 -144556 -156034 -122354 -24048 166113 155967 -91304 -215174 -27132 -56504
17778 -56504 189696 -162661 -81793 -456916 231501 265905 146896 -53887 136023 -192149
17767 -64039 39458 -155046 271679 169586 -27185 -49614 -273957 -46106 104662 269562
17757 269562 -191130 51527 -136475 -50884 65118 -205907 47205 -144733 -146476 102292 -66082
17745 132185 135212 273703 113543 -185846 260069 -66643 -152732 -164656 -190243 -71639 178396
17733 118156 283826 20250 -72090 -15011 -197516 32267 229230 207168 27943 37795 -274326
17721 65100 478642 25973 210774 -109116 166493 51732 156946 -62882 -227186 91715
17710 -194319 -27014 136264 56290 74105 -133332 118980 250457 -87446 -106007 -123115 -36430
17698 -173182 -31307 -167350 151662 143149 -248589 -176297 142579 55349 -63731 49802 -195844
17686 293205 25716 -197236 -89917 36587 -131613 146276 116836 178224 155184 -59881 -11212
17674 -156113 156465 -230772 68957 -49241 -149673 -105323 274563 50040 63295 17502 -42798
17662 138928 -43188 -48691 91760 -26762 143286 -7812 -62432 -65128 156794 151816 219408 -14573
17649 129762 32602 -25181 147980 12321 126027 21891 -43274 305391 228576 55022 -143767
17637 244096 42973 -386848 -156551 -292369 -147429 -123826 78231 100566 6880 142082 -115733
17625 120795 182719 56257 -40276 428593 -77603 -177805 -48255 -75755 -50526 -316900 -167146
17614 -167146 98026 370208 347622 -4739 -31242 -115435 107245 4121 -221423 204398 129872
17603 129872 -246063 143853 43579 499620 -80396 -102815 -213813 15977 40943 -448632
17592 30394 -166324 -42419 124762 -241161 137575 52089 186578 -109048 -116752 71207 190929
17581 190929 44374 -57546 88514 29842 -87896 -21892 -86566 50268 15671 7297 -80302 214729
17568 -337241 28102 11374 175455 169127 125653 399450 13989 97782 138311 98448 108832
17557 108832 204968 402219 298132 207336 -15926 74205 71729 111156 49701 83404 28421
17545 112156 19320 102921 39742 70270 103463 73453 -276356 321559 170739 173867 -15515
17533 174808 80664 -200176 230611 23320 65269 -21654 -270867 104811 35321 186608
17523 186608 167622 170547 130907 113799 46787 289785 -26780 114979 -63942 -39963 132988
17511 207683 161474 151531 76602 20456 -10599 -146369 54001 66681 299955 37476 17161
17499 256594 -239517 -166581 219684 175540 -85065 27497 249594 -115602 162564 203050
17489 203050 412711 -36946 113501 217224 273453 285447 98437 41514 232986 -181537
17478 146445 -119397 66888 44838 334361 -47183 199587 636942 39575 -34538 -9517 412721
17466 169015 264237 -101747 -48227 272692 -57296 8845 -11454 -40126 112076 391931 63189
17454 -270475 446740 292597 -188843 154630 295153 152273 -31753 366513 706434 106018
17443 309195 184004 253360 20931 127116 351407 274238 230989 261996 246039 145719 49333
17431 -101495 279104 241760 184569 476462 299285 18076 419188 169348 483672 110739
17420 301079 342592 421895 588800 -204504 316472 175361 201683 103678 285078 444031
17410 444031 199845 159351 592064 107739 191907 281414 83236 106978 123309 425686 11696
17398 257919 91245 -210042 2186 184022 210095 342093 205552 237035 -117774 210961
17387 381992 449888 -311067 -282186 12435 134305 301455 -54709 408786 295176 -62557
17376 54996 205921 3945 -74223 325154 62459 49739 -194359 142983 93876 -14909 89983
17364 -100984 -17525 -83883 56384 155522 241352 189790 220223 119502 91344 -38726 176209
17352 234844 28058 418452 91801 545626 -26052 -96689 40755 -207723 137290 193696 -23109
17340 216734 334144 232380 513834 -35529 165250 215315 -21440 177772 72435 176646
17330 176646 137052 40374 32148 323544 63627 115616 124068 470475 132528 391257 125887
17318 -40260 -83636 118496 99077 130259 -39501 44304 504539 148838 -51999 33031 63231
17307 63231 61259 198781 84997 339226 166900 76860 163175 312823 133546 171969 220660
17296 220660 41282 -462520 -9098 451219 184236 -465689 -79303 340667 236668 132379
17286 132379 2690 -71261 42900 326978 318263 -196881 137083 298481 35898 -172629 181715
17274 69732 -144067 138123 -148993 341968 76870 107863 296854 90090 -162654 -49215
17263 261564 104707 284647 240288 190328 -27818 169341 326986 213486 287710 136986
17252 118231 343360 45645 -125971 287129 139387 38530 21684 202839 211661 65453 238945
17241 238945 120895 270119 -18552 65659 407753 26253 -38811 337686 159494 260960
17231 260960 215012 196555 146003 174596 113069 259267 181618 118866 256012 127584 183689
17220 183689 245418 189957 -11662 487210 -96361 36892 76251 -57705 254223 620925 108519
17208 207265 344111 82945 449408 307222 277163 235535 196568 88252 94564 232607 196076
17197 196076 142589 203190 329681 116998 46806 -37396 303851 168659 434464 484538
17187 484538 311911 294842 -45483 337251 397848 -26016 274795 537311 230860 312264
17177 312264 173064 46874 125547 487364 504346 239073 251663 390509 261510 513344
17167 513344 236951 145120 463664 174303 157192 533461 519905 426227 40570 501411
17157 501411 309514 185764 342539 326299 58539 215892 284680 50296 427698 112517
17146 281116 149787 542048 276464 604908 368925 159642 270641 279469 314895 232233
17136 232233 229721 403348 235951 265704 270216 460179 359842 388313 234489 309408 236684
17125 236684 222162 155763 208137 563317 524707 235616 362118 197738 425384 202596
17114 216405 115514 236774 647356 227312 543424 390423 431375 371075 310486 694783
17104 694783 594672 172771 351817 424352 64414 178229 205289 330208 337411 412981 365571
17093 365571 476357 148684 609397 434260 421057 629490 396392 329629 492566 413298
17083 413298 282437 589703 316047 438470 518688 422108 548931 697179 444244 172308
17072 52519 513140 511022 507637 291122 539573 575926 338526 367581 479426 721522 536955
17061 536955 559707 705252 378874 441961 258196 477329 471750 153340 405854 583132
17051 583132 618261 513877 632318 271868 536144 349117 617939 563457 444673 689569
17041 689569 314897 366608 577121 678373 295304 436014 695621 697745 679678 618887
17031 618887 596952 383484 673072 692852 181874 907713 825560 426041 415990 463373
17021 463373 597315 190442 774936 646790 643206 789108 561305 410415 787322 645876
17011 645876 457389 680547 492973 595487 896910 793351 618644 622495 783067 700804
17001 700804 704060 589441 724907 585863 779433 780090 777963 1069220 361395 697939 931885
16990 931885 650035 787834 840910 902216 491593 717252 766377 572765 593293 831973
16980 831973 877515 962511 946196 904988 909559 924095 1016909 603753 756187 863510 919684
16969 919684 1078652 1004321 822443 1195584 1091195 961882 960647 1251968 905116 1133769
16959 1133769 1080316 1115485 1026084 1029602 520445 1081297 1063197 1200756 1248819 1107867 930577
16948 930577 1066284 1021718 1300757 1190646 1373201 1053630 1132089 1230048 1350441 1227409
16938 1227409 1250142 1045690 1226204 1263421 1271974 1279437 1213300 1183853 1505208 1661121 1042329
16927 1042329 1124792 1455249 1555150 1511904 1544742 1472796 1203647 1494941 1539622 1502534 1199538
16916 1199538 1543431 1537982 1651523 1535407 1553867 1733796 1766112 1679586 1850570 1740619
16906 1740619 1665160 1741906 1633196 1675005 1970501 1444693 1917200 1451156 1684331 1811676
16896 1811676 1899242 2193097 1864091 1809085 2087614 1788105 2107413 2257789 1758435 1869582
16886 1869582 2226510 2547868 2154819 1975034 2372932 2343478 2133331 2470132 2674836 2062847
16876 2062847 2317570 2487500 2542566 2583927 2492100 2629878 2639578 2435879 2749267 2322112
16866 2322112 2440474 3026212 3078235 2642894 2871171 2669493 2895971 2689264 3052216 3190871
16856 3190871 3178130 3198692 3274247 3255001 3590413 3338010 3496528 3278159 3575552 3585185
16846 3585185 3520005 3675152 3753753 3764017 4082807 4255057 4011149 4423854 4293409 4500013
16836 4500013 4327868 4317266 4641033 4651240 4594031 4747889 4873618 5011316 4734120 5045630
16826 5045630 5139252 5471865 5259085 5241485 5435336 5622408 5687872 6136188 6098504 5992408
16816 5992408 6335756 6343352 6747286 6770761 6754935 6938784 7184510 7126153 7446621 7572547
16806 7572547 7560172 7952299 7893279 8227971 8881685 8753843 8836085 9342629 9289378 9564771
16796 9564771 9673035 9973568 10496135 10757631 10451183 10666462 11398901 11808990 11819389 12343648
16786 12343648 12598346 13108430 13368790 13774807 14051831 14041665 14704295 15294027 15931743
16777 15931743 16499410 16852216 17308410 17863913 18283153 19152645 19816766 20429314 21202117
16768 21202117 21855294 22697047 23176196 24300922 25003011 26377587 27379227 28020538 29405694
16759 29405694 30382602 31304765 32840849 33830087 35633214 37035269 38568832 40438513
16751 40438513 42173000 43900777 46168309 48285934 50669091 52845959 55348883 58443570
16743 58443570 61133321 64125754 67766698 71120043 74536866 78524638 82293805 86652206
16735 86652206 91178390 95894208 100801908 105411968 111229343 116321318 121565421 126543953
16727 126543953 131982510 136925709 141683124 145813325 149845747 153609005 156282895 158167875
16719 158167875 159910902 159862039 159600584 158790076 156460630 153785637 150357864 146638939
16711 146638939 142244656 137648621 132518688 126983927 121681099 116572991 110973624 105860214
16703 105860214 100664546 95403988 90849575 86297132 81656609 77575929 73571058 69678417
16695 69678417 66678119 62786968 59858643 56901159 54097868 51589069 49012546 46720141
16687 46720141 44135066 42626642 40579211 38756445 37258446 35535142 33888383 32515275
16679 32515275 31365492 29738784 28834061 27414631 26802325 25391296 24688340 23307810
16671 23307810 22844930 21459954 20903891 20150630 19363749 19189473 18330515 17535473 17146775
16662 17146775 16418538 15936407 15454904 15560138 14654693 14021776 13879959 13665918 13314994
16653 13314994 12516749 12287966 11891191 11846561 11154946 10783621 10686080 10410392 10320281 9820224
16643 9820224 9523256 9282442 9252258 9050918 8934985 8382867 8585825 8212697 7887769 7808468
16633 7808468 7561120 7297872 7262609 6848639 7047128 6830690 6863042 6685605 6165195 6399992
16623 6399992 6091937 5679875 5631496 5578506 5866603 5376965 5101361 5565240 5351931 5273674
16613 5273674 4932720 4783299 4750074 4777485 4516027 4798025 4464472 4335606 4205786 4188865
16603 4188865 3940775 4149264 4007385 3955462 3622468 3724145 3796894 3884791 3693612 3751218
16593 3751218 3549052 3399634 3743000 3421327 3465308 3127472 3672523 3233729 3047886 2993879
16583 2993879 2910913 2831603 3200356 2871424 2723318 3067471 2881780 2772320 3022343 2728629
16573 2728629 2564717 2613430 2696811 2483449 2203745 2746315 2669523 2321229 2340326 2402864
16563 2402864 2240365 2332058 2215031 2085549 2325176 2065943 1941253 2190365 1829077 2105307
16553 2105307 1896032 1845636 2090154 2118595 2022179 1943637 1603297 1748892 1509439 1993590
16543 1993590 1671226 1707934 1923241 1764616 1566515 1679115 1488703 1793041 1650780 1568530
16533 1568530 1484247 1793711 1648747 1456097 1353823 1331414 1504328 1676057 1609370 1648150
16523 1648150 1479628 1310484 1617402 1616382 1304336 1042818 1329033 1350830 1104787 1540570
16513 1540570 1307796 1112960 1510576 1154114 1181073 1279773 1050798 1139809 1557385 1445557
16503 1445557 1048785 1046139 1069985 1195036 1065791 1045399 1463180 1363459 1113382 1582562
16493 1582562 1295210 929974 1272897 880020 1070944 1138070 683148 992040 1032803 845122
16483 845122 963871 985341 1055560 1056905 946890 1018494 843002 862837 851465 1026705 867871
16472 867871 929529 891766 836080 907673 817177 766907 626154 639772 794094 794983 761684
16461 761684 593277 1049535 703765 682930 1033909 924603 654560 739700 976817 860783
16451 860783 499890 768944 517416 655553 993564 680487 1043572 443347 758136 897647
16441 897647 573730 611122 1045578 820081 928655 777170 674288 881672 722727 865152
16431 865152 246674 531919 1006337 594222 675516 637750 581197 464748 709536 737887
16421 737887 640032 896716 624907 485397 556053 452397 658515 686321 621960 609991
16411 609991 181253 548856 932382 544702 502303 509605 486234 399408 488793 684408 627353
16400 627353 427757 682526 527737 355962 460501 649004 567211 867707 495098 131581
16389 674129 496679 691466 340517 387159 379813 452165 513593 335342 405888 630512 460276
16378 460276 336359 530514 244566 515460 594935 315253 702279 531171 658970 367686
16368 367686 400264 372841 421424 642973 648128 398625 192822 375764 337500 395686 367546
16357 367546 395075 144634 436081 174290 191999 756982 172859 144945 619137 570513
16347 570513 174146 414086 311171 320787 640446 149794 117541 423864 337034 110755
16336 86357 402491 592894 143115 629364 276347 48836 261336 437383 394215 366180
16326 366180 98901 323094 373185 197762 102827 86548 53203 392645 454924 -17209 309177
16314 -18488 468739 393542 111090 275897 627484 68066 314173 128700 285441 321611
16304 321611 314442 647112 415312 188890 -52944 600662 266395 153420 -275810 251778
16293 294369 -66708 -79916 72586 135515 408324 298703 180105 215437 92443 128917 4870
16281 71540 257938 180417 448658 67652 33155 331941 -185908 265819 348092 173256
16270 389575 315585 257940 190133 124915 193229 405231 191529 350580 263417 -143930 553340
16258 -77527 -177414 389457 -273365 156714 317525 384267 148920 134656 -14533 39077 330600
16247 330600 187196 56520 218898 14413 352151 32447 184139 189136 248328 -8234 -3652
16235 52487 -11848 341709 373368 334331 -109936 243179 235721 208270 -151748 272313 233465
16224 233465 -50247 429027 344010 284361 -178063 367591 71683 -12477 172189 55438 327831
16213 327831 107460 -120393 52630 -147833 57806 98234 14731 -73203 -71246 208533 -163857
16201 67760 23673 166283 29312 295213 309830 425298 43030 14146 325028 423799 -166843
16189 -6487 64375 167898 236986 440392 36160 99856 312660 176301 -14645 160868 -3871
16177 -39316 78941 -148831 -121801 110591 135948 41747 115981 5549 641183 226164 360630
16166 360630 118592 213650 56305 -126604 104670 62460 54346 212437 103815 -192344
16155 124727 -96539 359787 -200308 -268394 352004 113360 125711 308216 37039 -80238
16144 260422 -90629 39270 -47312 75942 282987 173039 313414 432352 -154518 315604
16133 100640 387557 96362 -120410 216545 215566 -98067 238758 17983 -114547 -289888 -18327
16121 -94541 232444 -59753 -125436 99494 35937 221542 -119593 -68001 135723 -235450 -243215
16110 -243215 207531 347268 204623 62417 319806 -85655 184001 296940 84003 192674
16100 192674 -44344 121684 171655 -152734 204133 -18010 36358 262889 -177251 170144
16089 -41070 251797 -227984 -272163 330854 205461 155828 -96131 -333924 136682 -143531
16078 -43595 -21646 29490 270568 283482 -269281 -313006 -32960 215821 13461 242241 -287673
16066 48031 37334 319283 57265 26868 14836 206016 -10977 105185 85615 103869 -252713
16054 151183 -86801 50539 383280 53204 207136 -108854 65538 209282 205577 -139419 173593
16042 -241379 -168678 -85283 -104628 -146042 -96604 5621 -216338 183705 -63828 276434 -6556
16030 111165 132012 126818 -7958 -290575 -119879 138080 -147977 168541 291258 -87252 12182
16018 134713 -37008 -89899 -281318 55512 -103632 -374739 107088 -124450 -208689 -70632
16007 -141923 -69712 -60447 -97761 145149 135192 -136492 243022 -69241 -161568 46093 13961
15995 400538 215894 125067 121517 -37701 -119675 64383 197054 -264032 215816 -91339 195036
15983 -14460 21305 13301 121720 1008 153612 -80697 64742 122692 213813 -386178 40358
15971 -129345 -40643 221417 305601 54359 143919 -223720 41472 -127835 -114620 -186464 406828
15959 305727 98328 313165 259828 -246165 -217486 -166322 -256990 146981 85693 70185 -124587
15947 -158108 -282486 -454632 -202645 6921 153469 131112 -228138 -127767 -52677 -119224
15937 -119224 -24326 265073 97036 -27405 58646 -183684 -59414 180841 46861 200361 -42112
15925 -63068 -163051 266059 -281329 294466 -148358 72888 97448 -158434 -76871 -20940 -152480
15914 -152480 111314 273369 15828 -70293 -23787 140856 10158 -50515 194467 -155846
15903 -293796 234590 -215006 35611 -47052 -59579 -210674 42724 -215272 10751 374746
15893 374746 151235 95426 -14342 88810 -165041 -330406 93687 -91709 260062 12963 -25548
15881 -189162 45887 -54218 138391 -118732 49717 -59675 -99167 -256311 214329 96881 78620
15870 78620 -71990 92318 -9173 256457 129630 -161760 23197 -128173 -79041 -24622 -262571
15859 -262571 -62138 129729 -192208 -118218 -30191 36636 -44639 30403 126099 127032 -63493
15847 44532 39652 -21549 38456 7415 -121316 -130212 180169 190368 43745 -150783 -34147 215596
15834 254878 575837 33030 -53566 -4278 186445 -187442 -156619 -206809 -270708 -53101 -61551
15823 -61551 124101 -526144 -160402 -181854 -76744 -59033 -29784 -447 -161206 163019 134744
15812 134744 -26745 -232032 -362554 122216 46466 16037 -246674 299884 52905 -165026
15801 67817 183814 318357 -87045 321022 10506 232617 -136755 -337837 -287496 -133688
15790 -112577 -108915 -18259 310580 -95181 -99771 -235951 19175 554735 -169402 47835 101843
15779 101843 60618 25502 181926 -339244 -112988 -188465 273477 -79102 80186 -1393 32951
15767 -414385 -324283 7841 140077 -145909 -168296 -150989 50675 45808 -121925 -403352 57710
15755 -120023 -199441 35714 -107115 -102188 25004 124332 3259 131776 352431 14332 212055
15744 212055 155835 76274 -77706 -4353 -384982 52358 158391 23155 209903 -51247 -120678
15733 -120678 -165068 -156515 -221781 -152983 10162 -194217 -92571 248924 -263929 366100 -178737
15721 -377539 -42299 227871 217269 -102350 135923 278051 -319022 285034 95999 -131851
15710 -105685 304456 125346 350009 -327432 -114871 -133947 -12258 47825 -21167 -165015
15700 -165015 79695 -65451 -183127 101506 43051 -54563 -98361 -207940 76917 -46311 349036
15688 -219809 123415 -459951 -410074 -159104 68104 -77175 -105832 -182786 -87538 -32486 30962
15676 82840 -146063 -147543 29567 -170809 114143 45431 291448 -75644 -95164 157115 111301
15665 111301 -145648 -52770 215878 -42765 -57223 33789 -336950 101814 24005 -203296
15654 119495 162289 -114325 -224837 -228499 -123396 177073 -131598 225512 31172 -40392
15643 59795 -66620 92396 -100947 174264 122467 81996 -24585 63196 -55447 -308127 147263
15631 226048 -181559 -26855 -213604 61250 46042 -40095 -100897 349391 13345 -618764 -89208
15619 -108752 -159843 -134008 -206480 -77520 -253644 -189654 -2127 -23093 231383 -323091 -12178
15607 -44621 116171 124448 -244880 222696 115988 124706 116192 -21236 184015 231855 51839
15595 -13379 33741 -23037 22316 273623 179974 132789 -130093 70792 -69223 -235699 -387980
15584 -387980 27930 -384069 -113412 -252656 -107883 28659 -96380 30488 116538 475594
15574 475594 194017 -337875 -36518 6488 -123661 241927 -102006 -212958 -161908 172639
15563 68083 -71785 -287414 488904 48699 -313361 227865 102017 -204130 76276 75031 -33659
15551 -69390 14785 -126337 -46922 17249 -119422 -250445 -6107 213436 -217734 158640 -139937
15539 167667 -100993 175679 -43972 -90004 -170660 259558 -90613 -76555 -79202 -210114 436021
15527 -39311 -381149 -96000 -161740 -7420 -27409 -316963 -112451 163769 -72858 -247812 -145622
15516 -145622 -180671 266879 62016 -166309 -738 37725 -191724 16430 60923 250602 -186526
15504 39085 2992 -72178 -296458 -551916 -88456 -121944 431 -218586 313893 -213239 47722
15492 42433 -28418 -74546 -366919 -127219 142907 208141 -131564 -88779 97365 44689 -324509
15480 -10062 -148038 -110469 51778 83632 -122684 -34149 -283404 62998 204917 155406 26810
15468 180832 -232375 248137 -105748 178580 326198 164824 -21670 4026 200574 86748
15457 -139037 39829 278262 99711 1098 393763 -46380 61276 -129495 26601 -190488 269947
15445 -93537 127232 133889 -93754 336730 -390709 140648 188176 204428 237285 259131 -129614
15433 -262466 70191 -7188 -11618 -123245 118020 -248215 115763 -36116 -202935 100570 -213879
15421 -265093 -124067 291322 -7509 70805 -90582 121497 138353 -2846 -241206 206021 -167549
15409 -15486 102322 -149534 60297 -151760 4354 242452 215350 127725 2218 45502 -119251
15397 -106651 -122513 -132666 194298 41743 -71102 286417 -363503 105498 -157154 -33962
15386 -129044 211822 -111988 36746 -61758 35253 177826 61032 -6756 86749 6910 108778
15375 108778 -210725 -120942 -214650 108603 -29725 -216057 19013 94542 122212 -147845 -351058
15364 -351058 58356 -517985 -4933 41252 122057 -266910 -122516 63020 85964 341316 254934
15353 254934 -18627 38791 34136 329256 -56172 186519 -20957 233620 -58124 -107258 193775
15341 124331 256114 289016 -165694 -20725 -55707 -189853 22796 92096 46092 -324147 62906
15329 454929 240522 152816 99413 191996 27920 159687 113313 -161566 -180676 -56393 -8921
15317 371021 176349 14095 79432 84602 174502 29917 50753 -265993 -95088 280167 -80118
15305 -91935 -7359 88394 494477 4882 20195 115189 -24180 153104 -81738 88035 -162458
15293 -28660 54403 291104 -169899 -67801 -161637 76375 291018 22100 -24317 89245 153199
15282 153199 54632 214289 108659 -220013 56040 210522 -24431 -12887 303850 -387651
15271 -18749 273113 -46242 13009 -29582 -11481 110143 7285 -183128 127337 -45918 -2728
15259 29752 206079 53771 35096 100153 170615 268585 278696 359900 208049 312134 413725
15248 413725 1272679 1998653 1542515 1601312 1648481 703482 254947 464089 336023 79717
15237 -10310 164570 -9665 84546 210237 -27735 185134 -110610 -99867 147148 -200823 191503
15225 200037 -160648 -110106 76558 69236 67066 216053 85220 330613 -244367 193856 -106965
15213 463721 199885 -23985 43671 341209 -75370 235733 166935 12629 -257904 -152132
15203 -152132 289736 199227 -460 -139149 128322 246030 -111600 151251 -39080 -119538 -286221
15192 -286221 -200984 436770 145856 -19476 16970 -77771 307301 -174220 119472 139874
15182 139874 -298838 -35005 77941 -7854 42470 196011 -211218 82590 186773 66569 170343
15171 170343 427622 -15616 43500 103657 239226 219109 195013 -163216 -193102 183938 -86039
15159 238079 44745 127697 -203055 -11691 121667 -13353 98137 -50553 40735 302497 -267467
15147 139631 131545 260373 95322 -173375 297082 -93079 417002 198851 250435 181359 84792
15135 -5748 74280 22798 -81961 -163476 242398 46337 181331 489909 81062 414677 115228
15123 815 28617 48790 263100 53639 464891 160863 306802 -114730 -8538 78396 116639
15112 116639 -440362 88166 -434 503372 102005 321146 368848 10270 35487 99051 -252338
15100 17517 -47422 -34609 490023 24556 261154 -78760 178633 -31399 187483 160656 72793
15088 249860 242715 553968 266462 63702 57545 82605 -165900 171123 176977 181487 -117951
15076 -159208 351746 82969 13232 217414 150661 290188 -97463 178222 -83702 74712 52231
15065 52231 17702 16691 -154121 181019 91052 -63366 98119 230122 65908 145598 -84806
15053 218254 113222 347468 -79170 179803 152660 279550 -316631 411353 357185 257909
15043 257909 116440 -266113 -76861 167585 172481 118964 218838 -41831 226130 -17696 54436
15031 281458 240067 430815 374176 24156 403846 -107685 105218 294172 144360 31099
15020 215579 61150 267062 264930 15931 255146 154513 -35827 365048 3128 250051 -25194
15008 129464 178270 31142 178456 58445 26201 -10664 342880 467666 -21940 676963 229407
14996 115372 82384 376517 289365 282562 33411 -93725 9057 549942 162139 128399 279208
14985 279208 181752 78687 190611 113270 62278 385245 257920 -70030 104492 12524 222128
14974 222128 -99271 122797 124544 359080 132347 34252 156559 280124 118547 275101
14964 275101 451643 284124 150390 212221 427660 282165 179124 225 478160 31651
14953 521040 460355 59735 429472 397171 496447 -7112 96654 321336 -11841 135977 279138
14942 279138 92597 -194340 102314 329970 410793 -190780 291176 43164 233206 118014
14932 118014 162265 245343 305432 146665 -242939 166351 117703 221479 278430 -70063 86478
14920 421730 94078 149625 348718 95723 517095 6578 291829 316119 23228 393590 414524
14909 414524 174430 96006 289543 195571 -112026 317016 437752 258780 477686 455845
14899 455845 523027 285025 615293 363191 88427 429333 198744 243388 296251 320470
14889 320470 249128 392110 372143 256683 342929 284984 202963 297714 205373 503332 170360
14877 468977 647051 388994 210231 249834 466712 416484 329852 621072 176018 651292
14867 651292 355228 310677 605939 478751 170949 92847 557219 384514 273929 337004
14857 337004 168549 246300 556240 521952 639958 320959 501420 172901 362513 210335
14847 210335 323158 383409 142873 339618 446898 233582 415862 345521 397940 394075
14837 394075 390865 46986 82356 248035 125102 170497 355439 441051 138451 423849 553504
14826 553504 371689 276343 399476 219075 472163 255534 605266 57089 685917 417028
14816 417028 423093 590133 330822 387683 28323 428366 707335 533995 413345 556884
14806 556884 517338 551262 670916 290710 407971 565365 25791 150793 501762 479230
14796 479230 284196 692729 228343 407296 512958 565624 579826 665390 527174 621048
14786 621048 857977 19342 262139 730902 757276 436954 260423 386413 582732 402779
14776 402779 642922 416863 352686 412625 481816 850345 696416 374115 484109 630634
14766 630634 769609 439647 687150 380475 579038 30445 458286 756852 582811 405342
14756 405342 1075190 297327 649663 431337 734794 674662 486234 448584 520840 471820
14746 471820 612458 696542 485691 63464 647574 361200 784042 852221 556442 438961
14736 438961 844902 678026 696892 442400 614980 571716 648185 735625 743771 492265 528177
14725 528177 361708 708079 832231 886191 808407 959977 413656 803454 726292 513676
14715 513676 761387 609901 774230 877369 787220 805161 741629 752461 573533 696046
14705 696046 1167060 711354 960357 685278 718580 316580 1031470 1012031 970818 705616
14695 705616 495956 677357 573817 969410 881645 834045 452432 1029156 941518 751666
14685 751666 788970 791582 1208256 849208 955262 992275 746520 785203 987922 963682 952616
14674 952616 770392 885473 718602 919514 983989 1163015 740666 1084215 1051554 970881
14664 970881 1106604 938904 1245272 1035012 1066615 860026 1178044 991496 1109329 939781
14654 939781 1181468 876222 833211 935293 1241895 1035510 1054197 901956 1082292 1264466
14644 1264466 1274063 1146096 952687 1087943 1110523 1196253 1144834 1458788 1136697 1323880
14634 1323880 939711 1218763 883125 972973 1118430 1231337 1368434 1183229 1223190 1346882
14624 1346882 1366047 1539888 1270646 1107530 1226808 1216445 1319377 1447262 1134407 1471445
14614 1471445 1456928 1148172 1362530 1445655 1185231 1603449 1379416 1481851 1334830 1656830
14604 1656830 1494780 1390413 1493447 1576503 1579794 1446871 1203584 1416011 1505538 1778578
14594 1778578 1397747 1560096 1375382 1688360 1497876 1717492 1297691 1823806 1573535
14585 1573535 1832128 1661767 1376059 1828743 2008579 1605694 1735109 1736442 2071468 1895648
14575 1895648 2056037 2035242 1833210 1960423 2259077 2088322 2076824 2184574 2279683 1842885
14565 1842885 2366195 2191079 2256922 2269787 2347657 2465237 2265423 2854248 2861883 2717522
14555 2717522 2814865 3554644 3581622 4008306 4264380 5117389 7274112 11384924 19081254
14546 19081254 38647738 38245408 19331477 11985509 6227675 3632357 2692004 1985513
14538 1985513 2173115 1875281 1784690 2040607 1986820 1919689 2289888 1708319 2090951 1825214
14528 1825214 1861130 2203946 1956575 2316696 2083469 2006151 2314245 2081901 2153097 2230212
14518 2230212 2427108 2452402 2304813 2312306 2381314 2520672 2485398 2599797 2671867 2482426
14508 2482426 2889361 2499493 2535635 2856988 2973410 2925186 2661013 3077286 2718373 2607003
14498 2607003 2899077 3164733 3221220 3017448 2899660 3402338 3022483 3147729 3434812 3484696
14488 3484696 3451554 3252174 3184593 3318558 3165739 3666922 3529904 3256601 3533180 3285899
14478 3285899 4005757 3886707 3619783 3703518 4015152 3592069 4044305 4111952 3911536 4220763
14468 4220763 3924718 4262400 4082526 4542651 4254883 4658817 4139760 4158746 4656338 4400394
14458 4400394 4781927 4733913 4855737 4530691 4594060 4712434 5098120 5021846 5043762 5045144
14448 5045144 5307366 5056425 5528088 5276768 5249978 5377336 5327913 5680483 5709329 5643627
14438 5643627 5792252 5841114 6168779 6157143 6305425 6306403 6729705 6666411 6550334 6205396
14428 6205396 6795140 6759493 6783975 6757861 7149460 6868442 7211276 7143421 7487381 7492872
14418 7492872 7584752 7698739 7988008 7908348 8062982 8305748 8235384 8560346 8257484 8481687
14408 8481687 8687172 9037116 9286487 9121290 9752975 9609060 9517658 9974312 9926211 9963556
14398 9963556 10347149 10487758 10721123 10893388 10878458 11165989 11106114 11669170 11493967 11742321
14388 11742321 12354250 12282060 12675340 12817870 12899792 13098646 13840565 13390383 13891393 14132431
14378 14132431 14691721 14776997 14968386 15421291 15728684 16159563 16192697 16956897 16911207 17161798
14368 17161798 17500024 17909507 18669277 18589367 19435843 19744984 19938781 20332169 20954140
14359 20954140 21294453 21904719 22422157 22998701 23207037 24221508 24456208 24959968 25569514
14350 25569514 26116861 26581652 27335177 28186081 29097857 29838914 30413643 31233970 31996121
14341 31996121 32802763 34036742 34598272 35893606 37024634 37901513 39101134 40260456
14333 40260456 41217737 42468876 43724024 45397265 46735811 48289288 49592018 51464776
14325 51464776 52672412 54558733 56097910 58134618 60220885 62222753 64656777 66687671
14317 66687671 69509412 71681059 74612483 77148596 80674204 83371055 86737454 90365441
14309 90365441 94035001 97952105 101803817 106206564 110772668 115820417 120895797 126308275
14301 126308275 131962248 138073527 144938586 151361352 158621459 166509171 174644857 183023237
14293 183023237 192478058 202172816 212257159 222806481 234186801 246274125 258504812
14286 258504812 271479404 284887563 298897695 313302181 327897348 342589443 357573834
14279 357573834 372204277 386587556 400429210 413429847 424885438 434010013 438542044
14272 438542044 440573979 442548969 443972905 442143458 437581124 433538443 427216085 419956285
14264 419956285 410847263 400246849 387381522 373213751 358057590 342176794 326444753
14257 326444753 310767842 295439229 280743515 266652977 254312082 241153917 228843152
14250 228843152 217170750 205957200 195504787 185694823 176090943 167588876 159700017
14243 159700017 152169305 144676574 137489087 131393304 125303203 120136256 114946144 109496497
14235 109496497 104598196 100372554 95974282 92126114 88631069 84999366 81839126 78198230
14227 78198230 75270201 72547144 69530582 66961602 64405345 61987176 59856107 58210878
14219 58210878 56014990 54257091 52296601 50471082 48969534 47722781 46038730 44937525
14211 44937525 43009181 42027584 40415924 39773429 38786948 37924672 36653919 35280406 34733459
14202 34733459 33646863 32679823 32241649 31307745 30393936 29365230 28651548 28288669 27431290
14193 27431290 26537836 25812034 25303616 25031391 24282940 23526172 22627175 22868878 22095843
14184 22095843 21564879 20780666 20472276 20082708 19878402 19238657 19142666 18631675 18472354
14175 18472354 17415576 17194443 17321188 16710621 16389323 16525238 15965814 15398974 14954094
14166 14954094 14795243 14987596 14549503 13846504 13816262 13776092 13686978 13244048 13066484 12769366
14156 12769366 12482668 12249517 11981588 11694923 11674362 11454454 11419830 11252631 11173681 11229193
14146 11229193 10286329 10250591 10602410 10515282 10024015 9904148 9594208 9236580 9038515 9398690
14136 9398690 9093454 8806575 8937100 8578170 8978362 9018251 8382058 8420915 8304190 8071775
14126 8071775 7645671 7862214 7574742 7484161 7573949 7466906 7058626 7267915 7289524 7409941
14116 7409941 7087657 6678645 6537965 6875505 6471239 6522958 6612438 6022008 6462721 6106718
14106 6106718 6103119 6011972 6125177 5952907 5927614 5516053 5582464 5579707 5931871 5429385 5218131
14095 5218131 5157360 5690967 5224334 5180749 5014449 5168312 5016849 5122853 4786626 4915035
14085 4915035 4759079 4887020 4802282 4590987 4565220 4646968 4561537 4627102 4569204 4003957
14075 4003957 4333084 4412665 4263700 4207983 4000788 3965718 3910273 4077722 3942436 4258051
14065 4258051 3864638 3566338 3926198 4051373 3858342 3842408 3556682 3538553 3545836 3822630
14055 3822630 3685219 3605525 3289806 3195107 3397974 3337430 3185960 3426213 3200375 2912905
14045 2912905 3183444 3239902 3331073 3225005 2996945 3114546 3241304 3273135 3048533 2894715
14035 2894715 3040446 3090465 2983215 2730743 2932389 2788271 3092305 2890764 2694740 2701926
14025 2701926 2709675 2650044 2776209 2523847 2492351 2378902 2514003 2279112 2293598 2521736
14015 2521736 2650240 2168844 2431224 2346002 2398836 2615857 2240942 1910597 2508718 2399099
14005 2399099 2281574 2365121 2022109 2114615 2345244 1969648 2193995 1930519 1836816 2089737
13995 2089737 1995342 2174785 1991907 2127510 2245101 2781241 4086506 6561743 12897293
13986 12897293 31719159 41498131 23329790 12666008 8300179 5932937 4417294 3924965
13978 3924965 3900597 3006060 2913025 2739611 2775491 2657243 2607975 2207969 2258418 2101025
13968 2101025 2186210 2110246 2645666 2246322 2042692 2202577 1903718 2259141 2309152 1872746
13958 1872746 1963102 1977181 2236711 2097697 1771097 1864077 2101036 1987247 1790919 1861531
13948 1861531 1449465 1601012 1893913 1657253 1895303 1823103 1694823 1690715 1595016 2101307
13938 2101307 1528631 1575243 1812226 1588611 1661096 1621051 1659110 1584231 1582391 1559616 1494652
13927 1494652 1533781 1659565 1510442 1519441 1357093 1296700 1399452 1497704 1533174 1285340
13917 1285340 1611777 1374988 1325751 1667486 1230100 1070361 1399975 1301533 1176605 1338585
13907 1338585 1596252 1218186 1109274 1362870 1163226 1398220 1317030 1553199 1103468 1494223
13897 1494223 1163979 1269476 1267518 933069 1301911 1305303 1313063 977928 1089274 992591 1436201
13886 1436201 1160823 1235956 1238932 1036517 1244690 1235130 1058432 1303505 1032633 1094225
13876 1094225 1144591 1004275 1084632 860664 1123297 1254519 1043094 910034 989936 1473469
13866 1473469 1250703 974964 1173747 627626 813387 764522 761702 970896 844616 695453
13856 695453 958962 833560 1080871 894661 692700 1164951 1072660 1140393 1135508 923659
13846 923659 1177549 826513 938829 941900 1185116 1056573 809857 758684 881621 759339
13836 759339 976268 1020180 915390 809003 1106437 483896 890641 742171 900564 650358
13826 650358 798163 657409 886490 736985 1118930 886423 947842 1014531 1004582 998444 756881
13815 756881 1008311 813594 634495 581857 770212 693940 754984 928831 409034 804818
13805 804818 739485 900186 712944 844311 632859 851233 1018348 748810 734990 629331
13795 629331 841866 626886 690974 614974 825428 640686 926304 932861 1068432 859857
13785 859857 851263 832083 1033929 933264 918783 957028 581076 414253 477085 608542 944102
13774 944102 562402 775897 631096 981652 868594 700590 504526 582454 317542 633073
13764 633073 745113 606952 592324 440529 728146 758290 553410 677921 345090 604979
13754 604979 733418 552054 303930 731731 740591 751732 627728 394907 415200 467910
13744 467910 550943 595243 470734 821119 666541 497255 596491 525874 504284 588605 441566
13733 441566 659789 993384 712965 193223 872040 576993 470741 725820 814071 401852
13722 524147 716364 462675 511354 483643 677970 496895 516493 366114 522045 246856
13711 612274 468972 221022 446264 463758 572274 422721 684526 616480 626024 670956
13701 670956 436520 663210 385668 320238 784743 488612 639178 294240 312106 518743
13691 518743 492492 765555 588523 412927 426071 379145 475194 376364 678768 529990
13681 529990 307171 437499 475559 351868 229914 198063 461010 542247 551991 545722 224573
13669 558780 685672 672450 555173 372805 478031 482140 409317 299925 649843 287786
13658 500716 642150 281043 469887 349672 429657 743746 322614 267365 592008 381270
13648 381270 584661 252163 467761 380841 374466 476215 273571 473162 664212 328024
13637 368039 528648 373134 314668 254378 346957 22614 345723 202530 477572 158868
13626 273733 481470 563117 367989 590776 408410 228271 207011 580703 258481 335560
13616 335560 375743 385422 518755 163261 501727 183933 715982 -22018 259401 587943
13606 587943 90822 399460 279168 657489 251889 70828 351943 341928 209225 520978
13596 520978 240565 -83654 126902 389695 647244 493121 411322 179687 340509 461591
13586 461591 339680 506887 267107 424722 351704 299156 245875 236697 326520 204030 322857
13575 322857 259168 434588 452684 422484 482284 463724 117503 545566 278382 255134 383916
13564 383916 98471 576796 349209 -15373 188374 216641 469206 278834 343028 306883
13554 306883 72370 203560 161249 457836 60309 362904 453215 381596 302497 156069 317652
13543 317652 241323 547669 603782 440824 123859 247748 257664 322778 339721 188406 -52210
13531 350448 58126 205656 244969 405603 -35421 505091 249955 223573 106364 265314
13521 265314 299788 99055 146288 222093 126155 23850 253558 116130 302893 624147 315410
13510 315410 213436 48774 312552 436115 34132 16147 225258 411318 -89443 472191
13499 103522 52227 578676 150038 190052 221611 230031 65574 280159 381593 670533 169672
13487 197326 30588 337022 421187 113304 218104 150901 171608 109568 239700 125758
13477 125758 7475 262324 384546 110624 141777 5479 210730 306871 242449 331605 197698
13466 197698 201605 287015 155580 252453 717634 470355 483342 -162876 83653 191192 195983
13455 195983 252844 417018 -70865 -215530 109874 233179 119845 483301 379621 196165
13445 196165 530894 -304935 -162135 -10772 -7638 455572 121296 247309 372688 271865
13435 271865 539163 300806 87498 413474 332715 403517 275443 384373 -102947 454841
13424 -46052 418139 -165649 497656 273867 162981 508313 97403 211786 194424 200190
13414 200190 343116 422132 348913 274001 364167 26936 -43243 320755 202796 245535 385779
13403 385779 161692 43896 163426 74976 347971 339869 -169533 -12368 462348 64273 235561
13392 235561 386411 432602 263798 453500 39509 322590 193516 185362 184103 -70 464977
13380 325421 84582 326017 55330 56052 254801 411738 219494 183419 138046 284945 288161
13369 288161 283974 -212734 367865 392189 68549 134319 -60695 -113481 59254 263491 115805
13357 307796 145482 377340 274545 48663 -118020 169935 -180715 186192 150756 167921
13347 167921 373230 247075 405136 7013 314709 512356 279425 72841 277002 183749
13337 183749 431243 -144315 290658 533163 130211 142779 269468 32979 411131 95898
13326 -88082 309773 55973 -17818 188714 65706 13111 394667 201597 164763 368281 14176
13314 598612 654411 288463 125597 781094 261855 175906 69972 -62604 -44380 364496
13303 168572 96468 163573 351034 66734 150532 41756 183349 251375 8744 175372 40117
13291 -27650 303360 209000 148975 -71741 122403 237434 200271 163858 321935 113606 -221031
13279 11956 219222 195622 224738 -74962 1316 -138864 184934 386682 158349 36320 31674
13268 31674 -27588 58091 -157670 -61669 153401 236073 54594 27731 72860 146314 45137
13256 290070 99452 11130 252185 73824 94617 252397 125636 54114 -294496 63089 191836
13245 191836 -293884 373031 95302 75176 -38322 326593 255952 -50648 130465 355714
13235 355714 95126 32481 13112 209495 111387 273943 125192 -110468 148380 -103372
13224 57187 -72178 -85190 202631 417262 51623 -144594 260973 138699 -120053 -166641
13214 -166641 -120091 16477 -294134 280926 251854 102171 -36099 286445 414206 -167696
13203 271280 49857 286986 138679 -33212 55582 116216 18122 160879 37295 105442 -40397
13191 34616 278839 174622 119915 110034 -13535 -66688 19628 45164 169964 82040 274338
13180 274338 371111 -133894 47168 218297 76510 70009 -76892 -215082 93118 75648 6884
13168 5190 26910 95944 40816 -121702 30766 70697 18731 -165333 292449 290917 165058
13157 165058 14351 251130 139097 1954 -35969 142238 82940 82517 115705 -299208 20043
13145 -44119 78237 53537 126337 296618 314490 -57307 661 -146194 -108905 46414 350070
13134 350070 261584 13940 218154 -202622 -59326 79754 -110922 -109965 -150247 -33951 -16306
13122 160320 111947 43396 237061 95240 -32703 5336 -2040 157469 -165211 76367 310078
13111 310078 -131983 -95972 173349 126476 39892 48896 53550 62967 -57947 -21069 -86039 134438
13098 -108192 -449846 -18660 204936 185734 143550 -69270 2958 116782 -88094 -58747 -110696
13087 -110696 245312 157734 -66595 -63954 58129 -136128 62431 162698 119549 369574 176402
13075 -84816 -23577 211187 -29827 -9728 278156 48318 125842 251182 98327 236643 36305
13063 -184319 172497 24288 -185429 242112 366126 284235 64997 58135 51615 121070 70263
13052 70263 12485 111708 37900 244134 120169 137171 33104 -224596 166781 -5318 229022
13040 470369 449506 53799 190009 230288 73913 -388752 -73515 -108602 25494 -114356 -80310
13029 -80310 -33624 241795 -23752 -138330 59795 194883 -61953 -96089 11946 239261 -32496
13017 73008 199095 -151709 49709 143829 32654 -23690 -221078 194287 -49847 48642 277503
13006 277503 238802 179747 233362 -291608 -270062 146445 -225144 142256 102686 11329 -104986
12994 305362 -162218 -61438 -281718 205748 97089 207819 -2451 -78536 -22490 150264 64798
12982 9997 200574 6428 -151180 72092 95124 103073 -47458 144310 109145 -52404 184474
12970 -8201 -311310 371743 -101253 222868 320017 90368 203173 81262 320560 268705 245944
12959 245944 -87963 275855 21465 -31230 58909 -209055 -86909 203045 198518 395299 -10687
12947 329834 178442 -175615 269936 4174 177453 -389314 -63745 203246 207097 -39727 -105420
12936 -105420 187615 14742 48619 -154032 -96087 154465 213487 24742 -114282 -271153
12926 -271153 37475 -309393 -42780 298131 140856 280562 152049 228811 -61637 40942
12915 85125 -28785 -244738 -69978 -300382 17110 -182415 -47660 40110 288657 193836 37897
12903 -101658 -217338 104599 230994 15228 78082 -89128 -26187 -37210 173323 9178 53422
12892 53422 123035 -193579 233833 224971 303580 299215 -81052 -23307 -40127 201995 145146
12881 145146 241882 -129280 288025 154298 90249 3272 142404 405768 -177448 96778
12870 -302566 -98691 243117 -326832 -235712 -289512 49829 80773 -227704 -129504 -92757 232611
12858 -43832 212502 -11279 -244300 308823 226631 132055 -765 -57362 -319757 344556 135117
12846 -88586 134026 -280973 151956 158536 189215 8665 20875 -151323 -209973 -225373 -13115
12834 -337247 192736 270619 77846 20663 326190 306236 -69572 -281450 37634 166748 35049
12822 -350515 -127112 141392 7402 244567 -87833 93701 -290982 2524 -6418 -35119 -109890
12811 -109890 -247818 208019 31847 117177 221211 126610 -58403 267282 -373630 21690
12800 124668 16042 26136 -198849 -274463 230336 77360 139348 -48694 109680 83037 -275682
12788 -189940 -116700 -289363 -100264 -16075 116345 -186436 135667 123339 194905 -329961
12777 81812 103240 -158868 3350 -325441 -179122 -51407 193067 163687 -91634 4242 109323
12766 109323 378827 163748 -213328 146120 45050 87690 -116866 -95567 364408 84343
12755 103569 -32494 -260103 -76883 70972 -97116 105074 204474 19652 19060 -351571 332116
12743 -153215 143494 151132 -156297 173994 -110658 244869 -94095 -147782 -266970 127594
12732 162282 147652 62858 59708 -15578 306365 -19527 -78946 -7674 -186553 266129 -27864
12720 262546 28345 -165516 8383 -30768 194705 -184967 -175603 52017 5017 523852 278296
12709 278296 30433 65044 273338 18904 -180700 587998 131783 114427 62695 211388
12699 211388 222939 75424 532995 101078 249521 38106 165424 169246 230582 -98497 139439
12687 319204 -145503 12990 321850 157429 246092 242388 -128697 387779 -43001 303962
12676 13281 -128676 327719 318728 84744 341463 10093 69021 193689 203801 33479 12235
12664 361970 226228 126974 -199159 -60640 16924 -68939 313079 62649 50266 3183 105401
12653 105401 73105 306159 -3870 232480 382099 -63525 151303 275167 161831 344803
12643 344803 -45054 -102426 220303 94373 83174 221881 -5021 159616 14849 329568 197676
12632 197676 457966 53318 4766 409169 42707 285359 161430 33118 209055 70028 215108
12621 215108 435018 69617 128616 27846 -60094 52947 156844 289544 100548 -39242 -117264
12610 -117264 -95436 7360 -93779 -143926 72142 -115798 110700 -171326 67981 55158 115164
12599 115164 313313 24642 94988 336150 74330 -105756 -82547 -257544 -83406 -106222 140429
12587 -224425 201186 -161542 354978 -108791 -174178 251598 -278244 218356 26161 -4490
12576 80778 -8377 -35152 -72423 -19958 -332923 -215503 106431 61445 -128532 -170495 -325722
12565 -325722 1054 -25611 265007 223088 158887 87835 -212577 285830 31249 -17790 266393
12553 227740 137093 -88811 -225886 111425 -371635 -149144 -33010 4831 92770 72662 226945
12542 226945 -43260 38227 202503 -212856 158865 -154584 203757 -475599 377977 -174581
12531 -119129 183865 22479 -69744 81304 262130 353264 8725 -177163 36632 236004 -92732
12519 129560 282322 -10891 350039 268 -195929 302031 274162 239998 27060 437354 108663
12507 178235 -25918 116513 -284874 -187102 186002 -156501 -1838 119389 -204729 162570
12496 319702 157415 35051 -297661 68529 -381767 118476 -435100 56111 119503 224275
12486 224275 -93681 79330 -31654 -19867 174210 -110933 -83626 -175813 207086 18959 52958
12475 52958 -147514 66405 -40645 172304 -39535 -182877 105914 256382 402787 -343846
12464 -150189 22950 5342 -21674 -191768 -111743 -216534 -162440 106516 -134556 -120911 -67162
12453 -67162 46864 -124004 117378 71596 -353729 -205545 40718 -53417 -48613 -95177 169572
12441 -67568 105271 -173810 -153317 -107858 -140086 -80117 -98704 119495 69684 -81028 -204099
12430 -204099 161177 37094 -124142 -100450 -37180 -395969 14468 92018 -238755 -8446 -142751
12419 -142751 94798 401668 -24254 163844 -8893 13882 8744 236020 191007 -82085 199084
12407 204598 -162937 -148765 -161472 -47097 -220558 28924 239535 -26999 -14392 -28012 96717
12395 -228527 45682 -89910 -50882 -15577 176535 -89283 181977 -72473 -63455 -322922 156413
12383 182527 285042 154284 364821 -114641 14344 286361 281690 133988 106545 82993
12373 82993 -13212 48692 -198438 17206 -55847 166746 -30564 -157156 -60754 -25576 49767
12361 -268391 51651 -181495 -78994 160795 -2058 190954 197132 -1839 -162961 -65898 -181073
12350 -181073 -79562 291664 -11170 -47188 -197950 31165 153760 126415 73515 -112602 -126849
12339 -126849 92793 190754 -102128 245480 148554 -161062 182659 -54982 -115213 130403
12328 215701 -131615 -82796 9492 -104912 -26897 -65848 279613 73575 323305 128451 394128
12317 394128 -173724 -21857 -15727 -270486 188609 300132 93607 -44755 31335 -322186 181163
12305 -25735 37305 -10627 -87713 -58323 459 7404 97671 113978 -81599 -127785 -18846 1352
12292 -65937 -151306 19518 18961 -45846 40084 -44983 364044 186398 188539 167679 -50587 365678
12279 82695 283326 -322329 112209 80825 54956 160813 194856 -11362 -103879 67488 -194985
12267 -56021 -129997 -87924 53672 283164 -71853 262 -78340 245821 -53353 151486 216511
12256 216511 482232 61007 -172872 101216 184782 -12320 17064 -118788 -31240 148950
12245 130772 -124349 -177594 191776 332534 -80490 -158658 561142 -128767 258041 348580
12235 348580 414827 -91308 121074 -26572 161327 142880 204026 44088 94937 445614 284362
12224 284362 177742 260285 -24248 330088 470058 107584 193998 447884 272696 463495
12214 463495 251912 159567 224284 -204355 370019 -50389 108963 -60 173345 155590 62588
12202 127198 155534 207308 156063 -252543 298367 49427 -290153 -88586 179195 67285 78575
12191 78575 -56403 234834 104065 -142347 388976 91076 392809 -46205 -13516 106578
12180 32859 93817 -90557 -101516 147925 -28349 170897 75684 93395 433528 112309 117121
12169 117121 122 402313 108671 550148 -99133 73888 107374 313927 101161 10442 -34458
12157 279682 -158878 184736 249636 127628 217087 -266092 140134 291965 101086 216694
12147 216694 111198 74344 223042 129805 -161500 -51216 203237 164478 28361 32256 -28573
12135 -82571 -242700 -112863 -55973 -83963 14844 209838 -190559 24703 -88144 192487 -26079
12123 7624 69360 -42732 -277866 -154235 -208257 -240310 -160572 7760 315904 17832 52627
12112 52627 -2372 231158 -12403 187124 302128 38708 85267 184002 -123203 -136358 55955
12100 572 89520 164535 -130647 -183697 215277 23049 64182 122676 -125328 -210004 268229
12088 -16698 107404 16344 -110127 355766 178058 186223 116644 185581 -96011 186180 10616
12076 -21926 -164098 -392526 28923 -17393 58766 247558 9617 -28343 59906 162174 -19047
12064 67607 -54834 -82911 -336115 109914 28342 106633 360130 111372 537648 1234922
12054 1234922 1471668 663580 241478 362817 110119 245234 -102544 -303937 -148152
12044 21998 -390172 -131221 -158206 -163345 98996 -364704 -385627 60974 56772 -242122 141964
12032 -134502 -163137 94054 244452 -54086 95640 347047 -97351 28967 -227097 -22616 94986
12020 46364 -61057 -5836 136468 -243172 94854 32944 185158 194330 -67015 -11058 -108364
12009 -108364 131689 -370638 -275550 230233 -25534 292947 41444 205158 73338 70552 -46019
11997 25384 -131324 37656 7515 149383 105162 -150457 24293 180523 -93281 126610 -275735
11985 2882 172253 168030 181049 -180636 -419611 -197602 -199255 52245 278740 128828 -108757
11973 -291296 -173025 -214952 -27616 -142599 181709 185871 243988 -48493 -401453 171421 43960
11961 60026 58751 -121912 -77572 -129150 157631 -53905 -10239 334760 105134 -160064 -63113
11949 151405 60903 -102790 -180586 253552 -146922 92370 2495 196684 154562 -81617 15835
11937 193892 44975 -221821 45200 -16982 187684 11164 41278 -88567 121618 -292639 119008
11925 -49849 50959 -165120 -87102 195779 -129433 -22158 27751 28192 143725 176786 -30724
11913 213589 80537 136167 32156 26485 -90414 34077 183998 58256 169029 10283 377738
11902 377738 302699 -56017 90349 -30786 -243090 -320842 153405 -205352 -165970 27257 -311562
11890 -152973 -7861 -214982 4774 -185013 -19686 -336855 210762 -40394 59074 -488877 46348
11878 -236197 -94461 -181635 20098 2863 193954 240227 492518 -31717 -196212 56618 -4380
11866 -33194 -46269 -63328 312217 78186 -73614 -145257 36884 5254 257196 256413 -113215 -169575
11854 -169575 51830 -44633 174836 7092 -31712 225210 -237858 329688 81904 -174551 182326
11842 -518644 -261629 20118 73376 -6125 -181121 98475 60481 -215973 -146800 -80869 24053
11830 -28571 -288186 -171226 -74635 78032 33061 -321575 -38045 -108532 229597 -317778 -119474
11818 -47055 -88944 160696 -136915 -136256 -116831 -53967 -106613 -232338 -107472 -158143 63273
11806 -95435 -91603 -58473 59623 131029 210136 52443 509 -16611 111038 191935 -4254 -14203
11794 -14203 86886 104772 -447188 31541 158131 84262 -177907 -136076 -38128 -70320 -245201
11783 -245201 245118 51669 -176268 139862 148581 101061 -113642 -41371 82862 65544 -3766
11771 -11831 -116079 2251 -49677 169696 -237198 -55706 252166 -11876 -5225 -186408 6034
11759 -18206 -2605 -162411 212226 -53046 -254343 -195241 195435 -7425 -190959 185864 -165205
11747 13506 -81632 326938 159770 -239901 -85130 181783 78787 -30079 -321374 -127404
11736 -55440 182017 -236203 263942 44353 96584 -325684 79509 -303899 -24372 306562
11725 77408 -57177 29430 -30667 92637 -41224 -185515 319316 142855 85263 -120470 -385051
11714 -385051 188529 230619 -146248 -148701 -11090 -188360 161443 -87077 -304303 137294
11703 233050 -7989 74565 11995 -60818 -110763 -157187 -71151 170240 -92156 -194863 -219504
11692 -219504 -331807 -155454 -26189 34285 -207687 145872 -332183 13628 91901 259 20976
11681 20976 40092 84278 41309 -19074 -144043 -112354 54162 122743 -202748 -46166 -18667
11669 156651 -223080 125722 -337963 221490 305438 206554 -259116 110577 67798 49766
11659 49766 -162783 -461132 -113766 -31075 67006 104796 -178146 102551 -125117 42908
11648 9159 -92522 -101441 166852 -24750 -20516 -182478 288551 80281 -34080 2557 84896 82350
11636 82350 -178954 -83044 -80658 337068 110198 218347 -1604 -248561 76914 132119 -46957
11624 -415649 -66438 -32379 -429284 141653 207725 390261 -181261 224985 87740 244984
11614 244984 65785 -180984 -135764 217748 120380 -15602 -151621 55553 124129 -188248 -157250
11603 -157250 -172409 -34467 2406 -85402 -82919 377199 63098 299465 276438 146765 235882
11592 235882 -143190 -7565 96753 18505 -79897 262667 94353 25778 -78749 -67882 -149974
11581 -149974 12912 38602 224440 -232502 93594 -20560 38532 138528 57762 73998 -64131
11569 73447 175396 10505 -175937 66939 194315 40195 -21653 241637 -337438 95464 364443
11558 364443 228588 31846 209754 260452 215084 -40528 -66298 -17936 438463 14056 194950
11547 194950 170825 128130 146221 114150 306213 260507 -173342 266072 96656 -225643 -28971
11535 314505 148911 -90344 67938 29374 105139 201152 40301 -134296 -118 53195 189622
11524 189622 -53731 124416 208227 15504 -60140 264875 -33220 -182763 26275 108015 240029
11513 240029 -101897 -79414 -124876 246968 -36184 65373 -238024 237443 191542 74483 189561
11502 189561 149995 31259 96894 72503 176960 -81019 76102 156314 -63187 83933 101453
11491 101453 -59373 92775 -223923 -32744 -8964 92329 49803 123415 484770 214080 254270
11480 254270 -156539 -92395 -115469 -239264 336829 67649 -26272 212290 317530 204769
11470 204769 198779 61550 110328 159931 -18820 -25232 13514 237775 102185 410499 -123655
11458 103831 -168648 23088 -247964 -73972 32272 -22210 204891 35119 161002 20061 220156
11447 220156 -80804 -54606 266006 -131299 220704 136543 105591 21215 85698 68635 477852
11436 477852 136882 237584 89559 184650 -103543 -204710 -176882 -137705 281973 48551
11425 32226 184352 60667 415841 -133766 19799 14872 32907 205771 -50207 -48978 9219
11413 56894 -75302 -86826 144440 -37995 -131068 68886 -397957 17347 8520 388487 42272
11401 292920 132105 -189213 -91798 167863 -277922 -197096 -54105 -81388 9887 -77847 84199
11389 144763 -77305 49908 -96966 40329 93665 167326 -203878 256194 151396 126887 163115
11378 163115 -6122 97611 131187 156803 43865 162585 75353 169202 89614 -42398 -189414
11367 -189414 -35495 -113207 -176610 -91703 -87204 -159820 -155894 101843 -104092 52903 -78109
11355 -133374 -101098 -245109 6773 -139243 36063 240796 38597 -66698 -332328 7680 28274
11344 28274 119140 -70743 350723 -265432 115616 266463 172661 -479266 56164 185133
11334 185133 254224 163445 56360 48693 -48266 -457 -371243 -118131 -299072 -53667 39229
11322 5863 131778 77986 -198670 156470 19703 -134231 -239568 -234366 -75674 231815 -84719
11310 -57552 -157530 -356339 -294123 -172706 49277 -336037 106947 127636 -119195 312963
11299 -53872 -154525 107454 -41439 -49817 -171834 -168114 -115385 5930 -382280 -211925 211472
11287 143704 272483 317579 286764 8450 -248039 -72188 2504 -433116 201054 301474 -133435
11275 -111375 -208482 392464 -96689 -383415 98293 180577 11240 122304 52547 -224909 157002
11263 -224413 -470380 6900 83003 -144420 309097 85416 -61208 -199458 -114520 96767 319659
11252 319659 103239 -207040 -84055 -24285 -177704 78003 -177717 239430 -123623 31222
11241 64121 -233928 -114720 223072 -96839 -170684 86837 -111322 -142715 -267489 -61353 -34737
11230 -34737 -250822 -100746 54835 -15867 -54607 -6237 127975 -12934 -69069 -350248 -262895
11219 -262895 76322 -197197 -219492 -59200 -110107 92128 -248412 -190612 22376 -21928 -72928
11208 -72928 -126450 63252 55172 -166710 -174566 -347545 -88186 27465 72125 -241116 -112381
11196 -121564 257054 49968 -182335 -92347 -188812 -92862 287547 -154327 -18651 -161573
11186 -161573 75112 131521 -64018 -30193 -80837 177061 -74030 -200661 -238469 -205368 -26726
11174 112676 -218673 -307908 47124 -244804 286439 220382 -2603 -76319 134306 -114876 -280136
11163 -280136 176842 48706 -195446 -27653 -153175 -276089 12336 -5863 -202773 -198664 210457
11151 204677 -45292 -72882 73115 469593 146879 -179238 7820 263821 255826 -160242 -62104
11139 -197252 50591 -38565 -176803 -324578 -30181 -152381 -269976 233733 -51597 456907
11128 188626 155003 192932 40758 60949 210137 153548 261920 -188245 -146667 -147356 -183750
11117 -183750 12291 241911 -70197 12006 -225229 382072 176751 12773 74468 103457 42038
11105 64735 148608 -153 21921 378443 151566 146817 -65351 265171 141168 116991 223400
11094 223400 505056 156949 342950 420791 327302 -118544 263954 -149223 264824 337329
11084 337329 155257 428929 78584 150344 264775 210190 255986 72978 270768 59642 -2997
11072 648679 504195 393855 641581 99143 -10241 464594 211924 576122 487559 328635
11062 328635 178924 618756 448255 793132 559273 323771 288649 625774 888358 624392
11052 624392 875474 305217 700579 502296 1108283 843415 757960 618627 796505 815207
11042 815207 455242 1003175 760801 736128 1051371 628921 885354 680389 1238818 801235
11032 801235 566502 708585 735396 933373 546163 861086 692789 633954 707087 878103
11022 878103 439118 809154 677273 619810 395839 501458 602825 785820 481884 173306
11011 290188 579486 632539 637980 1085703 987199 794766 778936 685396 603395 653343 746854
11000 746854 608518 584316 798372 699547 750190 808534 606327 682189 874232 863044 756110
10989 756110 581003 792155 779313 1057177 911439 813830 877934 1067815 1107799 1308630
10979 1308630 1042106 1724099 1665809 1909256 2273181 2254907 2470582 2637997 3103325 3172188
10969 3172188 3063711 2811333 2873734 2526106 2370767 1890742 1601229 1368888 1675000 1335329
10959 1335329 1355656 1235348 1491014 1076259 1553008 930601 952604 963599 836574 735644
10949 735644 611432 252812 219521 459819 347153 -81108 18134 319560 197719 67603
10938 -2524 428627 45296 38010 169127 -166906 -59639 112567 48471 213368 -13697 94430
10926 -36498 -2605 18865 -118315 60000 -160318 -98568 23882 -8424 91912 -158853 332304
10914 -221168 103893 -234843 -82837 310530 2606 98885 514039 -104741 -244066 -235674 89986
10902 11174 -337552 67204 240118 -199 -20443 121178 81937 -9674 151929 137996 -105359
10890 -135466 -20856 4456 -68457 158612 110084 -179937 -99330 -168886 333359 253499 -183804
10878 -1748 81402 25175 19556 -10512 -51035 33720 -220651 298772 -14585 49782 210657
10867 210657 -75631 185304 -213245 -263402 -100344 -42000 133110 -85724 67348 105181 -171403
10855 64065 60943 -371479 239158 57913 -12682 298666 -36749 55390 82165 -18257 -61464
10844 -61464 130865 -41990 -171423 101126 176746 225059 78927 104500 -77712 -21381 -149079
10833 -149079 186342 254662 -39643 -168200 -150721 -123365 56517 70782 -16699 116313 213
10821 81483 31811 -10502 -16628 131240 -418594 -91419 -66753 -59399 -157612 28534 -237615
10809 60567 -135000 -402860 -218345 -337381 253182 133064 28 24930 92759 -195363 83139
10797 -92898 110372 -100479 -71375 11505 -229533 -249086 -138043 353225 -252555 73201
10786 -139677 257058 -121373 -61668 203865 27087 132426 -295412 -191494 121820 168768
10776 168768 178490 -472604 -162460 -62654 -66610 -123565 -27308 169056 64558 -236656 -88120
10764 -277530 -314865 108671 -35371 -311992 304082 76004 37790 -21207 -157056 103728
10753 -69113 43890 -317781 -285160 -154247 395639 -47822 -275760 209086 -134103 -81488
10743 -81488 13150 -37642 48634 -12069 76313 130603 64242 228824 198275 58449 -138184
10731 146154 10351 203530 53520 75866 -222027 207782 -140084 -471338 -16311 37091
10720 26101 -39049 -67302 -28273 143213 7333 -77844 57419 93533 -214200 -14139 -46266
10709 -46266 -185893 -270023 262307 -7889 -145638 -383926 209138 157977 -386674 -212456
10699 -212456 54882 -151615 -218168 39407 -125995 -99035 -188267 -104659 -185245 -85231 56166
10687 -12813 -87810 -256658 161547 -231832 201288 145627 -71927 371068 402691 -137379
10676 -289884 -23678 -173493 -307514 55348 194079 188247 -149925 -178543 -85267 -114950 -18062
10664 -244665 -245517 -135934 -173455 -262678 142867 43280 -63541 -273499 -303493 -279406 193057
10652 34363 24347 211407 -171013 158894 3730 -226061 -76112 -63058 -129333 96875 -209083
10640 77115 -12558 271833 -336673 -149847 -180636 17339 -293066 -21406 16714 -382243 -14227
10628 -140742 -266780 -49299 2320 196067 175861 -381915 -103151 115601 -169848 33470
10617 100321 93811 255117 77060 95912 164128 141003 -21787 -159890 -126613 -196429 -191990
10606 -191990 -62480 -25927 -146998 284341 -89985 -27602 98123 51911 78504 147945 8631
10594 118681 -250616 -14464 -160772 -388111 89179 -4571 -101294 -172494 307853 -92319 182036
10582 93299 61995 -274404 -73517 165324 -140024 -311667 3055 -70435 -141947 -150003 -83863
10571 -83863 -149038 -169754 22994 -81671 -401 164853 -97855 51404 -204847 -79839 -70980 109838
10558 314283 -233927 -172558 -46393 82074 -180930 -128776 -330600 83236 -44622 -14801 173098
10546 -179860 -262492 -29115 219524 83699 -252489 -371281 -6341 48024 -144101 -237052 127371
10534 -232205 -67403 56620 202133 -18863 -96604 -174550 87158 -11613 -201354 19011 120381
10523 120381 102198 -75561 -285949 38653 150998 7614 -119179 -224647 -17650 166657 274076
10512 274076 -137995 324592 -20937 303006 -268348 599041 7243 -86571 1806 -152438 -168351
10501 -168351 -199808 43566 -248734 77490 -237307 4056 147632 -143289 48543 -140716 -35604
10489 -326076 419180 -11050 78111 -242485 -171927 6415 40664 -93048 232233 -72622 244375
10477 370776 313681 -89800 -63620 102387 165521 87220 123226 -228112 -468797 174364 -273227
10465 -99392 83914 151671 110210 -63449 110583 -115071 6068 -77047 -13121 -226534 -379789
10454 -379789 36637 -110241 -248664 277508 92937 51974 196388 -297540 62608 128732
10444 128732 80093 268160 -193395 110557 -138723 -3546 -307116 90879 -120215 -39583
10433 -122986 58651 -108282 376467 -12966 -18531 19554 44969 -81702 -84386 -110380 -15260
10421 130170 -269065 37526 -155335 21110 163153 -191144 -190643 334403 -2989 -156708 144630
10409 12123 -59123 116706 -347705 -267199 -217185 -71179 -79226 21948 77441 247900 240638
10398 240638 60652 112123 -164115 -233317 -10032 189702 -1397 56817 152969 183459 123301
10387 123301 121475 312478 78698 417243 113391 -303745 -33072 94031 -31289 211607 132010
10376 132010 62830 503166 2729 170929 227653 365758 239494 571931 610009 352291
10366 352291 292600 548216 374463 784156 195120 138602 562749 412639 -57812 417902
10355 -144145 225768 358160 383792 279402 327888 622569 157967 110704 135378 168774
10345 168774 131829 104569 384966 45261 314170 220429 -73124 59479 117114 399641 105452
10333 67398 257899 42421 168977 318884 -124799 159048 317302 88088 125842 435022
10323 435022 456819 326602 310292 81759 259996 -99129 79772 34527 -61240 228076 286132
10312 286132 164539 -106666 -12035 89686 269103 -276323 81839 264500 -6356 -79549 178584
10300 -1388 173219 71127 104493 154891 7846 -121112 -34671 229297 -34524 206239 34834
10288 -143521 149413 -202227 -114400 339064 67155 135588 -129317 -21900 138520 -108281
10277 -341049 -141288 -426469 222154 5995 105785 189378 332396 -51249 -93786 -212889 -85334
10265 114634 -262897 117660 33006 158049 -31806 210499 1251 86082 -211833 -62153 126144
10253 209394 116776 224216 93845 211320 -264690 336237 13735 -183026 225693 -142165
10242 -98159 -415418 -303182 -157592 194636 -127789 16916 -77132 -82270 -301335 -213619 -59877
10230 -353567 144165 -97382 -71451 -76003 148178 -11352 -20022 -54662 -23523 141290 -355512
10218 77648 69436 -203286 -203361 37429 62724 -161650 -76556 -283306 -70948 -392303 -128134
10206 232155 16309 -159873 2511 -202472 -70308 31857 9749 33321 -106240 -179957 -229234
10195 -229234 134736 221879 -165277 -96290 320660 22304 -185671 9322 -122526 -357105
10185 -357105 208771 -43983 215807 -239763 -181960 -7687 -181915 -225502 158863 -257451
10174 -183891 -18712 -196935 52575 73205 -127678 289875 146073 -150716 371613 197360
10164 197360 -210559 -211658 -196400 16287 -132387 -137800 -267606 16115 -212098 48630 -333984
10152 -10645 -301174 69723 123058 -6853 -147508 -251754 185548 -46806 -285618 6580 88420
10141 88420 195321 -372717 -2851 -221517 116591 169388 -69465 -215532 67957 -325365 -513273
10130 -513273 -229202 81318 1210 -69557 121985 114360 129869 -57530 -64904 -162904 -72269 43424
10117 -219649 69715 -243893 -270474 76377 -135945 155390 -54151 -185150 -5690 220944 42673
10105 26943 -47313 64617 318367 -80103 52016 249756 69077 -50271 90594 -98666 178319
10093 199363 211802 -29878 -218124 -120653 4262 -82833 -5081 -45367 -271580 -221697 -37410
10081 -184629 71031 104213 -77773 2052 -63111 -6540 -21928 -62326 23087 187899 351519
10070 351519 -261527 -183893 -366543 -304273 355384 -268435 74363 150874 -45856 -117589 211302
10058 77192 423032 9053 -244276 -147228 -117979 -42880 -184989 -555 -148267 -168577 -210659
10047 -210659 196176 -153842 -192741 -31302 204670 -187375 -36098 -137847 -110881 105287
10036 -59412 -218343 -107448 -200129 -197778 -62731 -283678 -428499 36338 67953 -146966 -194906
10025 -194906 -255732 -388615 -61148 82371 -154907 -31064 150091 156233 60836 -5882 -388838
10014 -388838 92070 -209911 32011 118861 -270348 -114170 -298322 86180 126191 -374093
10003 -128748 -316755 35289 -144282 -303616 275714 -215865 -284636 160560 -5882 -118619
9993 -118619 165644 -74496 110032 -19948 -52828 -55335 -168768 -149906 -88997 -198442 124810
9981 114109 -62019 84179 57547 -59338 -217763 -186040 30298 -253677 107596 -126444 139493
9969 -116375 20496 -75621 -246707 14422 -49028 228233 -11831 224498 -68949 88738 44363
9957 -175103 76088 -263821 183817 -102919 55313 -207298 57364 98156 -32290 -71246 -493161
9946 -493161 275169 -232036 168138 15968 -46145 -395330 -160806 -32112 -28400 202557 -140802
9934 160 258893 -236062 -122674 -424084 -264145 124285 -265542 135859 284949 -240031
9923 100923 -33095 107005 7248 226365 31348 52956 40051 -258470 106955 -107574 124672
9911 -72544 -110552 35515 -75265 -170644 -224800 -147260 -238678 -25700 -26983 6573 -118686 -142205
9899 -142205 189270 -73005 143905 -240592 -127576 71359 -44746 128496 30246 -37779 174870
9887 172364 -131527 22271 -147073 -340965 243467 166099 178762 -98656 -94819 39703 258327
9876 258327 -17314 -54940 -332107 166897 136293 -299029 190356 -90510 -110182 -39024 58926
9864 -178547 -47557 65814 -318383 -221648 322462 -297828 134799 -27370 -265557 224692
9853 -542788 21731 -408188 7819 -14298 -82819 248275 153102 -102104 39522 -313222 66196
9841 187531 -145883 -56667 -301193 -281928 -51844 -62423 25876 -84850 -43422 -282373 -119886
9829 44780 -137955 -11265 116439 94352 -117773 -221242 492030 -14368 101888 -183268
9818 -217368 16797 -124774 -128247 -215782 -4729 37730 -154127 87331 -107369 -268857 -142486
9807 -142486 -180944 -97290 -444304 -213575 -162024 -32417 -201271 97218 71713 -130586 64447
9795 87002 -76269 -5085 -279080 -4744 -334832 -25963 153049 154992 39223 142983 -66376 85041
9782 140111 20117 150001 -334508 245966 -249059 -524692 -24779 11097 144982 31207
9771 -149767 -274516 62560 -203117 -39234 141050 -231140 -2302 -129755 85324 -346931 -422264
9760 -422264 -246770 -29089 -323336 194237 -105892 -152337 232889 -95461 -57828 100248
9749 -29467 81427 -185670 -51754 26728 -146943 -212649 24225 -9810 -57440 41147 343593
9738 343593 -93702 -229634 32899 -195250 105647 -139114 102460 -77358 -43463 -244432
9728 -244432 -156555 -211529 -148030 -185904 -47377 -317414 128097 39182 -433330 -276095 -165540
9717 -165540 101132 245675 83882 -270391 -272644 4417 139979 -29932 65755 -135458 -283446
9706 -283446 -160569 106444 -429052 292699 -182950 -29489 -62208 -522847 -5096 -285404
9696 -285404 316869 120370 -34353 -56035 -50149 34282 67531 -167561 -43059 -204463 -159957
9685 -159957 -148966 217385 -258837 88195 -193282 -22808 341156 -160548 -108486 -9437 -160236
9674 -160236 38738 -62419 -161487 -68923 -180217 164384 -68310 -143104 -13065 12140 52829
9663 52829 -58292 -5715 29020 -166660 66599 -248666 -276067 106035 231248 75215 -19683
9651 75444 -86391 164963 -92851 -119727 -161463 -151290 -153831 8110 -170637 -162105 -185948 -370169
9639 -370169 116074 54599 -87599 252125 -191980 -35150 -125995 114848 81954 83455 -227398
9627 -249060 237313 -192681 57343 -204388 -229686 -140448 -288250 18751 110218 -25583 9646
9615 90068 164416 -181818 307309 -321532 -405951 -83392 130987 -177101 -127797 91004 -121569
9603 -92131 48199 114741 -1966 163389 286569 30624 -112077 222985 -554292 -35129 -190295
9592 -190295 28320 -52742 114096 -135085 -225720 138109 18792 -151979 -116278 104461 -409483
9580 -59444 -123616 -147196 -11738 -413511 224572 7528 -35227 -146690 -117561 134702 -249805
9568 43693 -43507 -82601 180960 192005 59313 -106563 87869 -66721 201753 -42526 -312299
9557 -312299 -48766 -148136 196173 114896 -275519 -234425 -129591 230103 -44492 23086 122750
9546 122750 130773 -112709 36978 34690 -96956 -146985 7722 25207 167926 -326954 -4789 75674
9533 -337898 189174 131229 -119109 264736 -72566 -120607 -13430 -128126 -91739 -42363 -47439
9522 -47439 22852 157535 -2697 -312323 -34878 -100418 -85577 -397181 146570 -110935 -186478
9511 -186478 -373478 79743 7103 1087 -37511 -199594 -162921 -36768 122718 23651 -247498
9499 -58527 -361847 89345 260481 44145 -138801 -63039 126956 -97514 -133231 16300 -160024
9487 16043 -174140 186352 41589 -5669 -114194 -324617 -200904 -30679 -201989 19360 -363255
9475 -50508 -60246 -537332 -56768 -33475 74875 -213648 -134250 99253 11732 -235965 -104648
9463 23102 -133631 108564 92896 4937 41870 -181312 -177759 48195 121926 10673 -339956
9451 -31911 -9601 49079 -1780 204449 -59254 -426064 92290 129135 -74605 -111347 -306071 -94152
9438 -323154 38997 -141792 -121257 -321204 -217166 209125 -197900 141049 -387837 125367
9427 94908 -121662 -276151 -72717 -209895 -182242 12408 -85754 97657 -150674 -174892 -286753
9416 -286753 -81224 -368447 -82347 -28236 -131843 -71758 -283940 16982 -159363 -129317 -230581
9405 -230581 -93439 58596 315887 -178679 -181500 -236814 -87769 -383330 98967 67578 27935
9393 -153395 -55122 -62410 30018 -638088 16019 23937 -304455 -368467 -19503 -130954 -21886
9381 291545 239149 -348688 172451 -163712 -24391 292987 -51263 -332504 -47997 -49663 -18759
9369 -30284 6308 -276265 -98711 -518145 -49836 -36355 2493 -26096 38406 -215309 -214797 4332
9356 -107014 -244097 -201448 -53182 -43636 16529 43963 14850 -110444 56154 -37039 -99761
9345 -99761 -290947 189896 131933 106357 194956 37252 -168317 -339554 130956 252307 -58861
9333 -324720 276647 -123120 96533 -323870 159100 156464 94038 -76497 103547 -62808 -187703
9322 -187703 -68751 150171 -114172 -355323 -346611 221391 -215899 -84273 83705 -162472 -296610
9311 -296610 -57960 52825 -292607 49064 73219 -264206 -197123 152185 -123606 -47867 -15979
9299 171216 -146424 -153717 -106186 168109 30508 -172422 -107213 -162900 81696 58748 13881
9287 -193769 218008 -42431 -60513 -159821 -147142 -81195 30236 -101850 280 -56505 -162070
9276 -162070 -24619 -168546 -244111 60104 -151875 130060 13111 -143744 -124364 355502 -66463
9264 -105586 -170113 61484 -51846 42823 -98005 -189100 257872 146898 -270995 33382 70156
9253 70156 -37724 24857 208355 252673 76440 -174721 -461770 -223474 -16853 33336 120836
9242 120836 -2994 -292028 85578 -138613 66244 186642 -91526 -459702 -122086 216634 88742
9230 -82279 -235106 27923 -75388 -223602 -79712 -203982 -221217 112655 -195574 58194 105129
9219 105129 -93008 -252479 -80718 191790 -9746 -137931 -127687 -38856 -214787 -190076 88438
9207 -173793 242971 47185 154841 -164202 -198721 35250 -35027 -83169 -34687 1042 -1582
9195 -163146 121283 246046 -207258 -287742 10928 -165265 -127471 14398 -14958 192740 -522613
9183 -197255 137854 -122713 -21255 -58276 -63541 -212839 58334 -153745 -362896 149908 -9762
9171 -173906 -40794 118550 110128 -258683 -9518 -64996 46467 -252179 -201777 -93210 71473
9159 40917 69544 -4404 38447 -246607 -127219 -6643 -80672 -126533 -17384 180968 46539 -279120
9146 -34381 -97495 -105254 -299252 -146946 294057 6605 -323153 -49864 -133303 438529 -176900
9134 206391 34305 -77743 80963 -351315 71345 108103 14346 232869 186518 55748 269517
9123 269517 114767 -283255 -411311 -21386 -217317 -147097 -257914 -32376 -411666 106778
9112 -337988 347191 225292 -176625 107605 87187 -34839 95284 47832 -197613 -251389 -175984
9101 -175984 -222806 7816 977 -148371 -211109 124532 281209 -57796 193616 -162348 -135495
9090 -135495 -196729 175020 89715 -177408 -230259 -369618 -181253 336809 -154643 -130876
9080 -130876 -140290 79491 -20607 -27750 105089 -16873 102241 -254353 151292 191372 -152978
9068 84488 -3770 -24165 -57737 -21318 -233536 236047 -133200 -213362 -194816 -161537 -146373
9057 -146373 -3130 -15853 17174 -13243 55100 -69665 167352 142135 48667 29483 1362 47793
9045 47793 -137205 219735 111532 195900 241010 -385069 -64402 170932 -267418 85069 12621
9033 138186 -144702 -175709 -94350 28184 140473 -157714 -20856 -80250 101272 -397336 46784
9021 -176604 -91195 -42310 -93060 -221523 -70496 -127638 -174114 -40630 75936 -32505 -156923
9010 -156923 -102735 -136361 44818 -198430 -272373 -122520 -155216 -19714 -299622 303060 163361
8999 163361 -155318 263719 119968 -39576 203278 -211603 -287172 -97858 -139345 50601 40015
8988 40015 278468 -366129 117431 -155572 -32486 -55043 30854 69508 -271802 -147673 -158529
8977 -158529 -365955 -101635 14814 93891 39034 -160327 332218 -58367 -320634 22723 -13184
8965 -110671 -242081 230718 -176215 -264362 39178 -272016 -91294 -5457 -112420 -137011 77054
8953 -377247 -127613 16619 191881 73774 -5819 232679 -168079 -172228 -112217 -282858 -203751
8942 -203751 365628 -174155 -232014 -91770 -325866 -377237 -120345 -175306 175150 22514 216312
8931 216312 55431 176413 -213261 -108806 43861 -282233 14009 -211492 47209 276488
8921 276488 318547 -238626 -290293 -100102 -378389 -29354 -356133 146364 62462 60361 178455
8910 178455 164677 5603 -290722 -174411 -36372 -288262 -272199 -99640 70328 -65747 101244
8898 -371307 -78804 232196 -177486 184385 -112478 -124389 -36523 -128428 -223197 -63770 -33636
8887 -33636 -181936 328974 -6643 67476 -290435 -180965 71539 -30004 112910 -112338 179236
8875 -192638 -135419 13256 -37176 74750 172320 -55061 -207712 -237038 297800 -375871 10701
8863 -292300 82628 -156511 -168747 -382115 -204022 279979 -84290 12587 -51206 -147899 -88514
8852 -88514 24821 -160085 -144402 2434 -115257 256383 150536 126256 86287 -156296 -31530
8840 259717 355273 45583 114147 -10286 -4897 -127693 -393257 -23317 -112676 -194543 57683
8828 -9253 26805 -98741 -168473 -116373 -135549 -99681 -204617 -209651 -361368 -30434 -95695 14705
8815 170443 -236674 83775 -127767 -427562 -61516 31967 56966 -55238 191606 24159 -98267
8803 303906 -55230 -127732 11425 147873 -109442 -127344 15918 -334100 -134098 -254262 -83737
8791 228648 -323725 -487094 348735 84948 45188 241123 219135 -279016 -53851 -314148
8781 -314148 -126742 62547 207395 -5749 -138446 -348897 -48717 -48940 124681 33280 -263492
8769 303311 18150 62100 -235148 -106793 -447860 249781 -429868 258839 -64190 -280970
8759 -280970 -34594 64725 -140623 -141125 76015 -108445 -142926 -53005 62112 280311 -256756
8747 -85581 -108010 40057 -126386 -109090 88598 129065 -59268 162195 40829 247110 -142867
8735 -108127 89782 67591 44428 260766 -78481 2507 79533 -126593 -118642 -112450 -8038 -17622
8723 -17622 -100555 -56195 -82232 -231283 -221581 -14239 248356 18551 -73319 -19510 159472
8711 -295 -101892 80412 123307 -18490 -66999 -16104 -212138 -51916 66264 72280 -115021 163771
8698 -54210 -35776 -229157 -447772 -177896 126180 53937 -49743 -199913 -206518 -275684 -116624
8686 -153710 -185980 -145885 103297 25974 303174 -68670 -75744 47406 41100 -28581 -66251 231437
8673 -895 133579 58475 -207640 -157963 -162438 -336072 30201 -297776 -182630 -134967 185184
8661 -90826 82073 -162658 -41459 123288 -122284 59989 106658 706 132996 -33343 52204
8649 11274 97330 -18660 -162745 110804 -208539 -262385 -161643 28728 -214313 48983 6739
8637 -236698 -195018 -110089 -96453 -105081 -337064 -29221 152777 64251 242102 -179911 -226165
8626 -226165 198758 -458027 89570 -323119 163191 144884 -106324 -54488 125316 -7891 -1823
8614 -324524 -324 -96303 -143582 225452 217887 121705 -159137 149702 99652 -107129 -78060
8603 -78060 -86486 -157852 -108449 -301193 217814 -417528 -247686 -316951 73014 176952 -156442
8591 -184890 -184345 -111150 74721 174786 263356 -101915 70132 141498 154827 -137116 -135925 118869
8578 116569 -322865 -1527 -143162 69306 -433606 986 114811 32803 -138362 -37319 -349053
8567 -349053 24058 -76846 125772 -188056 -404362 -88917 274511 147179 -233393 40210
8556 -174580 323226 16628 -143798 139858 84859 -148078 285060 -118996 43552 -393751
8545 20803 -301527 -367574 -133414 -176200 74654 -234232 -37113 -285368 -159128 -86885 12923
8533 170066 73099 -134675 -248391 152489 -40199 13027 240067 66281 -330998 -69308 188510
8521 -107037 -120166 140366 -308010 141546 5464 -55484 -135236 -79800 30186 -118417 -153079
8510 -153079 -163223 -246319 -106427 -65127 -72122 -6377 55057 -225669 -223047 -262029 4882 -43302
8497 7951 -84030 157481 1757 101133 187117 -86020 123209 7166 97240 -123881 -167960 105183
8484 223365 -15635 -86200 -33771 84218 293223 185506 -176984 9987 81404 148719 -21421
8472 -83354 -137457 236868 -10938 -52005 -67569 -142030 -3262 24936 216725 70264 64151 -144531
8459 -226065 -171822 -79869 -256172 -537692 22408 -145317 -326659 -60020 199407 35096 -9969
8447 235067 70018 -22620 -152111 90039 -14305 -141915 -218814 13115 167144 -20233 -49366
8436 -49366 -165442 -406132 28707 -331902 100619 -97334 -24437 -208344 -39008 -210480 -92694
8424 -132224 84328 130646 -419430 -225197 102463 -442158 66087 155248 -202791 120873
8413 -142793 -114181 -95125 10470 18774 -316637 -6811 108965 1775 241676 -24123 -48243 24418
8400 -155912 -278560 -22766 133502 -157509 58344 -70141 -7659 46113 215738 -4702 -72115
8389 -72115 -69817 -47826 204438 183810 218490 113962 177477 -15729 -4174 63911 -37960 -45298
8377 -45298 -274754 -272535 -132655 -191282 116218 239728 -412904 -427008 -14006 -16869 79543
8365 -58555 -336580 114973 -32392 85027 -89946 12399 -26947 333074 -172893 184278 -250566
8353 -316633 85879 -41413 -130983 -45303 -151414 -75603 -129393 13793 -21503 -163480 -111901
8342 -111901 154357 -24008 -15141 27249 -55875 100165 -343539 -120593 -179035 70397 106767
8331 106767 -188178 -116264 -203598 82833 118216 127622 -82884 -111365 224806 -114220 -22371
8319 -14708 -82114 333410 -77805 238851 -147087 27047 171117 -49328 -165044 -285539 -46023
8307 -71036 -62456 -163759 -359403 -59424 -181637 68813 -335912 -72496 34353 210162 -4303
8295 37452 -112875 -143164 -13236 -105310 -3193 112811 -149152 -264096 -10226 140260 83686
8284 83686 25195 52733 116411 94306 217742 -123221 -13752 -7435 13842 257651 20142
8272 327303 -398591 262708 34752 -131760 -302904 173783 -73811 -9272 -9993 163401 -166330
8260 -191025 30361 -319504 -52462 -67374 -100703 -90079 -115429 -169172 47624 71912 196517
8249 196517 213502 -80909 -268545 -18603 -166116 190285 -233418 160520 -40539 -147395
8239 -147395 233950 78754 231484 -28196 -52666 74792 -411794 15631 -409400 -173399 -140498
8228 -140498 -109857 -101809 11923 -347071 294953 101986 136396 80785 -8588 -322985 -162913
8217 -162913 -198266 128259 2592 -81067 157222 -93045 -40836 -110264 94786 -59270 -84215
8206 -84215 -160844 -94716 27165 -11201 -17335 159450 68060 336897 14190 2109 53045 166773
8194 166773 -446491 -155361 41508 -214829 -232790 -68837 77279 56736 124130 123917 231892
8183 231892 97811 41220 -273086 -48109 63074 284708 -59880 -44326 -194566 33475 -195221
8171 -90817 153425 7244 269115 -157843 -6059 -237109 15709 4592 120135 47364 -25071
8159 -152874 232984 -3561 -36421 -339179 65536 190376 50005 -159208 96952 66842 -80800
8147 204093 -154186 -211223 -391161 -14323 -19253 -101093 -52387 107632 -237189 29949 18928
8136 18928 173359 -160714 -357550 -53780 -72235 -143570 -161201 212136 31793 -87826 98339
8124 -295098 22592 -37165 449 -208548 -149599 -198537 -162129 -268572 -252259 87463 -289123
8112 69706 -259327 81245 -29126 -14501 -524638 -65169 -200791 -41883 222082 -283225 -119975
8100 -336582 -51327 -111799 -423746 125264 -225185 140441 -38491 -171215 -241962 238015
8089 9884 -85790 75510 28934 -94949 -81596 86641 15967 -69376 145084 -46572 189891 -319543
8076 -156664 -102352 155596 -342484 -122014 23510 -108621 -61001 -77194 135025 127973 -177173
8064 308488 40753 -95538 -270085 98959 417104 35547 30015 -112230 -443380 -166717 -56642
8052 80102 110948 8650 -171632 57348 -81459 -291896 -39394 75489 128136 -447367 143538
8040 101155 -99304 21268 97471 -77271 52555 -159990 195619 82870 182293 -52717 192462
8028 -192760 -276113 -288675 211936 -13607 -82024 -6652 89044 -71633 -93625 413714 -21496
8016 -206937 132287 269742 144011 -67967 34700 39799 -284691 -117325 -80731 37739 -169534
8004 -112604 -156874 -93678 -328109 170733 314443 -314787 71647 -30853 -134059 29814 -367089
7992 32807 -144547 -14151 121869 -215959 -418336 163599 93180 160891 -91629 236648 12941
7980 -27376 -386029 313871 -174807 -274867 -88868 -84832 115852 98694 15960 -2154 49640
7968 -154610 -166941 -17024 102898 109250 236235 -4208 122802 143681 -73197 49384 -63446
7956 -46939 154037 878 -84014 -299517 -218188 6140 168417 124293 -45114 356720 -52662 47253
7943 252089 72205 269783 77185 31490 42019 -147257 373178 -118630 -18733 49531 -352500
7931 90623 129797 179402 55310 -12234 -411289 -331145 99134 126830 -21841 159530 104419
7920 104419 -225674 -216206 -95892 -51907 -171896 -74557 -103819 -160407 209618 -90149 45820
7908 -148640 -135835 157743 -139235 -425574 -95686 217952 187091 -191572 50720 -302753
7897 130796 -44653 33825 -168606 -146952 -86445 -114969 -375168 -93254 102340 174446 -64432
7885 -254281 -24109 168913 -49183 8911 -11628 -222106 163417 -1804 -233181 45804 9132
7873 -104732 -139600 60800 -14220 -243689 -205604 156187 -183348 -177970 -116865 -81872 -246966
7862 -246966 -124652 -71064 -44398 -181290 164601 14741 -199589 -124023 -219564 -30221 194050
7850 75153 -111107 -11526 -17748 20719 -58432 144841 -47305 112597 169513 -31257 -215300
7839 -215300 -231915 -365887 -31836 -91604 39577 -22990 156188 28611 129634 411426 -88809
7827 -137796 12559 126087 37473 375998 -188591 -110589 237644 156666 77516 7846 -45089
7815 -115960 161653 208269 271709 17286 -294529 -33387 -90322 -103989 -77199 214780 -216932
7803 246485 -32168 391200 -92614 -296770 91427 -109035 -134794 -41131 166507 -30399 -193395
7792 -193395 164407 46196 -35916 -114005 -63062 215356 -59622 14692 -34511 -340947 -23737
7780 41771 131484 -9935 108765 -478972 -61186 -211771 113463 -166278 -187186 -140733 -154398
7769 -154398 -323460 -132385 156231 76736 -169619 -236551 -251177 -199406 266820 109339
7758 53780 36830 88662 -184425 -238531 -446109 -145993 -106033 204294 -275920 131305 57133
7746 -117669 -138423 -121116 5838 81653 -222938 54888 50639 -86029 61166 -171673 -74476 -147094
7734 -147094 -218619 -66461 120044 -12062 119359 -237208 -124701 -385669 -27667 -31127 -318756
7723 -318756 -74228 -140860 -224971 82168 21293 29987 -13113 -140561 -244761 12538 -172415
7711 113762 126928 18613 -104163 -314503 184817 108723 -39524 -37086 35175 -62885 -62016 90690
7698 -173675 -155292 214571 -108288 -66760 55752 -169956 65137 -88354 46262 -139760 -26996
7686 -87749 283707 78385 -116768 23109 -2182 -2346 188895 152413 -270393 36426 -140400
7674 443180 -144562 -27542 130866 -297695 9299 122194 55221 -212754 51819 -317470 50333
7662 102739 -38465 92880 -69797 264265 -183221 267796 -120399 317631 70900 -63442 109127
7650 -86312 -43578 18903 -17307 -166260 -293592 -186450 -26870 -263243 -181514 154582 -10253
7638 -41980 46842 113913 170672 -81772 -38885 24354 -95143 -198423 10322 139204 146471 -26899
7625 73829 -43311 339982 254912 110101 119166 -355315 -240993 -68812 102863 -94091 -126060
7614 -126060 -122833 85230 -222150 -354281 -255958 -86057 -78780 -337170 -140943 -15174 -147007
7603 -147007 -150746 -109950 131172 -161899 -10724 169514 109309 -120416 -200034 -337261 -109394
7591 30053 -205374 -79526 77465 -93322 -169872 320895 126091 -218940 -32100 -337645 -42245
7579 147245 -206906 -124029 -77203 36593 -126849 192701 -187976 -254459 211248 57903 -235915
7567 -22900 68360 98903 -97068 -74838 120038 3517 -172151 -283678 -71560 249614 -344103
7555 87211 8605 210270 66195 -138361 174946 -122019 98913 -113663 -61237 169273 204529
7544 204529 406366 274568 51448 -68212 -23978 243267 -230260 102490 15656 75477 -202323
7532 84398 -262748 -245496 139739 -57715 -68558 76588 67242 121656 175142 -7928 11227 -22026
7519 -144650 -100976 -101561 -49543 -216330 -255103 89245 182893 96121 24822 299831 -21012 40107
7506 -175934 -93355 65993 77099 -42141 161655 347691 -251664 -51323 -23090 59604 -218307
7494 198975 32642 -90266 5446 121440 -39809 223473 -129773 3364 -71914 -152685 63940
7482 306487 87040 75872 -72618 180043 180792 271470 -206164 -121424 373975 -217294 -325163
7471 -325163 12655 -204512 139562 -110701 -46773 -82943 22373 8142 -155196 48454 -48440
7459 -125103 -314988 -84093 -514383 -133767 -250292 -99899 33794 -237322 -130402 -248104
7449 -248104 -93269 -208741 -204155 -337561 -140641 -110628 -79913 -118037 -180612 38812 -86144
7437 354479 -51539 33130 83734 -167791 91217 -94230 -62814 -101383 -89472 87751 303103
7426 303103 128818 31793 -15507 236907 -280406 -124204 -50646 106628 -7867 -184183 10643
7414 331944 119651 -9892 129858 385252 68063 -132168 -430967 -81832 -176132 -499284 -44325
7402 109560 29452 -3179 147043 -37701 -6594 -46501 -92914 -253975 -349776 -45458 171307
7390 -90377 -375834 286668 -152547 -154669 72378 68850 -91040 8905 -232530 142335 171233
7379 171233 -54627 -42102 -96785 -299714 -277488 -183090 88876 -49796 -282611 -127092 -181045
7368 -181045 146739 -111539 12541 -63760 -71980 -93487 114598 283249 328640 -53329 124333
7356 -132965 -191035 -15892 -162971 203778 75160 -232039 36579 -114719 256427 250588 -58972
7344 47711 87943 91217 -95834 -219746 265830 -222039 -171944 -5791 -273319 -67532 108617
7332 66711 -168374 -153763 -97216 -180825 -187808 215666 138098 -101781 -204275 99752 -202231
7320 -172721 3842 -306289 -25311 -71673 101363 118532 -328716 -293 210062 -22788 -234309
7309 -234309 -70887 -111647 -372764 -509234 -368759 -121335 146183 219295 321616 256658
7299 256658 -44995 89228 -111444 -25408 -271355 -137553 118957 -71801 -190673 -142463 -285069
7288 -285069 -126965 114453 187617 -10098 -262701 -112985 31165 144057 39270 208903
7278 208903 -54636 -416089 267272 -111248 -108972 -255131 333207 56036 116270 -355482 -145439
7266 -96732 -7795 245803 68950 -305256 28555 16169 -23016 159349 247637 206820 -219877
7254 -101587 234047 208418 -46598 -138425 33490 92862 201351 211675 196935 82305 74314
7243 74314 -208139 -217724 -174136 283659 84359 -208208 -26648 19259 91443 -226247 164756
7231 -116637 -4256 -139091 128188 105532 235026 269945 162154 15884 114306 -25705 66063
7219 -145727 22403 -102674 -186287 329071 3351 189247 -32594 7222 158390 123741 96300
7208 96300 -80350 -92993 -159026 -431940 137007 -119263 -168516 39304 -146984 -348217 116918
7196 177 42304 388041 73024 6458 510 39588 -149632 453349 -190758 -347386 103638 309906
7184 309906 -55692 -97795 -180830 89201 216427 -311061 -119313 -25479 -91912 -12579 -171455
7173 -171455 68844 -458982 122967 23784 -12752 37451 -116626 -104429 -238975 -237394 98180
7161 -187712 -138861 -334738 -51005 -34797 -89209 -244225 110572 -122686 -302198 322861
7150 47615 -53476 -23497 -46507 -21590 -146886 99174 -163249 330076 -145630 -234121 93641
7138 -170357 60723 142005 -305297 -72956 -55432 -191666 54777 -222642 -310128 -322454 165443
7126 207449 -92665 -146040 607392 28069 31858 165027 -435640 -112253 -66393 -342171 -398780
7115 -398780 43457 11727 138973 -223023 -180189 -36198 -70400 -205735 -130729 28284 -69112
7103 -172083 186307 3654 31438 148283 1258 218447 -120247 174893 -238991 -49264 -172827
7092 -172827 -168565 -17102 189380 100969 -217795 -33466 51816 -5858 -92846 364781 -162015
7080 148985 -117402 48120 194961 -136808 -262984 -267437 56522 -103762 -199255 75983 -163534
7068 -246204 228746 121666 254851 -103979 102746 103100 -137752 -150569 -281732 -123543
7057 -12563 379309 52029 -57409 -219440 367874 33430 90206 25811 -300251 138416 -150311
7045 -248268 2662 190746 -118961 60097 -40337 -259667 -49391 107475 -88161 -89171 -152488
7034 -152488 23424 -247119 -223265 -267452 201437 234763 217700 86760 -62607 190278 -52594
7022 149549 -268642 -171990 -43418 289876 -189487 -95528 -170988 -72773 -304895 -100311 248170
7010 24801 142817 109222 101737 246481 -5071 58128 51342 -271888 -161226 -219137 -333821
6999 -333821 -5513 -179083 -170692 115814 -338835 -126214 267570 -309426 -55594 135687 -173331
6987 -90131 28540 -8596 144933 -194804 66992 244340 -161792 -19350 -25025 67152 85511
6976 85511 -148915 -99266 43895 -54869 -364699 -89953 -1206 -193178 -215524 -74264 -29765
6964 -54028 -126708 151443 -285006 -222321 -38042 153016 -92485 -94958 -242785 -479268 -3819
6952 126186 73970 -218796 -92232 -116959 -129163 -40435 -255263 181890 36368 104120 85333
6941 85333 -164550 -35543 97460 -162116 156707 88180 -7260 7877 -348862 166996 308320
6930 308320 251990 -107439 -183383 -19223 -14402 66711 -48826 11687 202531 196934 -51031 -173429
6918 -173429 -2457 197867 -73816 -208632 -160841 40086 121587 37313 -176460 64974 -52216
6906 118744 149710 215233 -339143 231184 105057 104368 -16533 640278 325328 69441 71400
6895 71400 -303895 -45587 189917 -45803 -74428 -19686 -129094 -327588 157211 -76858 107787
6883 1831 -82108 -14937 -111845 138080 -179264 306533 81537 -24813 248596 -14729 -63590
6872 -63590 -64852 -204711 -406864 197540 54187 -364999 26270 -290329 37158 200889 50852
6860 92421 137999 265461 -38425 -100915 219465 -108816 -59821 -43734 135630 -213312 -312562
6849 -312562 -41802 -263455 -18934 175091 2017 -112939 -4298 -140224 -263599 1323 -266763
6837 59227 -140437 163836 140861 -1992 -143289 154173 -10788 -70103 41372 -49345 -102479
6826 -102479 195044 -179432 -111546 -127012 153611 37148 -232332 56086 -77252 -51715 71102
6814 22571 75215 -10957 203695 -20383 242685 -80322 15544 -65858 35083 411298 -164209
6802 -24409 28466 126597 158242 -20271 -177901 -108957 203886 -128631 118176 -108496 206416
6790 -153125 -27889 50936 106161 21417 169648 -46897 90243 -118389 -109784 -191284 -265791
6779 -265791 7123 76398 156236 198781 -87050 -120780 45793 66326 -335928 -40422 -161791
6768 -161791 37630 42592 -276804 -3565 -151922 19303 -89407 141331 45586 220472 -294566
6756 -127582 207062 16496 -126123 1345 -61387 -86511 -181369 35021 57259 -73229 59084
6744 -166727 82002 -132722 -288903 -174908 167127 -87888 258081 -44329 -14911 12664 144032
6733 144032 54716 -223749 -147695 45149 136883 -138206 304266 -157923 107996 -66612 -32820
6721 50977 22794 186516 -371485 -132656 162555 -219367 -190869 -70684 222716 -144024
6710 143056 198503 264681 -212839 298490 15833 401617 96379 -304300 -153162 -15199 -115331
6699 -115331 -34184 -147269 200666 157006 -114777 42004 -120784 78990 127626 -357351 -301486
6688 -301486 -80750 126652 -160755 191411 -137546 -128075 -36451 -164668 -245974 39216 -44640
6676 30051 48155 140758 -83570 76710 16228 -34680 249367 10934 -38680 -77293 98818 -108721
6663 78456 9522 -12408 -41685 257401 -187766 -84129 163898 170450 154402 -318914 -158856
6651 2616 -2948 -214874 230082 28708 189498 161467 -386337 -122444 123738 -123758 215306
6639 101703 -273147 -22448 -42101 -221245 82384 -167345 193626 -17862 36593 -224007 153669
6627 -161219 -205388 -169973 -214861 71613 249136 57688 -23472 -335818 -136172 -239288 84938
6615 201082 -102565 350830 18461 54769 175871 26482 168044 6512 -301760 -52938 -269680
6604 -269680 -286081 -282430 113375 -107318 -213202 -32802 60544 -227374 181377 10903 -7441
6592 110725 -79955 16605 -107542 -103673 -120919 -197100 -313629 -10758 54244 -14356 92690
6580 -210195 -238395 -243963 -96427 -197782 -94604 -380962 121333 -27 -219824 -69892 -32165 257575
6567 64214 -78731 -18759 -98937 205146 -157887 -75713 -11164 24219 27619 -235725 32596
6555 -124123 212212 115391 -243160 -170537 -81158 -172453 -196953 -175813 -514266 30715 -148846
6543 -250586 77435 -322975 -153778 -182532 -22209 -303824 106029 72909 45535 43476 -120771
6531 126703 159783 -97674 162081 142233 185655 -192619 86440 -126339 201006 125892 -114978
6519 67047 -100252 244876 -272306 -162356 -139432 -38512 8757 176311 41222 253138 28609
6507 -33163 256166 -56415 91396 -80209 -149040 -54326 -7368 -256236 178381 -137473 84959
6495 -115065 -64152 -424964 -190270 184339 296191 876 42069 -200775 156144 -84421 196939
6483 -48935 135677 -60350 125715 154800 -19429 59927 16232 -189134 -74220 103640 43036
6471 60314 -205063 114247 33673 64987 257116 21754 -291338 91900 76747 -276770 -31139
6459 -53242 -112026 118923 -235684 -33062 -55974 -71631 62259 -368520 -67223 90510 134946
6448 134946 -20144 -121773 -102040 -143671 168382 -258791 425727 109045 -41039 -122152 11709
6436 103048 -73796 -146055 52764 -334875 -180962 89351 -225064 75545 -74202 -214034 161411
6424 176164 -39223 -165281 233417 62537 129590 -366654 -296780 -184376 35609 -101068 71767
6412 96931 77980 -64976 -186843 135133 -140307 203051 -48620 -175354 163854 -13691 355
6400 64657 -20332 -296361 -43885 -274967 -7703 -25332 142574 -169902 252328 -290555 43340
6388 202554 217526 -220868 -243652 -219081 382180 101490 -36845 -124316 58307 -255716 -42001
6376 62405 -54727 166132 -194169 97001 -72864 -321889 117151 252243 -698 91593 88829
6365 88829 -123505 293259 99539 59130 -144418 -4988 -285200 99410 201748 -88921 -12651
6353 -94272 173179 -240501 422768 -39979 143195 -12620 41989 299034 191731 -106915
6342 -75840 -95065 111413 -195777 -28148 332227 193497 -64454 132254 -185292 201277
6331 63210 -196706 -8923 -68781 72841 -283708 -34888 45850 -7823 -101426 71310 4950 -32905
6318 -39497 -27779 34980 -67419 -191286 -220939 272530 -145798 41274 -95769 -264792 -27628
6306 435314 57897 -260395 75283 497595 113422 122193 -107938 -152869 -46977 -79877 216362
6294 140235 -6528 150884 70683 239329 7282 -172797 33079 7462 28006 170593 117870
6283 117870 -160411 111499 -295721 259872 -335418 347573 43308 27919 6866 68313 33814
6271 9583 206879 -320465 110096 -109537 -426846 -115733 -40011 -259945 69020 -42199 -181897
6260 -181897 -27407 21465 179691 -56812 -71927 146796 225443 35455 -98485 -170488 122016
6248 76225 -530681 -303477 15782 -21534 297759 -77623 29664 -185399 -232310 1338 50655
6237 50655 -387550 200414 152077 -307567 72735 83179 130528 85868 17666 -117631 -282121
6226 -282121 185114 -87545 100612 243470 -80013 -6086 -131163 164986 -24405 97080 -39009
6214 60983 364846 -51934 249531 122071 -186721 -19395 6641 -59297 -20171 53211 -31148
6202 -17626 -200891 -307673 87696 86309 45224 -125181 141681 -167287 134264 -205456 343960
6190 -197989 7489 -113414 4605 212142 369464 -246790 29722 267658 76370 -9212 -37395
6179 -37395 162190 -264531 -132735 227007 -8950 -46880 -63933 55772 -322398 116188 -106451
6167 52343 127729 73454 -130462 -152681 -24712 422594 146893 -234818 -110429 -150530 260572
6155 8062 -254070 65783 -275445 -57644 29584 -342858 45393 289964 142476 138319 -47695
6143 153359 16267 -132215 61738 -50908 146660 -108858 113563 242417 103598 -282841
6132 127244 -110914 -99945 -161097 -71253 147907 276579 -147409 -7990 -65726 -23204 186534
6120 -37243 126248 -289611 174941 -59418 -165842 -234153 -83016 84840 -176422 -36158 -35322
6109 -35322 -57017 113805 -210291 113358 19984 -321046 -17468 -4640 -172558 -161734 186611
6097 -29460 73950 -167039 -389602 -73020 82563 -165705 1285 -260714 -139602 182255 -145479
6085 345365 -195239 16794 -2785 -136248 85403 -295797 147072 115676 198069 115737 165845
6074 165845 58520 107068 -391041 33547 157781 5560 -75164 -207727 -219284 42223 -26767
6062 -26702 -15228 92260 -259153 15104 -161825 -127716 51847 441220 -343635 147495 297555
6051 297555 8389 88834 -161174 136219 -96042 -200911 -52085 344143 -288548 -100540 237316
6039 145941 -141963 42965 157357 72852 -397207 213157 -52982 -225426 -202819 -36845 -83241
6028 -83241 -211681 100663 -175830 -99032 84407 -99254 -37957 417257 -110836 -52589 129220
6016 190954 296308 -9336 -60633 124786 59428 -61658 23590 -25236 27906 19079 164692
6005 164692 113649 -5395 -224842 14560 -75323 57623 -10992 69480 30581 78318 173112 -152774
5992 -24952 -154793 -130876 -61422 380763 403537 -88119 -292013 -20747 -71751 -56292 24671
5980 -30547 -193253 286100 130981 94226 -178772 365919 204936 150710 265095 111789
5969 59982 -142137 -63605 -115134 -140995 -189935 231722 24372 -230302 101475 -70927 -105218
5958 -105218 -230365 -216183 117206 281849 -110858 -179615 132173 -202081 -2076 -191251
5948 -191251 267130 4133 23501 15024 -263672 -59325 -176035 -171959 -4228 -193091 -64438 264472
5935 -53892 53112 157692 179067 -81367 -149220 -300954 -220394 279974 24722 37056 -158615
5923 176951 26560 -126585 -88999 -124214 39551 -142432 45928 -12448 -204788 -18783 194866
5911 -125451 118009 -299156 46362 87568 -69343 29729 174870 75339 242469 -26102 -10685
5899 8247 -60288 18141 318420 -248690 41069 22746 -300440 -213135 107053 -169489 -297085
5888 -297085 -44442 115568 -81012 50908 149081 106360 -158174 96491 -130890 -115538 31317
5876 137445 265310 -183961 198495 8265 -6065 -224179 -88159 132215 251487 -388317 -267585
5865 -267585 -38115 166869 189773 -229411 -75739 74889 54573 360822 215707 -273505 180541
5853 88892 3655 -109123 -378387 167415 -222176 105937 64840 79316 -117510 74752 -107894
5841 197685 135896 143358 -172747 201251 209114 248945 -72868 117967 -335473 -248786 -103696
5829 -92423 282770 113111 -18355 -120543 -57882 347484 -135151 -33037 -110422 19834 58676
5818 58676 -355221 93185 -84713 179815 207267 -17540 231738 -187341 -195975 -195558 -126631 344940
5805 -15206 -30024 -17697 -10021 -73981 10903 5378 -163324 -267102 10608 -132507 31417 -107462
5792 53407 -284 -141612 -181851 -105291 64397 -41389 -207200 -36130 99013 110933 253070 6525
5779 120189 84440 140057 -822 -101701 34188 159409 255226 113446 12591 -410765 -144966
5767 179892 134247 -32036 -34670 -183200 54445 211141 -60337 214800 -62210 -394388 -196449
5755 76867 -57680 -90642 -78995 43218 -356924 379422 122392 123566 339842 -49647 522961
5743 -194001 285940 15149 -86170 86159 225928 315687 -82165 45299 10446 61144 -89461
5731 58781 -275354 -288623 -52924 11901 39307 36148 38499 52560 168160 -300324 -186263
5720 -186263 -3071 -256911 -189054 -117358 -242562 -97832 118352 -134249 -142343 -44794 187469
5708 -317443 -39904 210071 -2002 77988 -119732 -43927 82225 88184 -56382 170960 -49867
5696 13127 35151 285415 -266374 -14628 -38673 33965 251164 -237662 -12361 -145920 51019
5684 -180165 -265637 -192902 -48159 289774 276129 289090 -127480 -39554 -156623 -191420 194570
5672 -62503 -56440 -131827 -211474 56089 26563 248133 -53948 22865 -34983 -58060 173010 -40019
5659 -53640 -109965 -65600 239873 -285773 -78208 -6148 297622 -332376 49409 -206013 -28731
5647 -29490 262643 -114623 -51710 -33192 234400 92724 135330 -13827 -139925 90411 -44528
5635 18766 -165741 14190 -171364 32650 283289 -118975 23893 37454 -228633 -4820 25546
5623 -63983 27175 -91760 -132321 37718 366683 22576 146445 51552 -147465 97940 63849
5612 63849 -176447 9442 -304946 87639 -274649 6162 74746 -216574 -9778 169761 -31165
5600 27333 -223555 53115 -152710 -17432 84147 45939 -279920 17112 -142387 49101 192927
5589 192927 -25533 -48145 -271612 -82915 -37886 -25118 -151205 113875 11794 171385 -77330
5577 137001 -40359 56083 68266 -37563 -72706 13280 26794 -7505 -46681 230773 48134 27423
5565 27423 76333 -135284 38886 73927 77077 235426 -295922 71805 -59361 41849 173279
5554 173279 -2212 45173 -46577 -85965 10843 140009 -203955 188926 18312 8766 -195785
5542 116393 -62018 -2682 55529 75667 -28950 26456 -53302 -128987 -71939 129830 -117055
5530 52842 52421 -3156 -253441 -378144 46949 74235 153861 113839 -194623 4187 -88641 324356
5517 -198665 43479 -72030 75438 -19837 -39023 206764 -58221 282316 31044 199266 -147809
5505 10134 -217970 194148 96409 -104683 136477 10959 107169 338425 -153342 41209 49628
5494 49628 -181137 35582 108702 -76419 -94429 -36281 109885 113706 76698 48640 174396
5483 174396 92713 214050 -112660 204190 97099 214387 -64221 -205420 -128516 3455 19885
5472 19885 -21601 -278471 217085 -78353 165290 185703 141672 -281958 -203074 105816 5740
5460 -152230 301553 54769 2235 -34187 -52113 -141468 57870 15042 -37932 113781 11995
5448 217537 93353 -22618 52762 142671 -195146 -97674 -67627 301102 -93221 236660 6511
5436 175351 -208086 30761 68449 97740 -69888 -57515 -525 -300192 138963 98259 -161785
5424 283572 -6916 91020 128647 167406 -79819 -153348 -168301 -106443 170307 -31365 107452
5412 22116 -100026 442001 205778 -113667 -164710 81636 32184 50816 134416 32129 -151133
5400 -5652 -88681 225488 -386119 106874 -137340 -13908 -63234 28636 -171953 -16832 -10360
5389 -10360 -141480 -101484 -193482 161512 -348469 181110 -136514 220260 31367 -311480
5378 95371 78743 277524 -103225 -101281 34912 -356510 69440 -82238 -108389 22432 -48539
5366 -143132 -27174 -69753 -430597 -7218 -177455 -168973 -115518 -183453 -101578 -169833 -56696 117043
5353 719 -257683 -130509 100448 -36326 237001 -223492 111987 104060 -22313 -42379 38489
5341 -139986 -71885 12671 11369 200543 -173593 -31545 34748 147755 2729 -177922 -249195
5330 -249195 -85877 -17253 -353333 -45835 -228391 -344292 182273 205156 1023 87501 195825
5319 195825 189224 -51455 -196128 22205 83616 -207228 -35577 -113149 -363365 248599 -62146
5307 -33785 54399 -12978 30520 151514 -48819 -8836 -74257 123634 -212914 177662 100827
5296 100827 188076 -167684 220526 23460 323472 -279829 -40440 51044 -192007 120029
5285 -161222 38042 -127494 28582 -109010 134097 20535 -125265 -133663 30482 75558 179868
5274 179868 -44104 157000 60277 41403 -79446 46543 225442 -280328 -37553 -23281 -51098
5263 -51098 37092 251455 -162566 77633 42748 290590 -162344 123279 -54948 -150894 164849
5251 -37923 -41757 341331 -50147 -230072 -79191 19015 182167 198196 -12370 -104091 -199330
5240 -199330 376747 -98354 31966 93981 129822 -102612 74668 -34880 -102282 75319 -298204
5228 -11869 -72320 124262 133717 -58639 -175787 -2503 -18074 -92689 386466 -147556 -100163
5217 -100163 -195054 -109657 159217 43462 225791 44254 407573 -52689 -227377 301890 -182267
5205 -25018 107142 177574 -237598 39243 53771 -233310 33776 -71138 30050 -37992 -129509
5194 -129509 -44525 -64692 18516 144583 135413 -69213 -21393 -342769 -88211 -88530 -43021 -61600
5182 -61600 157536 -5600 73772 -9768 -41198 178231 134386 -21294 -89715 -144479 260212 11350
5169 -333356 96334 95288 -174196 -90052 143002 140486 154472 -433114 -193725 -85877 26437
5157 244745 107188 37373 -177148 192809 54264 -213399 223652 -182202 15284 452785
5147 452785 -35861 -41957 -42015 58397 -203287 74623 88330 123874 -62088 -211183 98917 -45068
5134 -42238 105109 28762 141901 268739 -236152 85999 -175242 -246188 27271 -160611 -1752
5122 256894 99157 -39639 32743 181469 -63649 226585 -121679 -68193 107530 -103243 -305926
5111 -305926 117244 -123367 43530 -119407 134627 135076 218307 -120688 -150140 231588 -77692
5099 -40725 66444 115741 -238216 115923 -17810 -42513 -257061 -25016 184137 -156525 558983
5087 30758 -161904 31751 267363 -2095 -108812 -27693 -91797 -141578 81966 180044 337357
5076 337357 286950 5959 94050 126377 -2374 147584 118563 -170271 166828 149554 90943
5065 90943 -77255 -116485 -134313 111189 -100064 -173435 -219839 298589 -131570 94574 106206
5054 106206 78244 -131549 126503 -98260 -94886 -22093 33987 16122 -170236 98368 46196
5042 215107 72260 276930 -106371 56280 -292110 -107413 -178463 31890 22641 71130 -21557
5030 18458 -266270 159319 79945 -99311 25003 31503 -137022 -212118 -136571 -1440 36583 94726
5018 94726 -155617 -87502 -152456 38285 337569 -50598 34315 140997 31491 -165334 261429
5006 60941 -72070 83416 233028 113370 -113200 183932 -16150 119026 38823 -9699 -97697
4995 -97697 10970 26510 -261933 -60070 -366090 309143 54079 -34079 51459 -166512 253652
4983 35735 64084 -155896 -78902 86286 147464 -20425 6094 276791 -263772 170551 189129
4972 189129 -54520 -29381 -57785 163249 -50885 205947 270489 151822 59717 54527 -109467
4960 -32546 -94719 -157455 192423 -18089 -27831 41396 131596 42684 -232562 -157637 -454327
4949 -454327 95688 39384 248294 331063 254022 -67963 -212901 47349 106519 -118959 -125677
4938 -125677 224076 51274 -257270 -53203 11738 -142610 -115018 231152 235036 55297 365986
4927 365986 61902 -144987 -342849 -22125 -20630 76528 81384 61839 -246272 -224446 -74210
4915 -177622 226978 -5077 -16399 239472 269254 440330 58546 127808 75010 -19716 317312
4903 439074 270022 73916 -344081 -108533 47208 -259406 -59220 81254 368785 172962
4892 -183895 -138968 -141011 -94163 -36432 276844 -17838 48570 117594 131711 152210 50920 47709
4880 47709 -235215 -51699 -16053 -132633 329869 116600 157671 4283 -293856 87943 20040
4868 -40727 -248928 118300 179076 137409 -150309 -119961 -365005 -32703 123008 -237068 46503
4856 86329 -295883 -344276 20158 -50184 -161706 336402 227183 -180580 -246274 -218403 -766
4844 -152735 -274865 -355839 310779 -391253 198562 -298339 -52195 -414060 127353 -260799
4833 40536 490763 -64901 -115000 -1783 186600 -47679 -85841 207515 -54429 144134 -317921
4821 53947 107862 518627 -97998 -256729 19526 -102432 -263743 225242 -23365 238363 -71574
4809 133442 308348 -46596 -290407 -271450 27230 -42138 -149336 145775 -39019 163912 -2088
4797 280815 32570 -346757 50116 40957 66413 130821 412090 -94379 36234 -144362 -8680
4785 -130286 -103767 -162576 -2751 302490 253800 -119514 -116352 -40317 177999 224998 207764
4774 207764 -73753 -121841 -126953 -323243 -55994 287105 -51587 -15632 50340 -72237 31375
4762 239113 -39727 -28131 108940 -132427 233551 79141 70970 -19378 -22004 -260165 -73592
4750 -51653 -165956 150512 114492 -3932 296377 -284801 -115789 -104083 -88996 104390 105917
4739 105917 -6999 236286 24980 -37887 93531 -134738 -110029 -26433 76333 84981 -45528 -255618
4727 -255618 -155631 36220 -150144 68393 -107860 -4255 176412 -30978 222894 7894 -148853
4715 -76410 69792 -118978 -222719 28663 101918 -167650 -24609 -12407 -76270 144332 285543
4704 285543 282138 148380 255672 -109162 -21769 186221 -183416 263256 318146 -303990
4693 181634 198182 -238757 133218 30224 155648 -158324 110506 176087 21794 137524
4683 137524 -1458 -54554 -246262 -103070 95324 343397 -81163 208569 72947 -57192 198335
4671 -114439 342351 44368 184046 -243706 2048 -58291 25928 -5236 -290667 -118073 -84137
4660 -84137 -50150 60976 -96179 15147 2708 295483 292963 270677 -107856 -183738 503600 -58878
4647 -99854 -74253 -75789 -44573 215184 -35094 92419 335126 -28735 259278 335243 97181
4635 -228477 -196834 -43659 -328439 -174705 218119 126058 -157553 98074 -95330 -117675 244179
4623 142620 95830 126324 -18739 -50157 158664 -301926 279273 -145276 -162343 112070 -287091
4611 -14929 -113256 -79936 44553 -384581 -70489 125473 -39058 161289 360995 -74045 -91859
4600 -91859 57319 -91219 -16180 199520 43986 37166 -9772 -131333 48446 23341 -144076 94418
4587 -190239 -85578 400734 -13753 74939 137031 -324463 -199324 130644 -35886 -116708 -126754
4576 -126754 -190892 -236984 -41690 43605 129241 64764 -517 21137 -157114 54163 361060 269971
4564 269971 273311 79065 -148524 -56416 112284 -26511 171553 -126066 31898 -84075 30465
4552 -305605 183560 -262921 102928 179901 -75819 -216817 -175779 234717 23188 -17085 -44952
4541 -44952 173559 90045 100962 -186038 232162 433717 -5349 -58784 -130289 51654 -24001
4529 -133863 133292 239385 234216 -103674 52790 150644 -217043 -274531 44531 -197314 90790
4517 -20573 87962 197913 291969 27233 45413 227872 -66298 -46369 22878 111859 92410
4506 92410 -102257 -77763 64246 309411 -52680 96872 -16006 -198557 177283 -158576 111015
4494 -375423 -238082 367426 -234281 57279 540 141879 -187891 -68779 131447 529662 107905
4482 111499 -159667 -141988 -28987 -178846 -59947 -287640 -24918 -133321 -54404 -120848 229575
4470 -77678 -60553 -17598 124258 -193765 140575 219959 28858 100388 -190859 137700 -14033
$$ [...]
##END NTUPLES=NMR SPECTRUM
##END=
