##TITLE=AC1714_3158_8749746_dLcrRJoP4r
##JCAMPDX= 6.0         $$ Bruker NMR JCAMP-DX V2.0
##DATA TYPE= NMR SPECTRUM
##DATA CLASS= NTUPLES
##ORIGIN= BRUKER
##OWNER= Administrator
$$ 1.72 TOPSPIN		Version 2.1
$$ 2015-08-08 02:06:55.359 -0700  Administrator@X
$$ Compression mode = diff/dup
##.OBSERVE FREQUENCY= 400.02188249412
##.OBSERVE NUCLEUS= ^1H
##.ACQUISITION MODE= SIMULTANEOUS (DQD)
##.ACQUISITION SCHEME= undefined
##.AVERAGES= 64
##.DIGITISER RES= 22
##SPECTROMETER/DATA SYSTEM= spect
##.PULSE SEQUENCE= noesygpps1d.comp
##.SOLVENT NAME= COFFEE_meoh
##.SHIFT REFERENCE= INTERNAL, COFFEE_meoh, 1, 14.96106
##AUDIT TRAIL= $$ (NUMBER, WHEN, WHO, WHERE, PROCESS, VERSION, WHAT)
$$ ##TITLE= Audit trail, TOPSPIN		Version 2.1
$$ ##JCAMPDX= 5.01
$$ ##ORIGIN= Bruker BioSpin GmbH
$$ ##OWNER= Administrator
$$ $$ E:\/data/COFFEE/nmr/AC1714_3158_8749746_dLcrRJoP4r/42/pdata/1/auditp.txt
$$ ##AUDIT TRAIL=  $$ (NUMBER, WHEN, WHO, WHERE, PROCESS, VERSION, WHAT)
(   1,<2015-08-08 02:06:49.750 -0700>,<Administrator>,<X>,<go>,<TOPSPIN 2.1>,
      <created by zg
	started at 2015-08-08 01:55:19.266 -0700,
	POWCHK enabled, PULCHK disabled,
       configuration hash MD5:
       21 0F 79 D6 B3 7B B4 F6 88 20 88 DB 03 48 BD 9F
       data hash MD5: 64K
       CA 5B 32 09 45 73 A2 28 7F 9C E4 29 37 64 D5 F4>)
(   2,<2015-08-08 02:06:53.234 -0700>,<Administrator>,<X>,<proc1d>,<TOPSPIN 2.1>,
      <Start of raw data processing
       efp LB = 0.3 FT_mod = 6 PKNL = 1 PHC0 = 0 PHC1 = 0 SI = 128K 
       data hash MD5: 128K
       37 55 88 83 2A EB 8D DD ED 16 B7 95 A9 04 58 F8>)
(   3,<2015-08-08 02:06:54.141 -0700>,<Administrator>,<X>,<proc1d>,<TOPSPIN 2.1>,
      <pk PHC0 = -85.62195 PHC1 = 0 
       data hash MD5: 128K
       27 AD CA F0 E5 18 8C FD E4 24 D3 36 02 BE B6 47>)
(   4,<2015-08-08 02:06:54.516 -0700>,<Administrator>,<X>,<proc1d>,<TOPSPIN 2.1>,
      <abs ABSG = 1 
       data hash MD5: 128K
       B7 57 CE 35 56 87 E0 DF 94 36 5F A0 41 DB 4A E7>)
(   5,<2015-08-08 02:06:54.625 -0700>,<Administrator>,<X>,<proc1d>,<TOPSPIN 2.1>,
      <abs ABSG = 2 
       data hash MD5: 128K
       9C 46 D6 FE 22 B3 7A 39 31 DB 9F 51 D4 BC E2 CC>)
(   6,<2015-08-08 02:06:54.750 -0700>,<Administrator>,<X>,<proc1d>,<TOPSPIN 2.1>,
      <abs ABSG = 3 
       data hash MD5: 128K
       A6 3A A9 ED 3D 31 29 E9 C9 B4 FC 4A 94 68 BD 0F>)
(   7,<2015-08-08 02:06:54.828 -0700>,<Administrator>,<X>,<proc1d>,<TOPSPIN 2.1>,
      <abs ABSG = 4 
       data hash MD5: 128K
       48 AB 03 E1 D8 E6 66 7B A9 6E 8B EC 8D 68 E8 59>)
(   8,<2015-08-08 02:06:54.922 -0700>,<Administrator>,<X>,<proc1d>,<TOPSPIN 2.1>,
      <abs ABSG = 5 
       data hash MD5: 128K
       E1 5A 80 AF FE 91 E8 26 26 D7 3F 22 43 09 62 AB>)
$$ ##END=
$$ 
$$ $$ hash MD5
$$ $$ BE 11 5F BB 63 9E FF B7 8B 5E 08 BC 4A A1 50 1F
##$RELAX= 
##$RELAX= 
##$RELAX= 
##$RELAX= 
##$RELAX= 
##$RELAX= 
##$RELAX= 
##$RELAX= 
$$ Bruker specific parameters
$$ --------------------------
##$DU= <E:\>
##$EXPNO= 42
$$ [...]
##$TP07= 0
##$TPNAME0= <>
##$TPNAME1= <>
##$TPNAME2= <>
##$TPNAME3= <>
##$TPNAME4= <>
##$TPNAME5= <>
##$TPNAME6= <>
##$TPNAME7= <>
##$TPOAL= (0..7)
0.5 0.5 0.5 0.5 0.5 0.5 0.5 0.5
##$TPOFFS= (0..7)
0 0 0 0 0 0 0 0
##$TUNHIN= 0
##$TUNHOUT= 0
##$TUNXOUT= 0
##$USERA1= <user>
##$USERA2= <user>
##$USERA3= <user>
##$USERA4= <user>
##$USERA5= <user>
##$V9= 5
##$VALIST= <valist>
##$VCLIST= <CCCCCCCCCCCCCCC>
##$VD= 0
##$VDLIST= <DDDDDDDDDDDDDDD>
##$VPLIST= <PPPPPPPPPPPPPPP>
##$VTLIST= <TTTTTTTTTTTTTTT>
##$WBST= 2048
##$WBSW= 25
##$XGAIN= (0..3)
0 0 0 0
##$XL= 0
##$YL= 0
##$YMAX_a= 6620084
##$YMIN_a= -12584024
##$ZGOPTNS= <>
##$ZL1= 120
##$ZL2= 120
##$ZL3= 120
##$ZL4= 120
##$ABSF1= 14.96106
##$ABSF2= -5.597122
##$ABSG= 5
##$ABSL= 3
##$ALPHA= 0
##$AQORDER= 0
##$ASSFAC= 0
##$ASSFACI= 0
##$ASSFACX= 0
##$ASSWID= 0
##$AUNMP= <proc_prof1d_extract.lims>
##$AXLEFT= 0
##$AXNAME= <>
##$AXNUC= <1H>
##$AXRIGHT= 0
##$AXTYPE= 0
##$AXUNIT= <>
##$AZFE= 0.1
##$AZFW= 0.1
##$BCFW= 0
##$BC_mod= 0
##$BYTORDP= 0
##$COROFFS= 0
##$CY= 15
##$DATMOD= 1
##$DC= 0
##$DFILT= <>
##$DTYPP= 0
##$F1P= 0
##$F2P= 0
##$FCOR= 0.5
##$FTSIZE= 131072
##$FT_mod= 6
##$GAMMA= 0
##$GB= 0
##$INTBC= 1
##$INTSCL= 1
##$ISEN= 128
##$LB= 0.3
##$LEV0= 0
##$LPBIN= 0
##$MAXI= 10000
##$MC2= 0
##$MEAN= 0
##$ME_mod= 0
##$MI= 0
##$NCOEF= 0
##$NC_proc= -2
##$NLEV= 6
##$NOISF1= 0
##$NOISF2= 0
##$NSP= 0
##$NTH_PI= 0
##$NZP= 0
##$OFFSET= 14.96106
##$PC= 1
##$PHC0= -85.62195
##$PHC1= 0
##$PH_mod= 1
##$PKNL= yes
##$PPARMOD= 0
##$PPDIAG= 0
##$PPIPTYP= 0
##$PPMPNUM= 2147483647
##$PPRESOL= 1
##$PSCAL= 4
##$PSIGN= 0
##$PYNMP= <proc.py>
##$REVERSE= no
##$SF= 400.020009614676
##$SI= 131072
##$SIGF1= 0
##$SIGF2= 0
##$SINO= 400
##$SIOLD= 131072
##$SPECTYP= <>
##$SREGLST= <1H.CDCl3>
##$SSB= 0
##$STSI= 131072
##$STSR= 0
##$SW_p= 8223.68421052631
##$SYMM= 0
##$S_DEV= 0
##$TDeff= 65536
##$TDoff= 0
##$TI= <>
##$TILT= no
##$TM1= 0
##$TM2= 0
##$TOPLEV= 0
##$USERP1= <user>
##$USERP2= <user>
##$USERP3= <user>
##$USERP4= <user>
##$USERP5= <user>
##$WDW= 1
##$XDIM= 131072
##$YMAX_p= 389321065
##$YMIN_p= -11615
##$CURPLOT= <Network HP LaserJet P1505>
##$CURPRIN= <$Network HP LaserJet P1505>
##$DFORMAT= <normdp>
##$LAYOUT= <+/1D_H.xwp>
##$LFORMAT= <normlp>
##$PFORMAT= <normpl>
##$SURQMSG= 1
$$ End of Bruker specific parameters
$$ ---------------------------------
##NTUPLES= NMR SPECTRUM
##VAR_NAME=  FREQUENCY,     SPECTRUM/REAL,   SPECTRUM/IMAG
##SYMBOL=    X,             R,               I
##VAR_TYPE=  INDEPENDENT,   DEPENDENT,       DEPENDENT
##VAR_FORM=  AFFN,          ASDF,            ASDF
##VAR_DIM=   131072,        131072,          131072
##UNITS=     HZ,            ARBITRARY UNITS, ARBITRARY UNITS
##FACTOR=    0.0627417313425164, 1,          1
##FIRST=     8223.62146879497, 5738,         -56293
##LAST=      0,             6663,            -55466
##MIN=       0,             -11615,          0
##MAX=       8223.62146879497, 389321065,    0
$$ Real data points
##PAGE= N=1
##DATA TABLE= (X++(R..R)), XYDATA
$$ [...]
67776 86354 88056 89001 89177 88648 87814 87323 87302 87069 86128 85037 84772 85532 86823 88473 90758 93480 95730
67759 95730 96889 97308 97683 98188 98580 98765 98817 98717 98438 98126 97886 97505 96695 95500 94264 93295 92815 93059
67741 93059 94085 95517 96729 97348 97482 97518 97758 98117 98066 97071 95301 93631 92705 92169 91197 89548 87677
67724 87677 85942 84263 82586 81179 80298 79965 80201 81041 82121 82696 82432 81877 81823 82460 83419 84304 84736 84226
67706 84226 82677 80963 80382 81317 82811 83637 83417 82602 81752 81232 81317 82128 83383 84472 84892 84566 83792 82970
67688 82970 82361 82020 81952 82277 83124 84288 85191 85339 84826 84259 84159 84556 85128 85637 86182 87000 88065 88922 89053
67669 89053 88426 87601 87181 87246 87457 87623 87946 88641 89507 89975 89524 88026 85877 83886 82813 82746 82999 82912 82698
67650 82698 83197 84700 86395 87214 86964 86340 86009 86080 86386 86823 87314 87802 88424 89425 90724 91829 92381 92551
67632 92551 92646 92579 92052 91133 90294 89905 89955 90234 90509 90538 90231 89881 89983 90706 91680 92370 92463 91923 90985 90235 90351
67611 90351 91402 92546 92740 91832 90763 90650 91752 93316 94253 93941 92531 90699 89156 88278 88007 87924 87477
67594 87477 86357 84824 83550 82993 82913 82675 82060 81589 81919 83037 84243 84906 85044 85076 85276 85710 86552 88070
67576 88070 90154 92136 93346 93765 93972 94474 95199 95633 95354 94487 93694 93637 94362 95267 95698 95433 94595 93357
67558 93357 92005 91055 90918 91411 91872 91845 91452 91109 91035 91127 91153 90991 90746 90649 90826 91265 91982 92946 93713 93549
67538 93549 92381 91338 91759 93653 95704 96821 97084 96995 96506 95314 93699 92415 91793 91428 90853 90240 90313
67521 90313 91607 93893 96360 98429 100244 102134 103792 104464 104004 103218 102908 103045 103169 103153 103100 102835 102072
67504 102072 100940 99838 98836 97698 96486 95643 95378 95324 94981 94326 93901 94400 96107 98566 100829 102197
67488 102197 102654 102554 102146 101666 101546 102040 102763 103052 102768 102371 102300 102680 103558 104878 106126 106523 105818 104542
67470 104542 103405 102806 102960 103917 105221 106075 106215 106213 106576 107023 107054 106788 106586 106204 105149 103818 103465 104772
67452 104772 107083 109329 111126 112510 113227 113019 112448 112564 113633 114767 115063 114644 114200 113988 113822 113784 114256
67435 114256 115199 115958 116023 115629 115359 115464 115812 116269 116868 117686 118718 119784 120474 120434 119765 118929 118164 117371 116695
67416 116695 116728 117722 118997 119603 119350 118721 118068 117465 117153 117420 118054 118497 118638 118906 119590 120613 122048 124116
67398 124116 126432 127885 127756 126542 125353 124891 125311 126530 128120 129277 129531 129315 129367 129752 130001 130079 130548
67381 130548 131640 132730 132997 132336 131347 130619 130290 130201 130252 130464 130798 131066 131136 131146 131370 131868 132411 132703 132545
67362 132545 131833 130710 129761 129665 130469 131464 131961 131966 131880 131914 132108 132672 133847 135528 137344 139060 140625 141914
67344 141914 142771 143275 143665 143997 144112 143938 143572 143170 142997 143463 144731 146331 147542 148212 148792 149538 150140 150318
67326 150318 150314 150432 150457 149948 148941 147901 147109 146520 146227 146584 147707 149186 150508 151498 152136 152223 151611 150604
67308 150604 149738 149194 148865 149012 150275 152707 155215 156462 156184 155203 154303 153570 152809 152044 151430 151109 151340
67291 151340 152425 154226 156080 157429 158259 158709 158648 158052 157481 157624 158423 159182 159566 160040 161135 162678 164021
67274 164021 164805 165143 165166 164798 164202 164143 165483 168151 170912 172521 172963 173227 173949 174785 175246 175559 176249 177246
67256 177246 177951 178059 177752 177109 175850 173860 171668 170135 169760 170391 171533 172790 174019 175044 175451 174968
67240 174968 174104 173940 174950 176330 176903 176478 175851 175638 175773 176092 176721 177665 178615 179516 180830 182783 184770
67223 184770 185984 186405 186631 186897 186879 186481 186262 186803 188035 189410 190500 191175 191444 191478 191693 192460 193664 194832
67205 194832 195729 196598 197654 198637 199117 199087 198995 199232 199869 200802 201828 202568 202698 202408 202317 202694 203047 202749 201869
67186 201869 201061 200775 200928 201303 201891 202726 203658 204492 205242 206078 206973 207503 207203 206262 205701 206503 208520 210577
67168 210577 211759 212253 212721 213344 213914 214524 215589 217244 219199 221173 223043 224579 225490 225785 225809 225861 226096
67151 226096 226690 227631 228359 228144 227053 226085 226146 227210 228673 230140 231519 232719 233653 234463 235397 236472 237369
67134 237369 237678 237246 236427 235939 236247 237105 237952 238695 239646 240722 241310 241202 241135 241938 243503 245022 245985 246483
67116 246483 246784 247108 247736 248841 250184 251338 252279 253459 255244 257519 259845 261735 262814 262967 262493 261943
67100 261943 261756 262019 262548 263108 263724 264820 266770 269110 270619 270626 269998 270255 271836 273814 275283 276276 277132
67083 277132 277743 277957 278214 279100 280532 281928 283083 284339 285948 287750 289542 291304 292943 294169 294815
67068 294815 295051 295189 295557 296580 298570 301246 303810 305802 307563 309608 311871 313944 315749 317462 318968
67053 318968 319970 320576 321217 321984 322600 323131 324077 325586 327130 328321 329504 331160 333204 335352 337671 340193
67037 340193 342382 343731 344640 345987 347896 349661 350886 351974 353382 355066 356907 359137 361977 365316
67023 365316 369007 373053 377250 381051 384117 386750 389499 392574 395844 399096 402094 404711 407221 410113
67009 410113 413406 416515 419095 421618 424739 428392 431933 434962 437601 440141 442832 445901 449407 453060
66995 453060 456394 459098 461135 462847 465088 468805 474115 480053 485618 490759 495963 501281 506396 511400
66981 511400 516771 522541 528137 533096 537443 541322 544849 548428 552672 557769 563388 569374 576061 583616
66967 583616 591501 598949 605723 612161 618727 625767 633453 641632 649896 658014 666136 674411 682688 690832
66953 690832 699107 707903 717174 726480 735545 744531 753764 763427 773540 784078 795033 806426 818199
66940 818199 830115 841964 854025 867085 881697 897466 913378 928793 943761 958380 972384
66929 972384 985712 999104 1013629 1029609 1046447 1063559 1081045 1099195 1117698 1135811 1153215
66918 1153215 1170398 1188137 1206899 1226742 1247461 1268668 1289915 1310972 1331997 1353452 1375922
66907 1375922 1399811 1424840 1449888 1473770 1496363 1518610 1541247 1563980 1586241 1608266 1630827
66896 1630827 1654116 1677570 1700785 1723953 1747222 1770183 1792423 1814285 1836608 1859708 1882876
66885 1882876 1904967 1925341 1944190 1962030 1979115 1995468 2011270 2026835 2042115 2056575 2069738
66874 2069738 2081554 2091962 2100481 2106700 2110997 2114255 2116853 2118371 2118330 2116814 2114251 2110892 2106624 2101062
66860 2101062 2093782 2084713 2074311 2063119 2051159 2038001 2023376 2007443 1990550 1973088 1955473 1937714
66848 1937714 1919021 1898400 1875807 1852252 1828579 1804695 1780237 1755420 1730753 1706331 1681869
66837 1681869 1657218 1632423 1607453 1582195 1556593 1530590 1504253 1478120 1453030 1429143 1405503
66826 1405503 1381076 1355996 1331296 1307611 1284732 1262267 1240052 1217887 1195495 1172992 1150964
66815 1150964 1129851 1109581 1089952 1070963 1052545 1034306 1015884 997344 979006 961050 943501
66804 943501 926421 909796 893349 876784 860248 844295 829321 815191 801561 788348 775662
66793 775662 763353 750910 737989 724886 712318 700732 689922 679224 667992 655999 643650
66782 643650 631764 620898 610875 601182 591738 582917 574791 566833 558582 550239 542294 534844 527564
66769 527564 520122 512339 504258 496321 489148 482755 476279 468954 461080 453568 446788 440522 434782 429793
66755 429793 425128 419760 413369 406896 401326 396441 391322 385664 380015 374892 370215 365654 361142 356918
66741 356918 353204 349870 346418 342478 338284 334371 330710 326651 321929 317272 313538 310628 307756 304542
66727 304542 301185 297697 293743 289420 285609 283151 281947 281126 279876 277911 275364 272496 269494 266434
66713 266434 263498 261089 259477 258258 256559 253936 250827 247912 245266 242434 239131 235519 231867 228282
66699 228282 224827 221656 218919 216652 214792 213209 211720 210189 208612 207023 205376 203683 202173 201024
66685 201024 199844 197773 194396 190487 187517 186326 186355 186244 185072 183007 180922 179576 179151 179312 179491 179087
66669 179087 177632 175031 171784 168870 167157 166723 166776 166361 165213 163801 162596 161473 160020 158252 156738
66654 156738 155980 155902 156025 155940 155539 154995 154672 154893 155553 155997 155476 153737 151174 148478 146275 144912 144331 144128
66636 144128 143863 143307 142318 140730 138683 136898 136175 136476 136883 136593 135623 134413 133139 131804 130711 130315
66620 130315 130639 131168 131389 131176 130692 130202 130039 130375 130866 130785 129778 128356 127410 127269 127424 127129 126112 124683
66602 124683 123327 122335 121736 121414 121210 120978 120627 120162 119676 119281 119054 119020 119142 119269 119095 118222 116419 113947
66584 113947 111613 110286 110176 110650 110896 110724 110543 110638 110775 110601 110177 109884 109936 110136 110077 109458 108312 106998
66566 106998 105905 105084 104278 103319 102356 101624 101164 100893 100707 100436 99974 99651 100138 101605 103168 103639 102722 101097
66548 101097 99452 97956 96652 95779 95420 95274 95094 95084 95532 96269 96801 96890 96749 96730 96986 97386 97518 96868 95229
66529 95229 92999 90916 89410 88288 87169 86161 85933 86976 88878 90546 91209 90999 90463 89821 88991 88083
66513 88083 87431 87168 87119 87070 86812 86010 84521 82965 82464 83493 85256 86429 86308 85105 83524 82307 81924
66496 81924 82312 82958 83472 83958 84697 85695 86777 87883 88994 89883 90224 89885 88966 87660 86241 84977 83874
66479 83874 82686 81409 80474 80171 80131 79752 78984 78294 78002 78069 78432 79064 79638 79619 78895 78060 77875 78609 79842
66460 79842 80705 80374 78752 76817 75926 76518 77682 78159 77621 76824 76688 77419 78474 79205 79498 79759 80303 80915
66442 80915 81213 81308 81759 82798 83915 84416 84176 83643 83239 83000 82766 82489 82245 82049 81852 81727 81927 82590 83425
66423 83425 83939 83984 83839 83643 83119 82158 81327 81302 81941 82445 82412 82159 81944 81480 80526 79455 78773 78346 77580 76219
66403 76219 74569 73007 71637 70441 69459 68796 68652 69339 70971 73128 75096 76542 77698 78753 79347 78949
66387 78949 77639 76178 75287 75079 75247 75456 75360 74589 73183 71947 71815 72725 73604 73725 73606 74135 75171 75704
66369 75704 75231 74267 73414 72624 71713 71020 71053 71782 72783 73882 75214 76712 77945 78526 78388 77627 76354
66352 76354 74825 73502 72821 72856 73310 73834 74349 74961 75541 75632 75019 74273 74230 74858 75125 74287 72863 71940 71920
66333 71920 72502 73567 75219 76937 77575 76655 75135 74356 74553 74933 75017 75238 76103 77249 77777 77388 76861 77226
66315 77226 78610 80097 80722 80362 79541 78675 77909 77528 77926 79003 80080 80752 81377 82303 82985 82538 81020
66298 81020 79469 78579 77970 77045 75966 75338 75343 75663 76040 76416 76703 76876 77221 77985 78832 79092 78577 77676 76621
66279 76621 75268 73825 73141 73766 75094 75995 76103 75936 75882 75701 75134 74464 74206 74545 75372 76611 78221 79959
66261 79959 81381 82110 82065 81479 80729 80003 79045 77450 75390 73884 73986 75604 77404 78045 77379 76297 75615
66244 75615 75482 75798 76656 78041 79443 80320 80905 82008 83845 85517 86020 85462 84877 84919 85191 84940 84077 83306
66226 83306 83310 84007 84644 84585 83879 82968 82010 80830 79547 78802 79070 80035 80972 81512 81704 81575 81090 80469 80104
66207 80104 80145 80536 81364 82704 84077 84622 84074 83150 82713 82846 83052 83072 83169 83732 84872 86436 88155 89692
66189 89692 90581 90303 88726 86571 85134 85098 85816 86193 86150 86535 87626 88526 88403 87580 86883 86485 86101 85869
66171 85869 86227 87088 87920 88686 89958 91885 93637 94255 93734 92905 92465 92397 92240 91693 90920 90346 90229 90433
66153 90433 90667 90807 90908 91039 91272 91749 92562 93607 94689 95634 96122 95670 94180 92440 91662 92383 94077
66136 94077 95860 97213 97964 97987 97279 96152 95108 94583 94854 95983 97638 99215 100348 101208 102096 102888 103181
66119 103181 102923 102567 102540 102830 103187 103513 103847 104180 104526 105098 106083 107233 107994 108178 108218 108523 108847 108649 107941
66100 107941 107275 106925 106593 106073 105703 105807 106113 106180 106164 106665 107949 109765 111829 113965 115768 116641 116368 115316
66082 115316 113991 112739 111924 111869 112339 112521 111883 110788 109953 109626 109713 110317 111501 112667 112925 112255 111707 112118
66064 112118 113088 113633 113475 113169 113109 113008 112442 111460 110444 109674 109262 109274 109645 110085 110367 110671 111429 112797 114428
66045 114428 115806 116648 117001 117073 117029 116868 116497 115977 115602 115582 115784 115997 116381 117302 118691 119951 120654 120983 121278
66026 121278 121532 121691 122153 123387 125088 126233 126164 125280 124463 124102 123916 123578 123171 123065 123555 124664 126183
66009 126183 127841 129523 131344 133469 135813 138014 139788 141236 142661 144090 145225 145988 146826 148198 149877
65994 149877 151164 151791 152257 153129 154384 155607 156536 157080 157035 156192 154686 152999 151543 150385 149299 147999
65978 147999 146376 144669 143289 142381 141706 141027 140363 139716 138898 137903 137185 137132 137501 137805 138090 138818 139998 140985
65960 140985 141242 140929 140659 141002 142208 144012 145646 146500 146886 147751 149593 152129 155076 158581 162557 166204
65944 166204 168748 170339 171667 172947 173770 173851 173480 173224 173469 174205 175078 175723 176274 177319 179133 181201 182771
65927 182771 183676 184261 184784 185344 186177 187473 188995 190418 191962 194085 196523 198317 199003 199178 199618 200416
65911 200416 201324 202381 203615 204573 204776 204433 204102 203847 203340 202679 202365 202353 201846 200322 198162 195941 193584
65894 193584 190778 187763 185082 182708 180045 176824 173524 170797 168889 167679 166900 166160 165144 163988 163150
65879 163150 162705 162106 160947 159691 159204 159643 160240 160238 159792 159734 160583 161932 162814 162649 161761 160910 160501 160442 160673
65860 160673 161402 162684 164125 165280 166124 166854 167459 167833 168135 168658 169349 169832 169893 169677 169395 169077 168669 168202
65842 168202 167795 167602 167678 167815 167647 167054 166258 165442 164648 164264 165066 167197 169561 171029 172001 173880 177048
65825 177048 180377 182912 185001 187286 189536 191213 192502 193877 195030 195077 193708 191480 189095 186981 185473
65810 185473 184725 184418 184106 183923 184451 185794 187230 187956 187818 187167 186359 185595 185020 184714 184678 184894 185366 186073
65792 186073 187020 188264 189786 191451 193301 195796 199482 204423 210218 216517 223261 230420 237743 244861
65778 244861 251398 256975 261309 264438 266608 267877 267914 266243 262612 257205 250748 244401 239247 235649 233213
65763 233213 231498 230692 231492 234370 239105 245111 252186 260812 271613 284642 299357 315211 331952
65750 331952 349338 366949 384485 401877 418805 434329 447278 456842 462596 464289 462003 456292
65738 456292 447742 436500 422528 406133 387873 368273 348088 328556 310681 294363 278903 264309
65726 264309 251371 240378 230597 221338 212807 205462 199145 193375 188075 183456 179512 176141 173586 172214
65712 172214 171919 172093 172133 171681 170517 168589 166176 163838 162175 161592 162094 163139 163928 164049 163706 163278 162995
65695 162995 163179 164362 166737 169769 172751 175578 178679 182386 186749 191727 197150 202617 207863 213176
65681 213176 219147 226130 234324 244170 256185 270380 286341 303916 323347 344619 367088 389910
65669 389910 412524 434484 455131 473652 489419 502205 512203 519811 525226 528250 528680 526853 523628
65656 523628 519959 516754 514867 514693 515704 516927 517962 519015 519724 518640 514428 507219 498165 487766
65642 487766 475201 459404 440464 419732 398708 377960 357121 335817 314481 294165 275731
65631 275731 259429 245180 232812 221919 211918 202596 194473 188326 184379 182069 180410 178522 176047
65618 176047 173330 171029 169411 168174 167054 166199 165690 165080 163902 162465 161618 161799 162666 163595 164118 164053 163725
65601 163725 164001 165493 167656 169280 170006 170713 172191 174154 176027 178015 180657 183776 186786 189900 194185
65586 194185 200323 208015 216806 226794 238210 250876 264631 279885 297160 316248 336305 356704
65574 356704 377272 397676 417092 434599 449523 461211 468910 472288 471826 468225 461473 450899 436290
65561 436290 418587 399317 379543 359607 339661 320086 301347 283712 267289 252198 238572
65550 238572 226419 215585 205898 197347 190102 184298 179800 176235 173379 171430 170727 171184 172121 172757 172779
65535 172779 172398 171978 171765 171870 172315 173020 173755 174156 173818 172459 170083 167031 163891 161323 159786 159193 158810
65518 158810 157758 155830 153744 152454 152258 152707 153192 153364 153067 152243 151173 150561 150972 152106 152874 152459 151182
65501 151182 150081 149641 149327 148582 147922 148480 150546 153184 155494 157660 160273 163124 165433 167093 168862
65486 168862 171166 173437 175022 176170 177514 178925 179578 179139 178287 177845 177799 177439 176249 174321 172061 169830
65470 169830 167924 166615 165933 165494 164802 163817 163037 162882 163122 163147 162726 162293 162379 163018 163816 164471 164992 165497 166017
65451 166017 166596 167385 168504 169848 171227 172738 174797 177543 180306 181938 181812 180366 178581 177151 176254
65436 176254 175758 175325 174537 173347 172343 172244 173152 174612 176216 177730 178804 179218 179474 180437 182163 183693
65420 183693 184330 184492 184870 185375 185558 185564 185835 186140 185772 184687 183673 183274 183197 182936 182328 181292 179704 177921
65402 177921 176894 177265 178652 180260 181901 183917 186292 188420 189901 191148 192901 195278 197523 198741
65388 198741 198803 198344 197878 197079 195197 192062 188484 185593 183963 183308 182831 181867 180497 179575 179890 181230 182523
65371 182523 182969 182736 182473 182539 182970 183812 185107 186733 188613 191007 194294 198519 203358 208531 214077 220316
65355 220316 227663 236258 245520 254217 261311 266661 270662 273305 274080 272843 270332 267522 264662 261192
65341 261192 256467 250363 243272 235798 228506 221811 215969 211189 207730 205728 204818 204098 202730 200648 198466
65326 198466 196628 194923 193030 191227 190030 189210 187759 185047 181582 178354 175755 173520 171370 169189
65312 169189 166702 163565 159915 156445 153841 152391 152173 153161 154899 156419 156919 156486 155926 155933 156637 157888
65296 157888 159601 161613 163470 164691 165263 165576 165845 165888 165699 165914 167189 169186 170653 170745 169868 168979 168458
65279 168458 168042 167611 167437 167690 168177 168710 169335 170054 170636 170937 171163 171578 172145 172680 173290 174339 175963 177864
65261 177864 179705 181558 183754 186344 188932 191174 193204 195202 196643 196491 194377 191193 188106 185243
65247 185243 181907 177955 174330 171950 170593 169257 167393 165410 164036 163538 163656 164153 165209 167117 169560
65232 169560 171484 171976 171187 169990 168783 167117 164690 162150 160477 159850 159594 159165 158718 158678 159090 159528 159518
65215 159518 158992 158383 158214 158504 158786 158829 159098 160177 161916 163527 164446 164732 164681 164521 164515 164888 165395 165391 164599 163589
65195 163589 163230 163836 165074 166472 167711 168629 169276 169958 170913 171952 172607 172644 172194 171447 170475 169410 168509
65178 168509 167891 167362 166667 165829 165080 164560 164208 163891 163469 162751 161568 160066 158765 158126 158034 157911 157438 156923
65160 156923 156740 156642 156009 154793 153747 153568 154174 155104 156279 157899 159767 161299 162314 163388 165191 167765
65144 167765 170715 173879 177461 181553 185860 190007 193939 197772 201376 204362 206651 208856 211795 215671
65130 215671 220056 224722 230004 236043 242065 247052 251007 254990 259722 264664 268686 271232 272523 272911
65116 272911 272422 270793 267710 263073 257235 250812 244137 237059 229467 221827 214920 209165 204412 200278
65102 200278 196492 193032 190127 188018 186558 185233 183759 182396 181380 180384 178973 177425 176470 176226 175944
65087 175944 174946 173352 171707 170284 169015 167807 166659 165634 164924 164813 165423 166548 167808 168903 169794
65072 169794 170802 172428 174820 177508 179905 181909 183663 184947 185451 185573 186210 187569 188938 189849 190698
65057 190698 191717 192138 191151 189161 187279 185890 184532 182938 181296 179604 177674 175832 174771 174468 174028
65042 174028 172874 171446 170393 169732 169188 168725 168199 167030 164877 162331 160339 159159 158428 157978 157904 157933 157450
65025 157450 156322 155183 154698 154978 155855 157247 158951 160509 161726 163132 165477 168724 171902 174044 175132
65010 175132 176051 177747 180491 183822 187004 189528 191361 192915 194820 197476 200600 203270 204655 204766 204347
64995 204347 204057 204023 204205 204792 205927 207383 208925 210886 213887 217939 222292 226312 230050 233648 236519
64980 236519 237620 236507 233792 230532 227353 224193 220710 216862 213129 210070 207697 205525 203366 201744
64966 201744 201228 201634 202297 202882 203431 203755 203444 202501 201363 200200 198822 197474 196924 197292 197419 196104 193557
64949 193557 190996 189154 187966 187412 187688 188437 188691 187998 187100 187112 188410 190548 192833 194650 195609 195789 195665
64932 195665 195463 194766 193045 190454 187771 185661 184247 183288 182512 181764 181043 180485 180218 180254 180541 181001 181509
64915 181509 181975 182511 183317 184303 185129 185798 186920 189064 192037 195182 198215 201408 205122 209714 215819 223948
64899 223948 233550 243058 251391 259085 267481 277086 287300 297495 307582 317364 326041 332743 337196
64886 337196 339499 339560 337162 332369 325478 316821 307044 297368 288865 281390 273863 265896 258617 253544 251086
64871 251086 250569 251275 252780 254491 255626 255833 255324 254221 252225 249081 244962 240153 234791 229207 224078
64856 224078 219799 215970 212057 208357 205642 203832 201754 198612 195139 192746 191768 191219 190219 189016 188316
64841 188316 188155 187948 187451 187102 187372 188165 189069 189908 190818 191947 193250 194491 195354 195693 195826 196458 198102
64824 198102 200594 203244 205434 207031 208376 209989 212141 214552 216645 218206 219668 221628 224309 227680
64810 227680 231740 236253 240379 243094 244048 243682 242510 240663 238166 235221 232111 229139 226758 225328 224638
64795 224638 224145 223880 224607 226688 229256 231061 231880 232509 233509 234529 234977 234852 234657 234724 234809 234279 232721
64778 232721 230518 228767 228393 229365 230977 232854 235391 239206 244471 250845 257763 264699 271403 278088 285201
64763 285201 292903 300939 309111 317623 326767 336409 346014 355090 363519 371547 379490 387216 393754 397648
64749 397648 397939 394682 388369 379225 367508 354230 340961 328765 317747 307728 298896 291625 286066
64736 286066 282183 279896 278932 278853 279538 281308 284217 287530 290347 292550 294637 296924 299519 302923 307809
64721 307809 314012 320489 326634 332962 339997 347010 352492 355628 356661 355981 353472 348801 341917 333174
64707 333174 323230 312837 302432 291943 281290 270997 261954 254562 248436 243000 238058 233688 229921
64694 229921 226704 224059 222133 221137 221123 221695 222150 222147 222089 222545 223560 224968 227168 230867 236025 241722 247279
64677 247279 252856 258677 264327 269280 273574 277310 279891 280473 279008 276235 272725 268558 263977 259717
64663 259717 256406 254026 252228 250855 249892 249213 248739 248755 249744 251811 254511 257313 260094 262980 265804 268036
64647 268036 269409 270399 271868 274292 277611 281703 286604 292135 297745 302996 308013 313197 318664 324232
64633 324232 329791 335311 340455 344457 346580 346625 344927 341856 337365 331135 323254 314649 306559 299531 293153
64618 293153 286837 280593 274925 270228 266507 263522 260949 258543 256314 254379 252547 250266 247281 244109
64604 244109 241536 239820 238694 238023 238022 238804 240063 241395 242756 244527 247236 251240 256546 262825 269638
64589 269638 276652 283750 291132 299327 308829 319597 331083 342814 354583 365918 375847 383635 389456
64576 389456 393835 396692 397468 396023 392761 387918 381452 373747 365692 357758 349548 340673 331637 323356
64562 323356 316148 309692 303789 298623 294337 290871 288281 286797 286340 286313 286169 286041 286560 288097 290396 292954
64546 292954 295457 297769 299806 301699 303875 306473 308692 309196 307454 304250 300588 296442 291017 284033
64532 284033 276262 268878 262721 258122 254877 252298 249775 247483 246179 246162 246813 247348 247595 247753 247816 247700
64516 247700 247603 247745 247872 247562 247014 247041 248137 250011 252253 255029 258701 263023 267285 271243 275402 280135
64500 280135 284903 288674 290930 291917 292091 291772 291252 290777 290314 289821 289838 291285 294382 298290 302240 306549
64484 306549 311888 317911 323363 327443 330244 331794 331419 328515 323437 317231 310812 304766 299638 295942
64470 295942 293871 293249 293796 295360 297906 301334 305193 308668 311103 312523 313361 313621 312705 310224 306631
64455 306631 302823 299360 296324 293667 291381 289462 288011 287316 287650 289012 291163 293767 296455 299011 301737
64440 301737 305450 310791 317592 325147 333073 341703 351632 363090 375866 389789 405235 423075 444138
64427 444138 468814 497300 530059 567739 610791 659635 715398 780070 855545 942473 1039949
64416 1039949 1145895 1257519 1371676 1485163 1594695 1696874 1788894 1869628 1939481 1998518
64406 1998518 2044865 2075365 2087562 2080636 2054862 2011182 1951512 1878568 1794638 1700632 1596738
64395 1596738 1484040 1365447 1245243 1127942 1017364 916293 826468 748553 682084 625764
64385 625764 578115 537959 504314 476144 452493 432799 416753 403879 393427 384687 377176 370546
64373 370546 364473 358616 352512 345642 337779 329230 320487 311819 303408 295652 288876 282860 277177 271953
64359 271953 267718 264439 261446 258552 256607 256428 257698 259440 261145 262825 264288 265147 265376 265106 263972
64344 263972 261450 257940 254676 252250 250018 247406 245004 243630 242860 241459 239025 236304 233952 231947
64330 231947 230381 229921 230959 233017 235551 238836 243413 249053 254947 260709 266543 272495 278165 283123
64316 283123 287009 289221 289200 287195 284153 280528 275754 269232 261380 253293 245709 238829 232825 227927 224041
64301 224041 220761 217795 215104 212644 210345 208341 206841 205746 204672 203472 202432 201872 201828 202245 203238
64286 203238 204908 207060 209321 211534 213854 216527 219680 223361 227608 232309 237005 241013 243984 246368
64272 246368 249052 252359 255569 257621 258226 258033 257835 257908 258171 258610 259293 260102 260656 260427 258887 255787 251514
64255 251514 247043 243261 240289 237639 234924 232154 229346 226326 223139 220344 218500 217491 216757 216142 216036
64240 216036 216636 217577 218548 219860 221932 224483 226696 228087 228839 229394 230137 231420 233322 235304 236595 237104
64224 237104 237547 238471 239615 240514 241260 242268 243578 244907 246187 247608 249244 251023 253034 255470 258258
64209 258258 261075 263744 266321 268763 270769 271984 272163 271174 269148 266593 264102 261869 259741 257731 256218
64194 256218 255608 256143 258100 261806 267208 273651 280279 286488 291831 295776 297891 298221 297185 295094 291892
64179 291892 287367 281460 274427 266877 259663 253473 248356 243756 239085 234254 229558 225227 221273 217735
64165 217735 214778 212450 210556 208942 207729 207084 206953 207285 208320 210257 212699 214949 216948 219446 223009
64150 223009 227265 231442 235203 238534 241118 242430 242379 241389 239845 237830 235387 232637 229662 226667 224237
64135 224237 222951 222584 222149 220950 219295 217979 217415 217570 218406 219942 221935 223934 225681 227284 228967
64120 228967 230821 232916 235512 239032 243679 249055 254263 258571 262002 265135 268409 271772 274953 277758
64106 277758 280071 281982 284064 287144 291412 295988 299692 302144 303768 304920 305449 305085 303780 301500 298082
64091 298082 293557 288350 282969 277661 272558 267880 263712 259832 256096 252868 250672 249502 248908 248736 249233
64076 249233 250257 250925 250506 249316 248327 248091 248506 249409 250851 252788 254965 257202 259433 261449 263043 264442
64060 264442 266177 268395 270687 272710 274480 275944 276825 277206 277757 278911 280236 281102 281542 281932 282196 282062
64044 282062 281842 282193 283141 284059 284711 285636 287343 289752 292608 295860 299268 302208 304303 305856 307187 307938
64028 307938 307583 306449 305673 306135 307787 310011 312219 313979 314918 314792 313557 311227 307773 303340 298510
64013 298510 294134 290742 288166 285854 283526 281385 279709 278472 277449 276450 275227 273405 270916 268453
63999 268453 267097 267367 268879 271046 273745 277064 280641 283722 285994 288074 290884 294592 298431 301713
63985 301713 304743 308384 312819 317293 321235 325031 329275 333677 337382 340182 342669 345211 347507 349404
63971 349404 351550 354781 359206 364297 369669 375454 382069 389874 398935 408894 419200 429655 440664
63958 440664 452865 466691 482454 500629 521814 546493 575042 607882 645500 688447 737442
63947 737442 793326 856651 927352 1004945 1089027 1179493 1276331 1379273 1487451 1599223 1712375
63936 1712375 1824661 1934123 2038916 2136925 2225657 2302420 2364647 2410399 2438776 2449779 2443640
63925 2443640 2420440 2380400 2324346 2253648 2169911 2075001 1971355 1862018 1750165 1638452
63915 1638452 1528627 1421665 1318459 1220420 1129225 1045895 970403 902368 841861 789157 743887
63904 743887 704873 670917 641479 616529 595944 579169 565319 553551 543449 535119 528847 524638
63892 524638 522126 520879 520603 521083 522172 523944 526657 530438 535187 541050 548773 559173 572155 586621
63878 586621 601649 617541 635486 656354 680158 706614 735803 768232 804538 845212 890292
63867 890292 939263 991615 1047575 1107892 1172778 1241533 1313379 1388021 1465000 1543081 1620955
63856 1620955 1698054 1773934 1847212 1915990 1979134 2036227 2086305 2127670 2159121 2180472 2191533
63845 2191533 2191472 2179697 2156681 2123384 2080475 2028708 1969467 1904214 1833750 1758687 1680321 1600330
63833 1600330 1519772 1439125 1359282 1281776 1207817 1137562 1070658 1007162 947686 892814 842673
63822 842673 797057 755777 718730 685685 656235 630069 607100 587125 569679 554569 542251
63811 542251 532993 525735 518574 510500 501900 493091 483198 471099 456923 441926 427256 413436 400708
63798 400708 389195 378793 369358 360869 353151 345800 338812 332844 328298 324492 320413 315962 311773 308045
63784 308045 304423 300910 298016 295876 293993 292069 290450 289480 288952 288458 287856 287104 286036 284567 282883
63769 282883 281242 279814 278737 277991 277216 276020 274553 273340 272517 271668 270542 269421 268550 267680 266536 265335
63753 265335 264465 263899 263371 262942 263060 264081 266044 268832 272278 276024 279492 282180 284000 285303 286575
63738 286575 288142 290136 292657 295786 299383 303102 306727 310362 314170 318129 322198 326531 331244 336195
63724 336195 341284 346840 353328 360730 368474 375903 382494 387729 391178 392815 392992 392085 390271 387562 383830
63709 383830 378963 373228 367324 361742 356296 350679 345221 340626 337104 334370 332392 331499 331736 332753 334384
63694 334384 336690 339265 341206 342126 342601 343282 344116 344830 345645 346906 348360 349391 349847 350150 350739 351872
63678 351872 353890 357147 361528 366430 371360 376320 381424 386404 390808 394670 398621 403144 407955 412417
63664 412417 416372 420058 423182 424736 424075 421669 418248 413674 407339 399375 390673 381839 372975 364534
63650 364534 357510 352460 348998 346529 344917 344126 343851 343907 344516 345779 347326 348893 350829 353560 356833
63635 356833 360021 363016 366406 370855 376537 383033 389583 395619 401237 407069 413689 421440 430761 442100
63621 442100 455338 469827 485287 502095 520455 539918 560211 581904 605648 631212 657920
63610 657920 685575 714102 742592 769623 794425 816869 836254 850979 859771 862665 860557 854427
63598 854427 845406 835074 825010 815984 807773 799629 790744 780522 768705 755282 740176 723146
63586 723146 704226 684170 664224 645326 627650 611062 595856 582719 572013 563491 556937 552679
63574 552679 550959 551120 552075 553539 556071 559819 564017 568079 572506 578078 584689 591627 598721 606556 615706
63559 615706 626375 638708 652956 669319 688026 709566 734572 763678 797742 837727 883525
63548 883525 932923 982319 1028417 1068566 1099676 1118155 1121928 1112309 1093334 1069391 1043688 1018399
63536 1018399 995256 975601 960135 948879 941245 936009 931387 925546 917238 905952 891418 873224
63524 873224 851234 826294 800013 773615 747245 720670 694270 668931 645222 623236 603198
63513 603198 585606 570559 557395 545340 534265 524494 516011 508234 500635 493290 486623 480682 474965
63500 474965 469087 463417 458742 455273 452336 449224 446099 443755 442636 442386 442383 442418 442754 443654 445080 446895
63484 446895 449325 452980 458261 464799 471703 478319 484532 490441 496178 502037 508184 513942 517868 519020
63470 519020 517870 515543 512447 508142 502323 495357 487881 480371 473153 466421 460149 454249 448923 444521
63456 444521 441060 438187 435776 434343 434733 437449 442293 448559 455669 463790 473790 486474 501977 520037
63442 520037 540785 565141 594520 630160 672396 720253 771768 824593 875904 921718 957301
63431 957301 979161 986746 981932 967402 946040 921328 897111 876620 862131 855306 856988 866532
63419 866532 882098 901940 924925 949765 974534 997274 1016555 1031153 1039837 1042049 1038504 1030756
63407 1030756 1020413 1008879 997271 986017 974785 963093 950752 937429 922178 903927 882314
63396 882314 857790 831164 803396 775606 748732 723095 698528 674921 652538 631954 613847
63385 613847 598624 586035 575349 566203 559095 554801 553414 554226 556386 559351 562879 567054 572355 579320
63371 579320 587956 597683 607937 618705 630501 644054 660080 679020 700746 724658 750309 777882
63359 777882 807815 839899 872948 905428 936225 964596 989592 1009936 1024589 1033227 1036174 1034247
63347 1034247 1028816 1021481 1013215 1003961 993478 982318 971377 960550 948461 933749 916163 896230
63335 896230 874427 851162 827202 803542 780863 759527 740135 723820 711879 705306 704626 709801
63323 709801 719891 732763 745385 754592 757675 752485 737579 713005 681071 645811 611140 579372
63311 579372 551345 527322 507259 490576 476431 464357 454257 445853 438643 432399 427153 422594
63299 422594 418014 413094 408265 403976 400019 395967 391997 388799 386705 385239 383567 381205 378255 375062
63285 375062 371741 368151 364322 360638 357407 354489 351676 349243 347637 346783 346238 346031 346631 347955 349071
63270 349071 349278 348930 348785 349005 349239 349353 349540 349939 350600 351608 352813 353610 353497 352836 352713 353926 356287
63253 356287 358848 360713 361758 362786 364904 368611 373505 378810 383867 388167 391446 394093 397040 400945
63239 400945 405774 411449 418361 426764 436083 445530 455169 465692 477245 489189 501085 513259 526148
63226 526148 539604 553094 566257 579038 591559 604092 616942 630131 643295 656025 668224
63215 668224 680055 691657 702946 713605 723215 731389 737748 741802 743054 741340 736864 729725 719703
63202 719703 706836 691996 676426 660708 644572 627766 610798 594787 580904 570009 562412 557677
63190 557677 554846 553123 552430 553245 555985 560572 566583 573764 582367 592793 604919 617965 631173 644360
63176 644360 657573 670478 682580 693999 705547 717900 730949 744082 756808 768957 780444
63165 780444 790931 799548 804985 806120 802722 795435 785059 772044 756650 739191 719948 699091
63153 699091 676968 654254 631603 609289 587478 566762 548090 532071 518464 506456 495359
63142 495359 485050 475825 467909 461138 455130 449753 445313 442110 439825 437558 434630 431287 428436 426728
63128 426728 426062 425978 426248 426920 428022 429530 431531 434131 437156 440156 442755 444855 446628 448506 451032
63113 451032 454305 457575 459836 460920 461599 462470 463268 463599 463843 464774 466559 468697 470797 472871 474894 476644
63097 476644 478168 479989 482611 485990 489647 493114 496184 498923 501627 504630 508009 511452 514467 516722
63083 516722 518213 519177 519835 520216 520236 519920 519460 519076 518974 519433 520657 522474 524411 526254 528338 531129 534732
63066 534732 539041 544104 550067 556875 564363 572616 582009 592916 605465 619479 634510 650172 666691
63053 666691 684991 705898 729313 754324 780089 806458 833950 863254 894517 926863 958810
63042 958810 989477 1019137 1048401 1077276 1105572 1133887 1163369 1194427 1226232 1257567 1287692
63031 1287692 1316235 1342742 1366630 1387304 1404145 1416508 1423769 1425229 1420109 1407970 1389089 1364107
63019 1364107 1333484 1297770 1258264 1216819 1175011 1133993 1095051 1059424 1027385 998312 972115
63008 972115 949954 933066 921435 914204 910885 911453 915638 922969 933453 947443 964691 984120 1004730
62995 1004730 1026298 1048987 1072659 1096860 1121199 1145432 1169313 1192679 1215669 1238558 1261164
62984 1261164 1282491 1301153 1316290 1327956 1336470 1341392 1341314 1334709 1320852 1300022 1273135 1241383
62972 1241383 1205958 1167774 1127332 1085046 1041697 998504 956705 917088 879872 844934 812175
62961 812175 781689 753607 727839 704114 682277 662408 644543 628362 613313 599050 585643
62950 585643 573321 562103 551748 542038 532914 524295 515953 507760 499951 492816 486216 479803 473742
62937 473742 468647 464542 460451 455568 450438 446234 443060 439828 435947 432314 430188 429573 429266 428239 426503
62922 426503 424709 423378 422587 422104 421652 421091 420455 419857 419342 418843 418291 417852 418060 419495 422173 425408 428460
62905 428460 431160 433756 436373 439009 441861 445215 448989 452796 456450 460039 463496 466481 468769 470402
62891 470402 471491 472227 473097 474560 476396 477851 478586 479073 479924 481296 483099 485170 486940 487467 486312 484039
62875 484039 481473 478819 475917 472938 470246 467731 464905 461643 458427 455805 453872 452248 450357 447834
62861 447834 444947 442527 441201 440791 440658 440496 440455 440550 440419 439843 439253 439439 440728 442566 443986 444482 444280
62844 444280 443760 442986 442034 441385 441416 441669 441364 440665 440698 442062 444017 445556 446618 447735 449064 450394 451666
62827 451666 452857 453667 453992 454427 455632 457358 458734 459377 459685 460191 461230 463086 465740 468524 470705 472434
62811 472434 474505 477146 479770 482011 484249 486836 489539 492184 495303 499533 504679 509863 514498 518768
62797 518768 523280 528531 534651 541455 548795 556957 566607 578248 591867 607205 624224 643247 664770
62784 664770 689267 716953 747614 780707 815782 852812 892129 934007 978272 1024234 1071105
62773 1071105 1118507 1166337 1213971 1259870 1302258 1340051 1372827 1400037 1420610 1433287 1437046
62762 1437046 1431353 1416399 1393027 1362169 1324500 1280995 1233590 1184616 1135488 1086400 1037262
62751 1037262 988479 940829 895198 852551 813585 778231 745948 716566 690357 667255 646679
62740 646679 628296 612218 598206 585451 573590 563152 554443 546643 538752 530909 523989 518329 513677
62727 513677 510106 508038 507391 507466 507804 508548 509916 511933 514732 518589 523526 529316 535918 543451 551782
62712 551782 560674 570396 581574 594348 608313 623517 640810 660801 683049 706777 732000 759421
62700 759421 789462 821947 856630 893592 933119 975507 1020856 1068682 1117721 1166398 1213540
62689 1213540 1258432 1300245 1337647 1369052 1393086 1408881 1416114 1414808 1405005 1386662 1359972 1325708
62677 1325708 1285106 1239590 1190761 1140429 1090127 1040522 991689 944150 899281 858359 821404
62666 821404 787373 755452 725823 699102 675431 654421 635729 619234 604612 591186 578475
62655 578475 566694 556363 547491 539417 531459 523461 515695 508535 502300 497145 492921 489319 486261 483893
62641 483893 482038 480041 477496 474846 472866 471705 470893 470140 469578 469226 468791 468121 467346 466428 465088 463452
62625 463452 462247 461959 462219 462457 462716 463324 464086 464545 464785 465277 465927 466076 465611 465435 466488 468796 471766
62608 471766 474979 478315 481762 485621 490605 497173 504832 512623 520369 529054 539840 552945 567697
62595 567697 583488 600423 619056 639708 662199 686080 710795 735530 759272 781385 801913
62584 801913 820841 837130 849067 855669 857201 854150 846386 833806 817274 798186 777374 755052
62572 755052 731653 707971 684478 661195 638398 616876 597209 579314 562896 547934 534384
62561 534384 521886 510201 499611 490450 482446 475019 468028 461777 456341 451435 447001 443399 440766
62548 440766 438643 436602 434926 434205 434374 434684 434680 434748 435406 436439 437136 437260 437347 438020 439332 440925 442571 444355
62530 444355 446527 449354 453025 457509 462571 468091 474286 481480 489749 498972 509171 520655 533829
62517 533829 549027 566492 586268 608095 631587 656622 683361 711741 741019 769996 797716
62506 797716 823889 848571 871511 891875 908631 921091 929072 932706 932346 928585 922022 912896 901204
62493 901204 887374 872601 858284 845226 833578 823376 814825 808152 803536 801212 801301 803377 806327
62480 806327 808820 809854 808934 805921 800903 794094 785637 775336 762555 746527 726999 704622 680575
62467 680575 655771 630686 605985 582829 562135 543757 526872 511130 496967 484848 474672
62456 474672 466058 458741 452475 446924 441984 437940 434971 432715 430660 428863 427867 427858 428245 428257 427762 427302
62440 427302 427376 427960 428747 429608 430569 431490 432104 432390 432543 432463 431658 429958 427980 426471 425411 424235 422806
62423 422806 421606 420985 420813 420990 421722 422949 423992 424178 423591 422840 422307 421940 421613 421302 420969 420551 420080 419603
62405 419603 419025 418214 417252 416518 416608 418121 421261 425484 429796 433653 437417 441709 446550 451492 456419 461794
62389 461794 468084 475226 482757 490215 497394 504416 511664 519465 527777 536258 544624 552843 561016 569288
62375 569288 577884 587104 597206 608265 620058 632072 643903 655940 669502 685957 705700 728279
62363 728279 753382 781368 812790 847890 886669 929035 974546 1022270 1071211 1120649 1169713
62352 1169713 1216825 1259901 1297142 1327420 1350136 1365139 1372819 1373879 1368834 1357926 1341592 1320711
62340 1320711 1296169 1268311 1236974 1201989 1163679 1123156 1082223 1042709 1005526 970435 936874
62329 936874 904834 874773 846940 821176 797286 775132 754270 733896 713435 693059 673501
62318 673501 655505 639436 625159 612102 599647 587652 576465 566362 557223 548945 541920 536769
62306 536769 533632 531965 530980 530095 529066 528063 527666 528512 530705 533587 536178 537858 538704 539287 540191 541625
62290 541625 543430 545412 547599 550187 553291 556741 560012 562380 563466 563737 564206 565425 566914 567816 568003
62275 568003 568321 569851 573173 578253 584808 592674 602001 613099 626160 641252 658660 678985 702768
62262 702768 730229 761437 796408 834824 876104 920185 967796 1019288 1073294 1127105 1178289
62251 1178289 1225380 1267129 1301932 1328289 1345390 1353071 1351703 1342298 1326163 1304111 1276299 1242925
62239 1242925 1204566 1161759 1115014 1065731 1016426 969280 924748 882189 841614 804100 770550
62228 770550 740774 713976 689671 667860 648650 631974 617555 604955 593715 583537 574337 566160
62216 566160 559039 552867 547346 542180 537377 533210 529796 526839 523898 520797 517734 515191 513764 513773 514900
62201 514900 516486 518374 521157 525381 530862 537152 544297 552595 561777 571122 580411 590245 601228 613238
62187 613238 625740 638430 651272 664155 676795 688912 700189 710124 718149 723978 727815 730244
62175 730244 732031 734060 737336 742881 751503 763653 779563 799508 823830 852601 885271 920658
62163 920658 957262 993593 1028286 1060039 1087538 1109564 1125303 1134592 1137853 1135792 1129135 1118430
62151 1118430 1103881 1085370 1062789 1036356 1006598 974222 940282 906286 873736 843460 815637
62140 815637 790456 768375 749659 734092 721356 711393 704250 699916 698551 700497 705744 713630 723437
62127 723437 735159 749405 766629 786723 809225 833670 859734 887213 915813 944909 973667
62116 973667 1001449 1027928 1052701 1075066 1094173 1108962 1117815 1118971 1111949 1098414 1081224 1062724
62104 1062724 1044200 1026441 1010014 994917 980581 966395 952048 937545 923425 911026 901983
62093 901983 897175 896292 898484 903183 910291 919860 931697 945145 959254 973368 987550 1002364 1018401
62080 1018401 1036118 1055721 1076771 1098221 1119504 1141498 1165707 1192339 1219768 1246105 1270853
62069 1270853 1294714 1318282 1341372 1363416 1384047 1403247 1421064 1437201 1450880 1461222 1467735
62058 1467735 1470279 1468689 1462867 1453305 1441120 1427320 1412259 1395931 1378471 1360069 1340603 1319662
62046 1319662 1296850 1271905 1244705 1215419 1184536 1152482 1119233 1084579 1048798 1012836 977694
62035 977694 943802 911202 880204 851538 825712 802500 781363 762291 745758 731836 719798
62024 719798 708837 698775 689648 680922 671642 661272 649975 638130 626044 614134 602930 592787
62012 592787 583939 576822 571931 569244 568198 568487 570512 574796 581229 589141 597914 607276 617094 627055
61998 627055 636465 644387 650155 653838 655923 656434 654699 650206 643388 635125 625692 614678 602048 588799
61984 588799 576202 564545 553070 541270 529890 520251 512716 506363 500302 494801 490742 488317 486824
61971 486824 485546 484347 483409 482945 483244 484562 486769 489416 492251 495333 498600 501737 504666 507817 511669
61956 511669 516303 521655 527988 535844 545649 557453 570887 585339 600461 616730 635283 657010
61944 657010 681980 709858 740544 774123 810410 848910 889228 931264 974974 1019996 1065535
61933 1065535 1110523 1153874 1194588 1231696 1264440 1292696 1316900 1337123 1352373 1361337 1363756 1360506
61921 1360506 1352390 1339666 1323106 1304774 1287070 1271387 1258252 1248460 1243299 1243639 1249376 1259996
61909 1259996 1275282 1295199 1319179 1345695 1372609 1397973 1420421 1438687 1450898 1454860 1449329 1434787
61897 1434787 1412839 1385019 1352305 1315394 1275105 1232620 1189463 1147068 1106166 1066860 1029390
61886 1029390 994338 961917 931561 902752 875787 851190 828689 807500 787434 769009 752525
61875 752525 737748 724575 713316 704165 696987 691860 689258 689410 691990 696771 704082 714216 726814
61862 726814 741372 758100 777829 801265 828785 860692 897125 937839 982680 1032241 1087382
61851 1087382 1147920 1212349 1279107 1347608 1417598 1487937 1556573 1621468 1681000 1733580 1777540
61840 1777540 1811554 1834794 1846639 1846862 1836466 1817978 1794569 1769037 1743841 1721645 1705143 1696236
61828 1696236 1695595 1702886 1717091 1736650 1759711 1784313 1808168 1828361 1841703 1845569 1838343 1819282
61816 1819282 1788403 1746550 1695168 1635823 1570157 1500329 1429040 1358724 1290839 1226059 1164971
61805 1164971 1108368 1057000 1011197 970703 934823 902875 874574 849854 828402 809610 793079
61794 793079 778850 766972 757000 748143 739803 731877 724614 718249 712713 707671 702867 698287 693776 688739
61780 688739 682615 675579 668362 661356 654370 647296 640455 634050 627868 621904 616849 613424 611507 610305
61766 610305 609216 608060 606712 605076 603498 602703 603071 604164 605205 605966 607109 609490 613081 616701 618983
61751 618983 619537 618944 617823 616456 615285 615008 615754 616671 616930 616880 617699 620014 623355 626823 629831 632159
61735 632159 633801 635046 636495 638777 642135 646268 650587 654782 659109 663935 669091 674051 678793 683943
61721 683943 689865 696119 702152 708013 713892 719406 723985 727725 731216 734613 737424 739125 739489 738460
61707 738460 736347 734110 732741 732226 731639 730433 729100 728309 727888 727069 725382 722965 720183 717299 714460
61692 714460 711793 709489 707788 706742 705932 704607 702195 698562 693755 687775 680778 673298 665998 659173
61678 659173 652682 646380 640525 635609 631828 628810 625999 623242 620826 618970 617508 616104 614522 612561
61664 612561 610017 607016 604214 602398 601826 602110 602688 603336 604319 606112 608856 612087 615156 617936 620830
61649 620830 624139 627868 632184 637479 643642 649804 655274 660300 665353 670060 673468 675120 675152 673467 669559
61634 669559 663329 655528 647235 639207 631754 624838 618213 611810 606035 601427 598027 595363 592992 590861
61620 590861 589273 588743 589663 591726 593901 595332 595993 596021 594829 591642 586672 580940 574969 568452 561212
61605 561212 553691 546333 539246 532604 526632 521011 515130 509167 504114 500279 496672 492421 487973 484126
61591 484126 480478 475822 469834 463537 458134 453971 450533 446956 442601 437583 432712 428528 424560 419950
61577 419950 414693 409770 406109 403829 402439 401274 399681 397295 394365 391564 389241 387066 384551 381780
61563 381780 379466 378294 378269 378662 378618 377908 377078 376866 377495 378550 379401 379686 379476 379059 378561 377800 376635 375389
61545 375389 374691 374791 375298 375754 376278 377434 379562 382459 385649 388759 391615 394186 396560 398947 401572
61530 401572 404365 406714 407725 406897 404510 401262 397668 393942 390166 386214 381731 376718 372083 369015
61516 369015 367668 366969 365948 364775 364199 364396 364782 364708 363987 362931 362212 362463 363692 365171 366113 366293 365854
61499 365854 364797 363076 361045 359392 358583 358549 358816 358775 358019 356739 355670 355364 355588 355733 355686 355926 356784 358030
61481 358030 359299 360522 361708 362660 363240 363754 364663 365906 366840 367028 366816 366860 367230 367405 367129 366811 366876 367156
61463 367156 367280 367333 367582 367783 367435 366734 366594 367481 368825 369893 370711 371624 372389 372410 371759 371310 371706 372596 373176
61444 373176 373255 373553 374977 377748 381303 384978 388669 392777 397650 403247 409270 415341 421060 426170 430753
61429 430753 435056 439105 442720 445917 449009 452206 455489 458967 462936 467339 471556 475065 478042 480910
61415 480910 483478 484930 484653 482738 479713 476016 471772 466931 461570 456046 450727 445565 440210 434668
61401 434668 429473 424973 420778 416308 411649 407421 403958 401123 398921 397697 397530 397817 397776 397164 396256 395322
61385 395322 394468 393973 394388 396030 398465 400741 402222 403036 403676 404343 404927 405475 406344 407840 409912 412297
61369 412297 414743 417045 419065 420878 422839 425428 429048 433842 439533 445525 451443 457538 464277 471535
61355 471535 478677 485569 493101 502459 514175 528081 543809 560850 578357 595453 611853 627907
61343 627907 643895 659407 673503 685390 694887 702195 707364 710134 710378 708456 704867 699698 692739
61330 692739 684061 674137 663451 652386 641495 631423 622432 614377 607254 601367 596840 593382 590671
61317 590671 588511 586484 583933 580626 577005 573595 570648 568612 568250 569794 572517 575742 579830 585527
61303 585527 592748 600802 609452 618789 628076 635661 640363 642276 641933 639307 634108 626710 618225 609713
61289 609713 601636 594089 587327 581906 578326 576604 576350 577240 579261 582432 586484 591007 595816 601046 606991
61274 606991 613917 621850 630442 639285 648451 658499 669755 681876 694304 706883 719740 732930
61262 732930 746614 761419 778192 797409 819029 842693 867689 892859 916895 938693 957192
61251 957192 971104 979258 981218 977313 968237 955004 939101 922057 904626 886686 868055 849190
61239 849190 831014 814352 799635 786953 776208 767277 760070 754388 749770 745622 741562 737703 734647
61226 734647 733110 733299 734599 736087 737373 738706 740269 741809 743075 744114 744870 744965 744273 743333 742751 742462
61210 742462 742077 741671 741705 742345 743433 745016 747429 750850 755344 761426 770078 781949 796777 813815 832669
61195 832669 853627 877195 903407 931601 960875 990625 1020369 1049131 1075485 1098445 1118010
61184 1118010 1134683 1148851 1160809 1170914 1179287 1185730 1190252 1193280 1194977 1194802 1192240 1187560 1181248
61171 1181248 1173031 1162171 1148568 1132855 1115456 1096134 1074552 1050756 1025128 998357 971561
61160 971561 945982 922361 900788 881095 863203 847217 833517 822658 814901 809940 807233 806407
61148 806407 807112 808870 811371 814558 818033 820796 822002 821596 819772 816348 811379 805935 801361 798023 795605
61133 795605 794516 796039 800976 808912 819024 831022 845200 862052 881918 904552 929041 954588
61121 954588 981287 1009648 1039574 1070395 1101746 1133683 1165983 1198036 1229471 1260225 1289962
61110 1289962 1318036 1344027 1367708 1388492 1405607 1418910 1428906 1435930 1439889 1440795 1438788 1433469 1423841
61097 1423841 1409159 1389410 1365017 1336635 1305245 1271787 1236699 1200406 1164160 1129576 1097263
61086 1097263 1066680 1037488 1010212 985367 962737 941875 922657 905004 888635 873476 859852
61075 859852 848044 838035 829824 823466 818647 814772 811626 809504 808645 809045 810876 814438 819518 825429
61061 825429 831886 839364 848398 859004 870877 883717 897247 911369 926411 942844 960840 980407
61049 980407 1001739 1024985 1049922 1076331 1104289 1133539 1163170 1192770 1223281 1255665 1289291
61038 1289291 1322907 1356730 1392048 1428923 1465892 1501976 1537581 1573343 1609605 1647186 1687212
61027 1687212 1729893 1774678 1821649 1871254 1922707 1974404 2026203 2079702 2136141 2196020 2261156
61016 2261156 2335145 2421136 2520862 2636108 2769021 2920753 3092545 3289252 3519689 3793102
61006 3793102 4118153 4505878 4969841 5522258 6174837 6946627 7867544 8972620 10299532
60997 10299532 11895224 13810875 16067190 18613626 21324042 24028845 26538969 28644562
60989 28644562 30136418 30892652 30980276 30661815 30269498 30041571 30046798 30217579 30406724 30405584
60979 30405584 29961132 28854921 27018881 24587220 21830381 19029333 16388462 14021468
60971 14021468 11974064 10245581 8806119 7615269 6635163 5831687 5172143 4627935 4177824
60962 4177824 3805325 3494442 3230263 3001886 2802018 2624648 2465108 2321253 2192336
60953 2192336 2076998 1973492 1880843 1798272 1724088 1656365 1593902 1535442 1478848 1422334 1365811
60942 1365811 1309972 1254887 1200646 1148453 1099700 1054462 1012095 972706 936821 904075 873511
60931 873511 844876 818527 794344 771835 751135 732902 717250 703527 691025 679258 667843
60920 667843 656816 646840 638433 631234 624645 618829 614386 611369 609394 608456 608830 610284 612124 613928
60906 613928 615633 616988 617533 617103 615910 614185 612119 610001 608052 606296 604866 604092 603892 603409 601750
60891 601750 598869 595438 592151 589440 587442 585773 583723 581102 578460 576127 573645 570670 567763 565455
60877 565455 563045 559304 554100 548388 542753 536957 530950 525387 520888 517425 514702 512530 510658 508715
60863 508715 506625 504793 503794 504149 506328 510426 515715 520954 525394 529223 532942 536635 540068 543258 546758
60848 546758 551392 557699 565498 573888 581749 588301 593288 596842 599282 600837 601357 600470 598206 595385 593145
60833 593145 592069 591890 591916 591676 591212 590868 590789 590692 590267 589700 589440 589481 589278 588466 587261 585974 584451 582215
60815 582215 578801 573858 567326 559761 552085 544739 537412 529814 522245 515050 508049 501008 494336 488685
60801 488685 484016 479639 475150 470888 467467 465175 463883 463242 462890 462570 462081 461202 459932 458777 458380 458681
60785 458681 458849 458313 457479 457106 457355 457894 458658 460012 462273 465499 469646 474628 480217 486129 492157 498112
60769 498112 503891 509788 516499 524493 533509 542864 552081 561044 569782 578322 586552 594101 600597 606166
60755 606166 611285 615996 619738 622243 624129 626172 628398 630252 631338 631523 630747 629243 627652 626318 624671
60740 624671 621818 617555 612292 606185 598981 590686 581865 573166 564910 557147 549889 543317 537892 534027
60726 534027 531384 528865 525710 522347 519765 518396 518125 519041 521395 524885 528719 532436 536193 540210 544495
60711 544495 549237 554904 561749 569573 578145 587519 597825 608975 620716 632755 644896 657266 670368
60698 670368 684538 699322 713675 726853 739010 750971 763615 777340 791849 806500 821006
60687 821006 835656 850670 865659 880050 893831 907526 921662 936632 952711 969590 986027
60676 986027 1000640 1013010 1023465 1031842 1037186 1038833 1037088 1032512 1025114 1014689 1001581 986599 970300
60663 970300 952662 933442 912660 890829 868849 847622 827598 808632 790301 772374 755090
60652 755090 739084 724947 712741 701984 692148 682994 674405 666178 658218 650651 643437 636142 628494
60639 628494 620970 614382 608985 604418 600451 597246 594844 592896 591180 590042 590054 591394 593782 596877 600518
60624 600518 604512 608318 611180 612805 613831 615243 617143 618407 617784 615056 610854 605695 599729 593262
60610 593262 586905 581007 575224 568821 561270 552591 543312 534139 525545 517644 510416 503864 497933 492538
60596 492538 487753 483721 480325 477340 474958 473621 473116 472518 471401 470494 470543 471135 471428 471507 472043 472852 472879
60579 472879 471684 470091 469130 469008 469311 469601 469614 469427 469691 471336 474864 480192 487096 495351 504476 513896
60563 513896 523453 533319 543430 553470 563345 573027 581860 588673 592800 594471 593986 591138 585835 578924
60549 578924 571967 566317 562504 560306 559311 559548 561549 565635 571386 578181 585963 594950 604799 614776 624666
60534 624666 634755 644787 653584 659917 663213 663375 660614 655684 649674 643275 636748 630619 625764 622580
60520 622580 620759 620077 620712 622486 624581 626408 628136 630004 631838 633783 636796 641708 648198 655269 662272
60505 662272 668974 675173 681013 687434 695619 706120 718964 734298 752435 773566 798010 826483
60493 826483 859503 896565 936288 977087 1017192 1054269 1085647 1108953 1122261 1124057 1113772 1092234
60481 1092234 1061080 1021867 976404 927658 879310 834028 792632 755097 721685 692755 667922
60470 667922 646111 626445 608812 593526 580631 569657 560012 551362 543428 535630 527485 519510 513091
60457 513091 508956 506149 503023 499030 494944 491533 488742 486208 483882 481827 479888 477864 475748 473593
60443 473593 471382 469203 467288 465746 464478 463418 462576 461715 460342 458276 455956 453932 452246 450573 448773
60428 448773 447029 445526 444322 443472 442994 442761 442666 442913 443860 445494 447333 448997 450599 452447 454613 457078
60412 457078 459976 463240 466116 467626 467646 467040 466509 465795 464379 462532 461089 460445 460398 460851 461946 463439
60396 463439 464626 465171 465480 465978 466572 467182 468268 470204 472480 474197 475234 476275 477674 478991 479821 480479
60380 480479 481480 482764 483963 485179 486936 489300 491561 493015 493769 494530 495775 497412 499155 500873 502498
60365 502498 503863 504763 505116 504991 504648 504577 505242 506600 508015 508858 509171 509572 510585 512229 514270 516718 519894
60348 519894 523990 528619 533049 537048 541309 546710 553192 559770 565605 570612 574912 578323 580725 582406
60334 582406 583535 583650 582134 578891 574149 568037 561003 554286 549120 545561 542736 540186 538284 537339 537081
60319 537081 537146 537494 538130 538989 540237 542222 545010 548379 552302 556904 562042 567620 574340 583349 594910
60304 594910 608150 622314 637507 653938 671345 689584 708839 728410 745977 758929 766077 767523
60292 767523 763510 754406 741488 726682 711395 696239 681772 668745 657499 647770 639226 631683
60280 631683 624757 617913 611056 604520 598225 591359 583341 574804 567110 560976 555985 551433 547261 543896
60266 543896 541460 539587 537997 536828 536200 535838 535492 535450 536142 537391 538609 539641 540792 541968 542491 542038
60250 542038 541159 540525 540113 539575 538947 538523 538372 538451 538952 540097 541724 543452 545086 546582 547828 548860 550121
60233 550121 552094 554672 557191 559054 560117 560603 560868 561258 562001 563252 565153 567600 569989 571639 572579
60218 572579 573513 574821 576107 577063 578267 580569 584002 587769 591161 594069 596723 599337 601929 604260 606070
60203 606070 607534 609182 611127 612706 613213 612642 611394 609602 607232 604540 601979 599794 598060 596849 595971
60188 595971 594856 593172 591386 590223 589809 589773 589996 590702 591850 592955 593484 593228 592383 591539 591312 591675 591944
60171 591944 591721 591498 591897 592800 593775 594904 596442 598038 599173 600146 601764 604133 606651 609108 611870 614869
60155 614869 617455 619517 621821 624750 627508 629198 630059 631012 632463 634198 636104 638317 640854 643669 647034
60140 647034 651306 656367 661807 667755 675021 684135 694545 705040 714716 723204 730123 734794 736639 735515
60126 735515 731507 724782 715980 706444 697523 689726 682940 677216 672702 668896 664802 660066 655295 651033
60112 651033 647102 643268 639800 636887 634202 631552 629299 627515 625415 622422 619242 616987 615725 614842
60098 614842 614442 615251 617330 619931 622646 625736 629335 633285 637867 643796 651241 659627 668556 678145 688331
60083 688331 698656 708927 719237 729033 736935 741951 744206 744174 741859 737143 730309 721771 711829 701137
60069 701137 690890 681986 674286 667018 659573 651701 643437 635281 628031 621966 616433 610591 604323 598171
60055 598171 592678 588121 584563 581752 579152 576386 573647 571545 570632 570982 571984 572680 572716 572867 574080 576103
60039 576103 577718 578386 578765 579346 579530 578655 577164 575866 574519 572042 568001 563127 558360 553954 549574
60024 549574 544719 538936 532011 524176 515997 508000 500496 493697 487798 482913 479036 476100 474001 472599
60010 472599 471666 470838 469812 468770 468400 469080 470134 470439 469864 469587 470728 473097 475582 477444 478833 480284
59994 480284 482134 484452 487251 490634 494720 499419 504323 508925 512831 515716 517331 517838 517851 517738 517148
59979 517148 515715 513924 512548 511429 509703 507267 505121 504011 503640 503538 503854 504735 505705 506349 507019 508207
59963 508207 509671 510847 511705 512531 513268 513759 514330 515362 516455 516750 516062 515084 514455 514178 513970 513688 513261
59946 513261 512593 511602 510134 507918 504938 501790 499270 497503 495796 493394 490186 486639 483305 480500 478313
59931 478313 476759 475896 475733 476115 476876 478108 480043 482569 485106 487109 488524 489675 490900 492390 494200
59916 494200 496269 498541 501045 503681 506091 508110 510226 513097 516625 520084 523182 526310 529556 532285
59902 532285 534093 535543 537429 539794 542170 544277 545971 547035 547650 548675 550780 553613 556435 559293
59888 559293 562893 567524 572770 578217 583828 589671 595772 602188 608776 614956 620145 624265 627483 629620
59874 629620 630297 629446 627213 623567 618652 613288 608469 604364 600406 596293 592296 588603 585104 581975 579759
59859 579759 578550 577642 576417 575187 574784 575512 576868 578248 579799 582522 587502 594989 604336 614877 626485
59844 626485 639009 651577 662998 672722 680820 687153 691206 692892 692999 692701 692993 694606 697836 702050
59830 702050 705642 706781 704213 697567 687388 674946 661506 647509 632752 617453 602666 589412
59818 589412 577803 567335 557690 548932 541192 534625 529466 525732 522901 520294 517773 515755 514485 513616
59804 513616 512665 511595 510695 509958 508971 507490 505890 504737 504027 503139 501601 499627 497761 496237 494922 493721
59788 493721 492709 491882 491049 490075 489073 488266 487712 487266 486810 486478 486600 487391 488732 490360 492173 494227 496467
59771 496467 498690 500820 503033 505542 508377 511297 513796 515258 515516 515319 515890 517839 520693 523560 525973
59756 525973 528004 529908 531925 534227 536842 539681 542652 545563 548152 550607 553890 558815 564671 569532
59742 569532 572242 573451 574309 574896 574617 573561 572561 572107 571925 571611 571093 570487 569928 569524 569163 568514 567486
59725 567486 566438 565642 564871 563865 562844 562139 561737 561675 562409 564143 566178 567655 568592 569424 569930 569597 568899
59708 568899 569132 570855 573426 576145 578973 581887 584475 586531 588289 589685 590160 589694 589323 590038 591598
59693 591598 592953 593397 592789 591099 588471 585591 583419 582441 582477 583134 584152 585313 586256 586452 585406 583054
59677 583054 580005 577156 574885 572729 569919 566093 561466 556590 552000 547862 543848 539576 535241 531584
59663 531584 529151 527751 526728 525586 524360 523606 523980 525514 527308 528342 528668 529411 531449 534487 537673
59648 537673 540658 543615 546412 548314 548666 547579 545791 543895 541953 539922 538268 537784 538674 540164 541311
59633 541311 541953 542552 543335 544091 544752 545619 546924 548594 550586 552998 555609 557684 558610 558619 558592 559101 559759 559509
59615 559509 557575 554216 550568 547733 546087 545447 545624 546564 548143 550163 552506 555059 557572 559789 561590
59600 561590 562788 563060 562442 561675 561576 562104 562491 562301 561956 562209 563379 565145 566716 567213 566223 564077 561483
59583 561483 558942 556672 554766 553007 550791 547736 544220 540831 537506 533786 529779 526114 523013 520128
59569 520128 517355 515061 513293 511566 509763 508603 508693 509643 510631 511508 512867 515221 518511 522251 525844
59554 525844 528841 531160 533076 534957 537071 539576 542475 545651 549174 553481 558958 565502 572982 581994
59540 581994 593563 607996 624572 642407 660914 679086 694996 706565 712728 713722 710734 705734
59528 705734 701283 699776 702463 709061 718161 728123 737897 747146 755587 762435 766772 768256 767026 763097
59514 763097 756371 747198 736328 724231 711015 697035 683082 669877 657853 647401 638671 631127
59502 631127 624024 617433 612098 608140 604792 601659 599333 598253 597805 597246 596858 597381 598745 600153 601183
59487 601183 602150 603474 605222 607273 609622 612581 616816 622952 631014 640555 651336 663335 675918 687728
59473 687728 697790 706111 712755 717008 718160 716667 713775 710302 706511 703025 701124 702083 706614 714862
59459 714862 726525 740936 757348 775142 793733 812649 831961 852258 873832 896124 918150
59448 918150 939019 957693 972779 983079 987915 986499 977682 961216 938973 914054 888764 864050
59436 864050 840576 819267 800602 784198 769432 756079 744260 734315 726904 722717 721791 723468 727230
59423 727230 733347 742561 755343 771453 789995 809923 830813 853036 876818 901227 924570 945677
59411 945677 963928 977794 984176 980192 965607 943169 916836 890136 865930 846536 833227 825735
59399 825735 822591 821752 820608 815888 804627 785836 761024 732970 704299 677110 653026 632772
59387 632772 615998 602168 591404 583930 579029 575346 572232 570072 569291 569742 571033 572673 573796 573588
59373 573588 572365 571521 572060 573718 575778 577998 580297 582226 583464 584457 586077 588889 593081 598666 605392
59358 605392 612899 621336 631439 643558 657091 671358 686674 704051 724123 746711 771126 796471
59346 796471 821978 847423 872933 898098 921702 942599 960339 974500 984044 987927 985950 978480
59334 978480 965820 948504 927773 904986 880746 855187 828857 802697 777458 753720 732227
59323 732227 713418 696820 681688 668173 657180 649010 642781 637305 631992 626788 621775 617153 613356
59310 613356 610902 610068 610628 611914 613400 615286 618243 622530 627806 633931 641392 650660 661763 674912
59296 674912 690846 709831 730778 752024 772554 791605 807408 817316 819378 813396 800686 783538
59284 783538 764818 747287 732856 722502 716624 715052 716984 721531 728390 737695 749378 763031 778254
59271 778254 794733 812064 829708 846904 862539 875528 885541 892797 896872 896496 891084 881756 870099
59258 870099 856556 840845 823352 805037 786391 767610 749609 733749 720466 709029 698774
59247 698774 689862 682825 678016 675544 675176 676351 678802 682989 689389 697694 707333 718264 730299 741977
59233 741977 751262 757371 761002 762802 762607 760164 755505 748359 738204 725339 711122 696760 682425
59220 682425 667880 653373 639543 626910 615775 606359 598822 593211 589190 585688 581324 575787 570417
59207 570417 566737 564744 563339 562018 561142 560853 560807 560987 561721 562825 563601 563800 563797 563881 564220 565428 568124 571879
59189 571879 575607 579094 583100 587861 592646 597099 601900 607636 613981 620427 627075 634286 642308 651416
59175 651416 661621 672063 681716 690937 701263 713346 726191 738903 751974 766077 780661 794615
59163 794615 807461 818943 828199 834397 837721 838805 837561 833361 826121 816462 805060 792465 779350
59150 779350 766263 753197 739869 726347 713073 700426 688640 677972 668655 660675 653708 647227
59138 647227 640783 634493 629163 625498 623251 621639 620490 620347 621517 623774 627086 631775 637770 644491
59124 644491 651762 660031 669424 679417 689891 701732 715759 731699 748771 766752 785900 806217
59112 806217 827257 848362 868808 888080 906214 923464 939507 953509 965064 974473 981999 987602
59100 987602 991464 993898 994451 992108 986835 980115 973481 967302 961429 956032 951129 946168 940818 935462
59086 935462 930181 923975 915743 905454 893625 880317 865581 850315 835696 821982 808640 795375
59074 795375 782356 769793 757995 747536 738622 730495 722184 713697 705890 699279 693556 688184 682991
59061 682991 678155 673983 670673 668103 665933 663941 662040 659970 657485 654843 652576 650669 648592 646242
59047 646242 644067 642128 639957 637721 636540 637085 638680 640352 641973 643770 645665 647935 651736 657921
59033 657921 665814 673988 681873 689987 699105 709974 723234 738763 755507 772682 790689 810093
59021 810093 830234 849675 867541 883532 897042 907242 913855 917080 917086 914329 910025 905466 901077
59008 901077 896891 893591 892224 893158 896164 901304 908818 918193 928250 938200 947948 957315 965632 972221
58994 972221 976777 979240 979651 978118 974607 968910 960998 951115 939338 925569 910260 894596 879486
58981 879486 864969 851083 838665 828672 821298 816408 814163 814397 815997 817867 820187 823909 829401 836315
58967 836315 844313 853098 862259 871977 883417 897348 912627 926989 939041 948594 955445 958928 958521
58954 958521 953947 944837 931263 914485 896338 878008 860102 843502 829088 816855 806382 798021
58942 798021 792633 790273 790135 791551 793908 795739 795233 791835 786268 778858 769041 756794 743476 730736
58928 730736 719347 709362 700549 692344 684166 676193 669243 663678 659075 655130 652234 650949 651568 654304
58914 654304 659086 664992 670645 675610 680837 687388 695298 703962 713100 722993 734142 746957 761405
58901 761405 776781 792179 807356 822841 839111 856023 873127 890249 907723 926349 947074
58890 947074 970476 996568 1025192 1056155 1088542 1120324 1149234 1173919 1193786 1208150 1216246 1217924
58878 1217924 1213638 1203763 1188467 1168116 1143342 1114836 1083511 1050595 1017162 983940 952016 923117
58866 923117 898405 877426 858977 842579 828279 815568 803619 792238 781476 770569 758444
58855 758444 745206 732030 719603 707764 696683 687138 679354 672582 666172 660231 654942 650005 645033
58842 645033 639848 634268 628226 622165 616669 611695 606864 602466 599335 597645 596662 595772 595030 594561 594221
58827 594221 594029 594314 595202 596462 597915 599526 601155 602695 604375 606432 608710 611047 613602 616212 617972
58812 617972 618334 618144 618524 619174 618910 617526 615857 614210 612090 609498 607164 605349 603499 601298 599073
58797 599073 597085 595355 594222 594098 594675 595305 596107 597740 600290 603398 607212 612026 617264 622203 627438
58782 627438 634062 641530 647984 652779 657039 661538 665788 669521 673325 677135 679650 679961 678464 675692
58768 675692 671690 667032 662941 659675 656245 652377 649337 648012 647677 647583 648328 650580 653678 656675 659720
58753 659720 663292 666979 670083 672709 675366 678251 681711 686488 692619 698924 704511 710083 716928 725300
58739 725300 734577 744289 754228 764197 774453 785805 798653 812481 826706 841243 855755 869253
58727 869253 881059 891269 899684 905320 907782 908260 908404 908939 910024 912032 915095 918652 922198 925794
58713 925794 929190 931330 931489 930115 927762 923952 917927 909770 899924 888254 874371 858402 840701
58700 840701 821393 800759 779507 758157 736875 716364 698103 683044 670782 660483 651814 644531
58688 644531 638104 632346 627537 623442 619224 614829 611299 609038 607019 604471 602097 600694 599855 599184 599646
58673 599646 602289 606564 611280 616580 623673 633105 644505 657610 672433 688613 705386 721899 736990
58660 736990 749110 757118 760742 760065 755380 747907 739474 730837 721326 710809 700750 692508 685813 679964
58646 679964 675353 672587 671139 670154 669813 670676 672448 674440 676576 678889 680815 681918 682511 682624 681303
58631 681303 677956 673449 668807 663906 658694 654573 653114 654198 656836 661002 667281 675440 684915 696160
58617 696160 710099 726652 745019 764874 786022 807370 827365 844998 859396 869226 873729 873792
58605 873792 870917 865821 858984 851575 844456 837035 828473 819340 810802 802952 795301 788177 782303 777676
58591 777676 774261 772980 774645 778684 784319 792156 802976 815781 828708 841222 853755 865851 876442
58578 876442 885413 893197 899331 903083 905043 906486 907677 908476 910027 914022 920702 929361 940369 954887
58564 954887 972881 993207 1015267 1038783 1062338 1084117 1103862 1122153 1137996 1149216 1155315 1157979
58552 1157979 1158557 1156838 1152455 1145710 1136748 1125600 1113289 1101305 1089730 1077327 1063684 1049762
58540 1049762 1036204 1022578 1008575 994589 980904 967528 954882 943456 932843 922389 912631
58529 912631 904752 898777 893805 889853 887922 888312 890374 893909 899307 906302 914048 922373 931531 940832
58515 940832 949078 956284 963485 970949 978149 985383 993688 1003126 1012807 1022621 1033299 1044597 1054940
58502 1054940 1063036 1068381 1070212 1067545 1060467 1050083 1037211 1022369 1006745 991595 976850 961864
58490 961864 947263 934374 923154 912639 903333 897145 894847 895376 897765 901952 907637 914146 921597
58477 921597 930496 940039 948367 954485 958306 959086 955815 949134 940908 931865 921507 910215 899286 888833
58463 888833 877864 866672 857060 849967 844877 841764 841428 843611 846909 850953 856592 863561 870003 874719
58449 874719 877907 879413 878454 875604 872884 871292 870076 868865 868553 869636 871632 874558 879068 884825 890668
58434 890668 896612 903608 911240 917932 923692 930263 938270 946680 955427 965920 978263 990514 1001491
58421 1001491 1011936 1022220 1031286 1038583 1044724 1049569 1052080 1052679 1053159 1053545 1051711 1046991 1041439 1036607
58407 1036607 1031889 1027163 1024176 1023718 1023962 1023255 1022338 1022286 1022443 1021893 1020939 1019775 1017539 1013928 1009888 1005770
58391 1005770 1000737 994801 989178 983820 977057 968695 960930 955138 950371 946193 944210 945250 947600 949719
58377 949719 952397 956690 962007 967742 974616 982953 991774 1000872 1011524 1023949 1036477 1048436 1061331
58364 1061331 1075810 1090057 1102609 1114185 1125315 1134848 1142341 1149239 1156140 1161518 1164672 1167165 1169780
58351 1169780 1170996 1170242 1169743 1171228 1173708 1176472 1181359 1189854 1200647 1212240 1225337 1240551 1256465
58338 1256465 1272268 1289695 1310054 1331697 1352487 1372321 1391276 1407894 1421438 1433297 1444262
58327 1444262 1453015 1459091 1464395 1469933 1474115 1476308 1478889 1483688 1489647 1496150 1505093 1517161 1529619
58314 1529619 1540536 1551948 1566117 1582003 1598184 1615808 1635668 1655742 1674716 1694718 1717539
58303 1717539 1741376 1764273 1787374 1811729 1835385 1856850 1878007 1900396 1922157 1941893 1961906
58292 1961906 1984197 2006971 2028543 2050908 2075836 2101372 2125933 2151896 2181156 2211207 2239733
58281 2239733 2269057 2301803 2336207 2370132 2405665 2445087 2486359 2527285 2570137 2617319 2666459
58270 2666459 2714724 2764007 2817027 2872447 2928721 2988383 3053346 3120452 3186914 3255424 3328413
58259 3328413 3402188 3472739 3542429 3614815 3687828 3758558 3829853 3905502 3983882 4063097 4147139
58248 4147139 4239848 4338057 4438100 4543561 4658862 4780971 4905720 5036540 5178258 5327991
58238 5327991 5481357 5641939 5815084 5998162 6186911 6385615 6600635 6829634 7067852
58229 7067852 7319223 7590360 7879604 8183308 8506658 8856560 9230550 9625056 10047521
58220 10047521 10507517 11003680 11533284 12106554 12736655 13424417 14169180 14985824 15893849
58211 15893849 16899377 18007033 19240213 20630367 22197994 23967260 25989362 28329786
58203 28329786 31048027 34219071 37962752 42421985 47724116 53992228 61376712 70047440
58195 70047440 80193049 92089013 106152911 122889583 142816772 166470935 194306242
58188 194306242 226260116 261239100 297070766 330950515 359799688 380311471 389321065
58181 389321065 384987557 368037743 341763210 310578653 278354507 247659904 219850490
58174 219850490 195319716 173692300 154191378 136161620 119378725 103962619 90116105
58167 90116105 77957604 67482724 58577471 51058237 44727606 39403879 34916472 31108592
58159 31108592 27856863 25072200 22678115 20603797 18797085 17223616 15848915 14635216
58151 14635216 13555234 12592861 11729423 10943534 10224217 9569749 8973349 8423132 7915419
58142 7915419 7454311 7037890 6657290 6309139 5996359 5716520 5461134 5226646 5014735
58133 5014735 4821583 4637829 4459556 4288954 4124189 3959270 3794604 3637621 3491792
58124 3491792 3353995 3223103 3102023 2990539 2884793 2784714 2693876 2611530 2532654 2456203
58114 2456203 2385595 2320897 2258305 2197509 2141764 2090384 2038787 1986371 1936852 1890504 1843603
58103 1843603 1796014 1751736 1711160 1670196 1628067 1588727 1553397 1518721 1483701 1451708 1424009
58092 1424009 1397745 1371910 1349164 1330083 1311583 1292737 1276439 1263508 1250569 1235535 1220039
58081 1220039 1204750 1187328 1166793 1145278 1123886 1101252 1077574 1055580 1036103 1016944 997322
58070 997322 979266 963573 948568 933837 920996 909907 898417 886680 877385 870784 863925 855798
58058 855798 848783 843758 838143 830268 821553 812973 803317 792443 782467 774271 766341 758212 751494 746384
58044 746384 740761 733882 727452 722006 715833 708483 701752 696163 690131 683573 678634 675682 672320 667534
58030 667534 663045 659286 653929 645999 637807 631086 624642 617493 610995 606079 601499 596523 592417 589717
58016 589717 586931 583364 580313 578160 575368 571706 569271 568831 568381 566896 566332 568085 570640 572651 575354
58001 575354 579850 584781 588890 593348 599446 606281 612732 619437 626935 634004 639791 645580 652652 660209
57987 660209 666933 672733 677550 680494 681617 682507 683729 683675 681205 677350 673147 668108 662164 656842 652875
57972 652875 648717 642936 636111 629110 621678 614095 607940 603666 599565 594569 589867 586268 582398 577259
57958 577259 572263 568786 565753 561646 556987 552915 549108 544988 541330 538888 537082 535639 535756 537967
57944 537967 540703 542735 545251 549687 555301 560811 566782 574403 583479 593586 605651 620279 635790
57931 635790 649929 662386 673847 683881 691631 697436 701821 703843 702253 697390 690405 681582 670917
57918 670917 659271 647411 634899 621393 607995 595882 584711 573752 563418 554237 545508 536481
57906 536481 527774 520195 513352 506889 501790 498820 496791 493973 490233 486344 482389 478444 475634 474760
57892 474760 474846 474679 474787 476282 478758 481081 483276 485831 487957 488431 487634 487094 487396 487967 488388 488513 487830
57875 487830 486033 483803 481868 479875 477233 474308 471744 469458 467431 466591 467643 469820 472034 474466
57861 474466 477879 482200 487029 492728 499736 507466 514939 521870 528311 534177 539984 546821 554578 561413
57847 561413 566021 569124 571697 573233 573146 572251 571176 568750 563773 557158 550494 543697 536082 528591 522809
57832 522809 518597 514747 511317 509285 508460 507674 506652 505953 505581 505336 506001 508468 512179 516030 520241 525619
57816 525619 531564 536637 540681 544637 548604 551762 553867 555176 555243 553379 549958 545696 540092 532313 523308
57801 523308 515278 509109 503867 498609 493194 487517 481523 475947 471701 468538 465503 462424 459798 457590
57787 457590 455393 453327 451614 449831 447894 447107 448788 452393 456381 460234 464163 467745 470701 474262
57773 474262 479763 486361 492092 496606 500811 504318 505625 504719 503162 501450 498417 493614 488208 483054
57759 483054 477617 471304 464378 457203 449991 443484 438440 434375 430290 426633 424873 425081 425700 425909 426466
57744 426466 427846 429240 429888 429883 429249 427654 425505 423985 423569 423701 424151 425359 427208 428776 429559 429744 429235
57727 429235 427801 426252 425886 426583 426996 426842 427364 429244 431728 434293 437473 441368 444833 446940 448089
57712 448089 449078 450206 451711 453790 455758 456480 456238 456891 459624 463568 467164 469780 471630 473234 475394
57697 475394 478606 482126 484683 486253 487910 489867 491185 491696 492483 493954 495100 495438 496167 498489 502219
57682 502219 506991 513561 522851 534769 548955 565841 586153 610240 638728 673047 714638 764347
57670 764347 822947 891133 968114 1050725 1133998 1211390 1274203 1312732 1320037 1295051 1242409 1170395
57658 1170395 1088988 1007550 932202 865245 807187 758414 718623 686177 659264 637041 618992
57647 618992 604109 591526 581214 573259 567147 562391 559088 557232 556201 555537 555509 556352 557660 558981
57633 558981 560227 561093 561123 560839 561706 564303 567501 570135 572392 574740 576629 577359 577402 577807 578908 580488
57617 580488 582535 584919 586982 588400 589851 591950 594058 595177 595594 596624 598939 601960 604819 607311
57603 607311 609912 613220 617261 621237 624248 626341 628349 630710 633172 635681 638567 641551 643622 644453
57589 644453 645035 646370 648318 650276 652158 654092 655879 657432 659135 661217 663368 665354 667373 669449
57575 669449 671262 672972 675371 678768 682532 686141 689824 693735 697468 700881 704453 708240 711462 713732
57561 713732 715840 718765 722745 727754 733740 739901 744893 748512 752084 756491 760969 764621 767904 771760
57547 771760 776475 782340 790131 799736 809413 817677 824998 832488 840021 846929 853537 860470 867230 872954
57533 872954 877927 882958 887877 892088 896007 900484 905271 909519 913389 917800 922931 928380 934415 941545
57519 941545 949057 955497 960650 965747 971676 978162 984775 991549 998494 1005476 1012713 1020544 1028727 1036719
57505 1036719 1044476 1052121 1059182 1065192 1070795 1077130 1084230 1091143 1097492 1103754 1110044 1115925 1121634 1128320
57491 1128320 1136657 1146074 1155675 1165074 1174030 1182119 1189300 1196226 1203594 1211545 1219866 1228396 1237025 1245679
57477 1245679 1254424 1263361 1272466 1281710 1291155 1300670 1309867 1318717 1327942 1338327 1349861 1361919 1373976
57464 1373976 1385764 1397180 1408552 1420642 1433848 1447690 1461440 1474803 1487548 1499180 1509632
57453 1509632 1519801 1530683 1542360 1554375 1566551 1578880 1591220 1603737 1616964 1630762 1644051
57442 1644051 1656425 1669184 1683666 1699311 1714562 1729010 1743333 1757702 1771730 1785679 1800209
57431 1800209 1815081 1829433 1843298 1857587 1872617 1887842 1903051 1918587 1934365 1949851 1965136
57420 1965136 1980862 1996975 2012702 2027932 2043541 2060097 2077255 2094689 2112592 2130911 2149006
57409 2149006 2166486 2183733 2201337 2219552 2238379 2257585 2276677 2295443 2314361 2333753 2352941
57398 2352941 2371190 2389207 2408436 2428947 2449381 2469080 2488912 2509592 2530522 2550962 2571309
57387 2571309 2592457 2614645 2637593 2661120 2685042 2708929 2732529 2756114 2780097 2804581 2829457
57376 2829457 2854559 2879631 2904529 2929497 2954844 2980476 3006258 3032604 3060002 3088057 3115815
57365 3115815 3143039 3170326 3197963 3225534 3252861 3280521 3309139 3338757 3368991 3399213 3428537
57354 3428537 3456383 3483226 3510171 3537725 3565601 3593605 3621866 3650198 3678158 3705949 3734429
57343 3734429 3763994 3794234 3824868 3856192 3888324 3920816 3953395 3986441 4020372 4055115 4090464
57332 4090464 4126335 4162473 4198439 4234114 4269725 4305316 4340796 4376568 4413360 4451240 4489489
57321 4489489 4527631 4565945 4604706 4643673 4682631 4721854 4761652 4801896 4842314 4882843 4923548
57310 4923548 4964549 5006145 5048600 5091737 5135082 5178356 5221489 5264336 5306918 5349731 5393195
57299 5393195 5436969 5480455 5523706 5567096 5610340 5652770 5694545 5736657 5779692 5823352 5867112
57288 5867112 5910535 5953051 5994408 6035386 6077102 6119653 6162363 6205302 6249349 6294603 6339922
57277 6339922 6384441 6428524 6472825 6517323 6561723 6606016 6650257 6694449 6738838 6783576 6827998
57266 6827998 6871148 6913242 6955732 6999635 7044657 7090109 7135652 7180941 7225569 7269803 7314442
57255 7314442 7359493 7403855 7446631 7487877 7527687 7565537 7600979 7634165 7665284 7694389 7722192
57244 7722192 7750078 7778762 7807704 7836245 7864426 7892282 7919351 7945589 7971903 7999116 8027173
57233 8027173 8055934 8085819 8116842 8147776 8177224 8205132 8232482 8259817 8286689 8312212 8335615
57222 8335615 8356516 8375072 8391718 8406565 8419316 8429757 8437820 8443199 8445516 8444880 8441545 8435067 8424716
57209 8424716 8410799 8394632 8376982 8357566 8336337 8314130 8291587 8268424 8244341 8219747 8195083
57198 8195083 8170254 8145250 8120448 8095820 8070646 8044534 8017976 7991443 7964757 7937852 7911295
57187 7911295 7885534 7860447 7836106 7813131 7791707 7771023 7750216 7729161 7707937 7686384 7664635
57176 7664635 7643166 7621869 7599957 7577248 7554550 7532366 7510325 7488448 7467733 7448676 7430277
57165 7430277 7411390 7392055 7372544 7352106 7329640 7304860 7277813 7247994 7214934 7178960 7140384
57154 7140384 7098397 7051578 6999020 6940364 6875512 6805127 6730808 6654032 6575469 6495899 6416975
57143 6416975 6340317 6266702 6196924 6132597 6075111 6024451 5979966 5941572 5909112 5881058 5854923
57132 5854923 5828672 5800941 5770300 5735362 5695595 5651418 5603712 5553692 5503039 5453713 5407802
57121 5407802 5367503 5334487 5308887 5289455 5274965 5264943 5259155 5257502 5260834 5271025 5289958 5319317
57109 5319317 5361459 5419275 5494870 5589553 5705661 5847498 6020534 6231260 6488527 6804029
57099 6804029 7191481 7666923 8250328 8965653 9838952 10897278 12168138 13676351 15438965
57090 15438965 17462473 19742215 22260194 24982074 27856926 30817536 33779559 36650833
57082 36650833 39360825 41888850 44249665 46432357 48348513 49846244 50778574 51062611
57074 51062611 50689197 49698204 48152605 46123853 43685925 40917044 37906189 34754491
57066 34754491 31566166 28436064 25442190 22642612 20073701 17751343 15676081 13837975
57058 13837975 12219030 10796745 9550075 8462507 7519315 6704208 6000292 5392647 4868345
57049 4868345 4415274 4022521 3680999 3382581 3119639 2886293 2678933 2494538 2329568
57040 2329568 2181234 2048357 1929866 1823584 1727514 1641244 1565020 1498369 1440526 1391230
57030 1391230 1350259 1317110 1292036 1276533 1272183 1279967 1301263 1338073 1390875 1456894 1531274 1609053
57018 1609053 1684599 1749365 1791354 1797942 1760973 1681440 1570269 1443524 1315357 1194402 1084908
57007 1084908 988802 906181 835720 775966 725784 683492 646899 614757 587050 563440 542647
56996 542647 523863 507500 493877 482333 472251 463789 457011 451479 447359 445752 447221 451059 456625
56983 456625 464057 472872 481077 486514 488041 484703 475243 459693 440477 420711 402039 384930 370030
56970 370030 357983 348522 340876 334810 330691 329098 330839 336571 345777 356958 369509 384564 403209
56957 403209 424612 446505 466617 482808 492714 494443 487470 472520 451241 426357 401027 377266
56945 377266 355570 336397 320926 309709 301842 296414 293891 295166 300214 308734 321248 338462 360079
56932 360079 385141 412828 441872 469688 492936 508602 514118 507606 489255 461980 429735 395492
56920 395492 361353 329586 302143 279372 260191 243439 228581 215569 204691 196190 189547 183718
56908 183718 178534 175020 173577 172724 170675 167542 164949 163844 163742 163913 164390 165763 168571 172887 178255
56893 178255 184214 191063 199711 210737 224193 240310 259347 280394 301297 320244 336465 348936
56881 348936 355694 355428 348902 338078 324677 310305 296823 285430 276047 268585 264097 263751 267404
56868 267404 274242 284298 298317 316704 339586 367510 401144 440438 484500 531565 578362 620169
56856 620169 652430 672087 677274 667099 642935 609128 571208 533506 498852 469300 445893 428391
56844 428391 416526 411234 413818 424521 442874 468926 503210 546060 597886 659302 729711 805893
56832 805893 882586 953642 1011802 1048795 1058118 1038479 994062 931893 859625 784729 713519 650003
56820 650003 595981 552059 518041 492935 475712 466106 464196 469743 482740 504142 535073 575410
56808 575410 623581 677080 732225 783800 825811 852637 859630 844150 807489 755314 695101 633076
56796 633076 573684 520357 475077 437645 406865 382404 364657 353354 347455 346207 349432 357150
56784 357150 369782 388173 412302 440216 469014 496261 519530 535322 539989 531845 511745 482148
56772 482148 446465 408589 371708 337508 306954 281026 259839 242012 226190 212568 201805
56761 201805 193234 185536 178492 172652 167803 163192 158798 154979 151289 147127 143130 140441 138849 137078
56747 137078 134710 132444 130651 129039 127504 126059 124176 121509 118937 117581 117127 116504 115720 115469 115345
56732 115345 114319 112843 112556 113762 114946 115082 114772 114727 114671 114312 114093 114393 114998 115712 116563 117256 117433 117577
56714 117577 118563 120197 121270 121294 121143 121815 123423 125495 127380 128355 128186 127493 126820 125735 123842 122084
56698 122084 121737 122483 122992 123061 123628 124791 125533 125491 125403 125592 125475 124874 124422 124398 124409 124407 124779 125255 125070 124386 124243
56677 124243 124918 125593 125889 126345 127126 127514 127066 126199 125354 124607 124201 124407 124841 125002 125329 126473 127724 127716 126659
56658 126659 126303 127564 129722 132069 134721 137550 139922 141876 144082 146375 147816 148503 149661 151593 153201
56643 153201 154084 155484 158446 162395 166109 168844 170036 169303 167305 165398 163982 162411 160647 159464 158726
56628 158726 157226 154780 152775 151968 151406 150301 149395 149565 150500 151596 152812 153858 153958 153311 153405 154933
56612 154933 156644 157164 156732 156266 155955 155736 156036 157055 158231 159201 160381 161937 163264 164103 165110 166676
56596 166676 168278 169590 171030 172596 173373 172919 171931 170914 169406 167117 164602 162175 159524 156972 155656
56581 155656 155727 155924 155687 156053 157516 158700 158418 157511 157274 157436 157220 157218 158639 161476 164749 167852 170642
56564 170642 173034 175555 179439 185120 191473 197431 203357 209895 216534 222440 227722 232671 236659 239050
56550 239050 240519 242329 244821 247430 249521 250515 250035 248671 247726 247478 246648 244235 240777 237105 233181
56535 233181 229047 225561 223113 220808 218021 215476 213683 211618 208372 204860 202368 200464 197948 194997
56521 194997 192795 191653 190993 190625 190660 190605 189823 188543 187437 186680 186254 186452 187155 187387 186608 185694 185662 186232
56503 186232 186624 186907 187435 187811 187554 187037 186651 185906 184511 183504 183966 185312 186098 185949 185525 185193 184885 184688
56485 184688 184495 183637 181946 180554 180603 181692 182563 182767 182732 182775 182962 183359 183687 183411 182785 182926 184154 185288
56467 185288 185405 185106 185193 185330 185087 185053 185654 186028 185400 184553 184639 185541 186705 188464 191052 193310 194034 193810
56449 193810 194048 194865 195377 195430 195662 196391 197576 199234 200875 201342 200385 199464 199854 200857 201084 200492 199910 199547
56431 199547 199341 199790 201070 202258 202692 203114 204213 205223 205376 205480 206456 207529 207620 207463 208483 210450 212070
56414 212070 213064 213985 214747 215000 215168 215574 215397 214079 212771 212777 213624 214317 215261 217048 218587 218626 218073 218555
56396 218555 219589 219488 218303 217521 217464 217321 217224 218042 219497 220628 221687 223484 225324 225873 225707 226750 229343
56379 229343 231994 233871 235519 237199 238555 239896 241991 244549 246472 247384 247538 246774 245142 243870 243956
56364 243956 244531 244407 244311 245516 247227 247708 247250 247565 248782 249607 249981 251022 252580 253391 253468 253913 254542 254193
56346 254193 253252 253314 254359 254760 254193 254139 255332 257013 258815 261061 263137 263897 263861 264754 266699 268126 268529
56329 268529 269063 270248 271388 272418 273992 275610 275998 275618 276448 278928 281345 282574 283206 283697 283692 283562 284398
56312 284398 286041 287202 287827 289214 291502 293235 293799 294207 295152 296322 297850 300383 303464 305901 307818
56297 307818 310266 312847 314094 314230 315055 316932 318386 318943 319826 321469 322843 323673 324886 326468 327373 327960
56281 327960 329986 333649 337119 339551 342111 345444 348610 351213 354249 358180 362415 367148 373367 380601
56267 380601 387106 392792 399480 407699 415767 422669 429453 437109 445479 454806 465998 478797 492015
56254 492015 505895 521802 539417 556984 574564 594041 615570 637177 658417 681096 705512
56243 705512 729265 750917 771620 791927 810082 824807 836859 846478 852211 853603 852241 848757
56231 848757 841617 830276 816736 802563 787055 769742 751883 734063 715082 694773 675268 657987
56219 657987 641982 626626 613125 601824 590871 579285 568740 560625 553913 547510 542120 538102
56207 538102 534131 529660 526156 524261 522236 518929 515703 513788 512259 510333 509164 509628 510706 511623 513194
56192 513194 515608 517428 518265 519795 522751 525632 527748 530557 534419 537146 537546 537433 538353 539377 540004
56177 540004 542040 546399 550971 553869 556010 558511 560455 561460 563555 568157 573776 578875 584283 590814
56163 590814 597291 603054 609585 617570 625301 632051 640072 651011 663353 675580 688810 704058 720018
56150 720018 735934 753576 773971 795388 817042 841665 871865 907054 946462 991944 1045208
56139 1045208 1105528 1172944 1250444 1340268 1441192 1551913 1673360 1804536 1939429 2071064
56129 2071064 2195484 2309298 2407705 2488827 2556648 2616084 2668125 2712603 2751467 2785147 2809259
56118 2809259 2819247 2815597 2801119 2776570 2742800 2703470 2660955 2612155 2552325 2480287 2396397 2299019
56106 2299019 2187702 2067291 1944883 1825204 1712120 1610872 1524360 1450220 1385612 1331795
56096 1331795 1290161 1257536 1229978 1207782 1192214 1180774 1170549 1162939 1160130 1159995 1159352 1159152 1161537
56083 1161537 1164931 1167060 1169799 1175932 1184076 1191727 1200291 1212032 1225198 1237273 1249994 1265990 1283649
56070 1283649 1300430 1318004 1338789 1360723 1380878 1400859 1423104 1445242 1463814 1480254 1497523
56059 1497523 1514320 1528363 1541782 1557325 1572922 1586066 1599671 1617278 1636426 1653420 1670610
56048 1670610 1692029 1715812 1738189 1761108 1788399 1818080 1846118 1874203 1906116 1940024 1972148
56037 1972148 2004424 2040567 2078323 2113802 2149698 2190787 2235016 2277681 2320560 2367981 2417718
56026 2417718 2465121 2512551 2565236 2621419 2676215 2731532 2792213 2856017 2917663 2979225 3046261
56015 3046261 3117394 3188276 3261955 3344250 3432656 3521052 3611449 3709553 3812920 3915752 4021262
56004 4021262 4136626 4259803 4384375 4513119 4653115 4801729 4951804 5106583 5274560
55995 5274560 5453655 5635933 5823943 6026402 6241796 6462991 6694045 6945127 7214821
55986 7214821 7495444 7791642 8114858 8463756 8830064 9219455 9645766 10109068 10601577
55977 10601577 11130850 11713903 12353123 13042835 13795055 14632665 15562491 16583726 17717979
55968 17717979 19001055 20451506 22081787 23936214 26083579 28581050 31488697 34916288
55960 34916288 39011693 43906450 49717627 56594701 64714634 74253607 85446923 98681577
55952 98681577 114462220 133305803 155751872 182366670 213388868 248103144 284564332
55945 284564332 319957139 351063084 374366143 386274832 384170266 367850420 340002476
55938 340002476 305091396 267595277 230887457 197068213 167207255 141595700 120016957
55931 120016957 102035856 87165499 74898895 64744215 56296906 49252149 43351048
55924 43351048 38361534 34109676 30478054 27361638 24657351 22294459 20234875 18437033
55916 18437033 16849295 15438823 14194121 13095215 12109250 11217457 10419056 9705612 9056620
55907 9056620 8462729 7928902 7451398 7013953 6609386 6243598 5915337 5612252 5329614
55898 5329614 5073418 4842132 4623966 4415176 4223387 4049888 3885609 3727515 3582581
55889 3582581 3452456 3329799 3212877 3108731 3018807 2935936 2858663 2794605 2746397 2707684
55879 2707684 2676101 2656967 2650453 2647265 2640271 2628734 2608228 2568686 2506590 2428793 2341323 2244731
55867 2244731 2142839 2044808 1954703 1868626 1785068 1708613 1640751 1576817 1515034 1459353 1410580
55856 1410580 1363832 1317627 1276650 1242694 1211400 1180567 1153156 1129497 1105125 1079074 1055913
55845 1055913 1036777 1016640 993388 971458 953415 935869 916873 899701 885878 871736 855169
55834 855169 838995 824684 809562 793087 779061 768718 758283 746178 735909 729004 721837 712527
55822 712527 704235 698353 690989 679773 668007 658475 649009 637865 627810 621123 615659 609476 604568
55809 604568 602730 602359 602423 605055 611257 618443 624903 632229 640829 647656 651004 653050 655167 655153 651457
55794 651457 645603 638137 626877 611691 596418 583539 571409 559061 548970 542444 536942 530661
55782 530661 525231 521149 515180 505331 494178 484376 475068 465516 457968 453749 450524 446506 443548 443118
55768 443118 443012 441072 438443 436179 432345 425564 417949 411430 404596 396120 387911 381851 376654 370985
55754 370985 366476 364619 363655 361529 359013 357051 354015 348552 342431 337645 333225 327638 321771 316890
55740 316890 312175 306821 302162 299283 296954 294137 291988 291239 290321 288220 286384 285648 284207 280949 277736
55725 277736 275997 274049 270379 266562 264215 261932 258118 254136 251770 250115 247774 245688 245032 244712 243607
55710 243607 242897 243547 243992 242976 242188 243318 245030 245634 246165 247790 248665 246632 242904 239841 237084 233045
55694 233045 228346 224620 221580 218307 215812 215331 215688 215231 214807 215935 217638 218062 217803 218660 220373 221551
55678 221551 222695 225465 229845 234481 238745 242205 243435 241878 239624 238905 239085 238474 237567 237857 238879
55663 238879 239295 239791 242022 245601 248878 251985 256444 262349 268320 273732 278751 282794 285080 286086 286535
55648 286535 285659 282349 277168 271341 264710 256594 247714 239321 231389 223557 216773 212013 208313 204085
55634 204085 199489 195655 192654 190063 188417 188126 188098 187420 187237 188854 191096 191756 190691 189358 188279 187106
55618 187106 186231 186157 186086 185166 184246 184402 184730 183682 181604 179850 178341 176201 173899 172519 171754 170752 170065
55601 170065 170524 171048 169913 167555 165876 165377 165091 164651 164253 163291 161284 159574 159889 161717 163193 163948
55585 163948 164923 166002 166141 165502 165247 165543 165758 166209 167682 169641 171012 172315 174988 178981 183077 187170
55569 187170 192054 197310 201554 204628 207523 210299 212031 212633 212789 212274 210225 206948 203642 200527 196946
55554 196946 193016 189379 185679 181185 176579 173204 170842 168161 165198 163396 163292 163964 164634 165056 164576
55539 164576 162699 160470 159476 159559 159215 158064 157100 156764 156622 156763 157602 158373 157721 155831 154209 153410 152642
55522 152642 151489 150225 148608 146228 143963 143171 143428 142948 141312 139934 139673 139909 140198 140992 142246 142899
55506 142899 142328 141074 139841 138905 138556 138980 139760 140533 141785 143804 145438 145444 144485 144073 144050 143103 141392 140471
55488 140471 140615 140390 139077 137607 136759 136272 136046 136509 137416 137853 137742 137889 138369 138420 138062 138199 138886 139081
55470 139081 138443 137965 138488 139841 141546 143138 143808 143082 141804 141172 141025 140486 139875 140234 141220 141391 140523
55453 140523 139740 139423 138959 138661 139762 142033 143393 142573 140548 138764 137463 136353 135570 135390 136008 137761
55437 137761 140492 142872 143685 143520 143685 143893 142894 141044 140024 140036 139624 138591 138690 140777 143425 145210 146517
55420 146517 148223 150345 152807 155985 159735 163246 166426 169922 173401 175464 175790 175635 175642 174889 172760 170070
55404 170070 167601 165142 162595 160415 158289 155093 150960 147726 146553 146639 146982 147682 148649 148783 147555 145973
55388 145973 144967 144215 143436 143350 144312 145411 145926 146365 147130 147516 147026 146353 146014 145314 143724 142077 141334 141274
55370 141274 141343 141620 141995 141633 140276 138953 138397 137908 136731 135345 134389 133440 132024 130726 130200 130050 129768
55353 129768 129768 130418 131056 131119 131321 132540 134298 135454 135699 135378 134582 133408 132456 132102 131862 131306 130880 131053
55335 131053 131385 131291 131029 131097 131289 131143 130730 130363 130100 130094 130689 131640 132093 131853 131782 132396 133087 133385 133852 134912
55315 134912 135865 135972 135591 135325 134959 134247 133886 134636 136098 137246 137646 137433 136710 135760 135212 135290 135452 135292
55297 135292 135164 135397 135678 135765 135928 136173 135931 135063 134277 133953 133651 133337 133891 135583 137152 137384 136663 136076
55279 136076 135948 136105 136623 137312 137429 136863 136761 137968 139674 140597 140709 140798 141075 141283 141541 142095 142763 143377
55261 143377 144180 145134 145549 145086 144353 143846 143277 142590 142519 143265 143693 142898 141581 140868 140685 140394 140087 140153 140376
55242 140376 140568 141192 142307 142780 141751 140058 139041 138723 138428 138319 138950 139918 140353 140270 140290 140510 140728 141166
55224 141166 141840 141907 140806 139458 139138 139790 140627 141634 143117 144449 144820 144744 145319 146370 146819 146641 146901
55207 146901 147913 148762 148721 147982 146923 145770 145004 145081 145660 145940 145684 145159 144355 143183 142237 142301 143186 143881
55189 143881 143814 143179 142280 141343 140804 140977 141519 141877 142029 142312 142911 144040 146046 148587 150324 150276 148979 147561
55171 147561 146297 144988 144068 144232 145384 146938 148699 150579 152025 152730 153367 154600 155924 156512 156592 156823
55155 156823 156866 155859 153908 151911 150294 149018 148380 148601 149003 148769 148113 147581 146802 145263 143766 143557 144340
55138 144340 144707 144311 144072 144381 144672 144811 145365 146298 146741 146320 145556 144846 144181 143884 144401 145266 145463 144883 144293
55119 144293 143869 143081 142110 141989 142996 144164 144761 145099 145517 145708 145606 145957 147435 149826 152384 154320 154820
55102 154820 153509 151242 149674 149720 150945 152548 154140 155472 156199 156278 156075 155873 155711 155674 155835 155993 155951 155834
55084 155834 155676 155071 153928 153082 153263 153888 153820 152994 152225 151758 151175 150563 150534 151112 151626 151735 151566 151008 149916
55065 149916 148885 148670 148974 148919 148601 148956 150104 151114 151457 151470 151313 150738 150075 150206 151265 152417 153137 153678
55047 153678 154189 154520 155029 156340 158065 158959 158625 157948 157600 157281 156757 156497 156838 157507 158303 159298 160112 160063
55029 160063 159291 158738 158716 158583 158027 157527 157264 156796 156207 156329 157328 158206 158234 157881 157821 157995 158144 158274 158179 157466
55009 157466 156440 155914 155789 154995 153271 151796 151483 151856 152232 152748 153395 153307 152047 150657 150392 151180 152234
54992 152234 153372 154741 155901 156330 156433 157166 158846 160959 162864 164177 164765 164816 164676 164373 163754 163121 163067
54975 163067 163554 163956 164240 165150 166902 168655 169690 170154 170162 169277 167576 166276 166439 167830 169751 172146 175017
54958 175017 177511 178637 178500 178039 177895 178180 178878 179768 180307 180207 179848 179772 180121 180793 181549 181729 180681 178970
54940 178970 178358 179930 182879 185656 187650 189184 190698 192649 195554 199327 203187 206910 211538 218042
54926 218042 225828 233459 240416 247293 254530 261726 268030 272570 274638 273998 270932 265793 258877 250875
54912 250875 242801 235112 227505 219996 213465 208562 204779 201271 198033 195520 193617 191781 189879 188198
54898 188198 186860 185743 184799 184093 183829 184517 186579 189553 192387 194887 198079 202698 208114 213399 218631
54883 218631 224402 230745 237390 244447 251942 259116 265064 269648 273051 274811 274132 270884 265671 259214
54869 259214 252214 245339 238678 231617 223894 216285 209635 203744 198028 192810 189045 186996 185924 184909
54855 184909 183350 181024 178346 176320 175541 175443 175054 174181 173290 172628 172121 171759 171431 170749 169677 168917 168975 169253
54837 169253 168825 167806 167132 167274 167887 168510 168922 169018 169015 169526 170855 172474 173785 174957 176319 177422 177559
54820 177559 176941 176438 176336 176164 175657 175153 175075 175634 176818 178130 178683 178208 177609 177780 178326 178349 178062 178465 179620
54801 179620 180431 180231 179557 179201 179392 180067 181020 181563 180905 179247 177831 177548 178081 178698 179324 180477 182507
54784 182507 185226 187999 190125 191464 192728 194849 198065 201976 206379 211577 217850 225169 233491 242871
54770 242871 253203 264252 276039 288679 301551 312960 320971 324601 324215 320890 315499 308372 299760
54757 299760 290328 280893 271790 262915 254321 246199 238301 230188 222259 215696 210972 207268 203963 201753
54743 201753 201418 202178 202440 201788 201190 201439 202400 203789 205742 208456 211920 216083 220827 225835 230956 236524
54727 236524 242806 249356 255464 260953 265911 269951 272479 273392 272747 270038 264752 257501 249697 242116 234651
54712 234651 227417 221075 215874 211313 207042 203353 200428 197820 195131 192624 190697 189175 187572 185864
54698 185864 184585 184178 184444 184670 184345 183655 183086 182635 181826 180581 179464 178843 178484 178376 179177 181148 183312
54681 183312 184537 184917 185203 185364 184777 183490 182163 180948 179523 178161 177624 177935 178304 178365 178490 178712 178417
54664 178417 177442 176545 176402 176904 177749 178924 180198 180934 180869 180486 180181 179681 178727 177790 177619 178371 179590 180753
54646 180753 181603 182215 182925 183974 185138 185936 186168 185916 185200 184164 183454 183753 184870 185903 186386 186664 187052
54629 187052 187253 186810 185603 183736 181483 179486 178508 178690 179410 179944 179989 179625 179288 179642 180882 182184 182540
54612 182540 182124 182100 183046 184328 185172 185457 185192 184084 182197 180416 179662 179993 180840 181749 182524 183045 183364 183717
54594 183717 184187 184559 184699 184762 184906 185079 185224 185405 185634 185864 186157 186561 186837 186705 186334 186108 186037 185867 185732
54575 185732 186072 186892 187748 188544 189731 191517 193420 194762 195225 194864 194080 193562 193670 193865 193360 192304 191621
54558 191621 191662 191867 191900 192203 193081 194012 194322 193902 192965 191827 191206 191943 193846 195523 196011 195952 196523 197750
54540 197750 198678 198831 198709 198918 199523 200296 201098 201876 202588 203216 203726 204021 204021 203747 203340 203100 203377 204138 204680
54521 204680 204199 202719 201163 200418 200610 201304 202056 202642 203063 203393 203453 202765 201179 199388 198402 198537 199227 199721
54503 199721 199594 198856 198057 198049 199022 200010 200025 199366 199051 199287 199508 199704 200406 201342 201465 200728 200540 201812 203609
54484 203609 204497 204357 204076 204198 204719 205660 207033 208590 210207 212172 214577 216831 218335 219238 220001 220614
54468 220614 220791 220646 220599 220812 221157 221534 221867 221955 221727 221468 221500 221728 221712 221054 219688 217985 216551 215612 214700
54449 214700 213350 211946 211303 211487 211738 211580 211221 210809 210113 209192 208611 208695 209220 210042 211227 212341 212530 211714
54431 211714 210912 210938 211533 212172 212860 213566 213748 213200 212703 213106 214227 215302 216026 216534 216813 216747 216440 216034 215544
54412 215544 215160 215202 215497 215341 214443 213311 212453 211868 211652 212194 213300 213966 213662 213116 213235 213974 214802 215520
54394 215520 216030 216107 216050 216747 218392 219980 220700 220927 221103 220767 219691 218922 219409 220441 220733 220290 219865 219331
54376 219331 218121 216809 216581 217348 217908 217912 218215 219171 219957 219869 219219 218667 218581 219172 220390 221643 222404 223064 224337
54357 224337 225962 226955 227041 226800 226478 225770 224823 224326 224425 224553 224500 224624 224819 224381 223205 222109 221530 220823 219355
54338 219355 217440 215718 214326 213190 212512 212410 212557 212579 212413 212061 211477 210919 210817 211059 210957 210239 209514 209481
54320 209481 210173 211254 212547 213829 214625 214600 213962 213234 212869 213149 214098 215309 216201 216590 216753 216975 217361 218071
54302 218071 219304 221077 223335 226074 228886 230709 230796 229769 228879 228341 227334 225630 224062 223092 222064
54287 222064 220423 218686 217487 216493 215122 213729 213152 213437 213839 213868 213685 213573 213673 214148 215011 215793 215858 215142
54269 215142 214233 213659 213344 212846 211881 210580 209338 208488 208075 207958 208122 208733 209948 211755 213968 216086 217280
54252 217280 216943 215430 213906 213259 213376 213663 213937 214455 215274 215996 216238 216108 216034 216206 216351 216097 215462 214822
54234 214822 214447 214271 214180 214240 214473 214617 214353 213696 212985 212608 212797 213446 213999 213763 212603 211133 210063 209634
54216 209634 209816 210534 211326 211262 209841 207738 206099 205279 204789 204268 203814 203419 202777 201820 200959 200617 200798 201222
54198 201222 201606 201818 201966 202292 202797 203198 203480 204135 205445 206799 207288 206796 206009 205509 205366 205442 205547 205322
54180 205322 204520 203406 202487 201958 201779 202027 202725 203543 204124 204500 204774 204836 204908 205768 207666 209466 209864 209058
54162 209058 208231 207738 207029 206134 205839 206284 206695 206699 206690 206595 205615 203695 202058 201672 202176 202951 204214 206271 208614
54143 208614 210596 212347 214249 216073 217403 218314 218960 219084 218584 218050 218006 218114 217864 217518 217639 218102 218368
54126 218368 218372 218371 218263 217865 217574 217954 218861 219763 220752 222377 224476 226075 226598 226475 226314 226084 225432 224324 223009
54107 223009 221682 220446 219422 218597 217739 216697 215710 215258 215520 216155 216669 216963 217303 217723 217716 216802 215208 213610
54089 213610 212325 211219 210386 210362 211443 213202 214967 216426 217571 218349 218674 218546 217997 217148 216433 216397 217036
54072 217036 217670 217751 217503 217517 218005 218788 219768 220937 221980 222304 221614 220316 219209 218806 218959 219156 219092 218816
54054 218816 218391 217764 217144 217055 217646 218262 218191 217613 217229 217277 217533 218170 219767 222445 225675 228987 232205 234996
54036 234996 237032 238755 241091 244169 247109 249379 251487 253926 256361 258482 260861 264172 268109 271804
54022 271804 274844 277164 278391 278154 276907 275750 275464 276138 277480 278974 279885 279667 278399 276556 274508
54007 274508 272459 270611 268950 267113 264818 262323 260201 258845 258328 258483 258935 259373 259946 260969 262121
53992 262121 262511 261817 260767 260163 260020 260121 260678 261747 262623 262701 262632 263692 266198 269305 272337 275568 279680
53975 279680 285100 292047 300703 311122 323306 337565 354629 375328 400083 428421 458721 488622
53963 488622 515764 537862 552168 555785 547363 528370 502312 472963 443493 416331 392739 372519
53951 372519 354891 339701 327339 317711 310058 303801 298911 295351 292712 290645 289282 289057 290255 292722
53937 292722 295832 298843 301515 304201 307111 309831 311959 313844 316091 318503 320265 321170 322029 323621 325723
53922 325723 327397 327927 327240 325750 324107 322998 322925 324055 326266 329356 333150 337366 341341 344125 345175
53907 345175 344917 344238 343449 342139 340069 337689 335590 333870 332290 330631 328719 326517 324317 322390 320365
53892 320365 317604 314388 311864 310403 308863 306128 302634 299599 297401 295609 294049 292803 291435 289260
53878 289260 286336 283404 280901 278710 276732 275012 273368 271605 269973 268797 267756 266212 264149 262170
53864 262170 260718 259969 260198 261354 262373 261896 259836 257451 255790 254860 254475 254917 256260 257723 258289 257689
53848 257689 256504 255590 255530 256263 257079 257307 257089 257102 257565 258028 258211 258434 258989 259584 259729 259306 258533 257625 256726
53829 256726 255905 255051 253976 252717 251583 250835 250534 250691 251329 252375 253633 254825 255603 255825 255994 257033
53813 257033 259243 261854 264028 265855 267828 269841 271533 273233 275558 278196 280203 281570 283526 286949
53799 286949 291393 296072 301009 306745 313585 321686 331358 342711 355442 369491 385609 404644 426305
53786 426305 448943 470453 489165 503929 513580 516514 511103 496996 476123 452084 428312 406750
53774 406750 387903 371581 357490 345545 335830 328175 321899 316333 311440 307490 304225 300932 297357
53761 297357 293975 291286 289308 287868 286785 285644 283988 282005 280501 279877 279591 278961 278148 278003 279253
53746 279253 282079 286169 290844 295374 299555 303938 309297 315872 323233 330748 338076 345185 351919 357642
53732 357642 361564 363442 363635 362293 358967 353429 346458 339223 332194 325308 319020 314352 311799 310777
53718 310777 310328 309953 309691 309805 310416 311173 311423 311078 311047 312255 314522 317041 319680 322975 326937 330797 333972
53701 333972 336435 338049 338429 337732 336870 336648 337271 338714 340915 343518 346128 348835 351746 354141 355122 355118
53685 355118 355547 356747 357480 356868 355559 354375 353095 351440 350182 350149 350914 351514 351874 352497 353315 353834 354048
53668 354048 354246 354248 353696 352827 352086 351296 350072 348816 348367 348675 348768 348110 347257 346967 347239 347464 347111 346069 344600
53649 344600 343074 341690 340489 339659 339505 339980 340615 341144 341667 342007 341525 340125 338814 338567 339076 339411 339491
53632 339491 339999 341092 342261 343475 345465 348540 351894 354547 356444 358205 360152 362049 363623 364991
53618 364991 366527 368490 370869 373608 376890 380955 385554 389889 393392 396423 399864 404027 408249 411595
53604 411595 413797 415486 417629 420767 424751 429106 433482 437577 440902 443079 444379 445526 446868 448124
53590 448124 449039 449800 450622 451342 451698 451630 451125 450118 448776 447462 446187 444462 441951 438904 435779 432874
53574 432874 430500 428967 428098 427238 426078 424955 424066 422997 421471 419965 419010 418418 417775 417258 417306 417835 418412
53557 418412 418898 419339 419492 419064 418242 417517 417225 417625 419039 421364 423822 425726 427257 428981 431050 433401
53541 433401 436253 439708 443249 446443 449800 454099 459116 463882 468081 472385 477445 483385 490278 498348
53527 498348 507609 517913 529361 542106 555712 569385 582811 596277 610096 624572 640426 658431
53515 658431 678529 700003 722580 746691 772625 800190 829353 860367 892927 925885 958166
53504 958166 989428 1019520 1047803 1073417 1095823 1114914 1131150 1145924 1161233 1178395 1197183
53493 1197183 1216547 1235965 1255827 1276695 1298558 1320799 1342709 1364019 1384953 1405736 1426093
53482 1426093 1445381 1463142 1479422 1494622 1509224 1523531 1537566 1551318 1565145 1579557 1594355
53471 1594355 1608379 1620454 1630252 1637806 1642660 1644192 1642562 1638592 1632792 1625063 1615271 1603471 1589618
53458 1589618 1573724 1556256 1537824 1518485 1498026 1476774 1455362 1433643 1410702 1386146 1360664
53447 1360664 1335090 1309663 1284481 1259933 1236243 1213198 1190813 1169699 1150298 1132198 1114760
53436 1114760 1098055 1082765 1069405 1058109 1048901 1041706 1036200 1032001 1029040 1027607 1028122 1030943 1036204
53423 1036204 1043681 1052991 1064001 1076848 1091539 1107784 1125344 1144297 1164866 1187154 1211081 1236384
53411 1236384 1262675 1289741 1317754 1346982 1377382 1408812 1441511 1475954 1512285 1550344 1590215
53400 1590215 1632270 1676698 1723465 1772691 1824519 1878560 1934119 1990996 2049441 2109213 2169471
53389 2169471 2229925 2291314 2354238 2418081 2481598 2544050 2605144 2664235 2720319 2772765 2821572
53378 2821572 2866991 2909291 2948833 2985939 3020597 3052538 3081610 3107858 3131159 3150932 3166357
53367 3166357 3176870 3182328 3182501 3176426 3162603 3139983 3108468 3068309 3019618 2963064 2900641 2834909
53355 2834909 2767500 2698952 2629779 2560848 2492624 2424968 2357953 2292233 2228391 2166561 2106769
53344 2106769 2048826 1991687 1933849 1874929 1816148 1758837 1703300 1649602 1598543 1550899 1506388
53333 1506388 1464385 1425265 1390011 1358638 1329966 1303060 1278211 1256355 1237976 1222689 1209482
53322 1209482 1197281 1185504 1174140 1163284 1152933 1143352 1135158 1128582 1123037 1117950 1113694 1111098 1110216
53309 1110216 1110193 1110386 1111122 1113286 1117511 1123818 1131803 1141134 1151935 1164469 1178466 1193236 1208714 1225857
53295 1225857 1245549 1267609 1291487 1317429 1346042 1376844 1408167 1438667 1468351 1497994 1528107
53284 1528107 1558531 1588501 1616958 1643240 1667582 1690586 1712281 1732216 1750352 1767059 1782010
53273 1782010 1793915 1801850 1806305 1808321 1808020 1804680 1798007 1788611 1777086 1763196 1746266 1726050 1702939
53260 1702939 1677454 1649834 1620085 1588200 1554250 1518431 1481181 1443147 1404858 1366505 1328192
53249 1328192 1290313 1253432 1217786 1183222 1149679 1117378 1086302 1055812 1025127 994054 963034
53238 963034 932585 902932 874003 845497 817118 789055 762147 737255 714500 693429 673890
53227 673890 656344 641225 628338 617114 607214 598588 590984 583654 575746 567003 557981 549402 541348
53214 541348 533272 524773 516029 507305 498412 489006 479272 469895 461390 453748 446748 440285 434310 428689
53200 428689 423193 417511 411300 404489 397593 391470 386631 382849 379462 375876 371803 367291 362713 358593
53186 358593 355248 352589 350276 347991 345602 343217 341169 339726 338742 337758 336641 335905 336125 337126 338128
53171 338128 338732 339336 340389 341588 342218 342046 341402 340511 339323 338086 337488 337844 338570 338865 338660 338524 338915
53154 338915 339907 341350 342814 343541 343076 341911 341027 340795 340755 340415 339699 338599 337032 335253 333891 333255 332969
53137 332969 332476 331556 330238 328676 327330 326809 327185 327757 327819 327402 327046 327098 327415 327425 326409 324151 321508 319840
53119 319840 319594 319891 319797 319438 319398 319578 319351 318463 317102 315303 312985 310516 308564 307297 306263 305157 304205
53102 304205 303655 303292 302733 301998 301563 301884 302889 303906 304243 303909 303605 303832 304233 304113 303390 302708 302628 303044
53084 303044 303397 303242 302519 301432 300123 298519 296560 294488 292686 291268 290136 289453 289641 290750 292244
53069 292244 293571 294569 295142 295062 294426 293828 293706 293888 294161 294777 295941 297281 298363 299283 300210 300836 301008 301422
53051 301422 302812 304736 306142 306944 308043 309778 311449 312541 313461 314618 315586 315733 315110 314261 313558 313083
53035 313083 312716 312022 310478 308186 306003 304617 303830 303048 302066 301000 299836 298565 297589 297464 298219 299278
53019 299278 300007 300139 299734 299019 298312 297846 297492 296734 295043 292444 289818 288475 289211 291693 294793 297462
53003 297462 299170 299768 299376 298395 297280 296124 294742 293211 292041 291670 292021 292762 293812 295349 297368 299426
52987 299426 300884 301401 301191 300777 300526 300523 300830 301575 302639 303540 303917 303913 303859 303827 303786 303918 304355 304885 305398 306394
52967 306394 308371 310792 312394 312616 312095 311650 311466 311461 311729 312172 312270 311757 311070 310581 309776 307871 305114 302801
52949 302801 301900 302110 302392 302039 301028 299633 298103 296688 295703 295352 295496 295796 296074 296448 296986 297476 297704
52932 297704 297800 298033 298360 298475 298267 297938 297677 297478 297253 296899 296308 295623 295345 295768 296349 296113 294815 293262
52914 293262 292411 292505 293218 294133 294843 294993 294590 294040 293642 293287 292776 292143 291507 290976 290858 291550 292896 294080
52896 294080 294575 294939 296221 298762 301975 305124 307850 310010 311505 312381 312819 312910 312542 311559 309915 307782
52880 307782 305620 303955 302912 302042 300840 299352 298110 297552 297692 298223 298724 298844 298515 297973 297454 296934 296318
52863 296318 295690 295182 294739 294272 293930 293912 294066 294001 293581 293058 292708 292594 292692 292982 293355 293663 293917 294213 294417 294230
52843 294230 293638 292997 292477 291742 290435 288706 286934 285172 283336 281830 281394 282178 283467 284616 285821 287549
52827 287549 289545 290981 291444 291216 290618 289666 288544 287835 287943 288741 290169 292796 297258 303402 310449 317876
52811 317876 325593 333233 339741 343825 344572 341652 335401 326945 317946 309843 303191 297704 292827 288295
52797 288295 284294 281168 278960 277350 276049 275017 274124 272878 270904 268603 266950 266517 267002 267721 268313
52782 268313 268874 269635 270651 271717 272553 273134 273734 274565 275525 276497 277694 279376 281318 282910 283757 283876 283355
52765 283355 282155 280391 278561 277366 277301 278291 279627 280518 280898 281485 282817 284592 286218 287546 288575 288870
52749 288870 288077 286784 286055 286156 286487 286728 287198 287973 288536 288559 288321 288022 287367 286223 284990 283993 283113 282445
52731 282445 282682 284293 286774 289211 291144 292484 293097 293014 292663 292323 291694 290449 288883 287488 286241 284873
52715 284873 283563 282816 282813 283318 283999 284405 283990 282725 281455 281128 281801 282907 284198 285782 287410 288502 288979
52698 288979 289420 290202 290965 291141 290628 289784 289028 288615 288605 288927 289582 290726 292418 294363 296127 297527 298567
52681 298567 299140 299075 298459 297664 297087 297067 297902 299630 301800 303657 304658 304806 304647 304909 305862 306914 307147 306424
52663 306424 305576 305319 305482 305652 306016 306978 308385 309856 311589 314075 317112 319813 321572 322387 322277 321130
52647 321130 319204 317102 315031 312692 310060 307657 305810 304280 302974 302384 302809 303664 304212 304724 306230
52632 306230 309146 312668 315666 317828 319750 322076 324683 326617 326775 324734 320997 316530 312149 308338
52618 308338 305441 303769 303378 303829 304319 304214 303461 302392 301214 299935 298786 298332 298851 299844 300508 300582 300424
52601 300424 300345 300332 300445 301033 302305 303972 305548 306879 308138 309429 310687 311976 313572 315507 317196 317918
52585 317918 317730 317529 317937 318469 318316 317738 317987 319741 322271 324444 325978 327342 328943 330940 333439 336282
52569 336282 338857 340634 341633 341948 341228 339289 336887 335025 333591 331594 328801 326201 324577 323486 322115
52554 322115 320484 319206 318545 318358 318596 319234 319876 320002 319651 319377 319460 319517 319045 318092 317214 316778 316482 315713 314412
52535 314412 313433 313787 315468 317256 317825 316983 315773 315418 316217 317381 317944 317822 317891 318878 320414 321457 321553
52518 321553 321261 321348 321970 322805 323593 324243 324705 325100 325872 327439 329618 331597 332588 332449 331618 330463 328852
52501 328852 326496 323731 321653 321183 322070 323112 323367 322950 322670 323201 324647 326530 328017 328482 328149 327971
52485 327971 328572 329474 329756 329411 329524 330862 332706 333591 333105 332361 332561 333668 334900 336078 337685 339715
52469 339715 341333 342008 342362 343418 345466 348091 350888 353527 355382 355846 355021 353607 352033 350167 347853
52454 347853 345285 342720 340259 338036 336234 334756 333156 331136 328956 327291 326744 327383 328530 329144 328730
52439 328730 327741 326839 325941 324525 322676 321169 320412 319983 319415 318884 318782 319159 319897 320992 322230 323017 323016 322698
52421 322698 322798 323421 324132 324714 325302 325888 326286 326679 327756 330077 333613 338051 343239 349158 355747 363117
52405 363117 371720 381858 392939 403473 411986 417790 420846 421183 418783 413830 406745 398002 388229 378441
52391 378441 369735 362599 356829 352226 348975 347147 346250 345637 345109 344842 344955 345467 346417 347634 348649 349211
52375 349211 349698 350649 352114 353822 355742 357988 360357 362498 364383 366122 367402 367720 367091 366082 365143
52360 365143 364423 364049 364038 364011 363649 363396 364046 365635 367450 369143 370956 372669 373324 372566 371494 371555 373065
52343 373065 375382 378045 381092 384524 388059 391357 394172 396428 398442 400859 404061 407872 412089 417003
52329 417003 423034 430082 437584 445143 452829 460990 469853 479154 488105 495934 502515 508211 513216 517622
52315 517622 522144 527953 535430 543665 551655 559473 567805 576890 586515 596650 607385 618513 629774
52302 629774 641339 653513 666132 678748 691205 703513 715272 725770 734626 742015 748369 754170
52290 754170 759771 764981 769115 771952 774390 777536 781333 784724 787085 788779 790280 791498 792203 792504 792578
52275 792578 792347 791729 790922 790227 789774 789569 789649 790138 791353 793802 797753 802797 808097 813078 817604 821618
52259 821618 825087 828366 832139 836841 842485 849144 857075 866074 875161 883345 890504 897103 903290 908816
52245 908816 913839 919240 925740 932980 939892 945977 951815 958089 964418 969625 973142 975724 978545 981850
52231 981850 984801 986512 986987 987001 987187 987303 986471 984268 981421 979081 977505 975985 974168 972698 972126 971864
52215 971864 971089 970262 970768 973023 975871 978108 979825 981756 983913 985549 986214 986225 986161 986423 987401 989681 993741
52198 993741 999509 1006389 1013755 1021339 1029103 1036817 1043939 1049927 1054579 1057954 1060083 1060860 1060199 1058188 1055110
52183 1055110 1051382 1047391 1043317 1039163 1034922 1030604 1026041 1020978 1015470 1009985 1004857 999839 994464 988735
52169 988735 983174 978262 974086 970511 967410 964766 962801 962005 962721 964550 966357 967071 966527 965506 964980
52154 964980 965267 965873 966192 966332 967086 969055 971978 975044 977671 979771 981480 982908 984044 984649 984275 982667
52138 982667 980127 977325 974768 972653 971153 970526 970828 971742 972887 974266 976337 979520 983694 988319 993111
52123 993111 998325 1004154 1010109 1015517 1020566 1026205 1032935 1040345 1048102 1056700 1066654 1077578 1088755 1100279
52109 1100279 1112850 1126642 1141120 1155984 1171628 1188551 1206837 1226245 1246289 1266098 1284666
52098 1284666 1301393 1316054 1328273 1337530 1343807 1347755 1350056 1351002 1350852 1350118 1349221 1348216 1347104 1346171
52084 1346171 1345759 1345909 1346406 1347036 1347568 1347619 1346704 1344471 1340894 1336325 1331259 1325929 1320227 1314197 1308371 1303338
52068 1303338 1299188 1295810 1293561 1293067 1294339 1296698 1299646 1303313 1307832 1312874 1318102 1323618 1329559 1335606
52054 1335606 1341320 1346637 1351600 1355811 1358694 1360314 1361514 1363097 1365079 1366902 1368248 1369527 1371523 1374622
52040 1374622 1378508 1382653 1386900 1391275 1395378 1398371 1399686 1399434 1397987 1395490 1391966 1387608 1382672 1377241
52026 1377241 1371336 1365140 1358897 1352746 1346884 1341816 1338072 1335610 1333716 1331718 1329691 1328294 1327888 1327922 1327303
52011 1327303 1325203 1321263 1315120 1306197 1294164 1279285 1261982 1242349 1220518 1197308 1174007 1151550
51999 1151550 1130323 1110670 1092961 1076951 1061622 1046005 1029956 1013862 997945 982119 966309
51988 966309 950566 934903 919214 903309 886941 869976 852634 835419 818681 802401 786511
51977 786511 771211 756859 743771 732304 722999 716324 712347 710781 711338 713894 718306 724075 730211
51964 730211 735524 739256 741395 742209 741449 738298 732187 723479 713278 702760 692778 683798 676003 669565
51950 669565 664973 662831 663115 664830 666863 669201 672971 679084 687124 695811 704266 712363 719829 725708
51936 725708 729248 730984 732210 733353 733471 731478 727245 721179 713391 703904 693251 682176 670921 659364
51922 659364 647684 636343 625604 615668 607097 600436 595474 591536 588467 586593 585818 585706 586616 589746
51908 589746 595573 603094 611119 619512 628408 636850 643192 646492 646686 643641 637028 627253 615697 603711
51894 603711 591833 580213 569260 559545 551388 544905 540315 537888 537653 539434 543222 549291 557846 568690
51880 568690 581377 595603 611149 627406 643253 657617 669902 679586 685626 686823 682868 674767
51868 674767 664216 652801 641731 631833 623522 616945 612281 609741 609276 610512 613074 616860 622069 629168
51854 629168 638615 650229 662959 675689 688286 701456 715822 731739 749850 770837 794237 818147
51842 818147 840358 859166 872792 878923 875732 863177 842962 817566 789656 761842 736118 713436
51830 713436 693938 677270 662518 648525 634936 622595 612379 604012 596645 590209 585417 582592
51818 582592 581273 580933 581384 582305 582966 582652 581068 578208 574128 568920 562697 555649 548281 541359 535347
51803 535347 530061 525245 521205 518403 516637 515252 514116 513737 514302 515219 515872 516354 517182 518537 520083 521373
51787 521373 522185 522526 522381 521451 519247 515613 511116 506768 503419 501532 501286 502626 505366 509521 515430
51772 515430 523182 532099 541166 549803 557757 564399 568755 570376 569629 566969 562390 555864 547974 539778
51758 539778 532263 526039 521308 517826 514975 512165 509251 506599 504730 503846 503566 503297 503003 503415 505222
51743 505222 508238 511738 515528 520148 526013 532888 540387 548496 557282 566369 574994 582315 587433 589562
51729 589562 588738 586356 584506 584596 586716 590262 594783 599955 604995 608529 609343 607258 603213 598592 594461
51714 594461 591294 589105 587706 587021 587262 588757 591649 595945 601864 609697 619007 628145 634956 638009 637158
51699 637158 633306 628100 623698 622077 624027 628820 634928 640964 645880 648600 647927 643082 634364 623235
51685 623235 611656 601203 592664 586163 581434 578031 575588 574024 573321 573005 572167 570280 567941 566570
51671 566570 567307 570232 574541 579436 584903 591732 600639 611343 622534 632627 640320 644590 644752 640865
51657 640865 633795 624732 614827 605266 597229 591478 588248 587508 588806 590817 591835 591179 589464 586939 582271
51642 582271 573808 561616 547431 532957 519079 506430 495569 486408 478378 471432 466261 463301 462155
51629 462155 462154 462866 463884 464830 465890 467740 470549 473510 475761 477296 478598 479758 480365 480016 478518 475806
51613 475806 472073 467887 463915 460567 458038 456519 456110 456623 457638 458735 459655 460425 461426 463237 466281
51598 466281 470719 476664 484382 494176 506150 519955 534651 548937 561736 572506 580917 586589 589617
51585 589617 591210 593307 597448 604371 614587 628769 647352 670127 696472 725795 757603 791255
51573 791255 825718 859609 891768 921936 950505 977229 1000681 1019675 1035156 1050204 1068568
51562 1068568 1093745 1128732 1174974 1231026 1293168 1357680 1421722 1481888 1533349 1571593 1594531
51551 1594531 1602301 1595709 1575647 1543329 1500030 1446706 1384692 1316528 1245295 1173175 1101333 1031170
51539 1031170 964875 904494 850958 804214 763889 729581 700798 676924 657288 641263 628271
51528 628271 617616 608323 599448 590634 582118 574108 566568 559768 554526 551356 549651 548192 546352 544441
51514 544441 543013 542221 541738 540972 539433 537104 534291 530974 526671 521248 515445 510111 505298 500751 496916
51499 496916 494540 493278 491630 488613 484898 481870 480118 479293 479038 479399 480348 481419 482041 482016 481495 480562
51483 480562 479045 476807 474104 471515 469486 468015 466713 465055 462734 460039 457813 456711 456493 456415 456287
51468 456287 456543 457216 457630 457539 457807 459231 461290 462974 464496 467155 471584 477167 483268 489950 497178 504326
51452 504326 511203 518855 528585 540599 554247 569295 586209 605311 626237 648102 669572 688716
51440 688716 703442 712564 716423 716535 714845 713126 712420 712529 712032 708931 701456 688678 670976 650146
51426 650146 628679 608573 590743 575480 563014 553388 546138 540608 536513 533862 532374 531436 530737
51413 530737 530588 531412 533192 535602 538428 541542 544606 547165 549112 550862 553039 556046 559934 564582 569947
51398 569947 576156 583263 590937 598626 606176 614142 623321 634137 646680 661149 677926 697313 719565
51385 719565 745244 775293 810738 852449 901152 957401 1021408 1092906 1170964 1253674 1338177
51374 1338177 1421309 1500135 1571539 1631579 1676051 1702135 1709284 1698461 1670934 1628023 1571504
51363 1571504 1503728 1427361 1345312 1260822 1177263 1097550 1023568 956049 895078 840804 793648
51352 793648 753728 720271 691845 667052 644777 624103 604577 586532 570569 556578 543770
51341 543770 531758 521015 512026 504512 497863 491893 486738 482423 478966 476598 475376 474766 474091 473276
51327 473276 472731 472507 471981 470477 467990 465275 463284 462505 462748 463558 464758 466426 468460 470570 472771 475489
51311 475489 478947 482747 486265 489235 491797 494239 496863 499757 502547 504621 505741 506107 505730 504249 501573
51296 501573 498220 494706 491018 487013 482784 478341 473484 468506 464418 461874 460326 458955 457993 458272 459766
51281 459766 461509 462944 464511 466723 469358 471767 473474 474345 474636 474991 476001 477675 479726 482304 485956
51266 485956 490762 496059 501120 505759 510156 514528 519082 523944 528920 533599 537684 540908 542711 542462
51252 542462 540106 536184 531133 524992 517921 510569 503670 497533 492090 487196 482752 478772 475409 472733
51238 472733 470483 468307 466230 464560 463386 462552 462108 462260 462853 463459 464149 465547 467812 470070 471338 471636
51222 471636 471688 471929 472334 473038 474390 476315 478233 479834 481554 483981 487076 490255 493066 495448 497472
51207 497472 499229 501048 503412 506467 509887 513439 517362 521817 526251 529901 532834 535853 539298 542561
51193 542561 545032 546812 548062 548276 546946 544664 542811 542176 542335 542371 541831 541017 540682 541378 542771 543765 543557
51176 543557 542391 540964 539474 537747 535904 534155 532143 529238 525602 522262 519986 518727 518278 518824 520488
51161 520488 522831 525206 527287 529007 530172 530412 529410 527128 523938 520464 517022 513297 508862 503830
51147 503830 498638 493420 488139 483181 479125 475938 473074 470444 468531 467411 466493 465606 465506 466747 468672
51132 468672 470251 471504 473324 476184 479694 483361 487109 490954 494760 498568 502765 507594 512661 517191
51118 517191 520740 523409 525370 526425 526323 525379 524398 523900 523780 523839 524259 525261 526736 528587 531052 534211
51102 534211 537508 540376 542974 545575 547516 547738 546320 544482 542870 540782 537462 533303 529211 525462
51088 525462 521863 518573 516135 514891 514788 515513 516474 516898 516357 515097 513703 512618 512104 512350 513415 515286
51072 515286 518041 521674 525886 530484 535891 542561 549891 556511 561893 566874 572304 578028 583610 589150
51058 589150 594672 599431 602623 604324 605060 604976 604207 603605 604221 606267 609278 613084 617919 623787 630536 638467
51042 638467 648204 659824 672610 685648 698332 710409 721955 733139 743610 752292 758091 760509
51030 760509 759195 753482 743142 729395 714345 699460 685060 671073 657662 645252 634615 626776
51018 626776 622101 619574 617741 616350 616337 618281 621774 626453 632709 640891 650428 660251 669708 678704 687326
51003 687326 695720 704145 712838 721805 730713 738873 745589 750895 755823 761446 767791 774190 780518 787366
50989 787366 795055 803376 812549 823704 837986 855695 876597 900431 926688 954331 982273 1009859
50977 1009859 1036639 1062052 1085705 1107614 1127903 1146659 1164350 1181858 1199590 1216918 1233035
50966 1233035 1248027 1262578 1276956 1291058 1305379 1321213 1339587 1360378 1382640 1405527 1428776
50955 1428776 1452459 1476369 1499526 1520455 1538223 1553150 1566276 1578282 1589378 1600233 1612392
50944 1612392 1627336 1645291 1665192 1685555 1704931 1721569 1733165 1737516 1733594 1722010 1704404 1682435
50932 1682435 1657282 1629888 1601302 1572491 1543737 1514415 1483571 1450822 1416589 1381466 1345511
50921 1345511 1308379 1270150 1231824 1194901 1160495 1128888 1099759 1072676 1047382 1023761 1001634
50910 1001634 980738 961030 942959 927223 914133 903277 893896 885411 877546 870216 863575 858099
50898 858099 854288 852094 850781 849413 847539 845442 843729 842704 842181 841954 842249 843443 845391 847414 849056
50883 849056 850482 852042 853858 856097 859227 863532 868626 873906 879317 885259 891932 899219 907086 915636
50869 915636 924874 934888 946121 958853 972510 986257 1000396 1016440 1035508 1057354 1081408 1108098
50857 1108098 1138487 1173046 1211550 1254013 1300997 1353019 1410233 1472728 1540631 1613740 1691460
50846 1691460 1773214 1858624 1947235 2038316 2130920 2223652 2314292 2400157 2479214 2550478 2613151
50835 2613151 2665846 2707191 2736919 2755764 2764505 2763764 2754891 2740426 2723354 2706233 2691120 2679822
50823 2679822 2673676 2673158 2677932 2687033 2698809 2710957 2721036 2726895 2726534 2717971 2699690 2671142 2632495
50810 2632495 2584198 2527171 2463113 2393895 2320685 2244271 2166232 2089137 2015393 1946430 1883195
50799 1883195 1826836 1778529 1739021 1708674 1687578 1675234 1670457 1672020 1679368 1692513 1711414 1735534
50787 1735534 1763674 1793931 1823977 1851633 1875229 1893703 1906774 1915000 1919126 1919241 1915021 1906792
50775 1906792 1895633 1882216 1866277 1847540 1826333 1802727 1775794 1744486 1708832 1669695 1627914
50764 1627914 1584390 1540483 1497337 1455091 1413606 1373724 1336923 1303917 1274450 1248342 1225818
50753 1225818 1206805 1190869 1177956 1168339 1161585 1156464 1152270 1149588 1149451 1152396 1158690 1168857 1183431
50740 1183431 1202512 1225868 1253177 1283996 1317894 1354850 1395140 1438642 1484634 1532487 1582115
50729 1582115 1633453 1685868 1738410 1790344 1841261 1890927 1939294 1986341 2031580 2073725 2110904
50718 2110904 2141038 2162269 2173628 2175510 2169252 2156224 2137685 2115400 2091659 2068368 2046605 2027316
50706 2027316 2011852 2001334 1995845 1994671 1997059 2002302 2009239 2016070 2020701 2021268 2016565 2006229 1990445
50693 1990445 1969509 1943920 1914851 1884108 1853423 1824027 1796946 1773315 1754210 1740514 1733000
50682 1733000 1732175 1737984 1750119 1768776 1794643 1828076 1868968 1917683 1975359 2042612 2118304 2200092
50670 2200092 2285779 2373510 2460953 2545028 2622696 2691820 2751448 2801641 2843007 2876231 2901999
50659 2901999 2921293 2935273 2944603 2949203 2948826 2943463 2932954 2916737 2894580 2867242 2836004 2801957
50647 2801957 2766372 2731437 2699786 2673224 2652395 2637627 2629452 2628153 2633333 2644122 2659412 2677788
50635 2677788 2697747 2718395 2739758 2762163 2785583 2809898 2835606 2863665 2894177 2925233 2953118
50624 2953118 2973462 2981932 2974193 2946569 2898115 2832352 2756426 2678102 2603425 2536438 2479718 2434337
50612 2434337 2399818 2374885 2358330 2349021 2345422 2345503 2346967 2347386 2344405 2336120 2321000 2297431 2264028
50599 2264028 2220893 2170007 2113699 2053014 1988159 1920167 1851273 1783764 1719261 1659047 1604118
50588 1604118 1554497 1509141 1467094 1428540 1394530 1365940 1342849 1324624 1310372 1299522 1292177
50577 1292177 1288825 1289673 1294453 1302799 1314484 1329174 1346349 1365663 1387079 1410331 1434469 1458270
50565 1458270 1481065 1502875 1523867 1544075 1563908 1584705 1608495 1637089 1671461 1711897 1758507
50554 1758507 1811386 1870443 1935142 2004278 2075855 2147293 2216116 2280486 2339127 2391119 2436295
50543 2436295 2475805 2511764 2546098 2580031 2614653 2651389 2691384 2734667 2780300 2827281 2875225
50532 2875225 2924537 2976339 3032074 3092825 3158957 3230515 3307756 3390953 3479715 3572698 3667862
50521 3667862 3762825 3855046 3941940 4020938 4089404 4144610 4183898 4204999 4206456 4188021 4150583
50510 4150583 4095483 4023927 3937409 3838535 3730919 3618214 3503752 3391096 3284108 3186040
50500 3186040 3099077 3025073 2966126 2923860 2898680 2890245 2898105 2921040 2955907 2997912 3042036 3083781
50488 3083781 3118801 3142590 3150898 3140332 3108908 3056553 2985095 2897382 2796422 2685532 2568827
50477 2568827 2450815 2335317 2224975 2121430 2025455 1937027 1855900 1782109 1715590 1655508
50467 1655508 1600574 1549947 1503276 1459993 1419319 1381102 1345955 1314330 1285961 1260426 1237707
50456 1237707 1217863 1200591 1185537 1172756 1162408 1154122 1147094 1140836 1135579 1131763 1129288 1127551 1126328
50443 1126328 1126251 1128033 1131372 1135186 1138934 1143089 1148148 1153977 1160645 1169187 1180806 1195731 1213503 1233955
50429 1233955 1257047 1282085 1308115 1335011 1363384 1393477 1425003 1458025 1493062 1530155 1568766
50418 1568766 1608903 1651533 1697536 1746911 1799399 1855227 1914696 1977430 2042455 2108779 2175653
50407 2175653 2242538 2308893 2373756 2435604 2493148 2546156 2594768 2637940 2673365 2699134 2714591
50396 2714591 2719204 2711564 2690333 2655606 2608586 2550323 2481630 2404152 2320860 2235394 2151128 2070689
50384 2070689 1995913 1928171 1868815 1819191 1780172 1751978 1734447 1726983 1728065 1735297 1746340 1759419
50372 1759419 1772729 1783824 1790068 1789380 1780303 1761900 1734147 1698178 1655670 1608170 1557206 1504552
50360 1504552 1451810 1399967 1349785 1302258 1258133 1217282 1179176 1143821 1111699 1082953 1057253
50349 1057253 1034345 1014144 996296 980230 965718 952908 941778 932014 923450 916078 909463 902673
50337 902673 895080 886909 878733 870739 862728 854586 846454 838561 831140 824432 818584 813566 809358 806184
50323 806184 804419 804205 805314 807480 810732 815249 820931 827425 834665 843108 853156 864559 876733 889541
50309 889541 903315 918079 933262 948299 963028 977282 990525 1002321 1012843 1022514 1031317 1038820
50297 1038820 1044802 1049403 1052622 1053953 1052683 1048487 1041707 1033071 1023067 1011705 999035 985887 973774
50284 973774 963945 956725 951833 949047 948468 950432 955364 963526 974787 988854 1005764 1025679 1048066
50271 1048066 1071448 1094102 1114455 1130616 1140322 1142188 1136845 1126386 1112996 1098556 1085090 1074511
50259 1074511 1067656 1063929 1061898 1059977 1056887 1052232 1046791 1041718 1037316 1033003 1028462 1024261 1021119 1019026
50245 1019026 1017433 1015983 1014768 1013958 1013414 1012690 1011418 1009758 1008288 1007233 1005955 1003584 1000107 996400 993166
50230 993166 990245 987134 983744 980379 977265 974377 971570 968620 965251 961357 957202 953231 949650 946292
50216 946292 942943 939744 937135 935236 933412 930813 927524 924794 923755 924143 924791 925275 926479 929449 934265
50201 934265 940364 947518 956070 966380 978564 992816 1009694 1029997 1054503 1083890 1118797 1159745
50189 1159745 1206865 1259667 1317210 1378655 1443561 1511418 1580817 1649329 1714398 1774388 1828960
50178 1828960 1878843 1925497 1970703 2015841 2061133 2105477 2146959 2183284 2211630 2228415 2229942
50167 2229942 2213858 2180125 2130555 2067650 1994136 1913376 1829514 1746817 1668913 1598596 1537869
50156 1537869 1487718 1447991 1417780 1395833 1380427 1369125 1359168 1348238 1334610 1316727 1293084
50145 1293084 1262877 1226723 1186656 1145385 1105409 1068529 1035921 1008461 986800 971111 960902
50134 960902 955154 952563 951772 951707 951912 952350 952728 952280 950386 947125 942920 937930 932122 925707 919015 912129
50118 912129 905133 898603 893314 889358 886087 883059 880608 879310 879316 880525 883047 887070 892365 898324 904549
50103 904549 911195 918632 926902 935693 944839 954562 964988 975623 985838 995922 1007074 1020009 1034173
50090 1034173 1048856 1064542 1082306 1102105 1122681 1143251 1164378 1186932 1211115 1237085 1265801
50079 1265801 1298495 1335752 1377890 1426001 1481835 1546642 1620676 1703878 1796427 1898339 2008724
50068 2008724 2125556 2245983 2366941 2485795 2600666 2710314 2814102 2912475 3007217 3100557
50058 3100557 3193606 3285644 3374652 3457857 3531456 3590262 3628388 3640746 3624283 3578445 3505063
50047 3505063 3407951 3292204 3163384 3026807 2887014 2747444 2610547 2478357 2352966 2236347
50037 2236347 2129816 2033994 1949385 1876693 1816239 1767143 1727360 1694534 1666647 1641983 1619001
50026 1619001 1596653 1574745 1553694 1533857 1515136 1497034 1478860 1459968 1440084 1419467 1398567
50015 1398567 1377493 1356043 1334374 1313423 1294387 1277739 1262805 1248325 1233418 1218164 1203475
50004 1203475 1190571 1180577 1174383 1172408 1174142 1177968 1181827 1184282 1184882 1183577 1180135 1174329 1166373 1156725
49990 1156725 1145467 1132172 1116516 1098872 1080199 1061526 1043611 1026979 1012093 999491 989703
49979 989703 982880 978500 975686 974043 974070 976479 981228 987554 994973 1003810 1014547 1026989 1040485 1054833
49965 1054833 1070600 1088586 1109289 1132954 1159802 1190062 1223985 1261971 1304517 1351888 1403957
49954 1403957 1460524 1521672 1587543 1657703 1730793 1804908 1878406 1950479 2020871 2088912 2152767
49943 2152767 2209788 2257756 2295917 2325163 2347610 2366001 2382971 2400130 2417391 2432879 2443309
49932 2443309 2444633 2432825 2404652 2358103 2292549 2209042 2110663 2002308 1889678 1778118 1671953
49921 1671953 1574231 1486575 1409279 1341779 1283233 1232857 1190058 1154427 1125517 1102660 1085261
49910 1085261 1073263 1066957 1066125 1069706 1076428 1085375 1095676 1106143 1115780 1124388 1132032 1138049 1141207
49897 1141207 1140915 1137633 1131784 1122712 1109150 1090620 1068096 1043357 1017863 992192 966403 940835
49885 940835 916437 894243 874528 856664 839788 823443 807523 791910 776511 761694 748358
49874 748358 737326 728677 721897 716674 713275 711961 712293 713397 715000 717889 723266 731811 743403 757483
49860 757483 773522 791220 810395 830670 851323 871516 890507 907452 921311 931399 937991 941933
49848 941933 943675 943093 940069 934512 925695 912461 894631 873683 851686 830018 809502 791113 775807
49835 775807 763865 754889 748202 743015 738709 735494 734395 736105 740231 746181 754170 764634 777175
49822 777175 791012 806178 823287 842151 861444 879677 895827 909181 919494 927316 933430 937937
49810 937937 940582 941704 941785 940033 934620 924772 911715 897205 882024 866430 851163 837185 824962
49797 824962 814586 806160 799545 794166 789696 786558 785216 785246 785698 786220 787362 789832 793669 798165 802432
49782 802432 806221 810143 814793 819770 824108 827841 832541 840048 851024 864835 880080 894913 907542
49769 907542 917083 923677 927487 928190 925842 921569 916636 911128 904132 894881 883109 868679 851712 833057
49755 833057 813909 794861 775756 756570 738022 721204 706831 694866 684678 675650 667855 662008
49743 662008 658596 657273 657302 658288 660156 662695 665599 668807 672439 676502 680934 685796 691120 696771 702790
49728 702790 709736 718325 728838 741144 755023 770024 785160 799259 811668 822347 831308 838273
49716 838273 842917 845201 845392 843844 840672 835577 828159 818474 807072 794451 780829 766612 752602
49703 752602 739452 727326 716362 707038 699644 693834 689286 686385 685649 686753 688813 691448 694902 699252
49689 699252 704200 709627 715695 722343 729321 736754 745108 754462 764423 774973 786784 800410 815587
49676 815587 831609 847917 863949 878681 890746 898961 902737 902337 898967 894247 889138 883355 875963
49663 875963 866440 854975 841928 827396 811394 794295 776848 759796 743572 728424 714666 702606
49651 702606 692247 683258 675254 667953 661151 654905 649794 646577 645345 645271 645359 645156 644606 643732 642756 642062
49635 642062 641556 640484 638368 635736 633340 631017 628168 625082 622806 621568 620290 618061 615363 613287
49621 613287 612034 610826 609107 607214 605763 604802 603886 602908 602515 603428 605420 607382 608524 609138 609896 610825
49605 610825 611443 611601 611601 611576 611323 610785 610234 609957 610095 610751 611779 612571 612551 611929 611426 611289 611144 610855 610809 611145
49585 611145 611374 611220 611359 612735 615382 618399 620947 622930 624718 626590 628582 630844 633963 638716 645338
49570 645338 653216 661581 670366 680054 690819 702277 714029 725909 737580 748335 757534 764877 770163
49557 770163 773160 773864 772496 769099 763576 756384 748810 742215 737125 733186 729649 725775 721210 716329
49543 716329 711998 708749 706390 704521 703076 702107 701402 700709 700166 700206 701157 703136 706149 710119 715038 721309
49527 721309 729615 740164 752273 765010 778023 791398 804885 817637 828754 837855 845190 851427
49515 851427 857291 863170 869041 874774 880324 885491 889671 892084 892138 889414 883558 874541 863065 850360
49501 850360 837492 824930 812830 801526 791581 783344 776593 770814 765847 762058 759762 758662 758057
49488 758057 757388 756318 754563 752204 750055 749142 749617 750662 751579 752509 753919 755924 758403 761309 764419
49473 764419 767242 769664 772465 776697 782638 789651 796916 803961 810670 817145 823485 829381 834005 836544
49459 836544 836788 835051 831699 826962 820978 813749 805267 795996 786977 779049 772064 765190 757847 750113
49445 750113 742450 735469 729774 725562 722405 719759 717677 716705 717235 719283 722738 727314 732431 737693 743433
49430 743433 750183 757681 765155 772733 781641 792536 804323 815271 824699 832628 838082 838880 833626 823374
49416 823374 810984 799165 789336 781897 776869 774171 773715 775453 779261 784729 791313 798808 807522 817763
49402 817763 829329 841705 854692 868467 883000 897777 912248 926254 939707 952081 962658
49391 962658 971233 978163 983645 987244 988302 986612 982489 976401 968704 959650 949427 938339 927162
49378 927162 917205 909642 904715 901816 900434 900748 903136 907473 913328 920663 929786 940467 951480 961284
49364 961284 968916 974058 976495 976017 972831 967762 961842 955836 950187 945264 941450 938910 937311 935861
49350 935861 933836 931110 928115 925300 922772 920456 918264 915939 912975 908936 903697 897196 889229 879808
49336 879808 869638 859818 851140 843856 837947 833270 829512 826359 823710 821535 819698 818269 817765 818618
49322 818618 820485 822613 824788 827378 830540 834044 837938 842650 848157 853707 858686 863195 867472 871332
49308 871332 874633 877741 881050 884476 887936 891866 896636 901786 906515 910703 914774 918733 922036 924370
49294 924370 925842 926329 925396 923144 920578 918665 917317 915656 913096 909862 906635 904000 902247 901351 901031
49279 901031 900992 901362 902850 906224 911484 917748 924275 931419 940205 950924 962650 974335 985926 998020
49265 998020 1010693 1023266 1035233 1047058 1059932 1074917 1092494 1112881 1136581 1164162 1195170
49254 1195170 1227459 1258193 1285561 1308993 1327669 1339739 1343645 1339711 1329736 1315388 1297715 1277893
49242 1277893 1257462 1237573 1218559 1200395 1183194 1167328 1153630 1143476 1138001 1136974 1138893 1142298
49230 1142298 1146431 1150525 1153214 1153356 1151141 1147915 1145020 1143080 1142183 1142224 1143016 1144334 1145885 1147155 1147436
49215 1147436 1146233 1143688 1140457 1137318 1135018 1134381 1136186 1140773 1147918 1157204 1168514 1182176 1198676
49202 1198676 1218272 1240738 1265309 1290842 1316178 1340448 1363027 1383126 1399618 1411531 1418754
49191 1418754 1422043 1422273 1419928 1415399 1409453 1403178 1397573 1393416 1391354 1391861 1395192 1401625 1411715 1426115
49177 1426115 1445273 1469533 1499316 1534683 1574528 1616367 1656964 1692971 1721154 1738678 1743934
49166 1743934 1737358 1721428 1699798 1676230 1653881 1634952 1620488 1610421 1604092 1601116 1601697 1605891
49154 1605891 1612723 1620572 1628568 1637150 1646941 1657525 1667781 1677134 1685840 1694169 1701858 1708432 1713655
49141 1713655 1717598 1720643 1723466 1726666 1730364 1734432 1739069 1744712 1751319 1758212 1764802 1771129 1777563 1784366
49127 1784366 1791768 1800082 1809413 1819487 1830029 1841102 1852833 1865118 1877912 1891608 1906769 1923671
49115 1923671 1942460 1963667 1988144 2016500 2049035 2086196 2128556 2175994 2227203 2280254 2333391
49104 2333391 2385032 2433452 2477239 2515896 2549004 2574204 2586767 2582388 2560921 2527113 2487474
49093 2487474 2446453 2405159 2362756 2318501 2272909 2227799 2185571 2148246 2116914 2091720 2072015
49082 2072015 2056563 2044150 2034283 2026993 2021736 2016886 2010768 2002952 1994181 1985324 1976882 1969287 1962940
49069 1962940 1957873 1953825 1950743 1948794 1947786 1947048 1946131 1945363 1945498 1947006 1949754 1953141 1956413 1959110 1961359
49054 1961359 1963589 1965864 1967716 1968726 1969087 1969518 1970789 1973393 1977443 1982718 1988943 1996180 2004876 2015496
49040 2015496 2028173 2042762 2059139 2077401 2097793 2120393 2144812 2170244 2195798 2220588 2243368
49029 2243368 2262474 2276515 2285093 2288672 2288080 2284499 2279633 2275096 2271486 2268521 2266080 2264591 2264348 2265143
49015 2265143 2266913 2270203 2275555 2282834 2291607 2301851 2313822 2327406 2342140 2357773 2374413 2392108
49003 2392108 2410700 2430010 2449814 2469516 2488265 2505563 2521556 2536528 2550257 2562106 2571688
48992 2571688 2579261 2585425 2590534 2594509 2597160 2598554 2598966 2598482 2596773 2593362 2588107 2581363 2573586 2564816
48978 2564816 2554696 2543004 2530055 2516434 2502485 2488331 2474326 2461107 2449074 2438054 2427723
48967 2427723 2418152 2409800 2403133 2398417 2395667 2394678 2395339 2398042 2403442 2411525 2421321 2431981 2443840 2457882
48953 2457882 2474277 2492009 2509879 2527286 2544020 2559844 2574607 2588414 2601562 2614567 2628294
48942 2628294 2643689 2661276 2681180 2703597 2728768 2756427 2785789 2816394 2848598 2883027 2919863
48931 2919863 2958862 2999722 3042147 3085922 3131353 3179422 3231102 3286515 3345003 3405897 3468833
48920 3468833 3533233 3597743 3660509 3720145 3776547 3830766 3884175 3937724 3991844 4046608 4101683
48909 4101683 4156365 4210100 4262971 4315421 4367579 4419132 4469703 4518959 4566409 4611604 4654659
48898 4654659 4696145 4736380 4775103 4811902 4846550 4878914 4909019 4937385 4964722 4990979 5015090
48887 5015090 5036018 5053759 5068994 5082015 5092418 5099595 5103016 5101919 5095028 5080838 5058299 5027318
48875 5027318 4988627 4943070 4891151 4833453 4771307 4706603 4640836 4574700 4508565 4442897 4377994
48864 4377994 4313747 4250060 4187315 4126138 4066871 4009438 3953632 3899385 3846888 3796468 3748149
48853 3748149 3701496 3656182 3612719 3572131 3534839 3500388 3468478 3439716 3414905 3393927 3375753
48842 3375753 3359419 3344652 3331697 3320874 3312258 3305646 3300853 3298103 3297983 3301015 3307448 3317331 3330401
48829 3330401 3345920 3363103 3381829 3402486 3425070 3449024 3474115 3500826 3529526 3559829 3591192
$$ [...]
##END NTUPLES=NMR SPECTRUM
##END=
