##TITLE=AC1714_3158_8749746_dLcrRJoP4r
##JCAMPDX= 6.0         $$ Bruker NMR JCAMP-DX V2.0
##DATA TYPE= NMR SPECTRUM
##DATA CLASS= NTUPLES
##ORIGIN= BRUKER
##OWNER= Administrator
$$ 1.72 TOPSPIN		Version 2.1
$$ 2015-08-11 19:53:24.632 -0700  Administrator@X
$$ Compression mode = diff/dup
##.OBSERVE FREQUENCY= 400.02188249412
##.OBSERVE NUCLEUS= ^1H
##.ACQUISITION MODE= SIMULTANEOUS (DQD)
##.ACQUISITION SCHEME= undefined
##.AVERAGES= 8
##.DIGITISER RES= 22
##SPECTROMETER/DATA SYSTEM= spect
##.PULSE SEQUENCE= zg30
##.SOLVENT NAME= COFFEE_meoh
##.SHIFT REFERENCE= INTERNAL, COFFEE_meoh, 1, 14.98509
##AUDIT TRAIL= $$ (NUMBER, WHEN, WHO, WHERE, PROCESS, VERSION, WHAT)
$$ ##TITLE= Audit trail, TOPSPIN		Version 2.1
$$ ##JCAMPDX= 5.01
$$ ##ORIGIN= Bruker BioSpin GmbH
$$ ##OWNER= Administrator
$$ $$ E:\/data/COFFEE/nmr/AC1714_3158_8749746_dLcrRJoP4r/60/pdata/1/auditp.txt
$$ ##AUDIT TRAIL=  $$ (NUMBER, WHEN, WHO, WHERE, PROCESS, VERSION, WHAT)
(   1,<2015-08-11 19:53:17.195 -0700>,<Administrator>,<X>,<go>,<TOPSPIN 2.1>,
      <created by zg
	started at 2015-08-11 19:52:11.429 -0700,
	POWCHK enabled, PULCHK disabled,
       configuration hash MD5:
       21 0F 79 D6 B3 7B B4 F6 88 20 88 DB 03 48 BD 9F
       data hash MD5: 64K
       C5 32 D2 7F D1 8B 3D DD E5 89 78 45 87 2F 8E FF>)
(   2,<2015-08-11 19:53:20.539 -0700>,<Administrator>,<X>,<proc1d>,<TOPSPIN 2.1>,
      <Start of raw data processing
       efp LB = 0 FT_mod = 6 PKNL = 1 PHC0 = 0 PHC1 = 0 SI = 32K 
       data hash MD5: 32K
       8B 8A 2D E0 07 E3 34 B4 99 0D 71 7C B8 C5 BA 98>)
(   3,<2015-08-11 19:53:20.820 -0700>,<Administrator>,<X>,<proc1d>,<TOPSPIN 2.1>,
      <pk PHC0 = 87.86865 PHC1 = 0 
       data hash MD5: 32K
       8F 63 90 6C DC F5 53 7A 28 19 87 10 67 2F 6F 19>)
(   4,<2015-08-11 19:53:20.929 -0700>,<Administrator>,<X>,<proc1d>,<TOPSPIN 2.1>,
      <abs ABSG = 1 
       data hash MD5: 32K
       03 01 AC 19 ED 0C 26 63 41 F1 65 5A 82 C6 02 20>)
(   5,<2015-08-11 19:53:21.007 -0700>,<Administrator>,<X>,<proc1d>,<TOPSPIN 2.1>,
      <abs ABSG = 2 
       data hash MD5: 32K
       6D 44 25 7C 65 A8 CF A9 E9 2A 4E E6 B8 D7 F7 48>)
(   6,<2015-08-11 19:53:21.054 -0700>,<Administrator>,<X>,<proc1d>,<TOPSPIN 2.1>,
      <abs ABSG = 3 
       data hash MD5: 32K
       61 A1 B8 F8 4E F8 74 A5 F2 D1 D3 ED 40 17 56 83>)
(   7,<2015-08-11 19:53:21.117 -0700>,<Administrator>,<X>,<proc1d>,<TOPSPIN 2.1>,
      <abs ABSG = 4 
       data hash MD5: 32K
       82 08 DD A3 44 9E 76 7B 97 60 0E 73 32 8A 70 AF>)
(   8,<2015-08-11 19:53:21.179 -0700>,<Administrator>,<X>,<proc1d>,<TOPSPIN 2.1>,
      <abs ABSG = 5 
       data hash MD5: 32K
       E1 88 FF 17 29 46 09 39 F1 34 D3 B1 3D 59 2C 57>)
$$ ##END=
$$ 
$$ $$ hash MD5
$$ $$ 53 90 EF D9 0D F2 FF 22 D3 2D 3D 7D FC 44 F2 31
##$RELAX= 
##$RELAX= 
##$RELAX= 
##$RELAX= 
##$RELAX= 
##$RELAX= 
##$RELAX= 
$$ Bruker specific parameters
$$ --------------------------
##$DU= <E:\>
##$EXPNO= 60
##$NAME= <AC1714_3158_8749746_dLcrRJoP4r>
##$PROCNO= 1
$$ [...]
##$TP= (0..7)
150 150 150 150 150 150 150 150
##$TP07= 0
##$TPNAME0= <>
##$TPNAME1= <>
##$TPNAME2= <>
##$TPNAME3= <>
##$TPNAME4= <>
##$TPNAME5= <>
##$TPNAME6= <>
##$TPNAME7= <>
##$TPOAL= (0..7)
0.5 0.5 0.5 0.5 0.5 0.5 0.5 0.5
##$TPOFFS= (0..7)
0 0 0 0 0 0 0 0
##$TUNHIN= 0
##$TUNHOUT= 0
##$TUNXOUT= 0
##$USERA1= <user>
##$USERA2= <user>
##$USERA3= <user>
##$USERA4= <user>
##$USERA5= <user>
##$V9= 5
##$VALIST= <valist>
##$VCLIST= <CCCCCCCCCCCCCCC>
##$VD= 0
##$VDLIST= <DDDDDDDDDDDDDDD>
##$VPLIST= <PPPPPPPPPPPPPPP>
##$VTLIST= <TTTTTTTTTTTTTTT>
##$WBST= 2048
##$WBSW= 25
##$XGAIN= (0..3)
0 0 0 0
##$XL= 0
##$YL= 0
##$YMAX_a= 594045
##$YMIN_a= -518228
##$ZGOPTNS= <>
##$ZL1= 120
##$ZL2= 120
##$ZL3= 120
##$ZL4= 120
##$ABSF1= 14.98509
##$ABSF2= -5.573092
##$ABSG= 5
##$ABSL= 3
##$ALPHA= 0
##$AQORDER= 0
##$ASSFAC= 0
##$ASSFACI= 0
##$ASSFACX= 0
##$ASSWID= 0
##$AUNMP= <proc_prof1d_extract_pilot.lims>
##$AXLEFT= 0
##$AXNAME= <>
##$AXNUC= <1H>
##$AXRIGHT= 0
##$AXTYPE= 0
##$AXUNIT= <>
##$AZFE= 0.1
##$AZFW= 0.1
##$BCFW= 0
##$BC_mod= 0
##$BYTORDP= 0
##$COROFFS= 0
##$CY= 15
##$DATMOD= 1
##$DC= 0
##$DFILT= <>
##$DTYPP= 0
##$F1P= 0
##$F2P= 0
##$FCOR= 0.5
##$FTSIZE= 32768
##$FT_mod= 6
##$GAMMA= 0
##$GB= 0
##$INTBC= 1
##$INTSCL= 1
##$ISEN= 128
##$LB= 0
##$LEV0= 0
##$LPBIN= 0
##$MAXI= 10000
##$MC2= 0
##$MEAN= 0
##$ME_mod= 0
##$MI= 0
##$NCOEF= 0
##$NC_proc= -8
##$NLEV= 6
##$NOISF1= 0
##$NOISF2= 0
##$NSP= 0
##$NTH_PI= 0
##$NZP= 0
##$OFFSET= 14.98509
##$PC= 1
##$PHC0= 87.86865
##$PHC1= 0
##$PH_mod= 1
##$PKNL= yes
##$PPARMOD= 0
##$PPDIAG= 0
##$PPIPTYP= 0
##$PPMPNUM= 2147483647
##$PPRESOL= 1
##$PSCAL= 4
##$PSIGN= 0
##$PYNMP= <proc.py>
##$REVERSE= no
##$SF= 400.02
##$SI= 32768
##$SIGF1= 0
##$SIGF2= 0
##$SINO= 400
##$SIOLD= 32768
##$SPECTYP= <>
##$SREGLST= <1H.CDCl3>
##$SSB= 0
##$STSI= 32768
##$STSR= 0
##$SW_p= 8223.68421052631
##$SYMM= 0
##$S_DEV= 0
##$TDeff= 65536
##$TDoff= 0
##$TI= <>
##$TILT= no
##$TM1= 0
##$TM2= 0
##$TOPLEV= 0
##$USERP1= <user>
##$USERP2= <user>
##$USERP3= <user>
##$USERP4= <user>
##$USERP5= <user>
##$WDW= 1
##$XDIM= 32768
##$YMAX_p= 445900098
##$YMIN_p= -684086
##$CURPLOT= <Network HP LaserJet P1505>
##$CURPRIN= <$Network HP LaserJet P1505>
##$DFORMAT= <normdp>
##$LAYOUT= <+/1D_H.xwp>
##$LFORMAT= <normlp>
##$PFORMAT= <normpl>
##$SURQMSG= 1
$$ End of Bruker specific parameters
$$ ---------------------------------
##NTUPLES= NMR SPECTRUM
##VAR_NAME=  FREQUENCY,     SPECTRUM/REAL,   SPECTRUM/IMAG
##SYMBOL=    X,             R,               I
##VAR_TYPE=  INDEPENDENT,   DEPENDENT,       DEPENDENT
##VAR_FORM=  AFFN,          ASDF,            ASDF
##VAR_DIM=   32768,         32768,           32768
##UNITS=     HZ,            ARBITRARY UNITS, ARBITRARY UNITS
##FACTOR=    0.250966925370066, 1,           1
##FIRST=     8223.43324360094, -6352,        146121
##LAST=      0,             28690,           -8048
##MIN=       0,             -684086,         0
##MAX=       8223.43324360094, 445900098,    0
$$ Real data points
##PAGE= N=1
##DATA TABLE= (X++(R..R)), XYDATA
$$ [...]
$$ plain form
19545 -156037 -647 -149707 -426209 219918 180663 245601 -123270 -54218 -252250 -214838 -217397
19534 -217397 -263746 -232402 -164067 252535 -336534 115240 -274128 195012 -46743 -430680
19524 -430680 216883 -188231 -235359 -77627 260752 24463 -279149 47772 -154577 -2082 -54382
19513 -54382 58898 51672 -51044 -165430 -66523 120921 10799 -180131 -173502 263411 -25977
19501 -28060 -101888 -74314 157555 51247 -16598 -307188 147923 -29671 -13311 -106930 -98560
19490 -98560 -44668 -251053 -237570 -102821 25171 -192803 199860 -197924 -212848 -35808 -51114
19479 -51114 -156167 -408160 121866 -104334 306595 -89495 23510 85139 23126 -213690
19468 -96959 90720 272323 -20091 -247977 -219579 -71877 -183582 46196 206453 10182 -129550
$$ packed form
19545a56037f47j49060k76502B19918l9255O4938a23270e4218j98032L7412k559
19534b17397m6349L1344O8335B52535c36534A15240b74128A95012d6743l83937
19524d30680B16883a88231m7128g7627B60752B4463b79149D7772a54577b082n2300
19513e4382E8898p226e1044j14386f6523A20921A0799a80131O629B63411b5977
19501b8060p3828K7574A57555E1247a6598k90590A47923b9671a3311r3619Q370
19490i8560d4668k06385J3483a02821B5171a92803A99860a97924j4924c5808j5306
19479e1114j05053k51993A21866a04334C06595h9495B3510O1629B3126b13690
19468i6959I0720J81603b0091k27886K8398g1877j11705D6196J60257A0182a29550
$$ plain form
19456 -319354 -176385 -71437 -285019 -72295 -128035 -285762 51301 -193044 -135191 103251
19445 58583 166795 -192115 42334 -212470 -27179 196571 -238120 -321207 -91861 -146638 -33244
19433 -82409 122623 99382 456132 -161067 -277010 -18090 63330 -92825 49653 230868 -208553
19421 -52186 -39371 81586 229886 -64218 4259 -219268 -163004 -115301 -8181 -369428 -25006
19409 -86808 -210707 -221715 -58536 52640 -230567 -238777 366791 125629 -203115 276078 53435
19397 -193815 139428 127306 -266913 -227839 13553 -182328 -55429 -317009 20048 -121334
19386 -300258 -78695 -93110 313340 -67269 -4109 -238567 -193729 301415 36116 -183850 3026
19374 41715 -68856 184402 -54233 -80364 -77569 -533892 240450 86227 -235255 -265221 -314036
$$ packed form
19456c19354J42969g1437k13582g2295n5740j57727E1301a93044N7853A03251
19445E8583J08212a92115D2334b12470b7179A96571b38120q3087i1861n4777c3244
19433h2409A22623k3241L56750a61067j15943a8090F3330i2825D9653J81215b08553
19421e2186J2815H1586J48300f4218D259b19268N6264M7703h181l61247b5006
19409h6808j23899j1008e8536E2640b30567q210C66791A25629b03115B76078E3435
19397a93815A39428j2122b66913L9074A3553a82328e5429k61580B0048a21334
19386c00258g8695j4415C13340f7269d109k34458M4838C01415C6116a83850C026
19374D1715f8856A84402e4233k6131K795m56323B40450H6227b35255k9966m8815
$$ plain form
19363 -314036 52546 -157755 60808 169163 -263803 -297508 244074 -11783 -496489 231215
19352 -478827 34479 -406591 14703 -27461 25586 32527 -266247 -143245 -69716 -84020 -415849
19341 -415849 222154 246286 97060 3314 71389 187225 -199831 148506 -87293 -15768 -84710
19330 -84710 203597 35237 -179839 -84585 136733 158509 148203 -133488 -286175 -258437 -191232
19319 -191232 -123883 -330950 -71941 -141650 -395749 82639 -275455 -285649 -188244 215501 97727
19307 68596 -72240 425597 -289631 -274647 -249799 -276838 -34460 -94405 367274 -179707 -9620
19295 -250290 -65329 -335754 -111803 47674 108757 -179107 -22536 -178623 -160141 -281207
19285 -281207 -229863 197339 -11373 178847 -244041 196616 112699 184360 -241006 -76183
$$ packed form
19363c14036E2546a57755F0808J08355b63803l3705B44074a1783m84706B31215
19352d78827C4479d06591A4703b7461B5586O941b66247J23002f9716j4304l31829
19341d15849B22154K4132I7060C314O8075J15836a99831A48506h7293a5768o8942
19330h4710B03597C5237a79839h4585A36733K1776j0306a33488j52687K7738O7205
19319a91232O7349k07067g1941o9709k54099H2639b75455j0194R7405B15501I7727
19307F8596g2240D25597b89631J4984K4848k7039c4460n9945C67274a79707i620
19295b50290f5329k70425a11803D7674O1083a79107b2536j56087J8482j21066
19285b81207N1344A97339a1373A78847b44041A96616q3917P1661b41006g6183
$$ plain form
19274 -372809 -153020 453861 124005 -137702 74754 -305173 -196521 -129432 105714 24580
19263 15887 -98326 112395 -183241 -28491 112955 -39789 90809 -117264 89443 -278168 -347168
19252 -347168 34246 -29811 -54428 -167426 -319416 77044 -193822 -81990 -62420 -294416 -275466
19241 -275466 -88046 171038 -942 -177827 -256428 -172238 -72174 -228685 373542 -43966 -52022
19230 -52022 -250090 54102 -6027 -86403 -181203 -101985 -17018 -251326 -241120 -251330 -214545
19219 -214545 -165244 57849 -97088 -431817 -134690 -544816 180582 -207135 -96439 -57118
19209 -57118 5756 -185536 175643 -359703 136702 -187802 -247285 -123198 323551 -56157
19198 -82725 -168285 -120549 91685 -200722 -120169 -161898 96786 -279067 -146869 -154908 -162578
$$ packed form
19274c72809a53020D53861A24005a37702G4754c05173J08652O7089A05714B4580
19263A5887i8326A12395a83241b8491A12955c9789I0809a17264H9443b78168o9000
19252c47168C4246b9811k4617j12998j51990G7044a93822h1990J9570k31996J8950
19241b75466h8046A71038i42j76885p8601Q4190g2174j56511C73542d3966q056
19230e2022j98068E4102f027q0376r4800P9218a7018k34308J0206j0210L6785
19219b14545M9301E7849i7088l34729a34690m10126A80582b07135i6439L9321
19209e7118E756a85536A75643c59703A36702a87802n9483a23198C23551e6157
19198h2725q5560M7736I1685b00722Q0553m1729I6786b79067J32198q039p670
$$ plain form
19187 -162578 -90015 -129889 -84940 -204492 -60520 -52973 238408 10774 272023 88054 -96155
19175 -150757 -170826 -56235 -274390 70514 52735 -44240 -10423 -119512 -131958 -121569 151417
19163 -135622 -217573 93805 167725 -328484 -321829 -282464 481682 264603 159375 -354321 -117331
19151 -79420 128002 79910 148218 -70233 -119802 -151842 -192042 -193068 -18177 -122673 5511 -325661
19138 -226571 -86590 -49408 132599 -16774 -19970 150649 -22384 -146653 21136 -193464 -257274
19127 -257274 40414 -267150 203223 -360148 -197415 -396927 -348670 225767 207169 103274
19116 -7984 87525 -76524 -415439 -103366 -21798 80655 65034 -159331 -230029 129058 -127000
19104 -312162 -15489 -93804 163782 26442 -257092 253559 23437 46718 -94971 -97422 -47906
$$ packed form
19187a62578P2563l9874M4949j19552f0520P547B38408A0774K61249H8054i6155
19175a50757k0069e6235k18155G0514j7779d4240a0423j09089j2446J0389A51417
19163a35622q1951I3805P3920c28484O655L9365D81682k17079j05228c54321a17331
19151g9420A28002m8092O8308g0233m9569l2040m0200j026a8177j04496E511c25661
19138b26571h6590L7182A32599a6774l196A50649b2384j24269B1136a93464o3810
19127b57274D0414b67150B03223c60148J62733j99512M8257B25767j8598A03274
19116g984H7525g6524l38915a03366b1798H0655j5621a59331p0698A29058a27000
19104c12162a5489p8315A63782B6442b57092B53559B3437K3281i4971k451d7906
$$ plain form
19092 346717 73839 -190163 -144977 303533 -89448 -50285 -106737 61972 -225584 -512199 -241049
19080 -128663 -331871 -120025 283238 -23433 119805 -266747 -239868 -181434 -58986 -26150
19069 -158504 -112939 -274992 -47278 -112399 128548 84393 -100197 -126633 -118462 -9962 47547
19057 104462 -54765 -6052 -220225 -61801 -403877 -168238 -174729 47522 -219904 -88839 55951
19045 97894 -73061 30083 -123270 -253158 -97195 -144780 167082 -23824 -100031 44421 -64510
19033 -11521 61445 -94616 -88549 -546 -79518 182623 -31871 -151628 301880 -65936 45678 182638
19021 182638 -203229 -14794 -25954 -165128 49394 257445 67842 -113538 4240 -118069 50962
19009 -126097 -195164 138089 156729 -13660 103807 -141796 141016 -157948 -212239 -1825 -167648
$$ packed form
19092C46717G3839a90163M5186C03533h9448L9163n6452F1972b25584k86615b41049
19080a28663k03208a20025B83238b3433A19805b66747K6879N8434e8986b6150
19069a58504M5565j62053d7278o5121A28548m4155a00197k6436Q171i962D7547
19057A04462e4765f052k14173f1801l42076a68238o491D7522b19904h8839E5951
19045I7894g3061C0083a23270j29888i7195m7585A67082b3824p6207D4421f4510
19033a1521F1445i4616O067e46p8972A82623c1871j19757C01880f5936D5678J36960
19021A82638b03229a4794j1160j39174D9394K08051F7842a13538D240a18069E0962
19009a26097o9067A38089J8640a3660A03807a41796A41016a57948n4291a825j65823
$$ plain form
18998 -167648 84226 -69382 -8700 80691 -89036 -315200 -31449 -223552 88655 56893 -1440
18986 131204 86147 4039 -174941 161578 -47470 -160787 -214957 -14400 63576 -271561 235754
18974 115871 99848 -224383 -156806 278150 -56664 -296578 -176488 82038 -62503 -382950
18964 -382950 32383 226613 184255 -18647 -217485 -151279 -110466 -27851 -12972 -85142 -94852
18953 -94852 4023 -267521 58598 -67554 -237233 -108571 -95760 -23113 -166997 148334 96779
18942 96779 -52528 75077 16876 37386 -55324 160593 115336 -39977 -152677 2424 82790
18931 82790 -113199 -118380 133538 -346412 -118860 -205118 25095 -558442 -138304 164780
18920 122350 44596 -370557 -220921 60071 -103970 32830 -441307 -440978 -18361 379241 -19996
$$ packed form
18998a67648H4226f9382h700H0691h9036k26164c1449j92103H8655l1762a440
18986A31204m5057D039a74941A61578d7470j13317n4170a4400F3576b71561B35754
18974A15871j6023b24383O7577B78150e6664k39914J20090H2038f2503l20447
18964c82950C2383J94230m2358a8647j98838O6206M0813b7851a2972p2170r710
18953i4852D023b67521E8598f7554j69679a08571J2811b3113j43884A48334n1555
18942I6779e2528G5077A6876K0510e5324A60593m5257c9977j12700B424Q0366
18931H2790a13199n181A33538c46412a18860q6258B5095e58442a38304A64780
18920A22350D4596c70557J49636F0071a03970C2830d41307L29a8361C79241a9996
$$ plain form
18908 96512 280733 -41419 162859 334338 208962 -36660 -104041 36396 -18177 -149581 -46642
18896 -344778 47590 -128738 -308711 100917 -136993 211261 12731 -149363 362313 -351640
18885 131039 -162557 -178376 3624 414892 229431 -305509 -307209 25326 -238282 -279321 -19794
18873 -234209 137721 -244575 53118 -202726 143329 -35428 -307078 242532 -38470 -383652
18863 -383652 -159638 -222290 123620 -154042 248 32133 -302950 159340 91513 144420 -21234
18851 -26452 -91510 -260788 322286 207444 66447 -137155 -146016 -437244 -99687 146877 73906
18840 73906 -96641 93145 -258461 44600 -94436 98128 47070 99161 -56142 92656 60147
18829 60147 -95343 -279043 -130103 -27628 35853 -208136 153445 -62457 204364 -110347
$$ packed form
18908I6512J84221d1419A62859J71479j25376c6660o7381C6396a8177j31404d6642
18896c44778D7590a28738j79973A00917a36993B11261A2731a49363C62313c51640
18885A31039a62557j5819C624M11268j85461c05509j700B5326b38282m1039a9794
18873b34209A37721b44575E3118b02726A43329c5428k71650B42532c8470l45182
18863c83652a59638o2652A23620a54042B48L1885c02950A59340o7827N2907b1234
18851b6452o5058j69278C22286j14842F6447a37155q861k91228i9687A46877p2971
18840G3906i6641I3145b58461D4600i4436I8128D7070N2091e6142I2656l2509
18829F0147i5343j83700a30103b7628C5853b08136A53445f2457B04364a10347
$$ plain form
18818 -254250 176642 135698 -318168 -127912 23611 218859 -90164 15501 -20506 315038
18807 36259 -96939 -210070 89656 -287337 27989 88765 83286 173618 -62103 157965 58846
18795 -42422 -123108 179159 139476 -217911 29492 -28663 32865 -88292 333 -207205 21972
18783 -149331 1238 -251424 -179818 -35565 15555 -98034 5041 -190527 -211800 166186 121828
18772 121828 -153405 -33878 -501554 180602 41710 3317 259762 77182 36302 -265330 1694
18760 -57536 -120585 -43893 -57731 -242070 -40140 -350805 55024 -128814 -300508 171277 143850
18749 143850 55891 297545 -49355 21646 -213093 -204201 -347394 87260 53224 -19299 305559
18737 1968 -18608 -227112 -174713 -202585 64129 18191 86121 139624 16594 -84605 259400
$$ packed form
18818b54250A76642m0944c18168a27912B3611J95248i0164A5501b0506C15038
18807C6259i6939j13131H9656b87337B7989O0776n479R0332f2103A57965E8846
18795d2422q0686A79159l9683b17911B9492b8663C2865h8292C33b07205B1972
18783a49331A238b51424P1606c5565A5555i8034E041a90527k1273A66186m4358
18772A21828a53405c3878m67676A80602D1710C317K56445G7182C6302b65330A694
18760e7536o3049d3893j3838j84339d0140l10665E5024a28814j71694A71277k7427
18749A43850E5891K41654d9355B1646b13093Q892j43193H7260l4036a9299C05559
18737A968a8608k08504N2399k7872F4129A8191O7930N3503A6594h4605B59400
$$ plain form
18725 -388071 158220 329868 -15367 -28437 91759 -3437 -267142 -304580 -74369 -7894 240390
18713 -165831 -463406 -115709 175529 4315 -178740 218806 6565 -136687 111666 -245890
18702 87498 99942 -52432 91274 -25897 34254 22039 10098 -284185 142672 297869 -20429
18690 -181380 7597 -231496 24968 -7389 -87467 -183952 -54223 -8295 -234830 -409255 -19418
18678 265926 -46543 26702 13611 -207564 -116474 135982 -132998 19955 31165 -112823 -523732
18667 -523732 -150756 -484651 -125729 41055 41296 86941 -122694 70473 -228212 97412 -74182
18655 -36281 -70353 -369502 -95432 -17454 54422 174811 124104 286358 -244548 -11240 7581
18643 -166681 38943 221288 -121631 -182604 -52065 -3642 -34360 -44460 -73009 -269223 25433
$$ packed form
18725c88071A58220J71648a5367j3070I1759c437k63705l7438g4369g894B40390
18713a65831k97575a15709A75529D315a78740B18806F565a36687A11666b45890
18702H7498J2444e2432I1274b5897C4254j2215A0098b84185A42672J55197b0429
18690a81380G597b31496B4968g389q0078r6485e4223h295k26535j74425a9418
18678B65926d6543B6702j3091b07564R1090A35982a32998A9955J1210a12823m10909
18667e23732a50756l33895a25729D1055K41M5645a22694G0473b28212I7412g4182
18655c6281l4072k99149i5432a7454E4422J20389n0707J62254b44548a1240G581
18643a66681C8943J82345a21631o0973e2065c642l0718j0100k8549j96214B5433
$$ plain form
18631 -90423 -237169 -102488 123831 33627 65960 -325902 -177792 -130511 -93507 92172 -159730
18619 -386557 -52667 155163 2225 -285215 -198382 -106940 -26307 -101799 -150117 -98160 -334800
18608 -334800 -87480 169174 -192535 8518 -11836 -109655 -59975 -104242 211015 -224624 93551
18596 -164346 -25555 54399 188039 448587 59881 -55981 -90544 -37682 -282036 19999 -24257
18584 -180654 85166 106870 -344997 366202 -177405 -231115 -223844 22985 -121927 -280991 171754
18572 -182446 282682 -125372 -291593 -370760 -185564 -13037 -127471 -318151 -110061 -46148
18561 -169235 195016 -82300 349031 -216707 -110345 473 -132337 39544 -217365 -60266 -90106
18550 -90106 -41080 -122091 -355290 -42686 -125490 56211 -70551 -138238 76422 -62528 175592
$$ packed form
18631i0423j46746a02488A23831C3627L2333c25902J48110M7281L7004I2172a59730
18619c86557e2667A55163B225b85215Q6833R1442b6307p5492m8318N1957k36640
18608c34800h7480A69174a92535H518a1836r7819M9680m4267B11015b24624I3551
18596a64346b5555E4399J33640K60548E9881e5981l4563c7682k44354A9999b4257
18584a80654H5166K1704c44997C66202a77405n3710P271B2985a21927j59064A71754
18572a82446B82682a25372j66221p9167J85196a3037j14434j90680a10061d6148
18561a69235A95016h2300C49031b16707J06362D73a32337C9544b17365f0266k9840
18550i0106d1080q1011k33199d2686q2804E6211g0551o7687G6422f2528A75592
$$ plain form
18538 -128996 -82499 109263 -391205 -162454 -39739 94474 -216375 -99662 -285355 94000
18527 -146129 268066 -302179 -17977 79837 107372 -138107 301879 30498 -334028 -191134
18517 -191134 -177519 132928 -8123 158008 -385836 222664 -90052 -401375 22575 -92696 68784
18505 107679 111821 289233 43556 -164645 -126400 -145108 23453 -59132 269223 -101841 -138868
18494 -138868 -51875 155245 -127971 -16115 -138084 -97706 -217669 71841 -27731 -197782
18484 -197782 -174494 -87980 -29708 -155928 106215 4393 38206 -222121 299927 -110694 -93016
18473 -93016 -177068 143953 -116585 62362 -292276 58124 -69931 -91907 -6857 189818 26282
18461 -268333 -132401 132403 416142 -83969 -38280 -47060 170835 -143340 -48906 36559 -86584
$$ packed form
18538a28996M6497A09263c91205a62454c9739I4474b16375i9662j85693I4000
18527a46129B68066c02179a7977G9837K7535a38107C01879C0498c34028J42894
18517a91134J3615A32928h123A58008c85836B22664i0052l11323B2575i2696F8784
18505A07679M142J77412D3556a64645L8245j8708B3453e9132B69223a01841l7027
18494a38868e1875A55245a27971a6115j21969M0378j19963G1841b7731j70051
18484a97782K3288Q6514b9708j26220A06215D393L3813b22121B99927a10694J7678
18473i3016q4052A43953a16585F2362b92276E8124f9931k1976f857A89818B6282
18461b68333a32401A32403K83739h3969c8280q780A70835a43340d8906C6559h6584
$$ plain form
18449 -41293 -86195 34315 -144984 13350 70482 218071 -149468 -248015 55299 -92663 74834
18437 -25682 -90410 -152688 -515081 140286 -176996 -181448 -41304 -34531 -454165 63642 -50517
18425 -219980 -37613 -21276 -24128 -215778 249432 -121146 -175499 -132402 68592 -123717 73303
18413 -132408 87510 -195151 -110594 -103134 -28913 -88884 -14601 -326594 16917 -47212 49209
18401 179820 228722 92907 -183344 -175978 -119238 -62546 124873 1513 37587 -20612 -37103
18390 -37103 -68548 -447328 -283703 17129 299421 -48546 50416 -97370 -143268 184318 -30382
18378 -231869 -60550 -181796 44266 -178148 32264 3877 -5686 190665 234808 30973 247768
18367 247768 298887 82832 39535 -288080 91501 -184475 -426048 -127531 -145200 -195037 44736
$$ packed form
18449d1293m4902C4315a44984A3350N7132J47589a49468r8547E5299i2663G4834
18437b5682o4728o2278l62393A40286a76996m452d1304O773m19634F3642e0517
18425b19980c7613J6337k852j91650B49432a21146n4353M3097F8592a23717G3303
18413a32408H7510a95151Q4557P460b8913n9971a4601l11993A6917d7212D9209
18401A79820M8902I2907a83344P366N6740N6692A24873A513L6074b0612j6491
18390c7103l1445l78780J63625A7129K82292d8546E0416i7370m5898A84318c0382
18378b31869f0550j21246D4266a78148C2264C877e686A90665M4143C0973K16795
18367B47768N1119H2832C9535b88080I1501a84475k41573a27531j7669m9837D4736
$$ plain form
18355 205840 -103871 75884 -350212 -142957 -246093 -261571 -170255 -72062 -94905 -34749 123235
18343 -104848 310071 19659 105837 -168595 -17389 -125066 162267 53221 -76970 152865
18332 -39603 34351 7525 -139439 -42421 456710 175475 214750 -133122 -45759 81232 -147921
18320 470654 -136830 -149091 -287223 -187528 -119514 549 -173523 60417 -301259 -80067 -310859
18309 -310859 -8782 -404049 -154017 127506 122914 64069 -289108 -198200 -196270 76313 -18412
18297 -261994 129000 -141253 164829 87381 10026 109994 167676 109451 -430363 -177115
18286 86004 -206863 27968 -50430 168726 85851 -463624 -342232 -447580 26302 183949
18276 183949 35153 -121129 -240559 47784 -431979 -42346 13017 -79281 -12251 -87340 -251904
$$ packed form
18355B05840a03871G5884c50212a42957j03136j5478R1316g2062k2843c4749A23235
18343a04848C10071A9659Q6178a68595a7389j07677A62267E3221g6970A52865
18332c9603C4351G525a39439d2421D56710A75475L9275a33122d5759H1232a47921
18320D70654a36830j2261j38132R9695O8014E49a73523F0417c01259h0067k30792
18309c10859h782l95267a54017A27506m592n8845b89108R0908J930G6313a8412
18297b61994A29000a41253A64829p7448A0026R9968N7682n8225d30363a77115
18286H6004b06863B7968e0430A68726q2875d63624J21392j05348B6302J57647
18276A83949C5153a21129j19430D7784d31979d2346A3017g9281a2251p5089j64564
$$ plain form
18265 -251904 -157534 -127104 -292240 -221709 187565 -102950 10535 -49601 -250367 19306 -204667
18253 -144367 -102402 212111 118206 -4415 -23773 -68136 -379905 -20500 -75398 50381 -320970
18241 94854 -87177 97196 -120303 9070 162710 -82820 188429 -15408 96957 41163 46268
18230 46268 -11979 45410 -260112 -397557 603221 -408843 -183757 -149335 -95281 -36984 -65063
18219 -65063 -44985 313411 112279 23322 56233 -191607 -139860 115482 97523 126273 -143749
18207 -240645 -448787 -140028 -4873 156635 -136550 -112770 -13866 155689 -368359 192397
18196 -325795 21075 -163098 -299336 153964 29706 311101 -131197 -233143 192017 -127906
18185 -120067 134187 -89756 -9804 -154479 -97345 -316420 -116851 39093 -683 209838 224045
$$ packed form
18265b51904R4370L0430j65136P0531A87565a02950A0535d9601k00766A9306b04667
18253a44367M1965B12111r3905d415j9358m4363l11769b0500n4898E0381c20970
18241I4854h7177I7196a20303I070J53640h2820A88429a5408I6957D1163N105
18230D6268a1979D5410b60112j37445F03221d08843a83757L4422N4054c6984k8079
18219f5063K0078C13411A12279B3322L2911a91607N1747A15482j7959K8750a43749
18207b40645k08142a40028d873A56635a36550K3780a3866A55689c68359A92397
18196c25795B1075a63098j36238A53964B9706K81395a31197j01946A92017a27906
18185a20067A34187h9756i804j44675N7134k19075a16851C9093f83B09838J4207
$$ plain form
18174 224045 -115741 135252 16808 -203712 -67606 -25954 -30706 -468466 -13207 -106590 -77701
18163 -77701 173384 93007 260477 -102096 91274 -18870 -32549 228627 -137151 -130036 19079
18151 348656 -14081 29063 33697 -36667 -19082 371478 113005 207473 135159 -178636 150550
18139 -104012 -209003 -92112 -387852 -234828 43953 -77148 10041 87532 -88851 -228840 28672
18127 84235 -75125 -122795 41946 -179618 18936 -84005 -309456 -15756 -44929 207936 168292
18116 168292 -95398 41399 40539 -135558 -290398 -59558 -142887 -180518 65942 -143484 112826
18104 68262 -101100 -100213 -243049 -222151 -191460 -74146 -12862 -106586 146352 -91777 247970
18092 316917 -189368 -28975 57741 90120 94998 -145432 20607 -103691 -118213 30236 207896
$$ packed form
18174B24045a15741A35252A6808b03712f7606b5954m752m37760a3207r3383K8889
18163g7701A73384q0377J67470a02096I1274a8870j3679B28627a37151P115A9079
18151C48656a4081B9063M634c6667J7585C71478A13005R4468p2314a78636A50550
18139a04012j04991i2112k95740J53024D3953g7148A0041P7491h8851j39989B8672
18127H4235g5125m7670D1946a79618A8936h4005k25451a5756k9173B07936l9644
18116A68292i5398D1399q60a35558j54840e9558q3329l7631F5942a43484A12826
18104F8262a01100Q87j42836K0898L0691g4146a2862r3724A46352i1777B47970
18092C16917a89368b8975E7741L2379M878a45432B0607a03691j4522C0236J77660
$$ plain form
18081 207896 -206888 -180521 -279909 55907 -104481 12998 141489 -65902 -13987 119210 -333993
18069 84089 23062 -133455 31613 -311856 60891 -18876 157360 -95204 -75908 148801 -132574
18057 -262407 -294554 -51676 -187993 -337316 80627 139074 281378 -208270 -77163 -355976
18047 -355976 72907 -26254 -108443 93515 -66806 56049 -128098 90879 114055 108561 123823
18036 123823 15424 -110823 -324119 -213770 57141 81890 4788 61625 -152566 88410 -213256
18024 -228093 -324510 -154180 -118306 -41346 -127624 -269285 177067 -80178 -252036 -40826 113730
18012 160778 -17675 -102606 -229329 -211191 81683 7888 -170723 349470 42491 -317118 -285516
18001 -285516 190100 168050 -92565 -2243 21136 139001 -385748 162236 -182117 80555 -50023
$$ packed form
18081B07896b06888K6367r9388E5907a04481A2998J28491f5902a3987A19210c33993
18069H4089B3062a33455C1613c11856F0891a8876A57360i5204J9296A48801a32574
18057b62407l2147e1676j36317j49323H0627N8447J42304b08270g7163k78813
18047c55976G2907b6254q2189I3515f6806E6049a28098I0879K3176n494J5262
18036A23823A5424a10823k13296J10349E7141K4749D788N6837a52566H8410b13256
18024b28093r6417a54180L5874d1346q6278j41661A77067h0178j71858d0826A13730
18012A60778a7675q4931j26723J8138H1683G888a70723C49470D2491c17118L1602
18001b85516A90100k2050i2565b243B1136J17865c85748A62236a82117H0555e0023
$$ plain form
17989 -37775 -47660 103299 -199219 113134 -107646 -51722 -410272 -263021 149557 -119747
17978 222731 -261265 -110854 -411804 -125660 240515 -275414 -16105 -8660 194897 -159957
17967 -61770 17130 -43654 -17989 261737 142573 -281117 -142419 40390 23010 -92538 -307958
17956 -307958 289111 90568 22618 348302 177517 -39634 35231 -91166 85341 -263595 -175417
17945 -175417 -186173 -132689 148231 144930 -68340 -52247 -11300 56643 -130645 106310 -197387
17933 116978 -319052 192695 -2933 263019 8270 97894 -50395 141380 -38731 150008 -192312
17921 -236708 215470 358169 103265 -261331 26111 151375 -189476 105886 -7378 -264376
17911 -264376 51084 -73470 -177705 308650 125704 -65720 -171539 -192922 90683 54362 -56443
$$ packed form
17989c7775r885A03299a99219A13134a07646e1722l58550J47251A49557a19747
17978B22731b61265a10854l00950a25660B40515b75414a6105P445A94897a59957
17967f1770A7130d3654a7989B61737j19164b81117J38698D0390j7380i2538k15420
17956c07958B89111I0568B2618L25684j70785c9634C5231i1166H5341b63595Q8178
17945a75417j0756N3484A48231l301f8340J6093a1300E6643a30645A06310a97387
17933A16978c19052A92695b933B63019H270Q9624e0395A41380c8731A50008a92312
17921b36708B15470J42699A03265b61331B6111J25264a89476A05886g378k56998
17911b64376E1084g3470j04235C08650A25704f5720j05819k1383I0683l6321e6443
$$ plain form
17899 342173 -35935 -232117 -141302 -174470 -106627 96139 -282291 169798 98762 -58808 101578
17887 146993 263138 -122555 302870 -166225 219554 51909 -123408 141653 -60081 -63772
17877 -63772 125047 -225707 -118972 64362 124823 -18039 -184366 114542 2636 -244904 -187098
17866 -187098 -25986 294196 -37177 31440 -98508 -288070 173813 -279651 -117717 -288064
17856 -288064 -93347 -285400 40086 -99432 316463 124260 36345 -10750 159450 -373928
17845 -195943 -298634 50662 -78602 139141 56220 -238229 -187979 -117262 86268 232351 -25198
17833 -132428 181111 29402 143453 -17920 -141402 -567 171684 200133 270301 215921 56048
17821 -286115 34158 -8875 294177 -208271 123215 -249357 -241989 -13293 74854 222 -48307
$$ packed form
17899C42173c5935j96182R0815l3168O7843I6139b82291A69798p1036e8808A01578
17887A46993J16145a22555C02870a66225B19554E1909a23408A41653f0081l691
17877f3772A25047b25707J06735F4362O0461a8039j66327A14542B636b44904N7806
17866a87098b5986B94196c7177C1440i8508j89562A73813b79651a17717j70347
17856b88064i3347j92053D0086i9432C16463A24260C6345a0750A59450c73928
17845a95943j02691E0662g8602A39141E6220b38229N0250P0717H6268J46083b5198
17833a32428A81111B9402J14051a7920j23482e67A71684K8449P0168n4380E6048
17821b86115C4158h875B94177b08271A23215b49357P368a3293G4854B22d8307
$$ plain form
17809 -52359 388236 102265 344736 -214007 218256 -15032 -143926 -9005 191698 -50515
17798 -488540 -128285 -132808 -167415 -392557 -44275 903 76659 314645 -128651 -76120 271147
17786 -347637 18734 -129580 -304903 -63142 -40500 217904 -269659 -2813 244437 -359179
17775 -17959 124565 -92392 -47115 -98431 -316985 -294042 92676 207704 191921 -148101 -40665
17763 25177 -221232 -203578 -81969 353953 340593 -284470 67438 -195497 171979 384323
17753 384323 -7087 216126 421956 36556 -21723 103264 -406021 -70724 49324 -240262 -191685
17742 -191685 19573 291235 -247905 43912 -148169 -219205 -158861 62529 266343 -259162
17731 -190894 156246 97345 327114 -173383 124998 13097 96152 -85495 -332958 16165
$$ packed form
17809e2359C88236A02265K42471b14007B18256a5032j28894i005A91698e0515
17798d88540a28285m523l4607k25142d4275I03P5756K37986a28651N2531B71147
17786c47637A8734a29580j75323f3142K2642B17904b69659b813B44437c59179
17775a7959A24565i2392M5277n1316k18554K2943I2676J15028j5783a48101d0665
17763B5177b21232J7654h1969C53953j3360b84470F7438a95497A71979K12344
17753C84323g087B16126K05830C6556b1723A03264d06021g0724D9324b40262M8577
17742a91685A9573K71662b47905D3912a48169p1036O0344F2529K03814b59162
17731a90894A56246n8901K29769a73383A24998A3097Q3055h5495k47463A6165
$$ plain form
17720 536123 216735 241475 -481166 75365 -366009 -112821 -149655 133321 -233076 -63897
17709 287876 449601 -324048 80446 41043 -73608 -222759 -79587 -21236 42454 115634 184952
17698 184952 62527 346307 -138439 91202 -52057 -151204 -34713 -146092 214985 -21622 66879
17686 -182184 210504 -94180 160030 -37233 -124979 431798 69893 -59830 -227618 -104012
17675 130117 431613 -60565 -34484 9385 139925 35775 62155 -41470 238783 -106508 44682
17663 283191 246264 208258 -428316 215969 -279983 -53942 -105698 129647 -75815 86268 -138104
17651 65793 231941 116499 -171337 46353 -197390 -270442 -235905 59370 -162798 -163785 49974
17639 -54855 89568 -137712 -117604 -219030 -252918 -174350 463892 -293612 -154159 30534 285143
$$ packed form
17720E36123B16735K4740d81166G5365c66009a12821l6834A33321b33076f3897
17709B87876J61725c24048H0446l9403g3608j49151g9587b1236D2454P3180O9318
17698A84952F2527K83780a38439I1202e2057r9147c4713j11379B14985b1622F6879
17686a82184B10504i4180A60030c7233q7746D31798F9893e9830j67788a04012
17675A30117L01496f0565K6081I385J30540C5775K6380d1470B38783a06508D4682
17663B83191l6927l8006d28316B15969b79983e3942n1756A29647g5815H6268a38104
17651F5793J66148j15442a71337D6353a97390p3052L4537E9370a62798r87D9974
17639e4855H9568a37712K0108j01426l3888P8568D63892b93612J39453C0534K54609
$$ plain form
17628 285143 -268961 299249 61351 28274 47615 85227 -257059 184363 56890 -195995
17617 -182136 -53361 -16859 51698 5404 259127 75452 120421 -22893 -84357 125711 -107137
17605 -184840 -35835 -31697 93857 3664 62672 -256789 -111821 -18771 -259791 125410 -8669
17593 -148054 -140345 -136925 526123 346705 -200562 3213 -331052 232411 -115522 -8631 -285
17581 -102514 -159964 -170884 113900 41974 -152167 -179415 -191171 102734 126716 9116 -31601
17569 99901 121560 179021 -118266 222403 399166 75510 135614 119253 81873 -151913 89588
17557 204426 -105166 69171 234393 185773 254869 25678 85570 -54135 98239 -26402 66537
17545 22527 357440 94136 -52843 133066 158579 -271399 166614 -65937 59236 208799 107503
$$ packed form
17628B85143b68961B99249F1351B8274J9341L7612b57059A84363E6890a95995
17617a82136e3361a6859E1698E404K53723G5452M4969b2893o1464A25711a07137
17605a84840c5835M138I3857C664N9008b56789a11821a8771k41020A25410h669
17593a48054P709L420E26123j79418b00562C213c31052B32411a15522h631b85
17581a02514n7450j0920A13900D1974a52167k7248j1756A02734K3982I116c1601
17569I9901K1659N7461a18266B22403J76763G5510O0104j6361l7380a51913H9588
17557B04426a05166F9171J65222m8620O9096B5678N9892e4135I8239b6402F6537
17545B2527L34913I4136e2843A33066K5513b71399A66614f5937E9236J49563j01296
$$ plain form
17534 107503 172906 180258 -256507 564 33320 -180020 60273 14202 178030 41498 226561
17523 226561 -12418 135930 -50315 149118 -88806 228366 308941 -129849 -138473 -41767 -35445
17512 -35445 206297 -64080 -351483 68640 -150981 199844 200794 250145 -299572 -126519 -141379
17501 -141379 225719 334142 197505 -33292 -155419 109148 48964 308093 -35379 175351
17490 228968 78835 -44405 -65614 444616 428867 222155 160520 -248413 36037 185970 138148
17479 138148 74960 116215 -235626 366820 101756 99274 465318 -339204 174953 -134511
17468 212051 10137 -75780 29010 248122 139371 318019 412364 -10373 395742 105860
17457 51452 217580 -160324 122897 532658 348045 325345 352473 239556 243444 509296
$$ packed form
17534A07503O5403P352b56507E64L2756a80020F0273A4202J63828D1498J85063
17523B26561a2418A35930e0315A49118h8806B28366Q0575a29849q624d1767O322
17512c5445B06297f4080k87403F8640a50981A99844R50M9351b99572a26519j4860
17501a41379B25719J08423j36637c3292j22127A09148D8964K59129c5379A75351
17490B28968G8835d4405k1209D44616j5749k06712o1635b48413C6037J49933m7822
17479A38148o3188M1255b35626C66820A01756k482L66044c39204A74953a34511
17468B12051A0137g5780B9010K19112j08751J78648R4345a0373C95742A05860
17457E1452J66128a60324A22897M09761j84613k2700K7128j12917L888K65852
$$ plain form
17447 509296 445026 318700 473005 306327 36554 17723 60168 336648 436767 181072
17436 425361 258563 341573 260648 192553 264542 159057 255153 37061 200482 351479 70247
17424 11632 66859 113352 420475 419357 370700 112192 46705 237036 224168 504553 288891
17413 288891 59054 -180125 119138 458429 359164 314539 408215 -61539 46562 235249 -46701
17401 -113428 29451 71409 -36906 -13926 19539 64117 199235 78744 93197 253168 36056
17389 -3322 284369 289988 414517 -25318 252859 198585 233039 104974 240042 83287 -69111
17377 66105 -166319 134096 -137832 157514 318782 306588 85314 170912 60487 199032
17367 199032 -85937 9397 133572 230539 -132684 57242 -227252 270695 80177 -15616 164729
$$ packed form
17447E09296o4270j26326J54305j66678C6554A7723M2445K76480J00119A81072
17436D25361j66798Q3010q0925o8095P1989j05485R6096C7061J63421J50997G0247
17424A1632N5227M6493L07123j118m8657A12192D6705J90331j2868K80385k15662
17413B88891E9054a80125A19138L39291r9265m4625R3676f1539D6562J88687d6701
17401a13428B9451M1958c6906a3926A9539M4578J35118G8744J4453J59971C6056
17389c322B84369N619J24529b5318B52859n4274L4454A04974J35068H3287f9111
17377F6105a66319A34096a37832A57514J61268j2194H5314Q5598F0487J38545
17367A99032h5937I397J24175R6967a32684E7242b27252B70695H0177a5616A64729
$$ plain form
17355 245240 103233 324937 202038 65106 -351395 116407 -211977 19701 164513 454650
17345 454650 299863 -53255 184030 254579 185495 147021 340855 78497 149340 246973 -66039
17333 -155973 -98515 -53863 -115632 164365 146022 196251 109511 248049 393207 -42661 -83055
17322 -83055 475135 -24168 235934 -394394 250972 296612 -269986 -25284 61994 41121 109381
17311 109381 132224 262875 413097 -5873 64937 293027 206237 -50352 136495 301426 159160
17300 159160 79805 82386 154324 149828 260138 84571 230590 7980 96874 203739 137205
17289 137205 230277 -17061 118644 87662 103887 -23301 85395 -90337 30154 361424 247329
17278 247329 -196480 -78127 97723 205147 384804 304040 628856 231533 124774 -78477
$$ packed form
17355B45240A03233K21704j22899F5106c51395A16407b11977A9701J44812K90137
17345D54650j54787e3255A84030P0549o9084l8474J93834G8497P0843R7633f6039
17333a55973N7458M4652o1769A64365j8343N0229q6740J38538J45158d2661m0394
17322h3055D75135b4168B35934c94394B50972M5640b69986b5284F1994k0873O8260
17311A09381K2843J30651J50222e873F4937K28090q6790e0352A36495J64931j42266
17300A59160p9355K581P1938m496J10310H4571J46019G980Q8894J06865o6534
17289A37205R3072a7061A18644l0982J6225b3301H5395i0337C0154L31270j14095
17278B47329a96480g8127I7723J07424J79657q0764L24816B31533j06759g8477
$$ plain form
17267 21991 332341 179126 259254 27083 133359 237270 161409 -97296 116587 71791 41634
17256 41634 85478 211503 40770 492047 199641 323112 -58971 72903 81423 90246 414888
17245 414888 221826 126112 -61074 238216 181962 377296 -18698 31825 124205 182061 336199
17234 336199 158168 127053 309874 411723 208405 203806 -83694 7107 274174 364298 42869
17222 43149 161230 166225 -164477 134102 361583 193539 224188 120568 191509 428688
17212 428688 438747 94386 68730 166853 182446 339250 2009 158256 213967 316769 242398
17201 242398 306771 -75124 131447 238824 95991 273628 69762 511808 138930 340406
17191 340406 -35286 -78397 102125 192242 112866 174907 -124584 198024 393091 92670 30006
$$ packed form
17267B1991L10350j53215Q0128B7083J06276J03911p5861i7296A16587m4796l0157
17256D1634M3844J26025D0770M51277A99641J23471e8971G2903Q520Q823L24642
17245D14888j93062r5714f1074B38216n6254J95334a8698C1825R2380N7856J54138
17234C36199A58168l1115J82821J01849k03318m599h3694G107K67067R0124D2869
17222D3149J18081M995a64477A34102K27481j68044L0649j03620P0941K37179
17212D28688J0059I4386k5656R8123J5593J56804B009J56247N5711J02802p4371
17201B42398O4373g5124A31447J07377I5991J77637F9762M42046A38930K01476
17191C40406c5286m3111A02125R0117p9376O2041a24584A98024J95067I2670C0006
$$ plain form
17179 137183 115332 208277 354491 393339 62566 543791 82397 125352 38626 324249 -23309
17167 404420 93301 433800 290826 10234 382197 582862 456983 307600 356716 146718
17156 402967 197755 -6870 632578 403217 374702 255948 186911 345517 160932 369898
17146 369898 478306 223261 234080 243769 -46478 201690 310730 216029 163740 449414 146037
17134 494845 519152 575397 721146 118326 467561 408185 524792 264147 254472 210121 339012
17123 339012 307967 347028 108351 324131 459951 292852 545105 275254 362131 175133
17112 509634 243166 445201 448351 473708 720235 328583 390348 543782 832998 345975
17101 302185 562907 320419 427902 317432 637858 361686 577685 260170 528903 504786
$$ packed form
17179A37183k1851R2945J46214L8848F2566M81225H2397M2955C8626K85623b3309
17167D04420I3301L40499j42974A0234L71963K00665j25879j49383M9116A46718
17156D02967A97755f870F32578k29361k8515j18754o9037J58606A60932K08966
17146C69898J08408B23261J0819R689d6478B01690J09040r4701n2289K85674A46037
17134D94845K4307N6245J45749A18326L49235n9376J16607k60645r675m4351J28891
17123C39012l1045L9061A08351K15780J35820j67099K52253k69851Q6877A75133
17112E09634B43166K02035L150K5357K46527C28583O1765J53434K89216C45975
17101C02185K60722k42488J07483j10470L20426k76172K15999B60170K68733k4117
$$ plain form
17091 504786 478134 204336 486354 65206 104900 529932 305674 473143 387029 632232
17081 632232 323663 350629 417434 293947 240298 533641 217525 175799 402938 459358
17071 459358 531611 591427 688854 599271 107963 444955 470348 357367 313521 211994 610479
17060 610479 93522 805482 354040 431394 485949 771157 381617 358971 452935 607612
17050 607612 511540 596738 619955 375806 835634 630441 564976 709686 648688 680768 974190
17039 974190 216599 401696 763726 450298 714014 532249 715140 571384 822364 499929
17029 499929 645079 505229 493464 376494 678169 382719 616134 573902 900472 715536
17019 715536 748827 360364 618748 690949 572573 482603 664737 770233 944263 705290
$$ packed form
17091E04786k6652B04336K82018F5206L9694M25032k24258J67469q6114K45203
17081F32232l08569K6966O6805j23487n3649K93343B17525m1726K27139N6420
17071D59358P2253N9816R7427q9583A07963L36992K5393j12981m3846j01527L98485
17060F10479I3522P11960C54040P7354N4555K85208C81617k2646R3964J54677
17050F07612r6072Q5198K3217k44149M59828k05193o5465J44710o0998L2080K93422
17039I74190B16599J85097L62030l13428K63716j81765J82891j43756K50980l22435
17029D99929J45150j39850j1765j16970L01675k95450K33415m2232L26570j84936
17019G15536L3291C60364K58384P2201j18376q9970J82134J05496J74030k38973
$$ plain form
17009 705290 913253 545298 91499 649681 987466 691992 522218 528050 737673 970724
16999 970724 771016 446706 671537 540764 932525 729891 873381 936999 1014180 497711
16988 1021813 767360 893796 874506 888624 656907 776959 968139 870565 1108468 886922
16978 886922 1007645 654810 1066192 945514 1201360 980198 1217262 929991 961658 1170902
16968 1170902 985035 1001894 798751 961571 1031304 759087 982012 990948 841117 920706
16958 920706 1080811 1053580 785060 885222 1156674 1173702 1165605 1302016 1101353 1543526
16948 1543526 1245627 1500490 1376741 1002265 899566 1328778 1085383 1048984 1423635 1377421
16938 1377421 1396161 1529274 1360008 1460361 1323620 1369522 1237767 1549969 1203446 1501328
$$ packed form
17009G05290K07963l67955I1499N58182L37785k95474j69774N832K09623K33051
16999I70724j99708l24310K24831j30773L91761k02634J43490O3618P7181D97711
16988A021813k54453J26436j9290J4118k31717J20052J91180r7574K37903k21546
16978H86922J20723l52835M11382j20678K55846k21162K37064k87271L1667K09244
16968A170902j85867J6859k03143J62820O9733k72217K22925Q936j49831P9589
16958I20706J60105k7231k68520J00162K71452J7028q097J36411k00663M42173
16948A543526k97899K54863j23749l74476j02699M29212k43395l6399L74651m6214
16938A377421J8740J33113j69266J00353j36741M5902j31755L12202l46523K97882
$$ plain form
16928 1501328 1192007 1449930 1430049 1464888 1448598 1643424 1608542 1615611 1360511 1948270
16918 1948270 1246005 1605293 1549773 1712901 1079071 1531915 1998197 1924414 1829467 1512783
16908 1512783 1704996 1542361 1857446 1740684 1578336 1934113 1702982 2091135 2129240 2197547
16898 2197547 1979220 1593988 1949662 2247531 1965780 1734109 1888511 1632972 2088815
16889 2088815 2175068 2100683 2193219 2230937 2350022 2130828 2172257 2459848 2198988 2190487 2224878
16878 2224878 2154914 2477976 2147899 2238719 2329904 2950172 2816307 2516304 2546888 2873022
16868 2873022 2859467 2929097 3062422 2842976 2853893 3132332 3120706 3133490 3143173 3169506 3035393
16857 3035393 3433731 3139956 3409293 3808936 3889397 3613224 3635081 3557968 3637567 3743066
$$ packed form
16928A501328l09321K57923j9881L4839j6290J94826l4882P069k55100N87759
16918A948270p02265L59288n5520J63128o33830M52844M66282p3783r4947l16684
16908A512783J92213j62635L15085j16762j62348L55777k31131L88153L8105O8307
16898B197547k18327l85232L55674K97869k81751k31671J54402k55539M55843
16889B088815Q6253p4385R2536L7718J19085k19194M1429K87591k60860q501L4391
16878B224878o9964L23062l30077R0820R1185O20268j33865l00003L0584L26134
16868B873022j3555O9630J33325k19446J0917K78439j1626J2784R683K6333j34113
16857C035393L98338k93775K69337L99643Q0461k76173K1857p7113P9599J05499
$$ plain form
16847 3743066 3933300 4117522 4229371 3864320 4200509 4059994 4034094 4274901 4413343 4739781
16837 4739781 4449228 5001138 4631720 4854837 4835214 4949869 5238000 5267898 5291470 5704035
16827 5704035 5944049 5467280 5362221 5610725 5765775 6047058 6209103 6148887 6200897 6413099
16817 6413099 6701340 6770017 6830468 6869818 7323787 7498860 7529921 7750756 7832674 8245402
16807 8245402 8250272 8469686 8524233 9195218 9416757 9366931 9232004 9773785 9766289 10228636
16797 10228636 10715760 10824761 10839180 11476370 11478676 12152208 12309184 12528249 12812014 13328469
16787 13328469 13838996 14323814 14723334 15047048 15459241 15827464 16630531 17083357 17386637
16778 17386637 18103330 18507928 19336878 20035030 20676106 21550922 22232525 23039437 23802285
$$ packed form
16847C743066J90234J84222J11849l65051L36189j40515k5900K40807J38442L26438
16837D739781k90553N51910l69418K23117j9623J14655K88131K9898K3572M12565
16827E704035K40014m76769j05059K48504J55050K81283J62045o0216N2010K12202
16817F413099K88241O8677O0451L9350M53969J75073L1061K20835Q1918M12728
16807H245402M870K19414N4547O70985K21539m9826j34927N41781p496M62347
16797A0228636M87124J09001J4419O37190K306O73532J56976K19065K83765N16455
16787A3328469N10527M84818L99520L23714M12193L68223Q03067M52826L03280
16778A7386637P16693M04598Q28950O98152O41076Q74816O81603Q06912P62848
$$ plain form
16769 23802285 24687266 25363783 26542932 27681339 28807848 29941807 31202160 32455562
16761 32455562 34002708 35164970 36992135 38382139 40129385 42067775 43904584 45739429
16753 45739429 47908723 50151201 52673091 55129621 57592661 60701993 63986556 67187311
16745 67187311 70265962 73651967 77791364 81450646 85981924 90115582 94763663 99595094
16737 99595094 104318374 109052166 114152127 119600184 124801260 129774527 134849721 139613175
16729 139613175 144285995 148158853 151471125 154578453 156932751 158228327 159450800 159005996
16721 159005996 158712831 156902121 154686209 151750763 148263183 143950633 139566759 135016958
16713 135016958 129802052 124251096 119292568 113901705 108246269 103268508 98400779 93605528
$$ packed form
16769B3802285Q84981O76517J179149J138407J126509J133959J260353J253402
16761C2455562J547146J162262J827165J390004J747246J938390J836809J834845
16753D5739429K169294K242478K521890K456530K463040L109332L284563L200755
16745F7187311L078651L386005M139397L659282M531278M133658M648081M831431
16737I9595094M723280M733792N099961N448057N201076M973267N075194M763454
16729A39613175M672820L872858L312272L107328K354298J295576J222473m44804
16721A59005996k93165j810710k215912k935446l487580m312550m383874m549801
16713A35016958n214906n550956m958528n390863n655436m977761m867729m795251
$$ plain form
16705 93605528 88605734 84179639 79902136 75829898 71940647 68560703 64889176 61583398
16697 61583398 58757202 55879886 53134914 50751662 48294225 45992864 44261442 42071279
16689 42071279 40045412 38214004 36671878 35294226 33456634 32311481 31001425 29592909
16681 29592909 28516880 27357941 26393618 25282611 24376176 23642318 22889170 21898732 21090026
16672 21090026 20862763 19625780 19135403 18117533 17939882 17564894 16868657 16533953 15722094
16663 15722094 15390087 14720609 14402247 13935602 13538538 13223478 12908805 12117781 12247092
16654 12247092 11923465 11617148 11413949 10921452 11022528 10420797 9831964 9668420 9549133
16645 9549133 9366461 8858662 9059148 8537336 8416654 8428433 8081429 8005107 7966666 7562339
$$ packed form
16705I3605528m999794m426095m277503m072238l889251l379944l671527l305778
16697F1583398k826196k877316k744972k383252k457437k301361j731422k190163
16689D2071279k025867j831408j542126j377652j837592j145153j310056j408516
16681B9592909j076029j158939r64323j111007r06435p33858p53148r90438q08706
16672B1090026k27263j236983m90377j017870j77651l74988o96237l34704q11859
16663A5722094l32007o69478l18362m66645l97064l15060l14673p91024J29311
16654A2247092l23627l06317k03199m92497J01076o01731n88833j63544j19287
16645I549133j82672n07799K00486n21812j20682J1779l47004p6322l8441m04327
$$ plain form
16635 7562339 7333533 7193003 7230223 7122351 7093738 6664125 6510468 6398458 5989978 6041672
16625 6041672 5780101 6127932 5808356 5606971 5563093 5207656 5370697 5308695 5412728 4906029
16615 4906029 5019623 4936782 4586487 4571380 4454184 4671123 3930887 4515342 4404766 4253567
16605 4253567 4346028 4181458 3912814 4135002 3925634 3811919 3842654 3754681 3657009 3602796
16595 3602796 3508312 3476258 3253084 3458450 3032930 3191206 3462761 3098149 3293388 2826516
16585 2826516 3026755 3016795 2947872 2811134 2827799 2972198 3087677 2868968 2725158 2637973
16575 2637973 2582609 2660337 2615715 2608014 2530913 2655266 2596265 2206346 2508432 2428981 2129076
16564 2129076 2338538 2460783 2346364 2295478 2049560 2073268 2009868 2196619 2269068 2125433
$$ packed form
16635G562339k28806j40530L7220j07872k8613m29613j53657j12010m08480N1694
16625F041672k61571L47831l19576k01385m3878l55437J63041o2002J04033n06699
16615D906029J13594q2841l50295j5107j17196K16939p40236N84455j10576j51199
16605D253567R2461j64570k68644K22188k09368j13715L0735q7973r7672n4213
16595C602796r4484l2054k23174K05366m25520J58276K71555l64612J95239m66872
16585B826516K00239r960o8923j36738J6665J44399J15479k18709j43810q7185
16575B637973n5364P7728m4622p701p7101J24353n9001l89919L02086p9451k99905
16564B129076K09462J22245j14419n0886k45918K3708o3400J86751P2449j43635
$$ plain form
16554 2125433 2280190 1721742 1670727 2438383 2057651 1982413 2097769 2072091 2105521 1736349
16544 1736349 1873231 1693876 1679347 1903917 2044150 1707384 1674352 1866571 1462751 2093403
16534 2093403 1288294 1499820 1753766 1940680 1354960 1296185 1513803 1583967 1465975 1627871
16524 1627871 1285027 1386694 1435466 1424593 1273802 1386324 1480370 1269594 1338988 1250893
16514 1250893 839463 1163439 1084924 1333258 1047361 1499760 1144160 1290689 1369132 1451048
16504 1451048 1334537 1168395 881406 1142755 1354758 1393932 1201343 946500 1273592 997034
16494 997034 949464 964997 1280562 1023640 796360 944944 1204106 813912 982556 882970
16484 882970 772773 964825 957840 981010 1123341 798278 1214023 1104320 746014 599344
$$ packed form
16554B125433J54757n58448n1015P67656l80732p5238J15356k5678L3430l69172
16544A736349J36882j79355j4529K24570J40233l36766l3032J92219m03820O30652
16534B093403q05109K11526K53946J86914n85720n8775K17618P0164j17992J61896
16524A627871l42844J01667M8772j0873j50791J12522R4046k10776O9394q8095
16514A250893m11430L23976p8515K48334k85897M52399l55600J46529P8443Q1916
16504A451048j16511j66142k86989K61349K12003L9174j92589k54843L27092k76558
16494I97034m7570J5533L15565k56922k27280J48584K59162l90194J68644r9586
16484H82970j10197J92052o985K3170J42331l25063M15745j09703l58306j46670
$$ plain form
16474 599344 1228032 892527 967752 1129446 833772 738430 713047 1005467 912062 678288
16464 678288 1102205 685379 684040 798582 696106 880600 844199 779369 794611 891687 540354
16453 540354 709867 730937 754676 1035932 752846 724998 676744 1196046 783073 943848
16443 943848 543700 717960 740255 759938 842466 554401 914161 497256 422809 563498
16433 563498 651049 732681 653802 594211 868312 473570 526599 783236 712281 746000 597803
16422 597803 797920 1044558 717749 658806 708945 550113 511377 856701 507732 517699
16412 517699 648341 559566 480836 1003199 559496 654525 669924 568208 453121 705020
16402 705020 732091 687935 573518 541362 463849 464319 739989 340762 255353 697429 773030
$$ packed form
16474E99344O28688l35505P5225J61694k95674r5342k5383K92420r3405k33774
16464F78288M23917m16826j339J14542j02476J84494l6401o4830J5242R7076l51333
16453E40354J69513K1070K3739K81256k83086k7848m8254N19302m12973J60775
16443I43848m00148J74260K2295J9683Q2528k88065L59760m16905p4447J40689
16433E63498Q7551Q1632p8879n9591K74101l94742N3029K56637p0955L3719j48197
16422E97803K00117K46638l26809n8943N0139j58832l8736L45324l48969R967
16412E17699J30642q8775p8730N22363m43703R5029J5399j01716j15087K51899
16402G05020K7071m4156j14417l2156p7513M70K75670C40762q5409M42076P5601
$$ plain form
16391 773030 447813 536358 519418 663636 472189 257118 186619 559549 799801 531274
16381 531274 291262 202217 564593 512413 421203 184431 619303 580997 584350 539599 607773
16370 607773 539390 555181 830552 598110 702073 374838 364545 267076 453088 736828
16360 736828 537952 637774 387202 108913 688407 107077 195426 666308 410649 160116
16349 265313 551721 450391 365373 121536 562642 44403 298403 500147 488975 130881
16338 254019 467062 240399 316625 443597 396281 183943 451346 455765 222421 344370
16328 344370 55507 272296 471503 248136 282904 246086 340175 89002 -15735 509545 -42796
16316 172941 331476 462554 600291 468350 198024 428260 216899 727091 469762 273837
$$ packed form
16391G73030l25217Q8545j6940J44218j91447k15071p0499L72930K40252k68527
16381E31274k40012q9045L62376n2180r1210A84431M34872l8306L353m4751O8174
16370F07773o8383J5791K75371k32442J03963l27235j0293r7469J86012K83740
16360G36828j98876R9822k50572A08913N79494A07077Q8349M70882k55659A60116
16349B65313K86408j01330q5018A21536M41106D4403K54000K01744j1172A30881
16338B54019K13043k26663P6226J26972m7316A83943K67403M419B22421J21949
16328C44370E5507K16789J99207k23367L4768l6818R4089H9002a5735E09545d2796
16316A72941J58535J31078J37737j31941A98024K30236k11361N10192k57329j95925
$$ plain form
16306 273837 330098 190669 671287 349265 317342 434629 298417 467712 149203 197509
16296 197509 245179 286343 222753 334748 224079 223579 447207 225352 -21036 170239 59215
16284 160829 333322 546433 187301 26560 -181240 356576 189098 185592 13930 201239
16274 201239 287200 337907 233547 142786 255351 -17354 326451 220453 311333 180069
16264 180069 449419 352188 261796 158724 21581 204769 -26286 421333 340789 303995 243664
16253 243664 169700 36018 256654 547397 -2588 481503 192730 169294 37377 286062 260703
16242 260703 -60975 114502 298004 299146 248424 117687 84596 460677 -180320 213003
16231 115309 535450 126453 239738 170288 182114 -64804 -4803 289214 506221 248430
$$ packed form
16306B73837N6261j39429M80618l22022l1923J17287j36212J69295A49203M8306
16296A97509M7670M1164o3590J11995j10669n00K23628k21855b1036A70239E9215
16284A60829J72493K13111A87301B6560a81240C56576j67478l506A3930J87309
16274B01239Q5961N0707j04360r0761J12565a7354C26451j05998R0880j31264
16264A80069K69350r7231r0392j03072B1581J83188b6286D21333q0544l6794o0331
16253B43664p3964C6018K20636K90743b588D81503A92730k3436C7377K48685k5359
16242B60703f0975A14502J83502J142n0722A17687l3091L76081a80320B13003
16231A15309M20141A26453J13285o9450J1826f4804d803B89214K17007B48430
$$ plain form
16220 119085 35065 62949 170104 111062 239006 145056 299534 354142 -137580 167259
16209 365103 51225 -8817 -12560 378354 -128994 167390 202099 -76057 103647 218248 165650
16198 165650 18363 88502 540869 205542 -88987 352564 210286 224615 -136701 -169306
16188 -169306 91491 3750 47191 332737 161856 -108993 214262 -122151 55754 317392
16178 317392 182137 124372 272579 273736 -30425 -34415 2046 46213 334652 271456 175653
16167 175653 154704 86555 -96105 -28190 145248 72052 324992 353937 393371 171507 300224
16156 300224 314089 112487 172883 -76355 100887 105432 235225 241635 178530 -42698 73918
16144 125803 76032 429401 61722 95435 144262 -145104 37000 149319 169004 102719 -284415
$$ packed form
16220A19085C5065K7884J07155n9042J27944r3950J54478N4608a37580A67259
16209C65103E1225h817l743C78354a28994A67390L4709g6057A03647J14601n2598
16198A65650A8363P0139M52367B05542h8987C52564j42278J4329a36701l2605
16188a69306I1491C750M3441K85546A61856a08993B14262a22151E5754K61638
16178C17392j35255n7765J48207J157c0425l990B046M4167K88439o3196r5803
16167A75653k0949o8149i6105b8190A45248G2052K52940K8945L9434A71507J28717
16156C00224J3865A12487O0396g6355A00887M545J29793O410o3105d2698G3918
16144A25803m9771L53369F1722L3713M8827a45104C7000J12319J9685o6285b84415
$$ plain form
16132 -1116 8263 25178 92107 26410 127568 -41640 241769 14096 -76011 -185538 374680
16120 78478 98631 86459 199516 -40753 -156769 -235586 -12990 241937 151494 168105 77023
16108 221270 -194178 311756 -99053 198354 175007 111266 377429 -21742 194669 393080
16098 393080 -21917 100583 -47654 137201 193741 -157928 291028 101557 -27191 167567
16087 317098 220041 238288 -119348 277817 11785 -318892 122542 -157656 87713 -52163
16076 315777 -271615 -92129 -282246 -55619 194420 -334517 23256 130556 -38399 -155779
16066 -155779 152363 190501 -248576 -168702 171730 -296364 -56849 -37771 -13410 -305415
16056 -305415 207264 13834 120280 27025 120218 14217 33150 -79759 -41381 -109081 -65064
$$ packed form
16132a116H263J6915O6929B6410J01158d1640B41769A4096g6011j09527C74680
16120G8478K0153j2172J13057d0753j16016p8817a2990B41937r0443J6611G7023
16108B21270a94178C11756i9053A98354k3347o3741K66163b1742A94669J98411
16098C93080b1917A00583d7654A37201N6540a57928B91028A01557b7191A67567
16087C17098r7057J8247a19348B77817A1785c18892A22542a57656H7713e2163
16076C15777b71615i2129j90117e5619A94420c34517B3256J07300c8399j17380
16066a55779A52363L8138b48576P9874A71730b96364e6849J9078a3410k92005
16056c05415B07264A3834J06446B7025R3193A4217J8933g9759L8378o7700M4017
$$ plain form
16045 -65064 -148723 114585 -122182 -44980 114605 52424 -211491 76757 219520 85257 293675
16034 293675 -316838 285856 69206 318874 1079 -68402 -20777 -133212 -402598 218435
16023 -126714 -93902 193217 -319234 14441 -15264 209472 -175255 -69010 377921 42603
16012 12085 61437 342988 -85860 161198 -296740 -45356 213417 94313 -298323 39365 133256
16001 133256 104954 156280 156162 21903 -41648 -74664 -45669 155372 -321904 -84637 -6614 165838
15988 15342 -406785 83167 44252 132510 172019 -190757 122504 -103485 -205191 35285 74900
15977 74900 -23094 -297912 -298904 215090 -349387 96745 -139615 -300277 56372 32380 42905
15966 42905 47692 418565 166088 214158 202011 213845 30649 -125737 -374833 -14583 -1338
$$ packed form
16045f5064q3659A14585a22182d4980A14605E2424b11491G6757J42763H5257K08418
16034B93675c16838B85856F9206K49668A079f8402b0777j12435k69386B18435
16023a26714L2812A93217c19234A4441a5264B09472a75255f9010C77921D2603
16012A2085M9352K81551h5860A61198b96740d5356B13417I4313b98323C9365R3891
16001A33256k8302N1326j18B1903d1648l3016K8995A55372c21904h4637f614A65838
15988A5342d06785H3167l8915Q8258L9509a90757A22504a03485j01706C5285L9615
15977G4900b3094k74818r92B15090c49387I6745a39615j60662E6372k3992J0525
15966D2905M787L70873A66088M8070j2147J1834C0649a25737k49096a4583a338
$$ plain form
15954 194209 18090 -418629 57720 163411 -17569 443931 214959 -147346 -22143 -24918 12365
15942 -166185 20211 -237157 -160692 -109394 47740 -187512 -287830 100422 38991 345 115615
15931 115615 -24177 45934 -219910 153423 -96860 -116715 25122 20985 143832 -103498 126969
15919 -241065 -136613 248862 -178896 205731 198699 -50993 -43690 192269 133005 57096 -113029
15907 -135912 126018 -162505 -10297 -19842 58181 -252563 -60347 -68879 -339036 -267639 21958
15895 19668 -13113 -180483 70441 140520 -85851 -149555 70767 29199 -233965 -145040 272308
15883 29626 -208208 347988 243115 -140328 -14216 -84920 95778 -63044 -193965 108031
15872 -431950 320012 111227 -258157 72794 175241 96389 -183585 -35455 280481 204394
$$ packed form
15954A94209A8090d18629E7720J05691a7569D43931B14959a47346b2143k775A2365
15942a66185B0211b37157P6465N1298D7740a87512j00318A00422C8991C45J15270
15931A15615b4177D5934b19910A53423i6860j9855B5122m137J22847a03498A26969
15919b41065J04452B48862a78896B05731p032e0993P303A92269n9264E7096a13029
15907a35912A26018a62505a0297r545E8181b52563f0347q532k70157P1397B1958
15895A9668a3113j67370G0441P0079h5851o3704G0767B9199b33965Q8925B72308
15883B9626b08208C47988j04873a40328a4216p0704I5778f3044j30921A08031
15872d31950C20012A11227b58157G2794J02447p8852a83585c5455B80481p6087
$$ plain form
15862 204394 -263760 -37804 78116 12186 62170 -177380 283947 -51996 65524 72244 9047
15850 -215915 77231 -309589 280696 -119510 174477 -135537 87745 -74923 83376 -162045
15839 44144 -293430 -1815 46110 -224065 197644 144914 -56817 -142575 -186430 -38545 -17499
15827 174321 -93886 -200742 300185 5622 -118906 45964 -294712 -105703 284365 -282315
15816 68927 -936 88463 -50189 -85639 -114375 335672 -1974 167111 -240900 -111580 -163438
15805 -163438 27499 -13521 166691 -75559 51205 -127558 96270 -157056 -112447 195168 -182011
15793 -13122 -63172 242175 266145 65340 50843 37548 -179828 -44124 -127353 123661 -21701
15781 96463 126162 38202 -119016 -94296 100071 -256474 -174296 -21172 -216180 -138496 -178460
$$ packed form
15862B04394b63760c7804G8116A2186M9984a77380B83947e1996F5524O720I047
15850b15915G7231c09589B80696a19510A74477a35537H7745g4923H3376a62045
15839D4144b93430a815D6110b24065A97644n2730e6817q5758m3855c8545a7499
15827A74321i3886j06856C00185E622a18906D5964b94712a05703B84365b82315
15816F8927i36H8463e0189l5450k8736C35672a974A67111b40900a11580n1858
15805a63438B7499a3521A66691g5559E1205a27558I6270a57056M4609A95168a82011
15793a3122n0050B42175K3970F5340j4497j3295a79828d4124q3229A23661b1701
15781I6463K9699C8202a19016K4720A00071b56474Q2178b1172j95008P7684l9964
$$ plain form
15770 -178460 -181290 -92277 778 -407803 -267263 131465 6274 17460 -41631 158167 123869
15759 123869 -101627 -101488 11036 -112959 55445 61073 15795 -94275 -252571 162379 -50298
15747 -126426 328048 35357 -68402 223650 -155929 368353 332329 250559 53694 -675 -112500
15736 -112500 -40990 47325 -110 -66352 -262932 -32163 140659 184020 -36310 -166173 62353
15724 171652 -144437 -208851 229486 297238 -70395 -10507 -57990 112406 -350102 -44219 -155056
15713 -155056 -272644 -340614 290816 179292 87773 -69955 -113268 177732 192785 -477210
15702 -79150 -238743 104276 27564 70822 -207150 62642 773 -48551 -449319 34393 38826
15691 38826 52805 207885 -217151 183880 -34333 1291 -266744 -74637 51905 -120691 -93462
$$ packed form
15770a78460k830Q9013G78d07803J40540A31465F274J1186d1631A58167l4298
15759A23869a01627J39A1036a12959E5445N628A5795i4275j58296A62379e0298
15747a26426C28048C5357f8402B23650a55929C68353l6024q1770E3694f75j11825
15736a12500d0990D7325a10o6242j96580c2163A40659M3361c6310j29863F2353
15724A71652a44437o4414B29486O7752g0395a0507m7483A12406c50102d4219j10837
15713a55056j17588o7970B90816j11524H7773f9955m3313A77732J5053d77210
15702g9150j59593A04276B7564M3258b07150F2642G73d8551m00768C4393M433
15691C8826J3979J55080b17151A83880c4333A291b66744g4637E1905a20691K7229
$$ plain form
15680 -93462 -356039 224510 -252019 -74917 -47063 -416597 238822 -41051 38105 -13412 98367
15668 -44567 -55409 -531349 -77493 -128964 76383 -10954 199550 -146545 -138458 -153380 98209
15656 -92066 -110893 -389832 -354999 -570440 -7794 88516 -206453 57063 80757 193011 307013
15645 307013 -92931 -152659 -121471 98117 -254349 323691 -90828 -147185 -430704 26197 10649
15633 -16511 -8113 -283878 -78055 -35303 50059 -131975 149078 -107530 307296 -201052 -197837
15622 -197837 490032 35230 -181351 -88996 -34342 140665 -16915 -87676 -371989 166266
15611 -295762 -109862 62995 -55315 -45904 -118556 213875 24355 -53434 -112018 70371 -50785
15599 -36082 113513 -91244 6651 -237583 128603 -449041 -301087 258264 -124427 -4838 269315
$$ packed form
15680i3462k62577B24510b52019g4917K7854l69534B38822d1051C8105a3412I8367
15668d4567j0842m75940g7493n1471G6383a0954A99550a46545Q087j4922I8209
15656i2066j8827k78939L4833k15441g794H8516b06453E7063K3694J12254J14002
15645C07013i2931n9728L1188I8117b54349C23691i0828n6357k83519B6197A0649
15633a6511h113k75765g8055c5303E0059a31975A49078a07530C07296b01052L215
15622a97837D90032C5230a81351h8996c4342A40665a6915p0761k84313A66266
15611b95762a09862F2995e5315R411p2652B13875B4355e3434n8584G0371e0785
15599c6082A13513i1244F651b37583A28603d49041J47954B58264a24427d838B69315
$$ plain form
15587 -67866 -247615 10815 28228 -312468 -168403 -67027 245007 -119619 -99990 -73979 -60481
15576 -60481 -163870 -91254 233224 79158 -260241 15668 97070 -12285 -35169 65146 911
15564 -59853 132865 -208453 102234 80394 -82005 216994 135417 82049 -174116 -193088 -263272
15553 -263272 45903 -71815 39980 -107673 34261 -59137 -23385 549442 166577 141015 224107
15542 224107 185991 -159595 117122 -286028 202911 110572 -264262 -41285 -109899 -95015
15532 -95015 -16459 -531526 81010 108451 -178492 277710 -15879 -233758 112452 209724 -117754
15520 -236943 1223 177938 -2725 105396 277406 -120337 -20189 153362 103183 275731 77121
15508 121191 20806 55690 -128431 6403 -242650 -107164 -150253 -237101 20343 136227 -54201
$$ packed form
15587f7866j79749A0815J7413c12468J44065f7027B45007a19619J9629K6011J3498
15576f0481j03389P2616B33224G9158b60241A5668Q1402a2285k2884F5146I11
15564e9853A32865b08453A02234k1840h2005B16994q1577n3368a74116j8972p0184
15553b63272D5903g1815C9980a07673C4261e9137b3385E49442A66577k5562Q3092
15542B24107l8116a59595A17122b86028B02911r2339b64262d1285o8614J4884
15532i5015a6459n15067H1010K7441a78492B77710a5879k17879A12452R7272a17754
15520b36943A223J76715b725A05396J72010a20337b0189A53362n0179J72548G7121
15508A21191B0806L4884a28431F403b42650a07164m3089q6848B0343J15884e4201
$$ plain form
15496 14634 5896 68416 -121718 341504 -143369 -414239 -239676 17092 209283 176437 1459
15484 -214160 98834 64169 68065 74486 -3468 161771 61379 -177940 -11117 57823 67122 69811
15472 69811 236417 29160 290472 -26132 52855 -312462 71136 138012 284922 -294377 155172
15460 -156557 290303 137560 -1970 -114545 -34473 -24007 -361634 -29984 13462 -201919 -119822
15449 -119822 65409 214775 182672 -345364 -119935 37560 21941 -21068 -164289 -157100 -164423
15438 -164423 101005 -128292 -178379 -63407 150218 -89629 272908 -189828 91241 -6015 -279126
15427 -279126 -49280 207260 154275 107782 28297 97402 -492390 209961 -103718 286562
15416 135543 -163269 -44880 262299 -87727 22277 45355 -291784 -25884 37950 302315 220611
$$ packed form
15496A4634E896O2520a21718C41504a43369k70870J74563A7092J92191l2846A459
15484b14160I8834l4665L896O421c468A61771F1379a77940a1117E7823R299K689
15472F9811J66606B9160K61312b6132E2855c12462G1136O6876J46910b94377A55172
15460a56557B90303A37560a970j12575c4473J0466l37627b9984A3462b01919Q2097
15449a19822F5409J49366l2103c45364a19935C7560j5619b1068j43221P189p323
15438a64423A01005a28292n0087f3407A50218h9629B72908a89828I1241f015k73111
15427b79126d9280B07260n2985m6493B8297O9105d92390B09961a03718B86562
15416A35543a63269d4880B62299h7727B2277K3078b91784b5884C7950K64365q1704
$$ plain form
15405 220611 37958 216387 -245280 -114225 99198 -33977 -52155 21042 2330 150556 -311117
15393 -374840 -145462 -136808 -75771 138408 -114658 -23877 -175478 20059 12377 -168178 86035
15381 -98139 -84694 -126250 315603 -985 125322 -360485 -130301 -268547 125160 -21677 -83043
15370 -83043 -48673 235067 200252 -231936 -215599 -152257 196113 -194392 32505 -65106 -105311
15359 -105311 210265 124555 133888 -132370 -41658 250001 29220 -291513 -43244 16244 34599
15348 34599 -143534 -169307 155358 303787 83321 -103084 -61948 15818 -34087 -157585 -313721
15337 -313721 25502 -178264 -40010 23103 -24399 131574 -3923 197938 197601 -252426 -229398
15326 -229398 13356 94349 75680 -261135 142862 72404 59712 97760 273603 -88670 -130306
$$ packed form
15405B20611C7958J78429b45280a14225I9198c3977j8178B1042B330J48226c11117
15393c74840a45462Q654O1037A38408a14658b3877j51601B0059p682a68178H6035
15381i8139J3445m1556C15603i85A25322c60485a30301j38246A25160b1677o1366
15370h3043L4370B35067l4815b31936J6337O3342A96113a94392C2505f5106m0205
15359a05311B10265q5710R333a32370d1658B50001B9220b91513d3244A6244J8355
15348C4599a43534k5773A55358J48429H3321a03084M1136A5818c4087j23498j56136
15337c13721B5502a78264d0010B3103b4399A31574c923A97938l37b52426K3028
15326b29398A3356Q0993j8669b61135A42862p0458j2692L8048J75843h8670m1636
$$ plain form
15315 -130306 71469 351924 35516 -15719 152925 72165 -253007 -247450 46773 25393 172445
15304 172445 -264413 -91013 157543 9363 -155755 -190456 15708 -13993 -111677 -212932 -145129
15293 -145129 206262 129053 248417 -116330 -82569 33624 141868 269052 -202668 36488
15282 -25335 -183204 -340681 4506 -202475 286725 -243532 126691 -135580 -197175 11748
15271 106908 73305 206672 306853 166737 -272189 -30914 149770 125415 209616 81779
15260 162132 408571 184824 164344 120158 -31589 86813 25622 343844 347415 395817 413762
15249 413762 680602 1789227 1806297 1459642 1805729 1154575 456528 -214704 -25728 -46427
15239 -46427 305104 -147712 152997 140877 88441 -125856 -171650 -269703 23314 414639 257509
$$ packed form
15315a30306G1469K80455C5516a5719A52925G2165b53007N557D6773k1380J47052
15304A72445b64413i1013A57543I363a55755l4701A5708a3993r7684j01255O7803
15293a45129B06262p7209J19364a16330L3761C3624J08244J27184b02668C6488
15282b5335j57869j57477D506b02475B86725b43532A26691a35580o1595A1748
15271A06908l3603J33367J00181j40116b72189c0914A49770k4355Q4201H1779
15260A62132K46439A84824k0480m4186c1589H6813B5622L18222L571M8402J7945
15249D13762K66840J108625J7070l46655L46087o51154D56528b14704b5728k0699
15239d6427C05104a47712A52997j2120n2436a25856m5794r8053B3314L91325j57130
$$ plain form
15228 257509 -286062 669128 286961 -108007 -245085 137301 6390 26816 -67505 -249456
15218 -249456 205476 118281 139220 -305618 -75068 -84115 147501 68147 46987 122007 147428
15207 147428 2901 8262 138857 56224 -135420 267437 -52487 -93311 -67961 -73513 -29135
15195 124767 117716 27924 40143 170933 93960 27333 221363 57560 -48209 54925 136318
15184 136318 231145 271525 39645 -84291 -245277 226601 7868 221866 12974 153683 -284429
15172 -47511 111744 148242 113574 -492499 376845 20614 -94662 180014 -6832 192237 -114241
15160 -145589 -226371 82083 -62974 -105665 374439 99279 123962 18715 -168817 239276 299676
15149 299676 24999 90029 93449 146046 -126832 372955 -70509 211531 28143 161610 335777
$$ packed form
15228B57509b86062F69128B86961a08007j37078A37301F390K0426f7505j81951
15218b49456B05476q7195K0939c05618g5068r047A47501F8147k1160P5020K5421
15207A47428B901N361J30595E6224a35420B67437e2487m0824K5350n552b9135
15195A24767p051B7924J2219J30790p6973B7333J94030E7560d8209E4925Q1393
15184A36318R4827M0380C9645h4291j60986B26601G868K13998A2974J40709b84429
15172d7511A11744L6498l4668d92499C76845B0614i4662A80014f832A92237a14241
15160a45589q0782H2083f2974m2691C74439I9279K4683A8715a68817B39276O0400
15149B99676B4999O5030L420N2597a26832C72955g0509B11531B8143J33467J74167
$$ plain form
15138 335777 253018 184006 -132712 132977 369823 58821 109769 147775 -25548 -368204 107421
15126 258300 -159588 43328 440801 366377 174216 73225 380653 -71075 231165 -34957
15115 163582 -105825 -88616 -110372 217079 314617 205160 327288 72450 108695 193797 192658
15104 192658 107074 123066 -95250 -224578 310246 38906 325314 297924 164084 -297516
15093 314880 -40220 9175 -8016 -353875 86566 195040 84971 90501 -172607 -220464 142307
15081 230945 81077 123322 -397594 -270444 -89506 228480 -206563 -9067 372130 239297
15071 239297 -147429 -139523 17761 28666 65569 112113 -22524 198521 32409 20813 124721
15060 124721 263877 127031 -123677 410565 257103 202776 14817 624505 271207 -110218
$$ packed form
15138C35777q2759o9012a32712A32977K36846E8821N0948L8006b5548l42656A07421
15126B58300a59588D3328L97473p4424A74216G3225L07428g1075B31165c4957
15115A63582a05825J7209k1756B17079R7538j09457J22128G2450L6245Q5102j139
15104A92658q5584J5992i5250j29328C10246C8906K86408k7390j33840b97516
15093C14880d0220I175h016l45859H6566J08474H4971N530a72607m7857A42307
15081B30945H1077M2245c97594J27150h9506B28480b06563i067C72130j32833
15071B39297a47429P906A7761J0905L6903M6544b2524A98521C2409j1596J03908
15060A24721J39156A27031a23677D10565j53462n4327A4817O09688B71207a10218
$$ plain form
15049 -65923 29129 190735 -65787 231034 110813 143324 72475 248594 191647 10180 382510
15038 382510 -21224 7968 116803 366416 327798 -85520 7800 468067 55487 252902 -9274
15026 108887 156911 231556 -116101 -21874 -28435 241060 -22792 205739 63959 -148617 260262
15014 267485 214593 205813 -87190 241657 374995 68256 157923 39700 23431 -204035 161326
15002 132738 303822 18928 83443 197628 214770 -56969 -268312 45349 212224 82632 -30260
14990 -199619 242464 213585 503507 -88778 102273 337399 -137566 305956 -254545 55755
14979 254548 -33924 -10601 473582 270239 253151 291950 245497 148837 390123 337284 16485
14967 266028 36285 356254 95075 227904 134313 561086 327122 95011 639062 167214
$$ packed form
15049f5923B9129J61606f5787B31034A10813L2511p0849J76119n6947A0180L72330
15038C82510b1224G968J08835K49613l8618h5520G800M60267E5487J97415i274
15026A08887M8024P4645a16101b1874o561B41060b2792B05739F3959a48617B60262
15014B67485n2892q780h7190B41657J33338F8256Q9667C9700j6269b04035A61326
15002A32738J71084A8928O4515J14185J7142e6969k11343D5349J66875H2632c0260
14990a99619B42464k8879K89922h8778A02273K35126a37566C05956b54545E5755
14979B54548c3924a0601D73582k03343j7088L8799m6453r6660K41286n2839A6485
14967B66028C6285L19969I5075J32829r3591M26773k33964I5011N44051A67214
$$ plain form
14956 10842 46780 205245 -17131 239962 405336 -19966 114155 -164826 110049 30393
14945 -62115 123537 64051 317264 364816 301410 355382 190773 276025 178386 -120804 55203
14933 490368 59239 254496 399075 468932 442491 392051 69073 -20678 522545 134464 116170
14922 116170 264617 447824 105440 454533 323949 -113706 -91515 -108520 323720 372837
14912 372837 319257 361218 185942 207468 -9203 282787 -24449 -31265 377640 54073 280618
14901 280618 -124113 96877 355108 260076 204238 68286 299571 295925 204783 240801 442616
14890 442616 301360 339279 198375 261491 305580 164384 679968 279651 466248 300498
14880 300498 407070 21094 461298 333624 209701 471322 -46290 389530 187484 521099
$$ packed form
14956A0842L5938J58465a7131B39962J65374a9966A14155a64826A10049C0393
14945f2115A23537n9486K53213M7552o3406N3972j64609Q5252r7639a20804E5203
14933D90368E9239J95257J44579O9857k6441n0440F9073b0678E22545A34464j8294
14922A16170J48447J83207A05440L49093j30584a13706K2191j7005C23720M9117
14912C72837n3580M1961j75276K1526i203B82787b4449o816C77640E4073K26545
14901B80618a24113I6877K58231r5032n5838F8286K31285l646r1142L6018K01815
14890D42616j41256L7919j40904O3116M4089j41196N15584B79651J86597j65750
14880C00498J06572B1094M40204j27674j23923K61621d6290C89530A87484L33615
$$ plain form
14870 521099 474852 332011 226983 58626 703800 289086 131541 542774 622147 134895
14859 337412 90584 520747 40046 222981 375417 446916 540457 556168 310619 447600
14849 447600 294040 91827 261980 149864 243151 457170 658718 749521 -77556 227219
14838 365651 304847 318826 700592 145183 537317 387503 486780 444774 303121 -109269
14827 314157 392329 382060 462237 549621 525369 449202 386149 288032 410641 344631 134561
14815 464977 382527 578804 300239 262949 568121 393613 370612 156892 313321 341431
14805 341431 715204 225014 506736 257718 515039 171897 566230 392671 485032 388874
14795 388874 545974 462218 370395 680876 539547 771069 161140 237386 424445 674941
$$ packed form
14870E21099m6247j42841j05028E8626O45174B89086A31541M11233P9373A34895
14859C37412I0584M30163D0046J82935J52436P1499R3541J5711k45549J36981
14849D47600j53560I1827J70153j12116R3287K14019K01548R0803g7556B27219
14838C65651o0804J3979L81766A45183L92134j49814R9277m2006j41653a09269
14827C14157P8172j0269Q0177Q7384k4252p6167o3053r8117J22609o6010A34561
14815D64977q2450J96277k78565l7290L05172j74508k3001A56892J56429K8110
14805C41431L73773B25014K81722k49018K57321A71897L94333j73559R2361r6158
14795C88874J57100q3756r1823L10481j41329K31522A61140P6246J87059K50496
$$ plain form
14785 674941 412226 480500 831720 698127 483025 345195 659424 498982 490538 422574
14775 422574 737905 180703 471021 312050 856141 528064 491720 448917 453696 525485
14765 525485 774383 814733 645214 624908 720409 545282 756431 624205 796454 659433
14755 659433 822036 360606 586288 701601 676251 728342 460758 628323 947105 321571
14744 583823 854172 868311 420541 808959 794663 192790 791795 633045 876222 996754
14734 996754 431743 535328 809060 609309 898676 571854 783649 547211 504680 304690
14724 304690 669300 680344 394438 663896 920900 807593 478085 797096 621662 522376
14714 522376 537954 669469 484841 497126 560568 423872 590691 618513 538790 709051
$$ packed form
14785F74941k62715O8274L51220j33593k15102j37830L14229j60442q444o7964
14775D22574L15331A80703K90318j58971N44091l28077l6344m2803M779P1789
14765E25485K48898M0350j69519k0306R5501j75127K11149j32226J72249j37021
14755F59433J62603C60606K25682J15313k5350N2091k67584J67565L18782C21571
14744E83823K70349J4139D20541L88418j4296A92790N99005j58750K43177J20532
14734I96754D31743J03585K73732j99751K89367l26822K11795k36438m2531j99990
14724C04690L64610J1044k85906K69458K57004j13307l29508L19011j75434r9286
14714E22376J5578J31515j84628J2285O3442j36696J66819K7822p9723J70261
$$ plain form
14704 709051 963633 808632 712476 802546 1154625 898533 597713 767483 685584 661519
14694 661519 712830 567852 989592 1026409 876427 810894 538001 430083 764909 668590
14684 668590 799874 942721 655662 507573 1097226 696567 644387 637099 950638 982264
14674 982264 821989 823621 1181686 1113590 1010551 1048288 1014029 969556 925575 877512 1040048
14663 1040048 841908 778006 1100025 1087456 811126 873663 855363 1089308 715947 1039715
14653 1039715 1257962 675302 1001518 878597 996566 1045444 1046621 1092231 1026462 1263787
14643 1263787 1116705 1130117 825920 1097567 942709 929284 1325096 996020 1161709 1430165
14633 1430165 1023357 962741 1138988 1182660 1357121 1265534 1280104 1517924 1400506 1089495
$$ packed form
14704G09051K54582j55001r6156R0070L52079k56092l00820J69770q1899k4065
14694F61519N1311j44978M21740L6817j49982o5533k72893j07918L34826r6319
14684F68590J31284J42847k87059j48089N89653m00659n2180p288L13539L1626
14674I82264j60275J632L58065o8096j03039L7737l4259m4473m3981m8063J62536
14663A040048j98140o3902L22019j2569k76330O2537j8300K33945l73361L23768
14653A039715K18247n82660L26216j22921J17969M8878J177M5610o5769K37325
14643A263787j47082J3412l04197K71647j54858j3425L95812l29076J65689K68456
14633A430165m06808o0616J76247M3672J74461r1587J4570K37820j17418l11011
$$ plain form
14623 1089495 1418446 1225337 1014660 1317684 1196941 1446744 1103321 1242683 1350437
14614 1350437 1211839 1445624 1400155 1663817 1488150 1573127 1542703 1437641 1623277 1516319
14604 1516319 1375942 1225592 1328789 1744502 1307769 1358068 1388043 1378479 1744781 1514349
14594 1514349 1552856 1605948 1446756 1611890 1712046 1841491 1683691 1846510 1626831 1644293
14584 1644293 1558376 1681854 1536171 1920679 1757564 1769317 1978097 1431574 2154108 1950031
14574 1950031 1674149 2067658 2082973 1677496 2011744 2337730 2280946 2224286 2123768 2133553
14564 2133553 2261760 2603815 2599496 2398451 2574415 2541508 2876687 2457120 3054303 3082346
14554 3082346 3321337 3744512 4138138 4394938 5404651 7770961 12410578 20443811 38859909
$$ packed form
14623A089495L28951j93109k10677L03024j20743K49803l43423J39362J07754
14614A350437j38598K33785m5469K63662j75667Q4977l0424j05062J85636j06958
14604A516319j40377j50350J03197M15713m36733N0299K9975r564L66302k30432
14594A514349L8507N3092j59192J65134J00156J29445j57800J62819k19679J7462
14584A644293q5917J23478j45683L84508j63115J1753K08780n46523P22534k04077
14574A950031k75882L93509J5315m05477L34248L25986n6784n6660j00518R785
14564B133553J28207L42055m319k01045J75964l2907L35179m19567N97183K8043
14554C082346K38991M23175L93626K56800J009713K366310M639617Q033233J8416098
$$ plain form
14545 38859909 38510073 19343606 10323922 4725174 2694589 2252062 1930081 1826578
14537 1826578 2008129 1892674 1872454 1836997 1950499 2000750 1874768 1901376 1763829 1974246
14527 1974246 2345669 1869937 2175972 1956181 2202033 2314544 1967586 2188329 2423135
14518 2423135 2292522 2369051 2646880 2221413 2526995 2664868 2206842 2805318 2450323 2608039
14508 2608039 2657538 2708090 2813337 2471995 2665989 2635633 3099561 2860480 3111532 2836782
14498 2836782 3012474 3366723 2872333 3092081 3266709 3319809 3067791 3009658 3376549 3202335
14488 3202335 3223243 3531827 3431759 3352079 3450680 3247640 3551382 3426309 3345117 3702080
14478 3702080 3639944 3895331 3619520 3648327 3856861 3972401 3819773 3962767 3910403 4125518
$$ packed form
14545C8859909l49836j9166467r019684D725174k030585m42527l21981j03503
14537A826578J81551j15455k0220l5457J13502N0251j25982K6608j37547K10417
14527A974246L71423m75732L06035k19791K45852J12511l46958K20743K34806
14518B423135j30613P6529K77829m25467L05582J37873m58026N98476l54995J57716
14508B608039M9499N0552J05247l41342J93994l0356M63928k39081K51052k74750
14498B836782J75692L54249m94390K19748J74628N3100k52018n8133L66891j74214
14488C202335K0908L08584j00068p9680R8601k03040L03742j25073q1192L56963
14478C702080o2136K55387k75811K8807K08534J15540j52628J42994n2364K15115
$$ plain form
14468 4125518 3933967 4458927 4093302 4135750 4259736 4459549 4295675 4567555 4682869 4540661
14458 4540661 4559944 4471202 4524712 4717821 4644647 4794113 4955536 4801022 5293570 5130515
14448 5130515 5426608 4973655 5011006 5068125 5195779 5517819 5835872 5524073 5820845 5966853
14438 5966853 5984612 5581469 5683032 6089506 6324010 6314952 6208154 6297048 6576010 6498140
14428 6498140 6619222 6461534 6815087 6979748 6869517 7082681 7351799 7295814 7420029 7374155
14418 7374155 7635255 7628628 7806225 7873321 8252625 8073971 8116245 8306449 8471038 8734185
14408 8734185 8740133 8897217 9079072 9381818 9595567 9333970 9706618 9678816 10222635 10110931
14398 10110931 10285272 10637756 10563907 10605614 11132655 11196759 11622269 11453755 11726430 12026566
$$ packed form
14468D125518j91551N24960l65625M2448J23986J99813j63874K71880J15314j42208
14458D540661J9283q8742N3510J93109p3174J49466J61423j54514M92548j63055
14448E130515K96093m52953L7351N7119J27654L22040L18053l11799K96772J46008
14438E966853J7759m03143J01563M06474K34504r058j06798Q8894K78962p7870
14428F498140J21082j57688L53553J64661j10231K13164K69118n5985J24215m5874
14418G374155K61100o627J77597O7096L79304j78654M2274J90204J64589K63147
14408H734185N948J57084J81855L02746K13749k61597L72648k7802N43819j11704
14398A0110931J74341L52484p3849M1707N27041O4104M25510j68514K72675L00136
$$ plain form
14388 12026566 12244111 12352609 12478084 12677443 12879179 13211490 13422762 13885282 14068485
14379 14068485 14012611 14597008 15043204 15262360 15512212 15592481 16138961 16485142 16575170 16867572
14369 16867572 17473832 17431479 17967127 18920283 19156481 19319497 19491790 20064337 20512351
14360 20512351 21121734 21640956 21646449 22570427 23110371 23519276 23643995 24553686 25048963 25639620
14350 25639620 26581326 27104536 27625256 28662952 28994666 30127097 31196784 31729109 32304885
14341 32304885 33548066 34398925 35034446 36674382 37336646 38294215 39237125 40678643 42228709
14332 42228709 43238228 44408835 45877672 47400063 48980103 50699327 52510149 54073281
14324 54073281 56090748 57960194 59816533 62096554 64474051 66634451 69183897 71855787
$$ packed form
14388A2026566K17545J08498J25475J99359K01736L32311K11272M62520J83203
14379A4068485n5874N84397M46196K19156K49852Q0269N46480L46181R0028K92402
14369A6867572O06260m2353N35648R53156K36198J63016J72293N72547M48014
14360B0512351O09383N19222N493R23978N39944M08905J24719R09691M95277N90657
14350B5639620R41706N23210N20720J037696L31714J132431J069687N32325N75776
14341C2304885J243181Q50859O35521J639936O62264R57569R42910J441518J550066
14332D2228709J009519J170607J468837J522391J580040J719224J810822J563132
14324E4073281K017467J869446J856339K280021K377497K160400K549446K671890
$$ plain form
14316 71855787 74700558 77763612 80711694 83785404 87699553 91138018 95288996 99246507
14308 99246507 103588283 107606777 112817255 117608146 122956989 128280531 134142624 140322484
14300 140322484 147408808 154016974 161488093 169220365 177325255 186328271 195799017 205605612
14292 205605612 216029922 226531276 238077383 250300512 262794077 275755769 288899342
14285 288899342 302751610 316756754 331155587 345868759 360572497 375079960 389267051
14278 389267051 402899800 415671062 427030131 436664598 443790743 445900098 445200164 445571669
14270 445571669 445696378 442426027 438095661 433088481 425936548 416017246 403823106 389994578
14262 389994578 375131237 359881429 344078798 328144850 312415395 297064130 282066073
$$ packed form
14316G1855787K844771L063054K948082L073710L914149L438465M150978L957511
14308I9246507M341776M018494N210478M790891N348843N323542N862093O179860
14300A40322484P086324O608166P471119P732272Q104890R003016R470746R806595
14292B05605612J0424310J0501354J1546107J2223129J2493565J2961692J3143573
14285B88899342J3852268J4005144J4398833J4713172J4703738J4507463J4187091
14278C89267051J3632749J2771262J1359069R634467P126145K109355o99934L71505
14270D45571669J24709l270351m330366n007180p151933r919302j2194140j3828528
14262C89994578j4863341j5249808j5802631j5933948j5729455j5351265j4998057
$$ plain form
14255 282066073 267587275 255036763 242082525 229794932 217761213 206527906 195813023
14248 195813023 186066987 176597930 167887260 159754477 152364049 144829890 137988585 131473180
14240 131473180 125454811 119778825 114726964 109954911 104964104 100499822 96254621 92318788
14232 92318788 88540311 84966907 82122724 78578916 75630038 72896623 70180690 67284056
14224 67284056 65108240 62841758 60223900 58283104 56587175 55084804 53080796 50841242
14216 50841242 49523799 48058800 46549029 45657938 44308488 42225522 41254858 39965724
14208 39965724 39085342 38128230 37404154 36058063 34907366 33647694 33105159 32464227 31890727
14199 31890727 30798208 29826821 28960324 28485418 27546839 26782629 26545097 25749039 25174914
$$ packed form
14255B82066073j4478798j2550512j2954238j2287593j2033719j1233307j0714883
14248A95813023r746036r469057q710670q132783p390428p534159o841305o515405
14240A31473180o018369n675986n051861m772053m990807m464282m245201l935833
14232I2318788l778477l573404k844183l543808k948878k733415k715933k896634
14224F7284056k175816k266482k617858j940796j695929j502371k004008k239554
14216E0841242j317443j464999j509771q91091j349450k082966r70664j289134
14208C9965724q80382r57112p24076j346091j150697j259672n42535o40932n73500
14199C1890727j092519r71387q66497m74906r38579p64210k37532p96058n74125
$$ plain form
14190 25174914 24357835 24166678 23189849 22922317 22339924 21600974 21277883 20937814 20215594
14181 20215594 20482124 19412724 19190014 18862632 18405777 17880376 17718058 17014887 16855377
14172 16855377 16679473 16312226 16093379 15870325 15370293 15170233 14755586 14574932 14457613
14163 14457613 14416512 13953165 13470291 13346207 13238575 12806924 12755069 12484193 12153654 12154064
14153 12154064 11972723 11364408 11567239 10892351 11219126 11139142 10651346 10587991 10198453 10144296
14143 10144296 9918097 10028365 9543740 9742379 9653660 9208949 8974195 9289791 8675536
14134 8675536 8973671 8764327 8512064 8368478 8384474 8103965 7920494 8105470 8000678 7836860
14124 7836860 7698567 7739578 7377708 7474115 7228835 6898307 6944440 7194823 6810017 6908630
$$ packed form
14190B5174914q17079j91157r76829k67532n82393p38950l23091l40069p22220
14181B0215594K66530j069400k22710l27382m56855n25401j62318p03171j59510
14172A6855377j75904l67247k18847k23054n00032k00060m14647j80654j17319
14163A4457613m1101m63347m82874j24084j07632m31651n1855k70876l30539M10
14153A2154064j81341o08315K02831o74888L26775p9984m87796o3355l89538n4157
14143A0144296k26199J10268m84625J98639q8719m44711k34754L15596o14255
14134H675536K98135k09344k52263j43586J5996k80509j83471J84976j04792j63818
14124G836860j38293M1011l61870R6407k45280l30528M6133K50383l84806R8613
$$ plain form
14114 6908630 6607674 6663145 6498458 6420586 6211618 6646504 6146174 6038211 6156717 5739731
14104 5739731 5882713 5692251 5996030 5468497 5877391 5276956 5443450 5350154 5247405 5264805
14094 5264805 5544120 5170056 5271688 5177277 5134520 5020517 5044588 4839032 4821173 5254050
14084 5254050 4879455 4568182 4438700 4740262 4680612 4630405 4402307 4383566 4307260 4321442
14074 4321442 4437665 4089112 4419052 3753584 4277211 4072390 4075876 3931790 4112477 3534222
14064 3534222 3793080 3771890 4118649 3972520 3966098 3532938 3764139 3805974 3498405 3814157
14054 3814157 3386254 3569308 3555379 3741361 3519563 3517543 3559520 2921558 3380275 3207762
14044 3207762 2931490 3242807 2819675 3211530 3278760 3046027 2847002 2794726 2583956 3053095
$$ packed form
14114F908630l00956N5471j64687p7872k08968M34886n00330j07963J18506m16986
14104E739731J42982j90462L03779n27533M08894o00435J66494r3296j02749J7400
14094E264805K79315l74064J01632r4411m2757j14003K4071k05556j7859M32877
14084E254050l74595l11273j29482L01562n9650n0207k28098j8741p6306J4182
14074D321442J16223l48553L29940o65468N23627k04821L486j44086J80687n78255
14064C534222K58858k1190L46759j46129o422m33160K31201M1835l07569L15752
14054C814157m27903J83054j3929J85982k21798k020M1977o37962M58717j72513
14044C207762k76272L11317m23132L91855O7230k32733j99025n2276k10770M69139
$$ plain form
14034 3053095 3040790 3077458 2843222 2920852 3045169 2870137 2994713 3037762 2873083 2765962
14024 2765962 2435161 2789506 2450108 2725352 2701949 2470567 2602671 2472965 2076096 2387941
14014 2387941 2427847 2541649 2232623 2369867 2372375 2164339 2478355 2257191 2372015 2298120
14004 2298120 2174447 2225367 2112740 2079448 2298735 1882908 2435538 1980593 1959426 1894966
13994 1894966 2056263 2237130 2400019 2117817 3064368 4210515 7669569 13947717 31843070
13985 31843070 40918514 22687303 12451989 7752017 5362207 4462593 3759579 3584595
13977 3584595 3093036 3172909 2954339 3004123 2682046 2690431 2576005 1965225 2426353 2172975
13967 2172975 2351571 2349406 2054374 1980444 1983351 2128231 1875571 1985149 2024075 2023998 2100533
$$ packed form
14034C053095j2305L6668k34236P7630J24317j75032J24576M3049j64679j07121
14024B765962l30801L54345l39398K75244k3403k31382J32104j29706l96869L11845
14014B387941L9906J13802l09026J37244K508k08036L14016k21164J14824p3895
14004B298120j23673N0920j12627l3292K19287m15827N52630m54945k1167o4460
13994A894966J61297J80867J62889k82202R46551J146147L459054O278148J7895353
13985C1843070R075444j8231211j0235314m699972k389810q99614p03014j74984
13977C584595m91559P9873k18570M9784l22077Q385j14426o10780M61128k53378
13967B172975J78596k165k95032p3930K907J44880k52660J09578L8926p7P6535
$$ plain form
13956 2100533 1839641 2118784 2067892 1928727 1891645 1762616 1797999 1629557 1748124 1760134
13946 1760134 1520299 1477038 1960716 1661680 1786862 1506600 1528488 1592728 1664150 1810330
13936 1810330 2024345 1391823 1758642 1438075 1413954 1489674 1398207 1609380 1695151 1377110
13926 1377110 1402676 1638704 1334176 1270623 1389031 1345505 1259433 1409185 1539931 1404929
13916 1404929 1395364 1273905 1509706 1350096 1514589 1731018 1216943 1295337 1510406 1163660
13906 1163660 1176332 1485955 1463876 1467222 1276188 1260012 1207822 1140700 1121872 1071192 1353159
13895 1353159 1108365 1342414 1192061 1390321 966943 1264226 1067983 1303453 1153501
13886 1153501 1339732 1299937 1321219 1153952 1155037 896365 1044439 984493 978701 1315292 1197340
$$ packed form
13956B100533k60892K79143n0892j39165l7082j29029L5383j68442J18567J2010
13946A760134k39835m3261M83678k99036J25182k80262K1888O4240P1422J46180
13936A810330K14015o32522L66819l20567k4121P5720r1467K11173Q5771l18041
13926A377110K5566K36028l04528o3553J18408m3526q6072J49752J30746j35002
13916A404929r565j21459K35801j59610J64493K16429n14075P8394K15069l46746
13906A163660J2672L09623k2079L346j91034j6176n2190o7122j8828n0680K81967
13895A353159k44794K34049j50353J98260m23378K97283j96243K35470j49952
13886A153501J86231l9795K1282j67267J085k58672J48074n9946n792L36591j17952
$$ plain form
13875 1197340 1676728 1116702 1020410 1382729 1057495 933763 966554 1152734 1066537 1236037
13865 1236037 647820 1148110 925845 962169 959068 813697 525794 1193712 921215 904508
13855 904508 1416058 1017091 763757 1162423 788978 1110604 819902 1002112 951236 1006448
13845 1006448 933538 964777 885807 939364 711186 950886 900474 1021672 863391 834273
13835 834273 867365 734757 795668 905971 551422 1153518 875702 568900 1080641 835298
13825 835298 798724 914509 925685 718795 1028167 980101 729962 987164 870707 991893
13815 991893 740579 895352 582532 675781 665474 1083593 452101 716943 918045 681726
13805 681726 816078 869036 895102 651276 838337 771214 735954 747958 508953 641631
$$ packed form
13875A197340M79388n60026r6292L62319l25234j23732L2791J86180q6197J69500
13865A236037n88217N00290k22265L6324l101j45371k87903O67918k72497j6707
13855I04508N11550l98967k53334L98666l73445L21626k90702J82210n0876N5212
13845A006448p2910L1239p8970N3557k28178K39700n0412J21198j58281k9118
13835H34273L3092j32608O0911J10303l54549O02096k77816l06802N11741k45343
13825H35298l6574J15785J1176k06890L09372m8066k50139K57202j16457J21186
13815I91893k51314J54773l12820R3249j0307M18119D52101K64842K01102k36319
13805F81726J34352N2958K6066k43826J87061o7123l5260J2004k39005J32678
$$ plain form
13795 641631 1067184 437146 699506 998297 548153 499773 585103 808276 369607 590140
13785 590140 491010 571030 438059 851076 906834 628931 683843 504706 986707 717180
13775 717180 609139 611611 787184 426345 813217 609466 530335 765621 779219 574536
13765 574536 798295 449379 544439 723939 850784 933701 182185 766215 648589 695936
13755 695936 571779 443362 822183 701324 734653 699456 381500 662722 549545 627194
13745 627194 685516 1020955 729666 542982 673824 288284 707811 623690 691361 651373
13735 651373 952232 518790 394538 464874 629984 458626 563795 972102 503957 426701
13725 426701 421551 584340 529169 807923 627619 434646 613917 576009 490599 418003 581536
$$ packed form
13795F41631M25553D37146K62360K98791m50144m8380Q5330K23173C69607K20533
13785E90140r9130Q0020j32971M13017N5758k77903N4912j79137M82001k69527
13775G17180j08041K472J75573l60839L86872k03751p9131K35286J3598k04683
13765E74536K23759l48916R5060J79500J26845Q2917A82185N84030j17626M7347
13755F95936j24157j28417L78821j20859L3329l5197l17956K81222j13177P7649
13745F27194N8322L35439k91289j86684J30842B88284M19527q4121O7671l9988
13735F51373L00859m33442j24252P0336J65110j71358J05169M08307m68145p7256
13725D26701n150J62789n5171K78754j80304j92973J79271l7908q5410p2596J63533
$$ plain form
13714 581536 347333 510819 958552 889721 168441 653700 443999 609083 519744 534930
13704 534930 767824 444858 543309 846750 391611 394773 508481 484056 548894 639144 546508
13693 546508 859310 870183 639834 579949 420008 593639 562895 330611 468283 507501
13683 507501 273086 558831 538548 311525 359281 633079 250030 714371 792887 366409
13672 648988 622963 355376 203827 655931 529484 845709 787098 206144 291831 233183
13662 233183 470670 365955 476407 610900 148801 840279 562638 407999 502151 436931
13652 436931 397193 327429 345234 406381 716170 677937 396215 465700 -94467 547550 115701
13640 426161 653496 357354 438114 609756 577607 284053 388255 554344 341412 206121
$$ packed form
13714E81536k34203J63486M47733o8831A68441M85259k09701J65084q9339J5186
13704E34930K32894l22966R8451L03441C91611L162J13708k4425O4838R0250r2636
13693E46508L12802J0873k30349n9885j59941J73631l0744k32284J37672L9218
13683E07501k34415K85745k0283k27023M7756K73798B50030M64341P8516C66409
13672F48988k6025k67587j51549M52104j26447L16225n8611B06144Q5687n8648
13662B33183K37487j04715J10452J34493A48801O91478k77641j54639R4152o5220
13652D36931l9738o9764J7805O1147L09789l8233k81722O9485i4467E47550A15701
13640D26161K27335k96142Q0760J71642l2149B84053J04202J66089k12932j35291
$$ plain form
13630 206121 229342 579444 290385 34329 54009 260007 335136 310808 701471 342272
13619 300168 736100 413856 232435 523063 442843 63128 326401 764739 345462 290705
13609 290705 538680 449687 416694 600102 592785 326917 381021 249313 192394 4223 192500
13598 192500 80194 479238 327275 339431 527783 381009 338754 134665 448521 72438
13587 229395 342048 506264 525251 310312 334138 450001 341043 359242 273815 130728
13576 258867 239355 -108838 596227 165682 277088 390281 338702 737790 407815 486314
13566 486314 106640 323583 231435 286942 358154 -30142 466183 235066 596578 48218
13555 339865 264783 400075 272427 348295 320405 422576 354060 267100 189226 346114 493555
$$ packed form
13630B06121K3221L50102k89059C4329J9680K05998P5129k4328L90663C42272
13619C00168M35932l22244j81421K90628q0220F3128K63273M38338C45462n4757
13609B90705K47975q8993l2993J83408p317k65868N4104j31708n6919D223J88277
13598A92500H0194L99044j51963J2156J88352j46774m2255A34665L13856G2438
13587B29395J12653J64216J8987k14939K3826J15863j08958J8199q5427A30728
13576B58867j9512a08838E96227A65682J11406J13193n1579L99088l29975P8499
13566D86314A06640K16943r2148N5507P1212c0142D66183k31117L61512D8218
13555C39865p5082J35292j27648P5868k7890J02171o8516q6960p7874J56888J47441
$$ plain form
13544 493555 693501 246992 368132 428128 338172 220055 -59646 283991 234454 446871
13534 446871 267850 -11285 187896 230359 111341 281722 133570 327223 455772 101341
13523 337038 -73131 201990 184356 487108 226109 217477 376879 45443 604864 68468 106159
13512 106159 687200 261284 356223 384306 343467 263023 216294 524319 254783 52032 402792
13501 402792 227755 93682 686288 331941 274943 -32604 367404 90960 -30115 234079
13490 254008 248427 93516 256183 251627 98575 330877 301132 146571 130640 25548 187026
13479 187026 144423 387274 253281 267583 82059 358193 403992 255627 631085 536523
13469 536523 393411 325437 571270 329951 344936 247005 210412 244714 143162 473031
$$ packed form
13544D93555J99946B46992J21140N9996q9956j18117e9646B83991m9537K12417
13534D46871j79021a1285A87896M2463A11341J70381A33570J93653J28549A01341
13523C37038g3131B01990j7634L02752B26109q632J59402D5443N59421F8468L7691
13512A06159N81041B61284R4939K8083m0839q0444m6729L08025B54783E2032L50760
13501D02792j75037I3682N92606C31941n6998c2604C67404I0960c0115B34079
13490B54008n581I3516J62667m556I8575K32302k9745A46571j5931B5548J61478
13479A87026m2603K42851j33993J4302H2059K76134M5799j48365L75458r4562
13469E36523j43112o7974K45833k41319J4985r7931l6593L4302j01552L29869
$$ plain form
13459 473031 469381 96473 248090 123101 385615 502836 279372 218325 332280 439825
13449 439825 172255 327916 163581 57474 99672 590726 -157071 147406 497123 247156
13438 389714 305451 46648 91020 133851 399305 166772 146464 29042 320020 189709 279216
13427 279216 216396 290292 314220 184604 372161 287198 168959 241680 64637 127382 450686
13416 450686 284324 352914 49760 229104 -116529 187624 37455 169919 144442 -23467
13405 307902 377598 254790 284140 207473 196615 174899 390549 91186 110810 373751 108994
13393 -164828 199525 299744 244871 203335 393409 77525 604754 334020 -44457 195302
13382 211369 388944 565453 319610 442488 90509 335063 106877 545171 349279 372618
$$ packed form
13459D73031l650I6473J51617A23101K62514J17221k23464o1047J13955J07545
13449D39825A72255J55661A63581E7474M2198M91054a57071A47406L49717B47156
13438C89714q4263D6648M4372M2831K65454A66772k0308B9042K90978j30311Q9507
13427B79216o2820P3896K3928j29616J87557q4963j18239P2721F4637O2745L23304
13416D50686j66362O8590D9760J79344a16529A87624C7455J32464k5477b3467
13405C07902O9696j22808K9350p6667j0858k1716K15650I1186J9624K62941A08994
13393a64828A99525J00219n4873m1536J90074G7525N27229k70734d4457A95302
13382B11369J77575J76509k45843J22878I0509K44554A06877M38294j95892K3339
$$ plain form
13372 372618 88331 248247 281242 250667 414926 208441 157591 358437 197538 273655
13362 273655 7818 70338 346346 276893 167713 140686 409040 147249 194572 454374 378610
13351 378610 222590 60639 388410 190677 17483 314131 53489 259640 343175 137719
13340 218860 377497 232973 265227 355022 268778 300494 28207 241607 156970 357803 87192
13328 102610 -73381 259438 403266 388382 242866 235714 178773 15337 282316 174120 213981
13317 213981 367132 181277 109937 178990 475022 190462 308764 -128736 229880 42208
13306 77720 167458 -49044 425383 49914 -79409 85197 94496 198334 278704 286817 323972 374010
13294 374010 259096 -83699 -95940 166691 -20240 315922 298480 359529 325937 259684 -139799
$$ packed form
13372C72618H8331J59916L2995l0575J64259k06485n0850K00846j60899P6117
13362B73655G818O2520K76008o9453j09180k7027K68354A47249M7323K59802p5764
13351C78610j56020F0639L27771A90677A7483K96648E3489K06151Q3535A37719
13340B18860J58637j44524L2254Q9795q6244L1716B8207K13400q4637K00833H7192
13328A02610g3381B59438J43828j4884j45516p152n6941A5337K66979j08196L9861
13317B13981J53151A81277p1340O9053K96032A90462J18302a28736B29880D2208
13306G7720Q9738d9044D25383D9914g9409H5197R299J03838Q0370Q113L7155N0038
13294C74010j14914h3699j2241A66691b0240C15922j7442O1049l3592o6253a39799
$$ plain form
13282 201910 70494 -12857 63759 96155 133504 395150 -96411 -19118 115245 -327 21813
13270 97917 -31897 196997 72237 298916 42032 12619 70927 194878 65767 -41412 22203
13258 152357 66083 142560 -10600 43798 334045 82964 200120 126335 52307 102814 -82147
13246 -149771 136703 316360 215845 64425 204519 100656 182893 175911 153584 331413
13236 331413 -84894 341803 347957 -8779 223909 260803 130026 37791 13304 204513 -176204
13224 96113 -219300 80372 235189 539624 259952 79960 -30129 296891 347349 -373639
13213 336338 347151 274052 340327 192714 323353 573 379741 -57624 40125 106801 217452
13202 217452 433869 -55699 -19332 -65459 -97111 124769 42945 380931 153629 -26248 141254
$$ packed form
13282B01910G0494a2857F3759L2396L7349K61646i6411a9118A15245c27B1813
13270I7917c1897A96997G2237K26679D2032A2619N8308J23951F5767d1412B2203
13258A52357F6083P6477a0600D3798K90247H2964J17156p3785E2307N0507h2147
13246a49771A36703J79657j00515F4425J40094A00656Q2237o982k2327J77829
13236C31413h4894C41803O154h779B23909L6894A30026C7791A3304J91209a76204
13224I6113b19300H0372J54817L04435B59952G9960c0129B96891N0458c73639
13213C36338J0813p3099O6275j47613J30639E73L79168e7624D0125O6676J10651
13202B17452K16417e5699a9332m6127l1652A24769D2945L37986A53629b6248A41254
$$ plain form
13190 249161 -150112 -65327 63518 146651 235066 183796 333947 53183 123663 158069 -248550
13178 -83362 -110584 420043 1922 591149 225807 18333 173767 -130174 217430 71921 202200
13167 202200 -118197 -208015 -6524 426173 -96618 30022 483648 493192 109660 299925 -274318
13155 -26066 74686 29004 -9783 -114872 293183 -305134 242142 -97884 64717 45826 -65044
13143 51404 69052 66596 308360 356760 135880 98913 169897 -14706 -159736 -45665 29031
13131 55559 -187634 -101687 100590 93678 111560 223795 52238 261108 126851 -46542 334518
13119 572818 328670 9660 183792 315206 224741 4232 228392 -186495 237069 258832 170713
13108 170713 -313100 135715 -214619 -202563 -92416 59419 -118151 41856 379747 -102477
$$ packed form
13190B49161a50112f5327F3518Q3133Q8415n1270J50151E3183P0480L4406b48550
13178h3362k7222D20043A922N89227B25807A8333J55434a30174B17430G1921J30279
13167B02200a18197q9818f524D26173i6618C0022M53626R544A09660J90265b74318
13155b6066G4686B9004i783j05089B93183c05134B42142i7884F4717j8891f5044
13143E1404J7648k456K41764M8400A35880l6967P0984a4706j45030d5665B9031
13131E5559a87634Q5947A00590o912J7882J12235E2238K08870A26851d6542C34518
13119E72818k44148I660J74132J31414r0465D232K24160a86495B37069K1763q8119
13108A70713c13100A35715b14619J2056i2416E9419a18151D1856L37891a02477
$$ plain form
13097 380691 -26717 268369 4927 443162 175437 89697 217040 39462 182112 64283 -175909
13085 1594 129780 16373 -4402 62646 394178 18248 -13298 367720 108995 34321 205168
13074 205168 -53005 128431 -19565 -55735 21069 245030 266386 126856 184968 8843 59178
13063 59178 442583 213997 -81711 256555 267280 320931 129304 -96260 78829 158563 68400
13051 -103690 221822 -141586 155072 -137741 220746 308141 248071 66943 -85246 190560
13040 157371 37188 267293 -130134 -250038 -149157 105308 230071 139535 133804 49297
13029 239791 227229 17365 -102706 -5045 -126536 -5121 286163 35474 230549 193349 -264122
13017 85780 -32393 355665 573110 22056 168080 197718 335210 168455 128766 44835 297400
$$ packed form
13097C80691b6717B68369D927M38235A75437q5740J27343C9462J42650F4283a75909
13085A594J28186A6373d402F2646L31532A8248a3298C67720A08995C4321J70847
13074B05168e3005A28431a9565l6170B1069K23961K1356A26856N8112H843N0335
13063E9178L83405B13997h1711B56555J0725N3651A29304i6260G8829P9734F8400
13051a03690B21822a41586A55072a37741B20746Q7395o0070F6943h5246A90560
13040A57371C7188K30105a30134j19904J00881A05308J24763r0536n731D9297
13029B39791j2562A7365a02706e045j21491e121B86163C5474J95075l7200b64122
13017H5780c2393C55665K17445B2056J46024K9638J37492j66755l9689D4835K52565
$$ plain form
13006 297400 272074 256189 326148 185910 165999 164112 84867 -358414 383167 -301545 113476
12994 72758 -25384 170930 -41080 282072 61588 112253 -30590 14940 61173 103487 147998
12983 147998 -108000 -230588 351442 366951 343934 -9792 315185 215634 103413 -47636 4207
12971 229601 17081 10971 -194859 -45788 210419 154943 142462 -9129 -8219 409519 -172118
12959 57824 -33896 -89108 120044 188504 180476 -231204 -4772 211665 60207 -108637 199681
12947 230083 127570 146795 444358 322538 -122623 264882 -19449 -310787 -57441 -153247
12937 -153247 235052 -197885 111372 -111100 76511 83665 -315607 -102325 -150898 -110689
12927 -110689 156118 282839 -67787 36760 303683 188850 424611 -118347 -205701 203459
$$ packed form
13006B97400k5326j5885O9959j40238j9911j887p9245c58414C83167c01545A13476
12994G2758b5384A70930d1080B82072F1588N0665c0590A4940M6233M2314M4511
12983A47998a08000j22588C51442J5509k3017i792C15185r9551A03413d7636D207
12971B29601A7081o110a94859d5788B10419n5476j2481i129R10D09519a72118
12959E7824c3896n5212A20044O8460q028b31204d772B11665F0207a08637A99681
12947B30083j02513J9225K97563j21820a22623B64882a9449k91338e7441r5806
12937a53247B35052a97885A11372a11100G6511P154c15607a02325m8573M0209
12927a10689A56118J26721f7787C6760K66923j14833K35761a18347q7354B03459
$$ plain form
12916 299823 -162761 89943 6678 17731 22227 -14855 -28722 -175979 130298 43538 50995
12905 50995 -136526 11572 290824 132873 -86049 37655 33226 -159832 107174 45805 -42769
12893 -176093 -13575 -55968 278966 251773 338590 -13458 21592 18517 421152 -52292 -13797
12881 75718 29273 308421 345768 137514 -38248 248045 298395 -93723 -42316 141029 -161632
12869 -33549 -165771 -103187 -34056 -60489 29211 21942 28059 -41268 51187 -170513 -55808 119607
12856 257922 -173288 324906 -111574 241023 62101 242229 498410 9337 -122303 150156
12845 155660 -340853 24128 -93267 200327 249631 131645 -46802 334202 187960 296172
12835 296172 -15137 148994 352465 -157010 -61543 -150549 -112014 -22066 -37459 260381 10482
$$ packed form
12916B99823a62761H9943F678J1053M496a4855j3867j47257A30298D3538P457
12905E0995a36526A1572K79252A32873h6049C7655m429a59832A07174D5805d2769
12893a76093a3575m2393B78966k7193Q6817a3458B1592l075M02635e2292a3797
12881G5718B9273K79148L7347A37514c8248B48045N0350i3723d2316A41029a61632
12869c3549j32222O2584c4056k6433B9211p269O117d1268E1187a70513e5808A19607
12856B57922a73288C24906a11574B41023F2101J80128K56181I337a22303A50156
12845A55660c40853B4128i3267B00327M9304j17986d6802C34202j46242J08212
12835B96172a5137A48994K03471a57010f1543q9006L8535b2066j5393B60381A0482
$$ plain form
12823 -169752 175550 305763 -174351 57185 -88439 83782 -21726 31368 -108163 278301
12812 -193640 23468 163844 250107 171254 341730 155487 235439 377749 -160277 152106
12801 374153 86583 -41505 -39210 513812 127329 -196464 133899 -327157 -106678 -5827 313238
12789 -186621 56115 70750 -216533 93855 2765 139611 267030 190948 69061 234299 -302033
12777 499297 56469 -285736 -33251 124706 260161 362846 59260 395683 -71479 -176860
12767 -176860 -118176 293488 -37280 -117191 -55732 35699 -111464 -162655 35643 344426 -168669
12755 212124 49150 -140361 21661 -20529 145230 112649 -9814 9452 101444 234844 -78662
12743 215263 50601 29777 -8828 -268981 120293 233737 32524 96380 266248 272945 -130768
$$ packed form
12823a69752A75550J30213a74351E7185h8439H3782b1726C1368a08163B78301
12812a93640B3468J40376Q6263p8853J70476A55487P9952J42310a60277A52106
12801C74153H6583d1505K295E13812A27329a96464A33899c27157a06678e827C13238
12789a86621E6115J4635b16533I3855B765J36846J27419p6082F9061J65238c02033
12777D99297E6469b85736c3251A24706J35455J02685E9260L36423g1479j05381
12767a76860N8684B93488c7280p9911e5732C5699a11464n1191C5643L08783a68669
12755B12124D9150a40361B1661b0529A45230l2581i814I452R1992J33400g8662
12743B15263E0601k0824h828k60153A20293J13444C2524O3856J69868O697a30768
$$ plain form
12731 -165511 212988 140745 -191010 -155519 41511 46991 9531 342961 -43100 230514 -86892
12719 182525 96026 -73537 155770 100567 137297 87208 332414 141858 -98905 193756 341429
12708 341429 447909 287504 85800 -178119 476386 349185 -141851 55895 278989 107100
12697 56829 401266 -249234 27381 31092 -274101 245298 106789 248226 -56379 50642 124175
12686 124175 -184064 -9620 -105000 193979 -189742 124788 -31670 78701 61958 311689 7461
12674 115984 101050 61702 210734 -41887 -63976 -106944 -62725 200690 -140495 457427 72176
12662 470845 75512 -49808 20667 16791 48752 -32302 137272 236978 204280 -100777 -17158
12650 288361 -117183 298597 -123101 -59477 -52749 159148 60036 96290 56519 -12891 191625
$$ packed form
12731a65511B12988p2243a91010L5491D1511N480I531L33430d3100B30514h6892
12719A82525q6499g3537A55770n5203L6730n0089K45206A41858i8905A93756J47673
12708C41429J06480j60405H5800a78119D76386j27201a41851E5895K23094A07100
12697E6829L44437b49234B7381L711b74101B45298A06789J41437e6379E0642P3533
12686A24175a84064i620r5380A93979a89742A24788c1670G8701j6743K49731G461
12674A15984j4934l9348J49032d1887k2089m2968M4219B00690a40495D57427G2176
12662D70845G5512d9808B0667l876L1961c2302A37272R9706l2698a00777a7158
12650B88361a17183B98597a23101e9477O728A59148F0036L6254l9771a2891A91625
$$ plain form
12638 57694 409104 199101 -62414 -66096 155516 184821 108888 461061 447352 -11461 385478
12626 147794 202303 -15020 159183 -138067 67532 300591 108730 108485 -158474 7260 -112187
12614 -52222 -244127 11720 279849 232855 33185 284834 -106140 232715 -128668 448713
12603 228651 -105795 -144281 -77060 364140 254388 -55105 68227 393125 117310 -351511
12592 335028 136126 -57615 113343 417858 81948 206808 196828 -7187 242302 -33411 -6330
12580 -24924 -40854 -92288 -60954 329676 -57444 52301 117241 -143711 104282 -69872 208266
12568 94592 124084 333037 -118086 114679 108705 83440 -312159 191982 -112610 277504
12557 100857 180747 -150180 -139574 -206876 -167410 529541 316775 -109167 -132657 -176048 55675
$$ packed form
12638E7694L51410A99101f2414l682A55516K9305p5933L52173j3709a1461C85478
12626A47794N4509a5020A59183a38067F7532K33059A08730k45a58474G260a12187
12614e2222j91905A1720K68129m6994C3185K51649a06140B32715a28668D48713
12603B28651a05795l8486O7221C64140j09752e5105F8227L24898A17310c51511
12592C35028A36126e7615A13343L04515H1948J24860r980g187B42302c3411f330
12580b4924j5930n1434L1334C29676e7444E2301O4940a43711A04282f9872B08266
12568I4592K9492K08953a18086A14679n974k5265c12159A91982a12610B77504
12557A00857P9890a50180J0606o7302L9466E29541k12766a09167k3490m3391E5675
$$ plain form
12545 -75844 -64363 129187 32274 -57223 299642 -53739 -12107 -43859 65334 -43549 19853
12533 -213749 -7527 -120093 -113173 31023 148647 -138117 72584 323586 91031 48040 284616
12522 284616 -96276 176269 -179379 52959 39871 105354 22510 150595 256541 45078 189239
12511 189239 88734 116136 -317877 194663 480052 94521 184709 288367 36945 266544
12501 266544 211096 171039 335342 165988 -142450 155200 107288 2495 -235760 2437 100277
12490 100277 7579 155578 -241986 85248 144547 -63672 338874 240693 59894 -23069 -88828
12479 -88828 641 -180523 101032 192424 -41212 126067 -304527 285242 -21399 37371 -92620
12467 -300792 54366 90515 -245811 271785 48971 17881 303448 366445 8379 179147 308017
$$ packed form
12545g5844J1481A29187C2274e7223B99642e3739a2107l1752F5334d3549A9853
12533b13749g527j12566O920C1023J17624a38117G2584K51002I1031m2991K36576
12522B84616i6276A76269a79379E2959j3088O5483B2510J28085J05946D5078J44161
12511A89239H8734K7402c17877A94663K85389I4521R0188J03658C6945K29599
12501B66544n5448m0057J64303A65988a42450A55200m7912B495b35760B437R7840
12490A00277G579J47999b41986H5248N9299f3672C38874r8181E9894b3069o5759
12479h8828F41a80523A01032R1392d1212A26067c04527B85242b1399C7371i2620
12467c00792E4366L6149b45811B71785D8971A7881K85567O2997H379J70768J28870
$$ plain form
12456 308017 86190 -242620 10694 56270 -140954 192195 -76698 -16265 -191087 277655
12445 51182 -103198 -249949 197981 -5967 218566 384 40765 49130 171510 -114031 -58104
12434 -58104 -152424 291640 66146 25345 -3838 115852 21537 474183 12193 87797 191470
12423 191470 122203 339224 19108 -88014 -141521 141448 171854 96478 16251 119744 -151804
12411 -134580 205665 -154486 36019 -52298 -175437 96398 38090 -143970 108140 142925
12401 142925 -29690 -283253 240173 -158039 -295545 -16421 -87760 35674 315713 150652
12390 36558 192039 105375 236378 69045 -130659 309404 -251976 -160403 48548 -102007
12379 -52805 -98818 -222758 -122608 -177261 -94054 -134086 130022 -291459 -120847 -259066
$$ packed form
12456C08017H6190b42620A0694M5576a40954A92195g6698a6265j74822B77655
12445E1182a03198j46751A97981e967B18566C84M0381Q365J22380a14031N5927
12434e8104r4320B91640F6146B5345c838A15852B1537M52646A2193P5604J03673
12423A91470o9267K17021A9108h8014n3507A41448L0406p5376A6251J03493a51804
12411a34580B05665a54486C6019e2298j23139I6398C8090a43970A08140L4785
12401A42925b9690k53563B40173a58039j37506a6421p1339C5674K80039A50652
12390C6558J55481q6664J31003F9045a30659C09404b51976R1573D8548a02007
12379e2805m6013j23940J00150n4653Q3207m0032A30022b91459a20847j38219
$$ plain form
12369 -259066 -194900 61542 211750 -62029 105552 57929 63676 -152647 -59821 -571195 87077
12357 -157285 205631 -2900 67237 -231277 86200 -35651 -341048 79791 100340 -59069 -31365
12346 -31365 92963 -151585 -148583 -66740 -128115 437468 62046 -8325 185968 95089 452802
12335 452802 113416 5402 186028 -237174 47179 52141 -349384 482227 -40770 149855 -187154
12323 169757 116481 -104467 61087 -22259 -7911 -161393 13939 -16675 -15403 145419 -134784
12311 -60901 110178 63049 -158270 70992 -28126 -37807 -28792 9752 -197871 16607 77380 100277
12299 100277 34682 120638 -183389 90337 230717 205262 180713 215948 187490 -293948 292367
12287 114665 -272213 70186 52166 -488237 86999 -277753 303408 -81620 179514 180976 256186
$$ packed form
12369b59066O4166F1542J50208f2029A05552m7623N747a52647e9821n11374H7077
12357a57285B05631b900F7237b31277H6200c5651l05397G9791K0549e9069K7704
12346c1365I2963a51585L002f6740o1375D37468F2046h325A85968r0879L57713
12335D52802A13416E402J80626b37174D7179M962c49384D82227d0770A49855a87154
12323A69757n3276a04467F1087b2259g911j53482A3939a6675J272A45419a34784
12311f0901A10178m7129a58270G0992b8126r681R015I752a97871A6607O0773K2897
12299A00277C4682Q5956a83389I0337J40380k5455k4549L5235k8458b93948B92367
12287A14665b72213G0186j8020d88237H6999b77753C03408h1620A79514J462P5210
$$ plain form
12276 256186 196941 57694 -210109 105915 193310 -81494 -139523 122498 170911 -117312 -125147
12265 -125147 278171 37272 15801 17181 -111848 74474 -280075 -332874 -1196 -254731 108537
12253 328874 190366 235945 392373 37200 -74176 -103091 187464 399978 -137822 347387
12242 343202 194921 -147119 -125735 -84109 201493 49929 87643 292522 -82004 393199
12231 11461 393209 179864 156147 167388 64797 149934 411313 238563 678074 195143
12220 544295 246558 604541 209517 277986 271848 191521 174095 -101334 221004 -169137
12209 303938 116798 246800 226373 -23045 176097 678136 227367 99556 72760 -42025
12198 120674 398824 172152 148918 188732 139503 382904 268240 142757 311759 182510
$$ packed form
12276B56186n9245E7694b10109A05915Q7395h1494n8029A22498M8413a17312p835
12265a25147B78171C7272A5801J380a11848G4474b80075n2799a196k53535A08537
12253C28874j38508M5579J56428C7200g4176k8915A87464K12514a37822C47387
12242C43202j48281a47119K1384M1626B01493D9929L7714K04879h2004C93199
12231A1461L81748A79864k3717J1241F4797Q5137K61379j72750M39511A95143
12220E44295B46558L57983B09517O8469o138q0327j7426a01334B21004a69137
12209C03938A16798J30002k0427b3045A76097N02039B27367I9556k6796d2025
12198A20674K78150A72152k3234L9814m9229K43401j14664j25483J69002j29249
$$ plain form
12188 182510 335355 321064 79247 372710 278917 236804 -55247 2088 89945 124175 -71023
12176 301087 114414 478026 447382 -12594 118996 191511 130871 182095 -80782 204614 -39374
12164 150094 242483 121518 159214 153565 -140676 383568 329983 27088 -43897 187206 178346
12153 178346 150518 12400 -169285 -177458 -31189 1690 213011 191400 218484 -518814 -150232
12141 222272 -224587 -12008 209433 177303 145947 61456 88160 74639 111919 -135144 269954
12129 95855 40914 97501 -66709 86432 -111976 66982 -81216 -33816 29579 71857 46360
12118 46360 -78835 -170838 53126 198293 -59534 -27765 17381 -10181 -187230 87130 40711
12106 193612 -140942 8159 103605 -20698 -40389 -115630 -116018 396227 45618 -246050 -128845
$$ packed form
12188A82510J52845j4291G9247K93463r3793m2113e5247B088Q7857L4230g1023
12176C01087A14414L63612l0644a2594A18996P2515o0640N1224h0782B04614c9374
12164A50094R2389j20965L7696n649a40676C83568n3585B7088d3897A87206q860
12153A78346k7828A2400a69285q173c1189A690K11321k1611K7084e18814a50232
12141B22272b24587a2008B09433l2130l1356F1456K6704j3521L7280a35144B69954
12129I5855D0914N6587f6709H6432a11976F6982h1216c3816B9579M2278k5497
12118D6360g8835r2003E3126J45167e9534b7765A7381a0181j77049H7130D0711
12106A93612a40942H159R5446b0698j9691p5241l88C96227D5618b46050J17205
$$ plain form
12095 -128845 -318305 162828 -334625 -13888 7151 -107402 -298826 170105 36502 -7689 43886
12083 83170 -41892 136666 -229303 76810 -143402 -58673 -256267 2675 148246 -179355 13020
12071 19353 -35074 -158621 -81944 -65722 -125755 -136063 209112 50803 277855 -180578 -59421
12059 -141535 57263 164769 330841 609276 1310682 832663 518986 311125 347859 -39712
12048 140952 -11431 -44663 -79989 16835 28524 333105 397476 318779 27157 -66460 159775
12036 -138932 182028 3044 -82105 313838 -248965 -210237 60999 -106274 16994 -167298 -403094
12025 -403094 53028 -170823 -94845 89296 -113573 -68715 -371808 425171 467238 274659
12015 274659 133207 165282 -297656 -16468 -227948 32830 242693 50061 188118 24048
$$ packed form
12095a28845j89460A62828c34625a3888G151a07402j91424A70105C6502g689D3886
12083H3170d1892A36666b29303G6810a43402e8673j97594B675J45571a79355A3020
12071A9353c5074j23547P6677J6222o0033j0308B09112E0803K27052a80578e9421
12059a41535E7263J07506J66072K78435P01406m78019l13677k07861L6734c9712
12048A40952a1431l3232l5326A6835J1689L04581O4371p8697B7157f6460A59775
12036a38932A82028C044h2105C13838b48965L8728F0999a06274A6994a67298k35796
12025d03094E3028a70823P5978H9296a13573M4858l03093D25171M2067j92579
12015B74659A33207L2075b97656a6468k11480C2830K09863E0061J38057B4048
$$ plain form
12004 216636 -65837 455236 -319636 115485 104212 -151567 -330814 125840 -188103 -157034
11994 -157034 -41762 106573 -179054 -32614 -297230 201263 280153 347760 13390 -137987
11983 -161614 -221965 60492 -276464 -196049 -308756 -113473 217893 308313 91622 111374 -269706
11971 -233920 125618 292555 -63804 -254782 -214112 53672 200385 -13006 127184 -116176
11960 245652 -43663 -68067 -113060 -304436 -74478 -34829 233272 -8814 -207181 -238200 82602
11948 181067 -148848 -230312 -97904 341341 -30336 -10665 116303 -192005 217374 87404
11937 -206312 220759 -21532 -353272 -186397 -62753 -153137 -109819 116895 -49984 -233794
11927 -233794 181057 208686 -292304 95484 146779 -126752 -31337 -52095 -121351 -168156 119727
$$ packed form
12004B16636f5837D55236c19636A15485j1273a51567j79247A25840a88103L1069
11994a57034d1762A06573a79054c2614k64616B01263P8890O7607A3390a37987
11983a61614o0351F0492b76464Q0415j12707a13473B17893R0420I1622J9752b69706
11971b33920A25618J66937f3804j90978M0670E3672J46713a3006A27184a16176
11960B45652d3663k4404m4993j91376g4478c4829B33272h814j98367l1019H2602
11948A81067a48848q1464i7904C41341c0336a0665A16303a92005B17374H7404
11937b06312B20759b1532l31740J66875f2753r0384M3318A16895d9984j83810
11927b33794A81057K7629b92304I5484N1295a26752c1337k0758o9256m6805A19727
$$ plain form
11915 -161377 6428 92319 -78302 89846 188916 31205 -193993 147086 -120419 -20553 -91566
11904 -91566 236312 -50911 50201 -49128 84946 146271 61701 264943 22624 -143410 149574
11892 -201300 -83122 191764 28456 81670 136880 143999 15571 17696 -132525 375632 206205
11881 206205 -91163 -25820 220564 105838 -482966 183415 71510 -405654 92755 -55802
11870 -309633 -333969 -39622 -218875 -179031 -71466 49158 -107794 -32178 139660 13107 359779
11859 359779 -89041 63833 8649 6824 158613 -146692 -195244 157475 -91129 -61704 188537
11847 516 -63665 -93294 31240 5522 81129 85267 39448 -127091 -30119 -57196 -117488 20624
11834 -28847 139504 -112928 -116593 -324220 -133561 -81091 32086 -129019 -61685 202200 231648
$$ packed form
11915a61377F428Q5891g8302H9846R9070C1205a93993A47086a20419b0553p1013
11904i1566B36312e0911E0201d9128H4946O1325F1701K03242B2624a43410A49574
11892b01300h3122A91764B8456N3214N5210P119A5571K125a32525C75632j69427
11881B06205i1163b5820B20564A05838d82966A83415G1510d05654I2755e5802
11870c09633k4336c9622j79253L9844g1466D9158a07794c2178A39660A3107L46672
11859C59779h9041F3833H649j825J51789a46692m8552A57475i1129K9425A88537
11847E16f3665k9629C1240E522P5607M138C9448a27091c0119k7077o0292B0624
11834b8847A39504a12928l665k07627a33561N2470C2086a29019f1685B02200K9448
$$ plain form
11823 231648 -258906 -273917 -146234 -163144 -57291 59275 289351 205547 33434 117300 68557
11812 68557 197987 61801 29010 -383190 -100146 -277626 -39485 165272 -116639 -29729
11801 -178340 71717 230228 -120772 35683 -13459 2416 -112992 -160447 -153547 64409 288780
11790 288780 266003 -36654 -278486 35076 -145906 -182935 95895 -48854 393594 162887 49143
11778 -207901 -47718 -64252 -166637 -258610 -286001 -22894 -25880 12472 481050 -181757 -69724
11766 -27135 20221 -28622 -92777 63819 -222402 -153793 -181482 82745 127406 16878 72195
11755 72195 59163 43085 146891 348494 -88428 -32720 29765 -215287 130148 -269544 -70050
11743 192442 181454 132458 -316342 9329 -281751 -106163 103992 71689 157593 15620 11907
$$ packed form
11823B31648b58906j5011J27683j6910e7291E9275K30076q3804C3434Q3866m8743
11812F8557J29430F1801B9010c83190a00146j77480c9485A65272a16639b9729
11801a78340G1717J58511a20772C5683a3459B416a12992m7455O900F4409K24371
11790B88780k2777c6654k41832C5076a45906l7029I5895d8854C93594A62887D9143
11778b07901d7718j6534j02385r1973k7391b2894k986A2472M68578a81757f9724
11766b7135B0221b8622o4155F3819b22402O8609k7689H2745M4661A6878N5317
11755G2195j3032j6078J03806K01603h8428c2720B9765b15287A30148b69544g0050
11743A92442j0988m8996c16342I329b81751a06163A03992l2303Q5904A5620l713
$$ plain form
11732 11907 -68092 -36987 -193109 -113061 -98519 220439 -129795 -26963 138962 -199025 -116563
11721 -116563 -169865 -11572 -175362 -34784 -261353 -91523 63283 -391312 -42276 183652 -81572
11709 -296786 456315 18827 -522573 126875 72546 263424 67855 338674 -130654 507624
11698 -239816 7092 -8334 105546 26157 -46759 -163134 -17567 -277454 9780 -104343 146121
11686 -80203 -1375 -145856 248536 282917 87656 110060 -138268 139149 214833 -205008 316529
11674 -177458 271999 -188369 -31467 -231504 -237858 -34669 -190375 59966 -8259 -243541 -36789
11662 128367 -317682 -110724 15171 -95788 240467 16890 354531 -15768 -68740 68904 -12761
11650 -18637 -118822 -28496 220753 223794 168289 -85013 47460 221052 243500 -112473 46500
$$ packed form
11732A1907f8092L1105j56122Q0048J4542B20439a29795b6963A38962a99025Q2462
11721a16563n3302a1572j63790c4784k26569i1523F3283c91312d2276A83652h1572
11709b96786D56315A8827e22573A26875n4329J90878F7855K70819a30654E07624
11698b39816G092h334A05546B6157d6759j16375a7567k59887I780a04343A46121
11686h0203a375j44481B48536L4381H7656K2404a38268A39149P5684b05008C16529
11674a77458B71999a88369c1467k00037o354c4669j55706E9966h259k35282c6789
11662A28367c17682a10724A5171i5788B40467A6890L37641a5768n2972F8904a2761
11650a8637j00185b8496B20753L041n5505h5013D7460J73592K2448a12473D6500
$$ plain form
11638 113776 -13447 78654 -5889 -158073 229387 73870 -84324 -199680 -112062 -354777 41589
11626 111330 52554 44658 316983 -91518 285855 20181 -16265 87279 188476 381734 -223991
11614 248262 251242 162635 -169371 25983 -66378 -87050 -99998 -126933 87815 138613 -108867
11602 5444 157318 -223566 50395 111799 -154909 189255 -144282 154520 162322 129384 -64848
11590 145516 210351 -120253 -263329 104525 61771 -127171 399644 273471 -223529 132963
11579 -237137 -107430 -147906 133553 160509 7403 194661 296537 -98760 -17901 188326 -67263
11567 -108095 92502 84936 103884 -11006 -153418 447026 -79609 -167442 117091 -108088 278160
11555 70788 351440 -206233 -329522 -173780 121958 -100471 -68498 -20613 -31384 299027
$$ packed form
11638A13776a3447G8654e889j52184B29387G3870h4324j15356Q7618k42715D1589
11626A11330E2554p896K72325i1518B85855B0181a6265H7279J01197J93258b23991
11614B48262K980q8607a69371B5983f6378k0672j2948k6935H7815N0798a08867
11602E444J51874b23566E0395O1404a54909A89255a44282A54520P802l2938f4848
11590A45516O4835a20253j43076A04525m2754a27171C99644j26173b23529A32963
11579b37137a07430m0476A33553K6956G403J87258J01876i8760a7901A88326f7263
11567a08095I2502p566J8948a1006j42412D47026g9609q7833A17091a08088B78160
11555G0788K80652b06233j23289J55742A21958a00471L1973b0613j0771B99027
$$ plain form
11544 293271 266444 45594 335462 -56005 156238 -16721 35095 51466 -51827 201464 87152
11532 44896 123680 80288 360086 60077 -70804 237189 -179894 43467 376618 382547 186555
11520 85610 -44047 -63070 248753 -162321 27754 403162 865 -115735 -72641 16539 -225922
11508 60697 231903 1466 302709 180726 -176586 56811 42558 -31217 152581 147980 321152
11497 321152 130695 75710 18535 -47083 -67756 -105235 58430 360250 97033 45951 286660
11486 286660 27158 279733 85543 -106706 -234265 266764 271216 11523 487672 159676
11475 114439 109975 348744 -271732 90726 -75088 106088 176437 250025 216454 190993 -78627
11463 301185 -18633 313591 127536 -92331 363329 81058 166165 44443 242290 382306
$$ packed form
11544B93271k6827D5594K89868e6005A56238a6721C5095J6371e1827B01464H7152
11532D4896P8784m3392K79798F0077g0804B37189a79894D3467L33151N929A86555
11520H5610d4047j9023B48753a62321B7754L75408H65a15735M3094A6539b25922
11508F0697J71206A466L01243j21983a76586E6811j4253c1217A52581m601J73172
11497C21152A30695n4985A8535d7083k0673l7479E8430L01820I7033D5951K40709
11486B86660B7158K52575H5543a06706j27559B66764M452A1523M76149A59676
11475A14439m464K38769b71732I0726g5088A06088P0349P3588l3571k5461g8627
11463C01185a8633C13591A27536i2331C63329H1058Q5107D4443J97847J40016
$$ plain form
11453 382306 61243 50583 20115 -48027 84618 -182381 -257102 104127 141121 255039 155409
11442 155409 3931 128866 97527 -228039 -174485 105242 261210 156111 -166481 149584
11431 -36142 -155773 106108 130101 36898 270973 63991 -115303 -16410 -251529 -94559 10842
11419 -134110 -133194 342513 -115977 -187555 168130 131409 75452 -98354 -9150 151350 -29731
11407 -321470 -70852 206374 -19317 13386 497949 113667 -35554 94655 -41176 -51502 -96634
11396 -96634 171006 -55865 349735 -37871 -107895 249144 77142 454572 -414940 93409 -7487
11384 117763 -80020 145418 -33265 -24412 39956 314658 -98959 -178625 144381 137376 -116578
11372 -87089 125725 32159 -250220 1503 -143254 -248244 -209718 129236 -49535 -107046 -97958
$$ packed form
11453C82306F1243j0660B0115d8027H4618a82381p4721A04127L6994J13918r9630
11442A55409C931J24935l1339b28039N3554A05242J55968j05099a66481A49584
11431c6142j19631A06108K3993C6898K34075F3991a15303a6410k35119i4559A0842
11419a34110R16C42513a15977p1578A68130l6721n5957i8354i150A51350b9731
11407c21470g0852B06374a9317A3386M84563A13667c5554I4655d1176j0326m5132
11396i6634A71006e5865C49735c7871p0024B49144G7142L77430d14940I3409g487
11384A17763h0020A45418c3265Q853C9956K74702i8959p9666A44381p005a16578
11372h7089A25725C2159b50220A503a43254j04990L8526A29236d9535n7511R088
$$ plain form
11361 -97958 -297044 347508 -142247 -106447 236785 48786 171780 142313 315631 191646
11351 191646 -34446 -377564 47454 -429294 125814 -248888 381758 10094 -340328 175796
11340 18309 75154 -167643 88353 234259 146649 -583382 -17366 265150 53400 2818 -101781
11328 -11479 -163936 104992 -177216 113664 235095 247896 -209355 -110267 -42127 143722
11317 47924 -151324 126314 -356934 -38775 196285 31620 70704 -7907 -39319 -61693 -85915
11306 -85915 400316 -74817 -99626 17574 57766 105665 39710 1246 21550 -90184 174074
11294 61 -87718 370321 208750 -248931 297211 -355606 116766 5188 -27633 219051 213336
11283 213336 -26922 -2481 136237 -11051 132849 39405 -403356 -22073 -24681 32188 28791
$$ packed form
11361i7958j99086C47508a42247L5800B36785D8786J22994k9467J73318j23985
11351A91646c4446l43118D7454d29294A25814b48888C81758A0094c40328A75796
11340A8309N6845a67643H8353J45906q7610e83382a7366B65150E3400B818a01781
11328a1479j52457A04992a77216A13664J21431J2801b09355R9088d2127A43722
11317D7924a51324A26314c56934c8775A96285C1620L9084g907l1412k2374k4222
11306h5915D00316g4817k4809A7574M0192M7899C9710A246K0304i0184A74074
11294F1h7718C70321j61571b48931B97211c55606A16766E188b7633B19051n715
11283B13336b6922b481A36237a1051A32849C9405d03356b2073k608C2188l397
$$ plain form
11272 28791 41603 -186715 13106 -155959 352649 -414081 21597 -279612 -5058 18463 -45827
11260 -83097 148838 -167894 -198119 200217 -156176 -49338 18287 12554 -119816 -195925 -159634
11249 -159634 47621 -14852 -190427 -296339 -185737 -183747 -67298 119146 -241400 -7261 -498251
11238 -498251 161360 -33983 155407 131524 254435 184709 94600 41336 -12025 77001 -89403
11226 86801 9413 64631 -129741 -202123 -404184 -53653 -288153 -112669 -66626 189818 65473
11214 -65233 318593 -105479 6423 -178111 260287 -118619 -98917 -139867 -29150 -18570 -36440
11203 -36440 26136 -94145 -31718 -22785 -316037 73113 299977 211808 127193 213067 17627
11191 -310525 252189 -104889 89358 -132680 135899 -172103 139714 37744 15394 -223179
$$ packed form
11272B8791J2812a86715A3106a55959C52649d14081B1597b79612e058A8463d5827
11260h3097A48838a67894l0225B00217a56176d9338A8287n733a19816p6109L6291
11249a59634D7621a4852j75575j05912J10602J990f7298A19146b41400g261m90990
11238d98251A61360c3983A55407k3883J22911o9726r0109D1336a2025G7001h9403
11226H6801I413N5218a29741p2382k02061e3653k34500a12669M6043A89818F5473
11214f5233C18593a05479F423a78111B60287a18619J9702m0950b9150J0580j7870
11203c6440B6136i4145c1718Q933k93252G3113K26864q8169q4615Q5874A7627
11191c10525B52189a04889H9358a32680A35899a72103A39714C7744A5394b23179
$$ plain form
11180 -45601 -184586 -145158 59766 93701 -428807 61581 -76758 61337 -55582 -58664 -276596
11169 -276596 -13604 -26019 253679 230179 -282647 -179915 -133712 -38908 38325 -192617 14304
11157 -319062 67400 -124526 -40512 -276885 -277461 14552 -168343 -110001 90560 -105732 -85117
11146 -85117 -41175 -87659 41476 -9353 84882 136616 125356 -236964 157096 352931 21656
11134 62889 52778 193203 13141 -130127 185397 246515 83358 -11042 -83284 -15631 171063
11122 -66930 266308 -170710 121532 201241 -110490 75356 -126648 107848 -213169 -68369
11111 -116363 74122 -422235 -60339 -47488 348973 -52880 -310398 53548 241876 46582 352308
11100 352308 141827 146415 354742 299987 -72660 271744 -324031 268820 18946 37947 200224
$$ packed form
11180d5601j38985L9428E9766L3935d28807F1581g6758F1337e5582l082k17932
11169b76596a3604j2415B53679k3500b82647J02732M6203c8908C8325a92617A4304
11157c19062F7400a24526d0512k36373n76A4552a68343N8342I0560a05732K0615
11146h5117d1175m6484D1476i353H4882N1734j1260b36964A57096J95835B1656
11134F2889j0111J40425A3141a30127A85397O1118H3358a1042p2242a5631A71063
11122f6930B66308a70710A21532P9709a10490G5356a26648A07848b13169f8369
11111a16363G4122d22235f0339J2851C48973e2880k57518E3548J88328D6582L05726
11100C52308A41827M588K08327n4755g2660B71744c24031B68820A8946J9001J62277
$$ plain form
11089 200224 220399 5268 -22239 50513 38241 149106 247812 362969 160592 332128 451096
11078 451096 378027 278037 316729 449957 70600 63116 80631 479318 404640 304495 506375
11067 506375 248585 137467 462998 385043 409072 672079 375295 748385 573858 685658
11057 685658 414225 453903 885729 512510 680419 676617 723872 1009657 706012 631180
11047 631180 947493 998864 783554 741156 1107463 710235 507925 1093046 695664 381664
11037 381664 565563 836734 423282 428810 869129 792150 776315 551906 873937 989149
11027 989149 581082 1114339 766528 738375 836637 395252 596314 570199 1001937 755479
11017 755479 881823 647280 865469 510049 738296 647829 693413 917402 627194 481921
$$ packed form
11089B00224K0175E268b2239E0513j2272J10865R8706J15157A60592J71536J18968
11078D51096p3069r9990L8692J33228G0600p484J7515L98687p4678j00145K01880
11067E06375B48585j11118L25531p7955K4029K63007k96784L73090j74527J11800
11057F85658k71433L9678M31826l73219J67909l802M7255K85785l03645p4832
11047F31180L16313N1371k15310m2398L66307l97228k02310N85121l97382l14000
11037C81664J83899K71171m13452N528M40319p6979j5835k24409L22031J15212
11027I89149m08067N33257l47811k8153R8262C95252K01062k6115M31738k46458
11017G55479J26344k34543K18189l55420K28247r0467M5584K23989k90208j45273
$$ plain form
11007 481921 721679 1050475 895336 528328 638088 718213 732533 806701 739597 1160462
10997 1160462 953435 928265 722717 663008 751437 489318 687982 847227 831103 833724
10987 833724 724819 734056 618110 967508 1097118 1035255 822652 1113499 1460619 1186838
10977 1186838 1897701 2193731 1794425 2335506 2893400 2812472 3300114 3165525 3053286 3129979
10967 3129979 3114344 2525498 2551989 1851523 1647125 1609444 1582704 1536760 1231767 1146877
10957 1146877 1170224 1247148 1400821 1194001 755797 605026 939738 699928 651871 437263
10947 437263 317616 599915 405278 162438 491027 389871 108584 29570 225638 139850
10937 139850 161117 322038 373226 204872 428909 -48277 -26084 -325847 120736 207119
$$ packed form
11007D81921K39758L28796j55139l67008J09760Q0125J4320P4168o7104M20865
10997A160462k07027k5170k05548n9709Q8429k62119J98664J59245j6124K621
10987H33724j08905R237j15946L49398J29610o1863k12603K90847L47120k73781
10977A186838P10863K96030l99306N41081N57894q0928M87642j34589j12239P6693
10967C129979j5635n88846K6491p00466k04398l7681k6740m5944l04993q4890
10957A146877K3347P6924J53673k06820m38204j50771L34712k39810m8057k14608
10947D37263j19647K82299j94637A62438L28589j01156A08584B9570J96068q5788
10937A39850K1267J60921N1188j68354K24037d8277K2193k99763A20736Q6383
$$ plain form
10927 207119 104942 -131599 -105531 -52767 186777 -50636 98514 264852 81356 292218
10917 292218 -132998 67213 150727 63764 187040 -374802 79074 -24520 -15743 -43036 -41952
10906 -41952 427685 -24785 -164461 -234645 -123802 103789 -155746 -105956 -14316 87635 328460
10895 328460 367305 105364 -225375 -9217 42490 326604 -200630 81023 -3151 20110 50134
10884 50134 -50585 -233640 -186148 51432 -182732 -261568 32657 -261940 120363 42856 13880
10872 -120926 -143321 465300 -289654 -209012 5393 92010 183991 81619 -94109 -150070 -158939
10861 -158939 -318853 -150098 -16014 -35510 377649 -143843 -87281 -129519 -79904 193018
10850 186599 -59655 -62084 -24543 129552 -166066 -145030 -132833 -207842 36569 61819 -345759
$$ packed form
10927B07119j02177a31599K6068N2764A86777e0636I8514J66338H1356K10862
10917B92218a32998F7213Q3514F3764J23276c74802G9074b4520Q777k7293J084
10906d1952D27685b4785j39676p0184J10843A03789a55746M9790a4316H7635K40825
10895C28460L8845A05364b25375i217D2490K84114b00630H1023c151B0110L0024
10884E0134e0585j83055M7492E1432a82732p8836C2657b61940A20363D2856A3880
10872a20926k2395D65300b89654Q0642E393Q6617R1981H1619i4109n5961q869
10861a58939j59914a50098a6014j9496C77649a43843N6562m2238M9615A93018
10850A86599e9655k429b4543A29552a66066K1036J2197p5009C6569K5250c45759
$$ plain form
10838 -4228 -24606 -76772 -116455 13791 -39715 87288 -212894 224108 -272024 -220271 -162661
10827 -162661 -118253 -8139 232569 -166012 309352 -194602 -396641 46205 -113581 -494 -33292
10816 -33292 22965 17519 -62753 -6370 72134 -38774 85582 -284559 -300871 -3886 -343486 -46737
10803 124956 11641 91508 -30913 -196582 -118001 24463 -27288 -68643 -26914 -236545 33612
10791 51448 -88547 -93169 -35459 -304045 -38937 151090 50003 320 163213 -87973 139673
10779 94308 -45200 -78644 -114214 -129252 96642 -93032 -456460 -141516 284296 241577 85472
10767 -87622 -190760 -75356 52063 97005 114274 -191194 -17601 238586 225818 -176721 -207957
10756 -207957 47682 219499 -35065 132542 -75430 -306333 -128574 51103 115846 -93097 -96678
$$ packed form
10838d228k0378n2166l9683A3791c9715H7288b12894B24108b72024N1753N7610
10827a62661M4408h139B32569a66012C09352a94602k02039D6205a13581d94l2798
10816c3292B2965n446f2753f370G2134c8774H5582b84559j6312c886l39600d6737
10803A24956A1641P9867c0913j65669P8581B4463b7288m1355b6914k09631C3612
10791E1448h8547m622c5459k68586c8937A51090E0003C20J62893h7973A39673
10779I4308d5200l3444l5570j5038I6642i3032l63428a41516B84296m2719H5472
10767h7622j03138g5356E2063M4942J7269a91194a7601B38586j2768a76721l1236
10756b07957D7682J71817c5065A32542g5430k30903a28574E1103O4743i3097l581
$$ plain form
10745 -96678 198394 -167606 -77177 29275 119818 -90727 -22263 61449 -109519 328529 -246698
10733 -83638 -200386 -86918 210400 43835 323209 -79735 48295 -56762 121495 -145090 66503
10721 -75952 205829 -96755 484717 -287855 61646 8566 69015 65093 -259269 -50403 -24511
10709 437998 -145566 -200638 -44961 161131 76724 -396945 11335 -166169 -344821 -50919
10698 -201303 47951 171365 -280629 30598 90221 259127 -333721 -137197 -243438 3475
10687 -13966 23304 -52363 -70098 -5098 -86688 -172371 119948 -148618 -175187 -66198 137460
10675 139844 159613 -116 -170891 -255642 62504 -44938 -384201 -278260 152218 318444 -1653
10663 -146295 53411 -122448 16732 13248 -16712 -36232 -38764 -49896 195168 -201069 49659
$$ packed form
10745i6678A98394a67606g7177B9275R0543i0727b2263F1449a09519C28529b46698
10733h3638j16748h6918B10400D3835K79374g9735D8295e6762A21495a45090F6503
10721g5952B05829i6755D84717b87855F1646H566O0449l922b59269e0403b4511
10709D37998a45566n5072d4961A61131G6724c96945A1335a66169j78652e0919
10698b01303D7951J23414b80629C0598N9623J68906c33721a37197j06241C475
10687a3966B3304e2363j7735e098q1590q5683A19948a48618k6569f6198A37460
10675A39844J9769a16j70775q4751F2504d4938l39263J05941A52218J66226a653
10663a46295E3411a22448A6732l484a6712j9520k532j1132A95168b01069D9659
$$ plain form
10651 -223973 -292633 98365 138335 14479 68543 -284969 22142 54199 192553 -362163 -399783
10640 -399783 -106191 238618 -70057 332131 160087 -442780 -169165 -58562 -144146 -318268
10630 -318268 -53755 72950 -45 23527 -111859 38908 124528 -23772 -288602 -178428 37050
10618 -75297 -110688 -146204 -55867 197285 212252 247186 -162652 -63442 -61787 72078 -116683
10606 -171849 -38657 281317 167323 -156276 -77285 -81282 -507 -97780 -60783 -281718 131434
10594 -143460 155930 252585 -339562 -108261 224959 214654 -292413 101201 280482 -87387
10583 -47187 12207 -27728 -362080 -314235 -478 -89013 151993 -117631 189261 25471 -13228
10571 -435655 -224451 -258069 -28047 60986 393743 -209048 -350390 -311692 -3 13709 123585
$$ packed form
10651b23973o8660I8365L9970A4479N4064b84969B2142L2057J38354c62163l7620
10640c99783a06191B38618g0057C32131A60087d42780a69165e8562q5584j74122
10630c18268e3755G2950d5B3527a11859C8908Q5620b3772k64830J10174C7050
10618g5297l5391l5516e5867A97285J4967L4934a62652f3442J655G2078a16683
10606a71849c8657B81317j13994a56276g7285l997e07r7273L6997k20935A31434
10594a43460A55930R6655c39562a08261B24959j0305b92413A01201J79281h7387
10583d7187A2207b7728l34352M7845d78q8535A51993a17631A89261B5471a3228
10571d35655K11204l3618b8047F0986L32757b09048j41342L8698cA3709J09876
$$ plain form
10560 123585 -145109 39348 202022 400473 -89127 -216773 51878 -319343 -126026 -42662
10549 -56267 -79719 -359282 86048 93465 19402 95350 242623 -59973 121639 -216047 -53882
10537 -48340 -203831 -78748 96518 -38098 689 -148797 80787 -62988 -12727 59777 -204169
10525 -153273 119272 46169 57304 -62806 19299 -291433 -140611 202056 142428 123216 281481
10514 281481 345569 62117 -430071 19597 77596 -200075 155105 -28014 -23094 -42519 -82980
10503 -82980 -100449 -339953 -162905 -344271 -80239 104834 -122215 -50316 17357 -86286 -234125
10492 -234125 -174399 -114667 96744 246555 22218 402525 -21141 40482 -35153 181571 200563
10481 200563 -2100 358685 346521 190231 -96175 155539 38216 -61667 78862 116714 117178
$$ packed form
10560A23585a45109C9348J62674J98451h9127j27646E1878c19343a26026d2662
10549e6267k3452k79563H6048P417A9402P5948J47273e9973A21639b16047e3882
10537d8340j55491g8748I6518c8098F89a48797H0787f2988a2727E9777b04169
10525a53273A19272D6169J1135f2806A9299b91433a40611B02056n9628j9212J58265
10514B81481O4088F2117d30071A9597N7999b00075A55105b8014M920j9425m0461
10503h2980j7469k39504a62905j81366h0239A04834a22215e0316A7357h6286j47839
10492b34125N9726N9732I6744J49811B2218L80307b1141D0482c5153A81571J8992
10481B00563b100C58685j2164j56290i6175A55539C8216f1667G8862L7852M64
$$ plain form
10470 117178 120899 -23568 106099 72829 99026 177014 4998 45326 -234526 -521566 -39404
10458 147114 257260 168510 288516 -15367 -11683 15874 -7503 -243811 38611 30171 -9257 -98051
10446 -98051 25805 -159224 -89690 40394 96105 321476 -15233 -160153 -298602 -27829 119989
10434 -12111 220460 182953 311162 207293 68021 -53291 -183742 -53527 6094 -220106 159410
10422 -144086 33711 74295 12650 178139 -127478 -173681 -100050 164476 -289548 -74586 313485
10410 190991 -155052 84684 310487 -131594 -41438 -62046 -178245 9437 14438 139522 43961
10398 -126372 27632 -206584 -132960 38492 6842 85984 325357 161057 248305 21608 186084
10387 186084 -144628 287118 -170697 385937 305430 -29116 210081 32692 295817 -50168
$$ packed form
10470A17178L721b3568A06099l3270K6197P7988D998M0328b34526k87040c9404
10458A47114J10146q8750J20006a5367L684A5874g503k36308C8611q440i257q8794
10446i8051B5805a59224O9534D0394N5711K25371a5233j44920j38449b7829A19989
10434a2111B20460l7507J28209j03869F8021e3291j30451e3527F094b20106A59410
10422a44086C3711M0584A2650J65489a27478m6203P3631A64476b89548g4586C13485
10410A90991a55052H4684K25803a31594d1438k0608j16199I437N001J25084D3961
10398a26372B7632b06584P3624C8492F842P9142K39373A61057Q7248B1608J64476
10387A86084a44628B87118a70697C85937q0507b9116B10081C2692K63125e0168
$$ plain form
10376 271653 214988 146000 283305 132201 393251 392706 37113 193350 488688 546966 363886
10365 363886 695869 323295 167895 206768 154225 311818 324535 9319 209880 291345 -109568
10353 30314 196358 469212 408046 447289 299814 350928 -94997 384626 326082 448171 267236
10342 267236 527609 144966 101161 156940 139523 330674 262383 -64996 16615 468424 265470
10331 265470 26396 211493 36083 96950 169996 30709 -177420 113366 131282 209634 268225
10320 268225 413121 749709 219016 301941 -99242 -136878 42643 -46247 61512 180911 -74134
10308 -336826 -34568 -184524 -199093 90838 -27196 41541 -37097 -54579 95770 428765 102997
10296 -137329 -97009 -209373 -48101 -8028 171329 -130854 45093 -129095 46866 297369 56291
$$ packed form
10376B71653n6665o8988J37305A32201K61050n45C7113J56237K95338N8278j83080
10365C63886L31983C23295j55400L8873n2543J57593J2717I319K00561Q1465a09568
10353C0314J66044K72854o1166L9243j47475N1114i4997C84626n8544J22089j80935
10342B67236K60373A44966m3805N5779j7417J91151o8291f4996A6615M51809k02954
10331B65470B6396J85097C6083O0867P3046C0709a77420A13366J7916P8352N8591
10320B68225J44896L36588B19016Q2925i9242l7636D2643d6247F1512J19399g4134
10308c36826c4568j49956j4569I0838b7196D1541c7097j7482I5770L32995A02997
10296a37329M0320j12364d8101h028A71329a30854D5093a29095D6866K50503E6291
$$ plain form
10284 217313 -15868 -97913 -155386 -432374 163449 259678 -39113 127273 -107268 -17868 -1412
10272 254648 -83697 34022 366115 199768 79332 -106033 -61198 196427 -81091 -105925 -46004
10260 -153740 -160281 125878 37483 413414 225386 234070 34778 113754 -8681 -7638 -101764 -122765
10248 -122765 214484 167148 57111 -76676 185875 26684 -200547 -97259 -403965 143950
10237 150014 206911 -61269 264223 -137135 159965 -363992 82115 -199647 27081 -50202
10226 -135755 -29282 24326 -233067 91384 -113295 53150 -376704 -12907 -8209 -25848 -320769
10215 -320769 -44238 -81457 -106726 -326394 -51429 67358 -403528 -139064 304719 192704
10205 192704 56549 -325755 205126 41728 -42958 36995 27770 -191796 214637 -271169 120163
$$ packed form
10284B17313a5868q2045n7473k76988A63449R6229c9113A27273a07268a7868a412
10272B54648h3697C4022L32093j66347G9332a06033M4835A96427h1091k4834d6004
10260a53740o541A25878C7483L75931j88028Q684C4778P8976h681J043r4126k1001
10248a22765B14484m7336E7111g6676A85875B6684b00547i7259l06706A43950
10237A50014N6897f1269B64223a37135A59965c63992H2115a99647B7081e0202
10226a35755b9282B4326b33067I1384a13295E3150c76704a2907M698j7639k94921
10215c20769d4238l7219k5269k19668e1429F7358d03528a39064C04719j12015
10205A92704E6549c25755B05126D1728d2958C6995r225a91796B14637b71169A20163
$$ plain form
10193 -195145 51535 110814 -144677 86854 -51338 -11008 -111026 209266 223842 -80770 -192466
10182 -192466 -47114 67912 47966 65393 -137463 -268029 -346315 76870 -121946 -291851 -85327
10170 -109698 15779 -96874 82229 -24719 -212695 -396311 202368 76179 105514 -211266 11539
10158 -199399 -317443 -172815 -58107 -38421 -117638 16727 -224900 -166155 204637 -175566
10147 -200963 -22413 220301 15048 -24689 -367333 95082 156677 -312308 306571 -30535 -328511
10136 -328511 131213 122093 -235775 -96950 -291755 -451917 1520 -109774 -408144 -293215
10126 -293215 73135 -164645 72569 268519 108950 -101018 -139536 52481 -55002 -180274
10116 -180274 -95250 -213351 -221535 -206650 267085 21531 -145983 -176766 -319856 -58018 -259714
$$ packed form
10193a95145E1535N9279a44677H6854e1338a1008j00018B09266J4576h0770j11696
10182a92466d7114F7912j9946J7427a37463j30566p8286G6870a21946j69905h5327
10170a09698A5779i6874H2229b4719j87976j83616B02368G6179K9335b11266A1539
10158a99399j18044J44628e8107J9686p9217A6727b24900N8745B04637a75566
10147b00963b2413B20301A5048b4689l42644I5082O1595c12308C06571c0535k97976
10136c28511A31213r120b35775i6950j94805j60162A520a09774k98370J14929
10126b93215G3135a64645G2569J95950A08950a01018l8518E2481e5002j25272
10116a80274Q5024j18101q184J4885B67085B1531a45983l0783j43090e8018k01696
$$ plain form
10105 -259714 -265210 13762 -141119 -108554 -376455 9415 -114786 -297844 -229954 -162591 69332
10093 -215809 81273 -136914 -234135 225733 -165240 -186834 20743 151161 164933 -133101
10082 -107465 306541 394195 -88101 -64492 53695 114931 344395 33792 220699 -6792 170897
10070 214516 157921 -213989 33341 -319879 -106843 -4924 -46096 -19362 139567 2468 101898
10059 101898 115615 209335 -356790 -128065 176624 -88424 65044 220584 336482 -264133
10048 46732 -232716 -17290 -115772 -58864 -188845 -67747 -200477 -38890 -192747 -62931 -36989
10037 -36989 1182 139687 -22553 -152916 -288995 -252311 -233372 -141951 84750 -177 -124936
10026 -124936 -210182 60940 -281336 151399 87821 -314337 146146 -166014 84810 -117183
$$ packed form
10105b59714n496A3762a41119L2565k67901I415a14786j83058O7890O7363F9332
10093b15809H1273a36914r7221B25733a65240k1594B0743J30418J3772a33101
10082a07465C06541Q7654h8101K3609E3695O1236K29464C3792J86907f792A70897
10070B14516n6595b13989C3341c19879a06843d924m1172a9362A39567B468R9430
10059A01898J3717R3720c56790a28065A76624h8424F5044J55540J15898b64133
10048D6732b32716a7290r8482N6908j29981f7747j32730c8890j53857f2931K5942
10037c6989A182J38505b2553j30363j36079L6684J8939R1421H4750a77j24759
10026a24936q5246F0940b81336A51399o3578c14337A46146a66014H4810a17183
$$ plain form
10015 27530 -69457 -86129 174260 -129605 -56323 -367699 -425673 -291128 -9714 303466 -79079
10003 80222 -53568 -152033 -225724 -89368 -50231 8969 -36284 29344 -332378 -102257 -136340
9992 -136340 143369 89079 -161863 55593 -239145 -35908 -295653 40646 136262 -105969 -163388
9981 -163388 -226531 -83552 -42187 35445 -332428 68881 84859 -131777 29482 -384381 45167
9969 -114730 -80146 -153536 -269116 -447155 258124 -350374 201541 42344 -237249 113078
9958 -44658 -147195 170514 482403 13337 -249785 -289734 111065 -99449 -288930 -35623 145023
9946 -165351 -256901 76882 57105 -243707 -14942 9611 -65128 -239114 210112 49615 -170419
9934 97472 -78977 -285329 -8115 -98845 -330455 140830 119698 -154378 -37868 -172865 -99001
$$ packed form
10015B7530f9457j6672A74260a29605e6323l11376n7974J34545i714C03466g9079
10003H0222e3568r8465p3691h9368L9137H969c6284B9344c32378a02257l4083
9992a36340A43369n4290a61863E5593b39145c5908k59745D0646R5616a05969n7419
9981a63388o3143h3552M1365C5445c32428F8881J5978a31777B9482c84381D5167
9969a14730L4584p3390j15580j78039B58124c50374B01541D2344b37249A13078
9958d4658j02537A70514L11889A3337b49785l9949A11065i9449j89481c5623A45023
9946a65351r1550G6882j9777b43707a4942I611f5128j73986B10112D9615a70419
9934I7472g8977k06352h115r0730k31610A40830k1132a54378c7868j34997P3864
$$ plain form
9923 -99001 -121655 -389355 292608 66767 -173178 -148366 38452 -119656 -33662 118143 -119203
9911 -294474 174619 103258 -223000 -148858 58751 -17214 -267712 -164061 238818 -12698 -159664
9900 -159664 112670 -249314 70375 -177175 -459801 23298 -106913 112025 -12415 -217356
9890 -217356 -300296 134428 -244793 -112369 -225070 -31097 20669 -321893 166503 -74218
9879 -58854 -74765 191520 17066 44125 -112091 6129 -113094 -32370 -286801 319572 19896
9867 -105064 213885 29718 46423 -290460 217502 -449042 111489 -334268 -247869 -81454
9856 212814 -160138 -48674 232673 164595 -147645 -151655 -136202 -408362 -170981 299636 31078
9844 148892 -13704 -11226 198699 -222811 -85013 -176751 -52362 197140 -48578 -216975 45971
$$ packed form
9923i9001k2654k67700B92608F6767a73178K4812C8452a19656c3662A18143a19203
9911b94474A74619p1361b23000P4142E8751a7214k50498J03651B38818a2698j46966
9900a59664A12670b49314G0375a77175k82626B3298a06913A12025a2415k04941
9890b17356q2940A34428b44793a12369j12701c1097B0669c21893A66503g4218
9879e8854j5911A91520A7066K7059a12091F129a13094c2370k54431C19572A9896
9867a05064B13885B9718J6705b90460B17502d49042A11489c34268Q6399h1454
9856B12814a60138d8674B32673o8078a47645m010J5453k72160a70981B99636C1078
9844A48892a3704K478A98699b22811h5013r1738e2362A97140d8578j68397D5971
$$ plain form
9832 -31623 -66038 -23031 116558 347968 146768 299632 60363 -242546 83436 -112335 -230902
9821 -230902 -145245 -123789 8310 -289626 -126415 -325108 -44511 -213714 14076 -19192 193177
9809 -21414 20762 -126766 107571 52880 42668 -231006 21130 -169840 -89525 -208465 45589
9797 -313464 -149063 -310357 -37072 -288126 92332 -272157 217131 -684086 94405 307098
9787 307098 266958 -204344 221992 58055 137159 -264475 -169829 -131709 -585749 101886 144904
9776 144904 20067 -35885 29826 120755 56411 -316020 -283052 9911 -100996 -48382 -103082
9765 -103082 -208176 -137994 32155 -176831 -514325 -18081 -214010 237865 188618 -9963 140266
9753 167612 -309742 -53642 -145138 -17302 -5112 -322080 -149081 -10691 -43349 -48962 -177828
$$ packed form
9832c1623l4415b3031A16558K31410A46768J52864F0363b42546H3436a12335j18567
9821b30902Q5657K1456H310b89626a26415j98693d4511j69203A4076a9192A93177
9809b1414B0762a26766A07571E2880j0212b31006B1130a69840Q0315j18940D5589
9797c13464a49063j61294c7072k51054I2332b72157B17131f84086I4405K12693
9787C07098m0140b04344B21992E8055P9104b64475R4646L8120m54040A01886M3018
9776A44904B0067c5885B9826R0929E6411c16020L2968I911a00996d8382n4700
9765a03082j05094P0182C2155a76831l37494a8081j95929B37865m9247i963A40266
9753A67612c09742e3642r1496a7302e112l16968a49081a0691l2658n613j28866
$$ plain form
9742 -177828 200524 -184627 21191 54033 6212 -137740 90211 -28772 30705 231779 232077
9731 232077 17717 -176959 146904 -13599 -39738 -350090 -259220 -200643 -231205 -24625 -6697
9719 -49203 -125945 45694 -250597 121336 315405 218735 35443 -125594 -175229 -151057 -117144
9708 -117144 -70434 -93201 31096 -247986 -125431 82687 47292 -450868 -107347 86175 -194224
9696 -315380 -1235 51518 -171605 -86660 79969 -57873 -32270 -66753 6556 -173473 -48833 -204485
9684 -204485 -331352 252171 65620 -251750 4228 83823 -437918 -160452 -44080 -184402 185584
9672 173112 -45212 -5128 121575 -96416 -208552 -65330 9750 -198605 -94258 -200002 -212377
9661 -212377 -69754 86562 -95493 126658 -106993 -146166 372054 -172257 56392 -94603 104081
$$ packed form
9742a77828B00524a84627B1191L2842F212a37740I0211b8772C0705K01074K98
9731B32077A7717a76959A46904a3599k6139l10352R0870N8577l0562b4625f697
9719d9203p6742D5694b50597A21336J94069r6670C5443a25594m9635K4172L3913
9708a17144M6710k2767C1096b47986J22555H2687l5395d50868a07347H6175a94224
9696c15380a235E1518a71605Q4945G9969e7873K5603l4483F556a73473d8833j55652
9684b04485j26867B52171F5620b51750D228P9595d37918a60452d4080j40322A85584
9672A73112d5212e128A21575i6416j12136f5330I750a98605i4258j05744j2375
9661b12377f9754H6562i5493A26658a06993l9173C72054a72257E6392i4603A04081
$$ plain form
9649 -158564 -284134 505 -62086 -117616 -29098 129410 -26457 -161560 -321558 162250 -102160
9637 -108931 -219610 -291437 -205946 267727 -35268 -33116 -6727 -53936 -138885 59237 -2079 -441224
9625 -441224 -123321 160198 -86791 82857 -24129 -411156 142684 60244 -98771 -163593 69189
9613 -32846 169145 -282969 205713 -120612 90604 -293341 129014 84903 -9484 37088 -421125
9601 -70187 144368 -101257 -225442 -80665 -367169 -252731 149814 -19250 -448656 256023
9590 122945 177730 -141587 -161320 231365 179596 -225120 -204263 -42891 -64696 -337523 -325130
9579 -325130 -317375 -93178 109136 48650 -527840 -139476 344786 -89401 66733 153860 98967
9568 98967 138666 -50937 -195890 -51694 -126010 -59790 152412 25311 -316183 67457 -221315
$$ packed form
9649a58564j25570E05f2086n5530b9098A29410b6457j35103j59998A62250a02160
9637a08931j10679p1827Q5491B67727c5268K152f727m7209q4949E9237b079m39145
9625d41224a23321A60198h6791H2857b4129l87027A42684F0244i8771o4822F9189
9613c2846A69145b82969B05713a20612I0604b93341A29014m4111i484C7088d21125
9601g0187A44368a01257j24185h0665k86504J14438A49814a9250m29406B56023
9590A22945N4785a41587j9733B31365n1769b25120K0857d2891k1805k72827J2393
9579c25130P755i3178A09136D8650e27840a39476C44786h9401F6733Q7127n4893
9568I8967L9699e0937j44953e1694p4316e9790A52412B5311c16183F7457b21315
$$ plain form
9556 -166077 275309 -243093 -137616 -447867 -213040 25167 -564295 129331 -249840 -186573
9546 -186573 -294949 -115385 52269 -302168 -118131 -229930 1816 -30847 -1295 -116702 -34374
9534 95432 -140877 -267277 -233711 -58507 96844 468105 -284241 38842 -258007 -130561 -106946
9523 -106946 -244026 -98768 -175569 -211639 132142 -119400 -58900 -215514 196371 22608 -143896
9511 130506 36296 -145257 -76251 172728 -254053 -335194 88490 -212062 -131105 -241779 -14536
9499 99399 -119931 -36456 8705 -100770 -326363 -70928 -141905 -127197 167851 -54130 147772
9487 -344932 -76840 -3045 72229 -406681 -162141 -56931 -81586 42873 -68756 -336623 41698
9475 505 -392090 102663 125049 13894 -197785 -191208 -612 -99527 -214113 28889 -166590 -40879
$$ packed form
9556a66077B75309b43093J05477l10251b13040B5167e64295A29331b49840O3267
9546a86573j08376a15385E2269c02168a18131j11799A816c0847a295j15407c4374
9534I5432a40877j26400L3566e8507I6844L71261b84241C8842b58007J27446K3615
9523a06946j37080i8768p6801l6070A32142a19400e8900j56614A96371B2608a43896
9511A30506C6296a45257O9006A72728b54053q1141H8490b12062Q0957j10674a4536
9499I9399a19931c6456H705a00770k25593g0928p0977J4708A67851e4130A47772
9487c44932g6840c045G2229d06681a62141e6931k4655D2873f8756k67867D1698
9475E05c92090A02663K2386A3894a97785O577f12r8915j14586B8889a66590d0879
$$ plain form
9462 54859 11223 102416 -70313 -257705 189988 166647 134188 137555 -323355 -6248 -70518 79015
9449 -357314 -172202 -215273 -25847 -207855 97530 -135087 -168363 121527 62923 158618 80737
9438 80737 -51264 -310484 -86655 -157565 -331075 77049 -275280 -244306 -183293 36454 -172911
9426 121543 -315514 220392 -65996 183997 -28872 -218170 212088 -27085 88023 149644 40192
9414 -193873 -165417 -99128 -79977 -233127 -314491 -261971 -290456 -96759 -69203 -234178 -22336
9402 55877 -45523 -61608 98616 -164550 9700 -11066 109352 156334 -139264 88727 27682
9390 167920 59311 -203473 98816 171002 -298025 -393472 -29332 14498 -187590 161326 -433971
9378 91571 -36674 -209472 -55860 -153855 113665 -159007 90383 -537325 -220147 83603 186583
$$ packed form
9462E4859A1223R1193g0313j87392A89988k3341l2459L367c23355f248o4270G9015
9449c57314a72202m3071b5847j82008I7530a35087l3276A21527n8604R5695p7881
9438H0737e1264k59220h6655p0910j73510G7049b75280L0974O1013C6454a72911
9426A21543c15514B20392f5996A83997b8872j89298B12088b7085H8023O1621D0192
9414a93873K8456O6289J9151j53150q1364N2520k8485i6759K7556j64975b2336
9402E5877d5523j6085I8616a64550I700a1066A09352M6982a39264H8727B7682
9390A67920E9311b03473I8816P2186b98025r5447b9332A4498a87590A61326d33971
9378I1571c6674j72798e5860r7995A13665a59007I0383e37325b20147H3603J02980
$$ plain form
9367 186583 -131838 -111520 100825 304052 12354 -214046 -110360 99348 -127213 -80321
9357 -80321 -79390 -127527 85373 221811 -76358 129388 101559 -349191 -62454 95291 105840 3835
9344 -237560 5552 -75502 -49823 -420183 -483435 186390 -140003 15624 -266266 149595 122204
9333 122204 -97791 -130281 18813 -222183 117624 -219912 18643 104145 -197982 -256124 -404759
9322 -404759 115203 106574 -55918 209518 113326 79166 -6925 88678 117478 -56722 -100125 -144315
9310 -144315 214699 243621 17795 -84133 -153573 31786 111290 -315089 231402 47913 2205
9298 -53237 -131579 12237 -1211 333874 -236246 -113670 -216572 -99933 170701 130815 -132615
9286 61599 -211564 -126385 18819 90594 3041 -70185 24357 -142204 113962 -139535 162027
$$ packed form
9367A86583a31838K0318A00825K03227A2354b14046J03686I9348a27213M6892
9357h0321R31m8137H5373J36438g6358A29388k7829c49191f2454I5291J0549C835
9344b37560E552g5502K5679l70360o3252A86390a40003A5624b66266A49595k7391
9333A22204i7791l2490A8813b22183A17624b19912A8643Q5502a97982n8142j48635
9322d04759A15203q629e5918B09518r6192l4160f925H8678K8800e6722m3403m4190
9310a44315B14699K8922A7795h4133o9440C1786P9504c15089B31402D7913B205
9298e3237p8342A2237a211C33874b36246a13670j02902i9933A70701l9886a32615
9286F1599b11564Q5179A8819P1775C041g0185B4357a42204A13962a39535A62027
$$ plain form
9274 -88935 -93269 -128614 -254148 69997 158889 -214458 -118167 -53965 -227144 -11778 22803
9262 -81723 303223 -314455 172754 174213 -47419 37042 -15324 67675 -42739 -17646 -203695
9251 -203695 124770 -138851 -269557 -396787 -179586 134296 98533 -30345 -154033 -297470
9241 -297470 61613 190749 -314799 -181973 52243 -319491 160029 -15172 -153833 31190
9230 -355779 -149362 -194830 83168 -185780 -60735 -86157 108480 -94631 -26496 13407 -318598
9218 -228235 -303155 -67628 -209882 12744 357994 -184678 -22308 -67850 -74675 -23644 230597
9206 65174 -31581 -94521 -61847 -24860 -318679 -122479 -110551 -58019 -128076 51865 232639
9195 232639 -262764 -13691 -650958 -8334 -46086 -176485 -67779 -139447 -257311 -132635 81854
$$ packed form
9274h8935m334l5345j25534F9997Q8892b14458R6291e3965j73179a1778B2803
9262h1723C03223c14455A72754J459d7419C7042a5324F7675d2739a7646j86049
9251b03695A24770a38851j30706j27230a79586A34296l5763c0345j23688j43437
9241b97470F1613J29136c14799J32826E2243c19491A60029a5172j38661C1190
9230c55779a49362m5468H3168a85780f0735k5422A08480i4631b6496A3407c18598
9218b28235p4920f7628j42254A2744L45250a84678b2308m5542o825b3644B30597
9206F5174c1581o2940L2674b4860k93819a22479J1928N2532p0057E1865J80774
9195B32639b62764a3691o37267h334l7752j30399f7779p1668j17864J24676H1854
$$ plain form
9183 293575 -185946 217513 -106647 -17580 -410596 -163172 956 -163252 98477 67772 236668
9172 236668 -56081 103778 -343132 245412 -32411 76299 -237048 -476102 185800 -69299
9161 15847 -277389 -468580 340114 -189523 -34057 214914 -46257 244250 -70262 32970 152335
9150 152335 -144534 -84914 -149401 -44848 -156757 -30246 100318 -279631 -272393 14540 -131414
9138 -258242 -303518 -457687 111794 -195883 17234 161396 82629 34489 -101970 196616
9127 169463 136223 -49398 -152416 -389850 -576129 177625 -50691 -152671 298011 -166605
9116 28639 -454685 -3853 -288949 151793 -58373 -270550 -112970 -193199 -106198 -150604 -207169
9105 -207169 -205903 15897 94638 213564 327466 -34364 177409 -69301 70746 22237 -348366
$$ packed form
9183B93575a85946B17513a06647a7580l93016a63172I56a63252I8477l0705J68896
9172B36668e6081A03778c43132B45412c2411G6299b37048k39054A85800f9299
9161A5847b77389j91191C40114a89523c4057B14914d6257B44250g0262C2970J19365
9150A52335a44534N9620o4487d4848j11909c0246A00318b79631P238A4540a31414
9138b58242m5276j54169A11794a95883A7234J44162p8767C4489a01970A96616
9127A69463l3240d9398j03018k37434j86279A77625e0691j01980B98011a66605
9116B8639d54685c853k85096A51793e8373k12177a12970q0229Q7001m4406n6565
9105b07169J266A5897P8741J18926J13902c4364A77409f9301G0746B2237c48366
$$ plain form
9093 -192178 43324 -82482 -147902 -42587 -103935 9771 100885 23024 -231859 -117502 115177
9081 -154228 -169426 332925 -57320 -243853 -310226 359837 -198999 74147 -73307 -139880 286870
9069 212165 -17180 87786 -108200 188721 -380178 -303619 3037 -126510 -256864 158180 153833
9058 153833 13702 -215575 -193491 -99827 19392 -9102 -90436 191691 270312 -163555 54070
9046 77593 58311 -351178 -171438 -132260 335076 -27976 68807 20124 -190190 -61621 -239251
9035 -239251 92204 149406 -269317 167972 64882 72201 124632 -208478 -102542 -40153 71134
9023 -50274 -35811 -370568 -164215 3491 -26092 -129703 -392238 -44160 55345 -426677 89515
9011 -61064 -3252 -80104 -161353 318200 227623 105884 198908 -44499 -172853 -130328 -87840
$$ packed form
9093a92178D3324h2482o5420d2587o1348I771R1114B3024b31859J14357A15177
9081a54228j5198C32925e7320j86533o6373C59837a98999G4147g3307o6573B86870
9069B12165a7180H7786a08200A88721c80178P6559C037a26510j30354A58180m347
9058A53833A3702b15575K2084R3664A9392i102q1334A91691P8621a63555E4070
9046G7593j9282c51178a71438L9178C35076b7976F8807B0124a90190f1621j77630
9035b39251I2204N7202b69317A67972F4882P319N2431b08478a02542d0153G1134
9023e0274J4463l34757a64215C491b6092j03611k62535d4160E5345d26677H9515
9011f1064c252p6852q1249C18200r0577A05884R3024d4499j28354M2525M2488
$$ plain form
9000 -87840 64370 -490049 60175 -21744 185945 259703 -84707 -53057 329985 -291706 -157628
8989 -157628 -49258 26690 -322270 111023 -43011 153369 -232888 -75537 90652 50631 -152677
8977 63718 78297 -106156 -65760 -300865 52262 129930 147611 10880 -114461 -85017 388331
8965 -28438 -66367 29546 76419 -144440 -364784 283487 -94805 82887 -66729 -98120 50616
8953 -67341 -65436 244075 -88469 104509 -119348 67782 221927 -35575 -15732 16410 -141654
8941 -183145 -249297 -27698 -165393 172652 134895 91373 -417405 213741 35140 15911 86147
8930 86147 108353 150470 -290625 70641 345311 93916 346634 697138 2137538 2438632
8920 2438632 838720 328411 226582 257019 77145 159314 -142317 -340565 89868 -55130
$$ packed form
9000h7840F4370d90049F0175b1744A85945P3758h4707L1650C29985b91706J34078
8989a57628d9258B6690c22270A11023d3011A53369b32888g5537I0652m0021a52677
8977F3718J4579a06156M0396k35105E2262P7668J7681A0880a14461K9444C88331
8965b8438l7929B9546M6873a44440k20344B83487i4805H2887f6729l1391E0616
8953f7341J905B44075h8469A04509a19348F7782J54145c5575a5732A6410a41654
8941a83145o6152b7698j37695A72652l7757m3522d17405B13741C5140A5911P0236
8930H6147K2206M2117b90625G0641K74670I3916K52718L50504J440400L01094
8920B438632H38720C28411j01829L0437G7145Q2169a42317j98248H9868e5130
$$ plain form
8909 -268148 -261414 -51356 -159510 35529 -647230 -174273 -360832 -34175 -84439 -206940 83607
8897 -19499 83577 152223 -353269 237922 68746 156368 -165851 -248472 -82902 -201646 -202429
8886 -202429 -94196 -5152 172259 -167178 -118759 -125617 -239663 266407 -352246 -63524 126460
8874 217295 -148944 -229484 -274914 175639 -243515 -148654 -26706 21785 -72028 251185 -20287
8862 -77055 -263632 -165297 -252643 104864 -92367 -40996 -202626 124926 -87545 60504 -109115
$$ packed form
8909b68148O734e1356j08154C5529f47230a74273j86559c4175n0264j22501H3607
8897a9499H3577O8646c53269B37922F8746Q7622a65851q2621h2902j18744p83
8886b02429i4196e152A72259a67178M8419o858j14046B66407c52246f3524A26460
8874B17295a48944q0540m5430A75639b43515R4861b6706B1785g2028B51185b0287
8862g7055j86577R8335q7346A04864i2367d0996j61630A24926h7545F0504a09115
$$ [...]
##END NTUPLES=NMR SPECTRUM
##END=
