##TITLE=AC1714_3158_8749746_dLcrRJoP4r
##JCAMPDX= 6.0         $$ Bruker NMR JCAMP-DX V2.0
##DATA TYPE= NMR SPECTRUM
##DATA CLASS= NTUPLES
##ORIGIN= BRUKER
##OWNER= Administrator
$$ 1.72 TOPSPIN		Version 2.1
$$ 2015-08-11 20:06:29.585 -0700  Administrator@X
$$ Compression mode = diff/dup
##.OBSERVE FREQUENCY= 400.02188249412
##.OBSERVE NUCLEUS= ^1H
##.ACQUISITION MODE= SIMULTANEOUS (DQD)
##.ACQUISITION SCHEME= undefined
##.AVERAGES= 64
##.DIGITISER RES= 22
##SPECTROMETER/DATA SYSTEM= spect
##.PULSE SEQUENCE= noesygpps1d.comp
##.SOLVENT NAME= COFFEE_meoh
##.SHIFT REFERENCE= INTERNAL, COFFEE_meoh, 1, 14.9609
##AUDIT TRAIL= $$ (NUMBER, WHEN, WHO, WHERE, PROCESS, VERSION, WHAT)
$$ ##TITLE= Audit trail, TOPSPIN		Version 2.1
$$ ##JCAMPDX= 5.01
$$ ##ORIGIN= Bruker BioSpin GmbH
$$ ##OWNER= Administrator
$$ $$ E:\/data/COFFEE/nmr/AC1714_3158_8749746_dLcrRJoP4r/62/pdata/1/auditp.txt
$$ ##AUDIT TRAIL=  $$ (NUMBER, WHEN, WHO, WHERE, PROCESS, VERSION, WHAT)
(   1,<2015-08-11 20:06:24.054 -0700>,<Administrator>,<X>,<go>,<TOPSPIN 2.1>,
      <created by zg
	started at 2015-08-11 19:54:54.179 -0700,
	POWCHK enabled, PULCHK disabled,
       configuration hash MD5:
       21 0F 79 D6 B3 7B B4 F6 88 20 88 DB 03 48 BD 9F
       data hash MD5: 64K
       F7 70 C0 ED C0 12 99 27 53 6A 66 B9 96 BF 78 F4>)
(   2,<2015-08-11 20:06:27.492 -0700>,<Administrator>,<X>,<proc1d>,<TOPSPIN 2.1>,
      <Start of raw data processing
       efp LB = 0.3 FT_mod = 6 PKNL = 1 PHC0 = 0 PHC1 = 0 SI = 128K 
       data hash MD5: 128K
       8C D7 96 37 F1 6A EB 94 E3 A1 F0 7D DF 84 69 4A>)
(   3,<2015-08-11 20:06:28.382 -0700>,<Administrator>,<X>,<proc1d>,<TOPSPIN 2.1>,
      <pk PHC0 = -89.86816 PHC1 = 0 
       data hash MD5: 128K
       E8 87 22 CF 97 44 F4 BF 03 0E 40 45 A0 00 F6 B9>)
(   4,<2015-08-11 20:06:28.773 -0700>,<Administrator>,<X>,<proc1d>,<TOPSPIN 2.1>,
      <abs ABSG = 1 
       data hash MD5: 128K
       60 94 8B 40 30 77 14 EA DD 39 DA CF 9C DF 9A 17>)
(   5,<2015-08-11 20:06:28.867 -0700>,<Administrator>,<X>,<proc1d>,<TOPSPIN 2.1>,
      <abs ABSG = 2 
       data hash MD5: 128K
       99 7E 69 C9 0F 5F DF 96 AE C5 A8 87 B7 9D 60 4D>)
(   6,<2015-08-11 20:06:28.960 -0700>,<Administrator>,<X>,<proc1d>,<TOPSPIN 2.1>,
      <abs ABSG = 3 
       data hash MD5: 128K
       66 46 74 AD DB 43 F1 BE E7 FD CB B1 86 BE A6 D0>)
(   7,<2015-08-11 20:06:29.039 -0700>,<Administrator>,<X>,<proc1d>,<TOPSPIN 2.1>,
      <abs ABSG = 4 
       data hash MD5: 128K
       4C C7 5D 9D 6E FC 45 25 8F DF 60 D3 C8 24 BE 00>)
(   8,<2015-08-11 20:06:29.179 -0700>,<Administrator>,<X>,<proc1d>,<TOPSPIN 2.1>,
      <abs ABSG = 5 
       data hash MD5: 128K
       A2 CE 02 DF 95 2E 4A 14 41 AD 40 33 16 31 32 DF>)
$$ ##END=
$$ 
$$ $$ hash MD5
$$ $$ 18 45 A9 69 97 91 01 28 E4 59 03 42 03 8A 46 D7
##$RELAX= 
##$RELAX= 
##$RELAX= 
##$RELAX= 
##$RELAX= 
##$RELAX= 
##$RELAX= 
##$RELAX= 
$$ Bruker specific parameters
$$ --------------------------
##$DU= <E:\>
##$EXPNO= 62
$$ [...]
150 150 150 150 150 150 150 150
##$TP07= 0
##$TPNAME0= <>
##$TPNAME1= <>
##$TPNAME2= <>
##$TPNAME3= <>
##$TPNAME4= <>
##$TPNAME5= <>
##$TPNAME6= <>
##$TPNAME7= <>
##$TPOAL= (0..7)
0.5 0.5 0.5 0.5 0.5 0.5 0.5 0.5
##$TPOFFS= (0..7)
0 0 0 0 0 0 0 0
##$TUNHIN= 0
##$TUNHOUT= 0
##$TUNXOUT= 0
##$USERA1= <user>
##$USERA2= <user>
##$USERA3= <user>
##$USERA4= <user>
##$USERA5= <user>
##$V9= 5
##$VALIST= <valist>
##$VCLIST= <CCCCCCCCCCCCCCC>
##$VD= 0
##$VDLIST= <DDDDDDDDDDDDDDD>
##$VPLIST= <PPPPPPPPPPPPPPP>
##$VTLIST= <TTTTTTTTTTTTTTT>
##$WBST= 2048
##$WBSW= 25
##$XGAIN= (0..3)
0 0 0 0
##$XL= 0
##$YL= 0
##$YMAX_a= 6577314
##$YMIN_a= -12138929
##$ZGOPTNS= <>
##$ZL1= 120
##$ZL2= 120
##$ZL3= 120
##$ZL4= 120
##$ABSF1= 14.9609
##$ABSF2= -5.597281
##$ABSG= 5
##$ABSL= 3
##$ALPHA= 0
##$AQORDER= 0
##$ASSFAC= 0
##$ASSFACI= 0
##$ASSFACX= 0
##$ASSWID= 0
##$AUNMP= <proc_prof1d_extract.lims>
##$AXLEFT= 0
##$AXNAME= <>
##$AXNUC= <1H>
##$AXRIGHT= 0
##$AXTYPE= 0
##$AXUNIT= <>
##$AZFE= 0.1
##$AZFW= 0.1
##$BCFW= 0
##$BC_mod= 0
##$BYTORDP= 0
##$COROFFS= 0
##$CY= 15
##$DATMOD= 1
##$DC= 0
##$DFILT= <>
##$DTYPP= 0
##$F1P= 0
##$F2P= 0
##$FCOR= 0.5
##$FTSIZE= 131072
##$FT_mod= 6
##$GAMMA= 0
##$GB= 0
##$INTBC= 1
##$INTSCL= 1
##$ISEN= 128
##$LB= 0.3
##$LEV0= 0
##$LPBIN= 0
##$MAXI= 10000
##$MC2= 0
##$MEAN= 0
##$ME_mod= 0
##$MI= 0
##$NCOEF= 0
##$NC_proc= -2
##$NLEV= 6
##$NOISF1= 0
##$NOISF2= 0
##$NSP= 0
##$NTH_PI= 0
##$NZP= 0
##$OFFSET= 14.9609
##$PC= 1
##$PHC0= -89.86816
##$PHC1= 0
##$PH_mod= 1
##$PKNL= yes
##$PPARMOD= 0
##$PPDIAG= 0
##$PPIPTYP= 0
##$PPMPNUM= 2147483647
##$PPRESOL= 1
##$PSCAL= 4
##$PSIGN= 0
##$PYNMP= <proc.py>
##$REVERSE= no
##$SF= 400.020009676438
##$SI= 131072
##$SIGF1= 0
##$SIGF2= 0
##$SINO= 400
##$SIOLD= 131072
##$SPECTYP= <>
##$SREGLST= <1H.CDCl3>
##$SSB= 0
##$STSI= 131072
##$STSR= 0
##$SW_p= 8223.68421052631
##$SYMM= 0
##$S_DEV= 0
##$TDeff= 65536
##$TDoff= 0
##$TI= <>
##$TILT= no
##$TM1= 0
##$TM2= 0
##$TOPLEV= 0
##$USERP1= <user>
##$USERP2= <user>
##$USERP3= <user>
##$USERP4= <user>
##$USERP5= <user>
##$WDW= 1
##$XDIM= 131072
##$YMAX_p= 408455760
##$YMIN_p= -11848
##$CURPLOT= <Network HP LaserJet P1505>
##$CURPRIN= <$Network HP LaserJet P1505>
##$DFORMAT= <normdp>
##$LAYOUT= <+/1D_H.xwp>
##$LFORMAT= <normlp>
##$PFORMAT= <normpl>
##$SURQMSG= 1
$$ End of Bruker specific parameters
$$ ---------------------------------
##NTUPLES= NMR SPECTRUM
##VAR_NAME=  FREQUENCY,     SPECTRUM/REAL,   SPECTRUM/IMAG
##SYMBOL=    X,             R,               I
##VAR_TYPE=  INDEPENDENT,   DEPENDENT,       DEPENDENT
##VAR_FORM=  AFFN,          ASDF,            ASDF
##VAR_DIM=   131072,        131072,          131072
##UNITS=     HZ,            ARBITRARY UNITS, ARBITRARY UNITS
##FACTOR=    0.0627417313425164, 1,          1
##FIRST=     8223.62146879497, -2872,        -57024
##LAST=      0,             -1029,           -57941
##MIN=       0,             -11848,          0
##MAX=       8223.62146879497, 408455760,    0
$$ Real data points
##PAGE= N=1
##DATA TABLE= (X++(R..R)), XYDATA
$$ [...]
61537C65299J755J381J625K342K845K791K450J985J143o6r91j249j429k248l353
$$ 365299 367054 368435 370060 372402 375247 378038 380488 382473 383616 383550 382559 381310 379881 377633 374280
61522C74280l758l264k598k200j777j148p19p57q63o13k52k39n11o77p11r44j380
$$ 374280 370522 367258 364660 362460 360683 359535 358816 358059 357196 356583 356331 356092 355581 354904 354193 353249 351869
61505C51869j580j333j108j480k243k487j734o32k12n85q31k66O89J082O34m3
$$ 351869 350289 348956 347848 346368 344125 341638 339904 339272 339060 338475 337644 337378 338067 339149 339783 339740
61489C39740j72M52J337J682J003l77j527j718r76J61J129J553J334P83L89K88
$$ 339740 339568 340020 341357 343039 344042 343665 342138 340420 339444 339605 340734 342287 343621 344404 344793 345081
61473C45081K31K03N44J257J640J104m0j040j581j746j493p79M6N61Q18J056J090
$$ 345081 345312 345515 346059 347316 348956 350060 350020 348980 347399 345653 344160 343381 343427 343988 344806 345862 346952
61456C46952O17j7q2N11J086J140Q60O11M88M87O30P97Q46J017J698K741L460
$$ 346952 347569 347552 347470 347981 349067 350207 351067 351678 352166 352653 353283 354080 354926 355943 357641 360382 363842
61439C63842L526L405L681M390N203N883O303O340O043N671N374N070M767M661
$$ 363842 367368 370773 374454 378844 384047 389930 396233 402573 408616 414287 419661 424731 429498 434159
61425D34159M745M643M146L581L371L424L333K975K466J656K09j680l163l666
$$ 434159 438904 443547 447693 451274 454645 458069 461402 464377 466843 468499 468708 467028 463865 460199
61411D60199l682m196n404o544o996p005o920o407n078l579l049l503l678k818
$$ 460199 456517 452321 446917 440373 433377 426372 419452 413045 407967 404388 401339 397836 394158 391340
61397C91340j737j519j990k209j899j486j125o87m83r55j627j387j16R03O77j24
$$ 391340 389603 388084 386094 383885 381986 380500 379375 378688 378205 377250 375623 374236 374120 375023 375700 375576
61381C75576j65P64J678J890J783K005K484K662K418K289K640L034K819K136J801
$$ 375576 375411 376175 377853 379743 381526 383531 386015 388677 391095 393384 396024 399058 401877 404013 405814
61366D05814K115K439K263K046K483L384M055M412N026O110P260Q150Q886R614
$$ 405814 407929 410368 412631 414677 417160 420544 424599 429011 434037 440147 447407 455557 464443 474057
61352D74057J0443J1678J3535J5518J6781J7166J7262J7358J6998J5803J3975
$$ 474057 484500 496178 509713 525231 542012 559178 576440 593798 610796 626599 640574
61341F40574J1815R432P151N496M358K945Q70j345l297n367p802r877j0779j0788
$$ 640574 652389 661821 668972 674468 678826 681771 682641 681296 677999 672632 664830 654953 644174 633386
61327F33386j0700j0603j0013q885p581o159m586l403l196l512l349k790k997
$$ 633386 622686 612083 602070 593185 585604 579445 574859 571456 568260 564748 561399 558609 555612
61314E55612m282n266m561k510n49O03J359K286L473M786O094P235Q098Q727R013
$$ 555612 551330 546064 541503 538993 538444 539047 540406 542692 546165 550951 557045 564280 572378 581105 590118
61299E90118Q433O525L585M97k137m351o364q091r211r362q284o165l853k292
$$ 590118 598551 605076 608661 609158 607021 602670 596306 588215 579004 569642 561358 555193 551340 549048
61285E49048j535p59N05J680K081K053K559L862N293O266O896P491Q109Q748R470
$$ 549048 547513 546754 547259 548939 551020 553073 555632 559494 564787 571053 577949 585440 593549 602297 611767
61270F11767J0128J0465J0648J1217J2183J2758J2455J1888J2075J3297J5212
$$ 611767 621895 632360 643008 654225 666408 679166 691621 703509 715584 728881 744093
61259G44093J7609K0391K3081K5097K6278K6448K4736K0249J3514O358J49n121
$$ 744093 761702 782093 805174 830271 856549 882997 907733 927982 941496 947854 948003 942882
61247I42882r855j3852j6721j8561j9575j9599j8633j7465j6944j6824j5981j3847
$$ 942882 933027 919175 902454 883893 864318 844719 826086 808621 791677 774853 758872 745025
61235G45025j1076q695p050n860m914m265l791k967j450L07J405J580J471J691
$$ 745025 733949 725254 718204 712344 707430 703165 699374 696407 694957 695264 696669 698249 699720 701411
61221G01411J994J843J322Q32K99n67j331j212m25j50p87j238n34P47J392J291
$$ 701411 703405 705248 706570 707402 707701 707134 705803 704591 704166 704016 703229 701991 701457 702204 703596 704887
61205G04887J306J885K697L520M646O393Q818J1825J5127J8142K0462K2305K4118
$$ 704887 706193 708078 710775 714295 718941 725334 734152 745977 761104 779246 799708 822013 846131
61192H46131K5867K7198K8007K8272K7597K5618K2722J9703J6807J3829J1048
$$ 846131 871998 899196 927203 955475 983072 1008690 1031412 1051115 1067922 1081751 1092799
61181A092799R120P975O784N278M142L632K764N74k473n275p698j0518j3877j6866
$$ 1092799 1101919 1109894 1116678 1121956 1126098 1129730 1132494 1133068 1130595 1125320 1117622 1107104 1093227 1076361
61167A076361j8688j9581k0274k1113k1994k2766k3317k3442k2884k1524j9468
$$ 1076361 1057673 1038092 1017818 996705 974711 951945 928628 905186 882302 860778 841310
61156H41310j7043j4678j2580j0516q173n737l827k637j542J18K139L670M202
$$ 841310 824267 809589 797009 786493 778320 772583 768756 766119 764577 764695 766834 770504 774706
61143G74706L761K272n23m158p055p787o506m601l095j930o58R25L002N765Q874
$$ 774706 778467 780739 780216 776058 769003 761216 754710 750109 747014 745084 744426 745351 748353 754118 762992
61128G62992J1479J3233J4816J6958J9441K1560K3244K4978K6872K8391K9064
$$ 762992 774471 787704 802520 819478 838919 860479 883723 908701 935573 963964 993028
61117I93028K8957K8519K8330K8804K9688K9994K8916K6711K4215K1739J9078
$$ 993028 1021985 1050504 1078834 1107638 1137326 1167320 1196236 1222947 1247162 1268901 1287979
61106A287979J6317J3834J1514Q754N402J960j289m709q594j2758j6959k1135
$$ 1287979 1304296 1318130 1329644 1338398 1343800 1345760 1344471 1339762 1331168 1318410 1301451 1280316
61094A280316k4957k7884k9879l1421l2561l2700l1647l0083k8501k6512k3845
$$ 1280316 1255359 1227475 1197596 1166175 1133614 1100914 1069267 1039184 1010683 984171 960326
61083I60326k1284j9789j9198j8546j7326j5758j4271j3155j2397j1343r220o449
$$ 960326 939042 919253 900055 881509 864183 848425 834154 820999 808602 797259 788039 781590
61071G81590m658m590m800l491r63J033J851K480L724N256O559P632Q519R146
$$ 781590 776932 772342 767542 764051 763088 764121 765972 768452 772176 777432 783991 791623 800142 809288
61057H09288R769J0800J2085J3235J4514J6431J8537J9843K0448K1455K3177K4764
$$ 809288 819057 829857 841942 855177 869691 886122 904659 924502 944950 966405 989582 1014346
61045A014346K5877K7298K9349L1110L1923L2435L3298L4056L4283L4729L6207
$$ 1014346 1040223 1067521 1096870 1127980 1159903 1192338 1225636 1259692 1293975 1328704 1364911
61034A364911L8140L9398L9975M0796M2335M4413M6928M9813N2473N4082N4415
$$ 1364911 1403051 1442449 1482424 1523220 1565555 1609968 1656896 1706709 1759182 1813264 1867679
61023A867679N3966N3578N4261N7049O2574P1087Q2791R7455J13849J30657J48069
$$ 1867679 1921645 1975223 2029484 2086533 2149107 2220194 2302985 2400440 2514289 2644946 2793015
61012B793015J67348J89243K14780K47576K92545L51383M21842N02382N94324
$$ 2793015 2960363 3149606 3364386 3611962 3904507 4255890 4677732 5180114 5774438
61003E774438O98581Q15745R53537J129835J363128J663522K034539K464806K887896
$$ 5774438 6473019 7288764 8242301 9372136 10735264 12398786 14433325 16898131 19786027
60994A9786027L147232L042797K468942J531418N16698k74007o76060o81649l71161
$$ 19786027 22933259 25976056 28444998 29976416 30493114 30219107 29543047 28861398 28490237
60985B8490237J24503O04255Q13014N57446j57975j114109k009332k624888k896060
$$ 28490237 28614740 29218995 30032009 30589455 30431480 29317371 27308039 24683151 21787091
60976B1787091k874982k659566k347017k013017j701493j426441j187081r81930
$$ 21787091 18912109 16252543 13905526 11892509 10191016 8764575 7577494 6595564
60968F595564q10126o67413n48045m49384l70959l10400k63560k27337j99463
$$ 6595564 5785438 5118025 4569980 4120596 3749637 3439237 3175677 2948340 2748877
60959B748877j76692j56277j38407j24472j13400j02319r0253p8685o8706o0159
$$ 2748877 2572185 2415908 2277501 2153029 2039629 1937310 1847057 1768372 1699666 1639507
60949A639507n3510n0046m9742n0799n1691n2169n2086n0910m8715m6263m3878
$$ 1639507 1585997 1535951 1486209 1435410 1383719 1331550 1279464 1228554 1179839 1133576 1089698
60938A089698m1398l9115l7393l5558l2745k9704k8023k7525k6301k3607k0882
$$ 1089698 1048300 1009185 971792 936234 903489 873785 845762 818237 791936 768329 747447
60927G47447j9358j8408j6985j5188j3507j1915j0528r973j0217j0078q807p108
$$ 747447 728089 709681 692696 677508 664001 652086 641558 631585 621368 611290 602483 595375
60915E95375n824m613k911j271o19p32n94J06O99O44J99l4K26O73P52L51J02N50
$$ 595375 589551 584938 582027 580756 580137 579405 578811 578917 579616 580260 580459 580425 580651 581324 582076 582427 582529 583079
60897E83079J137P65o13j798j970j666j753k180k266j708q07j06q4p77j540j673
$$ 583079 584216 584981 584368 582570 580600 578934 577181 575001 572735 571027 570220 570114 570030 569253 567713 566040
60881E66040j401j622k616l721m438m999n533n561m880m182m209m779n136m831
$$ 566040 564639 563017 560401 556680 552242 547243 541710 536149 531269 527087 522878 518099 512963 508132
60867E08132l945k900k298k415k649k075o82P13J826L143M491M676L264J630J252
$$ 508132 504187 501287 498989 496574 493925 491850 491168 491881 493707 496850 501341 506017 509281 510911 512163
60852E12163J803K077K070K846M620O222O599N928N033M378L896L418K959K663
$$ 512163 513966 516043 518113 520959 525579 531801 538400 544328 549361 553739 557635 561053 564012 566675
60838E66675K512K139J240J19n69o79p06r41j111j001p84n01N1O54O46Ll89o8
$$ 566675 569187 571326 572566 572685 572116 571437 570731 569790 568679 567678 566894 566393 566444 567098 567744 567747 567358 567290
60820E67290K17l46j408k131k437k791l351m097n267o787p861p992p889q399r001
$$ 567290 567507 567161 565753 563622 561185 558394 555043 550946 545679 538892 531031 523039 515150 506751 497750
60805D97750q523p039n872n764o110o134n746m986l627j787l16l9q48j819k076
$$ 497750 489227 482188 476316 470552 464442 458308 452562 447576 443949 442162 441846 441807 440959 439140 437064
60790D37064j472o32k73l59j67O85J681K161K136J888J346N27J18P64K066L102
$$ 437064 435592 434960 434687 434328 434161 434846 436527 438688 440824 442712 444058 444585 444703 445467 447533 450635
60774D50635L654M102M392M203M002M757O442P899Q453Q673R168R607R479R004
$$ 450635 454289 458391 462783 466986 470988 475745 482187 490086 498539 507212 516380 525987 535466 544470
60760E44470Q606Q135P298O348N698N200M488L709L262L023K495J663J081J058
$$ 544470 553076 561211 568509 574857 580555 585755 590243 593952 597214 600237 602732 604395 605476 606534
60746F06534J268J260Q73kj569l687n591o503o472o273o443o798o928o850o853
$$ 606534 607802 609062 609935 609933 608364 604677 599086 592583 586111 579838 573395 566597 559669 552819 545966
60731E45966p036p274p475p513o999n618l699k017r96m64k26l08m46K6J355K843
$$ 545966 538930 531656 524181 516668 509669 504051 500352 498335 497339 496875 496649 496341 495895 495921 497276 500119
60715E00119L701M066M658N601O268O303O250O886Q258R683J0536J0812J0945
$$ 500119 503820 507886 512544 518145 524413 530716 536966 543852 552110 561793 572329 583141 594086
60702E94086J1225J1590J1918J2278J2723J3109J3362J3709J4281J4622J4216
$$ 594086 605311 616901 628819 641097 653820 666929 680291 694000 708281 722903 737119
60691G37119J3384J3063J3516J3963J3761J3356J3562J4379J5080J5220J5086
$$ 737119 750503 763566 777082 791045 804806 818162 831724 846103 861183 876403 891489
60680H91489J5190J5670J6069J5634J4003J1686R523P570N002J349k725o157q678
$$ 891489 906679 922349 938418 954052 968055 979741 989264 996834 1001836 1003185 1000460 994303 985625
60667I85625j0811j3040j5365j7501j9171k0350k1302k2145k2478k1818k0443
$$ 985625 974814 961774 946409 928908 909737 889387 868085 845940 823462 801644 781201
60656G81201j9131j8069j6767j5210j4088j3515j2552j0652q742p907p849p607
$$ 781201 762070 744001 727234 712024 697936 684421 671869 661217 652475 644568 636719 629112
60644F29112p189p312p923q137p570o720o026n389m703m056l334k277j000L6O49
$$ 629112 621923 614611 606688 598551 590981 584261 578235 572846 568143 564087 560753 558476 557476 557512 558161
60629E58161J057J438J851K416L131L613L538L126K759K314J423J94r15j776k611
$$ 558161 559218 560656 562507 564923 568054 571667 575205 578331 581090 583404 584827 585021 584106 582330 579719
60614E79719l430m050m530n047n458n544n511n743o156o322o113n774n516n439
$$ 579719 576289 572239 567709 562662 557204 551660 546149 540406 534250 527928 521815 516041 510525 505086
60600E05086n673o127o337o024n481n036m554l940l576l637l484k579j504j124
$$ 505086 499413 493286 486949 480925 475444 470408 465854 461914 458338 454701 451217 448638 447134 446010
60586D46010j226r47l39l19j095j700j310k04P77J115Q33M46P05J904L425M436
$$ 446010 444784 443837 443498 443179 442084 440384 439074 438870 439647 440762 441595 442041 442746 444650 448075 452511
60570D52511M833N070N355N651O174P184Q534R909J1137J1792J1165R373P708
$$ 452511 457344 462414 467769 473420 479594 486778 495312 505221 516358 528150 539315 548688 556396
60557E56396O857N637K722j066l709m733n284n821n556m244k712j374J86J835
$$ 556396 563253 568890 571612 570546 566837 562104 556820 550999 545443 541199 538487 537113 537299 539134
60543E39134K723K996M030O291Q420R205R178R392R735R364P933N577K501q10
$$ 539134 541857 544853 548883 555174 563594 572799 581977 591369 601104 610468 618401 623978 626479 625669
60529F25669l580n498o782p294o492m635k898j842q52M37J345J399J260J612K180
$$ 625669 622089 616591 609809 602515 596023 591388 588490 586648 585796 586233 587578 588977 590237 591849 594029
60514E94029K560L065L895M545M811N427O752P775P470O327N514N308N476O409
$$ 594029 596589 599654 603549 608094 612905 618332 625084 632859 640329 646656 652170 657478 662954 669363
60500F69363Q668J1846J5032J8137K1819K6306L1125L5642L9128M0695L9919L7135
$$ 669363 678031 689877 704909 723046 744865 771171 802296 837938 877066 917761 957680 994815
60488I94815L2492K5256J4991K900q997j9687k9234l7382m3196m6040m6138m4077
$$ 994815 1027307 1052563 1067554 1070454 1061457 1041770 1012536 975154 931958 885918 839780 795703
60476G95703m0527l6376l2439k8880k5344k1652j8034j4821j2323j0818j0249
$$ 795703 755176 718800 686361 657481 632137 610485 592451 577630 565307 554489 544240
60465E44240j0076r709q988q016o949o142n927n964n369l920k597k328k787k982
$$ 544240 534164 524455 515467 507451 500502 494360 488433 482469 477100 473180 470583 468255 465468 462486
60451D62486k528j801j304j432k370l541l740k475q00l3j99m30m52p09j327j883
$$ 462486 459958 458157 456853 455421 453051 449510 445770 443295 442495 442462 442263 441833 441381 440672 439345 437462
60435D37462k175k409k620k560k228j957j917j920j738j374j036r69j106q59K95
$$ 437462 435287 432878 430258 427698 425470 423513 421596 419676 417938 416564 415528 414559 413453 412594 412889
60420D12889J923K883K745K301K358K757K988L009K885K294J108j54r76j411j462
$$ 412889 414812 417695 420440 422741 425099 427856 430844 433853 436738 439032 440140 439986 439010 437599 436137
60405D36137p35O44J576J326N17J2l59r03q37N95K461L055K190J180P71N69L76
$$ 436137 435402 436046 437622 438948 439465 439477 439118 438215 437378 437973 440434 443489 445679 446859 447630 448199 448575
60388D48575O44J302J516J027N87O95Q64O25L66O18J204J608J712J717J706J635
$$ 448575 449219 450521 452037 453064 453651 454346 455210 455835 456201 456819 458023 459631 461343 463060 464766 466401
60372D66401J517J416J437J724K247K606K359J535N77n9j44K88Q98J309J585J994
$$ 466401 467918 469334 470771 472495 474742 477348 479707 481242 481819 481760 481616 481904 482802 484111 485696 487690
60356D87690K221J597L89m4R26K186K509K386L004M178M731M521M538N115N476
$$ 487690 489911 491508 491897 491853 492779 494965 497474 499860 502864 507042 511773 516294 520832 525947 531423
60341E31423N234M975M973M533L057R62r53k357l316l961m465m877m842m068l009
$$ 531423 536657 541632 546605 551138 554195 555157 554204 551847 548531 544570 540105 535228 530386 526318 523309
60326E23309k439k398k240j699j157q10m08J14M58O15R53J515J960K296K977M138
$$ 523309 520870 518472 516232 514533 513376 512566 512158 512272 512730 513345 514298 515813 517773 520069 523046 527184
60310E27184N324O192O805P204P354P627Q768J1119J4334J7768K0644K2001K1217
$$ 527184 532508 538700 545505 552709 560063 567690 576458 587577 601911 619679 640323 662324 683541
60297F83541J8640J5057J0670N297o18o137j0865j4886j7645j8039j5969j2852
$$ 683541 702181 717238 727908 733205 732587 726450 715585 700699 683054 665015 649046 636194
60285F36194j0202q427p292o651o365o224o425p408q910r828r452q238p081o377
$$ 636194 625992 617565 610273 603622 597257 591033 584608 577200 568290 558462 549010 540772 533691 527314
60271E27314o113o123n936m969l316j842j135q41l34M56J184J603J640J372J125
$$ 527314 521201 515078 509142 504173 500857 499015 497880 497039 496705 497161 498345 499948 501588 502960 504085
60256E04085J182J306J058O42P40J380J678J030p7q16r82q78o90m19o0M00Q95
$$ 504085 505267 506573 507631 508273 509013 510393 512071 513101 513024 512208 511226 510348 509658 509239 509179 509579 510474
60239E10474J165J113J260K212L630M422M085L182K353J631R35M30M8n97j344
$$ 510474 511639 512752 514012 516224 519854 524276 528361 531543 533896 535527 536462 536892 536940 536343 534999
60224E34999j315j28J324J894J515R55P51R29J443K223K982L442L621L629L381
$$ 534999 533684 533556 534880 536774 538289 539244 539995 540924 542367 544590 547572 551014 554635 558264 561645
60209E61645K833K288K140K316K257J489J96p92p42J30P33L01p84j621j905j907
$$ 561645 564478 566766 568906 571222 573479 574968 575164 574372 573630 573760 574493 574794 574010 572389 570484 568577
60193E68577j788j560j407j395j098k83M19L30q5Q7O37N64j50m74j27n8p49j350
$$ 568577 566789 565229 563822 562427 561329 561046 561465 561795 561710 561797 562434 562998 562848 562374 562247 562189 561440 560090
60175E60090j059k17N22J069J339R61J55o8O59J439J549J570K160K775K658K287
$$ 560090 559031 558814 559336 560405 561744 562705 562860 562792 563451 564890 566439 568009 570169 572944 575602 577889
60159E77889K553L122K901J905J364J991L071L525L162K667K705L210L411K716
$$ 577889 580442 583564 586465 588370 589734 591725 594796 598321 601483 604150 606855 610065 613476 616192
60145F16192J543R42J333K130K816L613M719N632N896N920O380P199P827Q095
$$ 616192 617735 618677 620010 622140 624956 628569 633288 638920 644816 650736 657116 664315 672142 680237
60131F80237Q058P325N276J957j812n142p517q735q891q386p630o811o088n641
$$ 680237 688295 695620 700896 702853 701041 695899 688382 679647 670756 662370 654740 647929 641841 636200
60117F36200n330m694l618k704k584l080l387k898j719n62k30r41k048k800l226
$$ 636200 630870 626176 622558 619854 617270 614190 610803 607905 606186 605624 605394 604453 602405 599605 596379
60102E96379l774m210l778k475j255o49j22P98J745K479L637N705P956R312R774
$$ 596379 592605 588395 584617 582142 580887 580238 580116 580914 582659 585138 588775 594480 602436 611748 621522
60087F21522J0119J0600J0835J0673J0358R946R203Q043O511M511J962r12l780
$$ 621522 631641 642241 653076 663749 674107 684053 693256 701299 707810 712321 714283 713371 709591
60074G09591o532r023j0832j1578j1321j0362r016p691o768o154n465m829m882
$$ 709591 703059 694036 683204 671626 660305 649943 640927 633236 626468 620314 614849 610020 605138
60061F05138n685o360o229n664n318n217n108n060n097m787l829k564j368j79
$$ 605138 599453 593093 586864 581200 575882 570665 565557 560497 555400 550613 546784 544220 542852 542673
60047E42673R17J330R09M85P17J055P80L96Q47J809J951P70q46j897k231k241
$$ 542673 543590 544920 545829 546314 547031 548086 548866 549262 550109 551918 553869 554639 553793 551896 549665 547424
60031E47424k298k639l228l713l944m382n486o907p815p895p521p066o567n969
$$ 547424 545126 542487 539259 535546 531602 527220 521734 514827 507012 499117 491596 484530 477963 471994
60017D71994n282m543l882l479l147k374j063Q7L72m8m40k97M46J542K375K305
$$ 471994 466712 462169 458287 454808 451661 449287 448224 448311 448683 448635 448195 447898 448344 449886 452261 454566
60001D54566J524J087J610K417K508J917J470J628K147K543K461J879J351J641
$$ 454566 456090 457177 458787 461204 463712 465629 467099 468727 470874 473417 475878 477757 479108 480749
59987D80749K663L299K766J618R09Q77J004Q20J55r59k041k437k226k216k620
$$ 480749 483412 486711 489477 491095 492004 492881 493885 494705 494860 493901 491860 489423 487197 484981 482361
59972D82361k555j532l95k5R2R31K284L159L264L023K583J877J260J160J307J164
$$ 482361 479806 478274 477879 477854 477946 478877 481161 484320 487584 490607 493190 495067 496327 497487 498794 499958
59956D99958P53L70o1o28r76r77j189j845k160j627j137j669k604k737k206k012
$$ 499958 500711 501081 501020 500392 499416 498439 497250 495405 493245 491618 490481 488812 486208 483471 481265 479253
59940D79253k188k052j834k395l432l633k705j742j457j327p79k3N24P43N91K48
$$ 479253 477065 475013 473179 470784 467352 463719 461014 459272 457815 456488 455709 455686 456210 456953 457544 457792
59924D57792L56J202J917J473K57m46k29L47J090K218L249L373K925L032L743
$$ 457792 458148 459350 461267 462740 462997 462551 462322 462669 463759 465977 469226 472599 475524 478556 482299
59909D82299L959L356K904L161L440L101K384J590O22k73m21K18R29J387J962
$$ 482299 486258 489614 492518 495679 499119 502220 504604 506194 506816 506543 506122 506340 507269 508656 510618
59894E10618K691L097L159L346L556L305L052L851N484O398N987N436N760O427
$$ 510618 513309 516406 519565 522911 526467 529772 532824 536675 542159 548557 554544 559980 565740 572167
59880E72167O605O395O046N210L771K314R89q79l381n349n995n981o076n901n070
$$ 572167 578772 585167 591213 596423 600194 602508 603497 602618 599237 593888 587893 581912 575836 569935 564865
59865E64865m354m439m511l462j815j023j265j266j81J427K563K840K578K474
$$ 564865 560511 556072 551561 548099 546284 545261 543996 542730 542549 543976 546539 549379 551957 554431
59851E54431L191M820O831Q762J0666J2583J4010J4276J3092J0497O821K965J84
$$ 554431 557622 562442 569273 578035 588701 601284 615294 629570 642662 653159 659980 662945 663129
59838F63129r43q21P2J765L970N412M731J763k502o875j0482j2842j3976j4326
$$ 663129 662186 661365 661437 663202 667172 672584 677315 679078 676576 669701 659219 646377 632401 618075
59824F18075j4223j3677j2747j1713j0710r702q844q323p804o764n443m667m532
$$ 618075 603852 590175 577428 565715 555005 545303 536459 528136 520332 513568 508125 503458 498926
59811D98926m186l160k009j249o28M3K61k45p85o92l78o78j599k428k623k103
$$ 498926 494740 491580 489571 488322 487694 487737 487998 487753 486968 486276 485898 485220 483621 481193 478570 476467
59795D76467j070q0J55m45j125j269j063q99p36n64p81j515k018j455K9J437J934
$$ 476467 475397 475317 475472 475027 473902 472633 471570 470671 469935 469371 468590 467075 465057 463602 463631 465068 467002
59778D67002J402L45m40m76j01P0J43P91J999K850K825K505K534K675K417J852
$$ 467002 468404 468749 468309 467833 467732 467802 467945 468736 470735 473585 476410 478915 481449 484124 486541 488393
59762D88393J392J196J280J651K075K233K317K769L296L108K288J887K288K686
$$ 488393 489785 490981 492261 493912 495987 498220 500537 503306 506602 509710 511998 513885 516173 518859
59748E18859K614K777L614M315M094L405K921K417J618J135J363J438N10o76q45
$$ 518859 521473 524250 527864 532179 536273 539678 542599 545016 546634 547769 549132 550570 551080 550404 549559
59733E49559j37K99J24j31m12j129k003k256j881j599j579j304o95l45n24q34
$$ 549559 549422 549721 549845 549714 549302 548173 546170 543914 542033 540434 538855 537551 536856 536511 535987 535153
59717E35153r48q98n83K02J164J630J426J045R37J179J744K496K916K539J652
$$ 535153 534205 533307 532724 532926 534090 535720 537146 538191 539128 540307 542051 544547 547463 550002 551654
59702E51654J055J113J493J848K131K285K133J713J337J143Q26k6j410k697l048
$$ 551654 552709 553822 555315 557163 559294 561579 563712 565425 566762 567905 568731 568705 567295 564598 561550
59687E61550k278j198o88n76k8R25J241M68m79o81n31r48j978l044l964m886n625
$$ 561550 559272 558074 557386 556810 556782 557707 558948 559416 558937 558256 557725 556777 554799 551755 547791 542905 537280
59670E37280n892n880n848n451m237k680j880k217k890k838j788l85M54M83M62
$$ 537280 531388 525508 519660 514209 509972 507292 505412 503195 500305 497467 495679 495294 495748 496231 496693
59655D96693J292K791L865L925L436K895K222J445J053J081P37l87j498j725j315
$$ 496693 497985 500776 504641 508566 512002 514897 517119 518564 519617 520698 521435 521048 519550 517825 516510
59640E16510r84p63l16L00R12J696K577K837K099J063N03K22k31n56l38k9k10
$$ 516510 515526 514763 514447 514747 515659 517355 519932 522769 524868 525931 526434 526656 526425 525869 525531 525502 525292
59623E25292m98k09L91N11M6n75j254k056k610k595k333k115j521k66R64J514
$$ 525292 524794 524585 524976 525487 525533 524958 523704 521648 519038 516443 514110 511995 510474 510208 511172 512686
59607E12686J827K507L025K650J862J562J489Q39l5o7P45J401J473J320J045N66
$$ 512686 514513 517020 520045 522695 524557 526119 527608 528447 528412 528345 529090 530491 531964 533284 534329 534895
59591E34895L43P01Q14j89j517j677q10l83q59j363j545j953k520k524k232k739
$$ 534895 535238 535939 536753 536564 535047 533370 532560 532177 531318 529955 528410 526457 523937 521413 519181 516442
59575E16442l932m428l905l667m277m456l197j382l33p2N7K61O20J391K242K216
$$ 516442 512510 508082 504177 500510 496233 491777 488580 487198 486865 486793 486850 487111 487731 489122 491364 493580
59559D93580J329R54J860K977L080K526K278K232J773J210J358K201L112L998
$$ 493580 494909 495863 497723 500700 503780 506306 508584 510816 512589 513799 515157 517358 520470 524468
59545E24468N223O622P596Q052Q551R640J1628J4653J8128K0269J8993J3703O013
$$ 524468 529691 536313 543909 551961 560512 570152 581780 596433 614561 634830 653823 667526 673539
59532F73539j254n759o788n299k860l37K345N327Q140J0098J0946J0900J0250
$$ 673539 672285 666526 659738 654439 651579 651242 653587 658914 667054 677152 688098 698998 709248
59519G09248R119P365M731J358j961m512o552q857j1429j3335j3996j3879j3609
$$ 709248 718367 725732 730463 731821 729860 725348 718796 709939 698510 685175 671179 657300 643691
59506F43691j3103j2005j0509r167q187p330o364n326m424l747l069k055q08M7
$$ 643691 630588 618583 608074 598907 590720 583390 577026 571700 567276 563529 560460 558405 557597 557644
59492E57644J68JO0M7n88j463j530m79R30K051L004M017M874N391N809O364O940
$$ 557644 557812 557813 557873 557920 557332 555869 554339 553860 554790 556841 559845 563862 568736 574127 579936 586300 593240
59475E93240P347P571P563P206O511N445L697J154j371k657k396j373k39J216
$$ 593240 600587 608158 615721 622927 629438 634883 638580 639734 638363 635706 633310 631937 631698 632914
59461F32914L319N738P849R482J0995J2802J4965J7022J8372J8966J9416K0076
$$ 632914 636233 641971 649820 659302 670297 683099 698064 715086 733458 752424 771840 791916
59449G91916K0436J9867J8440J6306J2789P133p7p233j3274j8071k1371k2560
$$ 791916 812352 832219 850659 866965 879754 886887 886810 879577 866303 848232 826861 804301
59437H04301k1647j9572j7290j5237j3590j2276j0760q723o742n472m323k163
$$ 804301 782654 763082 745792 730555 716965 704689 693929 685206 678464 672992 668669 666506
59425F66506Q77L561N531P689J0523J3461J6207J9164K2007K3505K3592K4133
$$ 666506 667383 670944 676475 684164 694687 708148 724355 743519 765526 789031 812623 836756
59413H36756K6282K8054K5872J8139O440o107j6723k3697k6622k6221k3453j8691
$$ 836756 863038 891092 916964 935103 941543 935436 918713 895016 868394 842173 818720 800029
59401H00029j2005m200K582N388K092o709j7392k5679k9602k9913k7997k4492
$$ 800029 788024 783824 786406 791794 793886 787177 769785 744106 714504 684591 656594 632102
59389F32102j9968j5653j2642j0947r703q021n580k943j298j159j433n92J245
$$ 632102 612134 596481 583839 572892 563189 555168 549588 546645 545347 544188 542755 542163 543408
59376E43408K490K320J565J186J089Q74O49N42L69K47O35J392J783J798K380L832
$$ 543408 545898 548218 549783 550969 552058 552932 553581 554123 554492 554739 555374 556766 558549 560347 562727 566559
59360E66559N134N485N437N810O501P193Q298J0229J2492J4413J6152J8237K0571
$$ 566559 571693 577178 582615 588425 594926 602119 610417 620646 633138 647551 663703 681940 702511
59347G02511K2623K4140K5034K5071K4200K2774K0976J8536J5341J1661P533K678
$$ 702511 725134 749274 774308 799379 823579 846353 867329 885865 901206 912867 920400 923078
59335I23078k631p446j1321j4780j8120k0729k2098k2674k3017k2946k2185k1051
$$ 923078 920447 913001 901680 886900 868780 848051 825953 803279 780262 757316 735131 714080
59323G14080j9810j8043j5411j2401r753p710o282n563n222m525l364k529k431
$$ 714080 694270 676227 660816 648415 638662 630952 624670 619107 613885 609360 605996 603467 601036
59310F01036k291j280L71J894K944L464L441L337M091O047Q542J0964J3507J6507
$$ 601036 598745 597465 597836 599730 602674 606138 609579 612916 617007 623054 631596 642560 656067 672574
59296F72574J9806K2979K5121K4287J8630Q856j708j0082j5572j8421j8417j5933
$$ 672574 692380 715359 740480 764767 783397 792253 790545 780463 764891 746470 728053 712120
59284G12120j2722j0183p906n178k604r07P04L324O409Q612R823J0939J2310J3763
$$ 712120 699398 689215 681309 676131 673527 672620 673324 676648 683057 691669 701492 712431 724741 738504
59270G38504J5449J7234J7967J6769J4460J2273R934O488K332j290m354p813j1545
$$ 738504 753953 771187 789154 805923 820383 832656 842590 849078 851410 850120 845766 837953 826408
59257H26408j4302j5617j6248j6670j6570j5906j5133j4323j3210j2040j1219
$$ 826408 812106 796489 780241 763571 747001 731095 715962 701639 688429 676389 665170
59246F65170j0198p973m793k030k68J306L378N534P127Q162Q914R390R469R077
$$ 665170 654972 646999 642206 640176 639908 641214 644592 650126 657253 665415 674329 683719 693188 702265
59232G02265Q180O940N750M572K642m86m025o794q652j0241j1752j2891j3734
$$ 702265 710445 717385 723135 727707 730349 729863 725838 719044 710392 700151 688399 675508 661774
59219F61774j4463j4553j3300j1137r359q533q088p432o585n646m572l525k775
$$ 661774 647311 632758 619458 608321 598962 590429 582341 574909 568324 562678 558106 554581 551806
59206E51806k190j476p98n75p63r56r82q64n63k09k05m47q0J202K359K441K147
$$ 551806 549616 548140 547342 546767 546004 545048 544066 543202 542639 542430 542225 541778 541698 542900 545259 547700 549847
59189E49847K766M092M806M563M353M855N736O636P618Q461Q582P942P227P040
$$ 549847 552613 556705 561511 566074 570427 575282 581018 587654 595272 603733 612315 620257 627484 634524
59175F34524P496Q487R587R920R082Q031Q216R861J1885J3358J4135J4226J3555
$$ 634524 642020 650507 660094 670014 679096 687127 695343 705204 717089 730447 744582 758808 772363
59162G72363J2382J1170R925Q260N992L184r9l499o267q127r701j1409j2576j2570
$$ 772363 784745 795915 805840 814100 820092 823276 823177 819678 813411 805284 795583 784174 771598 759028
59148G59028j2046j1981j2182j1921j1457j1462j1463j0394q479p028o439n907
$$ 759028 746982 735001 722819 710898 699441 687979 676516 666122 657643 650615 644176 638269
59136F38269n027m283l768k859j397l9Q21J519K301L052L818M766N676O314P199
$$ 638269 633242 628959 625191 622332 620935 620896 621717 623236 625537 628589 632407 637173 642849 649163 656362
59121F56362Q977J1220J2914J3918J4871J5922J6756J7626J9048K0579K1195K0900
$$ 656362 665339 676559 689473 703391 718262 734184 750940 768566 787614 808193 829388 850288
59109H50288K0644K0674K0276J9157J7775J6234J4061J1248Q360N536K505n28
$$ 850288 870932 891606 911882 931039 948814 965048 979109 990357 998717 1004253 1006758 1006230
59097A006230l122n513p999r693r364p423n496m203k999k130k753m815o682p430
$$ 1006230 1003108 997595 989596 979903 970539 963116 957620 953417 950418 948288 945535 940720 934038 926608
59083I26608p869q762r724j0459j1510j2971j3947j4087j4206j4671j4499j3039
$$ 926608 918739 909977 900253 889794 878284 865313 851366 837279 823073 808402 793903 780864
59071G80864j1184r983r207q279p569p605p832p289n954m612l744l234k774k140
$$ 780864 769680 759697 750490 742211 734642 727037 719205 711916 705962 701350 697606 694372 691598 689458
59057F89458j444j176j553j891j456p57r16j811k222j878j878k696l258k637j322
$$ 689458 688014 686838 685285 683394 681938 681181 680265 678454 676232 674354 672476 669780 666522 663885 662563
59042F62563j45Q90J932K615K883L415M542N642O307P087Q380R578J0143J0546
$$ 662563 662418 663308 665240 667855 670738 674153 678695 684337 690644 697731 706111 715689 725832 736378
59028G36378J1403J2487J3384J4346J5683J7027J7877J8220J8036J6917J4826
$$ 736378 747781 760268 773652 787998 803681 820708 838585 856805 874841 891758 906584
59017I06584J2460J0260P798M714J560r94k996m585n205m308k321k00J691L668
$$ 906584 919044 929304 937102 941816 943376 942382 939386 934801 929596 925288 922967 922767 924458 928126
59003I28126N994Q471J0531J1527J1242J0216R095P748N610K889N90q06j928l608
$$ 928126 934120 942591 953122 964649 975891 986107 995202 1002950 1008560 1011449 1012039 1011233 1009305 1005697
58989A005697o012q811j1486j3463j4611j5525j6622j7187j6239j4070j1867j0031
$$ 1005697 999685 990874 979388 965925 951314 935789 919167 901980 885741 871671 859804 849773
58977H49773q065n821l615j305J275L191L418K834L411N338O866P242P717R160
$$ 849773 841708 835887 832272 830967 832242 835433 838851 841685 845096 850434 857300 864542 872259 881419
58963H81419J0763J1889J3128J4509J4563J2379R040N769K254k016o212r345j1681
$$ 881419 892182 904071 917199 931708 946271 958650 967690 973459 975713 973697 967485 958140 946459
58950I46459j3675j4712j4254j3115j2216j1001q448m818j179J989M461N358L939
$$ 946459 932784 918072 903818 890703 878487 867486 859038 854220 853041 855030 859491 864849 868788
58937H68788Q48k488n353p844r984j1510j2165j1644r835p474n825n320n306n293
$$ 868788 869636 867148 861795 853951 843967 832457 820292 808648 798813 791339 785514 780194 774888 769595
58923G69595n374n164l758j251J053K552M020N805P037P484Q467J0741J3010J3809
$$ 769595 764221 759057 755299 754048 755101 757653 761673 767478 774515 781999 790466 801207 814217 828026
58909H28026J3483J3015J2338J1232J0572J1049J1685J1150R704Q476P681O914
$$ 828026 841509 854524 866862 878094 888666 899715 911400 922550 932254 940730 948411 955325
58897I55325O263N920N477M964N550P982J1274J4315J7636K2110K6826K9982L1055
$$ 955325 961588 967508 972985 977949 983499 991481 1002755 1017070 1034706 1056816 1083642 1113624 1144679
58884A144679L0511K8159K3552J7538J1682O415J106m385r592j4399j8857k2450
$$ 1144679 1175190 1203349 1226901 1244439 1256121 1262536 1263642 1259257 1249665 1235266 1216409 1193959
58872A193959k4840k6788k9063l0939l1101k9601k7528k5279k2560j9823j8140
$$ 1193959 1169119 1142331 1113268 1082329 1051228 1021627 994099 968820 946260 926437 908297
58861I08297j7741j7903j8173j8621j8969j8651j7682j6544j5274j3511j1333
$$ 908297 890556 872653 854480 835859 816890 798239 780557 764013 748739 735228 723895
58850G23895r292p777o878o575o588o488o395o917p957q443p829o891o307n585
$$ 723895 714603 706826 699948 693373 686785 680297 673902 666985 659028 650585 642756 635865 629558 623973
58836F23973m254k988k502k286j629r24p96q21l24L51N95O96J140J591J759K312
$$ 623973 619719 616731 614229 611943 610314 609390 608594 607773 607449 607800 608395 609091 610231 611822 613581 615893
58820F15893L706M995N101M429L933L459K357R24k51j451k997m058l817l083l213
$$ 615893 619599 624594 629695 634124 638057 641516 643873 644797 644546 643095 640098 636040 632223 629140 625927
58805F25927m062m467m012l043j667j25O52L24P1Q04J438O82n72n81M34R11P67
$$ 625927 621865 617398 613386 610343 608676 608551 609203 609527 609598 610402 611840 612522 611950 611369 611803 612714 613481
58788F13481J333K824M039M511M965N662O094O282O744P141O558N163M080L598
$$ 613481 614814 617638 621677 626188 631153 636815 642909 649191 655935 663076 669634 674797 678877 682475
58774F82475K934J757N92k72j027j583j693j650j896k238k462l020m065m605l889
$$ 682475 685409 687166 687758 687486 686459 684876 683183 681533 679637 677399 674937 671917 667852 663247 659358
58759F59358k778k267j656J17K240L146L106L594M596M732L764K904K771K977
$$ 659358 656580 654313 652657 652774 655014 658160 661266 664860 669456 674188 677952 680856 683627 686604
58745F86604L580M960O400O740O448P070Q731J0017J0392J0707J1295J1570J1725
$$ 686604 690184 695144 701544 708284 714732 721802 730533 740550 750942 761649 772944 784514 796239
58732G96239J2848J4867J6195J5904J4755J3582J2110R896P190M462K020K59o17
$$ 796239 809087 823954 840149 856053 870808 884390 896500 906396 913586 918048 920068 920327 919710
58719I19710j070j473j226K92K297L415L393K717J197j507m465o335p289q427
$$ 919710 918640 917167 915941 916233 918530 921945 925338 928055 929252 927745 923280 916945 909656 901229
58705I01229r751j0495j1065j2683j5307j7691j9346k0705k1569k1202j9759j7966
$$ 901229 891478 880983 869918 857235 841928 824237 804891 784186 762617 741415 721656 703690
58693G03690j5717j2739j0172r435r850r381p572n702m374l086j972j711j770
$$ 703690 687973 675234 665062 655627 645777 636396 628824 623122 618748 615662 613690 611979 610209
58680F10209r72K23K01j061j841j343l53P52K377M013M561M491N512P859J0092
$$ 610209 609237 609460 609661 608600 606759 605416 605063 605815 608192 612205 616766 621257 626769 634628 644720
58665F44720J1718J3630J5731J6508J5384J3158R917M911r87n273o988p675q530
$$ 644720 656438 670068 685799 702307 717691 730849 740766 745677 744690 739417 732429 724754 716224
58652G16224q888q217p353o799n908m538l605l226k260m17J067J484J573J856
$$ 716224 707336 699119 691766 684967 679059 674521 670916 667690 665430 665013 666080 667564 669137 670993
58638F70993J961K019K724L557L085J462M68N45J57j238k054j304k14j3j45K69
$$ 670993 672954 674973 677697 681254 684339 685801 686269 686814 686971 685733 683679 682375 682161 682148 682003 682272
58622F82272J085K214M186O802Q961J0620J3060J6544J9575K1055K1329K0533
$$ 682272 683357 685571 689757 696559 705520 716140 729200 745744 765319 786374 807703 828236
58610H28236J8033J4132J0225O639K465j939m673n324n809p307q691q990r036
$$ 828236 846269 860401 870626 877265 879730 877791 873118 867794 861985 854678 845987 836997 827961
58597H27961r515r641q952q304p964o785m387j959M8K742O227Q683R356J0087
$$ 827961 818446 808805 799853 791549 783585 776800 772413 770454 770502 773244 779471 788154 797510 807597
58583H07597J2253J4447J4873J3993J3022J1631R019N818L233J508M81M36J329
$$ 807597 819850 834297 849170 863163 876185 887816 896835 902653 905886 907394 907875 908311 909640
58570I09640K378L363N059P749J0785J3984J7669K1018K2432K2101K1936K2370
$$ 909640 912018 915381 920440 928189 938974 952958 970627 991645 1014077 1036178 1058114 1080484
58558A080484K1627J8826J5337J2205Q800N056K314P78j293m504p032p757q216
$$ 1080484 1102111 1120937 1136274 1148479 1157279 1162335 1164649 1165427 1164134 1159630 1152598 1144841 1136625
58545A136625r886j1895j2991j3569j4242j4509j4183j4120j4356j3729j2298
$$ 1136625 1126739 1114844 1101853 1088284 1074042 1059533 1045350 1031230 1016874 1003145 990847
58534I90847j1739j2302j2182j0863j0155j0538r724o556l246j799j111L68J965
$$ 990847 979108 966806 954624 943761 933606 923068 913344 906788 903542 901743 900632 901000 902965
58521I02965K927M417P047R049R128Q669Q965Q903P627O818P835R127Q972Q381
$$ 902965 905892 910309 917356 926405 935533 944202 953167 962070 969697 976515 984350 993477 1002449 1010830
58507A010830Q815R394Q913Q299Q458P952N342J741j350m551q559j1889j3191
$$ 1010830 1019645 1029039 1037952 1046251 1054709 1062661 1068003 1069744 1068394 1063843 1055284 1043395 1030204
58494A030204j3613j4419j4552j2998j1252j0771j0279q202n641m156k855l21
$$ 1030204 1016591 1002172 987620 974622 963370 952599 942320 934118 928477 924321 921466 921145
58482I21145K606M549O034P822R052R378J0421J2593J3224J0563O854M574K559
$$ 921145 923751 928300 934334 942156 951208 960586 971007 983600 996824 1007387 1014241 1018815 1021374
58469A021374r15m242n423o058q427j0927j0611q252o836o731o226n282m883m181
$$ 1021374 1020459 1016217 1010794 1004736 996309 985382 974771 966519 959683 952952 946726 941444 936561 932380
58455I32380k024J11K14o05j01J086Q74l88j095j795l816n953o223n492n701n940
$$ 932380 930356 930467 930681 930076 929975 931061 931935 931547 930452 928657 924841 918888 912665 907173 901472 895532
58439H95532m075q71J320K660M836P100P272N750M920N319N771O354P904R612
$$ 895532 891457 890586 891906 894566 899402 906502 913774 919524 924444 929763 935534 941888 949792 959404
58425I59404J0294J0901J2711J4409J4134J2760J1929J0616P291L638K240K283
$$ 959404 969698 980599 993310 1007719 1021853 1034613 1046542 1057158 1064449 1068087 1070327 1072610
58413A072610J420J68M03J130Q8j851k198j466j926l009k290n4J342J696K476
$$ 1072610 1074030 1074198 1074601 1075731 1075819 1073968 1071770 1070304 1068378 1065369 1063079 1063025 1064367 1066063 1068539
58398A068539L114K016K57J53J071O54r42j952k857n071p147o739n155n471p157
$$ 1068539 1071653 1073669 1073926 1074079 1075150 1075804 1074862 1072910 1070053 1064982 1057835 1051096 1045941 1040470 1033313
58383A033313p139n196l706k950j305P18J195Q35J838L563L660K624K820M045
$$ 1033313 1026174 1020978 1017272 1014322 1013017 1013735 1014930 1015765 1017603 1021166 1024826 1027450 1030270 1034315
58369A034315M482M891P124R701R771Q469R243J1797J2736J1427J0260R755Q466
$$ 1034315 1038797 1043688 1050812 1060513 1070284 1078753 1087996 1099793 1112529 1123956 1134216 1143971 1152437
58356A152437O958O941P175N098J742J70J89m43r14J106M081M442K907L344O264
$$ 1152437 1159395 1166336 1173511 1178609 1180351 1180521 1180710 1180267 1179353 1180459 1184540 1188982 1191889 1195233 1201497
58341A201497Q973J1090J4145J6861J6813J5828J7587K0879K1460J9469J8516
$$ 1201497 1210470 1221560 1235705 1252566 1269379 1285207 1302794 1323673 1345133 1364602 1383118
58330A383118J8425J5850J1436R227R328Q056N214M274N454N537M478N317P619
$$ 1383118 1401543 1417393 1428829 1438056 1447384 1455440 1460654 1464928 1470382 1475919 1480397 1485714 1493333
58317A493333Q055P251R028J2917J4787J4615J6247J9467K0104J8123J7759J9390
$$ 1493333 1501388 1508639 1517667 1530584 1545371 1559986 1576233 1595700 1615804 1633927 1651686 1671076
58305A671076J9218J7383J8160K1514K2615K0620J9801K1164K1065J9066J8916
$$ 1671076 1690294 1707677 1725837 1747351 1769966 1790586 1810387 1831551 1852616 1871682 1890598
58294A890598K0787K0810J9208K0462K4502K6293K5132K5657K8656K9978K9443
$$ 1890598 1911385 1932195 1951403 1971865 1996367 2022660 2047792 2073449 2102105 2132083 2161526
58283B161526L1522L5848L6781L3898L3308L6779L9349L9512M1788M6936M9696
$$ 2161526 2193048 2228896 2265677 2299575 2332883 2369662 2409011 2448523 2490311 2537247 2586943
58272B586943M8673M8750N1283N1825M9815N0486N4768N7495N7840O1036O7488
$$ 2586943 2635616 2684366 2735649 2787474 2837289 2887775 2942543 3000038 3057878 3118914 3186402
58261C186402P0975P0121P0653P3865P4209P0832O9902P2811P3887P2422P4666
$$ 3186402 3257377 3327498 3398151 3472016 3546225 3617057 3686959 3759770 3833657 3906079 3980745
58250C980745Q1328Q5756Q7214R2693J02825J09842J12543J18808J30034J38137
$$ 3980745 4062073 4147829 4235043 4327736 4430561 4540403 4652946 4771754 4901788 5039925
58240E039925J41668J49150J62404J72722J78055J87194K02129K13667K19849
$$ 5039925 5181593 5330743 5493147 5665869 5843924 6031118 6233247 6446914 6666763
58231F666763K30758K49317K65805K77463K94318L19152L41683L59547L84186
$$ 6666763 6897521 7146838 7412643 7690106 7984424 8303576 8645259 9004806 9388992
58222I388992M18663M51455M79855N16620N65251O13123O57991P15461P90509
$$ 9388992 9807655 10259110 10738965 11255585 11820836 12433959 13091950 13807411 14597920
58213A4597920Q69195R49208J049380J177165J318181J471173J659966J896699
$$ 14597920 15467115 16416323 17465703 18642868 19961049 21432222 23092188 24988887
58205B4988887K169819K484702K876502L364114L934297M592222N380035O320413
$$ 24988887 27158706 29643408 32519910 35884024 39818321 44410543 49790578 56110991
58197E6110991P392993Q595569R976217J1584804J3471867J5775564J8719050
$$ 56110991 63503984 72099553 82075770 93660574 107132441 122908005 141627055
58190A41627055K2453147K6952008L2009546L7012731M0459471L9979069L3521488
$$ 141627055 164080202 191032210 223041756 260054487 300513958 340493027 374014515
58183C74014515K1033151N015694j0694688k2862104l0024674l2506650l1784672
$$ 374014515 395047666 400063360 389368672 366506568 336481894 303975244 272190572
58176B72190572k9665164k7485037k5677307k3987886k2070967j9853668j7466324
$$ 272190572 242525408 215040371 189363064 165375178 143304211 123450543 105984219
58169A05984219j5060830j2773269j0732353r000566p546167o316105n294997
$$ 105984219 90923389 78150120 67417767 58417201 50871034 44554929 39259932
58162C9259932m469446l791961l218915k744171k364761k050230j773902j540984
$$ 39259932 34790486 30998525 27779610 25035439 22670678 20620448 18846546 17305562
58154A7305562j359114j210277j075549r60338q72528p99988p30184o69208o22297
$$ 17305562 15946448 14736171 13660622 12700284 11827756 11027768 10297584 9628376 9006079
58145I006079n77071n24058m73572m35288m00312l59505l20893k92901k67909
$$ 9006079 8429008 7904950 7431378 6996090 6595778 6236273 5915380 5622479 5354570
58136E354570k38183k11889j98174j91138j82599j76374j76348j74459j63933
$$ 5354570 5116387 4904498 4706324 4515186 4332587 4156213 3979865 3805406 3641473
58127C641473j51681j45135j39175j27974j17239j12815j08928r9600r0402q7445
$$ 3641473 3489792 3344657 3205482 3077508 2960269 2847454 2738526 2638926 2548524 2461079
58117B461079q5483p8316p0605o8333o7293o1990n6553n6218n6829n3084m8833
$$ 2461079 2375596 2297280 2226675 2158342 2091049 2029059 1972506 1916288 1859459 1806375 1757542
58106A757542m9139n0271m7204m3373m3562m4663m2437m0083m1252m1769l7059
$$ 1757542 1708403 1658132 1610928 1567555 1523993 1479330 1436893 1396810 1355558 1313789 1276730
58095A276730l0849k8114k6189k1166j6261j5505j5620j2366q695q644r315o885
$$ 1276730 1245881 1217767 1191578 1170412 1154151 1138646 1123026 1110660 1101965 1093321 1084006 1077121
58083A077121m618o984j1436j3616j5163j8901k1848k0575j8249j9013k0511j9066
$$ 1077121 1072503 1065519 1054083 1040467 1025304 1006403 984555 963980 945731 926718 906207 887141
58071H87141j6989j7595j8126j4995j1140j0879j2080j0596p995p794q367o604
$$ 887141 870152 852557 834431 819436 808296 797417 785337 774741 766746 758952 750585 743981
58059G43981m527n423p354p094o469q354j0445r568q080r352j0913q910n542n161
$$ 743981 739454 734031 726677 719583 713114 704760 694315 684747 676667 667315 656402 647492 641950 636789
58045F36789o489n608l499l759n623n856n009n614o654n782m436n088o064m709
$$ 636789 630300 624692 621193 617434 611811 605955 600946 595332 588678 582896 578460 573372 567308 562599
58031E62599k835l483n198n160m831o681q438o805l968m082n908n367l017k540
$$ 562599 559764 556281 551083 545923 541092 534411 525973 519168 515200 511118 505210 499843 496826 494286
58017D94286l710l377j808j914l285k884o05J108K062L716N156M537L096L123
$$ 494286 490576 487199 485391 483477 480192 477308 476703 477811 479873 483589 488745 493282 496378 499501
58003D99501L634K665J733L101M807L680J251J183K818K849J638K052L496K989
$$ 499501 503135 505800 507533 510634 515441 519121 520372 521555 524373 527222 528860 530912 534408 537397
57989E37397J116J129K945L561K750K929L991L560J942J641K321J286j371k962
$$ 537397 538513 539642 542587 546148 548898 551827 555818 559378 561320 562961 565282 566568 565197 562235
57975E62235l215m184n639n360l857l941n705o523n930n923o536n732l713k855
$$ 562235 559020 554836 549197 543837 539980 536039 530334 523811 517881 511958 505422 499690 495977 493122
57961D93122l268k821j614j937l589l791k176j513k790l715k959k012j958j888
$$ 493122 489854 487033 485419 483482 479893 476102 473926 472413 469623 465908 462949 460937 458979 457091
57947D57091j304r94q68J03J519K017K107L553O075P799Q686J0314J2438J3222
$$ 457091 455787 454793 453925 454028 455547 457564 459671 463224 469299 477098 485784 496098 508536 521758
57933E21758J2755J2917J3719J3208J1048Q888P093M372P84k131m242o755r300
$$ 521758 534513 547430 561149 574357 585405 594293 601386 605758 606542 604411 600169 593414 584114
57920E84114j0282j0071j0612j1907j2106j1047j0386j0276r314p739p316p850
$$ 584114 573832 563761 553149 541242 529136 518089 507703 497427 488113 480374 473058 465208
57908D65208p309n628m981n943o698o575p032q535r542r240q508p638n836l415
$$ 465208 457899 452271 447290 441347 434649 428074 421042 412507 402965 393725 385217 377579 371743 368328
57894C68328j762q84M14J882K142J594K046L388L627K433J573J678J593J114J346
$$ 368328 366566 365682 366096 367978 370120 371714 373760 377148 380775 383208 384781 386459 388052 389166 390512
57879C90512K068J761M66l19p02k178m199m375k481r79j017j057j80N24N63J016
$$ 390512 392580 394341 394807 394488 393786 391608 387409 383034 380553 379574 378557 377500 377320 377844 378407 379423
57863C79423K138K818L094M362O409P225O409N878O485O877O451O512P610Q452
$$ 379423 381561 384379 387473 391835 398244 405469 411878 417756 424241 431118 437569 444081 451691 460143
57849D60143Q324P954P333N412K551N08n73k328m844o186n917n926o968p509o941
$$ 460143 468467 476421 483754 489166 491717 492225 491652 489324 484480 478294 472377 466451 459483 451974 445033
57834D45033o712p236o846n071l843m036l881k227n29j8L39J455K379K544L177
$$ 445033 438321 431085 424239 419168 415325 411289 407408 405181 404652 404634 404973 406428 408807 411351 414528
57819D14528M851O004N557M718M659M693M226M179M893M824K850o1k799n483p751
$$ 414528 419379 425383 430940 435658 440317 445010 449236 453415 458308 463132 465982 465921 463122 457639 449888
57804D49888q065o287m608m337m038k437q85j022k086k493k359k585l008l134
$$ 449888 441823 435536 430928 426591 422553 420116 419231 418209 416123 413630 411271 408686 405678 402544
57790D02544l299l652l403k357j640j804j844j157o09n68J06J848L162K975K280
$$ 402544 399245 395593 392190 389833 388193 386389 384545 383388 382779 382211 382317 384165 387327 390302 392582
57775C92582K100J729N46l67l2O83O12K8n40j522l005l970m086m569n933o817
$$ 392582 394682 396411 396957 396590 396558 397241 397853 397881 397341 395819 392814 388844 384758 380189 374256 367439
57759C67439o437o185p103p749o433m028k566k446k653k541j838k80J484J907
$$ 367439 361002 354817 347714 339965 333532 329504 326938 324492 321839 319298 317460 317180 318664 320571
57745C20571P65k02M8K67o12j381o52P29J200Q71O18K21p59j589j576j430j760
$$ 320571 321336 321134 321182 321449 320837 319456 318804 319533 320733 321604 322222 322443 321684 320095 318519 317089 315329
57728C15329j645k94J119J202O03P70J548J828J607J632J835J695J436J474J518
$$ 315329 313684 313390 314509 315711 316314 317084 318632 320460 322067 323699 325534 327229 328665 330139 331657
57713C31657J324J438K010K095J213L79M32O99N23O01J496K346K499K871M176
$$ 331657 332981 334419 336429 338524 339737 340116 340548 341247 341770 342371 343867 346213 348712 351583 355759
57698C55759N340N293M817M857M558K836N88o40j009j536k052j853j284r04j36
$$ 355759 361099 366392 371209 376066 380624 383460 384048 383408 382399 380863 378811 376958 375674 374770 374634
57683C74634J536L246M270N624Q271J1184J3102J4916J8150K2355K6268L0429
$$ 374634 376170 379416 383686 389310 397581 408765 421867 436783 454933 477288 503556 533985
57671E33985L6229M3426N1106O0136P1511Q2298Q5794P6394N3229J9948j6780
$$ 533985 570214 613640 664746 724882 796393 878691 964485 1040879 1094108 1114056 1097276
57660A097276m9045p0876q1033q2132p7398o9236n9774n0569m1857l3535k6468
$$ 1097276 1048231 977355 896322 814190 736792 667556 607782 557213 515356 481821 455353
57649D55353k1524j7974j4543j1333r114p387n188l106k501l022l055k309j931
$$ 455353 433829 415855 401312 389979 380865 373478 368290 365184 362683 359661 356606 354297 352366
57636C52366k191k039j127l13LL86R83J180Q60O10N86L75M3Lnn50j251j185m28
$$ 352366 350175 348136 347009 346696 346699 347085 348068 349248 350108 350718 351304 351679 351722 351725 351720 351170 349919 348734 348306
57617C48306J30L35P94J484J730J471J265J094M17n53r05l38N60J277J646J448
$$ 348306 348436 348771 349565 351049 352779 354250 355515 356609 357026 356473 355568 355230 355790 357067 358713 360161
57601C60161P58L38P24J295J322J256J825K453K046Q74J81L23O60R48J333J411
$$ 360161 360919 361257 361981 363276 364598 365854 367679 370132 372178 373052 373233 373556 374216 375164 376497 377908
57585C77908P39k7M7M90J24r11j366r13l86r6N12J482K065J931J469R22L60K77
$$ 377908 378647 378620 378667 379157 379281 378370 377004 376091 375705 375609 376121 377603 379668 381599 383068 383990 384350 384627
57567C84627R94J748J599J003J105J852K233K110K203K492K273J720J827K668
$$ 384627 385621 387369 388968 389971 391076 392928 395161 397271 399474 401966 404239 405959 407786 410454
57553D10454L186K868K324K103K126K342K760K937K523K081K234K450K020J752
$$ 410454 413640 416508 418832 420935 423061 425403 428163 431100 433623 435704 437938 440388 442408 444160
57539D44160L008N304O615O046M573L205K023J127Q50Q04K55l78J64J947L520
$$ 444160 447168 452472 459087 465133 469706 472911 474934 476061 476911 477715 477970 477592 477756 479703 483223
57524D83223L883L433K813K188J874K343L226L541L131K838L148L713M241M731
$$ 483223 487106 490539 493352 495540 497414 499757 502983 506524 509655 512493 515641 519354 523595 528326
57510E28326M923M588M226M316M259L334K301K503L617M037L320K591K538K722
$$ 528326 533249 537837 542063 546379 550638 553972 556273 558776 562393 566430 569750 572341 574879 577601
57496E77601K887L239L358K556J453J448K490L082K714K451K899L450L873M719
$$ 577601 580488 583727 587085 589641 591094 592542 595032 598114 600828 603279 606178 609628 613501 618220
57482F18220N644N350L842K914L563M580M650M189M133M354M365M426M898N460
$$ 618220 623864 629214 633056 635970 639533 644113 648763 652952 657085 661439 665804 670230 675128 680588
57468F80588N713N730N493M797M163M596N993O980O876O578O944P476P375O725
$$ 680588 686301 692031 697524 702321 706484 711080 717073 724053 730929 737507 744451 751927 759302 766027
57454G66027N969N182M499M349M716N044N239N855O974P854Q047P826P338O444
$$ 766027 771996 777178 781677 786026 790742 795786 801025 806880 813854 821708 829755 837581 844919 851363
57440H51363N530N257N342M882M087M224N589O983P569P794Q037P908P357P089
$$ 851363 856893 862150 867492 872374 876461 880685 886274 893257 900826 908620 916657 924565 931922 939011
57426I39011P271P248O895O818O877O201N102N179O798Q269Q368P894P873P930
$$ 939011 946282 953530 960425 967243 974120 980321 985423 990602 997400 1005669 1014037 1021931 1029804 1037734
57412A037734P603P581Q293Q770Q266P700Q155R122R551R514R579R581R278R245
$$ 1037734 1045337 1052918 1061211 1069981 1078247 1085947 1094102 1103224 1112775 1122289 1131868 1141449 1150727 1159972
57398A159972R888J0437J0152R626R728J0113R996R619R700J0035R906R394R215
$$ 1159972 1169860 1180297 1190449 1200075 1209803 1219916 1229912 1239531 1249231 1259266 1269172 1278566 1287781
57385A287781R624J0334J1143J1912J2367J2523J2802J3300J3516J3192J2675
$$ 1287781 1297405 1307739 1318882 1330794 1343161 1355684 1368486 1381786 1395302 1408494 1421169
57374A421169J2123J1308J0509J0524J1363J2121J2527J3356J4729J5540J5339
$$ 1421169 1433292 1444600 1455109 1465633 1476996 1489117 1501644 1515000 1529729 1545269 1560608
57363A560608J5242J6050J6856J6713J6327J6804J7863J8603J9040J9511J9570
$$ 1560608 1575850 1591900 1608756 1625469 1641796 1658600 1676463 1695066 1714106 1733617 1753187
57352A753187J8830J8093J8308J9020J9049J8179J7144J6567J6752J7828J9184
$$ 1753187 1772017 1790110 1808418 1827438 1846487 1864666 1881810 1898377 1915129 1932957 1952141
57341A952141J9568J8626J7496J7116J6984J6513J6417J7456J8903J9566J9511
$$ 1952141 1971709 1990335 2007831 2024947 2041931 2058444 2074861 2092317 2111220 2130786 2150297
57330B150297J9467J9347J8755J8202J8424J9112J9565K0026K1091K2279K2525
$$ 2150297 2169764 2189111 2207866 2226068 2244492 2263604 2283169 2303195 2324286 2346565 2369090
57319B369090K1781K0987K0783K1163K1953K2761K2986K2686K2791K3662K4317
$$ 2369090 2390871 2411858 2432641 2453804 2475757 2498518 2521504 2544190 2566981 2590643 2614960
57308B614960K3998K3593K4250K5478K5918K5371K4730K4510K4635K5220K6286
$$ 2614960 2638958 2662551 2686801 2712279 2738197 2763568 2788298 2812808 2837443 2862663 2888949
57297B888949K7180K7351K7255K7497K7712K7387K7089K7644K8688K9270K9333
$$ 2888949 2916129 2943480 2970735 2998232 3025944 3053331 3080420 3108064 3136752 3166022 3195355
57286C195355K9439K9551K9344K9206K9715L0511L0921L1193L1922L2758L2922
$$ 3195355 3224794 3254345 3283689 3312895 3342610 3373121 3404042 3435235 3467157 3499915 3532837
57275C532837L2615L2615L2942L3112L3338L4204L5424L6166L6433L7010L8206
$$ 3532837 3565452 3598067 3631009 3664121 3697459 3731663 3767087 3803253 3839686 3876696 3914902
57264C914902L9613M0883M1799M1991M1514M1277M1949M2835M2853M2122M1650
$$ 3914902 3954515 3995398 4037197 4079188 4120702 4161979 4203928 4246763 4289616 4331738 4373388
57253D373388M1910M2663M3625M4422M4500M4064M4289M5620M6742M6504M5891
$$ 4373388 4415298 4457961 4501586 4546008 4590508 4634572 4678861 4724481 4771223 4817727 4863618
57242D863618M6580M8448N0247N2098N5359O0195O4967O8071O9095O8321O6452
$$ 4863618 4910198 4958646 5008893 5060991 5116350 5176545 5241512 5309583 5378678 5446999 5513451
57231E513451O4650O3566O2469O0413N7879N6086N5190N4514N3996N3893N3529
$$ 5513451 5578101 5641667 5704136 5764549 5822428 5878514 5933704 5988218 6042214 6096107 6149636
57220F149636N2053N0133M9210M9220M8655M6862M4730M3021M1573M0156L8831
$$ 6149636 6201689 6251822 6301032 6350252 6398907 6445769 6490499 6533520 6575093 6615249 6654080
57209F654080L7296L5226L3199L2122L1719L0869K9267K7517K5781K3736K1691
$$ 6654080 6691376 6726602 6759801 6791923 6823642 6854511 6883778 6911295 6937076 6960812 6982503
57198F982503K0299J9231J7561J5497J4266J4316J4947J5766J7011J8434J9324
$$ 6982503 7002802 7022033 7039594 7055091 7069357 7083673 7098620 7114386 7131397 7149831 7169155
57187G169155J9822K0929K2953K5097K6732K7942K8771K8994K8620K7574K5243
$$ 7169155 7188977 7209906 7232859 7257956 7284688 7312630 7341401 7370395 7399015 7426589 7451832
57176G451832K1473J7690J5464J4278J2279R103O207M384K673J86k581m714n999
$$ 7451832 7473305 7490995 7506459 7520737 7533016 7542119 7548326 7552710 7555383 7555569 7552988 7548274 7542275
57163G542275o631o827o945p148o970o090n231n236n741o063o855r259j2690j5177
$$ 7542275 7535644 7528817 7521872 7514724 7507754 7501664 7496433 7491197 7485456 7479393 7472538 7463279 7450589 7435412
57149G435412j5898j5788j5737j5791j6203j7706k0583k4454k8732l2108l2470
$$ 7435412 7419514 7403726 7387989 7372198 7355995 7338289 7317706 7293252 7264520 7232412 7199942
57138G199942k9425k6262k7205l2706l9380m4286m7025m7874m6674m4165m2102
$$ 7199942 7170517 7144255 7117050 7084344 7044964 7000678 6953653 6905779 6859105 6814940 6772838
57127F772838m1122m0262l9085l8482l8908l9697m0486m1572m2414m1556l8439
$$ 6772838 6731716 6691454 6652369 6613887 6574979 6535282 6494796 6453224 6410810 6369254 6330815
57116F330815l3553k6669j6903m751Q037K1009L5605N3014P3507R8068J28405
$$ 6330815 6297262 6270593 6253690 6248939 6256976 6277985 6313590 6366604 6440111 6538179 6666584
57105F666584J65070K07843K58347L20206L96523M89660O03527P43387R13005
$$ 6666584 6831654 7039497 7297844 7618050 8014573 8504233 9107760 9851147 10764152
57096A0764152J114435J350427J623787J933896K276686K647942L043112L453845
$$ 10764152 11878587 13229014 14852801 16786697 19063383 21711325 24754437 28208282
57088B8208282L868474M275420M661256N004936N277109N440051N436860N184230
$$ 28208282 32076756 36352176 41013432 46018368 51295477 56735528 62172388 67356618
57080F7356618M602830L681433K513115J253969L7800j072077k062688k927687
$$ 67356618 71959448 75640881 78153996 79407965 79445765 78373688 76311000 73383313
57072G3383313l651270m219662m630675m890103n005780m987215m847646m605232
$$ 73383313 69732043 65512381 60881706 55991603 50985823 45998608 41150962 36545730
57064C6545730m283368l909115l509135l105956k717104k355433k028630j739251
$$ 36545730 32262362 28353247 24844112 21738156 19021052 16665619 14636989 12897738
57056A2897738j486681j269167j084185r28284p97697o88819n98049n21979m58065
$$ 12897738 11411057 10141890 9057705 8129421 7331724 6642905 6044856 5522877 5064812
57047E064812m04442l59092l20003k86034k56721k31190k08198j87200j68403
$$ 5064812 4660370 4301278 3981275 3695241 3438520 3207330 2999132 2811932 2643529
57038B643529j51809j36961j23501j11157r9372q7749p6609o6292n6363m6279
$$ 2643529 2491720 2354759 2231258 2120101 2020729 1932980 1856371 1790079 1733716 1687437
57028A687437l6088k5494j3082K306K0351M0626O3300Q5530R7917Q8651N3456
$$ 1687437 1651349 1625855 1612773 1615079 1635430 1676056 1739356 1824886 1922803 2011454 2064910
57017B064910N15n4988j00106j28697j40565j39048j28972j14848r9843q5781
$$ 2064910 2065425 2010437 1910331 1781634 1641069 1502021 1373049 1258201 1158358 1072577
57007A072577p3423o2738n3596m6279m0872l6576l2511k8900k6454k4939k3535
$$ 1072577 999154 936416 882820 836541 795669 759093 726582 697682 671228 646289 622754
56996F22754k2336k2080k2470k2214k0873j9234j7619j5250j1730p855m335p65
$$ 622754 600418 578338 555868 533654 512781 493547 475928 460678 448948 441093 436758 435993
56984D35993L358P404R999J0085P242J729n255j1755j6061j7559j6740j4695j2418
$$ 435993 439351 446755 456754 466839 474081 475810 470555 458800 442739 425180 408440 393745 381327
56971C81327j0211p855n510l827k785j288J231L696N022O045Q457J2316J6225
$$ 381327 371116 363261 357751 353924 351139 349851 351082 354778 359800 365845 374302 386618 402843
56958D02843J9546K2675K5022K4492J9516J0551n57j1530k0014k4542k5701k5356
$$ 402843 422389 445064 470086 494578 514094 524645 524088 512558 492544 468002 442301 416945
56946D16945k4404k2287j8723j4614j0807p135l232O10L873O447Q590J0903J4341
$$ 416945 392541 370254 351531 336917 326110 318975 315743 316353 320226 326673 335263 346166 360507
56933C60507J9409K5265L0279L3168L2708K7090J5420K1j4468k4831l0992l4031
$$ 360507 379916 405181 435460 468628 501336 528426 543846 543867 529399 504568 473576 439545
56921D39545l4311l2173k8802k5291k1786j8350j5571j3607j1644r161o835n438
$$ 439545 405234 373061 344259 318968 297182 278832 263261 249654 238010 228849 222014 216576
56909B16576m660l838l041k573k169j464o97j78M01J382K397K910L072L377L895
$$ 216576 211916 208078 205037 202464 200295 198831 198134 197956 198357 199739 202136 205046 208118 211495 215390
56894B15390M516N504P091Q907J0452J1954J4071J6863J9585K1363K1540J9404
$$ 215390 219906 225410 232501 241408 251860 263814 277885 294748 314333 335696 357236 376640
56882C76640J4284O432k436r896j4388j6031j5822j4372j1801q565n539l009l18
$$ 376640 390924 397356 394920 385024 370636 354605 338783 324411 312610 304045 298506 295497 295179
56869B95179L070O813J0441J4150J8205K2314K6480L1685L8674M6309N2031N3454
$$ 295179 298249 305062 315503 329653 347858 370172 396652 428337 467011 513320 565351 618805
56857F18805M8841L7051J8844j927k0082l2455l8879m0362l7843l2647k6498k0381
$$ 618805 667646 704697 723541 721614 701532 669077 630198 589836 551993 519346 492848 472467
56845D72467j4217p863j480N025J1857J8580K4649L0692L8158M7614N8475P0048
$$ 472467 458250 450387 448907 453932 465789 484369 509018 539710 577868 625482 683957 754005
56833G54005Q0924Q7025Q2424O3813L3810o57l2450n6768p1552p7175p5669o9482
$$ 754005 834929 921954 1004378 1068191 1102001 1101344 1068894 1012126 940574 863399 787730 718248
56821G18248o0728n1204m2115l3505k4762j5965p945r22N992J3608K1886L0696
$$ 718248 657520 606316 564201 530696 505934 489969 482024 481102 487094 500702 522588 553284
56809E53284M0381N0817O0316O5722O3531N1419K9939L117k3256m4407n7899o3412
$$ 553284 593665 644482 704798 770520 834051 885470 915409 918526 895270 850863 792964 729552
56797G29552o2470n7981n2464m6434l9382l1839k5137j9505j4037q520l610Q66
$$ 729552 667082 609101 556637 510203 470821 438982 413845 394340 380303 371783 368173 369039
56785C69039N966J1834J7504K2788K8257L2842L3390K7730J6749K842j1922k5304
$$ 369039 375005 386839 404343 427131 455388 488230 521620 549350 566099 568941 557019 531715
56773E31715l4613l8573l8489l6375l3037k8828k4777k1626j8811j5671j2714
$$ 531715 497102 458529 420040 383665 350628 321800 297023 275397 256586 240915 228201
56762B28201j0637r053p425o205n922n929n391m701m749n420n866n679m876l433
$$ 228201 217564 208511 201086 194881 188959 183030 177639 172938 168189 162769 156903 151224 146348 142915
56748A42915j762r67j531k399k335j564j178j501j995k257k148j485m63J73Q1
$$ 142915 141153 140186 138655 136256 133921 132357 131179 129678 127683 125426 123278 121793 121330 121503 121584
56733A21584p9K75O60M14j53l33j30K5J63M73P37P49Q59J354J776J579R19K47
$$ 121584 121505 121780 122440 122854 122701 122368 122238 122263 122426 122899 123636 124385 125244 126598 128374 129953 130872 131119
56715A31119l10p13p42n04m22l50M31J825K575J979Q67J77l76j297k123k245k004
$$ 131119 130809 130096 129354 128850 128428 128078 128509 130334 132909 134888 135755 135932 135556 134259 132136 129891 127887
56698A27887j894j543n72L32L35k10l87j09N7r4m11p74q10K4J411K061J441N87
$$ 127887 125993 124450 123878 124210 124545 124335 123948 123839 123896 123802 123391 122617 121807 121831 123242 125303 126744 127331
56680A27331M85O20J84l54n3R23J681J817J381M38m72l47Q69J812J544P94M80
$$ 127331 127816 128436 128620 128266 128213 129136 130817 132634 134015 134453 133981 133634 134503 136315 137859 138653 139133
56663A39133K73k95o12j74K42K0J8R66J841J507P41Q13J224Q68L55R91K290K779
$$ 139133 139406 139111 138499 138325 138567 138587 138605 139571 141412 142919 143660 144473 145697 146565 146920 147911 150201 152980
56645A52980K652L268M454M651L617K716K440J743Q4j706k853l332l057j952q61
$$ 152980 155632 158900 163354 168005 171622 174338 176778 178521 178605 176899 174046 170714 167657 165705 164844
56630A64844q18j368j252n86o15j304j197M1R31N19k52k45L58Q95J318J672J542
$$ 164844 164026 162658 161406 160820 160205 158901 157704 157745 158676 159195 158943 158698 159056 159951 161269 162941 164483
56613A64483P14l29j022j132n44O10J587J699J286J135J133O08k37m89m5L46M87
$$ 164483 165197 164868 163846 162714 162170 162780 164367 166066 167352 168487 169620 170228 169991 169502 169457 169803 170290
56596A70290Q55J335J210N09M3l1l84j108j453j205j023j126r30l14%k21k76J58
$$ 170290 171145 172480 173690 174199 174242 174211 173827 172719 171266 170061 169038 167912 166982 166668 166668 166447 166171 166329
56578A66329L73j30p16n55K54R79J179R90R00J306K003K243J798J499K061K982
$$ 166329 166702 166572 165856 165301 165555 166534 167713 168703 169603 170909 172912 175155 176953 178452 180513 183495
56562A83495L466L805M741N942O446O197N926N743N215M552M363M437M038L234
$$ 183495 186961 190766 195507 201449 207895 214092 220018 225761 230976 235528 239891 244328 248366 251600
56548B51600K663K212J346L76J4r4p97j757j947j622j996l092l745l706l835m188
$$ 251600 254263 256475 257821 258197 258211 258117 257320 255563 253616 251994 249998 246906 243161 239455 235620 231432
56532B31432l898l165l295m330m640l507k210j845j827j375q75q80j139j434k048
$$ 231432 227534 224369 221074 216744 212104 208597 206387 204542 202715 201340 200465 199585 198446 197012 194964
56517A94964k759k674j747j149j469j835j485q51m55l9M87N36J7k58l3j84j106
$$ 194964 192205 189531 187784 186635 185166 183331 181846 180995 180540 180501 180988 181524 181541 181283 181250 181066 179960
56500A79960j759j264k86O2k42n45o23n91m48l09m27n69j78O31J109J101J215
$$ 179960 178201 176937 176651 176713 176471 175926 175303 174712 174264 173955 173528 172959 172781 173412 174521 175622 176837
56483A76837J598J667J299J072J077P56J52K7L87L29k29k42N96J207R52O27Q57
$$ 176837 178435 180102 181401 182473 183550 184306 184458 184485 184872 185201 184972 184730 185326 186533 187485 188112 188969
56466A88969R63L15m70n75j68L04Q82J476J497Q31K48K21L53L80O53J155J237
$$ 188969 189932 190247 189777 189202 189034 189338 190220 191696 193193 194024 194272 194493 194846 195226 195879 197034 198271
56449A98271Q05O19R35J065P46O40J005J144O99K18m5n03r58n00P82J439P26l84
$$ 198271 199076 199695 200630 201695 202441 203081 204086 205230 205929 206147 206102 205599 204641 204141 204923 206362 207088 206704
56431B06704q60q31n99PN83J26j192j807j015P6N50Q54J200P71l96p09M97J569
$$ 206704 205844 205013 204414 204421 205004 205130 203938 202131 201116 201192 201742 202596 203796 204567 204171 203462 203959 205528
56413B05528J070N4J84J107J428J043P88P10L36j10j38P6K47P30J679K353K191
$$ 205528 206598 206652 206836 207943 209371 210414 211202 211912 212248 212138 212000 212076 212323 213053 214732 217085 219276
56396B19276J629J121M26l25k01R49J830J625J223J458J646J030K98L16O51O87
$$ 219276 220905 222026 222452 222127 221926 222875 224705 226330 227553 229011 230657 231687 231985 232301 232952 233639
56380B33639Q64J517J750R66K31O51J534J664J235J020Q14K09j22N06J350J369
$$ 233639 234503 236020 237770 238736 238967 239618 241152 242816 244051 245071 245885 246094 245972 246478 247828 249197
56364B49197R04P93Q35N48M31R63J294M84p19r23j69M92Q11J291J887K088J831
$$ 249197 250101 250894 251729 252277 252708 253671 254965 255449 254730 253807 253638 254130 254941 256232 258119 260207 262038
56347B62038J315M89l83m97K57P68K79m96p12o40o21p6J311K644L160L278L319
$$ 262038 263353 263842 263459 262962 263219 263987 264266 263770 263058 262418 261797 261721 263032 265676 268836 272114 275433
56330B75433K649J232M88J213K160K071J584J659J732J050L99O27R26K73o78q92
$$ 275433 278082 279314 279802 281015 283175 285246 286830 288489 290221 291271 291670 292297 293223 293496 292818 291926
56314B91926p74j020j034k74L10NLJ361K797K649J624J448K084K484K810L590
$$ 291926 291152 290132 289098 288824 289134 289139 289142 290503 293300 295949 297573 299021 301105 303589 306399 309989
56298C09989L896K787J445J500K291K198J589J916K795K599J366N43N03N72Q52
$$ 309989 313885 316672 318117 319617 321908 324106 325695 327611 330406 333005 334371 334914 335417 335989 336841
56283C36841J738K306J585P38J506L184L645K810K483L178L651L432L366L733
$$ 336841 338579 340885 342470 343208 344714 347898 351543 354353 356836 360014 363665 367097 370463 374196
56269C74196L999M317N285O376O591O341O804P818Q410Q774R796J1109J1689J1888
$$ 374196 378195 382512 387797 394173 400764 407105 413909 421727 430137 438911 448707 459816 471505 483393
56255D83393J2863J4478J5723J6611J7793J8999J9812K1010K3108K4610K4067
$$ 483393 496256 510734 526457 543068 560861 579860 599672 620682 643790 668400 692467
56244F92467K2743K2706K3303K2341J9866J7854J6652J4688J1381P618L658p86
$$ 692467 715210 737916 761219 783560 803426 821280 837932 852620 864001 871619 875277 874491
56232H74491m724o844q009j0208j3416j5916j7284j8463j9412j9409j9137j9757
$$ 874491 869767 862923 854914 844706 831290 815374 798090 779627 760215 740806 721669 701912
56220G01912k0367j9252j7046j5733j5054j3080r992p966p445o727n275m265l817
$$ 701912 681545 662293 645247 629514 614460 601380 591388 583422 575977 569250 563975 559710 555893
56207E55893k778j429j414k810m059m759n607n882m214j745j106k211k419j029
$$ 555893 553115 551686 550272 547462 543403 538644 533037 527155 522941 521196 520090 517879 515460 514431
56193E14431l3q2N92K515L735L242K448K321K054J534K079L754M711M152L373
$$ 514431 514398 514316 514908 517423 521158 524400 526848 529169 531223 532757 534836 538590 543301 547453 550826
56178E50826L070K306R29L65J154K139K759L764N147N763N513N547O046O147O122
$$ 550826 553896 556202 557131 557496 558650 560789 563548 567312 572459 578222 583735 589282 595328 601475 607597
56163F07597P079Q565R125R094R962J1291J1414J0944J2136J4765J6265J6083
$$ 607597 614676 623241 632366 641460 651422 662713 674127 685071 697207 711972 728237 744320
56151G44320J6333J7835J9164K0009K1861K4795K7190K9150L2666L7932M3186
$$ 744320 760653 778488 797652 817661 839522 864317 891507 920657 953323 991255 1034441
56140A034441M8644N6814O8308Q1065R4259J08912J23812J34773J39011J36702
$$ 1034441 1083085 1139899 1208207 1289272 1383531 1492443 1616255 1751028 1890039 2026741
56130B026741J27891J12170R2441P4721O2634N5414N1688N0886N0022M3931L0747
$$ 2026741 2154632 2266802 2359243 2433964 2496598 2552012 2603700 2654586 2704608 2748539 2779286
56119B779286J3748l254j8573l0269l6051l7372l9577m6259n6909p0656q7588
$$ 2779286 2793034 2789780 2771207 2740938 2704887 2667515 2627938 2581679 2524770 2454114 2366526
56108B366526j05143j17990j23507j23508j19459j10554r7758q4789p3282o1554
$$ 2366526 2261383 2143393 2019886 1896378 1776919 1666365 1568607 1483818 1410536 1348982
56098A348982m9614m0476l4702k8858k1527j5834j3627j2149r016n740l716j410
$$ 1348982 1299368 1258892 1224190 1195332 1173805 1157971 1144344 1132195 1123179 1117439 1113723 1112313
56086A112313J836L768L591L918N972P353O919P144R269J0918J0989J1917J4577
$$ 1112313 1114149 1117917 1121508 1125426 1131398 1138751 1145670 1152814 1162083 1173001 1183990 1195907 1210484
56073A210484J6048J5090J4750J6732J8393J8138J8438K0554K1641K0260J9382
$$ 1210484 1226532 1241622 1256372 1273104 1291497 1309635 1328073 1348627 1370268 1390528 1409910
56062A409910K0649K1145J9165J7658J8401J8415J5848J3904J5037J6690J6706
$$ 1409910 1430559 1451704 1470869 1488527 1506928 1525343 1541191 1555095 1570132 1586822 1603528
56051A603528J7482K0766K3758K4444K5476K8761L1541L1782L1949L3707L4516
$$ 1603528 1621010 1641776 1665534 1689978 1715454 1744215 1775756 1807538 1839487 1873194 1907710
56040A907710L3207L2999L5227L6343L4943L5133L8797M1524M0572L9814M2147
$$ 1907710 1940917 1973916 2009143 2045486 2080429 2115562 2154359 2195883 2236455 2276269 2318416
56029B318416M4318M4139M5219M9307N1718N0000M9311N3289N7540N8328N9569
$$ 2318416 2362734 2406873 2452092 2501399 2553117 2603117 2652428 2705717 2763257 2821585 2881154
56018B881154O4573O9133O9840P1110P6686Q2272Q4086Q6346R2553R7922R8586
$$ 2881154 2945727 3014860 3084700 3155810 3232496 3314768 3398854 3485200 3577753 3675675 3774261
56007C774261R9706J06115J13511J17507J22399J31969J40885J44751J49312J59899
$$ 3774261 3873967 3980082 4093593 4211100 4333499 4465468 4606353 4751104 4900416 5060315
55997E060315J71275J78127J85745J99411K13337K21495K29434K43606K59267
$$ 5060315 5231590 5409717 5595462 5794873 6008210 6229705 6459139 6702745 6962012
55988F962012K71003K84505L05386L27465L45249L66362L97901M32765M63867
$$ 6962012 7233015 7517520 7822906 8150371 8495620 8861982 9259883 9692648 10156515
55979A0156515M98834N45253N95273O41448O93442P61449Q38380R17443J011014
$$ 10156515 10655349 11200602 11795875 12437323 13130765 13892214 14730594 15648037 16659051
55970A6659051J131496J270789J421192J598666J821629K086668K391827K762366
$$ 16659051 17790547 19061336 20482528 22081194 23902823 25989491 28381318 31143684
55962C1143684L224277L776000M419042N190071O123830P210730Q432981R815186
$$ 31143684 34367961 38143961 42563003 47753074 53876904 61087634 69520615 79335801
55954G9335801J1401924J3237205J5432357J8204587K1758718K6147126L1244016
$$ 79335801 90737725 103974930 119407287 137611874 159370592 185517718 216761734
55947B16761734L6597554M0955499M2008818L7238840K5699770R193545q443252
$$ 216761734 253359288 294314787 336323605 373562445 399262215 408455760 400012508
55940D00012508k3387311l3466452l8397243l9092210l6919849l3225171k9023341
$$ 400012508 376625197 343158745 304761502 265669292 228749443 195524272 166500931
55933A66500931k4884935k1058219j7660805j4747180j2294217j0236823q528936
$$ 166500931 141615996 120557777 102896972 88149792 75855575 65618752 57089816
55926E7089816p137635o005783n068319m291517l660549l144367k706357k334910
$$ 57089816 49952181 43946398 38878079 34586562 30926013 27781646 25075289 22740379
55918B2740379k031989j783346j567344j380818j229721j104667r89804q85860
$$ 22740379 20708390 18925044 17357700 15976882 14747161 13642494 12652690 11766830
55910A1766830q01627p31804o64377o01141n50600n08584m65123m22847l90281
$$ 11766830 10965203 10233399 9569022 8967881 8417281 7908697 7443574 7020727 6630446
55901F630446l63976l34738l04766k81872k63127k40525k16985k00838j89837
$$ 6630446 6266470 5931732 5626966 5345094 5081967 4841442 4624457 4423619 4233782
55892D233782j75737j59736j48708j40780j28892j14659j05041r8793q9149p6595
$$ 4233782 4058045 3898309 3749601 3608821 3479929 3365270 3260229 3161436 3072287 2995692
55882B995692o6590n7826m4762k9129j7894j2544j0759j5225k9976n0734o8989
$$ 2995692 2929102 2871276 2826514 2797385 2779491 2766947 2756188 2740963 2710987 2660253 2591264
55871B591264q3074r5864j05160j06478j02398r9089r6134q9178p9907p3737p0119
$$ 2591264 2508190 2412326 2307166 2200688 2098290 1999201 1903067 1813889 1733982 1660245 1590126
55860A590126o4576n8063n4999n3970m9662m2382l6885l3322k7983k1598j8541
$$ 1590126 1525550 1467487 1412488 1358518 1308856 1266474 1229589 1196267 1168284 1146686 1128145
55849A128145j8858j8900j8578k0390k2739k1832j8864j8003j8718j7448j5121
$$ 1128145 1109287 1090387 1071809 1051419 1028680 1006848 987984 969981 951263 933815 918694
55838I18694j5491j7443j6621j3581j2780j4423j4666j3070j2715j3496j2374
$$ 918694 903203 885760 869139 855558 842778 828355 813689 800619 787904 774408 762034
55827G62034r769q958r673q848p076p790j0548j1642j0835j1136j2401j1634r241
$$ 762034 752265 743307 733634 724786 717710 709920 699372 687730 676895 665759 653358 641724 632483
55814F32483q553r384q312n229l410l164j537J606L228K970L594N418N939N098
$$ 632483 623930 614546 606234 601005 597595 594431 592894 594500 597728 600698 604292 609710 615649 620747
55800F20747N434O794O356L924J891O1l980r363j2416j2843j3771j5465j4666
$$ 620747 626181 632975 639331 643255 645146 645207 641227 631864 619448 606605 592834 577369 562703
55787E62703j0736o943m922l272k296m609r887j4125j5402j5651j5773j3946r996
$$ 562703 551967 545024 540102 536830 534534 529925 520038 505913 490511 474860 459087 445141 435145
55774D35145o741n435m102j701P6L18L50O48j0j554k350k507l746n726o316n770
$$ 435145 428404 422969 418867 417166 417242 417560 417910 418558 418548 416994 414644 412137 408391 402665 396349 390579
55758C90579o502q385q592o637n259n611n864n393n980p849q690p809p226p526
$$ 390579 384077 375692 367100 360463 355204 349593 343729 338336 332356 324507 315817 308008 300782 293256
55744B93256o670m134k352k584l051k499k132k667k892k433k638l525l111r47
$$ 293256 286586 282452 280100 277516 274465 271966 269834 267167 264275 261842 259204 255679 252568 251621
55730B51621Q10R83Q56J141O47r60k194k499k955l526k768j018n74j814k525j909
$$ 251621 252431 253414 254270 255411 256058 255098 252904 250405 247450 243924 241156 240138 239564 237750 235225 233316
55714B33316j765k701k722r27P19P53K20J00k66q79l39J367K193J400O12N09l95
$$ 233316 231551 228850 226128 225201 225920 226673 226893 226993 226727 225848 225509 226876 229069 230469 231081 231590 231195
55697B31195k473l636k802j714j831k201j952k089l225m100l853l459l593l383
$$ 231195 228722 225086 222284 220570 218739 216538 214586 212497 209272 205172 201319 197860 194267 190884
55683A90884k446j769j593p84Q31J989K527L632M898M263J698j71j87k16j437
$$ 190884 188438 186669 185076 184292 185123 187112 189639 193271 198169 202432 204130 203959 203772 203556 202119
55668B02119k320j788j093j029l99J061J410k3r38K66J984K556K995M445N692
$$ 202119 199799 198011 196918 195889 195490 196551 197961 197938 197000 197266 199250 201806 204801 209246 214938
55653B14938N546N138N459N067K623m47k216l193m682o122o336n896o005o424
$$ 214938 220484 225622 231081 236148 238771 238324 236108 232915 228233 222111 215775 209879 203874 197450
55639A97450o309n763m979l420j322l39j153k194k062j469j331j004j0N29j33
$$ 197450 191141 185378 180399 176979 175657 175318 174165 171971 169909 168440 167109 166105 166095 166624 166491
55624A66491p24j03P86P74N04R17J370R90L63J97j16j121k019k139k128k383k118
$$ 166491 165767 165664 166450 167224 167728 168645 170015 171005 171368 171565 171449 170328 168309 166170 164042 161659 159541
55607A59541j195r12j619j732n39K84m39j294r41n08j257k041j465n53q12j404
$$ 159541 158346 157434 155815 154083 153544 153828 153389 152095 151154 150646 149389 147348 145883 145330 144518 143114
55591A43114p39O12J121R87J264J562R70J50K13N70J13n35m9J248K169K833M018
$$ 143114 142375 142987 144108 145095 146359 147921 148891 149041 149254 149824 149937 149402 149353 150601 152770 155603 159621
55574A59621N204N291M638M512N163O012O976P986Q088O603M333K252K9k725n007
$$ 159621 164825 170116 174754 179266 184429 190441 197417 205403 213491 220094 224427 226679 226708 223983 218976
55559B18976n856o035o633p185o847o214o160o100n237m313m286m380l482k283
$$ 218976 213120 207085 200452 193267 186420 180206 174046 167946 162709 158396 154110 149730 146248 143965
55545A43965k029k197j525l89mj39J63M61k91j455j480m87M4k60m76l76n60r18
$$ 143965 141936 139739 138214 137825 137821 137682 137845 138306 138015 136560 135080 134593 134637 134377 133901 133525 132965 132047
55527A32047p21j15J85L45R65J499Q40p76j984k247k103j774j027j92P7r2r4p
$$ 132047 131326 131211 131396 131741 132706 134205 135045 134269 132285 130038 127935 126161 125134 124942 125019 124927 124833 124826
55509A24826l11q65j181j219j012k46Q49J122J77o43k20N24K67m40k65N50Q20
$$ 124826 124515 123650 122469 121250 120238 119992 120841 121963 122140 121497 121277 121801 122068 121628 121363 121913 122733
55492A22733N09L23J3j036k163k260j692j541j584r41m4N2j88M76J631J704P15
$$ 122733 123242 123565 123578 122542 120379 118119 116427 114886 113302 112361 112317 112369 112181 112657 114288 115992 116707
55475A16707K49O86O50m55j432j295o02j90m6K9j33m65n30k53J6K06M71N50J06
$$ 116707 116956 117642 118292 117837 116405 115110 114508 114318 114272 114301 114168 113703 113173 112920 112936 113142 113613 114163 114269
55456A14269m60m58K9L95M44K50l77j317j657q21L78R55J226J815K129J306jn09
$$ 114269 113809 113351 113380 113775 114219 114469 114092 112775 111118 110297 110675 111630 112856 114671 116800 118106 118105 117596
55438A17596l85p41j479j393k35J017J706J909J464K50q26p04J45L56j18p1Q39
$$ 117596 117211 116470 114991 113598 113363 114380 116086 117995 119459 119709 118883 118179 118324 118680 118562 118491 119330
55421A19330J632J766J816K207K598K700K627K307J669J190J330J571J123K42
$$ 119330 120962 122728 124544 126751 129349 132049 134676 136983 138652 139842 141172 142743 143866 144108
55407A44108l07o35j333k077k074j591j610k097k075j286n11k62l68o78j091j151
$$ 144108 143801 143166 141833 139756 137682 136091 134481 132384 130309 129023 128512 128250 127882 127204 126113 124962
55391A24962o43k15m46q13o47l70n46o28k1N29K21j20N66J408R42k41m09L44M39
$$ 124962 124319 124104 123658 122845 122198 121828 121282 120654 120633 121162 121383 121263 121829 123237 124179 123938 123529 123873 124312
55372A24312k89n17p5k00j134j756j748j881k027j210J64M90l21o19R0M16j82
$$ 124312 124023 123506 123431 123231 122097 120341 118593 116712 114685 113475 113639 114129 113808 113189 113279 113695 113513
55355A13513l35O76J559J225M06J6k65p70q37j46M41L14Q1K36K26l41q38o82j48
$$ 113513 113178 113854 115413 116638 117044 117060 116795 116025 115188 115042 115483 115797 115878 116114 116340 115999 115161 114479 114331
55336A14331M52J149J536R41j44l32N47J111O24n8k00k04l13m9L90o3j353j851
$$ 114331 114783 115932 117468 118409 118265 117933 118480 119591 120215 120157 119957 119753 119440 119391 119781 119718 118365 116514
55318A16514p87N22Q40P20R99J212P31R0m9n2l01k44M59R49M53n10j093j222r88
$$ 116514 115727 116249 117089 117809 118808 120020 120751 120841 120792 120740 120439 120195 120654 121603 122056 121546 120453 119231 118243
55299A18243j51Q82R84P5l77L68J041N36j73K01J028Q99J7l90j78j58m01l34q7
$$ 118243 118092 118974 119958 120033 119656 120024 121065 121601 121428 121629 122657 123556 123573 123183 123005 122847 122446 122112 122025
55280A22025k88o96m36M99J099P76L6k92J27R81J510J086j7q33r36q63r70p93
$$ 122025 121737 121041 120605 121104 122203 122979 123015 122723 122850 123831 125341 126427 126410 125577 124641 123778 122808 122015
55262A22015n1N64L70k67o68q98j225j235m10P98J384J001Q1q89j628j838j362
$$ 122015 121964 122528 122898 122631 121963 121065 119840 118605 118195 118993 120377 121378 121459 120570 118942 117104 115742
55245A15742m65L60P24N36J44J78P54J068N04j82J24J046J257P24O83J251J036
$$ 115742 115277 115637 116361 116897 117041 117219 117973 119041 119545 119363 119487 120533 121790 122514 123197 124448 125484
55228A25484k99j011N4J526J558M26l89n57p78j167j196p61j43O23J388J549R59
$$ 125484 125185 124174 124228 125754 127312 127738 127349 126792 126014 124847 123651 122890 122747 123370 124758 126307 127266
55211A27266N18Q86J350R48j5n63n29m00k50N7J84j86o24o29n27q35j264j259
$$ 127266 127784 128670 130020 130968 130953 130390 129861 129461 129211 129268 129452 129266 128642 128013 127486 126651 125387 124128
55193A24128j003r97j108r05m44PN21J011Q14l37j529j746j172n60j2P03J170
$$ 124128 123125 122128 121020 120115 119671 119678 120199 121210 122024 121687 120158 118412 117240 116680 116668 117371 118541
55176A18541Q64K18J11O38J231J685K069K078J433O88O98J448K152K315K001J373
$$ 118541 119405 119623 119734 120372 121603 123288 125357 127435 128868 129556 130254 131702 133854 136169 138170 139543
55160A39543O59L21N71R49R42O26K24m63j570k597k957k699k152j425o59k36j65
$$ 139543 140202 140523 141094 142043 142985 143611 143835 143372 141802 139205 136248 133549 131397 129972 129313 129077 128912
55143A28912J1K82K5o66o22O21J800J641O87J66O9l37q69q09l74l52o21m00K77
$$ 128912 128923 129205 129230 128564 127942 128563 130363 132004 132691 132857 132926 132589 131720 130911 130537 130185 129564 129164 129441
55124A29441O03L54M0j39m08o71o06l39j46J84P48Q00j96j243q75O70J693J362
$$ 129441 130044 130398 130438 130299 129891 129220 128614 128275 128129 128313 129061 129861 129665 128422 127547 128217 129910 131272
55106A31272N18J17J25K55O02J163J533J459J122P34M02L23N68P03K59n28j014
$$ 131272 131790 131907 132032 132287 132889 134052 135585 137044 138166 138900 139302 139625 140193 140896 141155 140627 139613
55089A39613j005p41k74M51J097J212Q44L45j55n65n88k45j64o51j010n84J19
$$ 139613 138608 137867 137593 138044 139141 140353 141197 141542 141387 140822 140234 139989 139825 139174 138164 137580 137699
55072A37699K15k25n38o11o36k95N76J104M23p53r92k79J56r4k20J05J53l86p38
$$ 137699 137914 137689 137151 136540 135904 135609 136185 137289 137712 136959 135967 135688 135844 135750 135530 135635 135788 135402 134664
55053A34664l23L83P39P55O68M29R4N5M73R80J059M13q99k260k662j741l94L13
$$ 134664 134341 134724 135463 136218 136886 137315 137409 137464 137937 138917 139976 140389 139490 137230 134568 132827 132433 132746
55035A32746M78Q35J337J281O25R2L0J26J64K15J70o6o4N15J098R10K33q6n5l04
$$ 132746 133224 134059 135396 136677 137302 137394 137424 137550 137714 137929 138099 138033 137969 138484 139582 140492 140725 140639 140584 140280
55015A40280p26o29j09J00%K16N87K96n41q75m92k78m95l16N72J279J179P63N46
$$ 140280 139554 138925 138816 138916 138916 139132 139719 140015 139474 138599 138107 137829 137334 137018 137590 138869 140048 140811 141357
54996A41357L82L14Q44J774K042J308N24L63K83j63m22j58j30q76j553j160l4
$$ 141357 141739 142053 142897 144671 146713 148021 148545 148908 149191 149028 148606 148448 148318 147442 145889 144729 144695
54979A44695Q59J288J515J386O99j17n17n62m14K03J272J941J576P30K86K53K51
$$ 144695 145554 146842 148357 149743 150442 150325 149808 149246 148832 149035 150307 152248 153824 154554 154840 155093 155344
54962A55344M66J091J452Q96O8J41R98J372P41q2l11r1J58L54L88p2r46j483j175
$$ 155344 155810 156901 158353 159249 159317 159458 160456 161828 162569 162487 162176 162085 162243 162597 162985 162913 161967 160484 159309
54943A59309m92k59n31n81O4R41J220P66L49P27J737K566K808K890L411M464N760
$$ 159309 158817 158558 158027 157446 157510 158451 159671 160437 160786 161513 163250 165816 168624 171514 174925 179389 185149
54926A85149P087Q314R168R376R041Q551Q023O971M731J368k145m827o670q217
$$ 185149 192236 200550 209718 219094 228135 236686 244709 251680 256411 257779 255634 250807 244137 235920
54912B35920r352r257p826o249n600n540n141m407l932l578k630j204k87l22p03
$$ 235920 226568 217311 209485 203236 197636 192096 186955 182548 178616 175038 172408 171204 170917 170595 169892
54897A69892q26o56j70P60J630J545O01Q0Q28K220L246L756M072M204M200M590
$$ 169892 169066 168410 168240 169000 170630 172175 172776 172856 173684 175904 179150 182906 186978 191182 195382 199972
54881A99972N754P239Q322Q810Q740P815N770K973N3k699n059o469o576n957n643
$$ 199972 205726 212965 221287 230097 238837 246652 252422 255395 255448 252749 247690 241221 234645 228688 223045
54866B23045o030o731p272p420p002n989m715l597k653j691r24q95j688k590k773
$$ 223045 217015 210284 203012 195592 188590 182601 177886 174289 171636 169945 169021 168126 166438 163848 161075
54851A61075k152j421j263j687k130k107j626r98m70j50q5j67j83r8p1p4K03P97
$$ 161075 158923 157502 156239 154552 152422 150315 148689 147691 147221 147071 146986 146819 146636 146538 146467 146393 146596 147393
54833A47393J241J185Q44M45j93r50r30L73J948K323J498O94L81j29j078j592
$$ 147393 148634 149819 150663 151108 150915 149965 149035 149408 151356 153679 155177 155871 156252 156123 155045 153453
54817A53453j037N3Q71J223J163O66J60L93J259J645J031L66O23J337J375N19
$$ 153453 152416 152469 153340 154563 155726 156392 156552 156945 158204 159849 160880 161246 161869 163206 164581 165100
54801A65100n69j397j837j695r32m8M20M93M47K74qK9O79J506J880J809J688J622
$$ 165100 164531 163134 161297 159602 158670 158622 159042 159535 159982 160256 160248 160277 160956 162462 164342 166151 167839 169461
54783A69461J572J781K382K914K966K996L709M828N368N140N135O159P835R303
$$ 169461 171033 172814 175196 178110 181076 184072 187781 192609 197977 203117 208252 214411 222246 231549
54769B31549J0334J1192J1768J1417R719O947L717M66k475m577n491n716o386
$$ 231549 241883 253075 264843 276260 285979 292926 296643 297109 294634 290057 284566 278850 272464
54756B72464p951r507r879r083q130p568o996o015m930m235l874l334k236p20
$$ 272464 264513 255006 245127 236044 227914 220346 213350 207335 202405 198170 194296 190962 188726 188006
54742A88006N24P54Np43o82k28l27r07r26J21J568K683L506M344N180N961O869
$$ 188006 188530 189284 189289 188546 187864 187636 187309 186402 185476 185597 187165 189848 193354 197698 202878 208839 215708
54725B15708P898Q711R064Q865P723N219J796j446m076o665r366j1105j0818q864
$$ 215708 223606 232317 241381 250246 257969 263188 264984 263538 259462 252797 243431 232326 221508 212644
54711B12644o640n199m707m721m559l838k954k604k692k398j514q92j086j491
$$ 212644 206004 200805 196098 191377 186818 182980 180026 177422 174730 172332 170818 169926 168840 167349
54697A67349j365r56q75r83p32r4M99Q36R31O87J47k90l42k12j51n3J31J67O7
$$ 167349 165984 165028 164153 163170 162438 162344 162843 163679 164610 165297 165444 165154 164812 164600 164449 164396 164527 164694 164761
54678A64761K43P27Q20J32o71p64k99l7k31n34o35m42Q4P28R97O58K8n12q64q87
$$ 164761 165004 165731 166551 166683 166012 165248 164949 164912 164681 164147 163512 163070 163154 163882 164879 165537 165565 165053 164189 163302
54658A63302l86K84L77j70m78m7N18N99N41Q36J152R57M21k1l91p67q04m34l22
$$ 163302 162916 163200 163577 163407 162929 162882 163400 163999 164540 165376 166528 167485 167906 167885 167494 166727 165923 165489 165167
54639A65167q31j222p58J10N50O71R41J027L64n47p17k20Jk90m29j91j58n70p97
$$ 165167 164336 163114 162356 162466 163016 163687 164628 165655 166019 165472 164755 164535 164536 164246 163817 163626 163468 162898 162101
54620A62101k28R03J797J781Q29l03n91J47R83J040M76j7j97j65M4K33ln24n75
$$ 162101 161873 162776 164573 166354 167183 166880 166289 166436 167419 168459 168935 168918 168721 168556 168600 168833 168830 168306 167731
54601A67731m2R6o01r97m8J417J871J290O94K67m65j058n93M71O33l52j081o98
$$ 167731 167689 167785 167184 166187 166139 167556 169427 170717 171411 171678 171213 170155 169562 170033 170666 170314 169233 168535
54583A68535O9L73M38O73P66L41k83n69m47j56O7N1j22o6L29N40K40oL41O50J17
$$ 168535 168604 168977 169415 170088 170854 171195 170912 170343 169896 169740 169807 169858 169736 169670 169999 170539 170779 170773 171114 171764 171881
54562A71881o66m74M50O64q1m29L08R86N16m53n54M52J643K101J584N62n4K25
$$ 171881 171215 170741 171191 171855 171774 171345 171653 172639 173155 172702 172148 172600 174243 176344 177928 178490 178436 178661
54544A78661P95P24J67J71J015J757J617Q67L7p24j161p61M11J476J772J438P75
$$ 178661 179456 180180 180347 180518 181533 183290 184907 185774 185811 185087 183926 183165 183576 185052 186824 188262 189037
54527A89037j56j005j122m67J79K62Jl19p53j125r22j41M79M62O6m09j008j527
$$ 189037 188881 187876 186754 186287 186466 186728 186729 186410 185657 184532 183610 183469 183948 184410 184476 184067 183059 181532
54509A81532j451p77j40K04O00J049R97M29Q7K43K65j63m43k26l3j17J77J142
$$ 181532 180081 179304 179164 179368 179968 181017 182014 182443 182530 182773 183038 182875 182432 182206 182173 182056 182233 183375
54491A83375J859J549Q17O45R07Q82M86O4m76j226j540p53O95J682J777J426J091
$$ 183375 185234 186783 187600 188245 189152 190034 190520 190584 190108 188882 187342 186589 187284 188966 190743 192169 193260
54474A93260Q93Q58R09Q49P21Q57J194J156O55M62J025J625J496J050J052J232
$$ 193260 194153 195011 195920 196769 197490 198347 199541 200697 201352 201814 202839 204464 205960 207010 208062 209294
54458B09294P54k77r54r68r23j218j543j552j336j107r40r08j027j147j143j084
$$ 209294 210048 209771 208817 207849 206926 205708 204165 202613 201277 200170 199230 198322 197295 196148 195005 193921
54442A93921r24l25P61J655J609O92l88j073j196q37l75l09n54l50O38J566J448
$$ 193921 192997 192672 193433 195088 196697 197389 197001 195928 194732 193895 193520 193211 192657 192307 192945 194511 195959
54425A95959M55m11n96k40N16J522K157J769O18l31n79m16j67K00N92O11P7o78
$$ 195959 196414 196003 195407 195167 195683 197205 199362 201131 201749 201418 200839 200423 200256 200456 201048 201659 201736 201058
54407B01058j156j086m95K79O98N65L29N35J094J406J178O73K54J01J98L26J59
$$ 201058 199902 198816 198321 198600 199298 199863 200192 200727 201821 203227 204405 205078 205332 205433 205631 205957 206116
54390B06116k38k76L73J103J054L13k09p2K29J85OJ15L83L05k68q83j013n80M6
$$ 206116 205878 205602 205975 207078 208132 208445 208236 208164 208393 208578 208584 208699 209082 209387 209119 208236 207223 206643 206689
54371B06689M47N24M14J84j63n31p77r37j091j018m06N64J285J496J489J394R12
$$ 206689 207136 207660 208074 208258 208095 207564 206787 205850 204759 203741 203335 203899 205184 206680 208169 209563 210475
54354B10475j9p95r47q18r54j244j234r89r70j229j248o41L71J109R38j49j301
$$ 210475 210456 209661 208714 207896 206942 205698 204464 203475 202505 201276 200028 199387 199758 200867 201805 201656 200355
54337B00355j518q05j60k26n03l37K4m5m69p04o57o66p72o91l53P3N24Q84Q51
$$ 200355 198837 198032 197872 197646 197143 196806 196830 196785 196316 195612 194955 194289 193517 192826 192473 192546 193070 193954 194805
54318A94805M68M01J016J636J481R07P88J045R21M48M32R17R67K98j34L32R55
$$ 194805 195273 195674 196690 198326 199807 200714 201502 202547 203468 203916 204348 205265 206232 206530 206396 206728 207683
54301B07683P81N4l39k44k09m61o88o92o46o84p31p03o18m96l84l66l64j52K57
$$ 207683 208464 208518 208179 207935 207726 207265 206577 205885 205239 204555 203824 203121 202503 202007 201623 201257 200893 200741 200998
54282B00998M68J77l70o69o06m40l15o3L96P82P08J56m63o86m37n8N4j48l34j93
$$ 200998 201466 201643 201273 200604 199998 199558 199243 199180 199576 200358 201066 201222 200759 200073 199636 199578 199632 199484 199150 198957
54262A98957K07M71L17o6k35l3K00R1k65m77m20k77q7L74J118J684J605Q91o9
$$ 198957 199164 199635 199952 199886 199651 199618 199818 199909 199644 199167 198747 198470 198383 198757 199875 201559 203164 204055 203986
54243B03986q67j214r80l05M03P89O94Q8q78j672j676q64J35P68R69P68Q8p91
$$ 203986 203119 201905 200925 200620 201023 201812 202506 202594 201716 200044 198368 197504 197639 198407 199376 200144 200232 199441
54225A99441j149o86l3J64J64N61J136J106L23n06q76r70j068j045p66m63l95
$$ 199441 198292 197606 197573 197737 197901 198462 199598 200704 201027 200521 199645 198675 197607 196562 195796 195333 194938
54208A94938m65m59m02m38m82l31nK66L70L95L18j51j085j866j587j94J212J540
$$ 194938 194473 194014 193612 193174 192692 192361 192356 192622 192992 193387 193705 193554 192469 190603 189016 188822 190034 191574
54190A91574Q72P9l95p61j169j450j603j736j587q43J4J00m65n14M62J565J868
$$ 191574 192446 192525 192130 191369 190200 188750 187147 185411 183824 182981 182995 183095 182630 182116 182578 184143 186011
54173A86011J588J243O52l64j129r99l88n8J02N17P99L40m21m92J34N88N19L43
$$ 186011 187599 188842 189494 189130 188001 187002 186614 186556 186658 187175 187974 188314 187893 187401 187535 188123 188642 188985
54155A88985K23K4J28J070K261K415J413N80P48J241J270J108J131P48o51k269
$$ 188985 189208 189232 189360 190430 192691 195106 196519 197099 197847 199088 200358 201466 202597 203345 202694 200425
54139B00425k579j264L78R96N50n7k08j00j83l96k83K40O38M72j3l75n40n14K2
$$ 200425 197846 196582 196960 197956 198506 198449 198241 198141 197958 197562 197279 197519 198157 198629 198616 198241 197701 197187 197209
54120A97209J098J874J573P36O27J407J953J627J113J088J086L35r27j792j880
$$ 197209 198307 200181 201754 202490 203117 204524 206477 208104 209217 210305 211391 211726 210799 209007 207127
54105B07127j569j254r93p75o89p48p81n45J7N68N20l41j445j953j603p15M54
$$ 207127 205558 204304 203311 202536 201847 201099 200318 199773 199790 200358 200878 200537 199092 197139 195536 194821 195275
54088A95275J802K903L077K220J039K24k24n97q47o89j78J74j24r81j658j459
$$ 195275 197077 199980 203057 205277 206316 206540 206316 205719 204872 204183 204005 204179 204055 203074 201416 199957
54072A99957n49J38K7m08m09K9L63M13L93K93l8l60l09n7j7o5K34P25R06Q76J153
$$ 199957 199408 199546 199573 199165 198756 198785 199148 199561 199954 200247 200209 199849 199540 199483 199466 199401 199635 200360 201266 202142 203295
54051B03295J513J168J89l39N9N88N45K87K91K83J3LP03J631K161K509L084L453
$$ 203295 204808 205976 206165 205826 205885 206473 207018 207305 207596 207879 207892 207895 208598 210229 212390 214899 217983 221436
54033B21436K962J989J649K309L215L590L416L123K980K942K726K096J214N68
$$ 221436 224398 226387 228036 230345 233560 237150 240566 243689 246669 249611 252337 254433 255647 256215
54019B56215L86L59J75l2m6j5j68m25o18q47j234j573j579j293r43o70n78p98
$$ 256215 256601 256960 257135 257103 257057 257042 256874 256449 255831 254984 253750 252177 250598 249305 248362 247692 247114 246316
54001B46316j189j310r58m42j37o3r6j88k03J1J50l16j204j466m86J033K028K316
$$ 246316 245127 243817 242859 242417 242280 242217 242121 241933 241730 241741 241891 241575 240371 238905 238419 239452 241480 243796
53983B43796K339K209J833J547J941L031M298N354O200P055Q381J0749J4117J7619
$$ 243796 246135 248344 250177 251724 253665 256696 260994 266348 272548 279603 287984 298733 312850 330469
53969C30469K0713K4060K8382L2590L3964L0303K1407Q776n169j7523k5822k9370
$$ 330469 351182 375242 403624 436214 470178 500481 521888 530664 525495 507972 482150 452780
53957D52780k9405k7620k4862k1347j7547j4213j1671r591p561n712m594m437
$$ 452780 423375 395755 370893 349546 331999 317786 306115 296524 288963 283251 278657 274220
53945B74220m627m201k879j335k83L21R36J638K229K787L542M240M286L639K989
$$ 274220 269593 265392 262513 261178 260895 261216 262152 263790 266019 268806 272348 276588 280874 284513 287502
53930B87502K915L178L186K759K172J626J020K54m65p78o28l74l02j19P62K316
$$ 287502 290417 293595 296781 299540 301712 303338 304358 304612 304147 303369 302741 302367 302065 301946 302708 305024
53914C05024L706M163L771L061K210J118Q2k91P4M65K25m87j022j093r90j065
$$ 305024 308730 312893 316664 319725 321935 323053 323135 322844 322918 323383 323608 323121 322099 321006 320016 318951
53898C18951j314j562j839k321k893l060k538j784j595k209l100l696l887l821
$$ 318951 317637 316075 314236 311915 309022 305962 303424 301640 300045 297836 294736 291040 287153 283332
53884B83332l515l004k531k344k397k428k197j605q11l02m76j078j389j114p02
$$ 283332 279817 276813 274282 271938 269541 267113 264916 263311 262500 262198 261722 260644 259255 258141 257439
53869B57439o47r14j305j894k640l019k584j666j002q14p29m44j6M29Q13R47O05
$$ 257439 256792 255878 254573 252679 250039 247020 244436 242770 241768 240954 240225 239781 239765 240194 241007 241954 242559
53852B42559j47q91j212r95m71l7J32L18Q14J250Q69l00j230j180o69n58p38n21
$$ 242559 242412 241521 240309 239314 238843 238806 238938 239256 240070 241320 242189 241889 240659 239479 238810 238252 237514 236993
53834B36993R8M49L58L14M29J36p57j505j383o84k17j99j46K40O59P08M78M37
$$ 236993 237091 237540 237898 238212 238641 238777 238020 236515 235132 234448 234231 234032 233886 234126 234785 235493 235971 236408
53816B36408Q23J315J387Q94J60m06n94k91N40J680K717L501M261N141N857O160
$$ 236408 237231 238546 239933 240827 240987 240581 239987 239696 240236 241916 244633 248134 252395 257536 263393 269553
53800B69553O292O665P295P945Q674R881J1877J4694J8167K1936K5325K7360K6859
$$ 269553 275845 282510 289805 297750 306424 316305 328182 342876 361043 382979 408304 435664 462523
53787D62523K2610J4117K681q682j7015k1290k2329k1370j9233j6627j4338j2693
$$ 462523 485133 499250 501931 493249 476234 454944 432615 411245 392012 375385 361047 348354
53775C48354j1319r702p882o359n458m969m458l845l528l752m106l966l326k690
$$ 348354 337035 327333 319451 313092 307634 302665 298207 294362 290834 287082 282976 279010 275684 272994
53761B72994k208j641j177j403k148k253j192J1L07K20Q46J850J976J237J112
$$ 272994 270786 269145 267968 266565 264417 262164 260972 260983 261290 261510 262356 264206 266182 267419 268531
53746B68531K288L650M032L870M370N797P405Q531R031Q858P830N878L280O73
$$ 268531 270819 274469 278501 282371 286741 292538 299943 308474 317505 326363 334193 340071 343351 344024
53732C44024j282k522l743n511p254p745o644m902l533k630j913j416j160p55
$$ 344024 342742 340220 336477 330966 323712 315967 309323 304421 300888 298258 296345 294929 293769 293014
53718B93014O9Q84J157R97Q55Q15P94J139K221L549M045L313K070J181Q27P80
$$ 293014 293083 293967 295124 296121 296976 297791 298585 299724 301945 305494 309539 312852 314922 316103 316930 317710
53702C17710R32J121J006N80N28J446K830L483K975K099J738J818J748J318O66
$$ 317710 318642 319763 320769 321349 321877 323323 326153 329636 332611 334710 336448 338266 340014 341332 341998
53687C41998j38q78q79K00J481J612N34m06l10K05J88k72m63k26M6J67J95K2m56
$$ 341998 341860 340982 340103 340303 341784 343396 343930 343524 343214 343419 343607 343335 342872 342646 342692 342859 343054 343076 342620
53668C42620r83j233j228j029m32M96J007M93n76j231j252j196j434j810k098
$$ 342620 341637 340404 339176 338147 337715 338211 339218 339711 339135 337904 336652 335456 334022 332212 330114
53653C30114k115j624p52k58o39j238j075l10N7k24m09j36Q4n8q5M08J141J685
$$ 330114 327999 326375 325623 325365 324726 323488 322413 322103 322160 321936 321527 321391 321475 321417 321332 321740 322881 324566
53635C24566J931J760J028J74L6P35J475J766K024K608L050K800K114J611J509
$$ 324566 326497 328257 329285 329459 329495 330230 331705 333471 335495 338103 341153 343953 346067 347678 349187
53620C49187J747K383L324M149M603M843M857M174K693J228P49J394K639L968
$$ 349187 350934 353317 356641 360790 365393 370236 375093 379267 381960 383188 383937 385331 387970 391938
53606C91938M958N155M477L490K844K697K878L190L301K863K130J843K112K032
$$ 391938 396896 402051 406528 410018 412862 415559 418437 421627 424928 427791 429921 431764 433876 435908
53592D35908J009j37k12O43J163O21m27j030q71m03m49j552l293m418m087k838
$$ 435908 436917 436780 436568 437211 438374 438995 438568 437538 436667 436264 435815 434263 430970 426552 422465 419627
53576D19627j891j675j591j102m25j13l80r85j484j621j509j397j190n47M24J016
$$ 419627 417736 416061 414470 413368 412943 412830 412450 411465 409981 408360 406851 405454 404264 403717 404141 405157
53560D05157Q13K25k01m85p59o08L23J448J784J285Q58J068J577J895K041K203
$$ 405157 405970 406195 405994 405509 404750 404142 404465 405913 407697 408982 409840 410908 412485 414380 416421 418624
53544D18624K340K352K337K467K884L655M576N128N030M767N080N938O551O446
$$ 418624 420964 423316 425653 428120 431004 434659 439235 444363 449393 454160 459240 465178 471729 478175
53530D78175O098O308P374R024J0764J2131J2973J3662J4714J6157J7501J8423
$$ 478175 484273 490581 497955 506979 517743 529874 542847 556509 571223 587380 604881 623304
53518F23304J9147K0072K1364K3002K4889K6775K8421K9897L1392L2542L2478
$$ 623304 642451 662523 683887 706889 731778 758553 786974 816871 848263 880805 913283
53507I13283L0755K7986K5198K2855K0768J8760J7009J5882J5749J6766J8531
$$ 913283 944038 972024 997222 1020077 1040845 1059605 1076614 1092496 1108245 1125011 1143542
53496A143542K0101K0791K1014K1826K3548K5189K5529K4452K2963K2054K1920
$$ 1143542 1163643 1184434 1205448 1227274 1250822 1276011 1301540 1325992 1348955 1371009 1392929
53485A392929K2150K2179K1553K0122J8270J6725J5960J5896J6262J6871J7392
$$ 1392929 1415079 1437258 1458811 1478933 1497203 1513928 1529888 1545784 1562046 1578917 1596309
53474A596309J7238J6081J4299J2461J0587Q256N380K286q31m074p358j0308j2742
$$ 1596309 1613547 1629628 1643927 1656388 1666975 1675231 1680611 1682897 1682066 1677992 1670634 1660326 1647584
53461A647584j4851j6665j7845j8227j8260j8583j9426k0676k2199k3878k5437
$$ 1647584 1632733 1616068 1598223 1579996 1561736 1543153 1523727 1503051 1480852 1456974 1431537
53450A431537k6554k7053k6943k6400k5726k5067k4178k2809k1368k0735k1201
$$ 1431537 1404983 1377930 1350987 1324587 1298861 1273794 1249616 1226807 1205439 1184704 1163503
53439A163503k1906k1617j9865j7173j4387j1979r804p456m897k688j205O7J913
$$ 1163503 1141597 1119980 1100115 1082942 1068555 1056576 1046772 1039316 1034419 1031731 1030526 1030593 1032506
53426A032506M217O148P516R069J1159J3120J4405J5531J7232J9331K1248K2985
$$ 1032506 1036723 1042871 1050387 1059456 1070615 1083735 1098140 1113671 1130903 1150234 1171482 1194467
53414A194467K4826K6503K7563K8276K9329L0773L2104L3218L4607L6552L8790
$$ 1194467 1219293 1245796 1273359 1301635 1330964 1361737 1393841 1427059 1461666 1498218 1537008
53403A537008M0997M3050M4844M6421M8249N0842N4012N6945N9068O0408O1217
$$ 1537008 1578005 1621055 1665899 1712320 1760569 1811411 1865423 1922368 1981436 2041844 2103061
53392B103061O1628O1773O1867O2206O3054O4410O5655O5857O4708O2696O0147
$$ 2103061 2164689 2226462 2288329 2350535 2413589 2477999 2543654 2609511 2674219 2736915 2797062
53381B797062N6727N2426M8273M5183M2632L9490L5712L2184K9129K5835K1937
$$ 2797062 2853789 2906215 2954488 2999671 3042303 3081793 3117505 3149689 3178818 3204653 3226590
53370C226590J7820J3734R466M980K41n597j3683k3736l3927m2901n0904n8472
$$ 3226590 3244410 3258144 3267610 3272590 3272831 3267234 3253551 3229815 3195888 3152987 3102083 3043611
53358C043611o5036o9612p2085p3080p3173p2805p2378p1774p0371o8082o5818
$$ 3043611 2978575 2908963 2836878 2763798 2690625 2617820 2545442 2473668 2403297 2335215 2269397
53347B269397o4323o3201o1769o0268n9366n8973n8412n7458n6306n4732n2142
$$ 2269397 2205074 2141873 2080104 2019836 1960470 1901497 1843085 1785627 1729321 1674589 1622447
53336A622447m8570m4816m1553l8763l6154l3574l0931k8121k5192k2294j9470
$$ 1622447 1573877 1529061 1487508 1448745 1412591 1379017 1348086 1319965 1294773 1272479 1253009
53325A253009j6800j4657j3482j3231j3260j2797j1439r330p070n334m314l659
$$ 1253009 1236209 1221552 1208070 1194839 1181579 1168782 1157343 1148013 1140943 1135609 1131295 1127636
53313A127636k997k236j331j16J355K730L914N280O918Q233Q850R457J0982J3232
$$ 1127636 1124639 1122403 1121072 1120956 1122311 1125041 1128955 1134235 1141153 1149386 1158236 1167693 1178675 1191907
53299A191907J5221J6750J8711K1681K4987K7512K8843K9333K9506K9785L0425
$$ 1191907 1207128 1223878 1242589 1264270 1289257 1316769 1345612 1374945 1404451 1434236 1464661
53288A464661L1343L2143L2480L2211L1178K9319K6981K4827K3161K1739K0309
$$ 1464661 1496004 1528147 1560627 1592838 1624016 1653335 1680316 1705143 1728304 1750043 1770352
53277A770352J8947J7636J5923J3376J0031O191K097j900n237p675r700j1968
$$ 1770352 1789299 1806935 1822858 1836234 1846265 1852456 1854553 1852653 1847416 1839741 1830041 1818073
53265A818073j4532j7084j9748k3043k6993l0831l3736l5567l6650l7253l7564
$$ 1818073 1803541 1786457 1766709 1743666 1716673 1685842 1652106 1616539 1579889 1542636 1505072
53254A505072l7942l8791m0086m1225m1434m0372l8376l6207l4488l3369l2678
$$ 1505072 1467130 1428339 1388253 1347028 1305594 1265222 1226846 1190639 1156151 1122782 1090104
53243A090104l2261l2062l1930l1677l1318l1040l0801l0203k8980k7477k6279
$$ 1090104 1057843 1025781 993851 962174 930856 899816 869015 838812 809832 782355 756076
53232G56076k5396k4107k1841j9003j6609j5150j4065j2533j0575r062q616q861
$$ 756076 730680 706573 684732 665729 649120 633970 619905 607372 596797 587735 579119 570258
53220E70258q940q534q018p733p616p606p958q731r357r146q207p410p373p832
$$ 570258 561318 552784 544766 537033 529417 521811 513853 505122 495765 486619 478412 471002 463629 455797
53206D55797q122p979p666p478p400p197o706n978n209m594m309m510n142n728
$$ 455797 447675 439696 432030 424552 417152 409955 403249 397271 392062 387468 383159 378649 373507 367779
53192C67779n624m762l857l571l717l696l510l694m240m344l540k433j833j624
$$ 367779 362155 357393 353536 349965 346248 342552 339042 335348 331108 326764 323224 320791 318958 317334
53178C17334j107j86M97M98J34m8M8N0l81j153j717j565q06p3L11P45J601K461
$$ 317334 316227 316041 316538 317036 317170 317122 317170 317220 316839 315686 313969 312404 311598 311525 311836 312581 314182 316643
53160C16643K590K013J456J383J616J875K016J700O43n97q69K8Q37M20o89j144
$$ 316643 319233 321246 322702 324085 325701 327576 329592 331292 331935 331338 330469 330497 331334 331754 331065 329921
53144C29921p35m63q60j262j035n77n50p88o43q1K14k07j049j738j956j684j092
$$ 329921 329186 328723 327863 326601 325566 324989 324439 323651 323008 322927 323141 322934 321885 320147 318191 316507 315415
53127C15415n16k28j39K3J69j00q16j401j415j129j041j159j141r39p74o56m63
$$ 315415 314899 314671 314532 314555 314724 314624 313808 312407 310992 309863 308822 307663 306522 305583 304809 304153 303690
53110C03690l71o85j211j444j388j494j698j299j55P09L00j052k207k596k435
$$ 303690 303319 302634 301423 299979 298591 297097 295399 294100 293945 294654 294954 293902 291695 289099 286664
53095B86664j932j108k94m1m20r69j378j644j592r12J14O12K23l08q6P57J353
$$ 286664 284732 283624 283330 283289 282869 281900 280522 278878 277286 276374 276488 277100 277323 277015 276929 277686 279039
53078B79039J304J058J095J243J002K93m37p97r01j057j142o60M74J485J471M42
$$ 279039 280343 281401 282496 283739 284741 285034 284597 283800 282899 281842 280700 280040 280514 281999 283470 283912
53062B83912p06j220j137q86o58m55l19k59m3N52J328J775J654J258J029J112
$$ 283912 283206 281986 280849 279963 279305 278850 278531 278272 278229 278781 280109 281884 283538 284796 285825 286937
53046B86937J435J992K777L359L022J592o3q26n76k26m75j009j166q94o30n93
$$ 286937 288372 290364 293141 296500 299522 301114 301051 300225 299649 299423 298948 297939 296773 295879 295249 294656
53030B94656o45p08q08p94m42J05L90J86k61o12p90r38j181j495j631j296n50
$$ 294656 294011 293303 292495 291701 291259 291364 291754 291940 291679 291067 290277 289339 288158 286663 285032 283736 283186
53013B83186N1J8m77q03o62l33k01l03l94k24K82R06J239J079O78L49K3n02r87
$$ 283186 283237 283255 282778 281975 281313 280980 280779 280476 280082 279858 280140 281046 282285 283364 284042 284391 284414 283912 282925
52994B82925r08k10N09P11N13L65M49N78N35K61j79o42r32r10o33l98m91q37j001
$$ 282925 282017 281807 282316 283027 283540 283905 284354 284932 285467 285728 285549 284907 283975 283065 282432 282034 281543 280706 279705
52975B79705p15k54RK99J182K532L366L036K071J481J617K070K293J883P19o93
$$ 279705 278990 278736 278745 279044 280226 282758 286124 289160 291231 292712 294329 296399 298692 300575 301294 300601
52959C00601j402j098o29q49j425j489j050q38j098j411j574j702j528o32N89
$$ 300601 299199 298101 297472 296623 295198 293709 292659 291821 290723 289312 287738 286036 284508 283876 284465
52944B84465J126O91K3l03n29r34j241j137p32j95M45R30Q49L08j56m25q57j413
$$ 284465 285591 286282 286305 286002 285473 284539 283298 282161 281429 281234 281679 282609 283458 283766 283610 283185 282328 280915
52926B80915j481r15l35j49p3K0l08j153j796j699j267r96o72M2Q05J104R65O17
$$ 280915 279434 278519 278184 278035 277962 277982 277674 276521 274725 273026 271759 270763 270091 270133 270938 272042 273007 273624
52908B73624j3q82j507j586j433j239n95O80J826K014J373N69r1m63j69Q77J998
$$ 273624 273611 272729 271222 269636 268203 266964 266369 267049 268875 270889 272262 272831 272740 272277 272108 272985 274983
52891B74983K618L003L466L461K442J007J27l32j209k475l157k817k054j465r70
$$ 274983 277601 280604 284070 287531 289973 290980 291107 290775 289566 287091 283934 281117 279063 277598 276628
52876B76628k59O90J541J679N89j276k456k024p37L4L3j18k35m44k27R67K343
$$ 276628 276369 277059 278600 280279 280868 279592 277136 275112 274375 274409 274442 274324 274089 273645 273418 274385 276728
52859B76728K441J226J56KJ5m91j105j372j522j587r37N19J700J683P91k58j394
$$ 276728 279169 280395 280551 280553 280568 280077 278972 277600 276078 274491 273554 274073 275773 277456 278247 277989 276595
52842B76595k627l320l017k299j921j683j059l30j23k15J20Q52J258J204J352
$$ 276595 273968 270648 267631 265332 263411 261728 260669 260339 260216 260001 260121 260973 262231 263435 264787
52827B64787J973K366J831N98m98r13p39l47J60J090K699M586N951O629P362Q569
$$ 264787 266760 269126 270957 271555 271057 270144 269405 269058 269218 270308 273007 277593 283544 290173 297535 306104
52811C06104R313Q195N015Q97l083o538r090j0031r150p318n687m634l821k906
$$ 306104 315417 323612 328627 329524 326441 319903 310813 300782 291632 284314 278627 273993 270172 267266
52797B67266j831o94J13m5j290k599k591j145L06M38m92j149q10M6O28P27N78
$$ 267266 265435 264741 264854 264809 263519 260920 258329 257184 257490 257928 257436 256287 255477 255523 256151 256878 257456
52780B57456M08L76N88Q76Q43L62j49k55l3J68K56K88J50k10m31r2N65Q33N11
$$ 257456 257864 258240 258828 259704 260547 260909 260760 260505 260472 260640 260896 261184 261334 261124 260693 260601 261166 261999 262510
52761B62510J55K26M61L67m4l99n43o02o43n44k34J74M93N97M72K65J66J79R5
$$ 262510 262665 262891 263352 263719 263675 263276 262733 262131 261488 260944 260710 260884 261377 261974 262446 262711 262877 263056 263151
52742B63151j55k56J63R83J605J618J247R61Q54P06N55P54J360J841J708J095
$$ 263151 262996 262740 262903 263886 265491 267109 268356 269317 270171 270877 271432 272186 273546 275387 277095 278190
52726B78190M08k78j047j657j824j838k202k693k527j551n02Q0M04O37M75n6k79
$$ 278190 278598 278320 277273 275616 273792 271954 269752 267059 264532 262981 262479 262559 262963 263600 264075 264019 263740
52709B63740M0O0p86j622j268NR28J012P62M48m8l67R9R93J278Q40O87J206J483
$$ 263740 263780 263840 263054 261432 260164 260169 261097 262109 262871 263319 263271 262904 263003 263996 265274 266114 266801 268007 269490
52690B69490Q68O3m3L20N08O07R90J309R25O4l75p1L89L79p8m89l23O41J993K818
$$ 269490 270358 270421 270378 270698 271206 271813 272803 274112 275037 275101 274726 274655 275044 275423 275345 274856 274533 275174 277167 279985
52670B79985K551J634J052J228J687J739J210N16J58K65N60Q15J176J843K538
$$ 279985 282536 284170 285222 286450 288137 289876 291086 291602 291760 292025 292585 293400 294576 296419 298957
52655B98957K667K068J185M15l05j108j891k533l022l170k664j654p98m28j65
$$ 298957 301624 303692 304877 305292 304987 303879 301988 299455 296433 293263 290599 288945 288147 287719 287554
52640B87554L32P38O98N81R12J449J552J325J586K640L678L651K312K84j577k709
$$ 287554 287886 288624 289322 289903 290815 292264 293816 295141 296727 299367 303045 306696 309008 309292 307715 305006
52624C05006l062l021k965k823k203j015J69N59m7r76j273o45K16M23r6o24p01
$$ 305006 301944 298923 295958 293135 290932 289917 290086 290645 290598 289622 288349 287704 287920 288343 288247 287623 286922
52607B86922o58r45j320j181m84K11N40P56J157J537J476J008O69Q38J291J521
$$ 286922 286264 285319 283999 282818 282334 282545 283085 283841 284998 286535 288011 289019 289688 290526 291817 293338
52591B93338J369J119J019R84Q11M44j11q18j383j304m47O45J412J933K535L014
$$ 293338 294707 295826 296845 297829 298640 299084 298973 298155 296772 295468 295021 295666 297078 299011 301546 304560
52575C04560K871K245J874K085K374K184J602J046P50P39Q88Q19J32j061k154
$$ 304560 307431 309676 311550 313635 316009 318193 319795 320841 321591 322330 323218 324037 324169 323108 320954
52560C20954k752k949k910k680k473k550k608j976o82L49N37M05O02Q24M00n46
$$ 320954 318202 315253 312343 309663 307190 304640 302032 300056 299374 299723 300260 300665 301267 302091 302491 301945
52544C01945j184j017k50N88R40M45n36j009m51M13O02K53K62P96J100P38K04
$$ 301945 300761 299744 299494 300082 301022 301467 300931 299922 299471 299884 300486 300739 301001 301797 302897 303635 303839
52527C03839L9O9j43n54p86p00n33n51p25p63m23J37M88M94N30R11J430J776K058
$$ 303839 303878 303947 303804 303250 302464 301764 301231 300680 299955 299192 298769 298906 299394 299888 300418 301329 302759 304535 306593
52508C06593K487K718K084N29j167k110k007j179k73P4k90q81j075q40o64q67
$$ 306593 309080 311798 313882 314411 313244 311134 309127 307948 307675 307749 307459 306578 305503 304663 303999 303132
52492C03132j277j550j488j035k87M61R89J413J957K458K512K072J556J253J020
$$ 303132 301855 300305 298817 297782 297495 297956 298945 300358 302315 304773 307285 309357 310913 312166 313186
52477C13186O54L18L77R29J691K230K254J760R94L26J37O70J741K603K530J627
$$ 313186 313840 314158 314535 315464 317155 319385 321639 323399 324393 324719 324856 325526 327267 329870 332400 334027
52461C34027P41L72R0o61j701k500l003l434l589l071k126j506j415j308q66m83
$$ 334027 334768 335140 335230 334569 332868 330368 327365 323931 320342 317271 315145 313639 312224 310916 310050 309567
52445C09567m98n60j80N28J093J313J231P47k14j279j825j672j249r94q96p30
$$ 309567 309069 308509 308329 308857 309950 311263 312494 313241 313027 311748 309923 308251 307002 306008 305112 304382
52429C04382n05m13m80n15m39m30n91p05n03o0L25O52J206K035K675K710K371
$$ 304382 303877 303464 302984 302469 302030 301600 301009 300304 299801 299741 300066 300718 301924 303959 306634 309344 311715
52412C11715K344L044M241N438O465P643R268J0975J1803J1073Q987O143K789
$$ 311715 314059 317103 321344 326782 333247 340890 350158 361133 372936 384009 392996 399139 401928
52399D01928j031m791p588q982r198q552p323o094n404m873l590j620k15j22o32
$$ 401928 400897 396106 388518 379536 370338 361786 354463 348369 342965 338092 334502 332882 332667 332545 331913
52384C31913r47j391k382l129k582j105J11Q44J736K673K724J823J172J577K465
$$ 331913 330966 329575 327193 324064 321482 320377 320488 321332 323068 325741 328465 330288 331460 333037 335502
52369C35502K976L044K879K316J316M42J86K25kl96m14L4M29L73Q5J81R98K097
$$ 335502 338478 341522 344401 346717 348033 348475 348661 348886 348884 348488 348074 348108 348537 348910 348995 349176 350174 352271
52351C52271K610K193J489J275J410J137L47k21l1O27J273J904K648L296L540
$$ 352271 354881 357074 358563 359838 361248 362385 362732 362511 362480 363107 364380 366284 368932 372228 375768
52336C75768L397L162L148L584M408N152N429N513N994O860P572Q029Q725R663
$$ 375768 379165 382327 385475 389059 393467 398619 404048 409561 415555 422415 429987 438016 446741 456404
52322D56404R957Q990P390O250N847N716N613N770O316P048P793Q618R610J0599
$$ 456404 466361 475351 482741 488991 494838 500554 506167 511937 518253 525301 533094 541712 551322 561921
52308E61921J1215J1154J0517R875R780J0283J1046J1821J2409J2349J1335R893
$$ 561921 573136 584290 594807 604682 614462 624745 635791 647612 660021 672370 683705 693598
52296F93598R003Q803Q409P274O028N467N382N013M188L336K652J923J053K11
$$ 693598 702601 711404 719813 727087 733115 738582 743964 748977 753165 756501 759153 761076 762129 762340
52282G62340m79r42j003o40k02J1K49Q43J407J103j78j406j457k81J203K157K585
$$ 762340 761861 760919 759916 759276 759074 759085 759334 760177 761584 762687 762509 761103 759646 759365 760568 762725 765310
52265G65310L032L785M488M645M271L939M193N130O456P667Q301Q377Q509R189
$$ 765310 768342 772127 776615 781260 785531 789470 793663 798793 805249 812916 821217 829594 838103 847292
52251H47292J0019J0139R445Q672Q176P422O092M916M653M907M732M070L750M159
$$ 847292 857311 867450 876895 885567 893743 901165 907257 912173 916826 921733 926465 930535 934285 938444
52237I38444M744M893M573L968L114K136J360Q94M10l78j249j745j751j610j699
$$ 938444 943188 948081 952654 956622 959736 961872 963232 964126 964536 964158 962909 961164 959413 957803 956104
52222I56104k061k439k601k580k572k622k518j950p46R70K744L931M170L691K937
$$ 956104 954043 951604 949003 946423 943851 941229 938711 936761 936015 936985 939729 943660 947830 951521 954458
52207I54458J959N50j002j840j407kJ715L357M730N659O250O864P482P481O589
$$ 954458 956417 956967 955965 954125 952718 952716 954431 957788 962518 968177 974427 981291 988773 996254 1002843
52192A002843N535N115M969M068K221L21r03j650k412l309m259n270o187o547
$$ 1002843 1008378 1013493 1018462 1022530 1024751 1025072 1024169 1022519 1020107 1016798 1012539 1007269 1001082 994535
52178I94535o043m976m070l893m473n251n471m921m246m219m714m834m062k811
$$ 994535 988492 983516 979446 975553 971080 965829 960358 955437 951191 946972 942258 937424 933362 930551
52164I30551j712q81j68K90K52j24l62j97J64L24J37o7L11J467K744L229K828
$$ 930551 928839 927958 927790 928080 928332 928208 927846 927649 927813 928137 928274 928207 928518 929985 932729 935958 938786
52147I38786K394K561K905K621J598L20r38k203l222l497l072k577k319j892r82
$$ 938786 941180 943741 946646 949267 950865 951185 950247 948044 944822 941325 938253 935676 933357 931465 930483
52132I30483n1K95K26M17J090J928K819M021N525O838P587P855P767P243O515
$$ 930483 930432 930727 930953 931370 932460 934388 937207 941228 946753 953591 961178 969033 976800 984043 990558
52117I90558O426P617R684J1590J2785J3475J3923J4033J3789J3610J3956J4793
$$ 990558 996984 1004601 1014285 1025875 1038660 1052135 1066058 1080091 1093880 1107490 1121446 1136239
52105A136239J5678J6318J6875J7698J8771J9532J9304J7886J5608J2824R683
$$ 1136239 1151917 1168235 1185110 1202808 1221579 1241111 1260415 1278301 1293909 1306733 1316416
52094A316416O371L287P28j283k670l229l098k893k951k822k032j005n80r05j486
$$ 1316416 1322787 1326074 1326802 1325519 1322849 1319620 1316522 1313629 1310678 1307856 1305824 1304819 1304239 1303334 1301848
52079A301848k161l200m384m919m456l579k947k653k625l036l771m080l310j698
$$ 1301848 1299687 1296487 1292103 1287184 1282728 1279149 1276202 1273549 1270924 1267888 1264117 1260037 1256727 1255029
52065A255029k2J295K318L150L767M252M836N649O570P234P236O508N502M770
$$ 1255029 1255007 1256302 1258620 1261770 1265537 1269789 1274625 1280274 1286844 1294078 1301314 1307822 1313324 1318094
52051A318094M349L871L188K557K139J818J448J006M85R1M55J987L992N087M667
$$ 1318094 1322443 1326314 1329502 1332059 1334198 1336016 1337464 1338470 1338955 1339046 1339501 1341488 1345480 1350567 1355234
52036A355234L333J818K82j178k174k675l265m272n287n942o470p025p174o728
$$ 1355234 1358567 1360385 1360667 1359489 1357315 1354640 1351375 1347103 1341816 1335874 1329404 1322379 1315205 1308477
52022A308477o272o238o084n239m200l741l571k794j428m30l89j164k718n395
$$ 1308477 1302205 1295967 1289883 1284644 1280444 1276703 1273132 1270338 1268910 1268480 1268091 1266927 1264209 1258814
52008A258814r129j3121j6523j8977k0557k1574k2325k2608k1789j9825j7906
$$ 1258814 1249685 1236564 1220041 1201064 1180507 1158933 1136608 1114000 1092211 1072386 1054480
51997A054480j7222j7426j7135j5891j4656j4372j4880j5451j5605j5202j4387
$$ 1054480 1037258 1019832 1002697 986806 972150 957778 942898 927447 911842 896640 882253
51986H82253j3730j3824j4587j5397j5967j6531j7073j7082j6255j4918j3441
$$ 882253 868523 854699 840112 824715 808748 792217 775144 758062 741807 726889 713448
51975G13448j1805r969q146o437m606k500l06J743L585N050N808N866N671N450
$$ 713448 701643 691674 683528 677091 672485 669985 669679 671422 675007 680057 685865 691731 697402 702852
51961G02852M698K683o52m442p519r218r751r796r639q904p292n278l622k354
$$ 702852 707550 710233 709581 705139 697620 688402 678651 668855 659216 650312 643020 637742 634120 631766
51947F31766q36J273L605N641P135P961Q073P780P578P554P314O572N415L964
$$ 631766 630930 632203 635808 641449 648584 656545 664618 672398 679976 687530 694844 701416 706831 710795
51933G10795K172O3k246m756p471j0013j1814j2706j2935j2665j1955j1134j0590
$$ 710795 712967 713030 710784 706028 698557 688544 676730 664024 651089 638424 626469 615335 604745
51920F04745j0155r293p974o692n648m582l571l088k968k122J44L123N587P162
$$ 604745 594590 585297 577323 570631 564983 560401 556830 553742 550774 548652 548796 551919 557506 564668
51906E64668Q285R153R391Q633O937M645K079n65l234n839q120r851j1052j1739
$$ 564668 572953 582106 591497 600130 607067 611712 613791 613226 609992 604153 596033 586182 575130 563391
51892E63391j1603j0404q561o804n197l173o07J865L810N549P427R208J0651J2010
$$ 563391 551788 541384 532823 526019 520822 517649 517042 518907 522717 528266 535693 544901 555552 567562
51878E67562J3459J4545J4729J3976J2385R734O022J901j968n587q982j1366j1820
$$ 567562 581021 595566 610295 624271 636656 646390 652412 654313 652345 646758 637776 626410 614590
51865F14590j0601q922p451n757l337m58K225M388O111P537Q707R571J0026J0111
$$ 614590 603989 595067 587616 581859 578522 578064 580289 584677 590788 598325 607032 616603 626629 636740
51851F36740J0159J0674J2017J4275J7371K1071K4911K7993K8862K5820J8043
$$ 636740 646899 657573 669590 683865 701236 722307 747218 775211 804073 829893 847936
51840H47936O631n770j6684k4853k9773l1082k9132k5505k2032j9304j6758j4108
$$ 847936 854567 848797 832113 807260 777487 746405 717273 691768 669736 650432 633674 619566
51828F19566j1963j0931j0796j0796j0279q893o625l983j823o33q8N11J445K312
$$ 619566 607603 596672 585876 575080 564801 555908 549283 545300 543477 542844 542756 543267 544712 547024
51814E47024K459J561n9j677k815l721m983o557p517p012n402m011l701l949l584
$$ 547024 549483 551044 550985 549308 546493 542772 537789 531232 523715 516703 511301 507290 503589 499640 496056
51799D96056k253p87k25p47j659k089j603m27O91J054P51N79J006J443R24o96
$$ 496056 493803 493016 492791 492044 490385 488296 486693 486266 486957 488011 488762 489341 490347 491790 492714 492018
51783D92018k585l837m110l515k408j238k01J031K844M942O574P452P952Q418
$$ 492018 489433 485596 481486 477971 475563 474325 474124 475155 477999 482941 489515 496967 504919 513337
51769E13337Q675Q385P349N452K781k7k153l460m583n995p428q330q370p426n705
$$ 513337 522012 530397 537746 543198 545979 545952 543799 540339 535756 529761 522333 514003 505633 498207 492502
51754D92502m074l561m143m561l793k192p76P5P23J510K516L787N274O671P686
$$ 492502 488428 484867 480724 476163 472370 470178 469402 469477 470200 471710 474226 478013 483287 489958 497644
51739D97644Q334Q785R121R395R580R256P809N221K301n6j398j378K75L022N349
$$ 497644 505978 514763 523884 533279 542859 552115 559924 565145 567446 567390 565992 564614 564889 567911 573260
51724E73260N974M785K297j071m578o814o813n160l189j389M98K218K857K189
$$ 573260 579234 584019 586316 585245 580667 573853 567040 561880 558691 557302 557800 560018 562875 565064
51710E65064J299J630L764P079J0010J0808Q694M472k45m292p036p743n801j726
$$ 565064 566363 567993 571757 578836 588846 599654 608348 612820 612575 608283 601247 593504 587703 585977
51696E85977K820O275Q077Q230O602L088j760o603r975j1229j0888r926q750p123
$$ 585977 588797 595072 603149 611379 617981 621069 619309 612706 602731 591502 580614 570688 561938 554815
51682E54815n126l413k226q59J182L011L253J814M5p77m26P17K275M019N855P797
$$ 554815 549689 546276 544050 543191 544373 547384 550637 552451 552496 551719 551293 552010 554285 558304 564159 571956
51666E71956R528J0199R170O758L758M29l395p351j0421j1754j1171r008o017
$$ 571956 581484 591683 600853 607611 611369 611798 608403 601052 590631 578877 567706 558698 552681
51653E52681l218j136O61K700M564N320M642K657q34n829j1001j4404j5445j5100
$$ 552681 549463 548327 548988 551688 556252 561572 566214 568871 568037 562208 551207 536803 521358 506258
51639E06258j4070j2105r401p204o271n794m713l232k231j860j611j190n59M14
$$ 506258 492188 480083 470682 463478 457207 451413 446700 443468 441237 439377 437766 436576 436017 436431
51625D36431J549K101J667R82J028J624J724R43L1k53l1Mn84j648k617k890k311
$$ 436431 437980 440081 441748 442730 443758 445382 447106 448049 448080 447827 447796 447800 447216 445568 442951 440061 437750
51608D37750j317n46k67k32K3P74J836K750L347M117N665P906J0187J2128J3805
$$ 437750 436433 435887 435620 435388 435411 436185 438021 440771 444118 448235 453900 461806 471993 484121 497926
51593D97926J4988J4902J2989R555N462J648r69j668m28K148N579R752J4345J8739
$$ 497926 512914 527816 540805 550360 555822 557470 556501 554833 554405 556553 562132 571884 586229 604968
51579F04968K2776K6817L0604L2814L2601L0984K9909L0024K9952K7612K1930
$$ 604968 627744 654561 685165 717979 750580 781564 811473 841497 871449 899061 920991
51568I20991J3766N808J184J441N850J3014K2526L4405M7328N8479O5261O6539
$$ 920991 934757 940565 941749 943190 949040 962054 984580 1018985 1066313 1124792 1190053 1256592
51556A256592O2522N4339M3934L3365K3672J4556N265m713j5712k7821m0304n1547
$$ 1256592 1319114 1373453 1417387 1450752 1474424 1488980 1494245 1489532 1473820 1445999 1405695 1354148
51544A354148o0136o5787o9021p0196o9223o6049o1048n4844m8036m1145l4726
$$ 1354148 1294012 1228225 1159204 1089008 1019785 953736 892688 837844 789808 748663 713937
51533G13937k9299k5096k1840j9015j6361j4014j2139j0600r162p838o748n789
$$ 713937 684638 659542 637702 618687 602326 588312 576173 565573 556411 548573 541825 536036
51521E36036m725l588k756k512k688k804k487j722p56J37O76M85p33k687m428
$$ 536036 531311 527723 524967 522455 519767 516963 514476 512754 511998 512135 512811 513296 512563 509876 505448
51506E05448n176n076m815m611m139l380k795k526k154j587j469k191l039l022
$$ 505448 500272 495196 490381 485770 481631 478251 475456 472930 470776 469189 467720 465529 462490 459468
51492D59468k063q15K93J073J094J61r59j177n58l32j230k609l489l677l544l197
$$ 459468 457405 456590 456883 457956 459050 459211 458252 457075 456517 456185 454955 452346 448857 445180 441636 438439
51476D38439k527j644q58k98P1K41K28K25M26P46R41R18Q18Q64J222J916K800
$$ 438439 435912 434268 433410 433112 433183 433424 433652 433877 434303 435049 435990 436908 437726 438590 439812 441728 444528
51459D44528L573L964L950L877M353N736P649R185R884J0325J1503J3813J6964
$$ 444528 448101 452065 456015 459892 464245 469981 477630 486815 496699 507024 518527 532340 549304
51446E49304K0537K3991K6035K4893J9769J1907L910j868m247l227J23L739N203
$$ 549304 569841 593832 619867 644760 664529 676436 680346 678478 674231 671004 671127 674866 680069
51433F80069K967k745j0118j6806k1071k2373k1329j9122j6725j4396j1885r144
$$ 680069 683036 680291 670173 653367 632296 609923 588594 569472 552747 538351 526466 517322
51421E17322o659m919l765k588j191J3P55J307J959K501K658K588K486K096J224
$$ 517322 510663 505744 501979 499391 498200 498213 498968 500275 502234 504735 507393 509981 512467 514563 515787
51406E15787N04P96J907K740K850L094M338O202P627Q171Q143P835P260O634O454
$$ 515787 516291 517087 518994 521734 524584 527678 532016 538218 545845 554016 562159 569994 577254 583888 590342
51391E90342P023Q199R788J1866J4582J7855K1446K5358K9968L5709M2558M9970
$$ 590342 597365 605564 615352 627218 641800 659655 681101 706459 736427 772136 814694 864664
51379H64664N7414O4874P2390P9124Q3256Q3201P8727P0698N9970M7024L2474
$$ 864664 922078 986952 1059342 1138466 1221722 1304923 1383650 1454348 1514318 1561342 1593816
51368A593816J7242J918j3661k9724m5536n9369o9633p5909p8903p9562p8283
$$ 1593816 1611058 1612976 1599315 1569591 1524055 1464686 1395053 1319144 1240241 1160679 1082396
51357A082396p4865o9124o1598n3593m6387m0309l4756k9274k4436k1310k0176
$$ 1082396 1007531 938407 876809 823216 776829 736520 701764 672490 648054 626744 606568
51346F06568k0075j9709j8486j6545j4223j1909j0065q871p854o361m473k983
$$ 606568 586493 566784 548298 531753 517530 505621 495556 486685 478831 472470 467997 465014
51334D65014k361k164j770j259j154j539j913j884j547j157p83m85m53p16r06
$$ 465014 462653 460489 458719 457460 456306 454767 452854 450970 449423 448266 447483 446998 446545 445829 444923
51319D44923n70K83J171J676J836J973K222K341K001J247O21O88J413K189K554
$$ 444923 444353 444636 445807 447483 449319 451292 453514 455855 457856 459103 459724 460412 461825 464014 466568
51304D66568K656K773K670J856M44p63j248j417j978k978l858m252m321m323m300
$$ 466568 469224 471997 474667 476523 476967 476204 474956 473539 471561 468583 464725 460473 456152 451829 447529
51289D47529m206m040l713l035j942o04P62K015L083L935M488M467L534J849L10
$$ 447529 443323 439283 435570 432535 430593 429989 430751 432766 435849 439784 444272 448739 452273 454122 454432
51274D54432j78L73J252K047K897L674L752K912J962J920K816L818M356M626N015
$$ 454432 454254 454627 455879 457926 460823 464497 468249 471161 473123 475043 477859 481677 486033 490659 495674
51259D95674N423N302M264K564R09l60j767m068p038r321r680q114n666l514k457
$$ 495674 501097 506399 510663 513227 514136 513776 512009 507941 500903 491582 481902 473788 468122 464608 462151
51244D62151k661l443l640k710j342o72j110k106k770k417r72P81J697J491J054
$$ 462151 459490 456047 452407 449697 448355 447683 446573 444467 441697 439280 438308 439089 440786 442277 443331
51229D43331J177J494J280P31N67P68P08L46K83O35R30J140J787K758L087K366
$$ 443331 444508 446002 447282 448013 448580 449348 450056 450402 450685 451320 452250 453390 455177 457935 461022 463388
51213D63388J496J421J857J896J350Q33R58J923L485M878N115L927K167R77P97
$$ 463388 464884 466305 468162 470058 471408 472241 473199 475122 478607 483485 488600 492527 494694 495671 496468
51198D96468J429K450L201K952J706M34k6L3j90q05j304j445j364r97j52Q94J571
$$ 496468 497897 500347 503548 506500 508206 508640 508614 508647 508457 507652 506348 504903 503539 502542 502390 503284 504855
51181E04855J699J551J286Q98O11O11N56o7j112j922k240k347k320j940j403j259
$$ 504855 506554 508105 509391 510289 510900 511511 512067 512000 510888 508966 506726 504379 502059 500119 498716 497457
51165D97457j436j086J76J601K286K188J664O60j001k927m389n035m902m117l127
$$ 497457 496021 494935 495111 496712 498998 501186 502850 503510 502509 499582 495193 490158 485256 481139 478012
51150D78012k827l736n102n546m609l173k352k423k902l123k656j549l59L71P26
$$ 478012 475185 471449 466347 460801 456192 453019 450667 448244 445342 442219 439563 438014 437655 438026 438752
51135D38752J180J764J951J537J168J626K865M104M759M965N172N506N706N502
$$ 438752 439932 441696 443647 445184 446352 447978 450843 454947 459706 464671 469843 475349 481055 486557
51121D86557M959M255L330J968L32r13j344j301j347j399r10J62J127J417J190
$$ 486557 491516 495771 499101 501069 501401 500488 499144 497843 496496 495097 494187 494349 495476 496893 498083
51106D98083R56J097J812L026M089M151L126J760N54p28k116k856k541k081k553
$$ 498083 499039 500136 501948 504974 509063 513214 516340 518100 518654 517926 515810 512954 510413 508332 505779
51091E05779l522l616k599j675j703k201k391k206j821j118j75M74O21Q15J377
$$ 505779 502257 498641 496042 494367 492664 490463 488072 485866 484045 482927 482752 483226 483847 484662 486039
51076D86039J782J605J440K036L080L740M024M569N318N497M946M451M538M843
$$ 486039 487821 489426 490866 492902 495982 499722 503746 508315 513633 519130 524076 528527 533065 537908
51062E37908M991N224N707N927N308L998K512J081j66p87l80Q34K265L623M875
$$ 537908 542899 548123 553830 559757 565065 569063 571575 572656 572490 571703 571323 572157 574422 578045 582920
51047E82920N808O196O347O954Q254R765J0838J1249J1197J1100J1341J1851J1818
$$ 582920 588728 594924 601271 608225 616479 626244 637082 648331 659528 670628 681969 693820 705638
51034G05638J0246O945K689j659n762r400j2084j3478j3892j3877j3596j3015
$$ 705638 715884 722829 725518 723859 718097 708697 696613 683135 669243 655366 641770 628755
51022F28755j2329j1572j0110p367m010j515l37O02K211L913M725M892N432O545
$$ 628755 616426 604854 594744 587377 583367 581852 581515 582117 584328 588241 592966 597858 603290 609835
51008F09835P512Q070Q724R667J0315J0296J0057J0024R867R096P886O783N997
$$ 609835 617347 625417 634141 643808 654123 664419 674476 684500 694367 703463 711349 718132 724129
50995G24129N438N158N261N689O402P571R197J0893J2350J3836J5834J8472K1476
$$ 724129 729567 734725 739986 745675 752077 759648 768845 779738 792088 805924 821758 840230 861706
50982H61706K4369K6497K7325K7026K6322K5390K3678K1238J9413J9192J9601
$$ 861706 886075 912572 939897 966923 993245 1018635 1042313 1063551 1082964 1102156 1121757
50971A121757J8913J7057J5446J4616J3629J2120J1422J2748J5467J8045J9986
$$ 1121757 1140670 1157727 1173173 1187789 1201418 1213538 1224960 1237708 1253175 1271220 1291206
50960A291206K1799K3657K5112K5810K5693K4617K2557K0108J8059J6480J4819
$$ 1291206 1313005 1336662 1361774 1387584 1413277 1437894 1460451 1480559 1498618 1515098 1529917
50949A529917J2865J1083J0018R965J1306J4469J9056K3286K4701K1570J3855
$$ 1529917 1542782 1553865 1563883 1573848 1585154 1599623 1618679 1641965 1666666 1688236 1702091
50938A702091L297p341j5636k0691k3225k4519k5367k5942k6348k6916k7963k9511
$$ 1702091 1705388 1698047 1682411 1661720 1638495 1613976 1588609 1562667 1536319 1509403 1481440 1451929
50926A451929l1341l3238l5043l6521l7401l7643l7492l7045l5912l3613l0377
$$ 1451929 1420588 1387350 1352307 1315786 1278385 1240742 1203250 1166205 1130293 1096680 1066303
50915A066303k7193k4883k3295k1697j9706j7608j5816j4385j3096j1748j0268
$$ 1066303 1039110 1014227 990932 969235 949529 931921 916105 901720 888624 876876 866608
50904H66608q681p128n825m886m175l434k556j734j284j272j371j123m42L00O67
$$ 866608 857927 850799 844974 840088 835913 832479 829923 828189 826905 825633 824262 823139 822697 822997 823664
50889H23664O22M74N28Q35J292J753K057K133K220K748L775M673M776M321M296
$$ 823664 824286 824760 825288 826123 827415 829168 831225 833358 835578 838326 842101 846774 851550 855871 860167
50874H60167N206O400P027P254P945R347J0793J1771J2601J3764J5273J7005J9150
$$ 860167 865373 871773 878800 886054 893999 903346 914139 925910 938511 952275 967548 984553 1003703
50861A003703K1786K4473K6825K9179L2124L5643L9350M3330M8103N3747N9696
$$ 1003703 1025489 1049962 1076787 1105966 1138090 1173733 1213083 1256413 1304516 1358263 1417959
50850A417959O5405P0708P5452P9395Q2597Q5458Q8185R0525R2017R2085Q9929
$$ 1417959 1483364 1554072 1629524 1708919 1791516 1876974 1965159 2055684 2147701 2239786 2329715
50839B329715Q4914P7244O7726N6852M4591L1312J8274O848k428r653j4876j7899
$$ 2329715 2414629 2491873 2559599 2616451 2661042 2692354 2710628 2717476 2715048 2705395 2690519 2672620
50827B672620j8520j6743j2923p873k478K799P748J1692J3497J2478Q801K830
$$ 2672620 2654100 2637357 2624434 2616561 2614083 2616882 2624630 2636322 2649819 2662297 2671098 2673928
50815B673928n287j5040k5216l4811m3883n2950o1760o9243p4491p7374p8244
$$ 2673928 2668641 2653601 2628385 2593574 2549691 2496741 2434981 2365738 2291247 2213873 2135629
50804B135629p7450p5020p0661o4175n6145m7811l9985l2397k4433j6180q246
$$ 2135629 2058179 1983159 1912498 1848323 1792178 1744367 1704382 1671985 1647552 1631372 1623126
50793A623126r28N946J2498J8631K4180K8760L1621L2174L0595K7451K3043J7564
$$ 1623126 1622198 1628144 1640642 1659273 1683453 1712213 1743834 1776008 1806603 1834054 1857097 1874661
50781A874661J1796O793K860o14m193p764j0981j3792j6369j8988k2128k6196
$$ 1874661 1886457 1893250 1896110 1895496 1891303 1883539 1872558 1858766 1842397 1823409 1801281 1775085
50769A775085l0901l5268l8588m1005m2916m4167m4283m3208m1402l9246l6779
$$ 1775085 1744184 1708916 1670328 1629323 1586407 1542240 1497957 1454749 1413347 1374101 1337322
50758A337322l4047l1291k8612k5736k2400j8874j5713j3040j0383p352m184j314
$$ 1337322 1303275 1271984 1243372 1217636 1195236 1176362 1160649 1147609 1137226 1129874 1125690 1124376
50746A124376J305M120P302J0657J4074J7639K1220K4468K7378L0399L3818L7403
$$ 1124376 1125681 1129801 1137103 1147760 1161834 1179473 1200693 1225161 1252539 1282938 1316756 1354159
50734A354159M0806M3883M6459M8324M9691N1074N2378N2720N1663N0070M9061
$$ 1354159 1394965 1438848 1485307 1533631 1583322 1634396 1686774 1739494 1791157 1841227 1890288
50723A890288M8542M7368M4584L9820L2861K3780J3464L282n853j3693k0007k4404
$$ 1890288 1938830 1986198 2030782 2070602 2103463 2127243 2140707 2143989 2138136 2124443 2104436 2080032
50711B080032k6665k6802k4841k1105j6465j1689o744j426L481O639P672P322
$$ 2080032 2053367 2026565 2001724 1980619 1964154 1952465 1945721 1944295 1947776 1954415 1962087 1969409
50699A969409O005L185j502p336j3283j8936k4256k8832l1900l2776l1156k7404
$$ 1969409 1975414 1978599 1977097 1969761 1956478 1937542 1913286 1884454 1852554 1819778 1788622 1761218
50687A761218k2697j8175j3811q670k428M169J0573J7229K4568L2221L9915M8305
$$ 1761218 1738521 1720346 1706535 1697865 1695437 1699606 1710179 1727408 1751976 1784197 1824112 1872417
50675A872417N7915O7830P6423Q2978Q7684R0384R0380Q7397Q1793P3871O3947
$$ 1872417 1930332 1998162 2074585 2157563 2245247 2335631 2426011 2513408 2595201 2669072 2733019
50664B733019N3151M3152L4771K7574K1066J5572J1480Q261M734M0n939j2681
$$ 2733019 2786170 2829322 2864093 2891667 2912733 2928305 2939785 2948046 2952780 2952820 2946881 2934200
50652B934200j9267k4838k9110l2203l3792l2984k9390k3925j8025j2243o117
$$ 2934200 2914933 2890095 2860985 2828782 2794990 2762006 2732616 2708691 2690666 2678423 2672306
50641B672306P56Q006J4858K0682K5043K7589K8280K7622K6452K5364K4494K3997
$$ 2672306 2673062 2681068 2695926 2716608 2741651 2769240 2797520 2825142 2851594 2876958 2901452 2925449
50629B925449K4668K7551L2247L5390L1520J6629q464l8026o4666q3027r1266
$$ 2925449 2950117 2977668 3009915 3045305 3076825 3093454 3084990 3046964 2982298 2899271 2808005
50618B808005r0420q3080p2247o0353m8643l7352k6495j6465p909j248L528O524
$$ 2808005 2717585 2634505 2562258 2501905 2453262 2415910 2389415 2372950 2365041 2363793 2367321 2373845
50606B373845P500N867J229o147j5482k5948l6805m7130n5935o2780o7886p1346
$$ 2373845 2381345 2387212 2388441 2382294 2366812 2340864 2304059 2256929 2200994 2138214 2070328 1998982
50594A998982p2604p1274o8137o4653o1371n7558n2575m6941m1636l6866l2136
$$ 1998982 1926378 1855104 1786967 1722314 1660943 1603385 1550810 1503869 1462233 1425367 1393231
50583A393231k7225k2467j8164j4242j0522o906l275N20M517Q645J2807J6693
$$ 1393231 1366006 1343539 1325375 1311133 1300611 1293705 1290430 1290950 1295467 1304112 1316919 1333612
50571A333612J9648K1147K1418K1261K1198K1071K0588J9926J9561J9790K0705
$$ 1333612 1353260 1374407 1395825 1417086 1438284 1459355 1479943 1499869 1519430 1539220 1559925
50560A559925K2620K6166L1723L8777M6119N2849N9067O5234P0976P4945P5991
$$ 1559925 1582545 1608711 1640434 1679211 1725330 1778179 1837246 1902480 1973456 2048401 2124392
50549B124392P4007O9475O2751N4407M5914L9189L5387L4426L5624L8246M1502
$$ 2124392 2198399 2267874 2330625 2385032 2430946 2470135 2505522 2539948 2575572 2613818 2655320
50538B655320M4541M6851M8493M9872N1424N3511N6431O0430O5742P2404P9904
$$ 2655320 2699861 2746712 2795205 2845077 2896501 2950012 3006443 3066873 3132615 3205019 3284923
50527C284923Q7338R4114J00241J05669J09652J11236J09979J05704R7967Q6445
$$ 3284923 3372261 3466375 3566616 3672285 3781937 3893173 4003152 4108856 4206823 4293268
50517D293268P1655N4540L5497J4595p413k9167m9894o9643q8143j04296j17038
$$ 4293268 4364923 4419463 4454960 4469555 4462142 4432975 4383081 4313438 4225295 4120999 4003961
50506D003961j25951j30702j30735j25995j17309j05617r1356p5007n7502l9610
$$ 4003961 3878010 3747308 3616573 3490578 3373269 3267652 3176296 3101289 3043787 3004177
50496C004177k1418l133J4167K9161M1218N0023N4586N3382M5471L1110J1501
$$ 3004177 2982759 2979626 2993793 3022954 3064172 3114195 3168781 3222163 3267634 3298744 3310245
50485C310245j1604l6208o0372q2333j00457j13590j21702j25665j26183j23414
$$ 3310245 3298641 3262433 3202061 3119728 3019271 2905681 2783979 2658314 2532131 2408717
50475B408717j17843j10725j03126r5218q7068p9354p2595o6418o0487n5540n2366
$$ 2408717 2290874 2180149 2077023 1981805 1894737 1815383 1742788 1676370 1615883 1560343 1507977
50464A507977n0162m7216m2964l8213l3509k8608k3749k0043j8013j6727j4950
$$ 1507977 1457815 1410599 1367635 1329422 1295913 1267305 1243556 1223513 1205500 1188773 1173823
50453A173823j2498r913p566n622m366l910l856l632k905j562K84K054L025L244
$$ 1173823 1161325 1151412 1143846 1138224 1133858 1129948 1126092 1122460 1119555 1117993 1118277 1120331 1123356 1126600
50439A126600L577M582N905P179Q862J1506J4686J7413J9429K1384K3779K6345
$$ 1126600 1130177 1134759 1140664 1147843 1156705 1168211 1182897 1200310 1219739 1241123 1264902 1291247
50427A291247K8559L0256L1647L3023L4574L6340L8244M0310M2678M5365M8201
$$ 1291247 1319806 1350062 1381709 1414732 1449306 1485646 1523890 1564200 1606878 1652243 1700444
50416A700444N1221N4834N9264O3969O8045P1107P3365P4919P5432P4624P2645
$$ 1700444 1751665 1806499 1865763 1929732 1997777 2068884 2142249 2217168 2292600 2367224 2439869
50405B439869O9756O5996O1334N5917M9817M2704L4045K3595J1511j952j6582
$$ 2439869 2509625 2575621 2636955 2692872 2742689 2785393 2819438 2843033 2854544 2852592 2836010
50394B836010l2043m7682o2603p5760q6070r2706r5510r5003r1781q6035p7848
$$ 2836010 2803967 2756285 2693682 2617922 2531852 2439146 2343636 2248633 2156852 2070817 1992969
50383A992969o7825n7087m6430l5758k4588j3010j985P347J4406J9207K1695K1326
$$ 1992969 1925144 1868057 1821627 1785869 1761281 1748271 1746286 1753633 1768039 1787246 1808941 1830267
50371A830267J7500J0385J108r110j9721l0507m0687m8907n4277n6970n7691n6972
$$ 1830267 1847767 1858152 1859260 1850150 1830429 1799922 1759235 1710328 1656051 1599081 1541390 1484418
50359A484418n5267n3158n0979m8432m5146m1442l8053l5178l2304k9011k5474
$$ 1484418 1429151 1375993 1325014 1276582 1231436 1189994 1151941 1116763 1084459 1055448 1029974
50348A029974k2088j9071j6567j4717j3380j2082j0622r485r252r718r926r240
$$ 1029974 1007886 988815 972248 957531 944151 932069 921447 911962 902710 892992 883066 873826
50336H73826q171p822q576r577r729q952q070p592p136o181m809l286j491O43
$$ 873826 865655 857833 849257 839680 829951 820999 812929 805337 798201 792020 787211 783925 782434 783077
50322G83077K421K998K605K486L392M832O035P060Q470J0295J1900J2859J3458
$$ 783077 785498 788496 791101 793587 796979 801811 807846 814906 823376 833671 845571 858430 871888
50309H71888J4267J5387J6276J6283J5246J3532J1593R646P873O607O025N827
$$ 871888 886155 901542 917818 934101 949347 962879 974472 984118 991991 998598 1004623 1010450
50297A010450N514M815L605J587j359m584p052q461r501j0827j2178j2715j1845
$$ 1010450 1015964 1020779 1024384 1025971 1024612 1020028 1012976 1004515 995014 984187 972009 959294 947449
50284I47449r539o251k789R6K367M700P594J0778J3776J6657J9760K2763K4492
$$ 947449 937910 931659 928870 928966 931333 936033 943627 954405 968181 984838 1004598 1027361 1051853
50271A051853K3665J9668J2790M194m297j0822j4335j5000j3773j1556q806n849
$$ 1051853 1075518 1095186 1107976 1112170 1107873 1097051 1082716 1067716 1053943 1042387 1033581 1027732
50259A027732l429k505l329m945n995n958n289m525l790l078k447j776q66L2L56
$$ 1027732 1024303 1021798 1018469 1013524 1007529 1001571 996282 991757 987967 984889 982442 980666 979800 979832 980188
50244I80188O3k34k46m69j301k242k573k338k111k161k461l082l942m463m274
$$ 980188 980251 980017 979771 979302 978001 975759 973186 970848 968737 966576 964115 961033 957091 952628 948354
50229I48354l951m290m990m990m045l065k769k847k817k831l175l554l467k930
$$ 948354 944403 940113 935123 930133 926088 923023 920254 917407 914590 911759 908584 905030 901563 898633
50215H98633k341j898j600j475j516j477j086l91L35R06J359J974L165N019O997
$$ 898633 896292 894394 892794 891319 889803 888326 887240 886849 887184 888090 889449 891423 894588 899607 906604
50200I06604Q518R913J2182J5566J9131K2130K5132K9123L4115L9459M5100N1455
$$ 906604 915122 925035 937217 952783 971914 994044 1019176 1048299 1082414 1121873 1166973 1218428
50188A218428N8161O3927O7748O9506O9221O6688O2200N6908N1938M7720M4492
$$ 1218428 1276589 1340516 1408264 1477770 1546991 1613679 1675879 1732787 1784725 1832445 1876937
50177A876937M2836M2987M4032M4434M2946L8585L0229J7245M94j8024l6554n3941
$$ 1876937 1919773 1962760 2006792 2051226 2094172 2132757 2162986 2180231 2180725 2162701 2126147 2072206
50165B072206o8826p9426q4652q4899q1450p5492o7893n9253m9741l9311k8544
$$ 2072206 2003380 1923954 1839302 1754403 1672953 1597461 1529568 1470315 1420574 1381263 1352719
50154A352719j8867j1506o744m678o070j1443j9546k7743l4063l8150m0173l9946
$$ 1352719 1333852 1322346 1315602 1310924 1304854 1293411 1273865 1246122 1212059 1173909 1133736 1093790
50142A093790l7539l3901k9950k5614k0459j4928j0047o139k740J77J729J330
$$ 1093790 1056251 1022350 992400 966786 946327 931399 921352 915213 912473 912650 914379 915709
50130I15709k88j759k515l062m006n243o210o563o513o491o597o441n610m215
$$ 915709 915421 913662 911147 908085 904079 898836 892626 886063 879550 873059 866462 860021 854411 850196
50116H50196k823j830j170n84N2Q23J912L367M880O033O672O887O802O627O714
$$ 850196 847373 845543 844373 843789 843841 844664 846576 849943 854823 860856 867528 874415 881217 887844 894558
50101H94558P267Q021Q553Q827R193R824J0601J1520J2842J4576J6219J7262J7771
$$ 894558 901825 909846 918399 927226 936419 946243 956844 968364 981206 995782 1012001 1029263 1047034
50088A047034J8273J9169K0537K2216K3920K5421K6912K9073L2453L6923M1998
$$ 1047034 1065307 1084476 1105013 1127229 1151149 1176570 1203482 1232555 1265008 1301931 1343929
50077A343929M7590N4148O2091P1422Q1808R2673J03186J12375J19398J23525
$$ 1343929 1391519 1445667 1507758 1579180 1660988 1753661 1856847 1969222 2088620 2212145
50067B212145J24030J20537J13643J04987R6633R0392Q7385Q7554Q9517R1238
$$ 2212145 2336175 2456712 2570355 2675342 2771975 2862367 2949752 3037306 3126823 3218061
50057C218061R0958Q7179P8006O1570L7615Q299k2974n3186q0135j02216j18726
$$ 3218061 3309019 3396198 3474204 3535774 3573389 3581688 3558714 3505528 3425393 3323177 3204451
50046C204451j30061j36922j39582j38467j34925j30366j24693j16555j05445
$$ 3204451 3074390 2937468 2797886 2659419 2524494 2394128 2269435 2152880 2047435
50037B047435r2710q0165o8455n7271m6553l6915k9172k3942k1458k1249k2123
$$ 2047435 1954725 1874560 1806105 1748834 1702281 1665366 1636194 1612252 1590794 1569545 1547422
50026A547422k2822k2651k1449j9338j6948j5448j5704j7380j9288k0641k1569
$$ 1547422 1524600 1501949 1480500 1461162 1444214 1428766 1413062 1395682 1376394 1355753 1334184
50015A334184k2335k2626k1903k0243j8454j7356j7103j7142j6809j5816j4209
$$ 1334184 1311849 1289223 1267320 1247077 1228623 1211267 1194164 1177022 1160213 1144397 1130188
50004A130188j1952q797m694k65L320N093M870L192P72j887m437o431p507p872
$$ 1130188 1118236 1109439 1104745 1104480 1107800 1112893 1117763 1120955 1121727 1119840 1115403 1108972 1101465 1093593
49990A093593q408r939j2389j4816j6281j6485j5669j4249j2602j0867q829o317
$$ 1093593 1085185 1075246 1062857 1048041 1031760 1015275 999606 985357 972755 961888 953059 946742
49978I46742l793k113j363m75J525M245O496P894R126J0652J2021J2818J3550
$$ 946742 942949 940836 939473 938998 940523 944768 951264 959158 968284 978936 990957 1003775 1017325
49965A017325J5047J7393K0060K2830K5980K9679L3830L8505M4040N0433N7067
$$ 1017325 1032372 1049765 1069825 1092655 1118635 1148314 1182144 1220649 1264689 1315122 1372189
49954A372189O3202O8485P2797P6012P8111P9241P9330P7803P4018O7845N9590
$$ 1372189 1435391 1503876 1576673 1652685 1730796 1810037 1889367 1967170 2041188 2109033 2168623
49943B168623M9630L8666K8272K0564J6863J6722J8255J9273J7988J3094L648
$$ 2168623 2218253 2256919 2285191 2305755 2322618 2339340 2357595 2376868 2394856 2407950 2411598
49932B411598j0795k9717n1312p2720r1098j04719j13072j16160j14067j07357
$$ 2411598 2400803 2371086 2319774 2247054 2155956 2051237 1938165 1822005 1707938 1600581
49922A600581r7445q6163p4984o4726n5766m8172m1655l5735l0065k4591j9349
$$ 1600581 1503136 1416973 1341989 1277263 1221497 1173325 1131670 1095935 1065870 1041279 1021930
49911A021930j4260r157m010R06N151Q474J0855J2260J2531J1825J0732R594P891
$$ 1021930 1007670 998513 994503 995409 1000560 1009034 1019889 1032149 1044680 1056505 1067237 1076831 1084722
49898A084722M959J122k597n911r564j3972j8392k1890k4321k5766k5791k4166
$$ 1084722 1089681 1090803 1088206 1082295 1072731 1058759 1040367 1018477 994156 968390 942599 918433
49886I18433k1722j9639j8246j7353j7179j7924j8709j8290j6739j5280j4306
$$ 918433 896711 877072 858826 841473 824294 806370 787661 769371 752632 737352 723046
49875G23046j2847j0352p748o060m959l473j453M57J858K862L705M686O299Q826
$$ 723046 710199 699847 692099 686039 681080 677607 676154 676611 678469 681331 685036 689722 696021 704847
49861G04847J1997J5299J8377K0830K2093K1929K0628J8344J4797J0217O078L897
$$ 704847 716844 732143 750520 771350 793443 815372 836000 854344 869141 879358 885436 889333
$$ [...]
##END NTUPLES=NMR SPECTRUM
##END=
