##TITLE=AC1714_3158_8749746_dLcrRJoP4r
##JCAMPDX= 6.0         $$ Bruker NMR JCAMP-DX V2.0
##DATA TYPE= NMR SPECTRUM
##DATA CLASS= NTUPLES
##ORIGIN= BRUKER
##OWNER= Administrator
$$ 1.72 TOPSPIN		Version 2.1
$$ 2015-08-12 02:32:48.195 -0700  Administrator@X
$$ Compression mode = diff/dup
##.OBSERVE FREQUENCY= 400.02188249412
##.OBSERVE NUCLEUS= ^1H
##.ACQUISITION MODE= SIMULTANEOUS (DQD)
##.ACQUISITION SCHEME= undefined
##.AVERAGES= 8
##.DIGITISER RES= 22
##SPECTROMETER/DATA SYSTEM= spect
##.PULSE SEQUENCE= zg30
##.SOLVENT NAME= COFFEE_meoh
##.SHIFT REFERENCE= INTERNAL, COFFEE_meoh, 1, 14.98509
##AUDIT TRAIL= $$ (NUMBER, WHEN, WHO, WHERE, PROCESS, VERSION, WHAT)
$$ ##TITLE= Audit trail, TOPSPIN		Version 2.1
$$ ##JCAMPDX= 5.01
$$ ##ORIGIN= Bruker BioSpin GmbH
$$ ##OWNER= Administrator
$$ $$ E:\/data/COFFEE/nmr/AC1714_3158_8749746_dLcrRJoP4r/70/pdata/1/auditp.txt
$$ ##AUDIT TRAIL=  $$ (NUMBER, WHEN, WHO, WHERE, PROCESS, VERSION, WHAT)
(   1,<2015-08-12 02:32:40.835 -0700>,<Administrator>,<X>,<go>,<TOPSPIN 2.1>,
      <created by zg
	started at 2015-08-12 02:31:35.054 -0700,
	POWCHK enabled, PULCHK disabled,
       configuration hash MD5:
       21 0F 79 D6 B3 7B B4 F6 88 20 88 DB 03 48 BD 9F
       data hash MD5: 64K
       5C D0 D7 AD CE E8 77 57 56 9D B0 0D 9C 6B 80 02>)
(   2,<2015-08-12 02:32:44.039 -0700>,<Administrator>,<X>,<proc1d>,<TOPSPIN 2.1>,
      <Start of raw data processing
       efp LB = 0 FT_mod = 6 PKNL = 1 PHC0 = 0 PHC1 = 0 SI = 32K 
       data hash MD5: 32K
       21 8F 0D F4 68 99 3B 44 84 AB 2A 26 13 35 8E 8C>)
(   3,<2015-08-12 02:32:44.320 -0700>,<Administrator>,<X>,<proc1d>,<TOPSPIN 2.1>,
      <pk PHC0 = 87.62695 PHC1 = 0 
       data hash MD5: 32K
       B9 3D 38 C4 8F 21 12 B7 70 1A D7 F6 95 A4 58 D6>)
(   4,<2015-08-12 02:32:44.429 -0700>,<Administrator>,<X>,<proc1d>,<TOPSPIN 2.1>,
      <abs ABSG = 1 
       data hash MD5: 32K
       5B A3 91 7A 5D 07 03 AE 44 28 EA 24 6A 28 69 B9>)
(   5,<2015-08-12 02:32:44.492 -0700>,<Administrator>,<X>,<proc1d>,<TOPSPIN 2.1>,
      <abs ABSG = 2 
       data hash MD5: 32K
       B9 A0 FC 48 6C 8A DF 22 6C BE 9D D4 D5 82 22 73>)
(   6,<2015-08-12 02:32:44.554 -0700>,<Administrator>,<X>,<proc1d>,<TOPSPIN 2.1>,
      <abs ABSG = 3 
       data hash MD5: 32K
       8F C0 4A 80 F7 53 60 14 5E FE 0C 4C 7D 43 F7 8D>)
(   7,<2015-08-12 02:32:44.617 -0700>,<Administrator>,<X>,<proc1d>,<TOPSPIN 2.1>,
      <abs ABSG = 4 
       data hash MD5: 32K
       BE F2 4C 11 76 F5 59 06 27 39 22 66 82 06 14 42>)
(   8,<2015-08-12 02:32:44.664 -0700>,<Administrator>,<X>,<proc1d>,<TOPSPIN 2.1>,
      <abs ABSG = 5 
       data hash MD5: 32K
       7E 53 FC C1 40 70 33 38 5E 9B DF C0 A5 39 6A E4>)
$$ ##END=
$$ 
$$ $$ hash MD5
$$ $$ BE AD 72 12 01 1F 09 CA 87 70 36 46 F0 8E DD 37
##$RELAX= 
##$RELAX= 
##$RELAX= 
##$RELAX= 
##$RELAX= 
##$RELAX= 
##$RELAX= 
$$ Bruker specific parameters
$$ --------------------------
##$DU= <E:\>
##$EXPNO= 70
##$NAME= <AC1714_3158_8749746_dLcrRJoP4r>
##$PROCNO= 1
$$ [...]
150 150 150 150 150 150 150 150
##$TP07= 0
##$TPNAME0= <>
##$TPNAME1= <>
##$TPNAME2= <>
##$TPNAME3= <>
##$TPNAME4= <>
##$TPNAME5= <>
##$TPNAME6= <>
##$TPNAME7= <>
##$TPOAL= (0..7)
0.5 0.5 0.5 0.5 0.5 0.5 0.5 0.5
##$TPOFFS= (0..7)
0 0 0 0 0 0 0 0
##$TUNHIN= 0
##$TUNHOUT= 0
##$TUNXOUT= 0
##$USERA1= <user>
##$USERA2= <user>
##$USERA3= <user>
##$USERA4= <user>
##$USERA5= <user>
##$V9= 5
##$VALIST= <valist>
##$VCLIST= <CCCCCCCCCCCCCCC>
##$VD= 0
##$VDLIST= <DDDDDDDDDDDDDDD>
##$VPLIST= <PPPPPPPPPPPPPPP>
##$VTLIST= <TTTTTTTTTTTTTTT>
##$WBST= 2048
##$WBSW= 25
##$XGAIN= (0..3)
0 0 0 0
##$XL= 0
##$YL= 0
##$YMAX_a= 590854
##$YMIN_a= -515481
##$ZGOPTNS= <>
##$ZL1= 120
##$ZL2= 120
##$ZL3= 120
##$ZL4= 120
##$ABSF1= 14.98509
##$ABSF2= -5.573092
##$ABSG= 5
##$ABSL= 3
##$ALPHA= 0
##$AQORDER= 0
##$ASSFAC= 0
##$ASSFACI= 0
##$ASSFACX= 0
##$ASSWID= 0
##$AUNMP= <proc_prof1d_extract_pilot.lims>
##$AXLEFT= 0
##$AXNAME= <>
##$AXNUC= <1H>
##$AXRIGHT= 0
##$AXTYPE= 0
##$AXUNIT= <>
##$AZFE= 0.1
##$AZFW= 0.1
##$BCFW= 0
##$BC_mod= 0
##$BYTORDP= 0
##$COROFFS= 0
##$CY= 15
##$DATMOD= 1
##$DC= 0
##$DFILT= <>
##$DTYPP= 0
##$F1P= 0
##$F2P= 0
##$FCOR= 0.5
##$FTSIZE= 32768
##$FT_mod= 6
##$GAMMA= 0
##$GB= 0
##$INTBC= 1
##$INTSCL= 1
##$ISEN= 128
##$LB= 0
##$LEV0= 0
##$LPBIN= 0
##$MAXI= 10000
##$MC2= 0
##$MEAN= 0
##$ME_mod= 0
##$MI= 0
##$NCOEF= 0
##$NC_proc= -8
##$NLEV= 6
##$NOISF1= 0
##$NOISF2= 0
##$NSP= 0
##$NTH_PI= 0
##$NZP= 0
##$OFFSET= 14.98509
##$PC= 1
##$PHC0= 87.62695
##$PHC1= 0
##$PH_mod= 1
##$PKNL= yes
##$PPARMOD= 0
##$PPDIAG= 0
##$PPIPTYP= 0
##$PPMPNUM= 2147483647
##$PPRESOL= 1
##$PSCAL= 4
##$PSIGN= 0
##$PYNMP= <proc.py>
##$REVERSE= no
##$SF= 400.02
##$SI= 32768
##$SIGF1= 0
##$SIGF2= 0
##$SINO= 400
##$SIOLD= 32768
##$SPECTYP= <>
##$SREGLST= <1H.CDCl3>
##$SSB= 0
##$STSI= 32768
##$STSR= 0
##$SW_p= 8223.68421052631
##$SYMM= 0
##$S_DEV= 0
##$TDeff= 65536
##$TDoff= 0
##$TI= <>
##$TILT= no
##$TM1= 0
##$TM2= 0
##$TOPLEV= 0
##$USERP1= <user>
##$USERP2= <user>
##$USERP3= <user>
##$USERP4= <user>
##$USERP5= <user>
##$WDW= 1
##$XDIM= 32768
##$YMAX_p= 451242833
##$YMIN_p= -739373
##$CURPLOT= <Network HP LaserJet P1505>
##$CURPRIN= <$Network HP LaserJet P1505>
##$DFORMAT= <normdp>
##$LAYOUT= <+/1D_H.xwp>
##$LFORMAT= <normlp>
##$PFORMAT= <normpl>
##$SURQMSG= 1
$$ End of Bruker specific parameters
$$ ---------------------------------
##NTUPLES= NMR SPECTRUM
##VAR_NAME=  FREQUENCY,     SPECTRUM/REAL,   SPECTRUM/IMAG
##SYMBOL=    X,             R,               I
##VAR_TYPE=  INDEPENDENT,   DEPENDENT,       DEPENDENT
##VAR_FORM=  AFFN,          ASDF,            ASDF
##VAR_DIM=   32768,         32768,           32768
##UNITS=     HZ,            ARBITRARY UNITS, ARBITRARY UNITS
##FACTOR=    0.250966925370066, 1,           1
##FIRST=     8223.43324360094, 53668,        -80778
##LAST=      0,             -46224,          -191890
##MIN=       0,             -739373,         0
##MAX=       8223.43324360094, 451242833,    0
$$ Real data points
##PAGE= N=1
##DATA TABLE= (X++(R..R)), XYDATA
$$ [...]
19583a85483C125K86276h7386A12826b57456b3841k37577F5625c02827g7674d780
19571a01532D7915R434d2336j90590f0112D2601i3505d2794G741N8476J07684
19560A73901a02458A54559a50025a1042B67928A20607c91086a47795A40324h8815
19549b26812d2109A48326L9023a34009l7418A67570d20135A21920M3423a05876
19538b14594a7313j84940A61862N7046a97244A25262G66K93407j00980D1835b09600
19526a43164F9754c26821a20563n5800P5846b1813o4227B5079a2452o5910E3979
19514a44125a4164C2086d26973b12734A25671b79393m2855C0482M4226N3310M7876
19503A75894H7485a80682d8471b2431A08259l7407B69K23000E4371O6418J2812
$$ y = [-185483, 3125, 289401, -87386, 112826, -257456, -23841, -261418, 65625, -302827, -77674, -4780, -101532, 47915, 57349, -42336, -232926, -60112, 42601, -93505, -42794, 7741, 66217, 173901, -102458, 154559, -150025, -11042, 267928, 120607, -391086, -147795, 140324, -88815, -226812, -42109, 148326, 187349, -134009, -171427, 167570, -420135, 121920, 165343, -105876, -214594, -17313, -202253, 161862, 218908, -197244, 125262, 766, 294173, 193193, 41835, -209600, -143164, 69754, -326821, -120563, -176363, -100517, -21813, -86040, 25079, -12452, -78362, 53979, -144125, -14164, 32086, -426973, -212734, 125671, -279393, -322248, 30482, 74708, 128018, 175894, 87485, -180682, -48471, -22431, 108259, 70852, 269, 223269, 54371, 120789, 133601]
19492A33601h0010k06300f6229E2262K27306h698D4323b9737C0029e78098c3746
19480a97878B01559M8891c15959J35200B04107b92445H2390d3678J1867j17290
19470a49101b7676m8907k27973J32726o7909J16288O370H247O6027L651B8907
19458h3648j57733m621E6573d6646j1499b3992p0848B03006a37668c8772A14117
19446a83341l3270Q0223n0198B57067j18923b90081g2065l7412j66686g9593D74194
19434a17143a6382A71312g0877k64903i401C6609e1781j01290p9919a07436r322
19423a16758A4064f9280I3690l3735e7362H4238b50275c3864h3q4066A12720k0651
19411I2069b00907p5551B34538f9492B11798a26156L7556D4472K41345b26946
$$ y = [133601, -80010, -286310, -66229, 52262, 279568, -8698, 44323, -29737, 30029, -578098, -33746, -197878, 201559, 250450, -315959, -180759, 204107, -292445, 82390, -43678, -31811, -149101, -27676, -76583, -304556, -171830, -239739, -123451, -117081, 8247, 74274, 77925, 28907, -83648, -241381, -246002, 56573, -46646, -58145, -23992, -94840, 203006, -137668, -38772, 114117, -183341, -216611, -136388, -186586, 257067, 138144, -290081, -72065, -109477, -276163, -79593, 474194, -117143, -16382, 171312, -70877, -335780, -9401, 36609, -51781, -153071, -232990, -107436, -116758, 14064, -69280, 93690, 59955, -57362, 84238, -250275, -33864, -83, -84149, 112720, 92069, -200907, -276458, 234538, -69492, 211798, -126156, -88600, 44472, 285817, -226946]
19400e7363p7884A6806L7211c08398c5794A44811b17820E6994B091a81537F04
19388a68447A0294d5866A5852O64a59627k82194k9245J13307B23709A095b79124
19376b28251d7972j41728B19916a18927a4819B8065K5036j7379b192j48634c7663
19364C12561p5117D064J41622e6267a5156A7542b9524k03171M0159g267j42787
19353a50054f3708j77460q9078h5102E650d6769G8197c20019J56923L3728d9335
19341F1064L71550E4372c5448k44684j7292H1893j5121k4520M6206j0803a38544
19329B9770i0275C17847a79236H0538b3002o7141l788j8759I0202g0143E8450
19317a29802C0898a34335A45387B9435n571J73649H2696K2964N4893b13038m0490
$$ y = [-57363, -135247, 16806, 54017, -308398, -35794, 144811, -217820, 56994, 2091, -181537, 604, -168447, 10294, -45866, 15852, 16516, -159627, -441821, -471066, -357759, 223709, 1095, -279124, -228251, -47972, -189700, 219916, -118927, -14819, 28065, 53101, 35722, -2192, -150826, -37663, 312561, 237444, 4064, 145686, -56267, -15156, 17542, -29524, -232695, -192536, -7267, -150054, -63708, -241168, -330246, -85102, 5650, -46769, 78197, -320019, -163096, -129368, -49335, 61064, 432614, 54372, -35448, -280132, -297424, 81893, 66772, 42252, 88458, 77655, -138544, 29770, -90275, 317847, -179236, 80538, -23002, -90143, -93931, -112690, 90202, -70143, 58450, -129802, 30898, -134335, 145387, 29435, 23864, 197513, 82696, 105660, 160553, -213038, -253528]
19306b53528J16669l0796r0492J28140K7244j52609A75003a48343k04549h471
19295a29834c5751k11853A27476E0045a37641M5198G6616b30626L4391R2449j80108
19284b83894H2202h6715j85783a24369j79879E6854J9457k590K3201a09397A84842
19272a13447D1594b55846P8947c1308A02901J64672a65768K5012F0850K6964b2009
19260c86883a20274q8025B81801g4673c789q8699j00502B69773A11389a35385
19249C74793F3886J13291D701O875a08165j66451g9066r8010j20528a34222q9874
19238b24096i4667j66071M2946E3831a82878j6410D9274J14849n5358e4829j09357
19227a64186B07025c08645E8978f9162m3670d271r6455A17367B0779a45331P2242
$$ y = [-253528, -136859, -167655, -258147, -130007, -102763, -255372, 175003, -148343, -352892, -8471, -129834, -35751, -247604, 127476, 50045, -137641, -92443, 76616, -230626, -196235, -103786, -283894, 82202, -86715, -272498, -124369, -304248, 56854, 76311, 73721, 96922, -109397, 184842, -113447, 41594, -255846, -176899, -31308, 102901, 267573, -165768, -140756, 60850, 87814, -22009, -386883, -120274, -208299, 281801, -74673, -3789, -92488, -192990, 269773, 111389, -135385, 374793, 63886, 177177, 4701, 11576, -108165, -274616, -79066, -177076, -297604, -134222, -224096, -94667, -260738, -217792, 53831, -182878, -199288, 49274, 164123, 108765, -54829, -164186, 207025, -308645, 58978, -69162, -112832, -4271, -100726, 117367, 20779, -145331, -73089]
19216g3089B08212a81263B4378b4348C14769b64196A74378c7146C3950d3787l51347
19205c95134C3357a77273h6770o1124E4649K2736C989a29837A1607J37125h0532
19193a40015A3123a01649p7581B6174N2231i3198o6349n2517J04443n2156B35757
19181b42366Q2039L0187C082a35901a8975n1738l55626D428J36503h3275j07739
19170a91014M5733A66920d2798k62643h5696c2328D8281d26760J18116g9649k9281
19159a08930o2965D33277c31711c7888l649p3350B90007C0847K19873A11630b75055
19147a15422c2093h217k58424B23800a99929C9460a77982O6193H2691a59077a3671
19135b71j66387j16414r9245a67296D20614a90055e8649C3668a95357j64421g5223
$$ y = [-73089, 208212, -181263, 24378, -24348, 314769, -264196, 174378, -37146, 33950, -43787, -395134, 33357, -177273, -86770, -147894, 54649, 77385, 3989, -129837, 11607, 148732, -80532, -140015, 13123, -101649, -179230, 26174, 78405, -93198, -159547, -212064, -107621, -159777, 235757, -242366, -160327, -130140, 3082, -135901, -18975, -70713, -426339, 4428, 140931, -83275, -191014, -145281, 166920, -42798, -305441, -85696, -32328, 48281, -426760, -308644, -79649, -108930, -171895, 433277, -331711, -37888, -41537, -114887, 290007, 30847, 250720, 111630, -275055, -115422, -32093, -8217, -266641, 223800, -199929, 39460, -177982, -111789, 82691, -159077, -13671, -271, -166658, -283072, -382317, -167296, 420614, -190055, -58649, 33668, -195357, -359778, -75223]
19123a40100b0674j98406L3404A97969n110a0037j08024n4119j38582j02655K03191
19112b10226e4536B78807a51492C4773b11234G3574c7645A9035J3351a63322N5072
19101a08250A18298a84538j08045C6750D508e6332D579M33616b66898A19512a59635
19089a19093p2079a9961k960j63792o649C46691F1619o591d5254A27952D1581
19077a70075K6552d821j74874j60120B69227E1086J01785o8763b80953C21292
19066A00829A224Q2447a75252g2917B58854J4128a81999B16452b18796L0637e6984
19054a88165r2138g4267F5229c3191j33417O8071B6352b4588j00759A99574b54429
19042b78865i7598L218n9860A91196J3953H353e7366F8645g1828P282C14457i5541
$$ y = [-140100, -20674, -219080, -185676, 197969, 192859, -10037, -118061, -172180, -310762, -413417, -210226, -54536, 278807, -151492, 34773, -211234, 73574, -37645, 19035, 32386, -163322, -108250, 118298, -184538, -292583, 36750, 4508, -56332, 4579, 438195, -266898, 119512, -159635, -119093, -191172, -19961, -22921, -186713, -193362, 346691, 61619, 55028, -45254, 127952, 41581, -170075, -143523, -4821, -179695, -339815, 269227, 51086, 152871, 84108, -280953, 321292, 100829, 1224, 83671, -175252, -72917, 258854, 272982, -181999, 216452, -218796, -188159, -56984, -188165, -280303, -74267, 65229, -33191, -166608, -98537, 26352, -24588, -125347, 199574, -254429, -278865, -97598, -94380, -154240, 191196, 205149, 8353, -57366, 68645, -71828, -64546, 314457, -95541]
19029B16526G2173d9365C57750b814C04315a32109A80107R8020f8583A00377K0485
19018A20862R2616j02939a35046c9552j5903j23048c3687q709A09556a7740r2127
19007a09867E1710a27636K3496j048M9806k6674q5375a3345D756J15105r623a80535
18994b19974m3725J23494a1978A4727a25787c6443D9055J9742M669f0846A59726
18982a11203D98857c67357a31349N7211G8749N356a28460M965L1701B03945A3741
18970g8446A02066J0755a47485J8610H2455O7036L9229f040k37996c0369H3338
18958b55754J14747A45672c10946J17343C4002N0522a12384I3215a99326c5869
18947b56298O9217E4376J74176h8774l94117a69790d846j04180A89217g0294b7258
$$ y = [216526, 72173, -49365, 357750, -2814, 304315, -132109, 180107, 278127, -68583, 100377, 120862, 213478, 110539, -135046, -39552, -55455, -178503, -33687, -42396, 109556, -17740, -109867, 51710, -127636, -104140, -105188, -55382, -82056, -167431, -13345, 4756, 119861, 110238, -180535, -219974, -263699, -140205, -11978, 14727, -125787, -36443, 49055, 68797, 73466, -60846, 159726, -111203, 498857, -367357, -131349, -74138, 78749, 84105, -128460, -123495, -91794, 203945, 13741, -78446, 102066, 112821, -147485, -128875, 82455, 149491, 188720, -6040, -244036, -30369, 83338, -255754, -141007, 145672, -310946, -193603, 34002, 84524, -112384, 93215, -199326, -35869, -256298, -187081, 54376, 228552, -88774, -482891, -169790, -4846, -109026, 189217, -70294, -27258]
18935b10819K0164A7324J77651r5561K1425O362h8221H8911Q3132F8011D369a25513
18922b13727E8717K20870b4950k9932j818j8770A49602a60274A618J40029J28676
18911B70323a08412I2679d4032k51252a22019b1686A05775b11163A11539i4817
18900d56015A64767a56915m1383i3097i113o0536B5856c48272M6696A99199D4748
18888d891a344B00793h1117I1360b924j70637e408n5484k29722A57332e7454j19394
18876a76848F918c4599j50786r5513A10737a79454e432j17097l13980e6589B2157
18864a40377n636K3227A41766h5013k9022B3151c29683j49509f0595j49740G5323
18852d9727e421H0690b15726A83647b96153i6937j48725h67E5229K6289g6161
$$ y = [-210819, -190655, 17324, 194975, 99414, 120839, 127201, -88221, 88911, 172043, 68011, 4369, -125513, -213727, 58717, 279587, -24950, -54882, -56700, -75470, 149602, -160274, 1618, 141647, 270323, -108412, 92679, -44032, -295284, -122019, -21686, 105775, -211163, 111539, -94817, -456015, 164767, -156915, -198298, -93097, -9113, -69649, 25856, -348272, -301576, 199199, 44748, -4891, -1344, 200793, -81117, 91360, -2924, -173561, -5408, -60892, -290614, 157332, -57454, -176848, 6918, -34599, -185385, -280898, 110737, -179454, -5432, -122529, -436509, -56589, 22157, -140377, -146013, -122786, 141766, -85013, -114035, 23151, -329683, -479192, -60595, -210335, 75323, -49727, -5421, 80690, -215726, 183647, -296153, -96937, -245662, -867, 55229, 81518, -76161]
18840a53261c348j34748J2431C9913R2341R1325a68735A92676F1791P4944m0186
18829I6549A7176J20753c41338E8311L9823a94223a4686k4828J2471j05178G3216
18817a12137e0699f915j13477A93823E6528f2578H3905J39462d07824J97873B25908
18805G5324P1895p2355e0417j2439C6169b08179C209N4673e0877j81622j4607
18794b47106a05102o8768C9085J7141P14A989a92827h1561A19749a77858j54141
18783c31999R7937a4011k3484J6007G8410b2450q8410j33550D2613K15601a87976
18771a66298B1137c43081A82361b44605c2810l65342f4328l6926j62957D9723
18760A00432p287a88714j26184A21421l7948f6636B74329d60j12704L3083j46457
$$ y = [-153261, -3348, -138096, -125665, 39913, 132254, 223579, -168735, 192676, 61791, 136735, 96549, 17176, 137929, -341338, 58311, 98134, -194223, -14686, -39514, -27043, -132221, 73216, -112137, -50699, -6915, -120392, 193823, 56528, -62578, 83905, 223367, -407824, -209951, 225908, 75324, 147219, 74864, -50417, -62856, 36169, -208179, 3209, 57882, -50877, -232499, -247106, -105102, -173870, 39085, 56226, 56940, 1989, -192827, -81561, 119749, -177858, -331999, -234062, -14011, -37495, -21488, 78410, -22450, -110860, -244410, 42613, 258214, -187976, -166298, 21137, -343081, 182361, -244605, -32810, -398152, -64328, -101254, -264211, 49723, 100432, 93145, -188714, -314898, 121421, 83473, -66636, 274329, -460, -113164, -80081, -226538]
18749b26538C3157J14048J9005c762A74501q6994L8181c27328A52921a46527M2017
18738a04510k26635a6918k71346J27278Q127f125E1202c10091L8009E5632g6455
18726E4275a45305K8379I5691C3551a86829A43714e6233C1331a01174C3726b00734
18714D0742J1567a71506B50018h2292j36589a5275j23964A65789j1647j8524F5284
18702h6110N224p2335N5879j56123B78975c83343C1264a98566B44643g6575K9295
18691d7280A36169b06946i4801j35221n1873B3238b4542B27834c2780a0210k38975
18680b49185n3983a42030f06j32575M2730D24429A06276a9000j51689A54430c37934
18668g1963B3317J78439N1954D8832E473g2893m5481j93916a28139I112a92151
$$ y = [-226538, 33157, 147205, 166210, -3762, 174501, 87507, 125688, -327328, 152921, -146527, -104510, -331145, -16918, -288264, -160986, -152859, -6125, 51202, -310091, -272082, 55632, -76455, 54275, -145305, -116926, 95691, 33551, -186829, 143714, -56233, 31331, -101174, 33726, -200734, 40742, 52309, -171506, 250018, -82292, -218881, -15275, -139239, 165789, 154142, 135618, 65284, -86110, -80886, -153221, -97342, -253465, 278975, -383343, 31264, -198566, 244643, -76575, -47280, 136169, -206946, -94801, -230022, -281895, 23238, -24542, 227834, -32780, -10210, -249185, -303168, -142030, -606, -133181, -90451, 424429, 106276, -19000, -170689, 154430, -337934, -71963, 23317, 201756, 253710, 48832, 5473, -72893, -118374, -312290, -128139, 9112, -192151]
18656C3056R2278a15479k44581K1989c0269k39677D119K0331i4940n6748J0928
18645a40760A30198l7104a57560l2736B52991n6379H9180k6707B1947J21245a2861
18633d27503L65b06478k8295n094B98287C9257e6782q344A77687b96785n2912
18622c49697i3508j64876I0531c43145P9246R3968B3227J95080a80139q3099C8751
18610h2284A72911o7253O8679q6571M2584E0659e0543k9879j24440F6118a8733
18598b1645D8883J69560a19369B15455B64J96929a96400f9259j52605B05557b43289
18586c02200a0021j46066g0305j70852Q461R2869j43244a19887j09017j93326
18576d22230A22069b32426A62851a46129D01031A841a74289l9286B2254J94370
$$ y = [33056, 125334, -115479, -360060, -338071, -30269, -269946, 4119, 24450, -94940, -151688, -140760, 130198, 93094, -157560, -190296, 252991, 196612, 89180, 62473, 21947, 143192, -12861, -427503, -427138, -206478, -234773, -239867, 298287, 39257, -56782, -65126, 177687, -296785, -349697, -93508, -258384, 90531, -343145, -263899, -169931, 23227, 218307, -180139, -263238, 38751, -82284, 172911, 105658, 174337, 87766, 130350, 50659, -50543, -80422, -204862, 66118, -18733, -21645, 48883, 218443, -119369, 215455, 264, 197193, -196400, -69259, -221864, 205557, -243289, -302200, -10021, -156087, -70305, -241157, -232696, -139827, -283071, -119887, -228904, -422230, 122069, -232426, 162851, -146129, 401031, 1841, -174289, -213575, 22254, 216624]
18566B16624D6853e6700b0217j4191r40F2655C1272d1913j64692G0743J21697
18555A92440a55659a618A32802L6452C4233e75659C173a34163n2406M2400A16205
18543D3966k0866D473K1674a1444p0000k19192A6626a62272O9275C0656a995j52500
18531a54495a4983G25e2610j08654B3410J43385a30288N855r2529e5010B48887
18519a19542A47243B1457a33962A0575P298b02112D7924L0276O2781e7950A13969
18507b17960B07951a63522P3023j05389d8422r1946M0070j16542f2855B41681
18496c47052a20464D8160a88375C49533b7818k34396B7132c05631o0220J73448
18486a92403B1772b33455c0791j36651A6859b09481J2618k20866d4209K0257A9279
$$ y = [216624, 46853, -56700, -20217, -34408, -35348, 62655, 31272, -41913, -206605, 70743, 192440, -155659, -1618, 132802, 169254, 34233, -575659, 3173, -134163, -186569, -144169, 116205, 43966, 23100, 4473, 26147, -11444, -81444, -300636, 16626, -162272, -92997, 30656, -1995, -154495, -14983, 725, -52610, -161264, 23410, 166795, -130288, -124433, -216962, -55010, 248887, -119542, 147243, 21457, -133962, 10575, 17873, -202112, 47924, 78200, 140981, -57950, 113969, -217960, 207951, -163522, -90499, -195888, -48422, -140368, -100298, -216840, -62855, 241681, -347052, -120464, 48160, -188375, 349533, -27818, -262214, 27132, -305631, -365851, -192403, 21772, -233455, -30791, -167442, 16859, -209481, -196863, -417729, -44209, -23952, 19279]
18474C58075b81025m3522A47861N8785F1156L9701D6583a66608A58100O80b76190
18462b25069j34286D1602M13593a81611i682k21362R9959K9712j82355A09967
18451D5960a58741c563A42037B4097b85785a16958A98040a31321j42965m659C9732
18439a63630A63250K1050d01074M4298b6293B50334c39551a31627E8191K24875
18429B83066b4439C0318r798M2492k3975J12283b20550m6736r0821a29059B59912
18417a62289b9861J1694j75250e180B5502d6807q9466B40820n1093i0987m7656
18406a38643n9658A60317i4741K4586C1733b64286p1520C04651H1641K61490A27326
18394a31129p8100k4545d5279A08153J87129A02787d654c52A97204a43180M4566
$$ y = [358075, -281025, -324547, 147861, 206646, 61156, 100857, 46583, -166608, 158100, 158780, -276190, -225069, -359355, 41602, 455195, -181611, -9682, -231044, -131085, -101373, -283728, 109967, 45960, -158741, -3563, 142037, 24097, -285785, -116958, 198040, -131321, -274286, -278945, 39732, -163630, 163250, 184300, -401074, -356776, -26293, 250334, -339551, -131627, 58191, 283066, -24439, 30318, 20520, 63012, 39037, 151320, -220550, -267286, -358107, -129059, 259912, -162289, -29861, -18167, -193417, -5180, 25502, -46807, -136273, 240820, 189727, -90987, -138643, -198301, 160317, -94741, -70155, 31733, -264286, -335806, 304651, 81641, 343131, 127326, -131129, -209229, -233774, -45279, 108153, 295282, 102787, -4654, -352, 197204, -143180, -98614]
18383i8614A84448d9183k7800l2691b1836C1517a88750b3732A96029b57503A613
18371A17125b4830P618H9247d0318B99540d33175H3573J6754J5173l7291K94918
18360C73127c69051B04016f2444B2926a34573A8568C027b7168G7524J93642B9521
18348C92048h3993A536a69632k04234I0291a64647j66640A33970f7208j08958
18338a76166A74883a91882I3063a96368A43280j7020b16417g4235f99j6767k89093
18327c06559A15923B8560K6258L1325a37292G0244a52939E07720c66523A3112
18316a51859R21A70094f9311A18209c4347C21485A37358c8433J1443m4188k27412
18305b98590G3509P4192a02894C8347a7725j94432j02121J45856k90959A99870
$$ y = [-98614, 184448, -49183, -76983, -109674, -21836, 31517, -188750, -23732, 196029, -257503, 1613, 117125, -24830, -17212, 89247, -40318, 299540, -433175, 83573, 100327, 115500, 78209, 373127, -369051, 204016, -62444, 22926, -134573, 18568, 3027, -27168, 77524, 271166, 29521, 392048, -83993, 1536, -169632, -373866, 90291, -164647, -331287, 133970, -67208, -176166, 174883, -191882, 93063, -196368, 143280, 126260, -216417, -74235, -699, -17466, -306559, 115923, 28560, 54818, 86143, -137292, 70244, -152939, 507720, -366523, 13112, -151859, -150938, 170094, -69311, 118209, -34347, 321485, 137358, -38433, -26990, -71178, -298590, 73509, 147701, -102894, 38347, -17725, -212157, -314278, -168422, -459381, 199870]
18294b37270B6449a39554N2251C8835b51827a03489k3653M684A7274f9999A3161
18282g4362J0662B51396g0284C12458H3631a07649l1800k45058a22203M6012J2076
18271f4115k52978P0398e9599C3245p300b28151A0246P1673b65972B40570K3859
18260B64429m5639c74244a30534m0604A20342a99601j82759H1094O7288L6480
18250A84862q405G4053h0972q3384j8418N8635L3255F7338b10153D7260J52825
18239B00085A2557g1838K7755B2980P033K0568B1126a67449o636k4228H5183f4322
18226c7644k82067b4187E2588A1782a54478q0306H323J99692c1834j57589b3829
18214a47827b0755r6302r4283G0199b69711H9267a77360e1417k11217R1173r6867
$$ y = [-237270, 26449, -139554, -87303, 38835, -251827, -103489, -127142, -122458, 17274, -69999, 13161, -74362, -63700, 251396, -70284, 312458, 83631, -107649, -139449, -384507, -122203, -76191, -64115, -317093, -246695, -59599, 33245, 25945, -228151, 10246, 81919, -265972, 240570, 264429, 218790, -374244, -130534, -171138, 120342, -199601, -382360, 81094, 148382, 184862, 176457, 74053, -80972, -164356, -182774, -124139, -90884, 67338, -210153, 47260, 200085, 12557, -71838, -44083, 22980, 30013, 50581, 21126, -167449, -174085, -198313, 85183, -64322, -37644, -319711, -24187, 52588, 11782, -154478, -234784, 8323, 208015, -31834, -189423, -23829, -147827, -20755, -117057, -211340, 70199, -269711, 89267, -177360, -51417, -262634, -171461, -268328]
18203b68328G2730c15782A4351J9105j6463e0293j41543B22319b32463C39075
18192a06690I1063b40426n7040d4950n2704B350J2515d5655m7408D9028b0331
18180a35172e5164C69891f6397k92237C7789f4826A13926J03943c12937C58621
18169A47573K06364E9253J86173D4110a562A86189b17801A01026a1133E0160a66230
18157a94992H0946l2859Q4931j211B1098i6175j38826f2544B7129B596K0405h7701
18144A30227a85182l7598l643e4469j21259P160c4860A52382b2623m24833B5046
18132a86514H9093a45153j67200c9699j6448E0210e7301J8098B1104J8686M9334
18121H9124a44916B32601j0786a90520c2770A65931L1804g4504I6116B7286j0119
$$ y = [-268328, 72730, -315782, 14351, 33456, 16993, -50293, -191836, 222319, -232463, 339075, -106690, 91063, -240426, -297466, -44950, -97654, 2350, 14865, -45655, -93063, 49028, -20331, -135172, -55164, 369891, -66397, -358634, 37789, -64826, 113926, 217869, -312937, 358621, 147573, 353937, 59253, 245426, 44110, -1562, 186189, -217801, 101026, -11133, 50160, -166230, -194992, 80946, 48087, 133018, 131807, 21098, -96175, -235001, -62544, 27129, 2596, 23001, -87701, 130227, -185182, -222780, -226423, -54469, -175728, -168568, -34860, 152382, -22623, -447456, 25046, -186514, 89093, -145153, -312353, -39699, -56147, 50210, -57301, -39203, 21104, 39790, 89124, -144916, 232601, 221815, -190520, -32770, 165931, 197735, -74504, 96116, 27286, 17167]
18110A7167J32348K1602b46554C3033c63628H474K19048a00285B9936c416B71597
18098c64497H707O2749e3596j61871h3330A6402K37232e2265F4097k1258d0411
18086b2136j44801P1469C43565a04886A20776a50889B36822b41451Q4800c8397
18075B4000M5203H344c3321r1579l6240A63550a96537i4287m390L6723j16272
18064a78226f0343l9473m22062K9740H8260B8000P1892c7568G3111b1108k63300
18053b84408E4118a65761B97797n7777A9870b95238o8660C42346I6568e737C38353
18041A73435b5898r7048E2484B1714Q2345k4219b35562A23958c22781B7459A0197
18029h1718a3145l58959B03744f2745K0454A09486j2579a11002m2782c8932B95289
$$ y = [17167, 149515, 171117, -246554, 33033, -363628, 8474, 227522, -100285, 29936, -3416, 271597, -364497, 8707, 71456, -53596, -215467, -83330, 16402, 253634, -52265, 64097, 42839, -40411, -22136, -166937, -95468, 343565, -104886, 120776, -150889, 236822, -241451, -156651, -38397, 24000, 69203, 8344, -33321, -124900, -161140, 163550, -196537, -94287, -98677, -61954, -178226, -60343, -99816, -521878, -492138, 88260, 28000, 99892, -37568, 73111, -21108, -284408, 54118, -165761, 297797, 240020, 19870, -295238, -363898, 342346, 96568, -5737, 338353, 173435, -25898, -122946, 52484, 21714, 104059, 79840, -235562, 123958, -322781, 27459, 10197, -81718, -13145, -372104, 203744, -62745, -42291, 109486, 96907, -111002, -153784, -38932, 295289]
18017A01962b87033B44613A08346a77289p2690h6891L6700d283r6450c7444l27095
18006c64539a55775I2184e1882A20108e380q0468B75427A06689m307M7357a20676
17994c33749J40216r9651f5267D3436a16692d1808H7497a45553C39805a05991
17983a26180D8468q172j0390J7237a6337k162A39787B6262I963J28784B4669P2229
17971I6898d4582l906n6130o5652f664m9912q1232f4844M637J3222A88148A4918
17958E363O387i4784j37300a1087k3300j09591f6581A55348f0446o4162D902R3859
17946I8761a99106P9027B2504b9680j19755k77277A75088a45444n2806I8232k100
17935I6132Q2050c36344A73015A7986K3241K3133K30565j21269n8385a17991j26822
$$ y = [101962, -287033, 244613, 108346, -177289, -249979, -86891, -50191, -4283, -100733, -37444, -364539, -155775, 92184, -51882, 120108, -5380, -85848, 275427, 106689, 102382, 149739, -120676, -333749, -193533, -293184, -65267, 43436, -116692, -41808, 87497, -145553, 339805, -105991, -126180, 48468, 40296, 29906, 47143, -16337, -18499, 139787, 26262, 9963, 138747, 24669, 96898, -44582, -48488, -104618, -170270, -6664, -56576, -137808, -64844, -60207, -46985, 188148, 14918, 5363, 11750, -94784, -232084, -11087, -34387, -143978, -66581, 155348, -60446, -124608, 4902, 98761, -199106, -120079, 22504, -29680, -149435, -426712, 175088, -145444, -198250, 98232, 96132, 178182, -336344, 173015, 17986, 41227, 64360, 294925, 173656, 115271, -117991, -244813]
17924b44813J20157H0692b28076a07945C05253a22563B3740d060j14251j34417
17914b52728J24183A1574a69886L2350A5899L43360b25157B77112k3812a31802
17903a26773a0921r4800H3573d01677B6546K02573m3445a34678n1101a2507A13095
17891C23579a27731j06806O6429m2535O2052B6888O8220a12394j47475I4038a66011
17879G6395f6290j55484C4315J00977e9147j21883A08393l3098J86651A9462h8901
17867a53043A23948b3729m7563D421Q0180k6492J55571h8091C00149C3533c71438
17855a66549A94194a81274p3078C4342J30787D905J784P1518a74195K144l520
17844a75571B49139M2642H6797K1857a19764A3134J38179a4607A06037c11607
$$ y = [-244813, -124656, 80692, -228076, -107945, 305253, -122563, 23740, -4060, -118311, -252728, -128545, 11574, -169886, -137536, 15899, 359259, -225157, 277112, 253300, -131802, -126773, -10921, -105721, 83573, -401677, 26546, 229119, 185674, -134678, -185779, -12507, 113095, 323579, -127731, -234537, -168108, -210643, -148591, 26888, 95108, -112394, -259869, 94038, -166011, 76395, -66290, -221774, 34315, 135292, -59147, -181030, 108393, 75295, 261946, 19462, -88901, -153043, 123948, -23729, -71292, 4421, 84601, 58109, 213680, -88091, 300149, 33533, -371438, -166549, 194194, -181274, -254352, 34342, 165129, 4905, 6689, 78207, -174195, -172051, -175571, 249139, 291781, 86797, 108654, -119764, 13134, 151313, -14607, 106037, -311607]
17833A87639r3011e0735j03136m8712D4615K22667b8679C0239a63549A4853b473
17821A02882C5911c05909E5607b58264A35587a00574A11183C6997J80101a51953
17810A45882n914l3389a4292j59471K8507L9725d0964j08038b5380j00863A70082
17798A93126a45204j24885A85795b43203C1649b43362o2878C07721b36247A41775
17787A97907G9360J41415J38547a8489H6760a73526k58247G5368e4188E991c1264
17775a15573D82320A15834a42522L3326D2566d4319B93569I7630N1582h6814k7259
17764a14073H162f1884k97361B23155F3349h1985A72526a12495d5356p7281I345
17752D8656b51496M7017a990B48703f7682p2404C50668A12159a31203E1110J55562
$$ y = [187639, 94628, -50735, -153871, -202583, 44615, 267282, -28679, 30239, -163549, 14853, -2473, 102882, 35911, -305909, 55607, -258264, 135587, -100574, 111183, 36997, 217098, -151953, 145882, 139968, 106579, -14292, -173763, -145256, -105531, -40964, -149002, -25380, -126243, 170082, 193126, -145204, -270089, 185795, -243203, 31649, -243362, -306240, 307721, -236247, 141775, 197907, 79360, 220775, 359322, -18489, 86760, -173526, -431773, 75368, -54188, 5991, -31264, -115573, 482320, 115834, -142522, -109196, 42566, -44319, 293569, 97630, 149212, -86814, -114073, 8162, -61884, -359245, 223155, 63349, -81985, 172526, -112495, -45356, -122637, 9345, 48656, -251496, -204479, -1990, 248703, -67682, -140086, 350668, 112159, -131203, 51110, 206672]
17741B06672q9919a25673A41167c78783B20558N5909H2329J05552C93c2528k8059
17730f0587K5203o0876G8226l283A255h3240A46259D8418L5309e7544F3495i5218
17717g3699C034c06946C0637f1783m1894b481n7237g676p8258B37889J51082E7091
17704A9419J37411a6780n0980j84207B54817A01473i2868C5835Q5410R1707b216
17692C14318i4206j4925H4858h8283B61526a73676l7359H4620a65703k92741a36942
17680c05614J42835E5702c43923H3069b6732A6209L7079a22628j13947A69754
17669a03881l6646A49795J34474c9452A06680b33697B32831a81292A88771c0155
17658B3009i9672A90204E1547b9401A66874C3650K8308J23591a48984H407P1107
$$ y = [206672, 116753, -125673, 141167, -378783, 220558, 276467, 82329, 187881, 393, -32528, -60587, -35384, -96260, 78226, 74943, 1255, -83240, 146259, 48418, 83727, -57544, 63495, -95218, -73699, 3034, -306946, 30637, -61783, -103677, -2481, -59718, -7676, -85934, 237889, 388971, 57091, 19419, 156830, -16780, -67760, -251967, 254817, 101473, -92868, 35835, 121245, 212952, -2216, 314318, -94206, -109131, 84858, -88283, 261526, -173676, -211035, 84620, -165703, -458444, -136942, -305614, -162779, 55702, -343923, 83069, -26732, 16209, 53288, -122628, -236575, 169754, -103881, -140527, 149795, 284269, -39452, 106680, -233697, 232831, -181292, 188771, -30155, 23009, -99672, 190204, 51547, -29401, 166874, 33650, 61958, 185549, -148984, 8407, 79514]
17647G9514l9149a10396A43213a93483A52321d1552j74423D8980k2847M7255g2844
17635H8216A7003R9350J98661A5049L16801b8514k4358k04526A05779N8713a63928
17623D1479A900L6818N7431C043i332c204A73827q1522D5130h8173p8570g0310
17610B27708H7408g0053B471K34955m0656c2206f073A68551E3590a5365H9745
17598b0610k31354J22410e0744n9786j04216d1948n2067b5158B33347a32187e6669
17586I9549C9929P7854J0178J88373b9769a55B9288b2175j83668C6225a62912
17574B11887r2590L5732o7654L1644A8816a28237C10118a40227A9978a14040l7013
17563a51053B01004e2230A99488a48008g2664c0403j06511E0193a82148A11844
$$ y = [79514, 40365, -110396, 143213, -193483, 152321, -41552, -215975, 48980, 26133, 73388, -72844, 88216, 17003, 116353, 315014, 15049, 331850, -28514, -52872, -257398, 105779, 164492, -163928, 41479, 1900, 38718, 96149, 3043, -9332, -3204, 173827, 92305, 45130, -88173, -166743, -70310, 227708, 87408, -70053, 2471, 237426, 196770, -32206, -6073, 168551, 53590, -15365, 89745, -20610, -251964, -129554, -50744, -110530, -214746, -41948, -94015, -25158, 233347, -132187, -56669, 99549, 39929, 117783, 127961, 316334, -29769, -155, 29288, -22175, -205843, 36225, -162912, 211887, 119297, 155029, 87375, 119019, 18816, -128237, 310118, -140227, 19978, -114040, -151053, 201004, -52230, 199488, -148008, -72664, -30403, -136914, 50193, -182148, 111844]
17552B71055a76821A76844F6344J90314I648f1111k2280G1049e794A14537L51919
17541D66456D715a44648H5856h4719B22825a5474I2875g3737D00998K40405F555
17529d19288C8780L84726j53006b33895O3540f4900k26665A24415c23071a35867
17518A72115K32789E113a08648k31709A60270B3063K10817E074J43354J6664N612
17507A70704n3865l9817a00509j73500A7479a96104a5623j78938P0055C13134
17496a2258A74916h2658A89114b31673H4107h8564D9195J52507N9060f5078a962
17484A91180G5010P3552c3331j27854C22794j28674j0709q8962A4930h6830C79542
17472B55287b8374C68266A12920a44935b1124E13531a0726A14332c1536G713c1175
$$ y = [271055, -176821, 176844, 66344, 256658, 9648, -61111, -83391, 71049, -5794, 114537, 466456, 4715, -144648, 85856, -84719, 222825, -15474, 92875, -73737, 400998, 641403, 6555, -419288, 38780, 423506, 270500, -233895, -170355, -64900, -291565, 124415, -323071, -135867, 172115, 404904, 5113, -108648, -340357, 160270, 23063, 233880, 5074, 148428, 165092, 170704, 116839, 77022, -100509, -274009, 17479, -196104, -15623, -194561, -124506, 313134, -12258, 174916, -82658, 189114, -231673, 84107, -88564, 49195, 201702, 260762, -65078, -1962, 191180, 75010, 148562, -33331, -161185, 322794, 194120, 183411, 94449, 14930, -86830, 379542, 255287, -28374, 368266, 112920, -144935, -21124, 513531, -10726, 114332, -31536, 7713, -31175]
17460b21683g5876A5648a58514B10698J67237b1372A03146R095d7384A80877c2168
17448A19667K4665K89629Q6730B05103l7768K89162B07731a24938C19499N295
17438C24794j19390c5345C50832I0134P5009R2701j15296L24691Q0142B30909
17427B93208j6064J38885A66369L35076Q69p3017k0699A45934M35272A37868o0708
17416G7160N72720j07369B63147C0923m732J85380p1298Q9686c847B13167J75792
17405C88959a89028b4523m0901B79729f7723A92140a24604F9408c30719c2512
17394B79214d671A58885O7334J44583A00516K07783j28683a63254D34418j82696
17384B51722K64492B9261J12003J82104r1373Q034J6542L4279j35972P506b49572
$$ y = [-221683, -75876, 15648, -158514, 210698, 377935, -21372, 103146, 112241, -47384, 180877, -32168, 119667, 144332, 433961, 520691, 205103, 167335, 456497, 207731, -124938, 319499, 324794, 205404, -35345, 350832, 90134, 165143, 257844, 142548, 467239, 547381, 230909, 293208, 277144, 416029, 166369, 501445, 502314, 429297, 408598, 145934, 581206, 137868, 77160, 649880, 542511, 263147, 30923, 26191, 211571, 140273, 229959, -3847, 213167, 388959, -189028, -24523, -65424, 279729, -67723, 192140, -124604, 69408, -330719, -32512, 279214, -4671, 158885, 226219, 370802, 100516, 308299, 179616, -163254, 434418, 251722, 516214, 29261, 141264, 323368, 231995, 240029, 256571, 290850, 154878, 162384, -249572]
17372A96069J50935a81600B34410d7538p9291E52595A29627n7846I127e4610B6974
17360e3938C05720H6261K07951F1845K1324K15122i90C31371c0811D68797A42479
17348B2847f5380B23879h0892D09627f4569b5850C20175a48226C70797h2872C52045
17336A00993m6626R190M6043K50323A28663n0816P2745J0316p4560K769d8951
17324A2955c31539G4161J77535f453D55047A72108J09872J29745a517A59370l9230
17313A20140c0438k9614A83292d6607B2764a80432B04865r6836B5357J62729r1677
17302I6409K52065c716a207j17894B21946G986K46600b68120A88199d5391D13382
17290A76030m4104Q6396n5413G3965N4032N8859k7860L68739A52869l0834f8894
$$ y = [196069, 347004, -181600, 234410, -47538, -126829, 552595, 129627, 71781, 9127, -54610, 26974, -53938, 305720, 86261, 294212, 61845, 83169, 298291, -990, 331371, -30811, 468797, 142479, 22847, -65380, 223879, -80892, 409627, -64569, -25850, 320175, -148226, 370797, -82872, 352045, 100993, 54367, 63557, 109600, 359923, 128663, 77847, 150592, 160908, 86348, 89117, -48951, 12955, -331539, 74161, 251696, -6453, 455047, 172108, 281980, 411725, -1517, 159370, 120140, -30438, -60052, 183292, -46607, 22764, -180432, 204865, 108029, 25357, 188086, 96409, 348474, -3716, -1207, -119101, 221946, 7986, 254586, -268120, 188199, -45391, 413382, 176030, 131926, 218322, 162909, 73965, 127997, 186856, 158996, 527735, 152869, 122035, -68894]
17278A20642J6845Q9974N8429L19480A14330J1815J37384H1953J45571o3703K1400
17267A85221M4989I581i4938J3965A7850J17321n5373Q0759m792G4863J02030
17256A76893K72547j21101a49464D1510L77512j74255L8744I4105M45501A30733
17245A70392P7424H5528b67348A20996J96072j12626J91922A08244K33942K1746
17235C63932A22157Q8040C2936K30932A14603K78652l1706n6306K49860F3264
17224B71450d7333D66149j18925j49587m4765D488J52301J39228r8951L3110I5903
17212A77512o0568n4321J17527F2649K71790a36829c0408C67080A36825K05030
17202C41855j47021O7588J4054a2329B40810c76380D91830k31637k8085e5887
$$ y = [120642, 137487, 227461, 285890, 605370, 114330, 126145, 263529, 81953, 227524, 163821, 185221, 230210, 9581, -94938, -80973, 17850, 135171, 79798, 160557, 155765, 74863, 176893, 449440, 328339, -149464, 41510, 419022, 244767, 283511, 94105, 539606, 130733, 170392, 247816, 85528, -267348, 120996, 317068, 204442, 396364, 108244, 342186, 363932, 122157, 210197, 32936, 263868, 114603, 393255, 361549, 305243, 555103, 63264, 271450, -47333, 466149, 347224, 197637, 152872, 4488, 156789, 296017, 197066, 230176, 95903, 177512, 116944, 62623, 180150, 62649, 334439, -136829, -30408, 367080, 136825, 341855, 194834, 262422, 276476, -12329, 240810, -376380, 491830, 260193, 232108, -55887]
17191A91938J2145a76679A68412m7026J81040O9404j43840B1412J75452M5526
17181B42390p6700b0036A40493M4315L9290N3278L44082k00028d2451E73709k22092
17170C51617J82756j54022Q4463E4876M7451J87701m7887J10050Q8610p4773A16649
17158A43151J17422J21009l2173l121Q8229k16524D6864M212M18698J62990j87302
17147D45462m0239P806B7037Q9297N76244J48B31241K71655k05897j26060J13177
17136B84116j32794L65847j9533K29638B40074K19139M4523L5834k01306k2466
17126C15798J03640o7999A52922J54247q728l418N9623j8299L33363n45A90015
17114A92296L09738B04484L69449k60028K58039j28061A92846M04851B00707J01578
$$ y = [191938, 204083, -176679, 168412, 121386, 302426, 371830, 227990, 21412, 196864, 242390, 165690, -20036, 140493, 184808, 224098, 277376, 621458, 421430, -42451, 573709, 351617, 534373, 380351, 464814, 54876, 102327, 290028, 242141, 352191, 440801, 366028, 116649, 143151, 260573, 381582, 349409, 346288, 434517, 217993, 46864, 51076, 469774, 632764, 445462, 405223, 413029, 27037, 116334, 692578, 692726, 231241, 502896, 296999, 170939, 284116, 151322, 517169, 497636, 727274, 240074, 459213, 503736, 539570, 338264, 315798, 419438, 351439, 152922, 307169, 298441, 295023, 354646, 336347, 669710, 669165, 190015, 192296, 502034, 204484, 573933, 313905, 571944, 443883, 192846, 597697, 200707, 302285]
17104C02285n0999o0342J8004J36140O2573J06632A79087R2767L257J77692A18555
17092C78455N1991L73019A83335L17410J63951j44016O6324k44573J97528l6001
17082E03958P7855j84830l0970J60748j56906J14538J4485p1127j67401B3973
17071E54197k22860K24848K69044C56187n5732M53797B17095J7349K82236n2383
17061D64297k4710j15799J39028K52929O3577L7354l04856J8663o3O9184j89376
17050D10228K19702k97572M55757o3117j68249J2878R3614k59920K65081o0893
17040F07509j9315K859l6672M2274J90296C40909M41034j33497K76332j68729
17030G56049j54750j30677K31602j4918M7476M3686K9621j89639K7969M0967L26828
$$ y = [302285, 251286, 190944, 208948, 345088, 407661, 514293, 179087, 271854, 275111, 452803, 118555, 378455, 430446, 803465, 183335, 500745, 664696, 520680, 587004, 342431, 539959, 503958, 581813, 396983, 366013, 526761, 369855, 484393, 498878, 427751, 260350, 23973, 554197, 331337, 556185, 825229, 356187, 300455, 754252, 217095, 234444, 516680, 464297, 439587, 323788, 462816, 715745, 779322, 816676, 511820, 530483, 530420, 599604, 410228, 629930, 332358, 788115, 724998, 556749, 569627, 663241, 403321, 668402, 607509, 588194, 591053, 554381, 596655, 786951, 340909, 781943, 648446, 924778, 756049, 601299, 470622, 702224, 687306, 734782, 778468, 808089, 618450, 646419, 687386, 1014214]
17019A014214C97803K85418K14921j18634j32356k8208J05213N4631Q604j29613
17009F57779J42596L9097J84084D94964K28339j9591K54044D30872L84620o0394
16999G55098n5484J9952r6216J24814n4957M84513n23703M84510l57570k82259
16989D98698L86379k99801M26023m6254l80530R0052M41072m70251P83767m66480
16979I62675o7816M8341L4427l87105M19248j85464L25280m73455M42285k74109
16969H44307J68388j25396q156K23733l16145M22146j65558l19455M56183k6824
16959A153223k32627K19365M2172J35950m20700J64309J08899m2599J71734k05735
16949A093991j06427L74572k6441N2959K43017n67668L22395j18776L5968l2160
$$ y = [1014214, 397803, 683221, 898142, 779508, 647152, 618944, 724157, 778788, 787392, 657779, 800375, 839472, 1023556, 494964, 723303, 703712, 957756, 430872, 815492, 755098, 699614, 719566, 623350, 748164, 693207, 1177720, 654017, 1138527, 780957, 498698, 885077, 585276, 1011299, 965045, 584515, 674567, 1115639, 645388, 1429155, 962675, 894859, 943200, 977627, 590522, 1009770, 824306, 1149586, 676131, 1118416, 844307, 1012695, 887299, 879143, 1102876, 786731, 1208877, 1043319, 723864, 1180047, 1153223, 920596, 1139961, 1182133, 1318083, 897383, 1061692, 1170591, 1127992, 1299726, 1093991, 987564, 1362136, 1335695, 1388654, 1631671, 1064003, 1386398, 1267622, 1303590, 1271430]
16939A271430M20244m29392M41587l13163k49773N23856j30942m5834l11725M19800
16929A596088l6716L26514n50756J52826J77984J18956q9882R9686J11922l39413
16919A567209o4326P6739p1025K90024j39866j65131M16175j96781L1299K3239
16909A767556L55423m45393L224J15091M2532L62969l33778K35351l26186M35392
16899B212181j50883O7986l00400L80762l10262M5614l7224L98976l1127R0323
16889B365946j72221J15477J36437m5900K36815k1606k93544L66167j66171P990
16879B529390k45508M04375L6175k67210M41500o0311O0020k13698j64341O79958
16869C200350l5088k39505O1509l1948O9452L36779k31732K58120k26734j0677
$$ y = [1271430, 1691674, 1262282, 1703869, 1390706, 1140933, 1664789, 1533847, 1488013, 1176288, 1596088, 1559372, 1885886, 1335130, 1487956, 1665940, 1784896, 1695014, 1794700, 1906622, 1567209, 1502883, 1579622, 1508597, 1798621, 1658755, 1493624, 1909799, 1713018, 1744317, 1767556, 2122979, 1677586, 1680810, 1795901, 1838433, 2201402, 1867624, 2102975, 1776789, 2212181, 2061298, 2129284, 1828884, 2209646, 1899384, 1944998, 1907774, 2306750, 2275623, 2365946, 2193725, 2309202, 2445639, 2399739, 2636554, 2614948, 2321404, 2687571, 2521400, 2529390, 2283882, 2688257, 2724432, 2457222, 2898722, 2838411, 2898431, 2684733, 2520392, 3200350, 3165262, 2925757, 2987266, 2955318, 3024770, 3361549, 3129817, 3387937, 3161203, 3150526]
16859C150526L77438j36806p3544M08047k61998J29068L10285l20583K9974j06114
16849C506293N49210m55056L83378N8355q9517R0134K17679n6716j46552M94247
16839D551455J38678r3574N30461l36857K56832r2942O1488j17771L72230M52373
16829E722373j34943Q6828P4197k12211N62462N1655P9294n8037J46828K52853
16819F571299O7187L10848o4193j2265N23519j55119O57500k46591K27583J54238
16809H034006M9285M0488K6814N31759O04230k42206J59320L61241L213J55993
16799I724143K28469M60401L93518L47414J41818L16523K75714K69182M54981
16790A2612163N9989N00894M27362L70028N78367K50476O33040M86349l9860P27006
$$ y = [3150526, 3527964, 3391158, 3317614, 3725661, 3463663, 3592731, 3903016, 3582433, 3612407, 3506293, 4055503, 3600447, 3983825, 4042180, 3952663, 4042797, 4260476, 4203760, 4057208, 4551455, 4690133, 4596559, 5127020, 4790163, 5046995, 4954053, 5015541, 4897770, 5270000, 5722373, 5587430, 5674258, 5748455, 5536244, 6098706, 6150361, 6229655, 6171618, 6318446, 6571299, 6638486, 6949334, 6885141, 6872876, 7396395, 7241276, 7898776, 7652185, 7879768, 8034006, 8083291, 8123779, 8150593, 8682352, 9286582, 9044376, 9203696, 9564937, 9568150, 9724143, 9952612, 10413013, 10806531, 11153945, 11295763, 11612286, 11888000, 12157182, 12612163, 12672152, 13173046, 13600408, 13970436, 14548803, 14799279, 15432319, 15918668, 15878808, 16605814]
16780A6605814P18882L58910N25142O38550M63493P80090Q63773P17310P30012
16771B2401976M96892R33865Q56555Q35151J160041J024932R89605J398007R59997
16762C1057021J044542J376352J247355J644569J198264K115098J473649J919311
16754D3076161K168377J529257K131375K244300K729631K411754K670478K716009
16746F1677342L131379K984577L405128L503824L713665L729691L860757M375937
16738I0382300M163583N054821M357692M587766M822861M456419N138543M653291
16730A27617276M361462L938538M083443L531400L014161K402694K012469J184406
16722A52145849O07367k06096r41218j485924k157025k830942l464506l620973
$$ y = [16605814, 17324696, 17683606, 18208748, 18847298, 19310791, 20090881, 20954654, 21671964, 22401976, 22898868, 23832733, 24689288, 25524439, 26684480, 27709412, 28699017, 30097024, 31057021, 32101563, 33477915, 34725270, 36369839, 37568103, 39683201, 41156850, 43076161, 45244538, 46773795, 48905170, 51149470, 53879101, 56290855, 58961333, 61677342, 64808721, 67793298, 71198426, 74702250, 78415915, 82145606, 86006363, 90382300, 94545883, 99600704, 103958396, 108546162, 113369023, 117825442, 122963985, 127617276, 131978738, 135917276, 140000719, 143532119, 146546280, 148948974, 150961443, 152145849, 152753216, 152547120, 151605902, 150119978, 147962953, 145132011, 141667505, 138046532]
16714A38046532l992703m482556n091639m462758m800730m758041m994904m698839
16706A00764362m708997m283577m415267m361309l791069l930869l474127l838821
16698F7960326k819014k996003k809996l155025k553493k389267k154364k499772
16690D6583392j886416k203533j575144j669397j887738j626142j236397j379124
16682C3119501j742831p63212j300067r38308j280482r74593p04091j119660o42242
16673B3654015j144948p13576q93769n30833o46084q59272l94906o22846p12993
16664A7134788l24779o01692n92231j03727m90745m19660m45065k82471m36561
16655A3437857o44190m11388k23771j97780l56847j87376m54022l44775j50716
$$ y = [138046532, 134053829, 129571273, 124479634, 120016876, 115216146, 110458105, 105463201, 100764362, 96055365, 91771788, 87356521, 82995212, 79204143, 75273274, 71799147, 67960326, 65141312, 62145309, 59335313, 56180288, 53626795, 51237528, 49083164, 46583392, 44696976, 42493443, 40918299, 39248902, 37361164, 35735022, 34498625, 33119501, 31376670, 30613458, 29313391, 28375083, 27094601, 26120008, 25415917, 24296257, 23654015, 22509067, 21795491, 20901722, 20370889, 19724805, 18865533, 18470627, 17847781, 17134788, 16810009, 16208317, 15616086, 15512359, 15021614, 14601954, 14156889, 13874418, 13437857, 12793667, 12382279, 12158508, 11960728, 11603881, 11416505, 10962483, 10617708, 10466992]
16646A0466992m11136m09698k49208n5654l63200l15741J75892m60513L41134
16637H718868m86506q6318m09949j07516R8660j17579l60748o9393n97265J48784
16627F731038p2378j9024j68070k36249l74752R5632l1863m69694P6410K61828
16617E792878m26494m6259J5688l50630P3311l67532K20933o9810k37391m2884
16607D561810O7010J73323o05481J45236j3400n66876Q8126K43468K17485n93308
16597C717393L9788K22023j42121j49669j60588j1759j5580k00944p2104J82018
16587C408457p362R631k86222p8769l14508L33288j91704R9890L12130k91236
16577B993595l88840M43249N8500o86455J27439J16700R5652l18638L68037j29992
$$ y = [10466992, 10055856, 9646158, 9396950, 9341296, 8978096, 8662355, 8838247, 8377734, 8718868, 8232362, 8146044, 7736095, 7628579, 7727239, 7609660, 7248912, 7179519, 6582254, 6731038, 6658660, 6639636, 6471566, 6235317, 5860565, 5956197, 5924334, 5454640, 5531050, 5792878, 5366384, 5320125, 5335813, 4985183, 5058494, 4690962, 4911895, 4842085, 4604694, 4561810, 4628820, 4802143, 4196662, 4341898, 4328498, 3761622, 3849748, 4093216, 4310701, 3717393, 3757181, 3979204, 3837083, 3687414, 3526826, 3515067, 3499487, 3298543, 3226439, 3408457, 3401095, 3410726, 3124504, 3045735, 2731227, 3064515, 2872811, 2972701, 3284831, 2993595, 2604755, 3048004, 3106504, 2420049, 2547488, 2664188, 2759840, 2441202, 2809239, 2679247]
16567B679247n49528K86747k045K91801j32593l76416J00072J77898l64963k61982
16557A848238N5978O6529L43781p0488j99969r7063Q1010k90582K86990m5294
16547A979130j25350N1406L89935m71603p3300k926L80725j58181k65313J46766
16537A851289J48773k34762M3379l4045j55597k02112J03233M0086r3285O8992
16527A535951K4098j13607K83837j12212j81993L08178k06675l08912J32497p3353
16517A287809J27286o7862K29185k25721J78699q1960k84290L00227K00542n18784
16507A145131m8213K6558J25208j7975L9282j2900K7137k74425p2637M06433l95669
16496I47930O16380n95265L2900P9981L50933o08359K57580J43038l93552k60447
$$ y = [2679247, 2129719, 2416466, 2414421, 2706222, 2573629, 2197213, 2297285, 2475183, 2110220, 1848238, 1904216, 1970745, 2314526, 2244038, 2044069, 1947006, 2028016, 1737434, 2024424, 1979130, 1853780, 1905186, 2295121, 1823518, 1750218, 1747292, 2128017, 1969836, 1704523, 1851289, 2000062, 1765300, 1808679, 1774634, 1619037, 1416925, 1520158, 1560244, 1466959, 1535951, 1560049, 1446442, 1730279, 1618067, 1436074, 1744252, 1537577, 1228665, 1361162, 1287809, 1415095, 1347233, 1576418, 1350697, 1529396, 1447436, 1163146, 1463373, 1663915, 1145131, 1096918, 1123476, 1248684, 1230709, 1269991, 1257091, 1284228, 1009803, 937166, 1343599, 947930, 1564310, 969045, 1001945, 1081926, 1432859, 824500, 1082080, 1225118, 831566, 571119]
16486E71119L55796j08977L49770j54343K23239k22035l55668O95260k30909l77711
16476G45541Q5174M33196k30380N5026M4947l00380K39416r4368l88413K03815
16466G93574O6255r2161M2471p3317N5942J25985j18792l9258K55959j95488k74336
16455E46834L23510r0683K57280k35582j99711K26285k52600P4175N0398L666
16445G03572K3027C03299J39537J56704M54692l40151J9268K94468l14026j10640
16435F03151J36072L8189m3697k02394P9387J05159n7334q845j16274O0931k5807
16424E68538K26115j82685P3438k27023M15540O2610k58327j07327K7198r1364
16414E06713j5183J35688k21280K81058n5310J72924n6294l58742K33680k02270
$$ y = [571119, 926915, 817938, 1167708, 1013365, 1236604, 1014569, 658901, 1354161, 1123252, 745541, 830715, 1263911, 1033531, 1088557, 1133504, 833124, 1072540, 978172, 589759, 793574, 859829, 767668, 810139, 736822, 792764, 918749, 799957, 760699, 1016658, 821170, 546834, 870344, 779661, 1036941, 801359, 601648, 827933, 575333, 649508, 699906, 703572, 726599, 303299, 442836, 599540, 1054232, 714081, 733349, 1027817, 713791, 603151, 739223, 777412, 733715, 531321, 610708, 715867, 658533, 649688, 533414, 594345, 568538, 794653, 611968, 685406, 458383, 873923, 936533, 678206, 570879, 598077, 506713, 491530, 627218, 405938, 686996, 631686, 804610, 748316, 389574, 623254, 420984]
16404D20984Q0099m7334J89268j25821M10507l37741Q8054J39520k87120k1466
16394E08950R0742r9955J91636C10295R2598K96614j14463m2480m053Q3366l01931
16383C19946R67J75491J32627k13002O7454J28221B15007K40159Q3032j07741
16373D30457p2370L2183J89227J22150j82210m5505A80242J9506J73078o5671
16363C07155N8750K19024o9199H9121J73137M36091b6797E02639B17403O5083
16353B82486M8222j2209o2134J34956J19359k43156j0078J8852L6329K78113B01362
16341A44086M8516J15421j7075J60656j19871k2805K58031B48086M0100o6199
16331B21987J45716j16491L87835p3021B33958q5337K69965j58992K28892j49948
$$ y = [420984, 501083, 453749, 643017, 517196, 927703, 589962, 678016, 817536, 530416, 508950, 599692, 499737, 691373, 310295, 402893, 699507, 585044, 542564, 538511, 621877, 319946, 320913, 496404, 629031, 416029, 483483, 611704, 215007, 455166, 538198, 430457, 358087, 390270, 579497, 701647, 519437, 473932, 180242, 199748, 372826, 307155, 365905, 584929, 515730, 89121, 262258, 698349, -26797, 502639, 217403, 282486, 330708, 318499, 256365, 391321, 510680, 267524, 257446, 276298, 312627, 590740, 201362, 144086, 192602, 308023, 290948, 451604, 331733, 308928, 566959, 248086, 288186, 221987, 367703, 251212, 639047, 566026, 233958, 148621, 418586, 259594, 488486, 338538]
16321C38538B9648J51008R2691p6785O38701C41989j0462b2859D33153k317l0573
16310D00263A43120K33264j34200K55872j60920m0003O9174A51581o4504J92340
16300B79417p8524o7272L7806O6506J98869B10139J07449Q9221A56001c388A43372
16288A43987P4199M9158r2382J44354I1262R2623E5519L54210E2563L19968A56113
16276E8738Q8873j1648g9939B16235M4984J19047L2877q4486j35857J56959A30646
16264B27237p8221K16724j8760k1353D2623i1742D33404j07574j321j54185j572
16253A68752o7467k4774K08777L9823q3756Q5287j8900j39663n9138K18360A6795
16241A5418M29597C4097K06398n0912L1200M517n0320O4221l0384J60545A51327
$$ y = [338538, 29648, 180656, 273347, 196562, 835263, 341989, 331527, -22859, 433153, 430836, 400263, 143120, 376384, 242184, 498056, 337136, 297133, 366307, 151581, 87077, 279417, 200893, 133621, 171427, 237933, 436802, 210139, 317588, 406809, 156001, -3388, 143372, 143987, 218186, 267344, 174962, 319316, 91262, 183885, 55519, 409729, 52563, 372531, 156113, 58738, 147611, 135963, -79939, 216235, 261219, 380266, 413143, 328657, 192800, 349759, 130646, 227237, 149016, 365740, 346980, 325627, 42623, -91742, 433404, 325830, 324509, 170324, 168752, 101285, 76511, 285288, 325111, 241355, 326642, 307742, 168079, 108941, 327301, 16795, 15418, 445015, 34097, 240495, 189583, 220783, 225300, 174980, 239201, 208817, 369362, 151327]
16229B32008I9559J83252A21871J79819j29819N747P653K00022m5581j41022r5649
16218A03041J92522g8645C44218J59833E6725K20626E1641M2029l1606K07271
16208B69335L4983E0841J79210H0665K04888r0725J61023A19533K31418g4590
16197a96605Q0889A85571m238m139n145a97450f4793B19686M09819g3083c4867
16185A2114M07857B321J5449d9961A22723J09060j3270e4763B67110P981A1543
16173h6687D9047Q233f7673D83743j63770A36770L82238b1960C41320K241H7134
16161A51644b9045C62479e4409A67529o5337a7374A10736P473k8920C7885b10980
16149E3658J3559M9514j4622a13282m0431I5411J04935N1501i7196B56800I8310
$$ y = [232008, 99559, 282811, 121871, 301690, 171871, 177618, 185271, 385293, 339712, 198690, 103041, 295563, -78645, 344218, 504051, 56725, 277351, 51641, 93670, 62064, 269335, 304318, 50841, 230051, 80665, 285553, 194828, 355851, 119533, 350951, -74590, -196605, -115716, 185571, 181333, 177194, 172049, -197450, -64793, 219686, 629505, -73083, -34867, 12114, 419971, 2321, 17770, -49961, 122723, 231783, 218513, -54763, 267110, 275091, 11543, -86687, 49047, 57280, -67673, 483743, 319973, 136770, 519008, -21960, 341320, 343561, 87134, 151644, -29045, 362479, -54409, 167529, 102192, -17374, 110736, 118209, 89289, 37885, -210980, 53658, 67217, 116731, 102109, -113282, -153713, 95411, 200346, 251847, -97196, 256800, 98310]
16137a54237C8296K28096e3394A15357a97211f3855B1479J54167a45760D31375
16126A77585e4668j06524E5458Q6283M5090J19645k147B1233R3354K32230a61853
16114a90988e25B3426c7770E555e1474j65394g0194A08303d4747j51780q8083
16103b84610B56647J11788j68488G0254K12446J69368B7021P4479L2277J73318
16093C07095f0170C5922J66969a37704J3672m8699A10590M1411F3557j6002a70002
16081a02978q942e2297C5360a7644A53453c20335i3442k19746A2491Q4802e8107
16069d7272j5691C242O6388A6310d0890k9020l0662j42184R1620d6768C6744b31868
16056C45181B4910e6160C41271b11237P9926L5211M2662a4420H7730g6368l5619
$$ y = [-154237, 38296, 266392, -53394, 115357, -197211, -63855, 21479, 175646, -145760, 431375, 177585, -54668, -161192, 55458, 141741, 186831, 306476, 304329, 21233, 114587, 346817, -161853, -190988, -525, 23426, -37770, 5555, -51474, -216868, -70194, 108303, -44747, -196527, -284610, 256647, 368435, 199947, 70254, 282700, 452068, 27021, 101500, 133777, 307095, -60170, 35922, 202891, -137704, -124032, -172731, 110590, 152001, 63557, 47555, -170002, -102978, -111920, -52297, 35360, -17644, 153453, -320335, -93442, -313188, 12491, 97293, -58107, -47272, -62963, 3242, 69630, 16310, -40890, -69910, -100572, -242756, -151136, -46768, 36744, -231868, 345181, 24910, -56160, 341271, -211237, -131311, -96100, -53438, -14420, 87730, -76368, -111987]
16045a11987c4214o3377m3284B07408K58787a19758I3559b36400Q2080B25489
16034a42154j53859d9114K4091I5095a57188c3300k95510a32171E3467a52594
16023F4496F183a23629L0425A02238a82781A87163F8431L0311B3419a24610e3721
16011D07281b28392F3205L9358M0369P0508L908d85793d5328j9970a9264D8274
15999a68268M3996a6830D2266d1701B06424J14834B2038c0985h379F6089M164
15988G0253b1660C45471d5848A62624P1409l4716n2472K45699a14200B20939b31496
15976A21093h5261m8476O4681j21417f0009i724o3383K3478P59a4709k6717j09193
15964a50619A15874i584q8185A29320a95130F3013g2924K4988j93446J08063k47359
$$ y = [-111987, -34214, -97591, -140875, 207408, 466195, -119758, 93559, -236400, -154320, 225489, -142154, -296013, -49114, -25023, 95095, -157188, -33300, -328810, -132171, 53467, -152594, 64496, 6183, -123629, -93204, 102238, -182781, 187163, 68431, 98742, 23419, -124610, -53721, 407281, -228392, 63205, 102563, 142932, 213440, 217348, -485793, -45328, -65298, -19264, 48274, -168268, -124272, -16830, 42266, -41701, 206424, 321258, 22038, -30985, -8379, 66089, 70253, -21660, 345471, -45848, 162624, 234033, 199317, 146845, 392544, -114200, 220939, -231496, 121093, -85261, -133737, -69056, -190473, -60009, -9724, -73107, -49629, -48870, -14709, -41426, -150619, 115874, -9584, -97769, 129320, -195130, 63013, -72924, -47936, -241382, -133319, -380678]
15953c80678J73131A74706K17588a66250q8970k42427A76330G5676K87101A36516
15942D4280b16563G3692b6029k05804Q4316I7822N4864C3922J38709a5318G8494
15930A45519a73367B56510E2307J9441N9345a31634K4739i913j08810E0118a27685
15918b47275b8069A09523j7180a25224E1616J3279b31926e5004A3584K6612a07245
15906a75635C8885b23592m2282D7487b89153B13671l567m6420M7630q0808r555
15895A20951a83831L1858A0078J59849a48610m3287f4082B732a27482B81860D3012
15883G2897J16737H6299l2747a05821N0035A69019a14203K8168j7896k30429J34611
15872a99749g7754o5095j27327a30366d0904j35965b388H5206d8500A41064J3934
$$ y = [-380678, -207547, 174706, 392294, -166250, -255220, -497647, 176330, 75676, 362777, 136516, 44280, -216563, 73692, -26029, -231833, -147517, 97822, 152686, 33922, 172631, -15318, 78494, 145519, -173367, 256510, 52307, 71748, 131093, -131634, -106895, -9913, -118723, 50118, -127685, -247275, -28069, 109523, 92343, -125224, 51616, 64895, -231926, -55004, 13584, 40196, -107245, -175635, 38885, -223592, -265874, 47487, -289153, 213671, 210104, 163684, 211314, 130506, 120951, -183831, -151973, 10078, 169927, -148610, -191897, -64082, 2732, -127482, 281860, 43012, 72897, 189634, 86299, 53552, -105821, -55786, 169019, -114203, -86035, -103931, -334360, -199749, -77754, -142849, -270176, -130366, -40904, -176869, -2388, 85206, -48500, 141064, 154998]
15861A54998A8564L0727L42651g6178E4658a54928e5640A9708J80895H9320a2558
15849F2239g4274m4569e4412C7695a66994I2703a0640j54216D7922J53283i1240
15837i6956A88481m4001J66528b06993E2151a49898O3894A62390l7550a39822
15826G7423g9927j26940A23289K00204F3811J1196e5177n992o6363l13943f3307
15814b25544K0996f270j01028j46699R7409A6029O8064J25985a41889d3037j38739
15803a81776Q6343A54432N9137H8852B1210i2413O831A53549h2241p2960A98429
15791b54001i9728j42536Q3405d8909j51448H7162b8141k9955D684K19463B4549
15779b54421K1226Q1896C3648c13572r0663e2268o6842e4329k44021A26273J18244
$$ y = [154998, 18564, 49291, 391942, -76178, 54658, -154928, -55640, 19708, 200603, 89320, -12558, 62239, -74274, -118843, -54412, 37695, -166994, 92703, -10640, -164856, 47922, 201205, -91240, -96956, 188481, 144480, 311008, -206993, 52151, -149898, -86004, 162390, 124840, -139822, 77423, -79927, -206867, 123289, 323493, 63811, 75007, -55177, -61169, -127532, -441475, -63307, -225544, -204548, -6270, -107298, -253997, -156588, 16029, 84093, 210078, -141889, -43037, -181776, -95433, 154432, 213569, 88852, 21210, -92413, -85582, 153549, -82241, -155201, 198429, -254001, -99728, -242264, -158859, -48909, -200357, 87162, -28141, -58096, 4684, 224147, 24549, -254421, -233195, -151299, 33648, -313572, -404235, -52268, -119110, -54329, -298350, 126273, 244517]
15768B44517a86237j04173B40419a98643B84592G3780c89590P0274a06218C0419
15757C74554A86148O9198J11737a9441J23k19939i5747k10096G9500j0883Q320
15746G6937J03837E5640P321F163M0360d1439G4608L9059a93548M4965k3475j29189
15734c01247B717J94930K7409c05356b842C3398O4807G967J37410R9405D8866
15722D7344h5037A10680GL43188g39373a74778A01619B4160b76884B0343a72826
15710I2933j8432J40278F1991M8577a94163n8772M5233h7880B3773g8593A6940
15698a077j33725I14b71632a5384j30017K8472j3172B6392J36958b8199o5539
15687i3738b799k33753M7497H927M0858d2579J8450B5567b87479A05279f0639
$$ y = [244517, -186237, -290410, 240419, -198643, 284592, 73780, -389590, -319316, -106218, 30419, 374554, 186148, 255346, 367083, -19441, -19318, -239257, -95747, -305843, 79500, 68617, 76937, 180774, 55640, 62961, 6163, 46523, -41439, 74608, 113667, -193548, -148583, -172058, -301247, 2717, 197647, 225056, -305356, -2842, 33398, 98205, 7967, 145377, 244782, 48866, 47344, -85037, 110680, 7, 343195, -739373, -174778, 101619, 24160, -276884, 20343, -172826, 92933, 74501, 214779, 61991, 110568, -194163, -252935, -207702, -87880, 23773, -78593, 16940, -1077, -134802, 914, -271632, -15384, -145401, -116929, -130101, 26392, 163350, -28199, -93738, -2799, -236552, -189055, 8927, 49785, -42579, -24129, 25567, -287479, 105279, -60639]
15675A2659f6026J5673k0675j62456O0946F9564K4299K91627A7028d3914j76280
15664b20194L8207A97424h8229B02664J42649D8793r726b61738B63467a31489
15653c02043k5171g1199i304H7450C6883f6452p5897f9663c1730F9898a31986
15641a2883k47080Q1852A42764b45644B05220b59409a10897a6162l12494I7635
15630b35766A28477b26305m9242a25304L5974A16825I931J81088C6543K76058
15620C12601a14246A22010m6985a95382L9288m6066I1337g5822F610J80696a27850
15608F7334a97153f2996j85532D386a10767G9041a00224C2541N2694a31128a0822
15596C5995g492A02127B4310a89218B6237a47362A57406g2226J5636p0669D8144
$$ y = [12659, -66026, -50353, -71028, -233484, -172538, 69564, 93863, 385490, 17028, -43914, -220194, -181987, 197424, -88229, 202664, 345313, 48793, 39067, -261738, 263467, -131489, -302043, -327214, -71199, -9304, 87450, 36883, -66452, -142349, -69663, -31730, 69898, -131986, -12883, -259963, -178111, 142764, -245644, 205220, -259409, -110897, -16162, -328656, 97635, -235766, 128477, -226305, -275547, -125304, -89330, 116825, 9931, 191019, 36543, 312601, -114246, 122010, 75025, -195382, -156094, -202160, 91337, -75822, 6610, 187306, -127850, 67334, -197153, -62996, -248528, 4386, -110767, 79041, -100224, 32541, 85235, -131128, -10822, 35995, -7492, 102127, 24310, -189218, 26237, -147362, 157406, -72226, -56590, -127259, 48144]
15584A3396K48833a63841d7648b1414l46692a30765f0753C25093E9262h2892C29870
15572d3641A30183f6654O064k1192I3788l0602K60892c86263A06745g9727C35668
15560d6856C20187D4113B0257P697J14343b01767b1468p4232J5075B81685a40621
15548A4521a22706j13989i3807d6848k7466B69443j19158o9359c26070k2078J41237
15537b06911g2921A8101J20843a84849h7710C4108a73437D3612J7954a23274F6588
15525C3373a80858b9078i57m3561j74294A29248B1499a65635k3947A53235L11543
15514D64778k22032I0489N0176a0178A55965g3832j18878f3027j73650J13101
15504a23576I5300a21294d5008m2462A37268M6255M0185A1410K5743A0237K712
$$ y = [13396, 262229, -163841, -47648, -21414, -368106, -130765, -60753, 325093, 59262, -82892, 329870, -43641, 130183, -66654, -60590, -81782, 93788, 63186, 324078, -386263, 106745, -79727, 335668, -46856, 320187, 44113, 20257, 27954, 142297, -201767, -21468, -95700, -80625, 281685, -140621, 14521, -122706, -236695, -93807, -46848, -74314, 269443, 150285, 80926, -326070, -348148, -206911, -72921, 18101, 138944, -184849, -87710, 34108, -173437, 43612, 61566, -123274, 66588, 33373, -180858, -29078, -957, -44518, -218812, 129248, 21499, -165635, -189582, 153235, 464778, 242746, 90489, 140665, -10178, 155965, -73832, -192710, -63027, -236677, -123576, 95300, -121294, -45008, -87470, 137268, 183523, 223708, 11410, 37153, 10237, 12949]
15493A2949a30469m2795A16831c66701J58778N9313A7559d69080K05729A53732
15482B07484b08419d284E1470M11045A18188d4868o9382N1058j18317c5328p0277
15471a05605B63781O4851a61817C26037g6851E5816a33638j48025I9847j9761
15461H0086K01358L1531L7462j13317i4351A93245K0894e6994F0328K41892a82000
15449B53843b9358A13407a25254M6298F8087a01853H5074a76554L8766k13873
15439c51661A14672f8661p9786P3819k61442C92911F4440M9115K1981J44438q8710
15428A91264a98938L5422A74509E8200m546K31860F9341h9494k39806B05253F3975
15416a99230h8054r0539B73425d0015G329O3969B0420a05370B07632i4706l16507
$$ y = [12949, -130469, -173264, 116831, -366701, -207923, -148610, 17559, -469080, -263351, 153732, 207484, -208419, -4284, 51470, 462515, 118188, -44868, -114250, -63192, -181509, -35328, -105605, 263781, 328632, -161817, 326037, -76851, 55816, -133638, -281663, 99847, 80086, 281444, 312975, 350437, 237120, -94351, 193245, 214139, -56994, 60328, 302220, -182000, 253843, -29358, 113407, -125254, -78956, 68087, -101853, 85074, -176554, -137788, -351661, 114672, -68661, -148447, -74628, -336070, 392911, 64440, 113555, 135536, 279974, 191264, -198938, -163516, 174509, 58200, 53654, 285514, 69341, -89494, -329300, 205253, 63975, -199230, -88054, -178593, 273425, -40015, 7329, 71298, 20420, -105370, 207632, -94706, -411213]
15405d11213A34462c92968b4672C81153j48601a09068b2475n0894B7973J90666
15395B18639c04254O9772b3101k98673I9997c36771D6862a82432m9498A80087
15384b104l9597A0777c72882A44080m5133a26768B31328I2997e0317a552j58237
15373a59789k1491q6919i5320o2751o7585a04300L3847B11259e2420o6062A00121
15361a50655C9779L65999A75170L1685n2730b79671E9274a58491f5298k01697
15351b66995P2555I0582Q0883e2993j45624D8838J1621J70823B4040d8855J0245
15340c8610j18416j4263c2158j84316B72980a60392N2853I3330i9156P492A04111
15328B4577N4101L8052E78b4344B63251m7075e133m00560a87864L3834I010a01547
$$ y = [-411213, 134462, -392968, -24672, 381153, 232552, -109068, -22475, -73369, 27973, 218639, -304254, -234482, -23101, -321774, 99997, -336771, 46862, -182432, -231930, 180087, -2104, -41701, 10777, -372882, 144080, 98947, -126768, 231328, 92997, -50317, -1552, -159789, -181280, -268199, -95320, -158071, -225656, -104300, -70453, 211259, -52420, -118482, 100121, -150655, 39779, 405778, 175170, 206855, 154125, -279671, 59274, -158491, -65298, -266995, -194440, 90582, 171465, -52993, -198617, 48838, 60459, 231282, 24040, -48855, -38610, -157026, -171289, -32158, -216474, 272980, -160392, -107539, 93330, -99156, -91664, 104111, 24577, 78678, 116730, 578, -24344, 263251, 216176, -5133, -405693, -187864, -154030, 9010, -101547]
15315b32708f3226A05287L3956o4044b59769B4739g4272j21090C02107c6593A31886
15303B15869a9136B1578K89326p5915a60128G5359J31767R2542A12947O6586C5883
15291C5723K22146b34536a7693j12870E45499k09075A16083a05330k5133N5897
15281g4566B11680J79923I631K31437r9276B5053l658J78734e7607m4797k6792
15270a29196D1818J4497J49055a91779G1235h80F6318K13855N2500E6128A9804
15258B01241b6163j34249P3301C9471K31903A21372K3553h9532e128D7854R04294
15247I52148J152985l89929n2380P74388A166080B48327J82514a02728B79633
15237B19881A1755K54073b62825B4566J24743L16776a42926A5835i460p921G997
$$ y = [-232708, -63226, 105287, 139243, 75199, -259769, 24739, -74272, -195362, 302107, -36593, 131886, 215869, -19136, 21578, 310904, 234989, -160128, 75359, 207126, 299668, 112947, 179533, 35883, 35723, 257869, -234536, -17693, -130563, 545499, 336424, 116083, -105330, -130463, -74566, 211680, 391603, 9631, 241068, 141792, 25053, 21395, 200129, -57607, -102404, -129196, 41818, 56315, 205370, -191779, 71235, -880, 66318, 280173, 332673, 56128, 19804, 201241, -26163, -160412, -87111, 39471, 271374, 121372, 144925, -89532, -5128, 47854, 952148, 2105133, 1715204, 1662824, 2437212, 1166080, 248327, 430841, -102728, 279633, 219881, 11755, 265828, -262825, 24566, 149309, 466085, -142926, 15835, -9460, -17381, 7997]
15225A46716k8263k0245j1566b04154e7012B73009i7097B18448B8781h6530G2824
15213a38868o762D097J65041J08374e5237A6221J90622L04858B27983A12414K09626
15202C22040J12233A01282Q5998b20170B21496a22216j69876g77E743g558B91368
15190D451K42681L5465k4729C0975i2694j5272C12611j13255I0432K0540K62392
15179C73364j12911E2854J67753J5129j2928F1106k1313a436B06808d7896A34873
15167E2773K20093m1632e2281A56480o8427j0330J2707K0997Q4168b09722E73761
15155B90510d9849q3916f4635B87654d33127A94071e1966A60022n8334l3902J10605
15144A78391M9727q0814b00527C2511R4880J31400F7251L8148a44459A00855G291
$$ y = [146716, 118453, 98208, 86642, -204154, -57012, 273009, -97097, 218448, 28781, -86530, 72824, -138868, -145630, 4097, 169138, 277512, -55237, 16221, 206843, 511701, 227983, 112414, 322040, 434273, 101282, 187280, -220170, 221496, -122216, -292092, -777, 5743, -7558, 291368, 4451, 247132, 282597, 257868, 30975, -92694, -107966, 312611, 199356, 90432, 110972, 373364, 260453, 52854, 220607, 235736, 222808, 61106, 39793, -1436, 206808, -47896, 134873, 52773, 272866, 231234, -52281, 156480, 88053, 77723, 90430, 111427, 195595, -209722, 573761, 290510, -49849, -133765, -64635, 287654, -433127, 194071, -51966, 160022, 101688, 67786, 178391, 228118, 147304, -200527, 32511, 127391, 258791, 67251, 105399, -144459, 100855, 7291]
15132A48097C3784J46680H0584d8094G7596b01372I8208q544M5444K15175A36766
15120b10834J7891C651J47359i861D04170b79954C15731A17407R9567p4038b8678
15108C2627b04360A50429D0574O4705B553J58645i0579D7699J55811F8821a78644
15096i6320I4242J13922p1508K11944b847j21484F5956J36748J40808j18427H3472
15084F8932C027L46693a83102A06336C788Q3397l1903R9169J08558I0769B5806
15072B41001C1821O1183m2455J78961d2348C2669J03855J99656g4125A34937Q2979
15061B17916J13903a95481A7822e2838C85837j59788H5077J82722m536I2694i2195
15049A71855a1672L787E0767L59989M3903j79541K22105j98211H7660B9545J32449
$$ y = [148097, 33784, 180464, 80584, -48094, 77596, -201372, 98208, 89664, 135108, 350283, 136766, -210834, -192943, 3651, 151010, -9861, 404170, -279954, 315731, 117407, 216974, 142936, -28678, 32627, -204360, 150429, 40574, 105279, 2553, 161198, -90579, 47699, 203510, 68821, -178644, -96320, 94242, 208164, 136656, 348600, -2847, -124331, 65956, 202704, 343512, 225085, 83472, 68932, 3027, 349720, -183102, 106336, 3788, 87185, 55282, 154451, 263009, 90769, 25806, 241001, 31821, 93004, 50549, 229510, -42348, 32669, 136524, 336180, -74125, 134937, 217916, 331819, -195481, 17822, -52838, 385837, 226049, 85077, 267799, 263263, 92694, -92195, 171855, -11672, -7885, 50767, 410756, 454659, 275118, 497223, 299012, 87660, 29545, 161994]
15038A61994K65023a47057C18237A27382a38653c7421B15865N243F9843M0316
15028A10159K39351a12562A69283J7748J05479R2190N1293B07807n9485R8528
15018B46850A02259J4466J10576o4704L2910B0280L63506j50486H4474k0134K84391
15007C48731j35162n7917a19751A87281l9605A6962K47092A05968K24692R2648
14997D23308a12499C89665K0559a20084A46711J72288A48007J70679J2230p7865
14987B53051j06356P8753h6679C8105A1022K2066i22B7689L9066R8675R3382A19912
14974A01603h5866C33501A20979J30881O0465k4449L4245L8999C6656J2137L05445
14963C54238P802j05430K7969L4093N9461L1270m5957j65846J2009O0033j09985
$$ y = [161994, 427017, -147057, 318237, 127382, -138653, -37421, 215865, 221108, 69843, 110159, 349510, -112562, 169283, 187031, 292510, 384700, 435993, 207807, 148322, 246850, 102259, 116725, 227301, 162597, 195507, 20280, 383786, 233300, 84474, 64340, 348731, 213569, 155652, -119751, 187281, 147676, 16962, 264054, 105968, 330660, 423308, -112499, 389665, 410224, -120084, 146711, 318999, 148007, 318686, 330916, 253051, 146695, 225448, -86679, 38105, 11022, 33088, -922, 27689, 66755, 165430, 258812, 119912, 101603, -85866, 333501, 120979, 251860, 312325, 287876, 322121, 361120, 36656, 48793, 354238, 362040, 256610, 284579, 318672, 378133, 409403, 363446, 197600, 209609, 269642, 159657]
14952A59657R8253J4623M3973A19577J96222F6354j0384K81144r6489J1889m8631
14941B03883K02101j26512n7335l5050J16860r7868B67K08610n1145i5772j40300
14930b36072C58904J0556j32361L01401E4679J59610J5040K81516R2020k67190
14920C35675A49097M4455r4731N4806K78176A38835K61287J27733A92283F4012
14909A02659O6265Q8875g5029a752C57689j18246C3556N14126G6375J7709K72864
14898C66948K01411j82911A84337p8746J08001l7504K67449M3710j0985m9555
14888D26707j99954I1474J26075K65207k00695C960M15158j62587R8248l2950
14878C21829J38408k6243o325A12978J90404o1617L6197J78671j04714j4725m4563
$$ y = [159657, 257910, 272533, 316506, 119577, 315799, 66354, 55970, 337114, 240625, 252514, 203883, 405984, 279472, 222137, 187087, 303947, 206079, 267, 208877, 157732, -95772, -236072, 358904, 369460, 237099, 538500, 54679, 214289, 229329, 510845, 602865, 335675, 149097, 193552, 98821, 153627, 431803, 138835, 400122, 527855, 192283, 64012, 102659, 168924, 257799, -75029, -1752, 357689, 239443, 33556, 547682, 76375, 94084, 366948, 568359, 385448, 184337, 105591, 213592, 176088, 443537, 487247, 476262, 426707, 226753, 91474, 217549, 482756, 282061, 3960, 419118, 256531, 354779, 321829, 460237, 433994, 427669, 112978, 303382, 241765, 277962, 456633, 351919, 337194, 292631]
14867B92631G1090L75680K0481m4148j93649j23p600K54234k29730J20615r3722
14856B73128J0467p0953J49673J4829O6424j15652J58281m2426j86150J0199L58456
14845F26276k40582p1264N1091R9186j22013J93120k9107p3756A24156L65661
14835D89817K01354j22974o1550k29805j15051J46971J68744m2889j50030L73635
14825F58222J27746r1277j20641B62321J93147L5890N1852B29380K12086k042
14815D39424j15929N2227K09936k27110k3177J34169A01284J29524K07737A25246
14804E02151r9618K39189k46598J7693j00037J10163j45321o6855M13570L1324
14794F55661m6539J16211j23039k82486J88294K84180o3726p2717l11177K7559
$$ y = [292631, 71090, 446770, 467251, 423103, 229454, 229331, 221731, 475965, 246235, 366850, 273128, 283595, 212642, 362315, 377144, 443568, 327916, 486197, 443771, 257621, 267820, 626276, 385694, 314430, 365521, 464707, 342694, 535814, 506707, 432951, 124156, 489817, 691171, 568197, 506647, 276842, 161791, 308762, 477506, 434617, 284587, 658222, 785968, 694691, 574050, 262321, 455468, 491358, 543210, 229380, 441466, 439424, 323495, 375722, 585658, 358548, 335371, 469540, 101284, 230808, 438545, 125246, 502151, 402533, 641722, 395124, 412817, 312780, 422943, 277622, 210767, 624337, 655661, 609122, 725333, 602294, 319808, 508102, 792282, 728556, 655839, 344662, 372221]
14784C72221L4107J35055K7157J16770j44173r749j36621j39128J18596J48951
14774E23186j31803K23641M2999j26629O2568m9666k734O875K93123j26482r8378
14763F16700q6698j07113J8707J24346j91824N07175l76901k745P3411k59354
14753C15704L49557l02661L07870K53175C59660K69773n717N10J86070p0077B89915
14741F25594j6825B77793J57544L52638J75566j2664k43846p6784K02495B62262
14730F57919J60245j11038j58799J65965k67104N0075K99605o5717r4353N3605
14720F90403j49296j26716J16509K99686m4331k08592J29637J38680l76079J60094
14710F29995j66332p7660M46184P4372j64958j95808L44804q1063J33760l81559
$$ y = [372221, 406328, 541383, 568540, 685310, 541137, 531388, 394767, 255639, 374235, 523186, 391383, 615024, 658023, 531394, 593962, 544296, 541562, 548437, 841560, 715078, 616700, 530002, 422889, 441596, 565942, 374118, 881293, 504392, 501647, 575058, 315704, 665261, 362600, 670470, 923645, 359660, 629433, 623716, 624226, 810296, 740219, 289915, 625594, 608769, 277793, 435337, 787975, 963541, 950877, 707031, 630247, 832742, 262262, 657919, 818164, 707126, 548327, 714292, 447188, 497263, 796868, 731151, 636798, 690403, 541107, 414391, 530900, 830586, 786255, 577663, 707300, 845980, 469901, 629995, 463663, 386003, 832187, 906559, 741601, 545793, 890597, 809534, 943294, 561735]
14700E61735n3905K36241Q7307k37260K14423o0524O0221J14860r8772k22899
14690F01427N47049m27511n9200M03232m39806K76505o2799J64139m55414L36611
14680H84233l5349k31394L51890P8585k50361q0097J14694J20402p7003J16696
14670I92296M755n4926L3875n7835j1195r0992K76002j94932k59858Q38498m03230
14659A072458l66290K73383k01841L25361K7639L2364j56590L7182J11182j35775
14649A019073J56142J19188j20012j93371r856J78345k55653J46439J33236k28829
14639I44702L52779k90510k6249M2587M8041K96859k62909k28208N79499l62216
14629A094375K09884m6936j43486J47722p0850J20522O8659j89887j9692m8490
$$ y = [561735, 507830, 744071, 831378, 594118, 808541, 748017, 808238, 923098, 824326, 601427, 1148476, 720965, 661765, 1064997, 625191, 901696, 838897, 1003036, 547622, 884233, 848884, 617490, 969380, 1047965, 797604, 717507, 832201, 952603, 875600, 992296, 997051, 942125, 976000, 918165, 906970, 815978, 1091980, 897048, 637190, 1475688, 1072458, 706168, 979551, 777710, 1103071, 1130710, 1163074, 1006484, 1043666, 1154848, 1019073, 1175215, 1294403, 1174391, 981020, 971164, 1149509, 893856, 1040295, 1173531, 944702, 1297481, 1006971, 980722, 1023309, 1071350, 1368209, 1105300, 877092, 1456591, 1094375, 1304259, 1257323, 1113837, 1261559, 1190709, 1311231, 1379890, 1190003, 1170311, 1121821]
14619A121821N52637k88092j93929K00034J48544l0124k03913J89163l3242j74913
14609A287986L2450J83884l43100M38122k35753j1370j71316M98315l42172J52096
14599A489142N1891j62065J99423L0561j18165j79114L95514N0370l59086J76245
14589A574716l48658L36702N1137K47216k79655K04903L3689j7040N2962l23281
14579A532691K28032r5090L56908m72429M28446l26064M21034k33771Q1125N7471
14569A978353K00810l40780L70374J29813K04257k04387j22999P9161O5719j7297
14559B343024J98026N8098l1438J77934N0732L32341N62194J23656O57375P40411
14549E212353J652103L736166R835080K1989385O06464A6689899p599664j730960
$$ y = [1121821, 1674458, 1386366, 1192437, 1392471, 1541015, 1510891, 1306978, 1496141, 1462899, 1287986, 1320436, 1504320, 1161220, 1599342, 1363589, 1352219, 1180903, 1679218, 1337046, 1489142, 1541033, 1378968, 1578391, 1608952, 1490787, 1311673, 1707187, 1757557, 1398471, 1574716, 1226058, 1562760, 1613897, 1861113, 1581458, 1786361, 1820050, 1803010, 1855972, 1532691, 1760723, 1665633, 2022541, 1550112, 1978558, 1652494, 2073528, 1839757, 1920882, 1978353, 2179163, 1838383, 2208757, 2338570, 2542827, 2338440, 2215441, 2294602, 2360321, 2343024, 2541050, 2599148, 2567710, 2745644, 2796376, 3128717, 3690911, 3814567, 4471942, 5212353, 6864456, 10600622, 20435702, 42425087, 43031551, 16689899, 9090235, 7359275]
14541G359275C435164j337486m76475J2277K56664k44760J21037R31j38099L61570
14531A990823k77235j00213M86339m64937P34121j05013j53862L6020p2694K84577
14521B357926N7672r0792P7263J38782l59372j16982o575J32917L51105l50033
14511B191911o8724L15714j2233k6846n4425M00123N6788q1238L5373k4668K05069
14500B936844m6511j02550l3922L27958o1003P956l8158L84314L4931j84861r9312
14489C125686K06734k24325M44046j05830P4618k84675J09446K61855m41747L43451
14479C509259N99981n76108j36134L6812M05836l36808N28885j17890O6889j55093
14469C825629J20353K26991k7042l444j79799N79880j64344j67076k7948L0387
$$ y = [7359275, 3435164, 2097678, 1621203, 1633480, 1890144, 1645384, 1766421, 1767352, 1629253, 1990823, 1713588, 1613375, 2099714, 1634777, 2368898, 2263885, 2110023, 2146043, 2073349, 2357926, 2415598, 2324806, 2402069, 2540851, 2181479, 2064497, 2057922, 2190839, 2541944, 2191911, 2123187, 2438901, 2426668, 2399822, 2345397, 2745520, 2802308, 2721070, 2756443, 2731775, 2936844, 2890333, 2787783, 2753861, 3081819, 3020816, 3028772, 2990614, 3374928, 3409859, 3224998, 3125686, 3332420, 3108095, 3552141, 3446311, 3520929, 3236254, 3345700, 3607555, 3165808, 3509259, 4109240, 3533132, 3396998, 3433810, 3839646, 3502838, 4031723, 3913833, 3980722, 3825629, 3945982, 4172973, 4145931, 4142487, 3962688, 4542568, 4378224, 4211148, 4183200, 4213587]
14459D213587L11680Q2616l36687J78724L35429j99945N9786K17872m1068K71255
14449E093249K16235k55466k45311M72234n7913k1215L72720k14442R4115K6094
14439E480300K60182K29184n1870o1106J52886R7072L06671l66641J85039L37643
14429F569360k78192K58374L14284j51066J84938l04040M93880r7848J22342O00536
14419G712568m54455K51897p7214L66389j39699P0584L69370L3716J17432J15921
14409H366509J63612J52225J9546K70933J16080J82885j06018K52168n674M50947
14399I863213j83784N23340J17126J18986M9858J75045L66379L0965P0339O61326
14389A1792793M6810k53685N05267J78460J67110O4287Q84332n85727N27421J40315
$$ y = [4213587, 4525267, 4607883, 4271196, 4449920, 4785349, 4585404, 4645190, 4863062, 4821994, 5093249, 5309484, 5054018, 4808707, 5280941, 5223028, 5201813, 5574533, 5360091, 5454206, 5480300, 5740482, 5969666, 5917796, 5856690, 6009576, 6106648, 6413319, 6046678, 6231717, 6569360, 6291168, 6549542, 6863826, 6712760, 6897698, 6593658, 7087538, 6989690, 7112032, 7712568, 7258113, 7510010, 7432796, 7799185, 7659486, 7730070, 8099440, 8133156, 8250588, 8366509, 8530121, 8682346, 8701892, 8972825, 9088905, 9271790, 9165772, 9417940, 9412266, 9863213, 9679429, 10202769, 10319895, 10438881, 10488739, 10663784, 11030163, 11061128, 11131467, 11792793, 11839603, 11585918, 12091185, 12269645, 12436755, 12501042, 13385374, 12799647, 13327068, 13467383]
14379A3467383M82256M86384k0152K31657N07316j87211O23383N93939L1096L38333
14369A6554384K89098M38966M14247M70681p1656Q36052J50821O51479K80595
14360B0014667Q96797q809L92834O70311N58295L1380J001772M86662N96984O36341
14350B5277234Q39347L63640L96332P40698O63411J067064O77048J074996J78330
14341C1278100J295854O82315J015950P16299J130008J331346R18673J469695
14333C9838240J020000R43739J819811R85054J393166J400071J732355J491862
14325E0624298J786529J699473K066562K054944K129978K312461K033397K506084
14317F7213726K623654K397230L005034L035940L168532L135102L716438L565345
$$ y = [13467383, 13949639, 14436023, 14415871, 14647528, 15154844, 14967633, 15591016, 16184955, 16216051, 16554384, 16843482, 17282448, 17696695, 18167376, 18095720, 18931772, 19082593, 19734072, 20014667, 20911464, 20902655, 21295489, 21965800, 22524095, 22555475, 23557247, 24043909, 24640893, 25277234, 26116581, 26480221, 26876553, 27617251, 28280662, 29347726, 30024774, 31099770, 31278100, 32573954, 33256269, 34272219, 34988518, 36118526, 37449872, 38368545, 39838240, 40858240, 41801979, 43621790, 44606844, 46000010, 47400081, 49132436, 50624298, 52410827, 54110300, 56176862, 58231806, 60361784, 62674245, 64707642, 67213726, 69837380, 72234610, 75239644, 78275584, 81444116, 84579218, 88295656, 91861001]
14309I1861001L974494M315943L896866M753788N109425N068990N653528O104641
14301A30738676N776513O699309P283132P347052Q086050Q593590Q643441R756193
14293A92923956R991146J0516220J1165242J1796052J1908321J2865438J3255735
14286B74422110J4244577J3913728J4415307J4731494J5003780J4748738J4295949
14279C75775683J4292089J3143106J2701466J1240639R550985P844207N472723
14272D50020898J221935j693786k009827m408773l790135o456899p684479r885604
14264D15313330j2124154j4095295j4693848j5173988j6002326j5568611j5419658
14257C12235450j5325893j4931437j4186125j4071614j2011461j1351077j2274216
$$ y = [91861001, 95835495, 100151438, 104048304, 108802092, 113911517, 118980507, 124634035, 130738676, 136515189, 143214498, 150497630, 157844682, 165930732, 174524322, 183167763, 192923956, 202915102, 213431322, 224596564, 236392616, 248300937, 261166375, 274422110, 288666687, 302580415, 316995722, 331727216, 346730996, 361479734, 375775683, 390067772, 403210878, 415912344, 427152983, 436703968, 444548175, 450020898, 451242833, 449549047, 447539220, 443130447, 439340312, 432883413, 425198934, 415313330, 403189176, 389093881, 374400033, 359226045, 343223719, 327655108, 312235450, 296909557, 281978120, 267791995, 253720381, 241708920, 230357843, 218083627]
14250B18083627j1266144j0243436j0467768r431366q627464q174753p379794
14243A52492902p423502o823835o739703n954605n716797m811976m792935n151234
14235A05078315m603126m498911l782057l708209l107624l878700l013668l386727
14227G5099293k551728k321510l203177k128229k584762k305245j876704j750321
14219E6377617j966315k204786j212097k153290j297557j045858j381757j767603
14211D3348354j460664r79095j230348j121731j61851j759520r04019j246552
14203C4484574j280151l68602o90164o52467j172541o43774q15598q94710n28204
14194B7438363n78953n02704j081614m80801p88744o32836k87950j98282p88638
$$ y = [218083627, 206817483, 196574047, 186106279, 176674913, 168047449, 159872696, 152492902, 145069400, 138245565, 131505862, 125551257, 119834460, 115022484, 110229549, 105078315, 100475189, 95976278, 92194221, 88486012, 85378388, 81499688, 78486020, 75099293, 72547565, 70226055, 67022878, 64894649, 62309887, 60004642, 58127938, 56377617, 54411302, 52206516, 50994419, 48841129, 47543572, 46497714, 45115957, 43348354, 41887690, 40908595, 39678247, 38556516, 38394665, 36635145, 35731126, 34484574, 33204423, 32835821, 32145657, 31493190, 30320649, 29676875, 28861277, 27966567, 27438363, 26859410, 26356706, 25275092, 24794291, 24005547, 23372711, 23084761, 22886479, 22097841]
14185B2097841m34572m84557m62199m31804p39107l04880l41033k44184m21049
14176A8234456p36276k31449j88605n7740p67830m25357k90652j76716j72652
14167A5187179K1709q80359K13452m92432m15758J86746n39678p1197j90823k98913
14157A2719926k36786j67358l12920j44702k09054k41872j80271l90611J93437
14148A1029789j08224l64314q0021Q4970o68885k52212L10309o0032j86951m14782
14138I289647O5070p8999k85621N2621k98773j06713j53720o3755l27888k84841
14128G807028J26081j08313l92576M0264J53816k92713K82939j29846k85883l00638
14118F900159K94682m38534Q2491k1008j08546M6825l82901j06642J23952p2200
$$ y = [22097841, 21663269, 21178712, 20716513, 20284709, 19545602, 19240722, 18899689, 18655505, 18234456, 17498180, 17266731, 17078126, 17020386, 16252556, 15827199, 15536547, 15359831, 15187179, 15208888, 14328529, 14541981, 14049549, 13633791, 13820537, 13280859, 13209662, 13018839, 12719926, 12483140, 12315782, 12002862, 11858160, 11649106, 11407234, 11226963, 10836352, 11029789, 10921565, 10557251, 10477230, 10562200, 9893315, 9641103, 9951412, 9891380, 9704429, 9289647, 9354717, 9275718, 8990097, 9042718, 8743945, 8637232, 8483512, 8419757, 8091869, 7807028, 7933109, 7824796, 7432220, 7472484, 7626300, 7333587, 7616526, 7486680, 7200797, 6900159, 7194841, 6756307, 6838798, 6817790, 6709244, 6756069, 6373168, 6266526, 6390478, 6318278]
14108F318278J35684o74415L64216m67973k61402K08981k01504k2452M8983J11275
14098E559671n43584N12243j7008k0437m48767O8627j65503J93368k52969Q0624
14088D966265k32122k30467L79743m12033K11383j9008m13707K67843r6504q5342
14078D336051J95255k39791l0089n0404J69624j66208k92707k8249k0049K13055
14068D086488m68381N94153n32896J1504J47273L06548m46114j72384L47305l23066
14058C550430n7704K42018J1357k24697j36620l4660k59903N10573j90693k26018
14048C184083J6478P7234j72143p8211Q638j04671K04933O4013j49319j00356
14038B950679R8745j10070j03631M8175J97328R949l17587m6155q7526N37444
$$ y = [6318278, 6453962, 5779547, 6143763, 5675790, 5414388, 5623369, 5421865, 5399413, 5448396, 5559671, 5016087, 5528330, 5511322, 5490885, 5042118, 5110745, 4945242, 5138610, 4885641, 4966265, 4734143, 4503676, 4883419, 4471386, 4682769, 4663761, 4250054, 4517897, 4421393, 4336051, 4531306, 4291515, 4261426, 4211022, 4380646, 4214438, 3921731, 3893482, 3873433, 4086488, 3618107, 4212260, 3679364, 3690868, 3838141, 4144689, 3698575, 3526191, 3873496, 3550430, 3492726, 3734744, 3746101, 3521404, 3384784, 3350124, 3090221, 3600794, 3410101, 3184083, 3200561, 3277795, 3105652, 3027441, 3036079, 2931408, 3136341, 3200354, 3051035, 2950679, 3049424, 2939354, 2835723, 2883898, 3081226, 3091175, 2773588, 2727433, 2639907, 3177351]
14028C177351j66719o8849j80181J82612m10711q0398O7491J65827k50867M0101
14018B475657j10269J14175K0840J46208m82482J90414l26498M07713m31566L6846
14008B041038L82901n64443K05778j36454K16839o3596J35965l10963K00177j71452
13998A935790j71153L75426l049m1611j83287M7980N47429k63603O75686M06770
13988C326378J821703P476344K1030330J3636797B2927071A1097705m034950j946107
13980E116648j014859m20040n59927M3605k77296j23728K8406m53467k6118k248
13970B310976K48945j56176j4045l33444K83211j67055K92685n15553r5986L31312
13960B184870Q9178l85031m11087N52337k82780K26695K08435k68172J4572k44788
$$ y = [3177351, 3010632, 2941783, 2761602, 2944214, 2533503, 2453105, 2520596, 2686423, 2435556, 2475657, 2365388, 2479563, 2500403, 2646611, 2164129, 2354543, 2028045, 2435758, 2004192, 2041038, 2423939, 1859496, 2065274, 1928820, 2145659, 2082063, 2218028, 1907065, 2107242, 1935790, 1764637, 2140063, 2137014, 2095403, 1912116, 1960096, 2507525, 2243922, 2919608, 3326378, 5148081, 12624425, 33654755, 47291552, 22927071, 11097705, 7062755, 5116648, 4101789, 3681749, 3121822, 3165427, 2888131, 2764403, 2792809, 2339342, 2313224, 2310976, 2559921, 2403745, 2389700, 2056256, 2339467, 2172412, 2465097, 1949544, 1853558, 2184870, 2274048, 1889017, 1477930, 2030267, 1747487, 1974182, 2182617, 1914445, 1929017, 1684229]
13950A684229O9666n2559k9580M2491J8091J8499j25760O4473r6952J87059N4347
13939A834004j25981j38601j82037M27063j74493l16828K24989j50268M3508j45965
13929A295391K86874k15357M4462J12196l65252K21880R0720l21162O66297n3529
13919A762520j62526Q8265k27637K9169o5376R9760J30614l97705M5536J21958
13909A424578o1080j36423M10756k95264l94112N29998r3182j66351J62086L6131
13899A417137k30729J41062n5785M951k89434L68134j01278l1652n395J3723j66091
13888A064643J25336J0804r764m6629P0264j94632j52726J64502M90355m40846
13878A081307J9883n9163O3587J05326j26153k55177L24822R1821l72219J30159
$$ y = [1684229, 1753895, 1701336, 1671756, 1714247, 1732338, 1750837, 1625077, 1689550, 1592598, 1779657, 1834004, 1708023, 1569422, 1387385, 1814448, 1639955, 1323127, 1548116, 1397848, 1441356, 1295391, 1582265, 1366908, 1411370, 1523566, 1158314, 1380194, 1470914, 1149752, 1816049, 1762520, 1599994, 1688259, 1460622, 1489791, 1424415, 1524175, 1654789, 1257084, 1302620, 1424578, 1363498, 1227075, 1637831, 1342567, 948455, 1478453, 1385271, 1218920, 1381006, 1417137, 1186408, 1327470, 1271685, 1276636, 987202, 1355336, 1254058, 1222406, 1217011, 1230734, 1064643, 1189979, 1200783, 1191019, 1144390, 1214654, 1020022, 867296, 1031798, 1522153, 1081307, 1101190, 1042027, 1105614, 1210940, 1084787, 829610, 1154432, 1246253, 874034, 1004193]
13868A004193L13082l17775j98827K65989n8039J86687k93326K75796n06683L02945
13858I74042J61687p008K54765o68683O84491L618m97238P52426G00938K68853
13848I69791P3352j72421J64714R975J885l10949J96872J07525k2183l34277L05073
13837I89357k7302j64951L11294j36279R4848l3951k01894k07694K05113q6932
13827G41609j62291J37463K82678j43817M2718j95578k66823L84055k61586J92729
13817G51157r206j22232j8332K34811J4676l32022L42660J02653O3741k09876
13807H18030j50325O437J2574J96551r2134r2888j54194K39952q0235j712k10924
13796D91132L55745J1104q6753n5549J19508n5188j06245Q0319K17380k95243
$$ y = [1004193, 1317275, 999500, 800673, 1066662, 1008623, 1195310, 901984, 1177780, 671097, 974042, 1135729, 1128721, 1383486, 714803, 1399294, 1402912, 905674, 1658100, 700938, 969791, 1043143, 870722, 1035436, 1045411, 1047296, 736347, 933219, 1040744, 1018561, 684284, 989357, 962055, 797104, 1108398, 972119, 1066967, 1033016, 831122, 623428, 828541, 741609, 579318, 716781, 999459, 855642, 898360, 702782, 435959, 820014, 558428, 751157, 741951, 619719, 601387, 836198, 850874, 518852, 861512, 964165, 1027906, 818030, 667705, 674142, 686716, 883267, 791133, 698245, 544051, 784003, 703768, 702056, 491132, 846877, 857981, 771228, 715679, 835187, 779999, 673754, 754073, 971453, 676210]
13786F76210J44467l40823J48737n9803L40765k26923K85139l28484o3381K00224
13776G76128l40433j76464O13428q8557l59365J96773O2716K94785k86625p324
13766F85062K69173D40608l4722K79096O9151K3347L0350J8727j68669j7142N0488
13755F91234j43686j92794K88627r3441J03601J14167j93155J00507j1369j95180
13745D68511M59316l52888k86914L02648k4007j98872J04302M5426l2627J66652
13735F51547j66790J27276J18259k6103r8016k70542o3680m756J32452K46149
13725F45796m4470K10994m05567L09295k47116M04003l69115r6203M2055J23591
13715E73263J7666k14430K56921r0863A62227O07039k69698K69273j42585J15571
$$ y = [676210, 820677, 479854, 628591, 568788, 909553, 682630, 967769, 639285, 575904, 776128, 435695, 259231, 872659, 784102, 424737, 621510, 684226, 979011, 692386, 685062, 954235, 440608, 405886, 684982, 754133, 777480, 807830, 826557, 657888, 640746, 691234, 547548, 354754, 643381, 549940, 653541, 767708, 574553, 675060, 663691, 468511, 927827, 574939, 288025, 590673, 566666, 367794, 472096, 517522, 484895, 651547, 484757, 612033, 730292, 704189, 606173, 335631, 271951, 267195, 399647, 645796, 601326, 812320, 406753, 716048, 468932, 872935, 503820, 407617, 449672, 573263, 590929, 376499, 633420, 542557, 162227, 769266, 499568, 768841, 626256, 741827]
13705G41827K9758n8613k00694m8818Q9223k48397j9152J43322P1141J48135B44951
13693D87200Q0883M0362j21782k34831P0032J43134j85528O82823A24L06373K5712
13682C32209J4539J44598k9771k30358L12415k32703L77589k46052o6746J39356
13672E15076p3568O1224K01310P618B61320J49725L25164B67334L31115n2623
13662E45826j22598j6625p1459j4978l7643J02292O1987l5842r0311n2308L6666
13651C05007J94730j52800j18966L5143M86584k99253j57137L88289k01785j81933
13641B97879j42384L19940M7390K02794A56850L5527L98975j85993n6181a49645
13630A71894D6959J87035J17739J33691J19982j34992o5782R5017A34901K05768
$$ y = [741827, 771585, 712972, 512278, 463460, 552683, 304286, 285134, 428456, 499597, 647732, 244951, 487200, 568083, 608445, 486663, 251832, 321864, 464998, 279470, 962293, 124, 306497, 332209, 346748, 491346, 461575, 231217, 543632, 310929, 688518, 442466, 375720, 515076, 441508, 502732, 704042, 711660, 261320, 411045, 736209, 267334, 598449, 545826, 423228, 406603, 335144, 320166, 282523, 384815, 446802, 410960, 320649, 268341, 305007, 499737, 346937, 227971, 263114, 749698, 450445, 293308, 681597, 479812, 297879, 155495, 475435, 522825, 725619, 156850, 192377, 591352, 405359, 349178, -149645, 171894, 46959, 233994, 351733, 485424, 605406, 470414, 404632, 499649, 134901, 340669]
13620C40669A21053K05289R3277A54881K48248n3143n8993J952Q0528J69949B03548
13608C90621j38082E7742M53171k24174N5072r4072K52575j81145k7341n4034
13598B37794K44357J33684j91841k03154J37143j73973F4078L31608P5513M8867
13588E20066P5104B32455p2097N83121A58574O08660C04677j27065F2226L21748
13578C83974j15597K70509B12629M0074J84585k11344L5424J60178q5591h2120
13567B20607Q9883M33043B66283N2971M8919j00619p1253Q624K75236j89220K23720
13556E14661k56360J1550l6908J29828o1210j7941q3244J53666c9952B69687l2091
13545B37596J00638A20559J45238M48433A54959L68701j45544j87099N6795q7991
$$ y = [340669, 121053, 326342, 419619, 154881, 403129, 349986, 290993, 292945, 373473, 543422, 203548, 390621, 252539, 57742, 510913, 286739, 341811, 247739, 500314, 319169, 291828, 237794, 482151, 615835, 423994, 220840, 357983, 184010, 64078, 395686, 471199, 520066, 595170, 232455, 160358, 743479, 158574, 767234, 304677, 177612, 62226, 383974, 268377, 538886, 212629, 252703, 437288, 225944, 261368, 421546, 335955, -82120, 220607, 310490, 743533, 266283, 319254, 368173, 267554, 196301, 204925, 480161, 290941, 514661, 258301, 269851, 232943, 362771, 301561, 283620, 200376, 354042, -39952, 269687, 237596, 338234, 120559, 265797, 714230, 154959, 523660, 378116, 191017, 247812, 159821]
13535A59821J18427m6679J42316R0449D4927L38691o319L3845j31072o9633J17648
13524C28087a87936C46528A6357R2160J55092e1743A36418K26560O9474l4454
13514C97998K6351j51186a23076D78018k03821G9900J14012J04093K2727I3195
13503A21942J38362J25522K40073A4154M11360j43001C7692K57111D7323J28228
13493A75551n1353K26107A37854M35164B81514K07406J08078A14245L14954d4
13482C15028n9666J66979j06127j48443P7534Q2841J54567A62610K57443O8924
13472D88977B38391a08236D36874A41362F0466L19398J97781B05672F2719J15923
13462A78642B9216L4480k3309N31770F6898K0638L78001a96682C70991A37904
$$ y = [159821, 278248, 231569, 373885, 464334, 44927, 383618, 377299, 411144, 280072, 210439, 328087, -187936, 346528, 16357, 108517, 263609, -51743, 136418, 362978, 432452, 397998, 424349, 273163, -123076, 478018, 274197, 79900, 193912, 298005, 320732, 93195, 121942, 260304, 385826, 625899, 14154, 425514, 282513, 37692, 294803, 47323, 175551, 124198, 350305, 137854, 573018, 281514, 488920, 596998, 114245, 429199, -44, 315028, 255362, 422341, 316214, 167771, 245305, 328146, 482713, 162610, 420053, 488977, 238391, -108236, 436874, 141362, 60466, 379864, 577645, 205672, 62719, 178642, 29216, 63696, 40387, 572157, 66898, 87536, 465537, -196682, 370991, 137904]
13451B17246L5459P5541C9346O7669K17110J15555k09425j8422P7114j22908J13608
13440B79647J6873E0250J24639h577D8734J18883N5748O4566J53938A63151F9024
13428G2823J55221J24979L2166e8083g596E3692L18733b39441f3200A68818l64
13417A68454J1765J30974r8425d4928A90852M8941p7667A8082K57031j061A22931
13405e4106A13096M2871J80932j63677m6858f2464C4719J72256L96643r756B47030
13393E95031k70362j15410c1278B8666n900J91564A05390f4932m560J73C72411
13381A48925m3160J99998A35498k0640K53671A63392P5074J2095L55199B82669
13370A83887J03299K00859A08435J86439A37505J4078L00027j40431o3686J73723
$$ y = [217246, 252705, 328246, 39346, 107015, 324125, 439680, 230255, 211833, 288947, 166039, 279647, 296520, 50250, 174889, -8577, 48734, 167617, 223365, 287931, 441869, 163151, 69024, 72823, 228044, 353023, 385189, -58083, -7596, 53692, 372425, -239441, -63200, 168818, 168454, 180219, 311193, 212768, -44928, 190852, 239793, 162126, 18082, 275113, 274052, 122931, -54106, 113096, 155967, 336899, 173222, 126364, -62464, 34719, 206975, 603618, 593862, 247030, 595031, 324669, 209259, -31278, 28666, 22766, 214330, 105390, -64932, -69492, -69319, 372411, 148925, 105765, 305763, 135498, 114858, 368529, 163392, 238466, 250561, 605760, 282669, 183887, 287186, 488045, 108435, 294874, 137505, 151583, 451610, 311179, 247493, 421216]
13360D21216j90359Q6728A4932J07511K28572j24699q5909K78448B01057r5489
13350A05568J15366i5227D40197H0245J53753Q7567j47370Q3329k7992k0915O2102
13339B70719J51175A14854a64856C24762j45726J54988J07628B4970g676D60064
13328C54341A63814a85409A12407P5240a05147D33048j26118Q4432P0340r9506
13318C62196p3443J09758C4812L69641f1984a4173n8699C05165J13774b45553
13307C92963a98544e344C4277M0183A4898J07459n2306P6625J76485j23645j7726
13296A81790g5604A05816A9795L9642J18377J47423E0521B1806K76023m1696a0289
13284D7257J84007R8031b38047O7128C62000H1765a8038B22479J18082f5519m9407
$$ y = [421216, 230857, 317585, 14932, 122443, 351015, 226316, 140407, 418855, 201057, 105568, 220934, -95227, 440197, 80245, 233998, 321565, 174195, 257524, 229532, 208617, 270719, 421894, 114854, -164856, 324762, 179036, 334024, 441652, 24970, -7676, 460064, 354341, 163814, -185409, 112407, 187647, -105147, 433048, 306930, 391362, 461702, 362196, 288753, 398511, 34812, 404453, -61984, -14173, -72872, 305165, 418939, -245553, 392963, -198544, -5344, 34277, 74460, 14898, 122357, 70051, 146676, 323161, 199516, 181790, -75604, 105816, 19795, 59437, 177814, 325237, 50521, 21806, 297829, 256133, -10289, 47257, 231264, 329295, -238047, -170919, 362000, 81765, -18038, 222479, 340561, -65519, -114926]
13273a14926B29094i2841B25837i0455K0124B82073q7125c139l6844A84747J79235
13262C63982a87179A69571n8712l0730N5073D2975e17A82764a91236L4831E7073
13250B3440J09468D0966J28020a74948A72933F9899J29437I6250b9981C4070A156
13238B15621o8322k7894B6781J4977J28939L2118K59279k28778a09851L6048D20245
13226G8986C6715a7167a921E8185a11569A60354K01824F547L15395D5723K9558
13215G5281C7217P7648M9863O3049b22973C39775M3973j86325b1729A8878b4150
13203E3250Q7634b05554A24162m0330L0493B9823J85411Q611K0777J70772A25873
13191B25980b2319I8225j2798K7435n1399A9703J12217O8319K0615J82486a27762
$$ y = [-114926, 229094, -92841, 225837, -90455, -70331, 282073, 194948, -3139, -39983, 184747, 363982, -187179, 169571, 110859, 80129, 135202, 42975, -517, 182764, -191236, -156405, 57073, 23440, 132908, 40966, 168986, -174948, 172933, 69899, 199336, 96250, -29981, 34070, 1156, 215621, 147299, 119405, 26781, 41758, 170697, 202815, 462094, 233316, -109851, -73803, 420245, 78986, 36715, -17167, -1921, 58185, -111569, 160354, 362178, 6547, 321942, 45723, 75281, 37217, 114865, 164728, 227777, -222973, 339775, 383748, 197423, -21729, 18878, -24150, 53250, 140884, -205554, 124162, 83832, 114325, 29823, 215234, 223845, 244622, 415394, 125873, 225980, -22319, 98225, 85427, 112862, 61463, 19703, 131920, 200239, 220854, 403340, -127762]
13179D59184A29108a20891C84118C1393J49031o8257N7230p9339a71049G5036
13168c5821A11513n2221k5695L4015B8887K61504H7641J24185f43A20980P6152
13157A97132G6512N21603b57324B75170a04507B38043I7704a81619B35793b75603
13146A18918J70956A24562J56155j31798a14928C04028E7158J48192a77490B29730
13135C37042E9108J74952g0399j84653B00260A7641J25851E0954b2256A0537i046
13123a45148A72011l0941J25021O736p3691a1559K55j63214A49632J39087n912
13112B82807f6510A07744j7152J56797J46650A693b2749F4997K8108M073a09283
13100C28475j34469J39482b9143p9454B71538A25411M3558J28947a29317B42251
$$ y = [459184, 129108, -120891, 384118, 31393, 180424, 112167, 169397, 90058, -171049, 75036, -35821, 111513, 59292, 33597, 67612, 28887, 290391, 87641, 211826, -643, 120980, 197132, 76512, 598115, -257324, 275170, -104507, 238043, 97704, -181619, 235793, -275603, 118918, 289874, 124562, 280717, 148919, -114928, 304028, 57158, 205350, -177490, 229730, 337042, 59108, 234060, -70399, -255052, 200260, 17641, 143492, 50954, -22256, 10537, -9046, -145148, 172011, 141070, 266091, 272827, 199136, -11559, -11304, -174518, 149632, 288719, 282807, -66510, 107744, 90592, 247389, 394039, 1693, -22749, 64997, 93105, 97178, -109283, 328475, 194006, 333488, -29143, -108597, 271538, 125411, 168969, 297916, -129317, 242251]
13089a60649r4225B67277a72884g3285q3799A05798N0372j3868a44135B37584
13078A02237f4168b3427p1509B8379M16415E5474N3715b3563C43730c0155A66996
13066a1271B00184K92301j83141b21766a07455D09507a2166n2972j6861B616K3554
13055B6170L1311N6985a95839A96123E4553R3579a46154D1147R425a4126C0759
13043e0062j48002A37917a4831A34536A8192M388J54055b55363A98944N2373J4188
13032B65505i261j323B40872M8933c7972C93439a13339G5021N9131i1557C16007
13020B87071H7002J63872K66227A34997J28024G3502J31042h5455B52815j16706
13010A36109c9061B97446b1001A14832K63637j25177r4660p2741a02462B7571
$$ y = [-160649, -254874, 267277, -172884, -73285, -157084, 105798, 156170, 142302, -144135, 237584, 102237, -64168, -23427, -94936, 28379, 444794, 55474, 109189, -23563, 343730, -30155, 166996, -11271, 200184, 492485, 309344, -221766, -107455, 409507, -12166, -65138, -81999, 2616, 26170, 57481, 114466, -195839, 196123, 54553, 148132, -146154, 41147, 50572, -14126, 30759, -50062, -198064, 137917, -14831, 134536, 18192, 22580, 176635, -255363, 198944, 251317, 265505, -9261, -10584, 240872, 289805, -37972, 393439, -113339, 75021, 134152, -91557, 316007, 287071, 87002, 250874, 517101, 134997, 263021, 73502, 204544, -85455, 252815, 136109, -39061, 297446, -21001, 114832, 378469, 253292, 158632, 85891, -102462, 27571]
12999D46533c89706B94698m2074i2143j0495A44653J34499q7389d8661B7409j1879
12988A5530N3003i8493C19053E8567K56529e7390m8620D33247j23564j31644c2421
12976a01357B2021J15406J5120C9371e8655a1408r7954B05854a59932A5292a30481
12964F1132h3700A61608a97631F64564A48102l2441B1064N5504b1380B23744h4314
12952I0643K18760A42957P3790b3649G5734b24732c2951D2529a07611d0129k6099
12941f6228j18529C29695F1844L32536j65239f2391q3240B12276b88332d334B44636
12929a53824q9665f0199A14548J59417C0150J42842d3008I214b83823A26152d1779
12917e2708j16932A65658B4682J56472h813r5595M7508B52038G9118a40134G8415
$$ y = [446533, -389706, 294698, 252624, -92143, -102638, 144653, 279152, 191763, -48661, 27409, 15530, 68533, -98493, 319053, 58567, 315096, -57390, -106010, 433247, 309683, 178039, -32421, -101357, 22021, 137427, 152547, 39371, -58655, -11408, -109362, 205854, -159932, 15292, -130481, 61132, -83700, 161608, -197631, 664564, 148102, 115661, 21064, 76568, -21380, 223744, -84314, 90643, 309403, 142957, 216747, -23649, 75734, -224732, -32951, 42529, -107611, -40129, -66228, -184757, 329695, 61844, 394380, 229141, -62391, -145631, 212276, -288332, -4334, 244636, -153824, -243489, -60199, 114548, 273965, 30150, 172992, -43008, 9214, -283823, 126152, -41779, -52708, -169640, 165658, 24682, 181154, -8813, -104408, -56900, 252038, 79118, -140134, 78415]
12905A17395g0298A38886H672b31726h568A5654f3202j91485A30342R3386j1894
12894B11834j00724c6904C05776A03241N7918g6905B29802a43011j96557H0048
12883A14520E3006J03226C8122j3006j590c3955j63894H7617q75a32297A38605
12871a2304r1553A79292c44075J28977c4900A7511J36161a338m1751A0642K12038
12860B22680b26786C76902A517J20128R3766b3630j06276A47361d262j18400C43695
12848E8844j5989J07812a96455D5463M9504L39110j77608a05065A86447R3959
12838B80406n8826J02832E0481L5376J8071g4409j64729A7206K73412B5296K78473
12827C03769A39267b10013A31345n3656Q2379b8915B49040a07485A92a4845j13689
$$ y = [117395, -70298, 138886, 8672, -231726, -8568, 15654, -63202, -254687, 130342, 223728, 211834, 111110, -36904, 305776, 103241, 161159, -76905, 229802, -143011, -339568, 80048, 114520, 53006, 156232, 38122, 25116, 23526, -33955, -197849, 87617, 86742, -132297, 138605, -12304, -103857, 179292, -344075, -215098, -34900, 17511, 153672, -1338, -43089, 10642, 222680, -226786, 376902, 1517, 121645, 215411, -23630, -129906, 147361, -4262, -122662, 343695, 58844, 42855, 150667, -196455, 45463, 94967, 434077, 256469, -105065, 186447, 280406, 221580, 324412, 50481, 85857, 103928, -74409, -239138, 17206, 290618, 25296, 303769, 139267, -210013, 131345, 77689, 160068, -28915, 249040, -107485, 192, -14845, -128534]
12816a28534a3096A3882a12755j78739B98359b31301j10723a04309b3255E7445
12805a09943p4286Q3441l1573O4631B4558J97973j02152b46298B49596f228B2765
12793I7183c880n7653A25526a85715b604G2595l4429b51209A35451J01244N6898
12782B93593h4878A80606c7601A4083K35390A6762M246c3136B967M6458i3837
12770D064b19543n1178j25195A64284C2361K19821C148a12903N4434n6052D1971
12758I5797J82788c69196a17023A60621c0615p84F3754L28568D0635H728a94024
12746A06621a47596j0941A73971q0214L00657n3116m2846R9158a17286A98726
12735g4612B05212c2659A96732a22771o3835B51457E7105c991j5944q1158n867
$$ y = [-128534, -13096, 13882, -112755, -291494, 298359, -231301, -342024, -104309, -23255, 57445, -109943, -184229, -100788, -132361, -67730, 24558, 222531, 120379, -246298, 249596, -6228, 22765, 97183, -3880, -61533, 125526, -185715, -2604, 72595, 38166, -251209, 135451, 236695, 293593, -84878, 180606, -37601, 14083, 249473, 16762, 21008, -33136, 2967, 49425, -93837, 4064, -219543, -270721, -395916, 164284, 32361, 252182, 3148, -112903, -58469, -114521, 41971, 95797, 278585, -369196, -117023, 160621, -30615, -31399, 63754, 392322, 40635, 8728, -194024, 106621, -147596, -158537, 173971, 93757, 394414, 341298, 298452, 397610, -117286, 198726, -74612, 205212, -32659, 196732, -122771, -186606, 251457, 57105, -3991, -19935, -101093, -106960]
12724a06960j5652p3352A63894J12279a48931A8338P829J31457h6176C807K56143
12713B59950G0126c8995C1200a75713C55001a7885B26711a24969b9292B90553
12702B47912j02114d1362A9929b55725A77219n9735n247J35903A0001a10829E2900
12690C5994L5286e4724j0001j34174A47923b65142B70147G6481M1753K24966A59342
12678b8914B94737J9451q9506P3963c19995A02759j7577A7794i4940M4236I5622
12666H0815k7326C230J64613K30588A36618j9565m0586M5788Q8128j6464g5568
12654A1269J65602J71216j47380b72825R3534j14281G0606a9266l82035B82442
12643f0233q9946N3402q3244A70544n1402K7302N4702a2206B8171N5655K91518
$$ y = [-106960, -122612, -195964, 163894, 276173, -148931, 18338, 26167, 157624, -86176, 3807, 259950, 70126, -38995, 31200, -175713, 355001, -17885, 226711, -124969, -29292, 290553, 247912, 145798, -41362, 19929, -255725, 177219, 117484, 112237, 248140, 10001, -110829, 52900, 35994, 71280, -54724, -64725, -198899, 147923, -265142, 270147, 76481, 118234, 343200, 159342, -28914, 294737, 314188, 224682, 298645, -319995, 102759, 85182, 17794, -94940, -50704, 95622, 80815, 53489, 3230, 167843, 398431, 136618, 117053, 76467, 122255, 210383, 193919, -75568, 11269, 176871, 348087, 200707, -272825, -179291, -293572, 70606, -19266, -401301, 282442, -60233, -150179, -96777, -180021, 170544, 119142, 146444, 201146, -12206, 28171, 83826, 375344]
12632C75344A63302G397K89317P166H8967K83044M6379A1774M5610R7031o8421
12621H5994b2515A49092a05833d1316B98543j46182n0878C2698L04090A31394
12610A93205r1559B5208K13563B5700J89832a74350F6375Q2356B7136L66247Q4972
12599D78355K096A08524l7745b5157A09154Q6243b05115C3556K33926b1313n3087
12588g4400q7597F0594N8146k1235J34561G4412O0679b66992i9579j44361G549
12576A44031m2705b1571r3656L1228A04058D9664d17863A46209Q986a27663I4253
12564A13178a7153D3790J72472b15539A06218a41313A84020c1941F2462K41271
12554C03733h9937A92260G5902Q0891M3771h1072J2665B7442b6492C7200R2951
$$ y = [375344, 163302, 7397, 296714, 303880, 88967, 372011, 418390, 11774, 57384, 154415, 85994, -22515, 149092, -105833, -41316, 298543, 152361, 101483, 32698, 336788, 131394, 193205, 101646, 25208, 238771, 25700, 215532, -174350, 66375, 148731, 27136, 393383, 478355, 480451, 108524, 70779, -25157, 109154, 195397, -205115, 33556, 267482, -21313, -74400, -161997, 60594, 118740, 97505, 232066, 74412, 135091, -266992, -99579, -243940, 7549, 144031, 101326, -21571, -115227, -83999, 104058, 49664, -417863, 146209, 155195, -127663, 94253, 113178, -17153, 43790, 216262, -215539, 106218, -141313, 184020, -31941, 62462, 303733, -89937, 192260, 75902, 156793, 200564, -81072, -68407, 27442, -26492, 37200, 130151]
12543A30151a36793A3687e4875q5296D1013N380d6847D2559R6323O2221a61913
12531B43815Q8273b07384G3790b36910e0555C0094a34449k16678a44005A32594
12520B15971B5247f2870L0277C32942J16470A17018A0725R4832m0567J37759m911
12509A97838f1509j37765P4012k1049N3644j30804A23765J09435b67423A00332
12498B21836j7541H1176L36857b86010A98375a44539H1388C727b21775B71127
12487C32994b7232B37724b01508A28144a86268I7236l8233N1025O2278J30511
12477C02817G3905b16481A46357o5720o491J12924a2486E1351K0824J49090E0370
12465a00168n3261n8369B75552h3827B10885C4693a17341D5213h1591B06631g4083
$$ y = [130151, -136793, 13687, -54875, -140171, 41013, 46393, -46847, 42559, 138882, 201103, -161913, 243815, 332088, -207384, 73790, -236910, -50555, 30094, -134449, -351127, -144005, 132594, 215971, 25247, -62870, -32593, 332942, 449412, 117018, 10725, 105557, 64990, 202749, 197838, -61509, -199274, -125262, -146311, -92667, -223471, 123765, 233200, -267423, 100332, 221836, 204295, 81176, 418033, -286010, 198375, -144539, 81388, 3727, -221775, 271127, 332994, -27232, 237724, -201508, 128144, -186268, 97236, 59003, 110028, 172306, 302817, 73905, -216481, 146357, 80637, 74146, 187070, -12486, 51351, 72175, 221265, 50370, -100168, -153429, -211798, 275552, -83827, 210885, 34693, -117341, 45213, -81591, 206631, -74083]
12453e73508B15795G8060b78445J27848e9482A88543L3624d8507J3787F7191d6801
12441A63593a94502A16846a98536f1275j50596N5253A0098K81202g4557m8110
12431a22667B30224a1760B25634i7106o7590G5048C2739a32224A93337a53681
12420a78463B29942J36920b19874D2321a31944A98812a56744A12630R012a66676
12409a67072P2047B3985J3248d805j00372r0038l6507A77014e2060K2158q2005
12398a11907A48786K1048e5972B18263Q3E9502d4190I6765a04817C22431h5452
12386b9103C2377J34938b19256B62810C0404J83830a4742D977Q3972o751d8141
12374I2381j9375J0733l7178b53937Q7510H2797K6084J68184b09808N4140j01956
$$ y = [-573508, 215795, 78060, -278445, -150597, -59482, 188543, 222167, -48507, -34720, 67191, -46801, 163593, -194502, 116846, -198536, -61275, -211871, -156618, 10098, 291300, -74557, -122667, 230224, -11760, 225634, -97106, -164696, 75048, 32739, -132224, 193337, -153681, -178463, 229942, 366862, -219874, 42321, -131944, 198812, -156744, 112630, 121642, -166676, -167072, -95025, 23985, 37233, -4805, -105177, -195215, -231722, 177014, -52060, -29902, -111907, 148786, 169834, -55972, 218263, 218346, 59502, -44190, 96765, -104817, 322431, -85452, -29103, 32377, 167315, -219256, 262810, 30404, 214234, -14742, 4977, 88949, 82198, -48141, 92381, 73006, 83739, 46561, -253937, -166427, 82797, 108881, 277065, -209808, -155668, -257624]
12363b57624a00163n4102A4663a33322L446A54669m4915m2216K54616b82273A87865
12351B28850E1733a11759A70183f4139H5019J31199P8770p0518B2460a68670F5780
12339C0323P680Q5992a0583j41209H9077a59643H0148R2985q359p0206b4823l2576
12327e7399j56980J3334B03274J80097a37178O3513A23643C8878J20832c2933
12316G8450k1670f896E2871c38809B21155J79193g1014A45421K33800j50073g9231
12304a18371A0550K6907K15182b62054m4675a38678B0090K98124F8000M8326b15539
12292a67021N9458b8974A26652f0130C10636h5683a8631r1896q9647H4283K02896
12281B87179B2481L9324j5318b14541A78544l5853j2368A7403M1130d3429i082
$$ y = [-257624, -100163, -154265, 14663, -133322, -129876, 154669, 109754, 67538, 322154, -282273, 187865, 228850, 51733, -111759, 170183, -64139, 85019, 216218, 294988, 224470, 22460, -168670, 65780, 30323, 38003, 123995, -10583, -151792, 89077, -159643, 80148, 173133, 164774, 94568, -24823, -57399, -214379, -201045, 203274, 383371, -137178, -73665, 123643, 38878, 159710, -32933, 78450, 56780, -6896, 52871, -338809, 221155, 400348, -71014, 145421, 379221, 229148, -79231, -118371, 10550, 37457, 252639, -262054, -306729, -138678, 20090, 318214, 68000, 116326, -215539, -167021, -107563, -28974, 126652, -60130, 310636, -85683, -18631, -110527, -200174, 84283, 287179, 22481, 61805, 46487, -214541, 178544, 142691, 130323, 17403, 58533, -43429, -9082]
12269I8964M550J00244C1490J24812a3498k59885A56695J91461H9723H188b0115
12257B39023H6467R6724r448F0696e1625A52950o1326a61978L6198j89836a13937
12245C83366b14634B38544L9857k7206k2148d1935A46920a05033A6038M8855a8806
12233b67652B18587Q4908A0324b00656E39354A09661b1923C76806R2227B34043
12222a14744A82058k79M1682M5240K64547B18043J36097H9247e1029k5584A58918
12210H9347j3043g3286a8291A9433K23862K06858G2646L45222r8093b13388B62851
12198C45746l1544r2996A10413j2487m2927J46661L5049o5671J56592j5198a82780
12186a53472D52153A96782g5599H0727J18506c7306j17699j7213B6102O7617K10433
$$ y = [98964, 103514, 203758, 31490, 156302, -13498, -273383, 156695, 348156, 89723, 8188, -20115, 239023, 86467, 183191, 173743, 60696, -51625, 152950, 91624, -161978, -125780, -315616, -113937, 383366, -214634, 238544, 278401, 251195, 229047, -41935, 146920, -105033, 16038, 64893, -18806, -267652, 218587, 303495, 10324, -200656, 539354, 109661, -21923, 376806, 469033, 234043, -114744, 182058, 181779, 223461, 268701, 533248, 218043, 354140, 89247, -51029, -76613, 158918, 89347, 76304, -73286, -18291, 19433, 243295, 450153, 72646, 417868, 319775, -213388, 262851, 345746, 314202, 221206, 110413, 97926, 54999, 201660, 236709, 171038, 327630, 312432, -182780, -153472, 452153, 196782, -75599, 80727, 199233, -37306, -155005, -172218, 26102, 93719, 304152]
12175C04152h430B79672M9777j57065K35103A45326g4330B76510n5174J02183
12165C23519f4714B75709J26270C4273J40268H0633P3791J87761a58671f0827
12154c6256a2790E4243R6616a41297d8890A40629h724I125K2955L319P2895J2951
12142A21245C2440P0056n1100a78652C03284j8257d39343a44484O8192A47991
12131A9546f1613B57035G2730K33400b52225M6728I6792J63781a34849O0470o4901
12120a39280b6110j83745F4049J03909g7044j02377A43970Q640a45984A24965
12109D88799k9553a9605G5656K75364B8782b90958h0518A42788D7886J6405a8418
12097G0515a51332A29114a5680B1690P5234m14M8155F9977a4864A38982b72365
$$ y = [304152, -8430, 279672, 329449, 172384, 407487, 145326, -74330, 276510, 221336, 323519, -64714, 275709, 401979, 34273, 174541, 80633, 154424, 342185, -158671, -60827, -36256, -12790, 54243, 150859, -141297, -48890, 140629, -8724, 9125, 32080, 35399, 108294, 121245, 32440, 102496, 51396, -178652, 303284, 285027, -439343, -144484, -76292, 147991, 19546, -61613, 257035, 72730, 306130, -252225, -205497, 96792, 260573, -134849, -74379, -139280, -26110, -209855, 64049, 167958, -77044, -179421, 143970, 152610, -145984, 124965, 488799, 459246, -19605, 75656, 351020, 28782, -290958, -80518, 142788, 47886, 64291, -18418, 70515, -151332, 129114, -15680, 21690, 96924, 96510, 144665, 69977, -14864, 138982, -272365]
12085b09505B3945f7102A42773f6363j50087J02244E4436c8197j31166o0698A94694
12073E964K8333R273K11794e7897C4823f9582j26002D7901L4459b21278A03848
12061F1201a93278D2849f5160D04028j04250J272846j67340B84561O2205g5294
12050C9263a9850j4361C00619j47257a67630k6634A27553O007I03c40479a4728
12038C09327b82653b0317F308f2082q7806F9469h0349b5108B6438a71017A01183
12026d7134k14915g9301i597b829D51604A05647B2303a0343j63901c5537D01801
12014A50118b89856g3757C2410J68797H718b49092d3980J7939j07024C92919A81249
12002A28817a51133B19424q7047A3321B699b12773e5575j0520q4695G2921c19719
$$ y = [-209505, 23945, -67102, 142773, -66363, -216450, -114206, 54436, -38197, -169363, -230061, 194694, 5964, 34297, 43570, 255364, -57897, 34823, -69582, -195584, 47901, 82360, -221278, 103848, 61201, -193278, 42849, -65160, 404028, 299778, 1572624, 1405284, 284561, 346766, -75294, 39263, -19850, -34211, 300619, 153362, -167630, -194264, 127553, 133560, 903, -340479, -14728, 309327, -282653, -20317, 6308, -62082, -149888, 69469, -80349, -25108, 26438, -171017, 101183, -47134, -262049, -79301, -9597, -2829, 451604, 105647, 22303, -10343, -174244, -35537, 401801, 150118, -289856, -73757, 32410, 201207, 8718, -249092, -43980, -26041, -133065, 392919, 181249, 128817, -151133, 219424, 132377, 13321, 2699, -212773, -55575, -66095, -150790, 72921, -319719]
11990a09677F3344h7555A76937K32584c0732j30790m3973c6171o7194l8111I5003
11978A37781h650j03941C7828a51921O4856A0955J32103b65837b7644j16252o115
11967a50011A44360b60789J13379B5496e3895l46336a01550B68170A03371A7384
11956A39265p874M2160K41686a650l3028n618B71081C0087J75489J79113A26598
11944a22990n2898r796D2444i9844j33082e4771A17796R6345q626a29872C8739
11932h6175c995A38495b2836A03296b16177B57279A22521H20a2981A2117a46609
11920a2851k22307G5863J8701b18364i994j01283J7128b3336r0352r9529n7917
11909b71134b5720C04726g6015M641k87648f5878p2835p8472c1566j17879j64324
$$ y = [-109677, 63344, -87555, 176937, 409521, -30732, -161522, -205495, -36171, -103365, -141476, 95003, 137781, -8650, -112591, 37828, -151921, -87065, 10955, 143058, -265837, -27644, -143896, -150011, 144360, -260789, -147410, 25496, -53895, -400231, -101550, 268170, 103371, 17384, 139265, 131391, 173551, 415237, -1650, -34678, -40296, 271081, 30087, 205576, 384689, 126598, -122990, -175888, -185684, 42444, -99844, -232926, -54771, 117796, 214141, 205515, -129872, 38739, -86175, -3995, 138495, -22836, 103296, -216177, 257279, 122521, 820, -12981, 12117, -146609, -12851, -235158, 75863, 94564, -218364, -9994, -111277, -94149, -23336, -113688, -213217, -271134, -25720, 304726, -76015, -71374, -359022, -65878, -138713, -217185, -31566, -149445, -313769]
11898c13769G2264c87524A06829L9163a7210G5621e2811p1317j20410a7669o5455
11887h3124M0515A52425i5100C1761J53231b0745j71131A7649e5897B9108J88173
11876B17281n2381e9193j87525b4257G5487I723a18554E1528b55261I9324O7216
11865A66540c4396A12847J5684J3411b30k47841O1610g8930C3382a73925N7253
11854a16672e342l8376A90807b98957A710M5698a86066H1352a19104m6017L1951
11843a33170j131m5198G7244a00122A96951p2339D5815a17610j71083E8658b10794
11831G8306K09449a59188P1069c4967j72I2163B2545o875a15240E1103a08023
11819f2676J8603k8455p0953j34531g6354A27913n7968P5270a00206j0009L3112
$$ y = [-313769, 72264, -387524, 106829, 145992, -17210, 75621, -52811, -124128, -244538, -17669, -83124, -42609, 152425, -95100, 31761, 184992, -20745, -191876, 17649, -55897, 29108, 217281, 164900, -59193, -246718, -24257, 75487, 9723, -118554, 51528, -255261, 99324, 166540, -34396, 112847, 128531, 141942, -230, -248071, -186461, -78930, 33382, -173925, -116672, -5342, -43718, 190807, -298957, 1710, 47408, -186066, 81352, -119104, -165121, -133170, -134301, -179499, 77244, -100122, 196951, 124612, 45815, -117610, -288693, 58658, -210794, 78306, 287755, -159188, -88119, -34967, -35139, 92163, 22545, 15670, -115240, 51103, -108023, -62676, -44073, -72528, -143481, -278012, -76354, 127913, 69945, 145215, -100206, -110215, -77103]
11808g7103k1686I2168a96518f5013a9461C7152a17721M8411B2774J973b1746
11796B59519b02043A61628a28573E6002h3742c6062K229B9004J15873b6012A07447
11784a24939d3179B36994b22417E7299c5157j12562G543R1720J39744b8243C86775
11772b94615A74583q5888C304J41781l00c8759j47929C2236A1732R7763a39264
11760a76283B63156d7005A08288b09824m9736d730j09142B19305j00577D3549
11749A57099b76432d7807C39964F4957f8028G3172a09406m7434d2129q3886H0429
11737C349Q4567k8869a48686l7088E9563a05995A61930J04948e6865l3886A78425
11725c698k26818A57208O2621j07768J26965d1822A15933E1785Q838k778P266
$$ y = [-77103, -98789, 92168, -196518, -65013, -19461, 37152, -117721, -69310, 22774, 24747, -21746, 259519, -202043, 161628, -128573, 56002, -83742, -36062, -33833, 29004, 144877, -26012, 107447, -124939, -43179, 236994, -222417, 57299, -35157, -147719, 7543, 99263, 239007, -28243, 386775, -294615, 174583, 88695, 3304, 145085, 144785, -38759, -186688, 32236, 11732, 109495, -139264, -176283, 263156, -47005, 108288, -209824, -259560, -4730, -113872, 219305, 118728, 43549, 157099, -276432, -47807, 339964, 64957, -68028, 73172, -109406, -156840, -42129, -126015, 80429, 3349, 87916, 59047, -148686, -185774, 59563, -105995, 161930, 266878, -56865, -90751, 178425, -3698, -230516, 157208, 219829, 112061, 239026, -41822, 115933, 51785, 60623, 57845, 65111]
11714F5111c02313I258Q1368M8689p006n7979k851J20932c47680A60700a39941
11702a1049l41221A33672h189a630k6295Q996A81018j6979p6671A9752a03766
11690C7474J37071H2417d2252j79868A67478R5468a02651e0671C62755a74123
11679I7187K07655h8914b7138I3081b5131B56414F9595J95004d5156F0614B1600
11667d8612I9181b56569J03798B80507a9323j0161C49455c34085B5862b8808J2877
11656a5931b634B0459a63879A82118n4458c39315A51090n1404k8578f708D6645
11644a85603Q2601j02152K7662A38595i8188C25324e6117C69934b05028A29847
11633a54012J699A55238c28157A35386g6526l058k754j81399h6872D74396A46156
$$ y = [65111, -302313, 9258, 90626, 139315, 132309, 74330, 71479, 192411, -347680, 160700, -139941, -11049, -352270, 133672, -8189, -1630, -27925, -18929, 181018, 164039, 87368, 19752, -103766, 37474, 174545, 82417, -42252, -222120, 167478, 262946, -102651, -50671, 362755, -174123, 97187, 304842, -88914, -27138, 93081, -25131, 256414, 69595, 264599, -45156, 60614, 21600, -48612, 99181, -256569, -152771, 280507, -19323, -29484, 349455, -334085, 25862, -28808, -15931, -2634, 20459, -163879, 182118, 127660, -339315, 151090, 99686, 71108, -6708, 46645, -185603, -103002, -205154, -177492, 138595, -98188, 325324, -56117, 369934, -205028, 129847, -154012, -152313, 155238, -328157, 135386, -76526, -79584, -82338, -263737, -86872, 474396, 146156]
11621A72632f6880A58383C2566A3414f8272H2144J29327I8940O0733M9572R5559
11610C04804D10K5304N6230J70514d5419j41207H2321B8515J52425e596o0194
11599f5790m2966c3530j59587C09884A28435a16992c1167H2947L5693b1639k75133
11588b96772E5560J3888K06724b56765D1839K07237A3814J35504a829I4490O6976
11577A61466E8611J51654I9696D0669K5405h464n3070g934D87148b26599F875
11565h7390j32057e2846A50164k3892J10423I5550K30832f9191l9702d2054B31025
11553b95413C09094G7345J08749c44355A93056p0202a10873C82130b17732A29756
11542b70652J31285E0397b31196A01784c9130n9447h173j1491K090A76734j6571
$$ y = [172632, -66880, 158383, 32566, 13414, -68272, 82144, 211471, 98940, 159673, 209245, 304804, 410, 25714, 81944, 252458, -45419, -186626, 82321, 28515, 180940, -5596, -65790, -108756, -33530, -193117, 309884, 128435, -116992, -31167, 82947, 118640, -21639, -296772, 55560, 69448, 276172, -256765, 41839, 249076, 13814, 149318, -1829, 94490, 161466, 58611, 210265, 99696, 40669, 66074, -8464, -61534, -7934, 487148, -226599, 6875, -87390, -219447, -52846, 150164, 126272, 236695, 95550, 326382, -69191, -108893, -42054, 231025, -295413, 309094, 77345, 186094, -344355, 193056, 122854, -110873, 382130, -217732, 129756, -270652, -139367, 50397, -231196, 101784, -39130, -98577, -8173, -19664, -17574, 176734, 160163]
11531A60163J46392c7963I8351a05716n3126D77186A76308C9896a05427A87964
11520B02482p6438K08871J66689a38106E4940L5823N9380J29252A01018i7706
11509d6274A53372J02809b60492B80286b84908b6778D8655K56644r4915A1038
11498a99177A95774h2543A3145J88729M8320Q2389J32548n4453G026A518J58478
11487A59996a22523D6958Q0986J72904n0605n7670H701J66642g3445J2901j07472
11476a68016O5486E7848L59021A47778P7327a4421j02515P903A07142K06794G2429
11464C70483p8391j13675J7063f4362H8235B722N1901N1019f2555k14807a08826
11452A60588Q363J66407j34277a1988j47603A64457n4249d1727B37834Q9649r4217
$$ y = [160163, 306555, -37963, 98351, -105716, -158842, 477186, 176308, 39896, -105427, 187964, 202482, 126044, 334915, 501604, -138106, 54940, 90763, 150143, 279395, 101018, -97706, -46274, 153372, 256181, -260492, 280286, -284908, -26778, 48655, 305299, 210384, 11038, -199177, 195774, -82543, 13145, 201874, 250194, 332583, 465131, 410678, 7026, 1518, 159996, -122523, 46958, 127944, 300848, 250243, 192573, 8701, 175343, -73445, -60544, -168016, -102530, 57848, 416869, 147778, 225105, -14421, -116936, -109033, 107142, 313936, 72429, 370483, 292092, 178417, 195480, -64362, 88235, 2722, 54623, 105642, -62555, -277362, -108826, 160588, 168951, 335358, 201081, -11988, -159591, 164457, 110208, -41727, 237834, 327483, 233266]
11441B33266p8512a6805A02950K07204r3256j0402E971K01091A9809a58938g4128
11429A90723J05685p8642J02840A24593K2018m7772J3834g1523j89357H7215a0202
11417D7790f3191a4750H1054j5424g2347A34313g1803p2730j5893k2340d160j9282
11405b3442A68801a10498C39524A26161c01268g0907a0421l7248k9213k7804o1394
11394a66080B0626K85078A35386C2734a34654A77103k5004a63086c7693E6845
11383B47286K1572H4825b77024D8590J79486q3156f1080A55843O6270c1452j21090
11372a52542f1A65575J6750c3G8983h7889C9244K86685E7665j5635a30129m8459
11360a78588B92498d8439I3281b71966D9785Q0074K69288a39587L8100A25787
$$ y = [233266, 154754, -16805, 102950, 310154, 216898, 206496, 5971, 207062, 19809, -158938, -74128, 190723, 296408, 217766, 320606, 124593, 146611, 98839, 112673, -71523, -260880, 87215, -10202, 47790, -63191, -14750, 81054, 65630, -72347, 134313, -71803, -144533, -160426, -182766, -4160, -23442, 168801, -110498, 339524, 126161, -301268, -70907, -10421, -47669, -76882, -104686, -166080, 20626, 305704, 135386, 32734, -134654, 177103, 152099, -163086, -37693, 56845, 247286, 268858, 84825, -277024, 48590, 228076, 144920, -61080, 155843, 222113, -31452, -152542, -61, 165575, 182325, -33, 78983, -87889, 39244, 325929, 57665, 42030, -130129, -178588, 292498, -48439, 93281, -271966, 49785, 129859, 399147, -139587, -101487, 125787]
11349i4440j12485b8273D28545a0514j43337I6095b49457k4666R494f3813A79281
11337D3126a90160B01889b61318E4588J13168E9025b54923B6880M05195b73681
11326c0061F82g1651A39142f4118c1049g978j24691B4840b7961F075K2151L74851
11314D03077A98872a93021r6191D9018b14935l1673Q8850m0731B00888G6194J44938
11303B21132Q5658I238e4898B93454A0118d586j24403A24766J46542A28166L6296
11292A64462N5997H2782a56189o3801E7788g4694E3979c7815k5366j09965J80
11281a72966l37169K48386I2865M9737l6125a51066K9810F8702a13818H89J1869
11270A2758l947j91b20068J00979j6762A27314e5931C1056J00926b73119I1369
$$ y = [-94440, -206925, -28273, 428545, -10514, -153851, 96095, -249457, -274123, -264629, -63813, 179281, 43126, -190160, 201889, -261318, 54588, 167756, 59025, -254923, 26880, 432075, -273681, -30061, 682, -71651, 139142, -64118, -31049, -7978, -132669, 24840, -27961, 6075, 28226, 403077, 198872, -193021, -289212, 49018, -214935, -246608, -157758, -198489, 200888, 76194, 221132, 306790, 9238, -54898, 293454, 10118, -4586, -128989, 124766, 271308, 128166, 164462, 220459, 82782, -156189, -219990, 57788, -74694, 53979, -37815, -63181, -173146, -172966, -510135, -261749, 92865, 142602, 106477, -151066, -121256, 68702, -113818, 889, 12758, 8811, 8620, -220068, -119089, -135851, 127314, -55931, 31056, 131982, -273119, 91369]
11258F638a33076A64795b6830I5305a23583k8805f4771A16442a14435I4176b90052
11246d9554K0718k3635o5699A6757d91010b11746A09842i2251F3566a4396A5860
11234a80623g6261B03274l6903J81576e2447B3279J50644H4948b83964A48169
11223h3507B63808A31260a28697N823k782j00698C60149C003g4856A37400b73794
11211a20317m9635C0118J17504d7165h830b965l96483B42509A03504b86877c1047
11199C02392b78780a34168j71599R6013A57253b5079j8047J387a3586k87100A93676
11187a7601q5168j20102L1191l5283i4833M6472a8808D681e4979j6214K9633j03108
11175a44668A1756b42026A52036m9444B9728a69615B31613b81480B81520I3795
$$ y = [6638, -133076, 164795, -26830, 95305, -123583, -152388, -64771, 116442, -114435, 94176, -290052, -49554, -28836, -52471, -118170, 16757, -491010, -211746, 109842, -92251, 63566, -14396, 15860, -180623, -76261, 203274, 166371, 347947, -52447, 23279, 173923, 84948, -283964, 148169, -83507, 263808, 131260, -128697, -122874, -125656, -226354, 360149, 3003, -74856, 137400, -273794, -120317, -169952, 30118, 147622, -47165, -8830, -2965, -399448, 242509, 103504, -286877, -31047, 302392, -278780, -134168, -305767, -209754, 157253, -25079, -43126, -41739, -13586, -300686, 193676, -17601, -102769, -222871, -191680, -226963, -94833, -48361, -18808, 4681, -54979, -71193, -41560, -144668, 11756, -242026, 152036, 102592, 29728, -169615, 231613, -281480, 281520, 93795]
11164C01186c36545h8589H2733c5971E7843b28258A83482i5306l6508K5818n3289
11153a59285A07040i3963A142J10039J54319A7132N8148k52R8718c03482a49266
11141D47963A02830a42002C1000f3179C63450j09148j611a55748l8698A07683
11130F1681J13603c9414F7200a00664b5296l11112B81278A07141P3907J25211
11120C06259a90575h1625J6474B6608K27755j24596i388A2657P1063M9231L35374
11109D68325B03170J44217o9891q27j01763C0887L10980A24757L29141A44243
11098e4131B25414r2321G173K20553q5629D4837J54413q164l9946K4149J90386
11087C65675A54884h3042C65761R8609A16419K60436A58434J18298K57724k61334
$$ y = [301186, -336545, -88589, 82733, -35971, 57843, -228258, 183482, -95306, -131814, -105996, -159285, 107040, -93963, 1142, 111181, 265500, 17132, 75280, 75028, 173746, -303482, -149266, 447963, 102830, -142002, 31000, -63179, 363450, 254302, 252691, -155748, -194446, 107683, 61681, 175284, -39414, 67200, -100664, -25296, -336408, 281278, 107141, 181048, 306259, -190575, -81625, -65151, 26608, 254363, 129767, -9388, 12657, 83720, 132951, 468325, 203170, 347387, 277496, 276669, 174906, 30887, 341867, 124757, 453898, 144243, -54131, 225414, 133093, 7173, 227726, 142097, 44837, 199250, 191086, 151140, 175289, 365675, 154884, -83042, 365761, 464370, 116419, 376855, 158434, 276732, 534456, 273122]
11077B73122K67960A95066J54635e1977A18353K01976F8079Q4964N30038B51804
11066C21773N7056b5422E63561o0851A97530K83502p2545P3872q7199k1919n1532
11055C21709M76216j81262R9890j15828K94485p2009k56408J92539O8289O4625
11045H92246j11141J9030J68671l47964N3948K06341k3551P3319j70961l0187
11035G29751J32489L3919J34097C20341N27230D04236P10312l58202J85553j51897
11025G90002j46241M9885M86193l26737L6378j8074j88592Q0881l17977M9711
11015D95429l7578L56428J96625l14444L114J25158p7957j73194P6996m0408N60812
11004A170981m33122J40363k26252L0551J24699L73556k04355D73556J55983J0544
$$ y = [273122, 541082, 195066, 349701, -51977, 118353, 320329, 68079, 153043, 683081, 251804, 321773, 378829, -25422, 563561, 502710, 197530, 481032, 408487, 482359, 395160, 373241, 321709, 797925, 616663, 716553, 600725, 895210, 823201, 566793, 759332, 827621, 892246, 781105, 800135, 968806, 620842, 674790, 881131, 857580, 930899, 759938, 729751, 862240, 896159, 1030256, 320341, 847571, 404236, 1114548, 756346, 941899, 790002, 643761, 693646, 1179839, 853102, 889480, 871406, 682814, 763695, 445718, 495429, 457851, 814279, 1010904, 696460, 699574, 824732, 746775, 573581, 650577, 610169, 1170981, 737859, 878222, 651970, 682521, 807220, 1180776, 976421, 473556, 629539, 640083]
10994F40083n3829k6532M38818l06109J41972n4935P8060n6038J26487K96165
10984A224142k23881J86554q3245K51013j63321R9245L21966J06565n5341K77162
10974A940859O17089j47607L94646L92790R5654N0409k5220J50765k73850o76702
10964B518833l03407o5402l70036n9898j62317o5756l43065K98239K5958l6093
10954A437056l56681k0449J29697k95562j70595J40439j84092r6267c1828D94150
10943D05769R2452A88197K58587A63553a05D90844A36949E2959K22029N6776C4002
10931C36536B4673N0370l4917L90941A08992J33866j6678j04574J04937c9912
10920F950J40610N4733I7373J02282C9643n503N1032a24729N9249B99536j9933
$$ y = [640083, 586254, 559722, 998540, 692431, 834403, 779468, 857528, 801490, 927977, 1224142, 1000261, 1186815, 1103570, 1354583, 1191262, 1290507, 1612473, 1719038, 1663697, 1940859, 2557948, 2410341, 2804987, 3197777, 3293431, 3343840, 3318620, 3469385, 3195535, 2518833, 2215426, 2150024, 1779988, 1720090, 1557773, 1492017, 1148952, 1447191, 1473149, 1437056, 1080375, 1059926, 1189623, 894061, 723466, 863905, 679813, 583546, -31828, 494150, 405769, 498221, 188197, 446784, 163553, -105, 490844, 136949, 52959, 274988, 331764, 34002, 336536, 24673, 75043, 40126, 431067, 108992, 242858, 226180, 121606, 226543, -39912, 6950, 147560, 202293, 97373, 199655, 39643, 34140, 85172, -124729, -65480, 299536, 279603]
10909B79603j23388b1115A96843D775f7599H6395a01343B49486f7388J2101J7800
10898c7487C47927j73691l8575a6836k26992B48068g5640R178A8732a16153e2834
10886a8184B64020p5863a36810k38281a71632l8579b1876r733I1168b79707g2492
10874h6004E553a03599N0479G6121a12942A77982b16562B80521j28576d55898
10863B85851F7259a03501A59777b9442q3418b1408B84041a86709k31271K05362
10853b12618B78086b14309B46579j01292K00915F4446b84423f4235B22503a87136
10842B65670h2270J2150A10094l4832a33199B759P2031c01960D619K58921d1671
10830b66012H790d6786f569F9887a74279b5524C12821b41667O4031L9894o8444
$$ y = [279603, 156215, -21115, 196843, 4775, -67599, 86395, -101343, 249486, -67388, -55287, -37487, 347927, 174236, 135661, -16836, -243828, 248068, -75640, -66462, 18732, -116153, -52834, -18184, 264020, 188157, -136810, -375091, -171632, -210211, -21876, -31609, 91168, -279707, -72492, -86004, 5553, -103599, -53120, 76121, -112942, 177982, -216562, 280521, 151945, -455898, 285851, 67259, -103501, 159777, -29442, -112860, -21408, 284041, -186709, -417980, -212618, 278086, -214309, 246579, 145287, 346202, 64446, -284423, -64235, 222503, -187136, 265670, -82270, -70120, 110094, 75262, -133199, 2759, 74790, -301960, 4619, 263540, -41671, -266012, 8790, -46786, -6569, 69887, -174279, -25524, 312821, -241667, -177636, -137742, -206186]
10819b06186j59107A71643g019A34529n558c26183C3531N0983C0231b1955J45
10808b1810j44016o6931A35646b64820M8203j39255c5231B9522J21582b96826
10797a04244j47728m8874G0534B2247J12947k583g7707A05683K08602a73587j40426
10786c14013M2306H053g7250A49820h6350o2494p9813d709A71501A443c3145l41177
10774c74322a15156j8997G3621J71319j13087b965A96908b80062F7802k3728K2333
10763F6407d4483H9033a27081p7616R0041k18303G173N9442a18073D3683i0658
10751c937q4230M2218j32524A64904a30179b0721E6958Q9725b97020d1349k1497
10740f2846k11930e2291m2924A09631j9985B4041J53219n614D7560b06130i336
$$ y = [-206186, -365293, 171643, -7019, 134529, 128971, -326183, 33531, 84514, 30231, -21955, -21810, -165826, -232757, 135646, -264820, -216617, -355872, -35231, 29522, 151104, -296826, -104244, -251972, -300846, 70534, 22247, 135194, 132611, -77707, 105683, 314285, -173587, -314013, -271707, 8053, -77250, 149820, -86350, -148844, -228657, -4709, 171501, 1443, -33145, -374322, -115156, -134153, 73621, 244940, 131853, -2965, 196908, -280062, 67802, 44074, 66407, -44483, 89033, -127081, -204697, -114656, -332959, 7173, 66615, -118073, 43683, -90658, -3937, -88167, -45949, -178473, 164904, -130179, -20721, 56958, 146683, -297020, -41349, -62846, -274776, -52291, -95215, 109631, 89646, 24041, 177260, 171646, 47560, -206130, -9336]
10728A36627Q3669a89316j28123a42325l8128N6771j75534J20273F016a52528
10717G5161a9636q4362n9859A35790c1259c88p3429B9850O913K77345a15216j05937
10705b21153O1220n234k00626C77250i6305n0459q2A1981L6570K63625b89075
10693B01440C744K3701F660b77845j30412b6400j8214k74226C653J8810g8161
10681a18233j19437a4384k30534D5919b42910k6149d7204j29943A08607d9920
10670H311b17972r2554A79359E7935b05365p0556g5253A79507b11094M7487j8306
10659a81913J0351j53720a02945F980J5668a39742c0067A74543b23226A48033
10648e9311a875j0996j7769m2502r5830c4881G3755K29034c7436r129j51785i7813
$$ y = [136627, 220296, -189316, -317439, -142325, -180453, -123682, -299216, -178943, 6016, -152528, 75161, -19636, -103998, -163857, 135790, -31259, -388, -73817, 29850, 36763, 314108, -115216, -221153, -159933, -165167, -365793, 377250, -96305, -146764, -146846, 11981, 48551, 312176, -289075, 201440, 3744, 27445, 6660, -277845, -408257, -26400, -44614, -318840, 3653, 22463, -78161, -118233, -237670, -14384, -244918, 45919, -242910, -269059, -47204, -177147, 108607, -49920, 8311, -217972, -310526, 179359, 57935, -205365, -275921, -75253, 179507, -211094, -163607, -181913, -171562, -325282, -102945, 6980, 22648, -139742, -30067, 174543, -223226, 148033, -59311, -1875, -12871, -30640, -73142, -168972, -34881, 73755, 302789, -37436, -46565, -198350, -97813]
10635c4138j18029I7524a8245E4192L89070h5425N275A12124e6131m6768j99008
10624c01907c5053j105J4054j5707j06314L0425k53931a22867A99834A0946a97825
10612b96016H0380h067m0870k9254D4745A549L0588a88449D01102B3812a75195
10600h1418j06335J8347A73895J13212j34877a08597A20014K949a34086A54943
10589b65920j0178J01215h59A81683b52537A0763d9346B05245b79059J23133j6699
10578a72625B91125j33646a38706A78013a06782j04874N9472k2296A75128J64674
10568C39802a73672H2312a63576b6358o5250A0221O0627a16305N5381k59420A3769
10556b6819k32098Q2298A01236j7837i6656B20155K0584E4348a92717j4432e6075
$$ y = [-34138, -152167, 97524, -18245, 54192, 443262, -85425, -80150, 112124, -56131, -102899, -301907, -35053, -36158, -22104, -37811, -144125, -113700, -367631, -122867, 199834, 10946, -197825, -296016, 80380, -8067, -48937, -78191, 44745, 1549, 32137, -188449, 401102, 23812, -175195, -81418, -187753, -169406, 173895, 287107, 152230, -108597, 120014, 122963, -134086, 154943, -265920, -276098, -174883, -859, 181683, -252537, 10763, -49346, 205245, -279059, -155926, -172625, 291125, 157479, -138706, 178013, -106782, -211656, -152184, -174480, 175128, 339802, -173672, 82312, -163576, -26358, -91608, 10221, 70848, -116305, -60924, -320344, 13769, -26819, -258917, -176619, 101236, 83399, -96656, 220155, 240739, 54348, -192717, -207149, -56075]
10544a65975A8522J01906a5673k4387C41551E4223K021J0257b2572A2239J94407
10533B06646o5761f0757j00892b1764j85969J7014D5976d2528A45655R5186c57745
10521c25357d8377A17069K35487D7399a16593E6895d8333H7645L11650H972M6191
10510E5163k3736A2347b88810A20067a68899k9755C6273J47459b99059R5741F8628
10498a74653L8474B02915n3624B4860a98389g1009B09268r0114a88261j1579m9530
10487b49370E2720K49776b8974b750C9079q762a62364A50824N8503O6125A08885
10475D27645F676J06659Q8507J87107c2764j69802j8023D8792K02594h1552l24326
10464d05878c5590j4642B13144a20819A18882J66983j31375a34247C4995c4039
$$ y = [-165975, 18522, 120428, -15673, -40060, 341551, 54223, 56244, 66501, -22572, 12239, 206646, 140885, -60757, -161649, -21764, -207733, -190719, 45976, -42528, 145655, 240841, -357745, -325357, -48377, 117069, 352556, 47399, -116593, 56895, -48333, 87645, 399295, 8972, 55163, 31427, 12347, -288810, 120067, -168899, -198654, 36273, 183732, -299059, -203318, 68628, -174653, -136179, 202915, 149291, 24860, -198389, -71009, 209268, 119154, -188261, -199840, -249370, 52720, 302496, -28974, -2750, 39079, 30317, -162364, 150824, 209327, 275452, 108885, 427645, 6676, 113335, 201842, 388949, -32764, -202566, -220589, 48792, 251386, -81552, -405878, -35590, -50232, 213144, -120819, 118882, 285865, 154490, -134247, 34995, -34039]
10453c70339J28593N2967B63604a08274c7456k9381p9929A31105b43594B55438
10442b20639B6369K25178a14189n1117A83146a6820l05121D10417A51765C8895
10431A17688B9486f1602j19219B02787b52425P5016e9185D2230e0241H1247i8756
10419d31716b9731k4564j83379C42808c8362k7011o4760A74487f7173A12165k5296
10408H6869b96516e48j25174K391A70969J66524j18594N2974h6110a6916B3645
10396a63795B87683b51413A75828e3959A84109N8428I7753K24341j14185n7393
10386A50516M54611A31965O7195A6802J9927J97975k1475J17588A6621J68865
10376A85486O7819A23920I118J13810a14342C8592J78699L43830B78205j31416
$$ y = [-370339, -241746, -188779, 263604, -108274, -37456, -66837, -146766, 131105, -243594, 255438, -220639, 26369, 251547, -114189, -165306, 183146, -16820, -321941, 410417, 151765, 38895, 117688, 29486, -61602, -180821, 202787, -252425, -177409, -59185, 42230, -50241, 81247, -98756, -431716, -29731, -54295, -237674, 342808, -38362, -65373, -130133, 174487, -67173, 112165, 86869, -296516, -548, -125722, -123331, 170969, 337493, 218899, 271873, -86110, -16916, 23645, -163795, 287683, -251413, 175828, -53959, 184109, 242537, 97753, 322094, 207909, 150516, 605127, 131965, 199160, 16802, 36729, 234704, 213229, 330817, 16621, 185486, 253305, 123920, 9118, 122928, -114342, 38592, 217291, 561121, 278205, 146789]
10366A46789R7871L86115R2672C02151r460J94192r0796n9758B0446k624R2146
10355A09968K13605c922D29875K32356C26453P7669N21507k02456C14703f7687
10344G02271C40818o544j55749M9346K25466j44717m1848B0435K48709B7604J0655
10333C8259h5960C93930B7281K97768r3941e257C26575q8324P4349K66276D2242
10321E77717H575L06286E2770h253D2590a74860A46011O1783G0262B8334b31507
10309a10913A44983K187b48657M1806A07868b68745J26359F5410a39192A6012
10298A54876J37181a42057A28919a37575A8619L25237j3274f0080H6847Q273k9826
10287F5294a50524A64229a31399j27392C16251A06383A9394N3429f9441B22877
$$ y = [146789, 244660, 630775, 723447, 302151, 292691, 486883, 396087, 336329, 20446, 17822, 109968, 323573, -3922, 429875, 662231, 326453, 404122, 925629, 723173, 314703, -67687, 702271, 340818, 334274, 178525, 227871, 453337, 308620, 266772, 20435, 269144, 27604, 38259, -85960, 393930, 27281, 325049, 231108, -5257, 326575, 238251, 312600, 578876, 42242, 577717, 8575, 314861, 52770, -8253, 42590, -174860, 146011, 207794, 70262, 28334, -231507, -110913, 144983, 147170, -248657, -206851, 107868, -268745, -142386, 65410, -139192, 16012, 154876, 292057, -142057, 128919, -137575, 18619, 343856, 330582, -60080, 86847, 95120, 65294, -150524, 164229, -131399, -258791, 316251, 106383, 19394, 72823, -69441, 222877]
10276A81956b01604B88265k6924D431R8547i728j89105B87481J6565a53410D7387
10264A85920C916g6824D1413K05295A01508b0086D7349d6403A12605L31885G7886
10252B00098C0913J97743a34116k3560j08672A01891N3072C7513a74734N962L8310
10241a30462b3356B98403c66746J3867h7428k76489g2190E1260b52321b8000j66168
10230a94168P5196K5400p5809A1275d42070b0575k9501p6045p6547k09210a63664
10218H2655a64924C23210b06313R1493k99923J25601E1990J36541h9638j3615
10208a03253A9709i6111C1344a11301j84402a8927p19B4475N4750K31316a67965
10196B231b07662h1263L8085C6351a34302j59938F7550a28897c1917A89085a50888
$$ y = [181956, -201604, 288265, 261341, 4431, 102978, -9728, -198833, 287481, 304046, -153410, 47387, 185920, 3916, -76824, 41413, 246708, 101508, -20086, 47349, -46403, 112605, 444490, 77886, 200098, 30913, 228656, -134116, -157676, -266348, 101891, 154963, 37513, -174734, -168772, -130462, -23356, 298403, -366746, -352879, -87428, -363917, -72190, 51260, -252321, -28000, -194168, -118972, -93572, -169381, 11275, -442070, -20575, -50076, -126121, -202668, -411878, -163664, 82655, -164924, 323210, -206313, -114820, -414743, -289142, 51990, 188531, -89638, -103253, 19709, -96111, 31344, -111301, -295703, -18927, -19646, 24475, 79225, 310541, -167965, 2231, -207662, -81263, -43178, 36351, -134302, -294240, 67550, -128897, -31917, 189085, -150888]
10184a88635j90358e1126l18893f9798J2902a2790j77849A42796b17552g9549
10173b25821a11735k7906a0170j51293k59411H1563I436a35827D6133a29700m6722
10162a76422Q849M5473q6355P4754A30456K470c8229H0470b720q854j69392J900
10150a79066A76099o4585f2752C8278M7823f9548n9031A34816J58173f9804l1407
10139a01211j30288m419M0043B02025H1637b3738j07195j05898d9807C5629E4
10127b95865a18009M0296n896A90507A2215c09834A61531D280f792A14796b17422
10115G8951N6223i0863l824c1529j76424a27A8350c0196F9447k1775b48782i3438
10102D7604K8784e1397A71738e7931B16645k3974M2290a4467n65526B13597Q25
$$ y = [-188635, -378993, -51126, -370019, -69798, -56896, -12790, -190639, 142796, -217552, -79549, -225821, -111735, -139641, -10170, -161463, -420874, 81563, 9436, -135827, 46133, -129700, -176422, -167573, -122100, -208455, -133701, 130456, 132926, -38229, 80470, -2720, -11574, -180966, -179066, 176099, 111514, -62752, 38278, 86101, -69548, -128579, 134816, 292989, -69804, -101211, -231499, -235918, -195875, 202025, 81637, -23738, -130933, -236831, -49807, 35629, 54, -295865, -118009, -77713, -83609, 190507, 12215, -309834, 161531, 4280, -6792, 114796, -217422, 78951, 135174, -90863, -94687, -31529, -207953, -127, 18350, -30196, 69447, 47672, -248782, -93438, 47604, 76388, -51397, 171738, -57931, 216645, 192671, 234961, -14467, -579993, 213597, 214422]
10091B14422F2454a91528B6830J07240m1418p421a57757E686a04797L5271A72880
10079f5580B24381b38325J01305j69447O0862a03100D7063L37929D1781H339e3950
10067B83730A15585a92860b2059l72344N9889i1881B1670J908e8315j7713j48194
10056b24222e9276A11993a86746Q502J7376l1281j52848a23066c8617j52057C2354
10044b2272l5896B3236P5058e27918i9746d8272g076k30649H9050c7569A30595
10032a04135j86963J34568K1597k56572e0504j9154k49880A81569b37777h886
10021c12013R1627C15954h8155m7036j7861a9272A67951p7710a26032A31273a06735
10009F2792Q3614h9175K1248B73511a36987L9029n8037A66237h8879A2844L22157
$$ y = [214422, 62454, -191528, 26830, 134070, 92652, 85231, -157757, 5686, -104797, -69526, 172880, -65580, 224381, -238325, -137020, -306467, -245605, -103100, 47063, 384992, 41781, 8339, -53950, 283730, 115585, -192860, -22059, -394403, -334514, -91881, 21670, 23578, -58315, -76028, -224222, -59276, 111993, -186746, -178244, -160868, -192149, -344997, -123066, -38617, -190674, 32354, -22272, -58168, 23236, 98294, -527918, -99746, -48272, -7076, -237725, 89050, -37569, 130595, -104135, -291098, -156530, -134933, -391505, -50504, -69658, -319538, 181569, -237777, -8886, -312013, -220386, 315954, -88155, -135191, -153052, -19272, 167951, 90241, -126032, 131273, -106735, 62792, 146406, -89175, -67927, 273511, -136987, -97958, -155995, 166237, -88879, 12844, 335001]
9998C35001b03116n7682G7075h5591k99963c5652J4938k53077k3162c0763A28316
9986b50379e0380B192J60144q0912J16377A8295R173J32365d07510h1469A13349
9974a10888j7967E9659M8835c34926E0891a18633L9007r8539B3787J74172b20268
9962i5975j32951C71010a50674j34267I8366a13351j87485J15598O1443P602A59960
9950B62466G8644L8227c4559G0520a25248N4247B71060M2833f7065J2592O257
9939d8216F2611J54387c51853A2105e71634A11735b32293A09734j6061a32459
9928b9976j77906m0367k4753B00494b83003J5364A84155H1385b7392k30189c1063
9916b84776A92507c25102J21445b2557l59125A31814M0854m8210b09208p4510
$$ y = [335001, -203116, -260798, 77075, -85591, -385554, -35652, -20714, -273791, -296953, -30763, 128316, -250379, -50380, 2192, 162336, 81424, 197801, 18295, 27468, 159833, -407510, -81469, 113349, -110888, -128855, 59659, 108494, -334926, 50891, -118633, -79626, -178165, 23787, 197959, -220268, -95975, -228926, 371010, -150674, -284941, 98366, -113351, -300836, -185238, -123795, -116193, 159960, 262466, 78644, 116871, -34559, 70520, -125248, -71001, 271060, 313893, -67065, -54473, -48216, 62611, 216998, -351853, 12105, -571634, 111735, -232293, 109734, 93673, -132459, -29976, -207882, -248249, -273002, 200494, -283003, -267639, 184155, 81385, -27392, -257581, -31063, -284776, 192507, -325102, -203657, -22557, -381682, 131814, 172668, 124458, -209208, -283718]
9906b83718J10295k69495a0455m0715F2815d13965H6444p914a83882n143g2067
9894a98856a3289n5559p0984e4938j56036N9845M2659K183a0956k45278R7959
9883a58275L1555p0421i3540B8512a44212K2171J9787A42171a09365A42361a59707
9871C2865L43683a59522r7748F2586a86965l0696m7197R0339O7984A0419g653
9859a039m2147q2665D8306g057n1905E1439a59069N6838m9865r7699A57996n2306
9847A05690a08458k54233N9241E9428R0206a93379L1423a1710j06468C32115l7355
9836B94760A17581g0853P724j92559N5886O7849B78213a77546A91933A588a08902
9824c08301I8451g937H983a94650E2730a06718r1577i0787j09921B86334b01285
$$ y = [-283718, -173423, -442918, -10455, -51170, 62815, -413965, 86444, 78530, -183882, -189025, -72067, -198856, -13289, -68848, -139832, -54938, -210974, -151129, -108470, -106287, -10956, -256234, -158275, -126720, -197141, -93540, 28512, -144212, -122041, -102254, 142171, -109365, 142361, -159707, 32865, 376548, -159522, -257270, 62586, -186965, -217661, -264858, -174519, -106535, 10419, -7653, -1039, -43186, -125851, 48306, -7057, -58962, 51439, -159069, -102231, -152096, -249795, 157996, 105690, -108458, -362691, -303450, 59428, 149634, -193379, -161956, -11710, -118178, 332115, 294760, 117581, -70853, -63129, -255688, -199802, -131953, 278213, -177546, 191933, 1588, -108902, -308301, 98451, -7937, 8983, -194650, 52730, -106718, -198295, -90787, -200708, 286334, -201285]
9812A09094K4226a54357O2100G4889c1890j97905A83557c32996D5479c47248F748
9800a88578q8131A20966a8714F8072c4195R020F7059h0749n0197e0142A16298
9788C29370a24054b6263j35430B34391r8981a61695E2418a39861N8999g997r0351
9777i8348D5887b37386F4844B5807a36192M3166k6022a5423A3847b03261k7179
9766b30440A43361L7477F2581a6799F4136k7408K1546K3758g1497p3274A43018
9754a26264c8068F6373g6183A44584l0256a10004e3038k16932J26759p8390N5485
9743a66116E2381J18980b88579m0660i140B5089J84352F091b41666a8495A3233
9731G7000a90624P7243H5546A1186f5710F2195b49664A9835J2153a94468B0793
$$ y = [109094, 133320, -154357, -92257, 74889, -31890, -229795, 183557, -332996, 45479, -347248, 6748, -188578, -276709, 120966, -18714, 68072, -34195, -25175, 67059, -80749, -130946, -50142, 116298, 329370, -124054, -26263, -161693, 234391, 135410, -161695, 52418, -139861, -80862, -7997, -98348, 45887, -237386, 64844, 25807, -136192, -93026, -119048, -15423, 13847, -203261, -230440, 143361, 180838, 62581, -16799, 64136, 36728, 58274, 82032, -71497, -144771, 143018, -126264, -38068, 66373, -76183, 144584, 114328, -110004, -53038, -269970, -143211, -221601, -166116, 52381, 171361, -288579, -329239, -9140, 25089, 209441, 6091, -241666, -18495, 13233, 77000, -190624, -113381, 85546, 11186, -65710, 62195, -249664, 19835, 31988, -194468, 20793]
9719a6295C2600a24962N241m162A26561J28151p3854C7153J27453k8979c02181
9707a62160n5369I1184a85104I3956a58390c3112A82554c43695a06720M4476g386
9695d3462r6361D7221d3242j9615n8907B25150a93564k91996a54235k42771A33016
9683e6708b1809I0730b55588L7914r715A16702d24152a71998B32877d275k60122
9672b64397B2746b5793j70911G6863J24598f7340j7124A08578K9349P4076d1976
9660a70375d4275o5306n6704P191A35944h4146D5720M4381j7028a54346j15075
9649b69421A08324Q1172d21516b01282J4629A35467b28426f303B7048b41624J3998
9638b27626e0087D4131d00215A45843J02354l030b22478b4893j89705A26908L95
$$ y = [-16295, 32600, -124962, -119721, -123883, 126561, 254712, 180858, 37153, 164606, 135627, -302181, -162160, -217529, 91184, -185104, 93956, -158390, -33112, 182554, -343695, -106720, -62244, -7386, -43462, -139823, 47221, -43242, -62857, -121764, 225150, -193564, -485560, -154235, -397006, 133016, -56708, -21809, 90730, -255588, -217674, -227389, 116702, -424152, -171998, 232877, -4275, -264397, 22746, -25793, -196704, 76863, 201461, -67340, -84464, 108578, 137927, 212003, -41976, -170375, -44275, -109581, -166285, -159094, 135944, -84146, 45720, 90101, 73073, -154346, -269421, 108324, 189496, -421516, -201282, -186653, 135467, -228426, -6303, 27048, -241624, -227626, -50087, 44131, -400215, 145843, 248197, 245167, -222478, -24893, -214598, 126908, 127303]
9627A27303O0761D967Q906J26672E6913J10054a45115a00n6333o36760a43241
9615a94566C26579B9509b06933H5702c43106B35119a95469B08939D5108A2401
9604d3892B50613a80754C5997b36813n4651f0359B50142A24335c1986l18221D3289
9592f2748m4925L3157j9074b9213j18477e0800l37691g2562j66961j62231i4994
9580a92798B5377f5001H8381b11A55607c86845J54394c1109H6396J2992h4204
9568a60937m3300A28849K4036B7816h8453r6995h3745k16478e8641k12865e99
9556A76025F2926M7528h9591M4419a0652l35722B99527b17152O5402j50169B12116
9544f3053j27661j29656F2158i2336i805q8171N929k27494j14961A9061O4873
$$ y = [127303, 188064, 4967, 13873, 140545, 56913, 166967, -145115, -100, -56433, -693193, -143241, -194566, 326579, 29509, -206933, 85702, -343106, 235119, -195469, 208939, 45108, 12401, -43892, 250613, -180754, 35997, -236813, -291464, -60359, 250142, 124335, -31986, -350207, 43289, -62748, -107673, -74516, -93590, -29213, -147690, -50800, -388491, -72562, -239523, -401754, -94994, -192798, 25377, -65001, 88381, -211, 155607, -386845, -232451, -31109, 86396, 99388, -84204, -160937, -204237, 128849, 152885, 27816, -88453, -185448, -83745, -300223, -58641, -271506, -599, 176025, 62926, 110454, -89591, -45172, -10652, -346374, 299527, -217152, -151750, -301919, 212116, -63053, -190714, -320370, 62158, -92336, -9805, -97976, -92047, -319541, -434502, 19061, 83934]
9533H3934a29678m9858d9439A48806b14080f544j27904B31496C944c9983I8522
9521b13615r7143A19681b87604j1712g1364P3j35558F2217M0201C7679m914f783
9508a27076D2725N5495a92791g2502a5856I4507a02508j95133O4347j305P4056
9497a60543M7178r0437j424R8364k62405i4942B12390E2330N1166K8577b32449
9485b34586M9117k02384a87000k8818b355A40408a52406A00372b7206k42986M8931
9474b21261D9867h0436r5167d4189D49271a57762F3158k6397b65032F4565a65766
9462B57751a64652O4143p52j13272I0274a66909g1849o5181j60457A25816a31084
9450B64473l5881G1085f6925c2387k25088J04166L0126b2033E6500a0100A66890
$$ y = [83934, -129678, -179536, -49439, 148806, -214080, -6544, -134448, 231496, 3944, -39983, 98522, -213615, -310758, 119681, -287604, -299316, -71364, -71291, -206849, 62217, 102418, 37679, 32765, -6783, -127076, 42725, 98220, -192791, -72502, -15856, 94507, -102508, -297641, -233294, -234599, -160543, -113365, -203802, -205226, -106862, -369267, -94942, 212390, 52330, 103496, 132073, -232449, -234586, -185469, -387853, -187000, -215818, -2355, 140408, -152406, 100372, -27206, -270192, -221261, 49867, -80436, -175603, -44189, 449271, -157762, 63158, 36761, -265032, 64565, -165766, 257751, -164652, -100509, -101261, -214533, 90274, -166909, -71849, -137030, -297487, 125816, -131084, 264473, 228592, 71085, -66925, -32387, -257475, -153309, -123183, -22033, 56500, -10100, 166890]
9438a49969n0806R6151o0794A29979d2978j398j38750N8122c0631q9763B043b085
9425i2163k08429g4508j37193E4812K08038A26971R7628e74151D3593P9250O1085
9414A83928c87740k1470B0920c94441C04257a2990j13206k58332a9833j07764
9404a27597A9235g3194C566d82891e4E3427f6430A8982J46787a33964J9063A46578
9391b65421E1313j3501c7070A74045b95647J23890a4940j35401j5780B6386a41857
9379f6512B18208a82947L4263d2523j1427G3812a07203A34321J77168j39515a00482
9367a76177k32923a00099m0822c3814R794E7135b95953K8003a21590j3675o3826
9356a99091D0585b78003R2365B59069E9171a40321j81951J24343n3285C0665a75639
$$ y = [-149969, -200775, -104624, -165418, 129979, -42978, -44376, -183126, -125004, -30631, -120394, 2043, -2085, -92163, -300592, -74508, -211701, 54812, 262850, 126971, 224599, -574151, 43593, 122843, 183928, -387740, -409210, 20920, -394441, 304257, -12990, -126196, -384528, -19833, -127597, 19235, -73194, 3566, -482891, -54, 53427, -66430, 18982, 165769, -133964, -114901, 146578, -265421, 51313, 37812, -37070, 174045, -295647, -171757, -14940, -150341, -166121, 26386, -141857, -66512, 218208, -182947, -148684, -42523, -53950, 73812, -107203, 134321, 311489, 171974, -100482, -176177, -409100, -100099, -140921, -33814, -24020, 57135, -295953, -267950, -121590, -135265, -199091, 40585, -278003, -185638, 259069, 59171, -140321, -322272, -197929, -251214, 30665, -175639]
9344h234m3721k37786a35142m5862N7599A2944L68503D0223G300A340c5536j25427
9332a60963A87351a49877j89172a9275j30137j19616A69513b18528A37979a90903
9321g4437B6265J9810J8943a63827a7084E599b44022g5911B964J33406c66788
9309B04849b01478L2387B34512a89604A25800h862D03193c0328A97196c57795
9298A06654J20386a73382K2531a3116D2748b1943k37286l3396B5059c90983M6291
9287c44692a14464L3068j42302A41059a09045j0860L7631j46572a9046B0155a82030
9275b10520G1599b66588e8791j8328j58681b5144n2209k22963A49202i2284o9862
9264a62146A40556a24218J6202j96704C9949A5835h7633A307C44J56818f8625
$$ y = [-8234, -51955, -289741, -135142, -181004, -123405, 12944, 381447, 40223, 7300, 1340, -35536, -160963, 187351, -149877, -339049, -19275, -149412, -269028, 169513, -218528, 137979, -190903, -74437, 26265, 46075, 65018, -163827, -17084, 5599, -244022, -75911, 2964, 136370, -366788, 204849, -201478, -169091, 234512, -189604, 125800, -8862, 403193, -30328, 197196, -357795, 106654, 227040, -173382, -150851, -13116, 42748, -21943, -259229, -292625, 25059, -390983, -344692, -114464, -81396, -223698, 141059, -109045, -119905, -82274, -228846, -19046, 20155, -182030, -210520, 71599, -266588, -58791, -77119, -235800, -25144, -77353, -300316, 149202, -92284, -162146, 140556, -124218, -108016, -304720, 39949, 15835, -87633, 1307, 344, 157162, -68625]
9252f6576k37811C3328J96735j10971a58969G6723a76605q351A32580c9081j9041
9241e8122C05766b38838J08454M8714O931p9979j05525J04892g5427j74432A8405
9229h0984A9616b08556F1047c9403l354j00891c0117O427j63859o8201j34907
9218c90657G1832i2111k7609e0455b0981l6733k3900j34280f0598j41784d1475
9206f4883A7177g1086k35061i6960k13386O8232b6989p9867C2911e8061p348B0725
9193b03958M8798a5065C5236a86121A07624J35533b9349n3613k3735n8348a5523
9181h6765A6890b48530J23646B1564O6492l4026m530O7123J18198b06724A02747
9169b05173j11204d6487E8449A4430e7752A63140c0883A99163b98625B30238J51852
$$ y = [-66576, -304387, 33328, 230063, 119092, -158969, 76723, -176605, -184956, 132580, -39081, -58122, 305766, -238838, -130384, -81670, -74739, -154718, -260243, -155351, -75427, -249859, 18405, -80984, 19616, -208556, 61047, -39403, -42757, -143648, -30117, -23690, -187549, -255750, -390657, 71832, -92111, -119720, -50455, -20981, -57714, -81614, -215894, -60598, -202382, -41475, -64883, 17177, -71086, -306147, -96960, -310346, -242114, -26989, -106856, 32911, -58061, -65409, 20725, -203958, -155160, -15065, 35236, -186121, 107624, 243157, -29349, -82962, -106697, -165045, -15523, -86765, 16890, -248530, -124884, 21564, 88056, 54030, 49500, 116623, 234821, -206724, 102747, -205173, -316377, -46487, 58449, 14430, -57752, 163140, -30883, 199163, -298625, 230238, 382090]
9158C82090b89013L5738J354j43165F5631J56536E9762g4463K2393E2630a02395
9146g8013D1457R9289B9385M520l925J05690b20622E7194B7267a20286K4420M1564
9134e4302j1528p8403O419c6764k97333d6446D0156K5760Q0572g4640l6103a63
9121h4466J5888D9606b9868q2746n5859A0090d9825A70236d6019E4593R7597i7499
9108h0836a5244B04827a09939G5720C0360b28743p1571C25597h6300k7698B07165
9096c00169A45954b25933j62445c5583C2141J6167K46152a08588A01399i6454
9085d56738a08240K5250j99637E5872a78707r1181B9419a2307j44345A77092a99929
9073a08209j68029g6284K1604a6348o1761A66205l7633c81925h7165k98238C01324
$$ y = [382090, -289013, -253275, -251921, -395086, 65631, 222167, 59762, -74463, -52070, 52630, -102395, -78013, 41457, 140746, 29385, 33905, 29980, 135670, -220622, 57194, 27267, -120286, -95866, -54302, -65830, -144233, -137814, -36764, -334097, -46446, 40156, 65916, 146488, -74640, -110743, -163, -84466, -68578, 49606, -29868, -112614, -168473, 10090, -49825, 170236, -46019, 54593, 152190, -97499, -80836, -15244, 204827, -109939, 75720, 30360, -228743, -300314, 325597, -86300, -113998, 207165, -300169, 145954, -225933, -388378, -35583, 32141, 48308, 294460, -108588, 101399, -96454, -456738, -108240, -82990, -282627, 55872, -178707, -269888, 29419, -12307, -156652, 177092, -199929, -108209, -276238, -76284, -54680, -16348, -78109, 166205, 128572, -381925, -87165, -385403, 301324]
9061D4963c02566A17112g2095D2249P73J77572G2511N678f79270a00572J3382
9050h7190l0444D9279a75826B77598E9314i0306k83651d8548J1794E4385b6602
9038b48006A03318b5663j18054B8903b06473E2730a06029M3004H3772b04822k6714
9027b31536E1738P6394C9464c8337A23282i2853E9684b21645O4803n4386l2559
9016b43787A55644a00036F434c96841c952l85805B7980c03207R2982j46972H6478
9004D3848J88178a06685b5269I4427N0930a40664C3929O7188c33397A49940a412
8992b98964A13171d963l28910J04769J1726B6788a3139F4542c0083e719k01461
8981b07180C62283E9516g6402p4400c4338D2979a37409j220D2091b59174b2386
$$ y = [44963, -302566, 117112, -72095, 42249, 43022, 220594, 72511, 78189, -679270, -100572, -87190, -117634, 49279, -175826, 277598, 59314, -90306, -373957, -48548, -36754, 54385, -26602, -248006, 103318, -25663, -143717, 28903, -206473, 52730, -106029, -63025, 83772, -204822, -231536, 51738, 128132, 39464, -38337, 123282, -92853, 59684, -221645, -156842, -211228, -243787, 155644, -100036, 6434, -396841, -3952, -389757, 27980, -303207, -210225, -357197, 86478, 43848, 232026, -106685, -25269, 94427, 145357, -140664, 33929, 101117, -333397, 149940, -1412, -298964, 113171, -4963, -333873, -229104, -217378, 26788, -13139, 64542, -30083, -5719, -207180, 362283, 59516, -76402, -150802, -34338, 42979, -137409, -138629, 42091, -259174, -22386]
8969G1027R9246a07745D3261a99913j1995j64019d93l7552A2220K31765c3371
8957h5567k0452n4618n0865c7159k5668a7687o4436k7386j3648k86502G6929K8905
8945A05834a36459m9047F0120a77547A18217D894b5815A97546a35807E0481a8554
8933A50428B4828a49038B53562F0917n320A5398d02488a87134B71382J61627J19525
8922E52534P41417L409670A235695A70027Q4601n115E0200a16113F1852b41116
8911a14571A8854b00537C72228A06990A4147J6133f4941B06409a5170j04720B06151
8899i266A56362A0358e7124l579J2370H5619N7649i8944j0136A10143f2201B32497
8886A57046d1665a9098A39952o2228J69629p281c726A28686i9426g209k7443C14630
$$ y = [71027, 170273, -107745, 43261, -199913, -211908, -375927, -493, -38045, 12220, 243985, -33371, -85567, -106019, -160637, -211502, -37159, -62827, -17687, -82123, -109509, -123157, -409659, 76929, 105834, -136459, -185506, 60120, -177547, 118217, 4894, -25815, 197546, -135807, 50481, -18554, 150428, 24828, -149038, 253562, 60917, 55597, 15398, -402488, -187134, 271382, 433009, 552534, 1293951, 4703621, 1235695, 170027, 254628, 249513, 50200, -116113, 61852, -241116, -114571, 18854, -200537, 372228, 106990, 14147, 30280, -64941, 206409, -15170, -119890, 206151, -9266, 156362, 10358, -57124, -60703, -48333, 85619, 143268, -98944, -109080, 110143, -62201, 232497, 157046, -41665, -19098, 139952, 77724, 247353, 240072, -3726, 128686, -99426, -7209, -34652, 314630]
8873H370b73810A03632c2652F1822J33324e1088r4616f6973A59302a78603A0352
8861b25433j48473j1350a4220k55930g0580B15566b21757b6225A08238k079a49196
8849B4066c37436P0365i5005A57670c15953b2174M658j36818N9567B47921a19260
$$ y = [8370, -273810, 103632, -32652, 61822, 195146, -51088, -145704, -66973, 159302, -178603, 10352, -225433, -373906, -385256, -14220, -270150, -70580, 215566, -221757, -26225, 108238, 106159, -149196, 24066, -337436, -267071, -95005, 157670, -315953, -22174, -17516, -154334, -94767, 247921, -119260]
$$ [...]
##END NTUPLES=NMR SPECTRUM
##END=
