##TITLE=AC1714_3158_8749746_dLcrRJoP4r
##JCAMPDX= 6.0         $$ Bruker NMR JCAMP-DX V2.0
##DATA TYPE= NMR SPECTRUM
##DATA CLASS= NTUPLES
##ORIGIN= BRUKER
##OWNER= Administrator
$$ 1.72 TOPSPIN		Version 2.1
$$ 2015-08-12 02:45:52.257 -0700  Administrator@X
$$ Compression mode = diff/dup
##.OBSERVE FREQUENCY= 400.02188249412
##.OBSERVE NUCLEUS= ^1H
##.ACQUISITION MODE= SIMULTANEOUS (DQD)
##.ACQUISITION SCHEME= undefined
##.AVERAGES= 64
##.DIGITISER RES= 22
##SPECTROMETER/DATA SYSTEM= spect
##.PULSE SEQUENCE= noesygpps1d.comp
##.SOLVENT NAME= COFFEE_meoh
##.SHIFT REFERENCE= INTERNAL, COFFEE_meoh, 1, 14.96119
##AUDIT TRAIL= $$ (NUMBER, WHEN, WHO, WHERE, PROCESS, VERSION, WHAT)
$$ ##TITLE= Audit trail, TOPSPIN		Version 2.1
$$ ##JCAMPDX= 5.01
$$ ##ORIGIN= Bruker BioSpin GmbH
$$ ##OWNER= Administrator
$$ $$ E:\/data/COFFEE/nmr/AC1714_3158_8749746_dLcrRJoP4r/72/pdata/1/auditp.txt
$$ ##AUDIT TRAIL=  $$ (NUMBER, WHEN, WHO, WHERE, PROCESS, VERSION, WHAT)
(   1,<2015-08-12 02:45:47.039 -0700>,<Administrator>,<X>,<go>,<TOPSPIN 2.1>,
      <created by zg
	started at 2015-08-12 02:34:17.367 -0700,
	POWCHK enabled, PULCHK disabled,
       configuration hash MD5:
       21 0F 79 D6 B3 7B B4 F6 88 20 88 DB 03 48 BD 9F
       data hash MD5: 64K
       ED F0 5A 4F 36 7B 61 6F C7 7C 15 88 A5 57 93 F7>)
(   2,<2015-08-12 02:45:50.210 -0700>,<Administrator>,<X>,<proc1d>,<TOPSPIN 2.1>,
      <Start of raw data processing
       efp LB = 0.3 FT_mod = 6 PKNL = 1 PHC0 = 0 PHC1 = 0 SI = 128K 
       data hash MD5: 128K
       77 65 B8 F1 B1 AF AD 3E 8A 83 31 2D 62 8D BD D0>)
(   3,<2015-08-12 02:45:51.070 -0700>,<Administrator>,<X>,<proc1d>,<TOPSPIN 2.1>,
      <pk PHC0 = -89.80774 PHC1 = 0 
       data hash MD5: 128K
       0F 08 E9 65 C1 97 1C CB 87 62 4F 8D 08 B0 1E B3>)
(   4,<2015-08-12 02:45:51.445 -0700>,<Administrator>,<X>,<proc1d>,<TOPSPIN 2.1>,
      <abs ABSG = 1 
       data hash MD5: 128K
       17 B1 E7 17 36 8D F0 11 98 23 20 7F 21 2D 9B 69>)
(   5,<2015-08-12 02:45:51.539 -0700>,<Administrator>,<X>,<proc1d>,<TOPSPIN 2.1>,
      <abs ABSG = 2 
       data hash MD5: 128K
       0D FB DB E7 07 5D B1 6B 0E 60 41 38 00 75 5B 41>)
(   6,<2015-08-12 02:45:51.617 -0700>,<Administrator>,<X>,<proc1d>,<TOPSPIN 2.1>,
      <abs ABSG = 3 
       data hash MD5: 128K
       14 E1 F6 68 4E 75 29 25 2F CF 2B 48 CD 38 CB FE>)
(   7,<2015-08-12 02:45:51.710 -0700>,<Administrator>,<X>,<proc1d>,<TOPSPIN 2.1>,
      <abs ABSG = 4 
       data hash MD5: 128K
       A6 9A 40 FE 6A 00 68 BF F6 09 80 10 5D FD 5D 6A>)
(   8,<2015-08-12 02:45:51.804 -0700>,<Administrator>,<X>,<proc1d>,<TOPSPIN 2.1>,
      <abs ABSG = 5 
       data hash MD5: 128K
       C4 DC 93 2D 0F 78 10 BC 5F 3D 97 94 1D FB 6E 68>)
$$ ##END=
$$ 
$$ $$ hash MD5
$$ $$ 17 7A 8A 3D 7E 19 D7 4C 1E EB EE 2F 83 4A E2 6E
##$RELAX= 
##$RELAX= 
##$RELAX= 
##$RELAX= 
##$RELAX= 
##$RELAX= 
##$RELAX= 
##$RELAX= 
$$ Bruker specific parameters
$$ --------------------------
##$DU= <E:\>
##$EXPNO= 72
$$ [...]
##$TP07= 0
##$TPNAME0= <>
##$TPNAME1= <>
##$TPNAME2= <>
##$TPNAME3= <>
##$TPNAME4= <>
##$TPNAME5= <>
##$TPNAME6= <>
##$TPNAME7= <>
##$TPOAL= (0..7)
0.5 0.5 0.5 0.5 0.5 0.5 0.5 0.5
##$TPOFFS= (0..7)
0 0 0 0 0 0 0 0
##$TUNHIN= 0
##$TUNHOUT= 0
##$TUNXOUT= 0
##$USERA1= <user>
##$USERA2= <user>
##$USERA3= <user>
##$USERA4= <user>
##$USERA5= <user>
##$V9= 5
##$VALIST= <valist>
##$VCLIST= <CCCCCCCCCCCCCCC>
##$VD= 0
##$VDLIST= <DDDDDDDDDDDDDDD>
##$VPLIST= <PPPPPPPPPPPPPPP>
##$VTLIST= <TTTTTTTTTTTTTTT>
##$WBST= 2048
##$WBSW= 25
##$XGAIN= (0..3)
0 0 0 0
##$XL= 0
##$YL= 0
##$YMAX_a= 6624009
##$YMIN_a= -12569599
##$ZGOPTNS= <>
##$ZL1= 120
##$ZL2= 120
##$ZL3= 120
##$ZL4= 120
##$ABSF1= 14.96119
##$ABSF2= -5.596992
##$ABSG= 5
##$ABSL= 3
##$ALPHA= 0
##$AQORDER= 0
##$ASSFAC= 0
##$ASSFACI= 0
##$ASSFACX= 0
##$ASSWID= 0
##$AUNMP= <proc_prof1d_extract.lims>
##$AXLEFT= 0
##$AXNAME= <>
##$AXNUC= <1H>
##$AXRIGHT= 0
##$AXTYPE= 0
##$AXUNIT= <>
##$AZFE= 0.1
##$AZFW= 0.1
##$BCFW= 0
##$BC_mod= 0
##$BYTORDP= 0
##$COROFFS= 0
##$CY= 15
##$DATMOD= 1
##$DC= 0
##$DFILT= <>
##$DTYPP= 0
##$F1P= 0
##$F2P= 0
##$FCOR= 0.5
##$FTSIZE= 131072
##$FT_mod= 6
##$GAMMA= 0
##$GB= 0
##$INTBC= 1
##$INTSCL= 1
##$ISEN= 128
##$LB= 0.3
##$LEV0= 0
##$LPBIN= 0
##$MAXI= 10000
##$MC2= 0
##$MEAN= 0
##$ME_mod= 0
##$MI= 0
##$NCOEF= 0
##$NC_proc= -2
##$NLEV= 6
##$NOISF1= 0
##$NOISF2= 0
##$NSP= 0
##$NTH_PI= 0
##$NZP= 0
##$OFFSET= 14.96119
##$PC= 1
##$PHC0= -89.80774
##$PHC1= 0
##$PH_mod= 1
##$PKNL= yes
##$PPARMOD= 0
##$PPDIAG= 0
##$PPIPTYP= 0
##$PPMPNUM= 2147483647
##$PPRESOL= 1
##$PSCAL= 4
##$PSIGN= 0
##$PYNMP= <proc.py>
##$REVERSE= no
##$SF= 400.020009560758
##$SI= 131072
##$SIGF1= 0
##$SIGF2= 0
##$SINO= 400
##$SIOLD= 131072
##$SPECTYP= <>
##$SREGLST= <1H.CDCl3>
##$SSB= 0
##$STSI= 131072
##$STSR= 0
##$SW_p= 8223.68421052631
##$SYMM= 0
##$S_DEV= 0
##$TDeff= 65536
##$TDoff= 0
##$TI= <>
##$TILT= no
##$TM1= 0
##$TM2= 0
##$TOPLEV= 0
##$USERP1= <user>
##$USERP2= <user>
##$USERP3= <user>
##$USERP4= <user>
##$USERP5= <user>
##$WDW= 1
##$XDIM= 131072
##$YMAX_p= 402605230
##$YMIN_p= -10960
##$CURPLOT= <Network HP LaserJet P1505>
##$CURPRIN= <$Network HP LaserJet P1505>
##$DFORMAT= <normdp>
##$LAYOUT= <+/1D_H.xwp>
##$LFORMAT= <normlp>
##$PFORMAT= <normpl>
##$SURQMSG= 1
$$ End of Bruker specific parameters
$$ ---------------------------------
##NTUPLES= NMR SPECTRUM
##VAR_NAME=  FREQUENCY,     SPECTRUM/REAL,   SPECTRUM/IMAG
##SYMBOL=    X,             R,               I
##VAR_TYPE=  INDEPENDENT,   DEPENDENT,       DEPENDENT
##VAR_FORM=  AFFN,          ASDF,            ASDF
##VAR_DIM=   131072,        131072,          131072
##UNITS=     HZ,            ARBITRARY UNITS, ARBITRARY UNITS
##FACTOR=    0.0627417313425164, 1,          1
##FIRST=     8223.62146879497, 601,          -59231
##LAST=      0,             1858,            -60105
##MIN=       0,             -10960,          0
##MAX=       8223.62146879497, 402605230,    0
$$ Real data points
##PAGE= N=1
##DATA TABLE= (X++(R..R)), XYDATA
$$ [...]
$$ plain form
61503 382378 380566 378921 377880 377356 376721 375672 374644 374214 374483 375219 376197 377138 377642 377515 377011 376514 376120
61486 376120 375647 374969 374242 373808 373864 374177 374223 373746 373069 372698 372730 372884 372953 372995 373126 373385 373766 374199 374604 375051
61466 375051 375688 376432 377019 377481 378179 379116 379783 380015 380443 381480 382458 382490 381781 381194 380972 380892 381365 383091 385590
61447 385590 387408 388138 389113 391555 395014 398277 400970 403537 406307 409462 413497 418920 425644 433193 441280
61432 441280 449732 458096 465812 472643 478611 483746 488211 492452 496820 501226 505414 509371 513168 516595
61418 516595 519181 520380 519647 516684 511892 506199 500220 493898 487210 480719 475012 469976 465109 460210
61404 460210 455312 450262 444947 439746 435211 431415 428090 425259 423186 421765 420489 419080 417685 416401
61390 416401 415054 413630 412503 412039 412223 412931 414331 416619 419415 421760 422994 423532 424476 426444 429034
$$ packed form
61503C82378j812j645j041n24o35j049j028m30K69P36R78R41N04j27n04m97l94
61486C76120m73o78p27m34N6L13M6m77o77l71L2J54O9M2J31K59L81M33M05M47
61466C75051O37P44N87M62O98R37O67K32M28J037R78L2p09n87k22q0M73J726K499
61447C85590J818P30R75K442L459L263K693K567K770L155M035N423O724P549Q087
61432D41280Q452Q364P716O831N968N135M465M241M368M406M188L957L797L427
61418E16595K586J199p33k963m792n693n979o322o688o491n707n036m867m899
61404D60210m898n050n315n201m535l796l325k831k073j421j276j409j395j284
61390D16401j347j424j127m64J84P08J400K288K796K345J234N38R44J968K590
$$ plain form
61375 429034 431564 433947 436461 439021 441327 443647 446710 450638 454608 457915 460862 464192 468075 472145
61361 472145 476309 481005 486733 493660 501669 510603 520468 531479 543826 557481 572453 589119 607792
61348 607792 627981 648615 669129 689668 710004 728911 745026 757783 767052 772553 774243 772787
61336 772787 768892 762526 753414 742017 729347 716135 702917 690615 680120 671324 663389 656011 649665
61323 649665 644495 639725 634490 628703 622866 617507 612976 609346 606225 603096 600052 597882 597272 598224 600406
61308 600406 603633 607839 612945 619055 626530 635594 645981 657019 667793 677126 683798 687081 686980 683910
61294 683910 678385 671128 663107 655153 647683 640929 635237 630921 627999 626257 625502 625618 626558 628470 631724
61279 631724 636592 642922 650234 658106 666356 674930 683760 692761 701967 711697 722620 735467 750438
$$ packed form
61375D29034K530K383K514K560K306K320L063L928L970L307K947L330L883M070
61361D72145M164M696N728O927Q009Q934R865J1011J2347J3655J4972J6666J8673
61348F07792K0189K0634K0514K0539K0336J8907J6115J2757R269N501J690j456
61336G72787l895o366r112j1397j2670j3212j3218j2302j0495q796p935p378o346
61323F49665n170m770n235n787n837n359m531l630l121l129l044k170o10R52K182
61308F00406L227M206N106O110P475R064J0387J1038J0774R333O672L283j01l070
61294F83910n525p257q021p954p470o754n692m316k922j742p55J16R40J912L254
61279F31724M868O330P312P872Q250Q574Q830R001R206R730J0923J2847J4971
$$ plain form
61266 750438 766888 783771 800587 817887 836802 858107 881811 907520 934870 963388 992062
61255 992062 1019285 1043140 1061651 1073094 1076529 1072156 1060866 1043528 1021084 995236 968364 942386
61243 942386 917976 895104 873898 854670 837523 822454 809640 799205 790861 784162 778923 775011
61231 775011 771897 768991 766455 765263 766237 769199 773110 776868 779957 782482 784661 786312 787003 786669 785769
61216 785769 784718 783544 782335 781607 781846 782987 784746 787236 790801 795453 800936 807224 814530 823022 832973
61201 832973 845042 859882 877513 897562 919994 945006 972179 1000408 1028928 1057922 1087853
61190 1087853 1118486 1148766 1177403 1203335 1225891 1244772 1259958 1271598 1279982 1285503 1288532 1289444
61178 1289444 1288686 1286419 1282025 1274490 1263671 1250650 1236350 1220227 1201020 1178424 1153268 1126355
$$ packed form
61266G50438J6450J6883J6816J7300J8915K1305K3704K5709K7350K8518K8674
61255I92062K7223K3855J8511J1443L435m373j1290j7338k2444k5848k6872k5978
61243I42386k4410k2872k1206j9228j7147j5069j2814j0435q344o699n239l912
61231G75011l114k906k536j192R74K962L911L758L089K525K179J651O91l34r00
61216G85769j051j174j209p28K39J141J759K490L565M652N483O288P306Q492R951
61201H32973J2069J4840J7631K0049K2432K5012K7173K8229K8520K8994K9931
61190A087853L0633L0280K8637K5932K2556J8881J5186J1640Q384N521L029R12
61178A289444p58k267m394p535j0819j3021j4300j6123j9207k2596k5156k6913
$$ plain form
61166 1126355 1098009 1068698 1039282 1010548 983231 958355 936673 917732 900434 884720 871748
61155 871748 862069 854671 848403 843500 840933 840870 842573 845375 848964 852991 857089 861164 865041 867860 868413
61140 868413 866237 862072 857215 852676 848968 846544 846254 849232 856132 866605 879856 895653 914338
61127 914338 935833 959310 984195 1011013 1040713 1073403 1108021 1143099 1177610 1211314 1244556
61116 1244556 1277601 1310056 1341048 1369888 1396163 1419315 1438807 1454885 1468509 1480172 1489266
61105 1489266 1494891 1496657 1494374 1487703 1476738 1462312 1444916 1423740 1397627 1366733 1332494 1296157
61093 1296157 1258206 1219231 1180499 1143276 1108025 1074535 1042582 1012305 984118 958300 934607
61082 934607 912416 891413 871931 854428 838905 825155 813302 803669 796309 791026 787685 786037
$$ packed form
61166A126355k8346k9311k9416k8734k7317k4876k1682j8941j7298j5714j2972
61155H71748r679p398o268m903k567o3J703K802L589M027M098M075L877K819N53
61140H68413k176m165m857m539l708k424k90K978O900J0473J3251J5797J8685
61127I14338K1495K3477K4885K6818K9700L2690L4618L5078L4511L3704L3242
61116A244556L3045L2455L0992K8840K6275K3152J9492J6078J3624J1663R094
61105A489266N625J766k283o671j0965j4426j7396k1176k6113l0894l4239l6337
61093A296157l7951l8975l8732l7223l5251l3490l1953l0277k8187k5818k3693
61082I34607k2191k1003j9482j7503j5523j3750j1853r633p360n283l341j648
$$ plain form
61070 786037 785447 785278 785522 786662 789005 792471 796893 802155 808195 815291 824115 834999 847280 859914
61056 859914 872745 886681 902628 920699 940462 961491 983592 1006918 1031937 1058988 1087813
61045 1087813 1117684 1147902 1177946 1207463 1236604 1266143 1296704 1327896 1358680 1388506 1417555
61034 1417555 1445953 1473388 1499621 1524877 1549671 1574658 1600623 1628225 1657743 1689493 1724315
61023 1724315 1763060 1805648 1851127 1898645 1947898 1999061 2053197 2112710 2180545 2258949 2349714
61012 2349714 2455263 2578132 2719261 2878175 3055365 3253737 3478165 3735870 4038339
61003 4038339 4401660 4844435 5387098 6053939 6873438 7875159 9088614 10546094 12280969
60994 12280969 14316134 16653437 19273892 22132170 25120699 28022630 30522794 32318932
$$ packed form
61070G86037n90j69K44J140K343L466M422N262O040P096Q824J0884J2281J2634
61056H59914J2831J3936J5947J8071J9763K1029K2101K3326K5019K7051K8825
61045A087813K9871L0218L0044K9517K9141K9539L0561L1192L0784K9826K9049
61034A417555K8398K7435K6233K5256K4794K4987K5965K7602K9518L1750L4822
61023A724315L8745M2588M5479M7518M9253N1163N4136N9513O7835P8404R0765
61012B349714J05549J22869J41129J58914J77190J98372K24428K57705L02469
61003D038339L63321M42775N42663O66841Q19499J001721J213455J457480J734875
60994A2280969K035165K337303K620455K858278K988529K901931K500164J796138
$$ plain form
60986 32318932 33274670 33493259 33252783 32867304 32582732 32540962 32761841 33109553 33290433
60977 33290433 32945204 31811845 29849764 27239184 24275166 21246739 18368959 15770755
60969 15770755 13508778 11587249 9978989 8644034 7540919 6631014 5880281 5260280
60961 5260280 4747419 4321168 3963442 3659308 3397201 3168270 2965902 2785531 2623897
60952 2623897 2478123 2345707 2225093 2115531 2016271 1926235 1844311 1769300 1699364 1632087
60942 1632087 1565482 1498926 1433113 1369277 1308431 1251080 1197436 1147760 1102279 1060706 1022187
60931 1022187 986010 952183 921098 892884 867390 844518 824136 805840 789238 774336 761259
60920 761259 749775 739547 730629 723155 716728 710804 705678 702288 700870 700532 700464 700907 702422 704726 706804
$$ packed form
60986C2318932R55738K18589k40476l85479k84572m1770K20879L47712J80880
60977C3290433l45229j133359j962081k610580k964018l028427k877780k598204
60969A5770755k261977j921529j608260j334955j103115r09905p50733o20001
60961E260280n12861m26251l57726l04134k62107k28931k02368j80371j61634
60952B623897j45774j32416j20614j09562r9260r0036q1924p5011o9936o7277
60942A632087o6605o6556o5813o3836o0846n7351n3644m9676m5481m1573l8519
60931A022187l6177l3827l1085k8214k5494k2872k0382j8296j6602j4902j3077
60920G61259j1484j0228q918p474o427n924n126l390j418l38o8M43J515K304K078
$$ plain form
60905 706804 707914 708034 707531 706774 705874 704501 702121 698686 694880 691445 688511 685849 683370 680953 678090
60890 678090 674313 669839 665270 660697 655597 649644 643191 636857 631013 625719 620794 615804 610252 603974
60876 603974 597203 590265 583390 576789 570609 564808 559389 554796 551718 550298 549815 549362 548718 548437 549216
60861 549216 551276 554280 557736 561516 565971 571437 577769 584525 591538 599004 606951 614901 622223 628709
60847 628709 634805 641318 648743 656711 664176 670365 675379 679490 682146 682323 679905 676074 672131 668493
60833 668493 665097 662088 659579 657209 654589 651960 649857 648318 646930 645471 643912 641943 639121 635503
60819 635503 631546 627272 622085 615628 608329 600866 593474 586056 578589 571110 563588 556065 548679 541346
60805 541346 533759 526013 518922 513355 509505 507080 505828 505385 504967 503929 502508 501337 500320 498793 496862
$$ packed form
60905G06804J110J20n03p57r00j373k380l435l806l435k934k662k479k417k863
60890F78090l777m474m569m573n100n953o453o334n844n294m925m990n552o278
60876F03974o771o938o875o601o180n801n419m593l078j420m83m53o44k81P79
60861E49216K060L004L456L780M455N466O332O756P013P466P947P950P322O486
60847F28709O096O513P425P968P465O189N014M111K656J77k418l831l943l638
60833F68493l396l009k509k370k620k629k103j539j388j459j559j969k822l618
60819F35503l957m274n187o457p299p463p392p418p467p479p522p523p386p333
60805E41346p587p746p091n567l850k425j252m43m18j038j421j171j017j527j931
$$ plain form
60790 496862 495656 495845 496747 497467 498202 499598 501422 502901 504165 506272 509730 513967 518461 523492 529330
60775 529330 535504 541469 547455 554008 561082 568233 575433 583022 591026 599141 607398 616241 625824 635614
60761 635614 644841 653067 660269 666597 672131 676687 679915 681768 682836 683958 685507 687233 688699 689659
60747 689659 690107 690147 689745 688443 685570 681010 675464 669607 663249 655877 647749 639808 632560 625759 619264
60732 619264 613561 609147 606029 604054 603289 603693 604810 606071 607161 607972 608647 609916 612898 618195 625477
60717 625477 634186 644174 655282 666802 678018 689184 701379 715429 731304 748532 766778 785971
60705 785971 806142 827249 849009 870881 892362 913358 934312 955968 978859 1002722 1026377
60694 1026377 1048489 1068519 1086711 1103210 1117666 1129778 1139631 1147177 1151894 1153355 1151724 1147218
$$ packed form
60790D96862j206J89R02P20P35J396J824J479J264K107L458M237M494N031N838
60775E29330O174N965N986O553P074P151P200P589Q004Q115Q257Q843R583R790
60761F35614R227Q226P202O328N534M556L228J853J068J122J549J726J466R60
60747F89659M48M0m02j302k873m560n546n857o358p372q128p941p248o801o495
60732F19264n703m414l118j975p65M04J117J261J090Q11O75J269K982N297P282
60717F25477Q709R988J1108J1520J1216J1166J2195J4050J5875J7228J8246J9193
60705G85971K0171K1107K1760K1872K1481K0996K0954K1656K2891K3863K3655
60694A026377K2112K0030J8192J6499J4456J2112R853P546M717J461j631m506
$$ plain form
60682 1147218 1139502 1128158 1113486 1096283 1077107 1056303 1034522 1012483 990219 967206 943303
60671 943303 919070 895090 871500 848336 825849 804290 783721 764231 746032 729236 713767
60660 713767 699604 686800 675274 664923 656003 648905 643400 638538 633591 628740 624529 621013 617898
60647 617898 615233 613355 612103 610613 608194 605153 602487 600873 600214 600068 600249 600857 601934 603324 604896
60632 604896 606728 609034 611920 615202 618440 621252 623797 626763 630596 634702 637732 638768 637950 635877
60618 635877 632793 628631 623536 617919 612063 606018 599850 593690 587508 581053 574141 566963 560067 553960
60604 553960 548647 543577 538221 532610 527109 521780 516414 511235 506971 503982 501719 499406 496873 494391
60590 494391 492135 490253 489054 488601 488380 487942 487587 487820 488435 488797 488847 489028 489354 489404 489291 489711 490751 491503
$$ packed form
60682A147218p716j1344j4672j7203j9176k0804k1781k2039k2264k3013k3903
60671I43303k4233k3980k3590k3164k2487k1559k0569j9490j8199j6796j5469
60660G13767j4163j2804j1526j0351q920p098n505m862m947m851m211l516l115
60647F17898k665j878j252j490k419l041k666j614o59j46J81O08J077J390J572
60632F04896J832K306K886L282L238K812K545K966L833M106L030J036q18k073
60618F35877l084m162n095n617n856o045o168o160o182o455o912p178o896o107
60604E53960n313n070n356n611n501n329n366n179m264k989k263k313k533k482
60590D94391k256j882j199m53k21m38l55K33O15L62N0J81L26N0j13M20J040P52
$$ plain form
60572 491503 491366 491147 492306 495551 500610 506928 514033 521541 529452 538329 548694 560317 572494 584864
60558 584864 597391 609518 619987 627815 633074 636325 637554 636190 632212 626714 621086 615894 610899
60545 610899 605991 601689 598731 597574 598377 601109 605548 611542 619397 629551 641634 654259 666092
60532 666092 676690 685960 693322 698063 700194 700225 698308 694329 688723 682498 676403 670749 666040 663015
60518 663015 661808 661704 662059 662950 664695 667262 670441 674215 678640 683715 689554 696273 703503 710429 716629
60503 716629 722509 728710 735477 742891 751366 761623 774505 791041 812254 838588 869754 905310
60491 905310 944995 988172 1033332 1078358 1120867 1158068 1186989 1205473 1212688 1208339 1191976 1163813
60479 1163813 1125807 1081120 1032545 982048 931560 883283 838943 799276 764391 734135 707998
$$ packed form
60572D91503j37k19J159L245N059O318P105P508P911Q877J0365J1623J2177J2370
60558E84864J2527J2127J0469P828N259L251J229j364l978n498n628n192m995
60545F10899m908m302k958j157Q03K732M439N994P855J0154J2083J2625J1833
60532F66092J0598R270P362M741K131L1j917l979n606o225o095n654m709l025
60518F63015j207j04L55Q91J745K567L179L774M425N075N839O719P230O926O200
60503G16629N880O201O767P414Q475J0257J2882J6536K1213K6334L1166L5556
60491I05310L9685M3177M5160M5026M2509L7201K8921J8484P215m349j6363k8163
60479A163813l8006m4687m8575n0497n0488m8277m4340l9667l4885l0256k6137
$$ plain form
60468 707998 685218 665334 648313 633882 621082 608844 596954 586143 577155 569873 563369 556832
60456 556832 550303 544386 539293 534467 529293 523883 518861 514573 510820 507334 504248 502068 501256 501711 502519
60441 502519 502500 501311 499760 498707 497902 496378 493829 490969 488488 486297 484004 481590 479228 476872 474488
60426 474488 472476 471401 471323 471717 472053 472215 472355 472631 473200 474313 476246 479069 482491 485963 489016 491534
60410 491534 493565 494884 495041 494070 492924 492758 493755 494986 495584 495730 496247 497496 499065 500385 501270 501827
60394 501827 502235 502752 503625 504830 506125 507461 509064 510998 512937 514614 516162 517762 519278 520595 522004
60379 522004 523750 525451 526565 527335 528597 530558 532452 533626 534423 535548 536987 538062 538382 538320 538641 539954
60363 539954 542442 545799 549354 552503 555148 557685 560478 563363 565666 566809 566929 566808 567162 568160 569700
$$ packed form
60468G07998k2780j9884j7021j4431j2800j2238j1890j0811q988p282o504o537
60456E56832o529n917n093m826n174n410n022m288l753l486l086k180q12M55Q08
60441E02519j9j189j551j053q05j524k549k860k481k191k293k414k362k356k384
60426D74488k012j075p8L94L36J62J40K76N69J113J933K823L422L472L053K518
60410D91534K031J319J57r71j146j66R97J231N98J46N17J249J569J320Q85N57
60394E01827M08N17Q73J205J295J336J603J934J939J677J548J600J516J317J409
60379E22004J746J701J114P70J262J961J894J174P97J125J439J075L20o2L21J313
60363E39954K488L357L555L149K645K537K793K885K303J143J20j21L54R98J540
$$ plain form
60348 569700 571902 574996 578965 583672 589251 595955 603619 611608 619295 626233 631990 636248 639040 640431
60334 640431 640056 637515 633204 628136 622857 617213 611255 605612 600708 596363 592532 589637 587682 585853
60320 585853 583730 582233 582512 584318 586293 587607 588519 589631 591448 594564 599361 605406 611787 618181 625077
60305 625077 633036 642362 653528 667161 683399 701729 721633 742803 764518 785304 803500 817869
60293 817869 827572 831989 830853 824260 812527 796423 777708 758822 741624 726633 713564 702122
60281 702122 691874 681853 671061 659428 647879 637368 628077 619609 611635 604176 597403 591408 586203
60268 586203 581772 578032 574809 572039 569954 568860 568669 568859 569038 569389 570398 572271 574739 577215 578993
60253 578993 579560 579029 578151 577679 577831 578499 579587 580806 581458 581073 580189 579933 580789 582207 583455 584293 584722
$$ packed form
60348E69700K202L094L969M707N579O704P664P989P687O938N757M258K792J391
60334F40431l75k541m311n068n279n644n958n643m904m345l831k895j955j829
60320E85853k123j497K79J806J975J314R12J112J817L116M797O045O381O394O896
60305F25077P959R326J1166J3633J6238J8330J9904K1170K1715K0786J8196J4369
60293H17869R703M417j136o593j1733j6104j8715j8886j7198j4991j3069j1442
60281G02122j0248j0021j0792j1633j1549j0511r291q468p974p459o773n995n205
60268E86203m431l740l223k770k085j094j91J90J79L51J009J873K468K476J778
60253E78993N67n31q78m72J52O68J088J219O52l85q84k56Q56J418J248Q38M29
$$ plain form
60236 584722 584709 584496 584778 586124 588390 590963 593395 595584 597568 599388 601072 602536 603605 604269 604808 605533
60220 605533 606561 607951 609884 612494 615610 618939 622435 626312 630685 635282 639572 643096 645704 647569
60206 647569 649022 650313 651484 652457 653204 653750 653956 653372 651506 648416 644904 641876 639486 637150 634447
60191 634447 631742 629731 628557 627645 626368 624704 623235 622584 622810 623384 623836 624298 625140 626165 626671 626471
60175 626471 626356 627189 628919 630917 632937 635221 637873 640711 643673 646855 650141 653233 656077 658886 661703
60160 661703 664323 666622 668639 670336 671712 673099 674911 676987 678622 679377 679568 679841 680680 682374 685094
60145 685094 688642 692446 696049 699513 703207 707338 711875 716831 722486 729275 737422 746652 756395 766256
60131 766256 776011 784990 791913 795754 796524 794771 790619 783888 774980 764921 754521 744119 734180 725435
$$ packed form
60236E84722j3k13K82J346K266K573K432K189J984J820J684J464J069O64N39P25
60220F05533J028J390J933K610L116L329L496L877M373M597M290L524K608J865
60206F47569J453J291J171R73P47N46K06n84j866l090l512l028k390k336k703
60191F34447k705k011j174r12j277j664j469o51K26N74M52M62Q42J025N06k00
60175F26471j15Q33J730J998K020K284K652K838K962L182L286L092K844K809K817
60160F61703K620K299K017J697J376J387J812K076J635P55J91K73Q39J694K720
60145F85094L548L804L603L464L694M131M537M956N655O789Q147R230R743R861
60131G66256R755Q979O923L841P70j753m152o731q908j0059j0400j0402r939q745
$$ plain form
60117 725435 718147 711844 706037 700683 695725 690758 685616 680864 677253 674880 673178 671497 669482 667188
60103 667188 665096 663757 663215 663032 663024 663565 664963 666941 669118 671683 675234 680118 686286 693603 701996 711406
60087 711406 721768 732905 744325 755336 765544 775025 783891 791927 798698 803642 806010 805181 801334
60074 801334 795267 787348 777165 764587 750637 736740 723547 711006 699177 688297 678337 669198
60062 669198 661205 654740 649551 645057 641202 638275 635943 633253 629731 625797 621972 618391 615385 613758
60048 613758 613939 615375 617267 619515 622365 625439 627816 628997 629260 628980 628097 626421 624101 621494 618694
60033 618694 615447 611544 607152 602605 597953 592814 586809 580048 573037 566131 559287 552358 545390 538492
60019 538492 531657 524927 518617 513118 508537 504756 501800 499817 498673 497860 497034 496462 496714 497959 499716
$$ packed form
60117G25435p288o303n807n354m958m967n142m752l611k373j702j681k015k294
60103F67188k092j339n42j83qN41J398J978K177K565L551M884O168P317Q393R410
60087G11406J0362J1137J1420J1011J0208R481Q866Q036O771M944K368q29l847
60074H01334o067p919j0183j2578j3950j3897j3193j2541j1829j0880r960r139
60062F69198p993o465n189m494l855k927k332k690l522l934l825l581l006j627
60048F13758J81J436J892K248K850L074K377J181K63k80q83j676k320k607k800
60033F18694l247l903m392m547m652n139o005o761p011o906o844o929o968o898
60019E38492o835o730o310n499m581l781k956j983j144q13q26n72K52J245J757
$$ plain form
60004 499716 501296 502388 503310 504786 507369 510888 514508 517528 520066 522791 526076 529737 533551 537624
59990 537624 542093 546770 551264 555231 558309 560104 560547 560095 559275 558128 556360 553948 551302 548850 546686
59975 546686 544600 542325 539848 537641 536421 536447 537228 538166 539227 540622 542062 542940 543275 543942 545760 548706
59959 548706 552112 555241 557488 558444 558167 557274 556512 556231 556249 556060 555140 553249 550600 547582 544345 540838
59943 540838 537229 533959 531285 528979 526625 524039 521328 518690 516290 514251 512739 512051 512433 513629 514881
59928 514881 515707 516499 517911 519798 521347 522225 522978 524172 525691 527126 528334 529344 530208 531270 533147
59913 533147 536051 539438 542730 546109 550196 555132 560328 564993 568634 571238 573263 575329 577642 579783
59899 579783 581247 582054 582662 583477 584661 586283 588409 591155 594769 599511 605325 611802 618598 625711 633218
$$ packed form
60004D99716J580J092R22J476K583L519L620L020K538K725L285L661L814M073
59990E37624M469M677M494L967L078J795M43m52q20j147j768k412k646k452k164
59975E46686k086k275k477k207j220K6P81R38J061J395J440Q78L35O67J818K946
59959E48706L406L129K247R56k77q93p62k81J8j89r20j891k649l018l237l507
59943E40838l609l270k674k306k354k586k711k638k400k039j512o88L82J196J252
59928E14881Q26P92J412J887J549Q78P53J194J519J435J208J010Q64J062J877
59913E33147K904L387L292L379M087M936N196M665L641K604K025K066K313K141
59899E79783J464Q07O08Q15J184J622K126K746L614M742N814O477O796P113P507
$$ plain form
59884 633218 640944 648501 655483 661609 666937 671936 676915 681217 683412 682559 678994 673757 667706 661405
59870 661405 655251 649206 642821 636053 629716 624564 620263 615902 611343 607372 604572 602743 601531 601027
59856 601027 601458 602730 604558 606845 609698 613256 617661 623023 629285 636245 643812 652173 661591 672104
59842 672104 683566 695946 709343 723375 736543 746719 752797 755827 758127 761271 765294 769613 773852
59829 773852 777370 778607 775660 767466 754247 737107 717529 696966 676452 656634 638298 622495
59817 622495 609861 600060 592210 585574 579594 573709 567720 562102 557511 554130 551863 550813 550952 551614
59803 551614 551985 552085 552570 553486 553878 552856 550580 547895 545386 543080 540793 538390 535802 533059 530372
59788 530372 528056 526277 524890 523619 522484 521922 522253 523086 523590 523486 523488 524531 526815 529730 532448 534393
$$ packed form
59884F33218P726P557O982O126N328M999M979M302K195q53l565n237o051o301
59870F61405o154o045o385o768o337n152m301m361m559l971k800j829j212n04
59856F01027M31J272J828K287K853L558M405N362O262O960P567Q361R418J0513
59842F72104J1462J2380J3397J4032J3168J0176O078L030K300L144M023M319M239
59829G73852L518J237k947q194j3219j7140j9578k0563k0514j9818j8336j5803
59817F22495j2634r801p850o636n980n885n989n618m591l381k267j050J39O62
59803E51614L71J00M85R16L92j022k276k685k509k306k287k403k588k743k687
59788E30372k316j779j387j271j135n62L31Q33N04j04KJ043K284K915K718J945
$$ plain form
59772 534393 535458 536080 536959 538463 540418 542543 544768 547004 549007 550763 552663 555007 557626 560257 562922
59757 562922 565692 568492 571411 574707 578188 581165 583568 586481 590856 596127 600870 604479 607413 610082
59743 610082 612416 614433 616390 618288 619855 620982 621572 621143 619370 616966 615198 614418 613833 612770 611343
59728 611343 609801 608089 606377 605245 604924 604971 605031 605312 605932 606440 606466 606336 606559 607136 607823 608694 609895 611141
59710 611141 611961 612330 612713 613588 615177 617411 619902 622155 624084 626171 628852 631943 634875 637299 639204
59695 639204 640641 641657 642338 642586 641969 640118 637319 634519 632669 632158 632804 634139 635562 636419 636240 635018
59679 635018 633167 631061 628677 625800 622461 618878 615004 610502 605303 599862 594725 590137 586189 582940
59665 582940 580139 577224 573962 570819 568446 567145 567075 568396 570705 572907 574398 575991 578862 582845 586595
$$ packed form
59772E34393J065O22Q79J504J955K125K225K236K003J756J900K344K619K631K665
59757E62922K770K800K919L296L481K977K403K913M375N271M743L609K934K669
59743F10082K334K017J957J898J567J127N90m29j773k404j768p80n85j063j427
59728F11343j542j712j712j132l21M7O0K81O20N08K6j30K23N77O87Q71J201J246
59710F11141Q20L69L83Q75J589K234K491K253J929K087K681L091K932K424J905
59695F39204J437J016O81K48o17j851k799k800j850n11O46J335J423Q57j79j222
59679F35018j851k106k384k877l339l583l874m502n199n441n137m588l948l249
59665E82940k801k915l262l143k373j301p0J321K309K202J491J593K871L983L750
$$ plain form
59650 586595 589258 591064 592324 592791 592277 591121 589704 588052 586156 584251 582615 581533 581474 582717 584809
59635 584809 586975 589128 591765 594741 596974 597708 597378 596812 596149 595061 593625 592464 592198 593059 594804 596784
59619 596784 598300 599065 599158 598643 597594 596400 595486 594739 593770 592834 592790 593963 595726 597466 599295 601427 603446
59602 603446 604713 605102 604964 604688 604646 605178 606305 607686 609000 610040 610369 609492 607643 605912 605251 605696 606653
59585 606653 607408 607212 605605 603051 600634 598686 596308 592701 588318 584131 580297 576300 571965 567627 563553
59570 563553 559850 556777 554568 553107 552215 552052 552754 553912 555006 556167 557963 560521 563362 566031 568386
59555 568386 570312 571660 572599 573708 575583 578487 582283 586520 590663 594535 598541 603370 609528 617231
59541 617231 626603 637877 651493 667924 687044 707508 726998 743174 754370 759881 760473 758743
$$ packed form
59650E86595K663J806J260M67n14j156j417j652j896j905j636j082n9J243K092
59635E84809K166K153K637K976K233P34l30n66o63j088j436j161k66Q61J745J980
59619E96784J516P65R3n15j049j194r14p47r69r36m4J173J763J740J829K132K019
59602F03446J267L89j38k76m2N32J127J381J314J040L29q77j849j731o61M45R57
59585F06653P55j96j607k554k417j948k378l607m383m187l834l997m335m338m074
59570E63553l703l073k209j461q92j63P02J158J094J161J796K558K841K669K355
59555E68386J926J348R39J109J875K904L796M237M143L872M006M829O158P703
59541F17231R372J1274J3616J6431J9120K0464J9490J6176J1196N511N92j730
$$ plain form
59529 758743 758012 760204 765078 771677 779809 789615 800431 810887 819881 826846 831308 832840 831350 826973
59515 826973 819730 809674 797213 782994 767676 752061 737084 723234 710258 697918 686807 677958
59503 677958 671742 667505 664161 660868 657443 654480 652857 652732 653229 653396 653167 653012 652984 652656 651830 650852 650331
59486 650331 650868 652853 656247 660781 666614 674444 684573 696339 708950 722482 737323 752898 767647
59473 767647 780238 790212 797486 801810 802924 800978 796777 791757 787565 785349 785570 788553 794800 804474
59459 804474 817042 831925 849168 869039 891343 915626 941564 968473 994811 1019003 1040643
59448 1040643 1060227 1077732 1092064 1101758 1105516 1102135 1090718 1071359 1045399 1015131 983495 953608
59436 953608 927639 905855 887173 870604 855785 842382 829845 818018 807538 799486 794966 794842
$$ packed form
59529G58743p31K192M874O599Q132R806J0816J0456Q994O965M462J532j490m377
59515H26973p243j0056j2461j4219j5318j5615j4977j3850j2976j2340j1111q849
59503F77958o216m237l344l293l425k963j623j25M97J67k29j55k8l28q26r78n21
59486F50331N37J985L394M534N833P830J0129J1766J2611J3532J4841J5575J4749
59473G67647J2591R974P274M324J114j946m201n020m192k216K21K983O247R674
59459H04474J2568J4883J7243J9871K2304K4283K5938K6909K6338K4192K1640
59448A040643J9584J7505J4332R694L758l381j1417j9359k5960l0268l1636k9887
59436I53608k5969k1784j8682j6569j4819j3403j2537j1827j0480q052m520j24
$$ plain form
59424 794842 799360 807951 819849 834839 852980 873767 896182 919450 943096 966350 988386 1009091
59412 1009091 1028505 1044914 1054299 1052695 1039122 1016123 987922 958509 930902 907215 888841 876621
59400 876621 870772 870373 872738 873552 868289 854353 832417 805719 777826 750888 725631 702428 681952
59387 681952 665013 652107 643003 636674 631852 627930 625066 623316 622107 620919 620041 620101 621066 622182 622683
59372 622683 622220 620982 619901 620305 622665 625926 628766 631227 634397 638782 644022 650122 657869 667708 679066
59357 679066 691212 704108 718110 733530 750952 771317 795055 821457 849381 878285 908101
59346 908101 938374 968088 996285 1022389 1045828 1065635 1080596 1089693 1092336 1088339 1077894 1061704
59334 1061704 1040972 1016941 990340 961442 930742 899379 868779 840070 813866 790311 769141
$$ packed form
59424G94842M518Q591J1898J4990J8141K0787K2415K3268K3646K3254K2036K0705
59412A009091J9414J6409R385j604j3573k2999k8201k9413k7607k3687j8374j2220
59400H76621n849l99K365Q14n263j3936k1936k6698k7893k6938k5257k3203k0476
59387F81952j6939j2906r104o329m822l922k864j750j209j188q78O0R65J116N01
59372F22683m63j238j081M04K360L261K840K461L170M385N240O100P747R839J1358
59357F79066J2146J2896J4002J5420J7422K0365K3738K6402K7924K8904K9816
59346I08101L0273K9714K8197K6104K3439J9807J4961R097K643l997j0445j6190
59334A061704k0732k4031k6601k8898l0700l1363l0600k8709k6204k3555k1170
$$ plain form
59323 769141 749996 732844 717895 705082 694083 684901 677817 672485 667777 663066 659029 656528 655200
59310 655200 653917 652307 650997 650649 651492 653621 656881 660536 663857 667168 671746 678600 687817 698996
59296 698996 711838 726290 742613 761230 782163 804781 828364 852309 875059 893355 903692
59285 903692 904679 897584 884993 869754 854696 842003 832546 826535 824635 827548 834656 844288 855509
59272 855509 868592 883565 899335 914568 928460 940266 949051 954477 957015 956875 953344 945645 933897
59259 933897 918884 901447 882461 862788 842938 823188 804198 786871 771473 757588 745137
59248 745137 734719 726745 721074 717763 717294 719680 724135 730100 737795 747304 757940 769054 780688
59235 780688 792740 804119 813427 820007 823790 824679 822672 818046 810775 800280 786411 770275 753463
$$ packed form
59323G69141j9145j7152j4949j2813j0999r182p084n332m708m711m037k501j328
59310F55200j283j610j310l48Q43K129L260L655L321L311M578O854R217J1179
59296F98996J2842J4452J6323J8617K0933K2618K3583K3945K2750J8296J0337
59285I03692R87p095j2591j5239j5058j2693r457o011j900K913P108R632J1221
59272H55509J3083J4973J5770J5233J3892J1806Q785N426K538j40l531p699j1748
59259I33897j5013j7437j8986j9673j9850j9750j8990j7327j5398j3885j2451
59248G45137j0418p974n671l311m69K386M455N965P695R509J0636J1114J1634
59235G80688J2052J1379R308O580L783Q89k007m626p271j0495j3869j6136j6812
$$ plain form
59222 753463 736807 720430 704569 689637 675788 663041 651694 642142 634435 628364 623705 620033
59210 620033 616730 613587 611064 609495 608406 607133 605778 604994 605018 605460 605911 606336 606957 608056 609806 612079
59194 612079 614590 617382 620822 624911 629051 632830 636727 641615 647856 655195 663290 671943 680925 689861
59180 689861 698241 705621 712086 718534 726011 734653 743737 752885 762631 773615 785860 799183 813705
59167 813705 829472 845965 862351 877803 891309 901757 908656 912339 913108 910625 904617 895730 885216
59154 885216 874025 862474 850343 836994 821938 805809 790356 777040 765928 756173 747024 738003
59142 738003 728821 719748 711622 704895 699089 693680 688969 685491 683097 681481 681142 682932 686694 691162
59128 691162 695239 698818 702377 706376 711224 717435 725580 736100 749067 764023 780254 797364 815411
$$ packed form
59222G53463j6656j6377j5861j4932j3849j2747j1347r552p707o071m659l672
59210F20033l303l143k523j569j089j273j355p84K4M42M51M25O21J099J750K273
59194F12079K511K792L440M089M140L779L897M888O241P339Q095Q653Q982Q936
59180F89861Q380P380O465O448P477Q642R084R148R746J0984J2245J3323J4522
59167H13705J5767J6493J6386J5452J3506J0448O899L683P69k483o008q887j0514
59154H85216j1191j1551j2131j3349j5056j6129j5453j3316j1112r755r149r021
59142G38003r182r073q126o727n806n409m711l478k394j616l39J790L762M468
59128F91162M077L579L559L999M848O211Q145J0520J2967J4956J6231J7110J8047
$$ plain form
59115 815411 834523 854798 876594 900239 925153 949799 972914 994378 1014591 1033547 1050865
59104 1050865 1066144 1078771 1087858 1092918 1094272 1092469 1087768 1080588 1071941 1062888 1053958 1045482 1038003
59091 1038003 1031885 1026974 1023032 1019938 1017006 1012785 1006168 997203 986295 973300 958141 941679 925053
59078 925053 908536 891836 875145 859122 844181 830547 818711 808966 800734 793062 785609 778491
59066 778491 771508 764344 757325 751198 746250 742193 738709 735460 731897 727801 723802 720597 717866 714714
59052 714714 711024 707550 704783 702557 700787 699841 700026 701232 703124 705187 706720 707397 707848 709180 711974
59037 711974 716122 721480 728082 735800 744368 753835 764606 777092 791535 807899 825581 843642 861815
59024 861815 880923 901664 923265 943925 962317 978006 990653 999598 1004276 1004660 1001422 995993 990088
$$ packed form
59115H15411J9112K0275K1796K3645K4914K4646K3115K1464K0213J8956J7318
59104A050865J5279J2627R087N060J354j803m701p180q647r053q930q476p479
59091A038003o118m911l942l094k932m221o617q965j0908j2995j5159j6462j6626
59078I25053j6517j6700j6691j6023j4941j3634j1836r745q232p672p453p118
59066G78491o983p164p019o127m948m057l484l249l563m096l999l205k731l152
59052G14714l690l474k767k226j770r46J85J206J892K063J533O77M51J332K794
59037G11974M148N358O602P718Q568R467J0771J2486J4443J6364J7682J8061J8173
59024H61815J9108K0741K1601K0660J8392J5689J2647Q945M678L84l238n429n905
$$ plain form
59011 990088 984676 979735 975435 972969 973513 976935 982374 989657 999219 1010969 1024151 1038110 1052160
58998 1052160 1064875 1074609 1080881 1084488 1086191 1086016 1083722 1079089 1071653 1060963 1047295 1031517 1014222
58985 1014222 995581 976045 956572 938116 921428 907261 896148 887999 882441 879418 878914 880343
58973 880343 882918 886538 891646 898369 906450 915810 926464 938093 950464 964069 979459 995972 1011927
58960 1011927 1025957 1037413 1045694 1050147 1050680 1047585 1040695 1029592 1014696 997359 978833 959902
58948 959902 941506 924840 910624 899041 890444 885360 883686 884601 887357 891379 895515 898073 897880 894717
58934 894717 888609 879431 867491 853857 839805 826305 814059 803561 794954 788186 783181 779576 776688
58921 776688 774253 772824 772821 773687 774839 776973 781432 788555 797630 808068 819505 831132 842295 853661
$$ packed form
59011I90088n412m941m300k466N44L422N439P283R562J1750J3182J3959J4050
58998A052160J2715R734O272L607J703j75k294m633p436j0690j3668j5778j7295
58985A014222j8641j9536j9473j8456j6688j4167j1113q149n558l023n04J429
58973H80343K575L620N108O723Q081R360J0654J1629J2371J3605J5390J6513J5955
58960A011927J4030J1456Q281M453N33l095o890j1103j4896j7337j8526j8931
58948I59902j8396j6666j4216j1583q597n084j674R15K756M022M136K558j93l163
58934H94717o108r178j1940j3634j4052j3500j2246j0498q607o768n005l605k888
58921G76688k435j429lQ66J152K134M459P123R075J0438J1437J1627J1163J1366
$$ plain form
58907 853661 866443 880534 894758 908934 924119 940571 957021 972486 987414 1002409 1017073
58896 1017073 1030921 1044475 1058818 1074865 1093577 1115923 1141987 1170802 1201470 1233608 1266280
58885 1266280 1297443 1324988 1347516 1363736 1372271 1372850 1366827 1355597 1338997 1315979 1286434 1251891
58873 1251891 1214896 1178095 1143295 1110903 1080580 1052585 1027842 1006522 987465 969427 952198
58862 952198 936031 920717 905713 890624 875198 859403 843880 829618 816831 804754 792861
58851 792861 781580 771429 762182 753291 744540 735877 727181 718551 710291 702333 694233 685897 677774 670259
58837 670259 663626 658499 655423 653809 652322 650558 649359 649280 649899 650934 652776 655353 657642 659092 660580
58822 660580 663235 667120 671625 676206 680156 682637 683703 684376 685099 685102 683929 682448 681435 680226 677880
$$ packed form
58907H53661J2782J4091J4224J4176J5185J6452J6450J5465J4928J4995J4664
58896A017073J3848J3554J4343J6047J8712K2346K6064K8815L0668L2138L2672
58885A266280L1163K7545K2528J6220Q535N79o023j1230j6600k3018k9545l4543
58873A251891l6995l6801l4800l2392l0323k7995k4743k1320j9057j8038j7229
58862I52198j6167j5314j5004j5089j5426j5795j5523j4262j2787j2077j1893
58851G92861j1281j0151r247q891q751q663q696q630q260p958q100q336q123p515
58837F70259o633n127l076j614j487j764j199p9O19J035J842K577K289J450J488
58822F60580K655L885M505M581L950K481J066O73P23Lj173j481j013j209k346
$$ plain form
58807 677880 674798 671988 669481 666680 663718 661258 659353 657618 656258 655844 656230 656627 656611 656324 655826 655029
58791 655029 654291 654483 656427 660490 666446 673436 680458 687230 694221 701586 708641 714763 720174 725432 730703
58776 730703 735974 741352 746616 751002 753905 755323 755313 753781 751174 748542 746318 743798 740411 736747 733693
58761 733693 731350 729553 728728 729345 731021 732917 734601 735976 736960 737857 739463 742169 745495 749034 753171
58746 753171 758277 764014 770143 777236 785772 795244 805023 815436 827131 840004 853697 868549 885022
58733 885022 902625 920326 937682 954667 970784 985195 997474 1007528 1015125 1020195 1023263 1024962
58721 1024962 1025476 1025050 1024468 1024325 1024302 1023791 1022771 1021393 1019272 1015922 1011419 1005928 999074 990450 980197
58706 980197 968407 954527 938083 919528 899646 878622 856380 833360 810350 788094 767496
$$ packed form
58807F77880l082k810k507k801k962k460j905j735j360m14L86L97j6k87m98p97
58791F55029p38J92J944M063N956O990P022O772O991P365P055O122N411N258N271
58776G30703N271N378N264M386K903J418j0j532k607k632k224k520l387l664l054
58761G33693k343j797q25O17J676J896J684J375R84Q97J606K706L326L539M137
58746G53171N106N737O129P093Q536R472R779J0413J1695J2873J3693J4852J6473
58733H85022J7603J7701J7356J6985J6117J4411J2279J0054P597N070L068J699
58721A024962N14m26n82j43k3n11j020j378k121l350m503n491o854q624j0253
58706I80197j1790j3880j6444j8555j9882k1024k2242k3020k3010k2256k0598
$$ plain form
58695 767496 749474 734037 720313 708095 698326 691321 685576 679430 672985 667297 662596 658480 654965
58682 654965 652001 648725 644663 641069 639617 640203 641458 642997 645695 650044 655773 663038 672558 684394
58668 684394 697732 712027 727437 744083 761626 779378 795965 809156 817013 819235 816769 810517
58656 810517 801257 790264 778821 767338 755924 745527 737429 731734 727356 723461 720151 717910 717121
58643 717121 717848 719444 720772 721527 722743 725155 727768 729123 729217 728897 727954 725373 721247 717021 713814 711665
58627 711665 710358 709890 710189 711446 714650 720903 730247 741993 755858 771858 789498 808212 828284
58614 828284 850164 872982 894819 914233 930510 942761 950043 952391 950759 945982 938574 929290 918925
58601 918925 907827 896410 885684 876309 867608 858661 850003 843137 838783 836699 836800 839285 844095 851353
$$ packed form
58695G67496j8022j5437j3724j2218r769p005n745o146o445n688m701m116l515
58682F54965k964l276m062l594j452N86J255J539K698M349N729P265R520J1836
58668F84394J3338J4295J5410J6646J7543J7752J6587J3191P857K222k466o252
58656H10517r260j0993j1443j1483j1414j0397q098n695m378l895l310k241p89
58643G17121P27J596J328P55J216K412K613J355R4l20r43k581m126m226l207k149
58627G11665j307m68K99J257L204O253R344J1746J3865J6000J7640J8714K0072
58614H28284K1880K2818K1837J9414J6277J2251P282K348j632m777p408r284j0365
58601I18925j1098j1417j0726r375q701q947q658o866m354k084J01K485M810P258
$$ plain form
58587 851353 861863 875890 891973 908218 924285 940742 956987 971260 982299 989566 992444 990971
58575 990971 987035 983117 980040 977574 976862 980280 988889 1001783 1017956 1037090 1058436 1080815 1103998
58562 1103998 1128424 1153285 1176486 1196786 1214414 1229345 1240609 1247715 1251257 1251722 1249071 1243821
58550 1243821 1237096 1229252 1219751 1208622 1196623 1183728 1169037 1152609 1135882 1119759 1103634 1086892
58538 1086892 1070124 1054330 1040018 1027509 1016979 1007808 998959 990331 982724 976353 970645 965726 962838
58525 962838 962872 965632 970783 978371 988042 998812 1009924 1021037 1031541 1040764 1048944 1056927 1064962 1072878
58511 1072878 1081174 1090589 1100704 1110415 1119718 1129527 1139691 1148654 1155079 1158359 1157662 1152216 1142753 1131095
58497 1131095 1118101 1103458 1087388 1070845 1054032 1036601 1019520 1004844 993331 984028 976495 971584
$$ packed form
58587H51353J0510J4027J6083J6245J6067J6457J6245J4273J1039P267K878j473
58575I90971l936l918l077k466p12L418Q609J2894J6173J9134K1346K2379K3183
58562A103998K4426K4861K3201K0300J7628J4931J1264P106L542M65k651n250
58550A243821o725p844r501j1129j1999j2895j4691j6428j6727j6123j6125j6742
58538A086892j6768j5794j4312j2509j0530r171q849q628p607o371n708m919k888
58525I62838L4K760N151P588R671J0770J1112J1113J0504R223Q180P983Q035P916
58511A072878Q296R415J0115R711R303R809J0164Q963O425L280o97n446r463j1658
58497A131095j2994j4643j6070j6543j6813j7431j7081j4676j1513r303p533m911
$$ plain form
58485 971584 969711 970310 973457 980084 989963 1001216 1012500 1023957 1035449 1045577 1053102 1057738 1059034
58472 1059034 1056208 1049720 1041287 1031717 1020364 1007272 994034 981855 970548 960225 952165 947004
58460 947004 943605 940718 938427 937241 937110 937986 940003 942480 944099 944539 944507 943926 941772 938047 934066 930341
58444 930341 926131 921600 918465 917743 918717 920775 924394 929563 935193 940900 947449 954734 961365 967135 973859
58429 973859 982732 992838 1003269 1014657 1027403 1040341 1052442 1064091 1075425 1085096 1091957 1096528
58417 1096528 1099748 1101835 1103232 1104938 1106850 1107372 1105586 1102277 1098163 1093075 1087595 1083386 1080896 1078745
58403 1078745 1076332 1074864 1074792 1074526 1073012 1071393 1070747 1070175 1068538 1066061 1062863 1057909 1050836 1042942 1035104
58388 1035104 1026677 1017656 1009738 1003882 998991 994389 991304 990322 989662 987794 985755 985181 986073 988149 992239
$$ packed form
58485I71584j873N99L147O627R879J1253J1284J1457J1492J0128P525M636J296
58472A059034k826o488q433r570j1353j3092j3238j2179j1307j0323q060n161
58460I47004l399k887k291j186j31Q76K017K477J619M40l2n81k154l725l981l725
58444I30341m210m531l135p22R74K058L619N169N630N707O549P285O631N770O724
58429I73859Q873J0106J0431J1388J2746J2938J2101J1649J1334R671O861M571
58417A096528L220K087J397J706J912N22j786l309m114n088n480m209k490k151
58403A078745k413j468p2k66j514j619o46n72j637k477l198m954p073p894p838
58388A035104q427r021p918n856m891m602l085r82o60j868k039n74Q92K076M090
$$ plain form
58373 992239 998507 1005269 1011433 1018284 1027155 1037296 1047717 1059060 1071786 1084487 1095958 1107114
58361 1107114 1119046 1130916 1141398 1150338 1157402 1161175 1161342 1159849 1158253 1156009 1152818 1150296 1149512 1149277
58347 1149277 1148829 1149962 1154572 1162283 1172343 1185440 1201663 1219069 1236366 1254696 1274810 1294991
58335 1294991 1313787 1332060 1350096 1365397 1375920 1382961 1388427 1391857 1392679 1392738 1393834 1395239 1396334
58322 1396334 1399077 1405068 1412613 1419589 1426742 1435397 1444458 1452672 1461430 1472404 1484764 1497484 1511790
58309 1511790 1528502 1545672 1561830 1578781 1598179 1618246 1637067 1656066 1676803 1697395 1715739
58298 1715739 1733323 1752122 1770653 1786964 1802609 1819733 1837129 1853203 1869854 1889129 1908982
58287 1908982 1926789 1944323 1964708 1987165 2009399 2032560 2059046 2087790 2116350 2145291 2176048
$$ packed form
58373I92239O268O762O164O851Q871J0141J0421J1343J2726J2701J1471J1156
58361A107114J1932J1870J0482Q940P064L773J67j493j596k244l191k522p84k35
58347A149277m48J133M610P711J0060J3097J6223J7406J7297J8330K0114K0181
58335A294991J8796J8273J8036J5301J0523P041N466L430Q22N9J096J405J095
58322A396334K743N991P545O976P153Q655R061Q214Q758J0974J2360J2720J4306
58309A511790J6712J7170J6158J6951J9398K0067J8821J8999K0737K0592J8344
58298A715739J7584J8799J8531J6311J5645J7124J7396J6074J6651J9275J9853
58287A908982J7807J7534K0385K2457K2234K3161K6486K8744K8560K8941L0757
$$ plain form
58276 2176048 2207060 2236806 2268210 2305289 2347782 2393462 2442907 2497236 2554051 2610610 2668352
58265 2668352 2729426 2791734 2852419 2913038 2976013 3039156 3099156 3157290 3216211 3274554 3330468
58254 3330468 3386854 3447084 3509233 3570882 3635794 3709090 3789478 3873187 3961767 4058779 4162514
58243 4162514 4269575 4382078 4503705 4632434 4764924 4904143 5054583 5214111 5379055
58234 5379055 5553019 5741588 5942696 6151768 6372056 6610044 6864963 7133189 7418619
58225 7418619 7728009 8060489 8412807 8790450 9202156 9648246 10126236 10642744 11207449
58216 11207449 11821039 12482624 13203098 13997106 14868672 15820394 16870143 18042252 19350101
58207 19350101 20806376 22443856 24307563 26435750 28871831 31689481 34987092 38872240
$$ packed form
58276B176048L1012K9746L1404L7079M2493M5680M9445N4329N6815N6559N7742
58265B668352O1074O2308O0685O0619O2975O3143O0000N8134N8921N8343N5914
58254C330468N6386O0230O2149O1649O4912P3296Q0388Q3709Q8580R7012J03735
58243D162514J07061J12503J21627J28729J32490J39219J50440J59528J64944
58234E379055J73964J88569K01108K09072K20288K37988K54919K68226K85430
58225G418619L09390L32480L52318L77643M11706M46090M77990N16508N64705
58216A1207449O13590O61585P20474P94008Q71566R51722J049749J172109J307849
58207A9350101J456275J637480J863707K128187K436081K817650L297611L885148
$$ plain form
58199 38872240 43483544 49025504 55762031 63991643 74056961 86357236 101311166 119317221
58191 119317221 140761736 165981041 195093976 227844249 263579011 301106920 338127438
58184 338127438 370659080 393517663 402206391 395060963 373991406 343383226 308222288
58177 308222288 272704494 239711430 210847013 186695549 167104681 151363742 138316779
58170 138316779 126621968 115208465 103634658 92052692 80877482 70496638 61171083
58163 61171083 53027436 46058176 40156627 35185731 31014847 27512104 24548261 22023529
58155 22023529 19870592 18029051 16438393 15055995 13857960 12817347 11899380 11079157
58147 11079157 10345333 9684113 9076412 8512480 7993302 7515513 7069382 6652644 6271636
$$ packed form
58199C8872240M611304N541960O736527Q229612J0065318J2300275J4953930J8006055
58191A19317221K1444515K5219305K9112935L2750273L5734762L7527909L7020518
58184C38127438L2531642K2858583Q688728p145428k1069557l0608180l5160938
58177C08222288l5517794l2993064k8864417k4151464j9590868j5740939j3046963
58170A38316779j1694811j1413503j1573807j1581966j1175210j0380844r325555
58163F1171083q143647o969260n901549m970896m170884l502743k963843k524732
58155B2023529k152937j841541j590658j382398j198035j040613r17967q20223
58147A1079157p33824o61220o07701n63932n19178m77789m46131m16738l81008
$$ plain form
58138 6271636 5926887 5610689 5319962 5058443 4824782 4610889 4413525 4235715 4075127
58129 4075127 3922262 3771812 3625533 3482957 3339812 3196953 3060792 2933309 2810836
58120 2810836 2693474 2586084 2488824 2396164 2306755 2225190 2152398 2083090 2014611 1950081 1890858
58109 1890858 1833751 1777612 1725236 1676899 1629016 1580879 1536007 1495392 1456013 1417344 1382797
58098 1382797 1353333 1325987 1299793 1276898 1256736 1235497 1212614 1191637 1173525 1155237 1136129
58087 1136129 1119528 1106473 1093821 1079965 1066604 1053430 1036860 1015744 992974 970046 945329
58076 945329 919040 894418 872467 850854 829427 811429 797644 784702 770919 758608 748791 738914
58064 738914 727955 718733 712793 707583 701113 695086 691039 687401 682583 677321 671984 665209 656944 649270
$$ packed form
58138F271636l44749l16198k90727k61519k33661k13893j97364j77810j60588
58129D075127j52865j50450j46279j42576j43145j42859j36161j27483j22473
58120B810836j17362j07390r7260r2660q9409q1565p2792o9308o8479o4530n9223
58109A890858n7107n6139n2376m8337m7883m8137m4872m0615l9379l8669l4547
58098A382797k9464k7346k6194k2895k0162k1239k2883k0977j8112j8288j9108
58087A136129j6601j3055j2652j3856j3361j3174j6570k1116k2770k2928k4717
58076I45329k6289k4622k1951k1613k1427j7998j3785j2942j3783j2311r817r877
58064G38914j0959r222n940n210o470o027m047l638m818n262n337o775q265p674
$$ plain form
58050 649270 642625 634900 625710 617759 612408 607699 602260 597310 593125 587504 579634 571814 565525 559343
58036 559343 552466 546655 542811 539198 534943 531758 530231 527918 523227 517828 513094 507464 499705 491701
58022 491701 485573 480690 475735 471159 467476 463644 459259 456027 455137 455387 455586 456524 458862 461454 463485
58007 463485 466011 469781 473696 477001 480733 485535 490286 494403 499233 505664 512575 518991 525521 532319
57993 532319 538056 542457 547412 553869 559870 563317 564640 565164 564947 563823 562595 561639 560155 558063 556641
57978 556641 556099 554626 551099 546619 542198 537258 531670 526811 523029 518452 511944 505051 499401 494384
57964 494384 489055 484098 480100 476000 471150 466956 464663 463250 461221 458641 455795 451811 446410 441282
57950 441282 437938 435868 434344 434177 436015 438719 441236 444388 449133 454786 460755 468269 478513 490594
$$ packed form
58050F49270o645p725r190p951n351m709n439m950m185n621p870p820o289o182
58036E59343o877n811l844l613m255l185j527k313m691n399m734n630p759q004
58022D91701o128m883m955m576l683l832m385l232q90K50J99R38K338K592K031
58007D63485K526L770L915L305L732M802M751M117M830O431O911O416O530O798
57993E32319N737M401M955O457O001L447J323N24k17j124j228r56j484k092j422
57978E56641n42j473l527m480m421m940n588m859l782m577o508o893n650n017
57964D94384n329m957l998m100m850m194k293j413k029k580k846l984n401n128
57950D41282l344k070j524j67J838K704K517L152M745N653N969P514J0244J2081
$$ plain form
57936 490594 503208 516774 532067 548157 563519 577817 590998 602026 610303 616925 622776 626680
57924 626680 627083 624213 618955 611068 600288 587912 575422 562627 548798 534472 520522 506605
57912 506605 492158 477833 464418 451470 438495 426344 415969 406946 398575 391125 384643 378032
57900 378032 370855 364599 360486 357515 354388 351882 351332 352123 352864 353918 356592 360625 364534 367835 371114
57885 371114 374473 377639 380971 384710 387779 388867 388123 386464 383972 380381 376383 372923 369838 366438
57871 366438 362774 359162 355408 351704 349273 348793 349208 349467 350287 352751 356377 360200 364680 370746 377940
57856 377940 385327 393355 402945 413448 423315 432187 440658 448611 455497 461621 467429 472019 474011 473457
57842 473457 471405 468144 463377 457574 451547 445174 437996 430535 423547 416611 409042 401583 395561 390854
$$ packed form
57936D90594J2614J3566J5293J6090J5362J4298J3181J1028Q277O622N851L904
57924F26680M03k870n258p887j0780j2376j2490j2795j3829j4326j3950j3917
57912E06605j4447j4325j3415j2948j2975j2151j0375r023q371p450o482o611
57900C78032p177o256m113k971l127k506n50P91P41J054K674M033L909L301L279
57885C71114L359L166L332L739L069J088p44j659k492l591l998l460l085l400
57871C66438l664l612l754l704k431m80M15K59Q20K464L626L823M480O066P194
57856C77940P387Q028R590J0503R867Q872Q471P953O886O124N808M590J992n54
57842D73457k052l261m767n803o027o373p178p461o988o936p569p459o022m707
$$ plain form
57828 390854 386394 382252 379538 378488 378249 378365 379030 380047 380907 381810 383457 386023 389367 393773 399361
57813 399361 405186 410055 413807 416829 419020 420358 421641 423302 424185 422814 419253 414437 408560 401628
57799 401628 394786 389306 384750 379724 373991 368365 363049 357632 352286 347492 343077 338870 335620 333788
57785 333788 332242 329828 327524 327158 328605 330184 331319 332796 334771 336648 338724 341864 345524 348075
57771 348075 349191 350035 350926 350656 348389 344515 339429 333104 326183 319825 314063 307708 300190 292195 284306
57756 284306 276474 269024 262727 257525 252542 247719 244108 242161 240965 239615 238322 237704 237869 238513 239177
57741 239177 239323 238831 238338 238369 238466 238041 237500 237399 237009 235156 232207 229744 228452 227684 226937 226290 225576 224653
57723 224653 224440 226090 229053 231411 232210 232111 231844 231546 231706 233079 235305 237033 237704 238002 238370 238456 238173
$$ packed form
57828C90854m460m142k714j050k39J16O65J017Q60R03J647K566L344M406N588
57813C99361N825M869L752L022K191J338J283J661Q83j371l561m816n877o932
57799D01628o842n480m556n026n733n626n316n417n346m794m415m207l250j832
57785C33788j546k414k304l66J447J579J135J477J975J877K076L140L660K551
57771C48075J116Q44Q91k70k267l874n086o325o921o358n762o355p518p995p889
57756B84306p832p450o297n202m983m823l611j947j196j350j293o18J65O44O64
57741B39177J46m92m93L1R7m25n41j01l90j853k949k463j292p68p47o47p14r23
57723B24653k13J650K963K358P99r9k67k98J60J373K226J728O71K98L68Q6k83
$$ plain form
57706 238173 237920 237553 236537 235395 235679 238158 242227 247215 252856 258298 262121 263904 264646 265282 265873 266368
57690 266368 266901 267118 266406 265055 264021 263444 262667 261865 262314 264893 269625 276749 286831 299715 314976
57675 314976 333683 358175 389823 428603 475112 531095 597222 671992 753407 839741 927061
57664 927061 1007090 1068858 1102501 1102006 1066765 1002289 918690 826908 735657 650924 576316 512849
57652 512849 459486 414885 378289 348710 324524 304385 287619 273375 260527 248819 238998 231356
57640 231356 225222 220160 216391 213603 210787 207824 205815 205121 204414 202504 199843 197333 194927 192439 190572
57625 190572 189940 189922 189532 188734 187950 187005 185458 183453 181436 179604 178175 177579 177798 178136 178145 178090 178092 177633 176412
57606 176412 174845 173319 171829 170722 170733 171710 172414 172208 171956 172531 173489 174010 174143 174267 174176 173597 172853 172242
$$ packed form
57706B38173k53l67j016j142K84K479M069M988N641N442L823J783P42O36N91M95
57690B66368N33K17p12j351j034n77p77q02M49K579M732P124J0082J2884J5261
57675C14976J8707K4492L1648L8780M6509N5983O6127P4770Q1415Q6334Q7320
57664I27061Q0029O1768L3643m95l5241o4476q3599r1782r1251q4733p4608o3467
57652E12849n3363m4601l6596k9579k4186k0139j6766j4244j2848j1708r821p642
57640B31356o134n062l769k788k816k963k009o94p07j910k661k510k406k488j867
57625A90572o32j8l90p98p84r45j547k005k017j832j429n96K19L38Rn5Km59j221
57606A76412j567j526j490j107J1R77P04k06k52N75R58N21J33J24r1n79p44o11
$$ plain form
57588 172242 171463 170324 169219 168271 166847 164657 162406 160687 159103 157282 155773 155013 154294 152799 150959
57573 150959 149816 149589 149722 149801 149610 148849 147613 146700 146751 147506 148368 149046 149208 148356 146680 145248 144684 144460
57555 144460 144087 144054 144846 146003 147044 148434 150586 152724 153794 153920 153951 154219 154704 155884 158303 161623
57539 161623 164953 167848 170353 172531 174547 176659 178506 179040 177823 175705 173626 171546 169319 167691
57525 167691 167405 168007 168553 168904 169380 169775 169807 169995 171028 172617 173973 175042 176365 178017 179619 181106
57509 181106 182711 184379 185885 187205 188252 188654 188390 188135 188423 188990 189433 189834 190174 190013 189455 189479 190437
57492 190437 191161 190604 189484 189144 189526 189605 189221 189148 189687 190446 191264 192281 193306 194069 194835 195952 197188 198273
57474 198273 199495 200942 201862 201809 201635 202158 202633 201983 200916 201119 202675 203923 203870 203200 202855 202979 203442 204137
$$ packed form
57588A72242p79j139j105r48j424k190k251j719j584j821j509p60p19j495j840
57573A50959j143k27J33P9j91p61j236r13N1P55Q62O78J62q52j676j432n64k24
57555A44460l73l3P92J157J041J390K152K138J070J26L1K68M85J180K419L320
57539A61623L330K895K505K178K016K112J847N34j217k118k079k080k227j628
57525A67691k86O02N46L51M76L95L2J88J033J589J356J069J323J652J602J487
57509A81106J605J668J506J320J047M02k64k55K88N67M43M01L40j61n58K4R58
57492A90437P24n57j120l40L82P9l84p3N39P59Q18J017J025P63P66J117J236J085
57474A98273J222J447R20n3j74N23M75o50j067K03J556J248n3o70l45J24M63O95
$$ plain form
57456 204137 204560 204259 203900 204788 207075 209483 211004 211936 212983 214293 215701 217207 218823 220443 221976
57441 221976 223290 224174 224846 226096 228270 230517 231827 232437 233315 234699 236179 237817 239945 242075 243305
57426 243305 243835 244812 246586 248314 249493 250758 252797 255460 258297 261220 264333 267719 271520 275534 278801
57411 278801 280477 281170 282487 285098 288147 290734 293019 295540 298277 300871 303174 305182 306913 308598
57397 308598 310601 312985 315475 317863 320060 321911 323453 325295 328208 332376 337380 342621 347356 350824
57383 350824 353056 355157 358029 361208 363777 365917 368534 371780 375180 378887 383441 388366 392408 395381
57369 395381 398499 402521 406715 410073 412598 414917 417467 420446 423882 427461 430937 434772 439623 445123
57355 445123 450120 454293 458546 463545 468823 473808 478896 484941 492232 500359 508630 516398 523442 530150
$$ packed form
57456B04137M23l01l59Q88K287K408J521R32J047J310J408J506J616J620J533
57441B21976J314Q84O72J250K174K247J310O10Q78J384J480J638K128K130J230
57426B43305N30R77J774J728J179J265K039K663K837K923L113L386L801M014L267
57411B78801J676O93J317K611L049K587K285K521K737K594K303K008J731J685
57397C08598K003K384K490K388K197J851J542J842K913M168N004N241M735L468
57383C50824K232K101K872L179K569K140K617L246L400L707M554M925M042K973
57369C95381L118M022M194L358K525K319K550K979L436L579L476L835M851N500
57355D45123M997M173M253M999N278M985N088O045P291Q127Q271P768P044O708
$$ plain form
57341 530150 536877 543203 548496 553110 558133 563902 569625 574667 579354 584292 589634 595327 601467 608195
57327 608195 615780 624665 634739 644751 653477 661431 670293 680509 690669 699616 707935 716725 725959
57314 725959 734927 743569 752528 762227 772492 782788 792544 801567 810338 819493 829045 838655 848562 859400
57300 859400 871006 882380 893036 903491 914176 924913 935928 948313 962655 977976 992820
57289 992820 1006899 1020987 1035662 1050877 1066513 1082721 1099723 1117558 1135917 1154172 1171829
57278 1171829 1188976 1205974 1222858 1239600 1256794 1275252 1294794 1314255 1332944 1351332 1370088
57267 1370088 1389155 1408195 1427213 1446307 1465359 1484336 1503442 1522701 1541922 1561327 1581651
57256 1581651 1603321 1626046 1649469 1673689 1698876 1724812 1751057 1777147 1802641 1827545 1852699
$$ packed form
57341E30150O727O326N293M614N023N769N723N042M687M938N342N693O140O728
57327F08195P585Q885J0074J0012Q726P954Q862J0216J0160Q947Q319Q790R234
57314G25959Q968Q642Q959R699J0265J0296R756R023Q771R155R552R610R907J0838
57300H59400J1606J1374J0656J0455J0685J0737J1015J2385J4342J5321J4844
57289I92820J4079J4088J4675J5215J5636J6208J7002J7835J8359J8255J7657
57278A171829J7147J6998J6884J6742J7194J8458J9542J9461J8689J8388J8756
57267A370088J9067J9040J9018J9094J9052J8977J9106J9259J9221J9405K0324
57256A581651K1670K2725K3423K4220K5187K5936K6245K6090K5494K4904K5154
$$ plain form
57245 1852699 1879101 1906752 1934781 1962712 1990840 2019366 2048140 2077425 2107902 2139609 2171719
57234 2171719 2203774 2236286 2269747 2303890 2338419 2373598 2409551 2445682 2481320 2516343 2550724
57223 2550724 2584138 2616523 2648396 2680124 2711437 2742116 2772533 2803034 2833362 2863230 2893023
57212 2893023 2923447 2954869 2987383 3021071 3055881 3091655 3128575 3167154 3207470 3248881 3290736
57201 3290736 3332911 3375413 3417874 3459643 3499918 3537753 3572457 3604132 3633367 3660379 3685017
57190 3685017 3707408 3727882 3746290 3762308 3776415 3789770 3803085 3816534 3830641 3846137 3862803
57179 3862803 3879690 3896741 3915118 3935580 3957650 3980689 4004631 4029293 4054134 4079223 4105329
57168 4105329 4132538 4159911 4187036 4214726 4243538 4272704 4301195 4328720 4354939 4378873 4400070
$$ packed form
57245A852699K6402K7651K8029K7931K8128K8526K8774K9285L0477L1707L2110
57234B171719L2055L2512L3461L4143L4529L5179L5953L6131L5638L5023L4381
57223B550724L3414L2385L1873L1728L1313L0679L0417L0501L0328K9868K9793
57212B893023L0424L1422L2514L3688L4810L5774L6920L8579M0316M1411M1855
57201C290736M2175M2502M2461M1769M0275L7835L4704L1675K9235K7012K4638
57190C685017K2391K0474J8408J6018J4107J3355J3315J3449J4107J5496J6666
57179C862803J6887J7051J8377K0462K2070K3039K3942K4662K4841K5089K6106
57168D105329K7209K7373K7125K7690K8812K9166K8491K7525K6219K3934K1197
$$ plain form
57157 4400070 4419442 4438106 4456193 4473565 4490697 4507930 4524747 4540817 4557065 4574727 4593920
57146 4593920 4613926 4634346 4655166 4676188 4697062 4717448 4736664 4753828 4768972 4783504 4799186
57135 4799186 4817059 4837374 4859495 4881582 4901554 4919075 4935816 4953464 4972546 4993446 5017054
57124 5017054 5043512 5071466 5099428 5126929 5153824 5179828 5205764 5234213 5268013 5308914 5358316
57113 5358316 5418127 5489974 5574569 5672806 5786872 5919980 6076203 6261226 6482260 6746898
57103 6746898 7063420 7442844 7899774 8451711 9119939 9932110 10922727 12131122 13600747
57094 13600747 15379354 17515117 20049103 23010791 26418020 30275738 34572603 39280545
57086 39280545 44355416 49732122 55320144 61011234 66686296 72190068 77280882 81621612
$$ packed form
57157D400070J9372J8664J8087J7372J7132J7233J6817J6070J6248J7662J9193
57146D593920K0006K0420K0820K1022K0874K0386J9216J7164J5144J4532J5682
57135D799186J7873K0315K2121K2087J9972J7521J6741J7648J9082K0900K3608
57124E017054K6458K7954K7962K7501K6895K6004K5936K8449L3800M0901M9402
57113E358316N9811P1847Q4595R8237J14066J33108J56223J85023K21034K64638
57103F746898L16522L79424M56930N51937O68228Q12171R90617J208395J469625
57094A3600747J778607K135763K533986K961688L407229L857718M296865M707942
57086C9280545N074871N376706N588022N691090N675062N503772N090814M340730
$$ plain form
57078 81621612 84861946 86766451 87284190 86513206 84613358 81745118 78056087 73689991
57070 73689991 68797029 63541048 58098289 52642636 47325655 42265576 37547010 33223348
57062 33223348 29319120 25835654 22758707 20063314 17716392 15680921 13920571 12401014
57054 12401014 11089237 9954698 8971346 8117189 7372574 6720496 6147824 5644326 5200643
57045 5200643 4808212 4460254 4151108 3874984 3626651 3402667 3200571 3017479 2850763
57036 2850763 2699298 2562447 2438330 2324606 2220447 2126189 2041497 1965533 1898707 1842518
57026 1842518 1797537 1763059 1739100 1727555 1731014 1751309 1789314 1844932 1916448 2000032 2089591
57015 2089591 2176062 2246542 2285512 2279311 2221879 2117998 1981511 1829473 1676229 1531045
$$ packed form
57078H1621612L240334J904505N17739p70984j899848k868240l689031m366096
57070G3689991m892962n255981n442759n455653n316981n060079m718566m323662
57062C3223348l904228l483466l076947k695393k346922k035471j760350j519557
57054A2401014j311777j134539r83352q54157p44615o52078n72672n03498m43683
57045E200643l92431l47958l09146k76124k48333k23984k02096j83092j66716
57036B850763j51465j36851j24117j13724j04159r4258q4692p5964o6826n6189
57026A842518m4981l4478k3959j1545L459K0295L8005N5618P1516Q3584Q9559
57015B089591Q6471P0480L8970o201n7432j03881j36487j52038j53244j45184
$$ plain form
57005 1531045 1399069 1282644 1181750 1094898 1020784 958789 907793 865659 830587 802130 780142
56994 780142 763493 750588 740516 732867 727005 722435 719497 718914 720860 725002 731071 738722 747009 754328
56980 754328 758533 756944 747181 728843 704127 676280 647739 619892 593718 569905 548822 530991
56968 530991 517169 507430 500735 496045 493465 493837 497774 505533 517247 532612 550781 571012 592777
56955 592777 614594 633318 645292 647975 640381 622995 598129 569606 540987 514186 490100 469711
56943 469711 453692 441535 432216 425541 422224 422945 428090 438062 453022 472469 495769 522925 554138
56930 554138 588491 623211 653865 675144 682393 673624 650430 616848 577506 536571 497251 461318
56918 461318 429296 401420 377954 358432 341521 326379 313461 303365 295533 288804 282637 277061
$$ packed form
57005A531045j31976j16425j00894q6852p4114o1995n0996m2134l5072k8457k1988
56994G80142j6649j2905j0072p649n862m570k938n83J946M142O069P651Q287P319
56980G54328M205j589r763j8338k4716k7847k8541k7847k6174k3813k1083j7831
56968E30991j3822r739o695m690k580L72L937P759J1714J5365J8169K0231K1765
56955E92777K1817J8724J1974K683p594j7386k4866k8523k8619k6801k4086k0389
56943D69711j6019j2157r319o675l317P21N145R972J4960J9447K3300K7156L1213
56930E54138L4353L4720L0654K1279P249q769k3194l3582l9342m0935l9320l5933
56918D61318l2022k7876k3466j9522j6911j5142j2918j0096p832o729o167n576
$$ plain form
56906 277061 272028 267628 264457 262951 262666 262851 263326 264284 265766 267899 271037 275071 279344 283945 290313
56891 290313 299705 311795 325636 341167 358645 377379 396292 415065 433190 448216 456565 456308
56879 456308 448182 434124 416087 396277 377087 360172 346198 335568 328684 325577 326241 331427 342221
56866 342221 358787 380387 406793 438764 476873 520623 568978 620811 674015 724320 765457
56855 765457 790907 796376 781673 750746 709726 664683 620616 581221 548415 522306 502441 489217
56843 489217 483682 486438 497545 517331 546474 585258 633426 690763 757178 832107 913985 999544
56831 999544 1082465 1152747 1198885 1212206 1190261 1137302 1062421 976618 889791 808728 736945
56820 736945 675732 625163 584839 554532 534203 523334 520886 526428 540796 564978 598748 641008
$$ packed form
56906B77061n033m400l171j506k85J85M75R58J482K133L138M034M273M601O368
56891B90313R392J2090J3841J5531J7478J8734J8913J8773J8125J5026Q349k57
56879D56308q126j4058j8037j9810j9190j6915j3974j0630o884l107O64N186J0794
56866C42221J6566K1600K6406L1971L8109M3750M8355N1833N3204N0305M1137
56855G65457K5450N469j4703l0927m1020m5043m4067l9395l2806k6109j9865j3224
56843D89217n535K756J1107J9786K9143L8784M8168N7337O6415P4929Q1878Q5559
56831I99544Q2921P0282M6138J3321k1945n2959p4881q5803q6827q1063p1783
56820G36945o1213n0569m0324l0307k0329j0869k448N542J4368K4182L3770M2260
$$ plain form
56808 641008 690826 747104 807217 866365 917766 953120 964402 947555 905263 845555 777490
56797 777490 708170 642461 583385 532137 488721 453103 425356 404949 390891 382761 380784 384829
56785 384829 394140 408218 427213 451212 479663 511355 544027 573737 595367 604376 598339 577526
56773 577526 544908 505430 464143 424404 387736 354875 326165 301340 279945 262041 247821
56762 247821 236667 227382 219290 212342 206342 200952 196325 192790 189914 186787 183183 179561 175978 172057
56748 172057 168060 164925 163038 161865 160937 160240 159513 158198 156361 154738 153565 152279 150613 149104 148189
56733 148189 147695 147541 148083 149327 150617 151483 152040 152278 151879 151078 150766 151194 151464 150961 150438 150935 152272 153439
56715 153439 154044 154559 155382 156382 157302 158081 158784 159477 160157 160661 160764 160437 159857 159142 158263 157141 155651 153686
$$ packed form
56808F41008M9818N6278O0113N9148N1401L5354J1282j6847m2292n9708o8065
56797G77490o9320o5709n9076n1248m3416l5618k7747k0407j4058q130j977M045
56785C84829R311J4078J8995K3999K8451L1692L2672K9710K1630R009o037k0813
56773E77526l2618l9478m1287l9739l6668l2861k8710k4825k1395j7904j4220
56762B47821j1154r285q092o948o000n390m627l535k876l127l604l622l583l921
56748A72057l997l135j887j173r28o97p27j315j837j623j173j286j666j509r15
56733A48189m94j54N42J244J290Q66N57K38l99q01l12M28K70n03n23M97J337J167
56715A53439O05N15Q23J000R20P79P03O93O80N04J03l27n80p15q79j122j490j965
$$ plain form
56697 153686 151535 149935 149265 148910 147924 146086 143812 141409 139131 137646 137504 138266 139031 139666 140616 141680
56681 141680 142157 142187 142780 144288 145953 147256 148591 150164 151354 151764 152049 153047 154745 156702 158828 161186
56665 161186 163496 165335 166487 166900 166755 166661 167169 167897 167812 166605 165185 164625 165229 166742 168762 170778 172519
56648 172519 174404 176977 179848 182065 183566 185271 187616 190043 192172 194304 196319 197200 196302 194206 191770
56633 191770 189154 186315 183593 181231 179086 177363 176864 177946 179943 182094 184293 186500 188278 189485
56619 189485 190658 192175 193819 195609 198106 201231 203682 204264 203142 201179 198844 196370 194147 192222
56605 192222 190186 188239 187531 188649 190533 191731 192039 192114 192239 192405 192893 193756 194168 193267 191333 189390 187972
56588 187972 186925 185970 184808 183153 181282 180072 179917 180147 180124 180175 180816 181752 182513 183349 184655 186067 187060
$$ packed form
56697A53686k151j600o70l55r86j838k274k403k278j485j42P62P65O35R50J064
56681A41680M77L0N93J508J665J303J335J573J190M10K85R98J698J957K126K358
56665A61186K310J839J152M13j45r4N08P28q5j207j420n60O04J513K020K016J741
56648A72519J885K573K871K217J501J705K345K427K129K132K015Q81q98k096k436
56633A91770k616k839k722k362k145j723m99J082J997K151K199K207J778J207
56619A89485J173J517J644J790K497L125K451N82j122j963k335k474k223j925
56605A92222k036j947p08J118J884J198L08P5J25J66M88Q63M12r01j934j943j418
56588A87972j047r55j162j655j871j210j55K30k3N1O41R36P61Q36J306J412R93
$$ plain form
56571 187060 187885 189083 190586 192181 194216 196949 199774 202183 204949 209226 214846 220703 226507 232955
56557 232955 240219 247480 254062 260058 265650 270656 274966 278752 282060 284707 286739 288548 290452 292418
56543 292418 294071 294768 293880 291362 287809 283752 279299 274672 270446 266800 263146 259090 255182 252107 249612
56528 249612 246860 243437 239428 235071 230961 227996 226412 225284 223726 222046 220974 220281 218989 216616
56514 216616 213458 209981 206710 204296 202965 202126 201126 200007 199020 197977 196691 195447 194326 192773 190659
56499 190659 188989 188562 188582 187724 186026 184528 183582 182838 182567 183588 185837 188179 189720 190430 190508 190062 189400
56482 189400 188865 188441 188195 188717 190287 191987 192685 192612 192912 193857 194652 194936 195277 196079 197017 197663 197941 197922 197940
56463 197940 198709 200457 202117 202398 201507 200802 200860 201054 201121 201845 203762 206182 208028 208976 209371 209581 209760 209884
$$ packed form
56571A87060Q25J198J503J595K035K733K825K409K766M277N620N857N804O448
56557B32955P264P261O582N996N592N006M310L786L308K647K032J809J904J966
56543B92418J653O97q88k518l553m057m453m627m226l646l654m056l908l075k495
56528B49612k752l423m009m357m110k965j584j128j558j680j072o93j292k373
56514B16616l158l477l271k414j331q39j000j119r87j043j286j244j121j553k114
56499A90659j670m27K0q58j698j498r46p44k71J021K249K342J541P10P8m46o62
56482A89400n35m24k46N22J570J700O98p3L00R45P95K84L41Q02R38O46K78j9J8
56463A97940P69J748J660K81q91p05N8J94O7P24J917K420J846R48L95K10J79J24
$$ plain form
56445 209884 209852 209816 210253 211339 212481 212997 212981 212961 213061 213160 213471 214189 214898 215185 215486 216430 217699 218532 219018
56426 219018 219816 220851 221469 221736 222363 223285 223572 222909 222111 221878 222033 222254 222699 223589 224860 226427 228160
56409 228160 229519 229945 229694 229611 230035 230537 230738 230736 230748 230916 231392 232038 232319 232056 231911 232426 233068 233128 233006 233545
56389 233545 234533 235137 235488 236495 238278 240176 242218 245113 248672 251627 253311 254324 255268 255968 256302 256692
56373 256692 257425 258370 259538 261030 262344 262769 262552 262618 263015 262761 261429 259766 258507 257661 257286 257819 259160
56356 259160 260378 260772 260555 260207 259951 260030 260756 262077 263748 265845 268423 270898 272677 274102 275704 276859
56340 276859 276500 274983 273833 273685 273917 274262 275178 276416 276889 276377 275911 276025 276068 275660 275426 275771 276359 277317
56322 277317 279472 282746 285693 287421 288702 290425 292175 293199 293693 294282 295113 296172 297623 299198 300163
$$ packed form
56445B09884l2l6M37J086J142N16j6k0J00R9L11P18P09K87L01R44J269Q33M86
56426B19018P98J035O18K67O27R22K87o63p98k33J55K21M45Q90J271J567J733
56409B28160J359M26k51q3M24N02K01kJ2J68M76O46K81k63j45N15O42O0j22N39
56389B33545R88O04L51J007J783J898K042K895L559K955J684J013R44P00L34L90
56373B56692P33R45J168J492J314M25k17O6L97k54j332j663j259q46l75N33J341
56356B59160J218L94k17l48k56P9P26J321J671K097K578K475J779J425J602J155
56340B76859l59j517j150j48K32L45R16J238M73n12m66J14M3m08k34L45N88R58
56322B77317K155L274K947J728J281J723J750J024M94N89Q31J059J451J575R65
$$ plain form
56307 300163 300433 300887 302157 304056 306501 309800 313566 316649 318739 320898 323834 326832 329060 330733 332192
56292 332192 332999 332834 332342 332250 332498 332941 333990 335796 337680 339087 340388 342197 344684 348016 352482 357656
56276 357656 362420 366339 370045 373831 377078 379634 382540 386664 391691 397140 403256 410146 417198 424187
56262 424187 431861 440642 449811 458867 468626 479987 492567 505516 518917 533501 549698 567699
56250 567699 587679 609208 631195 653051 675231 698177 721629 745428 769920 794906 819121
56239 819121 841342 861052 877552 889540 896219 897919 895145 888067 877311 864032 848696 830973
56227 830973 811209 790634 769720 747932 725619 704432 685097 666550 648118 630756 615126
56216 615126 600244 585315 571219 558804 547337 536081 525950 517956 511371 505012 499210 494900
$$ packed form
56307C00163K70M54J270J899K445L299L766L083K090K159K936K998K228J673J459
56292C32192Q07j65m92r2K48M43J049J806J884J407J301J809K487L332M466N174
56276C57656M764L919L706L786L247K556K906M124N027N449O116O890P052O989
56262D24187P674Q781R169R056R759J1361J2580J2949J3401J4584J6197J8001
56250E67699J9980K1529K1987K1856K2180K2946K3452K3799K4492K4986K4215
56239H19121K2221J9710J6500J1988O679J700k774p078j0756j3279j5336j7723
56227H30973j9764k0575k0914k1788k2313k1187j9335j8547j8432j7362j5630
56216F15126j4882j4929j4096j2415j1467j1256j0131p994o585o359n802m310
$$ plain form
56204 494900 491843 489252 487246 486226 485741 485327 485582 487070 489042 490446 491307 491996 492214 491887 491996 493238
56188 493238 494825 495733 496085 496267 495975 495360 495762 497945 500742 502770 504256 505941 507599 509075 511395 515238
56172 515238 519592 523462 527576 532788 538188 542625 546857 552318 558865 565572 572676 580871 589716 598599
56158 598599 608236 619390 631189 642631 654651 668659 684053 699376 715124 733130 753796 776058
56146 776058 799668 825524 854137 885676 921247 962430 1009889 1063980 1126350 1199474 1285071
56135 1285071 1384114 1497405 1624380 1761781 1904725 2048362 2187454 2315913 2428954 2525426
56125 2525426 2607019 2676308 2736714 2792337 2845168 2892861 2930787 2955483 2965105 2958541 2936589 2902987
56113 2902987 2861929 2814849 2760631 2697305 2621757 2529696 2418828 2291747 2154276 2012299
$$ packed form
56204D94900l057k591k006j020m85m14K55J488J972J404Q61O89K18l27J09J242
56188D93238J587R08L52J82k92o15M02K183K797K028J486J685J658J476K320L843
56172E15238M354L870M114N212N400M437M232N461O547O707P104Q195Q845Q883
56158E98599R637J1154J1799J1442J2020J4008J5394J5323J5748J8006K0666K2262
56146G76058K3610K5856K8613L1539L5571M1183M7459N4091O2370P3124Q5597
56135A285071R9043J13291J26975J37401J42944J43637J39092J28459J13041R6472
56125B525426Q1593O9289O0406N5623N2831M7693L7926K4696R622o564k1952l3602
56113B902987m1058m7080n4218o3326p5548r2061j10868j27081j37471j41977
$$ plain form
56103 2012299 1871654 1738833 1618730 1512495 1419563 1340350 1274937 1220978 1175668 1138483
56093 1138483 1109556 1087002 1068560 1054353 1045152 1039356 1034577 1030815 1029122 1028636 1028018 1028368 1031312 1035546
56079 1035546 1038771 1041895 1047717 1056389 1065750 1075408 1086870 1100204 1113990 1128164 1143704 1159982
56067 1159982 1175449 1190291 1205468 1220095 1232785 1244449 1256548 1267905 1276797 1284880 1295215 1307529
56055 1307529 1319408 1331030 1344519 1359489 1373484 1386277 1399694 1413894 1427935 1443206 1462005
56044 1462005 1483359 1504455 1525500 1548828 1574043 1598629 1622710 1648507 1675712 1702224 1729054
56033 1729054 1759730 1795197 1833799 1875592 1921711 1970163 2017468 2063973 2112429 2162034 2209422
56022 2209422 2254968 2302355 2352287 2402532 2453772 2509227 2568541 2628300 2688744 2753749 2824043
$$ packed form
56103B012299j40645j32821j20103j06235r2932p9213o5413n3959m5310l7185
56093A138483k8927k2554j8442j4207r201n796m779l762j693m86o18L50K944M234
56079A035546L225L124N822Q672R361R658J1462J3334J3786J4174J5540J6278
56067A159982J5467J4842J5177J4627J2690J1664J2099J1357Q892Q083J0335J2314
56055A307529J1879J1622J3489J4970J3995J2793J3417J4200J4041J5271J8799
56044A462005K1354K1096K1045K3328K5215K4586K4081K5797K7205K6512K6830
56033A729054L0676L5467L8602M1793M6119M8452M7305M6505M8456M9605M7388
56022B209422M5546M7387M9932N0245N1240N5455N9314N9759O0444O5005P0294
$$ plain form
56011 2824043 2896653 2971212 3050398 3133964 3218946 3306077 3399480 3499749 3604040 3712998 3830494
56000 3830494 3956394 4086958 4222654 4368006 4523484 4685369 4853859 5033132 5223111
55991 5223111 5419797 5624191 5842040 6074382 6317645 6573615 6849421 7147057 7463326
55982 7463326 7801042 8169393 8572056 9006184 9474484 9986525 10546745 11153610 11812568
55973 11812568 12537137 13335510 14209724 15170204 16237477 17428422 18756654 20248703 21944241
55964 21944241 23880218 26094608 28649696 31635293 35152875 39325717 44334073 50423641
55956 50423641 57884220 67048998 78310356 92097265 108832221 128932234 152801003
55949 152801003 180696211 212541274 247861241 285719657 324273115 360054835 387940445
$$ packed form
56011B824043P2610P4559P9186Q3566Q4982Q7131R3403J00269J04291J08958J17496
56000C830494J25900J30564J35696J45352J55478J61885J68490J79273J89979
55991E223111J96686K04394K17849K32342K43263K55970K75806K97636L16269
55982G463326L37716L68351M02663M34128M68300N12041N60220O06865O58958
55973A1812568P24569P98373Q74214R60480J067273J190945J328232J492049J695538
55964B1944241J935977K214390K555088K985597L517582M172842N008356O089568
55956E0423641P460579R164778J1261358J3786909J6734956K0100013K3868769
55949A52801003K7895208L1845063L5319967L7858416L8553458L5781720K7885610
$$ plain form
55942 387940445 402605230 400868166 383195363 353256734 316116871 276495421 237913591
55935 237913591 202570142 171521996 144985720 122689544 104150489 88813912 76126860
55928 76126860 65604864 56859404 49570425 43462017 38312732 33958531 30265416 27111374
55920 27111374 24398239 22057359 20030543 18259361 16698762 15323216 14110093 13030337
55912 13030337 12061397 11194360 10420602 9723701 9090682 8518684 8003825 7534618 7102406
55903 7102406 6707523 6349131 6018890 5710330 5424990 5163758 4921007 4692564 4480902
55894 4480902 4287269 4106644 3935364 3775985 3629789 3491986 3359351 3235691 3124861
55885 3124861 3024770 2932818 2851062 2781432 2721618 2670047 2629542 2601855 2583525 2570783 2563503
$$ packed form
55942C87940445J4664785j737064j7672803k9938629l7139863l9621450l8581830
55935B37913591l5343449l1048146k6536276k2296176j8539055j5336577j2687052
55928G6126860j0521996q745460p288979o108408n149285m354201l693115l154042
55920B7111374k713135k340880k026816j771182j560599j375546j213123j079756
55912A3030337r68940q67037p73758o96901o33019n71998n14859m69207m32212
55903G102406l94883l58392l30241l08560k85340k61232k42751k28443k11662
55894D480902j93633j80625j71280j59379j46196j37803j32635j23660j10830
55885C124861j00091r1952q1756o9630n9814n1571m0505k7687j8330j2742p280
$$ plain form
55874 2563503 2560579 2556044 2543236 2518482 2478228 2417993 2337948 2245167 2147097 2046771 1946593
55863 1946593 1851516 1764901 1685620 1612488 1547490 1491720 1442361 1396852 1356030 1320216 1286263
55852 1286263 1251636 1217751 1186230 1155480 1124006 1093617 1066275 1040887 1016001 992587 971494
55841 971494 951231 930792 911671 894668 877766 859586 841905 826352 811696 796817 783287
55830 783287 772458 762828 752788 743408 736139 730355 725180 721073 717561 712251 704155 695251 686917 677909
55816 677909 667886 659602 655067 652594 650204 649018 650582 653691 656789 660990 667784 675870 682947 688583
55802 688583 692882 694505 692582 688549 683653 676638 666223 653767 641052 627514 612159 596300 581904
55789 581904 569049 557371 548221 542887 540295 538671 537762 537305 535257 530018 522768 515376 507755 499520
$$ packed form
55874B563503k924m535j2808k4754m0254o0235q0045r2781r8070j00326j00178
55863A946593r5077q6615p9281p3132o4998n5770m9359m5509m0822l5814l3953
55852A286263l4627l3885l1521l0750l1474l0389k7342k5388k4886k3414k1093
55841I71494k0263k0439j9121j7003j6902j8180j7681j5553j4656j4879j3530
55830G83287j0829r630j0040r380p269n784n175m107l512n310q096q904q334r008
55816F77909j0023q284m535k473k390j186J564L109L098M201O794Q086P077N636
55802F88583M299J623j923m033m896p015j0415j2456j2715j3538j5355j5859j4396
55789E81904j2855j1678r150n334k592j624r09m57k048n239p250p392p621q235
$$ plain form
55775 499520 492311 487844 485169 482338 479357 477102 474804 471107 466367 461479 455684 447865 438841 430178
55761 430178 421871 413377 405688 400036 395688 391268 387199 384557 382518 379256 374527 369217 363141 355504
55747 355504 346868 338647 331197 324136 317824 312801 308522 304281 300550 297846 295350 292303 289654 288488
55733 288488 287958 286697 285268 285210 286524 288039 289404 290711 290903 288690 284585 280333 276808 274001 272214
55718 272214 271477 270500 268042 264779 262249 260598 258966 257355 256426 256102 255955 256331 257580 258906 259469 259768
55702 259768 260398 260471 258991 256843 255506 254656 252983 250636 248761 247273 245127 242443 240423 239473 239152 239529
55686 239529 240832 242182 242487 242266 242867 244214 245162 245745 247244 250070 253219 255767 257442 257859 256673 254394
55670 254394 251813 248900 245451 242348 240736 240406 240444 241038 243145 246846 251557 257443 264960 273304 280854
$$ packed form
55775D99520p209m467k675k831k981k255k298l697m740m888n795p819r024q663
55761D30178q307q494p689n652m348m420m069k642k039l262m729n310o076p637
55747C55504q636q221p450p061o312n023m279m241l731k704k496l047k649j166
55733B88488n30j261j429n8J314J515J365J307J92k213m105m252l525k807j787
55718B72214p37r77k458l263k530j651j632j611r29l24j47L76J249J326N63K99
55702B59768O30P3j480k148j337q50j673k347j875j488k146k684k020r50l21L77
55686B39529J303J350L05k21O01J347R48N83J499K826L149K548J675M17j186k279
55670B54394k581k913l449l103j612l30L8N94K107L701M711N886P517Q344P550
$$ plain form
55655 280854 286957 291880 295375 296865 296719 295770 293762 289748 283785 276839 269303 261057 252714 245302 238928
55640 238928 233167 228379 225168 222909 220338 217376 214892 213046 211360 210024 209438 208776 206786 203841 201501
55625 201501 200203 199074 197892 197386 197538 197404 196827 196732 197480 198410 199173 200049 200767 200477 199157 197741 196631
55608 196631 195292 193475 191597 189836 187973 186134 184564 182817 180367 177811 176163 175219 174041 172802
55594 172802 172542 173221 173705 173728 174196 175429 176610 177183 177386 177293 176749 176309 176768 177750 178294 178796 180671 184016
55576 184016 187386 190130 193155 197059 201357 206054 212188 220059 228479 236496 244358 252064 258429 262469
55562 262469 264523 265247 264646 262767 260166 256931 252292 245957 238909 232245 226083 220159 214585 209492 204744
55547 204744 200476 197109 194511 191952 189087 186150 183209 180311 178350 178391 179838 180663 179862 178432 177509
$$ packed form
55655B80854O103M923L495J490j46r49k008m014n963o946p536q246q343p412o374
55640B38928n761m788l211k259k571k962k484j846j686j336n86o62j990k945k340
55625B01501j298j129j182n06J52j34n77r5P48R30P63Q76P18k90j320j416j110
55608A96631j339j817j878j761j863j839j570j747k450k556j648r44j178j239
55594A72802k60O79M84K3M68J233J181N73K03r3n44m40M59R82N44N02J875L345
55576A84016L370K744L025L904M298M697O134P871Q420Q017P862P706O365M040
55562B62469K054P24o01j879k601l235m639o335p048o664o162n924n574n093m748
55547B04744m268l367k598k559k865k937k941k898j961M1J447Q25q01j430r23
$$ plain form
55532 177509 176925 176122 175194 174300 173181 171912 171093 170772 170179 169006 167812 166722 164991 162425 160040 158604
55516 158604 157592 156308 154977 154062 153470 153109 153227 153592 153362 152340 151369 150888 150209 148895 147682 147242 147082
55499 147082 146560 146036 146135 146700 147342 148227 149512 150747 151582 152321 153074 153173 152190 150819 149991 149798 149892 150211 150627
55480 150627 150684 150357 150345 150952 151499 151506 151567 152245 152916 152659 151652 150823 150674 151188 152329 153869 155219 156097 156884
55461 156884 157860 158768 159629 161106 163326 165161 165469 164416 162825 161028 159226 158181 158422 159256 159614 159546
55445 159546 159930 161007 162066 162460 162185 161624 161221 161280 161639 161769 161473 161093 160827 160468 160083 160187 160777 161024
55427 161024 160482 159855 159943 160627 161571 163100 165525 168288 170730 173177 176416 180563 185265 190505 196360 202374
55411 202374 207943 212928 217151 219806 220175 218511 215484 211211 205695 199693 194172 189178 184153 179084
$$ packed form
55532A77509n84q03r28q94j119j269q19l21n93j173j194j090j731k566k385j436
55516A58604j012j284j331r15n92l61J18L65k30j022r71m81o79j314j213m40j60
55499A47082n22n24R9N65O42Q85J285J235Q35P39P53R9r83j371q28j93R4L19M16
55480A50627N7l27j2O07N47PO1O78O71k57j007q29j49N14J141J540J350Q78P87
55461A56884R76R08Q61J477K220J835L08j053j591j797j802j045K41Q34L58o8
55445A59546L84J077J059L94k75n61m03N9L59J30k96l80k66l59l85J04N90K47
55427A61024n42o27Q8O84R44J529K425K763K442K447L239M147M702N240N855O014
55411B02374N569M985M223K655L69j664l027m273n516o002n521m994n025n069
$$ plain form
55397 179084 174544 170845 167933 165818 164296 162530 159852 156858 154888 154437 154790 155142 155343 155554 155807 155970
55381 155970 155761 154896 153607 152752 152924 153713 154372 154886 155765 157043 158162 158702 158677 158198 157390 156525 155769 154912
55363 154912 153743 152498 151551 150932 150546 150566 151137 151953 152584 153025 153470 153809 153769 153334 152651 151783 150894 150343 150220
55344 150220 150098 149575 148712 147614 146096 144207 142651 142172 142861 144381 146383 148359 149687 150322 150933 151839
55328 151839 152417 152100 151346 150989 151148 151484 151979 152739 153467 153869 154200 154716 155031 154701 154037 153670 153696 153872 154187
55309 154187 154560 154418 153328 151629 149813 147854 145824 144517 144540 145282 145762 146049 146874 148234 149390 149924
55293 149924 149950 149615 149273 149701 151159 152668 153257 153431 154207 155204 155146 154026 153217 153435 154056 154601 155473 156817
55275 156817 157951 158465 158841 159455 159859 159587 158823 157847 156609 155288 154523 154621 155149 155679 156327 157213 158005 158373
$$ packed form
55397A79084m540l699k912k115j522j766k678k994j970m51L53L52K01K11K53J63
55381A55970k09q65j289q55J72P89O59N14Q79J278J119N40k5m79q08q65p56q57
55363A54912j169j245r47o19l86K0N71Q16O31M41M45L39m0m35o83q68q89n51j23
55344A50220j22n23q63j098j518j889j556m79O89J520K002J976J328O35O11R06
55328A51839N78l17p54l57J59L36M95P60P28M02L31N16L15l30o64l67K6J76L15
55309A54187L73j42j090j699j816j959k030j307K3P42M80K87Q25J360J156N34
55293A49924K6l35l42M28J458J509N89J74P76R97n8j120q09K18O21N45Q72J344
55275A56817J134N14L76O14M04k72p64r76j238j321p65R8N28N30O48Q86P92L68
$$ plain form
55257 158373 158353 158018 157358 156715 156710 157406 158130 158403 158471 158634 158705 158521 158426 158710 158950 158395 156818 154736 152897 151693
55237 151693 150910 150078 149262 149242 150459 152003 152401 151385 150163 149895 150605 151714 152788 153418 153147 152088 151146
55220 151146 151128 151932 152939 153800 154505 154994 155118 154831 154226 153576 153445 154441 156628 159329 161584 162621 162079
55203 162079 160197 157842 155912 154584 153456 152338 151504 151148 151155 151463 152112 152820 153036 152633 152122 151963 152152
55186 152152 152610 153419 154387 154917 154733 154363 154471 154998 155371 155382 155402 155776 156368 156786 156889 156909 157125 157561 158145 159110
55166 159110 160891 163436 165917 167442 167964 168209 168908 170386 172641 175302 177526 178429 177780 176117 174200
55151 174200 172555 171435 170846 170645 170727 171004 171106 170496 169191 167972 167484 167417 167042 166220 165300 164403 163422 162519
55133 162519 161934 161422 160517 159233 157927 156701 155598 155169 155943 157427 158451 158603 158580 159004 159632 159923 159737
$$ packed form
55257A58373k0l35o60o43nO96P24K73O8J63P1j84r5K84K40n55j577k082j839j204
55237A51693p83q32q16k0J217J544L98j016j222k68P10J109J074O30k71j059r42
55220A51146j8Q04J007Q61P05M89J24k87o05o50j31R96K187K701K255J037n42
55203A62079j882k355j930j328j128j118q34l56PL08O49P08K16m03n11j59J89
55186A52152M58Q09R68N30j84l70J08N27L73J1K0L74N92M18J03K0K16M36N84R65
55166A59110J781K545K481J525N22K45O99J478K255K661K224R03o49j663j917
55151A74200j645j120n89k01Q2K77J02o10j305j219m88o7l75q22r20q97r81r03
55133A62519n85n12r05j284j306j226j103m29P74J484J024J52k3M24O28K91j86
$$ plain form
55116 159737 159275 158870 158942 159654 160513 160834 160537 159998 159277 158261 157440 157631 158842 160229 161289 162229 163061 163327
55098 163327 163047 163010 163671 164563 165235 165908 166707 167061 166539 165617 164944 164390 163562 162796 162900 164095 165817 167375
55080 167375 168306 168291 167268 165651 164106 163088 162641 162467 162093 161293 160478 160310 160841 161385 161419 161154 161061 161248
55062 161248 161579 161968 162250 162141 161681 161378 161587 162042 162277 162308 162626 163642 165360 167412 169243 170417 170812
55045 170812 170484 169483 168069 166886 166459 166672 167102 167688 168490 169027 168641 167456 166247 165410 164862 164874 165923
55028 165923 167522 168372 168096 167825 168431 169191 168986 168028 167450 167698 168248 168640 168979 169538 170391 171328 171742 170910
55010 170910 168804 166376 164617 163655 163074 162736 162795 163218 163805 164459 165136 165743 166394 167419 168862 170340 171674
54993 171674 173164 174856 176069 176200 175561 174937 174696 174868 175641 177069 178581 179446 179681 179956 180742 181959 183329
$$ packed form
55116A59737m62m05P2P12Q59L21k97n39p21j016q21J91J211J387J060R40Q32K66
55098A63327k80l7O61Q92O72O73P99L54n22r22o73n54q28p66J04J195J722J558
55080A67375R31j5j023j617j545j018m47j74l74q00q15j68N31N44L4k65r3J87
55062A61248L31L89K82j09m60l03K09M55K35L1L18J016J718K052J831J174L95
55045A70812l28j001j414j183m27K13M30N86Q02N37l86j185j209q37n48J2J049
55028A65923J599Q50k76k71O06P60k05r58n78K48N50L92L39N59Q53R37M14q32
55010A70910k106k428j759r62n81l38N9M23N87O54O77O07O51J025J443J478J334
54993A71674J490J692J213J31o39o24k41J72P73J428J512Q65K35K75P86J217J370
$$ plain form
54976 183329 184584 185441 185800 185942 186202 186558 186794 186911 187071 187262 187329 187200 186909 186626 186828 188106 190481 193125
54958 193125 195065 195975 196185 196241 196616 197424 198159 198115 197316 196626 196707 197328 197907 198202 198166 197737 197254 197468 198621
54939 198621 200015 201062 202287 204665 208405 213050 218334 224264 230664 237386 244785 253322 262786 272396
54925 272396 281464 289406 295420 298782 299370 297428 293076 286577 278776 270599 262277 253696 245324 238103
54911 238103 232459 227968 224000 220251 216735 213698 211431 209787 208089 205984 204085 203192 203181 203311 203409 203972
54895 203972 205241 206962 209097 211968 215563 219349 223067 227188 232381 238921 246725 255544 264968 274514
54881 274514 283727 291912 297934 300817 300593 298045 293638 287181 278708 269166 259881 251542 243922 236494
54867 236494 229251 222923 218300 215313 213060 210839 208698 206743 204480 201481 198284 195915 194663 193992
$$ packed form
54976A83329J255Q57L59J42K60L56K36J17J60J91O7j29k91k83K02J278K375K644
54958A93125J940R10K10N6L75Q08P35m4p99o90Q1O21N79K95l6m29m83K14J153
54939A98621J394J047J225K378L740M645N284N930O400O722P399Q537R464R610
54925B72396R068P942O014L362N88j942m352o499p801q177q322q581q372p221
54911B38103n644m491l968l749l516l037k267j644j698k105j899q93j1J30R8N63
54895B03972J269J721K135K871L595L786L718M121N193O540P804Q819R424R546
54881B74514R213Q185O022K883k24k548m407o457q473r542r285q339p620p428
54867B36494p243o328m623k987k253k221k141j955k263k999l197k369j252o71
$$ plain form
54853 193992 193531 193402 193605 193753 193540 192920 191751 189855 187521 185461 184057 183094 182351 182004 182265 182989 183807
54836 183807 184372 184489 184307 184379 185127 186190 186663 186039 184623 183088 182009 181830 182772 184537 186395 187710 188320
54819 188320 188463 188544 188844 189241 189389 189403 190041 191750 193868 195293 195723 195646 195398 195011 194822 195287 196074 196240 195612
54800 195612 195201 195850 197132 198115 198627 199187 200056 200961 201607 201951 202003 201727 201197 200693 200592 201206 202642 204808
54782 204808 207688 211543 216601 222568 228811 235160 242216 250647 260401 270856 281574 292581 303801
54769 303801 314462 323356 329795 334079 336768 337633 335762 330794 323665 315963 308827 302491 296435 289733
54755 289733 281824 273247 265161 257865 250514 242774 235968 231651 229506 227721 225216 222490 220359 218950
54741 218950 218176 218301 219643 222238 225972 230577 235439 239990 244402 249322 254901 260753 266877 273833 281732
$$ packed form
54853A93992m61j29K03J48k13o20j169j896k334k060j404r63p43l47K61P24Q18
54836A83807N65J17j82P2P48J063M73o24j416j535j079j79R42J765J858J315O10
54819A88320J43Q1L00L97J48J4O38J709K118J425M30p7k48l87j89M65P87J66o28
54800A95612m11O49J282R83N12N60Q69R05O46L44N2k76n30n04j01O14J436K166
54782B04808K880L855N058N967O243O349P056Q431R754J0455J0718J1007J1220
54769C03801J0661Q894O439M284K689Q65j871m968p129p702p136o336o056o702
54755B89733p909q577q086p296p351p740o806m317k145j785k505k726k131j409
54741B18950p74J25J342K595L734M605M862M551M412M920N579N852O124O956P899
$$ plain form
54726 281732 289679 296461 301227 303316 302184 297954 291524 283811 275289 266454 258050 250374 242885 235073
54712 235073 227429 221074 216610 213671 211451 209353 207253 205349 203794 202467 201238 200258 199689 199320 198873
54697 198873 198541 198621 198757 198242 197196 196667 197307 198556 199483 199881 200116 200400 200689 200974 201246 201372 201267 201023
54679 201023 200736 200472 200464 201004 202041 203225 204359 205313 205548 204413 202157 199947 198533 197478 196111 194634
54663 194634 193680 193240 192753 192078 191759 192269 193358 194247 194359 193835 193397 193586 194187 194602 194652 194684 194978 195554 196474
54644 196474 197771 199015 199609 199621 199734 200189 200443 200065 199248 198184 196762 195313 194808 195555 196364 195798 193903
54627 193903 191935 190764 190304 190285 190757 191743 192961 193982 194379 193850 192604 191469 191227 191873 192853 193804 194683
54610 194683 195396 195794 195997 196264 196583 196723 196707 196851 197305 197854 198301 198804 199709 201069 202445 203290 203567 203825
$$ packed form
54726B81732P947O782M766K089j132m230o430p713q522q835q404p676p489p812
54712B35073p644o355m464k939k220k098k100j904j555j327j229r80n69l69m47
54697A98873l32Q0J36n15j046n29O40J249R27L98K35K84K89K85K72J26j05k44
54679B01023k87k64qN40J037J184J134R54K35j135k256k210j414j055j367j477
54663A94634r54m40m87o75l19N10J089Q89J12n24m38J89O01M15N0L2K94N76R20
54644A96474J297J244N94J2J13M55K54l78q17j064j422j449n05P47Q09n66j895
54627A93903j968j171m60j9M72R86J218J021L97n29j246j135k42O46R80R51Q79
54610A94683P13L98K03K67L19J40j6J44M54N49M47N03R05J360J376Q45K77K58
$$ plain form
54592 203825 204429 204930 204595 203515 202644 202686 203450 204385 205132 205328 204515 202796 201141 200503 200880 201576 202186 202893
54574 202893 203998 205432 206627 206775 205517 203518 201937 201190 200732 200205 200120 200985 202354 203326 203574 203329 202824
54557 202824 202336 202369 203084 203787 203703 203135 203205 204490 206429 208099 209101 209654 210164 210832 211513 212041 212664 213824
54539 213824 215381 216528 216783 216562 216396 216161 215650 215419 216204 217758 219041 219482 219403 219236 218974 218495 217859 217161
54521 217161 216470 215954 215756 215745 215732 215851 216378 217228 217932 218070 217520 216467 215448 215088 215465 215923 215876 215484 215204
54502 215204 215024 214701 214421 214595 215200 215910 216744 217920 219149 219708 219288 218319 217414 216922 216982 217571 218457 219395
54484 219395 220358 221370 222320 223172 224087 225025 225642 225955 226621 227916 228966 228771 227701 227122 227723 229031 230407
54467 230407 231673 232804 233818 234932 236108 236626 236006 235161 235544 237119 238352 238364 237918 237889 237959 237506 236762
$$ packed form
54592B03825O04N01l35j080q71M2P64R35P47J96q13j719j655o38L77O96O10P07
54574B02893J105J434J195J48j258j999j581p47m58n27q5Q65J369R72K48k45n05
54557B02824m88L3P15P03q4n68P0J285J939J670J002N53N10O68O81N28O23J160
54539B13824J557J147K55k21j66k35n11k31P85J554J283M41p9j67k62m79o36o98
54521B17161o91n16j98j1j3J19N27Q50P04J38n50j053j019l60L77M58m7l92k80
54502B15204j80l23k80J74O05P10Q34J176J229N59m20r69r05m92O0N89Q86R38
54484B19395R63J012R50Q52R15R38O17L13O66J295J050j95j070n79O01J308J376
54467B30407J266J131J014J114J176N18o20q45L83J575J233J2m46k9P0m53p44
$$ plain form
54450 236762 236293 236066 235837 235845 236315 236740 236422 235380 234065 232597 230960 229599 229027 229015 228900 228651 228886 229784
54432 229784 230630 230650 229817 228588 227251 225867 224624 223823 223500 223315 222963 222592 222644 223304 224331 225466 226763
54415 226763 228362 230176 232030 233784 235061 235200 233962 232121 230815 230415 230444 230401 230077 229240 227817 226456
54399 226456 226130 226970 228150 229116 230171 231498 232384 232017 230554 228830 227423 226553 226535 227621 229424 231093
54383 231093 232145 232922 234156 236143 238280 239441 239088 237961 237314 237435 237497 236894 236085 235772 235973 236435 237370
54366 237370 239040 240962 242226 242460 241953 241038 239963 239178 239014 239092 238676 237736 237086 237338 238190 238928 239188 239067
54348 239067 238869 238995 239753 240927 241798 241868 241411 241071 240995 240707 239801 238497 237368 236648 235928 234537 232187 229304
54330 229304 226857 225787 226423 228251 230292 231781 232520 232650 232288 231526 230613 229892 229581 229775 230580 232006 233770
$$ packed form
54450B36762m69k27k29QM70M25l18j042j315j468j637j361n72j2j15k49K35Q98
54432B29784Q46K0q33j229j337j384j243q01l23j85l52l71N2O60J027J135J297
54415B26763J599J814J854J754J277J39j238j841j306m00K9m3l24q37j423j361
54399B26456l26Q40J180R66J055J327Q86l67j463j724j407q70j8J086J803J669
54383B31093J052P77J234J987K137J161l53j127o47J21O2o03q09l13K01M62R35
54366B37370J670J922J264K34n07r15j075p85j64P8m16r40o50K52Q52P38K60j21
54348B39067j98J26P58J174Q71P0m57l40p6k88r06j304j129p20p20j391k350k883
54330B29304k447j070O36J828K041J489P39J30l62p62r13p21l11J94Q05J426J764
$$ plain form
54313 233770 235488 237080 238801 240801 242867 244660 246091 247378 248859 250703 252648 254054 254368 253578 252112
54298 252112 250401 248656 246861 244794 242281 239735 238120 237862 238032 237278 235475 233759 232900 232484 231917 231404
54282 231404 231366 231512 231143 230074 228693 227306 225922 224579 223473 222822 222781 223362 224269 225096 225907 227249 229283
54265 229283 231223 232089 231780 231044 230572 230512 230687 230861 230847 230707 230788 231331 232123 232743 232963 232726 232067 231362 231299 232117
54245 232117 233095 233293 232671 231987 231791 232025 232503 233117 233532 233314 232571 232004 232111 232650 233035 232885 232169 231218 230792
54226 230792 231620 233528 235320 235887 235214 234053 232940 231925 231028 230422 230121 229937 229816 229858 229852 229144 227298 224688
54208 224688 222106 219920 217988 216377 215585 215785 216323 216403 216042 215828 215897 215787 215352 215184 215827 217124 218654
54191 218654 220352 222155 223411 223310 221909 220192 219093 218784 218947 219288 219626 219841 219917 219919 219795 219374 218640 217867
$$ packed form
54313B33770J718J592J721K000K066J793J431J287J481J844J945J406L14p90j466
54298B52112j711j745j795k067k513k546j615k58J70p54j803j716q59m16n67n13
54282B31404l8J46l69j069j381j387j384j343j106o51m1N81R07Q27Q11J342K034
54265B29283J940Q66l09p36m72o0J75J74j4j40Q1N43P92O20K20k37o59p05o3Q18
54245B32117R78J98o22o84j96K34M78O14M15k18p43n67J07N39L85j50p16r51m26
54226B30792Q28J908J792N67o73j161j113j015q97o06l01j84j21M2op08j846k610
54208B24688k582k186j932j611p92K00N38Q0l61k14O9j10m35j68O43J297J530
54191B18654J698J803J256j01j401j717j099l09J63L41L38K15P6Kj24m21p34p73
$$ plain form
54173 217867 217439 217603 218365 219439 220343 220750 220763 220709 220699 220610 220414 220180 219754 218864 217729 217166 217729 218945 219791
54154 219791 219831 219526 219515 220035 221136 222973 225520 228219 230412 232064 233707 235625 237480 238885 239991 241162
54138 241162 242290 242815 242368 241131 239557 238009 236686 235628 234680 233623 232400 231116 229878 228836 228347
54123 228347 228764 229957 231233 231925 231963 231858 232236 233402 235132 236827 237983 238543 238724 238669 238526 238644 239214
54106 239214 239705 239218 237602 235764 234618 234103 233561 232688 231723 230921 230215 229390 228333 227195 226380 226138 226140 225805
54088 225805 225231 225314 226586 228369 229576 230010 230288 230712 230928 230724 230481 230622 231066 231484 231809 232231 232855 233555
54070 233555 234039 233990 233246 232011 230851 230405 230944 232084 232956 232915 232108 231184 230480 229897 229596 230199 231910 233947
54052 233947 235433 236437 237510 238514 238784 238345 238064 238415 238879 238933 238952 239637 241043 242695 244363 246200 248288
$$ packed form
54173B17867m28J64P62J074R04M07J3n4j0q9j96k34m26q90j135n63N63J216Q46
54154B19791M0l05j1N20J101J837K547K699K193J652J643J918J855J405J106J171
54138B41162J128N25m47j237j574j548j323j058r48j057j223j284j238j042m89
54123B28347M17J193J276O92L8j05L78J166J730J695J156N60J81n5j43J18N70
54106B39214M91m87j616j838j146n15n42q73r65q02p06q25j057j138q15k42Kl35
54088B25805n74Q3J272J783J207M34K78M24K16k04k43J41M44M18L25M22O24P00
54070B33555M84m9p44j235j160m46N39J140Q72m1q07r24p04n83l01O03J711K037
54052B33947J486J004J073J004K70m39k81L51M64N4J9O85J406J652J668J837K088
$$ plain form
54035 248288 250547 253025 255853 258890 261692 263983 265977 268184 270965 274298 277834 281143 283954 286302
54021 286302 288483 290809 293263 295394 296765 297585 298607 300163 301618 302165 301953 301826 302076 302092 301426 300493
54005 300493 299866 299391 298556 297366 296257 295315 294163 292663 291226 290359 290273 291039 292772 295454 298845 302821
53989 302821 307650 313735 321288 330474 341774 355951 373616 394960 419924 448371 479877 513240
53977 513240 546160 575312 596806 606968 603425 586180 558003 523549 487528 453210 422281 395627
53965 395627 373764 356468 342549 330572 319877 310645 303125 297216 292768 289757 287912 286605 285444
53952 285444 284676 284601 284887 284903 284634 284712 285633 287355 289673 292447 295349 297877 299856 301610 303498 305645 308254
53935 308254 311717 316082 320774 325191 329292 333238 336765 339398 341116 342376 343506 344467 345104 345323 344996
$$ packed form
54035B48288K259K478K828L037K802K291J994K207K781L333L536L309K811K348
54021B86302K181K326K454K131J371Q20J022J556J455N47k12j27K50J6o66r33
54005C00493o27m75q35j190j109r42j152j500j437q67q6P66J733K682L391L976
53989C02821M829O085P553R186J1300J4177J7665K1344K4964K8447L1506L3363
53977E13240L2920K9152K1494J0162l543j7245k8177l4454l6021l4318l0929k6654
53965C95627k1863j7296j3919j1977j0695r232p520n909m448l011j845j307j161
53952B85444p68p5K86J6k69P8R21J722K318K774K902K528J979J754J888K147K609
53935C08254L463M365M692M417M101L946L527K633J718J260J130R61O37K19l27
$$ plain form
53920 344996 344096 342996 342414 342881 344366 346421 348628 350929 353575 356672 359763 362092 363386 364086 364625
53905 364625 364842 364419 363609 362994 362665 362140 361084 359645 357989 356008 353697 351507 349997 349260 348847 348161
53889 348161 346823 344776 342193 339296 336205 332918 329325 325242 320588 315659 311104 307412 304528 302131
53875 302131 300108 298462 296841 294641 291710 288667 286279 284681 283353 281820 280180 278884 278130 277617 276924
53860 276924 275988 275076 274367 273802 273309 272932 272740 272816 273352 274411 275558 276101 275849 275299 274903 274573 274146 273860
53842 273860 273982 274342 274679 275145 275998 277061 277943 278470 278493 277669 276123 274951 275163 276229 276589 275746 274963 275599
53824 275599 277485 279431 280694 281444 282166 283187 284605 286260 287898 289617 292001 295526 299971 304637 309062
53809 309062 313422 318468 325272 334878 347879 364283 383858 406496 432062 459760 487571 512240
$$ packed form
53920C44996r00j100n82M67J485K055K207K301K646L097L091K329J294P00N39
53905C64625K17m23q10o15l29n25j056j439j656j981k311k190j510p37m13o86
53889C48161j338k047k583k897l091l287l593m083m654m929m555l692k884k397
53875C02131k023j646j621k200k931l043k388j598j328j533j640j296p54n13o93
53860B76924r36r12p09n65m93l77j92P6N36J059J147N43k52n50l96l30m27k86
53842B73860J22L60L37M66Q53J063Q82N27K3q24j546j172K12J066L60q43p83O36
53824B75599J886J946J263P50P22J021J418J655J638J719K384L525M445M666M425
53809C09062M360N046O804R606J3001J6404J9575K2638K5566K7698K7811K4669
$$ plain form
53797 512240 530051 538127 535486 523279 504287 482076 459909 439775 422251 407412 395550 386763
53785 386763 380299 375075 370775 367855 366471 366127 366546 368230 371751 376933 383048 389492 395977 402398 408749
53770 408749 414927 420378 424186 425644 424464 420369 413012 402631 390383 377703 365514 354228 344032
53757 344032 334809 326093 317645 309955 303824 299557 296853 295236 294200 293078 291288 288907 286715 285481
53743 285481 285244 285310 284953 284097 283298 283026 283113 283065 282713 282305 282136 282459 283599 285539 287406 288130 287905 288303 290513
53724 290513 293985 297315 299941 302322 304880 307600 310555 314029 317960 321858 325458 329000 332662 336082
53710 336082 338720 340426 341451 342097 342613 343299 344439 346035 347735 349126 350127 351041 352207 353665 355265
53695 355265 356998 359051 361498 364121 366566 368525 369845 370702 371645 373146 375005 376523 377388 378085 379250
$$ packed form
53797E12240J7811Q076k641j2207j8992k2211k2167k0134j7524j4839j1862q787
53785C86763o464n224m300k920j384l44M19J684L521N182O115O444O485O421O351
53770D08749O178N451L808J458j180m095p357j0381j2248j2680j2189j1286j0196
53757C44032r223q716q448p690o131m267k704j617j036j122j790k381k192j234
53743B85481k37O6l57q56p99k72Q7m8l52m08j69L23J140J940J867P24k25L98K210
53724B90513L472L330K626K381K558K720K955L474L931L898L600L542L662L420
53710C36082K638J706J025O46N16O86J140J596J700J391J001R14J166J458J600
53695C55265J733K053K447K623K445J959J320Q57R43J501J859J518Q65O97J165
$$ plain form
53680 379250 380904 382560 383819 384610 385077 385515 386251 387248 387961 387814 386798 385361 383816 382108 380176 378297
53664 378297 376928 376202 375646 374549 372714 370743 369359 368552 367732 366642 365677 365242 365246 365434 365803 366412 367072
53647 367072 367519 367654 367425 366729 365637 364466 363434 362523 361791 361501 361702 362121 362708 363902 365950 368318 370201
53630 370201 371422 372426 373629 375125 376847 378625 380212 381579 383078 385091 387676 390690 393995 397348
53616 397348 400454 403351 406369 409452 412061 414135 416596 420269 424739 428976 432728 436552 440673 444673
53602 444673 448321 451951 455863 459902 463732 467100 469800 471835 473629 475665 477905 479898 481324 482045
53588 482045 481874 480884 479807 479443 479731 479975 479913 479801 479554 478642 477032 475417 474241 473188 471887 470364 468441
53571 468441 465524 461616 457888 455514 454260 452932 450969 448955 447625 446997 446567 445998 445394 445071 445182 445554
$$ packed form
53680C79250J654J656J259P91M67M38P36R97P13j47j016j437j545j708j932j879
53664C78297j369p26n56j097j835j971j384q07q20j090r65m35MJ88L69O09O60
53647C67072M47J35k29o96j092j171j032r11p32k90K01M19N87J194K048K368J883
53630C70201J221J004J203J496J722J778J587J367J499K013K585L014L305L353
53616C97348L106K897L018L083K609K074K461L673M470M237L752L824M121M000
53602D44673L648L630L912M039L830L368K700K035J794K036K240J993J426P21
53588D82045j71r90j077l64K88K44o2j12k47r12j610j615j176j053j301j523j923
53571D68441k917l908l728k374j254j328j963k014j330o28m30n69o04l23J11L72
$$ plain form
53555 445554 445908 446165 446395 446582 446726 447094 447970 449122 449971 450411 451045 452406 454395 456725 459488 462897 466785
53538 466785 470747 474565 478227 481760 485387 489606 494771 500768 507378 514753 523164 532504 542406 552815
53524 552815 564090 576606 590541 606000 623057 641683 661836 683600 707081 732223 758898
53513 758898 786997 816182 845656 874470 902003 927941 951941 973745 993673 1012683 1031683
53502 1031683 1050879 1069963 1088883 1108249 1128860 1150904 1173841 1197152 1220959 1245688 1271367
53491 1271367 1297693 1324689 1352661 1381372 1409848 1437358 1464087 1490457 1516249 1540937 1564560
53480 1564560 1587540 1609774 1630569 1649535 1667013 1683583 1699636 1715498 1731340 1746697 1760540
53469 1760540 1772184 1781852 1790039 1796627 1800993 1802757 1801983 1798638 1792209 1782061 1768189 1751561 1733610
$$ packed form
53555D45554L54K57K30J87J44L68Q76J152Q49M40O34J361J989K330K763L409L888
53538D66785L962L818L662L533L627M219N165N997O610P375Q411R340R902J0409
53524E52815J1275J2516J3935J5459J7057J8626K0153K1764K3481K5142K6675
53513G58898K8099K9185K9474K8814K7533K5938K4000K1804J9928J9010J9000
53502A031683J9196J9084J8920J9366K0611K2044K2937K3311K3807K4729K5679
53491A271367K6326K6996K7972K8711K8476K7510K6729K6370K5792K4688K3623
53480A564560K2980K2234K0795J8966J7478J6570J6053J5862J5842J5357J3843
53469A760540J1644R668Q187O588M366J764p74l345o429j0148j3872j6628j7951
$$ plain form
53456 1733610 1715175 1695927 1675097 1652776 1630096 1607937 1585812 1562422 1537045 1509977 1481838
53445 1481838 1453106 1424391 1396478 1369698 1343618 1317704 1292112 1267505 1244327 1222641 1202582
53434 1202582 1184500 1168648 1155064 1143867 1135321 1129361 1125300 1122319 1120272 1119802 1121620 1125714 1131348
53421 1131348 1137893 1145670 1155844 1169304 1185709 1203832 1222850 1243004 1264932 1288724 1313958 1340422
53409 1340422 1368313 1397689 1428088 1458972 1490456 1523385 1558704 1596790 1637439 1680387 1725732
53398 1725732 1773774 1824591 1877900 1933330 1990681 2049946 2111299 2175063 2241396 2309770 2379009
53387 2379009 2448106 2516912 2585818 2654899 2723689 2791720 2858832 2924756 2988667 3049436 3106284
53376 3106284 3159028 3207777 3252634 3293719 3331273 3365500 3396300 3423342 3446381 3465299 3479738
$$ packed form
53456A733610j8435j9248k0830k2321k2680k2159k2125k3390k5377k7068k8139
53445A481838k8732k8715k7913k6780k6080k5914k5592k4607k3178k1686k0059
53434A202582j8082j5852j3584j1197q546n960m061k981k047m70J818M094N634
53421A131348O545P777J0174J3460J6405J8123J9018K0154K1928K3792K5234K6464
53409A340422K7891K9376L0399L0884L1484L2929L5319L8086M0649M2948M5345
53398A725732M8042N0817N3309N5430N7351N9265O1353O3764O6333O8374O9239
53387B379009O9097O8806O8906O9081O8790O8031O7112O5924O3911O0769N6848
53376C106284N2744M8749M4857M1085L7554L4227L0800K7042K3039J8918J4439
$$ plain form
53365 3479738 3488924 3492072 3488757 3478505 3460182 3432312 3394215 3346558 3290728 3228031 3159639 3086894
53353 3086894 3011237 2933993 2856370 2779362 2703374 2628224 2553811 2480594 2409156 2339607 2271752
53342 2271752 2205540 2140881 2077278 2014220 1951836 1890733 1831318 1773855 1719069 1667936 1620716
53331 1620716 1576802 1535805 1498161 1464317 1433832 1405884 1380366 1357879 1338630 1321867 1306502
53320 1306502 1291911 1277921 1264365 1251136 1238681 1228011 1219856 1213945 1209433 1205976 1203997 1203811 1204961
53307 1204961 1206678 1208712 1211438 1215453 1221357 1229592 1240034 1251993 1265072 1279824 1297044 1316607
53295 1316607 1337669 1359885 1383686 1409274 1436130 1463932 1493346 1525286 1559596 1594911 1629759
53284 1629759 1663571 1696693 1729590 1762052 1793105 1821765 1847797 1871572 1893336 1912939 1930274
$$ packed form
53365C479738R186L148l315j0252j8323k7870l8097m7657n5830o2697o8392p2745
53353C086894p5657p7244p7623p7008p5988p5150p4413p3217p1438o9549o7855
53342B271752o6212o4659o3603o3058o2384o1103n9415n7463n4786n1133m7220
53331A620716m3914m0997l7644l3844l0485k7948k5518k2487j9249j6763j5365
53320A306502j4591j3990j3556j3229j2455j0670q155n911m512l457j979j86J150
53307A204961J717K034K726M015N904Q235J0442J1959J3079J4752J7220J9563
53295A316607K1062K2216K3801K5588K6856K7802K9414L1940L4310L5315L4848
53284A629759L3812L3122L2897L2462L1053K8660K6032K3775K1764J9603J7335
$$ plain form
53273 1930274 1945556 1958975 1970318 1979052 1984617 1986641 1985165 1980690 1973770 1964459 1952318 1936884 1917842
53260 1917842 1894896 1867966 1837588 1804682 1769806 1732988 1694317 1654239 1613177 1571253 1528582
53249 1528582 1485460 1442134 1398802 1356008 1314624 1275195 1237579 1201348 1166182 1131765 1097716
53238 1097716 1063875 1030368 997264 964536 932424 901373 871561 842886 815448 789432 764554
53227 764554 740446 717798 698157 682160 668781 656830 646256 637243 628975 620414 611749 603847
53215 603847 596594 588878 580078 570534 560606 550315 539987 530226 521070 512047 503274 495574 489190 483253
53201 483253 476972 470536 464360 458198 451725 445412 439950 435115 429942 423993 417832 412230 407391 403050
53187 403050 398970 395162 391807 389015 386543 383831 380510 376885 373703 371431 369883 368565 367274 366283
$$ packed form
53273A930274J5282J3419J1343Q734N565K024j476m475o920r311j2141j5434j9042
53260A917842k2946k6930l0378l2906l4876l6818l8671m0078m1062m1924m2671
53249A528582m3122m3326m3332m2794m1384l9429l7616l6231l5166l4417l4049
53238A097716l3841l3507l3104l2728l2112l1051k9812k8675k7438k6016k4878
53227G64554k4108k2648j9641j5997j3379j1951j0574r013q268q561q665p902
53215F03847p253p716q800r544r928j0291j0328r761r156r023q773p700o384n937
53201D83253o281o436o176o162o473o313n462m835n173n949o161n602m839m341
53187D03050m080l808l355k792k472k712l321l625l182k272j548j318j291r91
$$ plain form
53173 366283 366000 366448 367094 367246 366678 365780 365084 364736 364519 364251 363984 363848 363871 364026 364333 364797 365311 365669 365736
53154 365736 365528 365168 364831 364765 365260 366390 367766 368672 368571 367498 365988 364651 363796 363305 362799 361980 360883
53137 360883 359790 358878 357996 356840 355314 353686 352427 351865 351891 351973 351477 350050 347786 345151 342784 341197
53121 341197 340523 340559 341117 342167 343555 344784 345352 345187 344557 343687 342714 341780 340864 339683 338139 336650 335581
53104 335581 334513 332724 330311 328176 326831 325946 325193 324729 324475 323754 322267 320854 320548 321248 322043 322529
53088 322529 323078 323899 324569 324652 324353 324338 325096 326465 327644 327836 327073 326297 326378 327240 328133 328505 328293 327657 326829
53069 326829 326071 325429 324643 323566 322501 321896 321936 322629 323916 325353 326146 326000 325601 325696 326089 326138 325906 325991 326489
53050 326489 326996 327608 328918 330866 332501 333233 333572 334126 334512 333949 332546 331321 331004 331340 331624 331584 331535 331794
$$ packed form
53173C66283k83M48O46J52n68q98o96l48k17k68k67j36K3J55L07M64N14L58O7
53154C65736k08l60l37o6M95J130J376R06j01j073j510j337q55m91n06q19j097
53137C60883j093r12q82j156j526j628j259n62K6Q2m96j427k264k635k367j587
53121C41197o74L6N58J050J388J229N68j65o30q70r73r34r16j181j544j489j069
53104C35581j068j789k413k135j345q85p53m64k54p21j487j413l06P00P95M86
53088C22529N49Q21O70Q3k99j5P58J369J179J92p63p76Q1Q62Q93L72k12o36q28
53069C26829p58o42p86j077j065o05M0O93J287J437P93j46l99R5L93M9k32Q5M98
53050C26489N07O12J310J948J635P32L39N54L86n63j403j225l17L36K84m0m9K59
$$ plain form
53032 331794 332216 332436 332521 333002 334072 335045 335002 333856 332383 331252 330428 329489 328080 326058 323640 321511 320325
53015 320325 319923 319420 318254 316777 315653 315003 314457 313772 313052 312494 312261 312525 313383 314649 315946 317077 318171
52998 318171 319344 320294 320481 319815 318948 318643 318981 319467 319745 319761 319308 318067 316293 314837 314179 313945 313747 313885
52980 313885 314726 315969 317145 318398 320040 321743 322999 324037 325396 326838 327682 328108 329081 330829 332421
52965 332421 333203 333741 334870 336431 337487 337351 335984 333757 331187 328701 326440 324478 323129 322640 322656 322549
52949 322549 322234 322037 321777 320793 319069 317519 316868 316922 317254 317842 318543 318730 318112 317391 317423 318080 318508 318243 317489
52930 317489 316604 315837 315450 315601 316114 316593 316706 316286 315452 314710 314519 314616 314323 313655 313463 314137 314867 314733 313934
52911 313934 313286 313113 313352 314176 315560 316526 315927 313997 312242 311655 311826 311992 312159 312768 313878 315305 317160
$$ packed form
53032C31794M22K20Q5M81J070R73m3j146j473j131q24r39j409k022k418k129j186
53015C20325m02n03j166j477j124o50n46o85p20n58k33K64Q58J266J297J131J094
52998C18171J173R50J87o66q67l05L38M86K78J6m53j241j774j456o58k34j98J38
52980C13885Q41J243J176J253J642J703J256J038J359J442Q44M26R73J748J592
52965C32421P82N38J129J561J056j36j367k227k570k486k261j962j349m89J6j07
52949C22549l15j97k60r84j724j550o51N4L32N88P01J87o18p21L2O57M28k65p54
52930C17489q85p67l87J51N13M79J13m20q34p42j91R7k93o68j92O74P30j34p99
52911C13934o48j73K39Q24J384R66n99j930j755n87J71J66J67O09J110J427J855
$$ plain form
52894 317160 319699 322705 325492 327570 329001 330034 330668 330809 330631 330422 330090 329213 327813 326658 326337 326317
52878 326317 325491 323599 321477 319889 318772 317762 316759 315635 314125 312513 311819 312553 313737 313906 312931
52863 312931 312109 312479 313771 315108 316145 317120 318124 318786 318728 318088 317398 316947 316534 316032 315917 316727 318100
52846 318100 318910 318523 317380 316199 315120 313888 312326 310251 307463 304301 301807 300862 301379 302673 304203
52831 304203 305640 306669 307284 307868 308560 308924 308738 308568 308921 309380 309434 309814 312008 316503 322407 328806 335641
52814 335641 343092 350837 358194 364388 368378 369002 365726 359092 350316 340663 331211 322770 315774 310342
52800 310342 306393 303552 301193 298926 296870 295097 293142 290630 288168 286885 287079 287936 288552 288597 287978 286688
52784 286688 285284 284773 285552 286917 288024 288993 290629 293294 296362 298682 299461 298932 298233 298355 299116 299521
$$ packed form
52894C17160K539L006K787K078J431J033O34J41j78k09l32q77j400j155l21k0
52878C26317q26j892k122j588j117j010j003j124j510j612o94P34J184J69r75
52863C12931q22L70J292J337J037R75J004O62n8o40o90m51m13n02j15Q10J373
52846C18100Q10l87j143j181j079j232j562k075k788l162k494r45N17J294J530
52831C04203J437J029O15N84O92L64j86j70L53M59N4L80K194M495N904O399O835
52814C35641P451P745P357O194L990O24l276o634q776r653r452q441o996n432
52800C10342l949k841k359k267k056j773j955k512k462j283J94Q57O16M5o19j290
52784B86688j404n11P79J365J107R69J636K665L068K320P79n29o99J22P61M05
$$ plain form
52768 299521 299191 298877 299317 300114 300232 299316 298005 297091 296851 297177 297867 298583 298860 298491 297865 297709 298430 299830
52750 299830 301460 303015 304241 304778 304543 304185 304557 305587 306267 306052 305727 306337 307736 308873 309270 309438 309916
52733 309916 310686 311672 313097 314951 316543 317037 316288 314927 313741 312966 312079 310312 307617 305026 303721 303798
52717 303798 304302 304437 304312 304418 304863 305336 305545 305450 305200 304975 304788 304455 303859 303139 302436 301667 300890 300685 301717
52698 301717 303879 306259 307973 308803 309077 309313 309941 310995 312086 312949 313852 315107 316329 316780 316401 315951
52682 315951 316112 316937 318207 319754 321356 322829 324329 326087 327823 328938 329376 329742 330428 331219 331895 332674
52666 332674 333809 335323 337274 339766 342495 344873 346906 349382 352851 356941 361008 364865 368441 371233
52652 371233 372656 372608 371244 368514 364374 359173 353453 347613 342052 337355 333954 331786 330566 330127 330279
$$ packed form
52768B99521l30l14M40P97J18r16j311r14k40L26O90P16K77l69o26j56P21J400
52750B99830J630J555J226N37k35l58L72J030O80k15l25O10J399J137L97J68M78
52733C09916P70R86J425J854J592M94p49j361j186p75q87j767k695k591j305P7
52717C03798N04J35j25J06M45M73K09r5k50k25j87l33n96p20p03p69p77k05J032
52698C01717K162K380J714Q30K74K36O28J054J091Q63R03J255J222M51l79m50
52682C15951J61Q25J270J547J602J473J500J758J736J115M38L66O86P91O76P79
52666C32674J135J514J951K492K729K378K033K476L469M090M067L857L576K792
52652C71233J423m8j364k730m140n201n720n840n561m697l401k168j220m39J52
$$ plain form
52637 330279 330656 331026 331508 332322 333613 335667 338830 342872 346814 349640 350867 350327 348038 344622 341191
52622 341191 338257 335234 331589 327983 325602 324681 324348 323701 322485 320936 319560 318909 318993 319027 318289 317125
52606 317125 316627 317436 319301 321587 323682 325092 325728 326050 326465 326731 326483 326112 326468 327739 329280 330549
52590 330549 331515 332113 332054 331470 331148 331721 333013 334479 335962 337678 339766 342129 344576 346849 348631 349702
52574 349702 350105 350078 349913 349803 349731 349517 349128 348811 348723 348506 347566 345836 343999 342813 342414 342373 342309 342259 342457 342832
52554 342832 342916 342338 341291 340228 339136 337547 335390 333415 332462 332564 333073 333420 333490 333476 333703 334407 335478
52537 335478 336593 337738 339199 340821 341818 341784 341393 341504 341988 342128 341819 341554 341455 341227 341020 341412 342381 343130
52519 343130 343183 342938 342870 342884 342829 343038 343933 345520 347652 350301 353193 355531 356547 356122 354643 352547 350294
$$ packed form
52637C30279L77L70M82Q14J291K054L163M042L942K826J227n40k289l416l431
52622C41191k934l023l645l606k381r21l33o47j216j549j376o51Q4L4p38j164
52606C17125m98Q09J865K286K095J410O36L22M15K66k48l71L56J271J541J269
52590C30549R66N98n9n84l22N73J292J466J483J716K088K363K447K273J782J071
52574C49702M03k7j65j10p2k14l89l17q8k17r40j730j837j186l99m1o4n0J98L75
52554C42832Q4n78j047j063j092j589k157j975r53J02N09L47P0j4K27P04J071
52537C35478J115J145J461J622R97l4l91J11M84J40l09k65r9k28k07L92R69P49
52519C43130N3k45o8J4n5K09Q95J587K132K649K892K338J016m25j479k096k253
$$ plain form
52502 350294 348429 347255 346580 346041 345543 345202 345046 344985 344943 344899 344972 345400 346193 346849 346875 346592 346876 347943 349008
52483 349008 349467 349788 350731 352225 353667 354938 356383 357979 359291 360307 361648 363716 366099 368013 369045
52468 369045 369262 368985 368690 368951 370075 371747 373142 373465 372446 370360 367653 364613 361464 358618 356516
52453 356516 355094 353646 351511 348815 346374 344896 344447 344616 344964 345246 345367 345273 344921 344366 343827 343592 343804
52436 343804 344352 344969 345355 345316 344895 344331 343722 342782 341198 339210 337570 336842 336991 337657 338506 339176 339352 339222
52418 339222 339545 340896 342987 345082 346926 348955 351703 355377 359922 365107 370553 376138 382485 390670
52404 390670 401182 413338 425771 437212 446619 452872 454890 452259 445581 436142 425266 414016 403317
52391 403317 394002 386503 380608 375788 371847 369087 367742 367489 367682 367908 368075 368102 367843 367383 367111 367402 368322
$$ packed form
52502C50294j865j174o75n39m98l41j56o1m2m4P3M28P93O56K6k83K84J067J065
52483C49008M59L21R43J494J442J271J445J596J312J016J341K068K383J914J032
52468C69045K17k77k95K61J124J672J395L23j019k086k707l040l149k846k102
52453C56516j422j448k135k696k441j478m49J69L48K82J21r4l52n55n39k35K12
52436C43804N48O17L86l9m21n64o09r40j584j988j640p28J49O66Q49O70J76j30
52418C39222L23J351K091K095J844K029K748L674M545N185N446N585O347Q185
52404C90670J0512J2156J2433J1441R407O253K018k631o678r439j0876j1250j0699
52391D03317r315p499n895m820l941k760j345k53J93K26J67K7k59m60k72K91R20
$$ plain form
52374 368322 369703 371380 373288 375488 378122 381165 384159 386367 387368 387406 387061 386672 386179 385433 384513 383761
52358 383761 383602 384243 385426 386568 387342 388069 389318 391097 392728 393631 393970 394339 395001 395790 396602 397622 398970
52341 398970 400494 402092 403993 406473 409429 412499 415549 418828 422635 427069 432194 438261 445527 453759
52327 453759 462006 469097 474513 478746 482645 486506 490037 493222 496710 501050 505903 510549 515046 520316
52313 520316 526936 534336 541504 548170 554957 562518 570933 579942 589466 599690 610747 622476 634532
52300 634532 646706 659007 671425 683615 694976 705074 713908 721741 728777 735102 740904 746662 752975
52287 752975 760089 767594 774727 781124 787128 793283 799625 805659 810895 815137 818386 820853 823185 826283
52273 826283 830552 835406 839704 842711 844615 846230 848262 850680 852764 853839 854091 854444 855533 856990 857994
$$ packed form
52374C68322J381J677J908K200K634L043K994K208J001L8l45l89m93p46r20p52
52358C83761j59O41J183J142P74P27J249J779J631R03L39L69O62P89Q12J020J348
52341C98970J524J598J901K480K956L070L050L279L807M434N125O067P266Q232
52327D53759Q247P091N416M233L899L861L531L185L488M340M853M646M497N270
52313E20316O620P400P168O666O787P561Q415R009R524J0224J1057J1729J2056
52300F34532J2174J2301J2418J2190J1361J0098Q834P833P036O325N802N758O313
52287G52975P114P505P133O397O004O155O342O034N236M242L249K467K332L098
52273H26283M269M854M298L007J904J615K032K418K084J075K52L53J089J457J004
$$ plain form
52258 857994 858386 858901 860315 862678 865622 869123 873574 878991 884572 889412 893566 898006 903396 909359 915184
52243 915184 920880 927050 933911 941054 948185 955525 963293 971290 979351 987785 996892 1006222 1014778 1021980
52229 1021980 1028102 1033772 1039247 1044278 1048453 1051595 1053893 1055651 1056927 1057516 1057356 1056794 1056326 1056138 1056073 1055962
52213 1055962 1055859 1055936 1056235 1056493 1056294 1055494 1054448 1053512 1052404 1050512 1048012 1046177 1046147 1047759 1050094 1052849
52197 1052849 1056445 1060876 1065235 1068660 1071193 1073381 1075460 1077270 1078608 1079283 1079020 1077723 1075716 1073476
52183 1073476 1071246 1069155 1067518 1066627 1066274 1065853 1064965 1063688 1062237 1060657 1058918 1057035 1054919 1052324 1049136
52168 1049136 1045545 1041758 1037659 1033004 1027939 1023138 1019356 1016914 1015608 1014958 1014488 1013887 1013080 1012200 1011455
52153 1011455 1011046 1011193 1012177 1014196 1017110 1020387 1023385 1025749 1027526 1028920 1029972 1030454 1030035 1028555 1026246
$$ packed form
52258H57994L92N15J414K363K944L501M451N417N581M840M154M440N390N963N825
52243I15184N696O170O861P143P131P340P768P997Q061Q434R107R330Q556P202
52229A021980O122N670N475N031M175L142K298J758J276N89j60n62m68j88o5j11
52213A055962j03P7K99K58j99q00j046r36j108j892k500j835l0J612K335K755
52197A052849L596M431M359L425K533K188K079J810J338O75k63j297k007k240
52183A073476k230k091j637q91l53m21q88j277j451j580j739j883k116k595l188
52168A049136l591l787m099m655n065m801l782k442j306o50m70o01q07q80p45
52153A011455m09J47R84K019K914L277K998K364J777J394J052M82m19j480k309
$$ plain form
52138 1026246 1023713 1021634 1020373 1019898 1020090 1021003 1022733 1025086 1027580 1029841 1031882 1033972 1036368 1039238 1042687
52123 1042687 1046615 1050567 1053918 1056355 1058205 1060225 1063035 1066662 1070671 1074792 1079381 1085116 1092294 1100724
52109 1100724 1110359 1121609 1134739 1149295 1164644 1180919 1198757 1217972 1237039 1254197 1268730
52098 1268730 1280970 1291488 1300728 1309146 1317147 1324871 1332316 1339612 1346963 1354410 1361940 1369752 1378100
52085 1378100 1386873 1395573 1403681 1410851 1416791 1421246 1424108 1425374 1425083 1423448 1420876 1417558 1413138 1407203
52071 1407203 1400044 1392566 1385506 1379190 1374032 1370623 1368990 1368253 1367471 1366634 1366495 1367563 1369552 1371694 1373322
52056 1373322 1374231 1374720 1375303 1376264 1377488 1378755 1379985 1381201 1382512 1384333 1387379 1392125 1398350 1405383 1412664
52041 1412664 1419872 1426733 1433025 1438741 1443952 1448532 1452224 1454943 1456750 1457542 1457101 1455568 1453646 1452141
$$ packed form
52138A026246k533k079j261m75J92R13J730K353K494K261K041K090K396K870L449
52123A042687L928L952L351K437J850K020K810L627M009M121M589N735P178Q430
52109A100724R635J1250J3130J4556J5349J6275J7838J9215J9067J7158J4533
52098A268730J2240J0518R240Q418Q001P724P445P296P351P447P530P812Q348
52085A378100Q773Q700Q108P170N940M455K862J266k91j635k572l318m420n935
52071A407203p159p478p060o316n158l409j633p37p82q37j39J068J989K142J628
52056A373322R09M89N83R61J224J267J230J216J311J821L046M746O225P033P281
52041A412664P208O861O292N716N211M580L692K719J807P92m41j533j922j505
$$ plain form
52027 1452141 1451371 1451224 1451657 1452903 1455022 1457480 1459511 1460985 1462658 1465311 1468813 1472351 1475450 1478224 1480416
52012 1480416 1480702 1477428 1469894 1458552 1444078 1426699 1406556 1384300 1361022 1337677 1314783 1292641
52000 1292641 1271591 1251837 1233096 1214677 1196139 1177698 1159769 1142158 1124052 1104873 1084871
51989 1084871 1064742 1044981 1025742 1006928 988050 968257 947032 924864 902988 882448 863647
51978 863647 846640 831452 818070 806517 797117 790399 786545 785125 785538 787525 791012 795576 800323
51965 800323 804261 806634 806839 804267 798493 789651 778487 765960 752909 740148 728682 719458 712814
51952 712814 708379 705637 704434 704887 707052 710847 716149 722744 730339 738719 747723 756834 765066 771614
51938 771614 776513 780262 782863 783743 782736 780694 778727 776951 774287 769472 762116 752788 742282 730972
$$ packed form
52027A452141p70j47M33J246K119K458K031J474J673K653L502L538L099K774K192
52012A480416K86l274p534j1342j4474j7379k0143k2256k3278k3345k2894k2142
52000A292641k1050j9754j8741j8419j8538j8441j7929j7611j8106j9179k0002
51989A084871k0129j9761j9239j8814j8878j9793k1225k2168k1876k0540j8801
51978H63647j7007j5188j3382j1553r400o718l854j420M13J987L487M564M747
51965H00323L938K373K05k572n774q842j1164j2527j3051j2761j1466r224o644
51952G12814m435k742j203M53K165L795N302O595P595Q380R004R111Q232O548
51938G71614M899L749K601Q80j007k042j967j776k664m815p356r328j0506j1310
$$ plain form
51924 730972 718912 706456 694544 684184 675672 668474 661915 655873 650842 647452 646029 646510 648633
51911 648633 652165 656937 662806 669712 677691 686423 694582 699969 700860 697266 690637 682299 672528 661176
51897 661176 648657 635906 623569 611754 600628 590891 583445 578692 576375 576098 577917 582317 589649
51884 589649 599704 611943 626065 642045 659432 676835 692565 705901 717284 726869 733194 733993
51872 733993 728514 718594 707131 695905 685260 675353 666817 660197 655518 652695 651830 652825 655239 658930
51858 658930 664461 672393 682416 693639 705535 718219 732005 747163 764079 783262 805080 829623
51846 829623 856523 884486 911059 933225 948248 953929 948735 932595 907668 877688 846236 815783
51834 815783 788004 763986 743794 726462 710974 696992 684402 672727 661508 650986 641897 634723
$$ packed form
51924G30972j2060j2456j1912j0360q512p198o559o042n031l390j423M81K123
51911F48633L532M772N869O906P979Q732Q159N387Q91l594o629q338r771j1352
51897F61176j2519j2751j2337j1815j1126r737p446m753k317k77J819M400P332
51884E89649J0055J2239J4122J5980J7387J7403J5730J3336J1383R585O325P99
51872G33993n479r920j1463j1226j0645r907q536o620m679k823q65R95K414L691
51858F58930N531P932J0023J1223J1896J2684J3786J5158J6916J9183K1818K4543
51846H29623K6900K7963K6573K2166J5023N681n194j6140k4927k9980l1452l0453
51834H15783k7779k4018k0192j7332j5488j3982j2590j1675j1219j0522r089p174
$$ plain form
51822 634723 629587 626641 626011 627232 629158 630600 630880 629714 626834 622008 615412 607791 600073 592781 585882
51807 585882 579273 573219 568100 563865 560096 556673 553988 552386 551730 551750 552514 554202 556603 559189 561613
51792 561613 563861 565932 567610 568569 568505 567196 564596 560969 556845 552854 549581 547412 546396 546374 547416
51777 547416 550038 554805 561757 570319 579639 588871 597273 604254 609358 612097 611976 608908 603506 596717
51763 596717 589230 581445 573801 566699 560086 553563 547135 541518 537465 534969 533370 532114 531188 530898 531460
51748 531460 532757 534406 536128 538260 541707 547102 554006 561207 567864 574072 580295 586639 592967 599431
51734 599431 606310 613260 619112 622710 623888 623540 622910 622957 624261 627223 632049 638392 644986 649923 651697
51719 651697 650171 646467 641964 637621 634237 632726 633652 636636 640648 644958 649653 655365 662737 671868
$$ packed form
51822F34723n136k946o30J221J926J442K80j166k880m826o596p621p718p292o899
51807E85882o609o054n119m235l769l423k685j602o56K0P64J688K401K586K424
51792E61613K248K071J678R59o4j309k600l627m124l991l273k169j016k2J042
51777E47416K622M767O952Q562R320R232Q402O981N104K739j21l068n402o789
51763E96717p487p785p644p102o613o523o428n617m053k496j599j256r26k90N62
51748E31460J297J649J722K132L447N395O904P201O657O208O223O344O328O464
51734E99431O879O950N852L598J178l48o30M7J304K962M826O343O594M937J774
51719F51697j526l704m503m343l384j511R26K984M012M310M695N712P372R131
$$ plain form
51705 671868 681688 689836 693789 692620 687672 681448 676011 672481 671548 673841 679550 687726 696060 701618
51691 701618 702232 697490 688484 676720 663482 650072 638025 628625 622247 618294 615625 613006 609590
51678 609590 605399 601346 598426 596837 596043 595653 596017 597953 602035 608273 616411 626376 638248 651659
51664 651659 665353 677624 687201 693460 695854 693717 687012 676935 665346 653743 643068 634133 627548
51651 627548 623161 620092 617597 615595 614211 613139 611727 609367 605500 599390 590404 578691 565423 552172
51637 552172 540012 529237 519781 511707 505181 500197 496587 494350 493724 494816 497253 500344 503532 506629
51623 506629 509708 512798 515600 517428 517565 515764 512318 507732 502580 497666 493804 491132 488954 486626
51609 486626 484347 482758 482066 482060 482740 484303 486557 489067 492007 496242 502347 510046 518973 529407 541808
$$ packed form
51705F71868R820Q148L953j169m948o224n437l530r33K293N709Q176Q334N558
51691G01618O14m742r006j1764j3238j3410j2047r400o378l953k669k619l416
51678F09590m191m053k920j589p94l90L64J936M082O238Q138R965J1872J3411
51664F51659J3694J2271R577O259K394k137o705j0077j1589j1603j0675q935o585
51651F27548m387l069k495k002j384j072j412k360l867o110q986j1713j3268j3251
51637E52172j2160j0775r456q074o526m984l610k237o26J092K437L091L188L097
51623E06629L079L090K802J828J37j801l446m586n152m914l862k672k178k328
51609D86626k279j589o92oO80J563K254K510K940M235O105P699Q927J0434J2401
$$ plain form
51594 541808 555954 571034 586255 600838 613606 623286 629485 633081 635566 638297 642479 649470 660764
51581 660764 677572 700476 729308 763113 800163 838177 874964 909254 941053 971042 999462
51570 999462 1025507 1047683 1064728 1076588 1085230 1094795 1110432 1136229 1173960 1223517 1283844 1352809
51558 1352809 1426474 1499335 1565796 1621559 1664114 1692670 1707748 1710223 1700258 1677288 1641118 1592724
51546 1592724 1533891 1466558 1392867 1315498 1237364 1160941 1088049 1020126 958295 903176 854870
51535 854870 813155 777547 747309 721654 699892 681278 664899 650075 636820 625610 616598 609271
51523 609271 602849 596829 591197 586384 582994 581237 580566 580148 579654 579286 579010 578240 576444 573660 570154 565984
51507 565984 561294 556731 553063 550435 548342 546254 543960 541354 538351 535060 531780 528723 525997 523890
$$ packed form
51594E41808J4146J5080J5221J4583J2768R680O199L596K485K731M182O991J1294
51581F60764J6808K2904K8832L3805L7050L8014L6787L4290L1799K9989K8420
51570I99462K6045K2176J7045J1860Q642R565J5637K5797L7731M9557O0327O8965
51558A352809P3665P2861O6461N5763M2555K8556J5078K475r965k2970l6170m8394
51546A592724n8833o7333p3691p7369p8134p6423p2892o7923o1831n5119m8306
51535H54870m1715l5608l0238k5655k1762j8614j6379j4824j3255j1210r012p327
51523F09271o422o020n632m813l390j757o71m18m94l68k76p70j796k784l506m170
51507E65984m690m563l668k628k093k088k294k606l003l291l280l057k726k107
$$ plain form
51493 523890 522823 522888 523676 524707 525808 526860 527370 526639 524457 521483 518767 516839 515233 512984 509659
51478 509659 505886 502781 500884 499783 498764 497675 496990 497099 497703 498046 497786 497469 498041 499882 502526 505272
51462 505272 507766 509921 511687 513315 515617 519465 525021 531804 539490 548240 558212 569314 581713 596185
51448 596185 613538 633850 656505 680659 705123 727913 746494 758919 764827 765504 763262 760666
51436 760666 759629 760447 761345 759218 751320 736855 717374 695800 674861 655992 639322 624394 610881
51423 610881 598851 588694 580914 575809 573063 571667 570532 569319 568515 568569 569155 569519 569370 569034 568790 568572
51407 568572 568481 569154 571271 574876 579479 584651 590276 596411 603172 610570 618196 625308 631611 637804 644985
51392 644985 653676 663903 676093 691260 710204 733108 760154 792117 830028 874589 926219 985413
$$ packed form
51493E23890j067O5P88J031J101J052N10p31k182k974k716j928j606k249l325
51478E09659l773l105j897j101j019j089o85J09O04L43k60l17N72J841K644K746
51462E05272K494K155J766J628K302L848N556O783P686Q750R972J1102J2399J4472
51448E96185J7353K0312K2655K4154K4464K2790J8581J2425N908O77k242k596
51436G60666j037Q18Q98k127p898j4465j9481k1574k0939j8869j6670j4928j3513
51423F10881j2030j0157p780n105k746j396j135j213q04N4N86L64j49l36k44k18
51407E68572r1O73K117L605M603N172N625O135O761P398P626P112O303O193P181
51392F44985Q691J0227J2190J5167J8944K2904K7046L1963L7911M4561N1630N9194
$$ plain form
51380 985413 1052660 1127992 1210749 1299619 1392642 1487014 1578892 1663540 1736161 1793102 1832392
51369 1832392 1853113 1854622 1836801 1800741 1748488 1682173 1604095 1517663 1427338 1337046 1249054
51358 1249054 1164661 1085384 1013011 948874 893399 845998 805106 768938 736655 708340 683540
51347 683540 660625 638345 617324 599063 583879 570778 559062 548870 540214 532702 526501 522441
51335 522441 520589 519556 517933 515855 514457 514123 513955 512862 510661 508131 506283 505595 505764 506177 506625 507362
51319 507362 508472 509659 510859 512599 515264 518285 520580 521819 522819 524571 527165 529875 532067 533770
51305 533770 535377 537059 538671 540068 541163 541546 540402 537206 532437 527209 522193 517188 511820 506250
51291 506250 501004 496377 492337 488923 486431 485186 485216 486171 487580 489315 491849 495863 501396 507450 512633
$$ packed form
51380I85413O7247P5332Q2757Q8870R3023R4372R1878Q4648P2621N6941L9290
51369A832392K0721J509j7821l6060n2253o6315p8078q6432r0325r0292q7992
51358A249054q4393p9277p2373o4137n5475m7401m0892l6168l2283k8315k4800
51347F83540k2915k2280k1021j8261j5184j3101j1716j0192q656p512o201m060
51335E22441j852j033j623k078j398l34j68j093k201k530j848o88J69M13M48P37
51319E07362J110J187J200J740K665L021K295J239J000J752K594K710K192J703
51305E33770J607J682J612J397J095L83j144l196m769n228n016n005n368n570
51291E06250n246m627m040l414k492j245L0R55J409J735K534M014N533O054N183
$$ plain form
51276 512633 516194 518444 520224 522126 524164 526047 527657 529306 531596 535072 539894 545713 551848 557717
51262 557717 563231 568694 574306 579803 584563 587894 589197 588088 584601 579195 572429 564713 556395 547893
51248 547893 539567 531647 524409 518215 513232 509328 506410 504538 503511 502750 501927 501336 501196 501004 500239 499397
51232 499397 499553 500988 502972 504877 506676 508255 509105 509080 508832 509143 510253 512100 514583 517308 519671 521634
51216 521634 523842 526510 528764 529728 529813 530185 531235 532301 532871 533420 534943 538014 542364 547082 551304 554932
51200 554932 558577 562632 566670 570034 572686 575039 577182 578839 579916 580568 580785 580430 579691 579067 578785 578636
51184 578636 578406 578115 577822 577577 577554 577826 577985 577447 576233 575022 574286 573711 572582 570341 566728 561953 556998
51167 556998 553331 551818 552091 553220 554770 556861 559442 561917 563429 563261 561099 557259 552667 548260 544263
$$ packed form
51276E12633L561K250J780J902K038J883J610J649K290L476M822N819O135N869
51262E57717N514N463N612N497M760L331J303j109l487n406o766p716q318q502
51248E47893q326p920p238o194m983l904k918j872j027p61q23n91j40j92p65q42
51232D99397J56J435J984J905J799J579Q50k5k48L11J110J847K483K725K363J963
51216E21634K208K668K254R64Q5L72J050J066N70N49J523L071M350M718M222L628
51200E54932L645M055M038L364K652K353K143J657J077O52K17l55p39o24k82j49
51184E78636k30k91k93k45k3K72J59n38j214j211p36n75j129k241l613m775m955
51167E56998l667j513K73J129J550K091K581K475J512j68k162l840m592m407l997
$$ plain form
51152 544263 540149 535349 529891 524391 519547 515664 512512 509628 506798 504244 502280 500884 499736 498675
51138 498675 497996 498217 499598 501918 504650 507292 509566 511451 513225 515515 519039 523999 529744 535320 540418
51123 540418 545499 550868 555939 559682 561602 561980 561285 559790 557768 555635 553722 552139 551005 550554 550848
51108 550848 551668 552976 555266 559129 564498 570558 576291 580861 583610 584235 583086 580956 578331 575073 570961
51093 570961 566271 561583 557216 553148 549381 546121 543598 541891 540896 540389 540206 540406 541088 541930 542210 541604
51077 541604 540815 541069 542992 546295 550452 555330 561041 567476 574183 580600 586358 591471 596246 600978 605768
51062 605768 610607 615441 620009 623871 626838 629212 631287 632853 633534 633499 633463 634128 635983 639487 644818 651469
51046 651469 658698 666449 675381 685895 697680 710322 723748 737856 752241 766532 780535 793762
$$ packed form
51152E44263m114m800n458n500m844l883l152k884k830k554j964j396j148j061
51138D98675o79K21J381K320K732K642K274J885J774K290L524M960N745N576N098
51123E40418N081N369N071L743J920L78o95j495k022k133j913j583j134m51K94
51108E50848Q20J308K290L863N369O060N733M570K749O25j149k130k625l258m112
51093E70961m690m688m367m068l767l260k523j707r95n07j83K00O82Q42K80o06
51077E41604p89K54J923L303M157M878N711O435O707O417N758N113M775M732M790
51062F05768M839M834M568L862K967K374K075J566O81l5l6O65J855L504N331O651
51046F51469P229P751Q932J0514J1785J2642J3426J4108J4385J4291J4003J3227
$$ plain form
51034 793762 805302 814317 820128 821685 817852 808827 796570 783078 768678 752731 735523 718587
51022 718587 703382 690514 680200 672637 667730 665004 663949 664149 665200 667055 670320 675589 682469 689879
51008 689879 697312 705160 713733 722727 731930 741689 752138 762469 771615 779424 786632 793685 800117 805243
50994 805243 809192 813029 817870 824058 831353 839785 850009 862710 878041 895961 916797 940960 968178
50981 968178 997563 1028425 1060573 1093633 1126518 1157815 1186561 1212560 1236174 1257805 1277328
50970 1277328 1294007 1307233 1317399 1325757 1333489 1341269 1349738 1359888 1372677 1388515 1407240 1428349
50958 1428349 1451127 1474847 1499004 1523170 1546635 1568547 1588512 1606732 1623440 1638569 1652150
50947 1652150 1664761 1677362 1690992 1706767 1725737 1748214 1773049 1797570 1818135 1831012 1833525
$$ packed form
51034G93762J1540R015N811J557l833r025j2257j3492j4400j5947j7208j6936
51022G18587j5205j2868j0314p563m907k726j055K00J051J855L265N269O880P410
51008F89879P433P848Q573Q994R203R759J0449J0331R146P809P208P053O432N126
50994H05243L949L837M841O188P295Q432J0224J2701J5331J7920K0836K4163K7218
50981I68178K9385L0862L2148L3060L2885L1297K8746K5999K3614K1631J9523
50970A277328J6679J3226J0166Q358P732P780Q469J0150J2789J5838J8725K1109
50958A428349K2778K3720K4157K4166K3465K1912J9965J8220J6708J5129J3581
50947A652150J2611J2601J3630J5775J8970K2477K4835K4521K0565J2877K513
$$ plain form
50936 1833525 1825126 1807596 1784100 1757754 1730499 1702706 1673708 1642992 1610921 1578057 1544063
50925 1544063 1507992 1469750 1430540 1391586 1353033 1314543 1276313 1238964 1202908 1168520 1136614
50914 1136614 1108027 1082806 1060306 1040026 1021826 1005448 990400 976433 963721 952496 942817
50903 942817 934705 928134 922812 918257 914238 910973 908832 907909 907867 908089 908081 907865 907816 908033 908166 908053 908174 909068
50885 909068 910581 912217 914045 916623 920038 923633 926911 930216 934243 939218 944885 951031 957672 964816
50871 964816 972341 980175 988508 997731 1008174 1019903 1032902 1047426 1063997 1082955 1104225 1127808
50859 1127808 1154260 1184358 1218414 1256370 1298556 1345848 1398841 1457243 1520408 1588307 1661621
50848 1661621 1740841 1825468 1914168 2005652 2099215 2194363 2290026 2384347 2475154 2560320 2637606
$$ packed form
50936A833525q399j7530k3496k6346k7255k7793k8998l0716l2071l2864l3994
50925A544063l6071l8242l9210l8954l8553l8490l8230l7349l6056l4388l1906
50914A136614k8587k5221k2500k0280j8200j6378j5048j3967j2712j1225r679
50903I42817q112o571n322m555m019l265k141r23m2K22qk16m9K17J33j13J21Q94
50885I09068J513J636J828K578L415L595L278L305M027M975N667O146O641P144
50871I64816P525P834Q333R223J0443J1729J2999J4524J6571J8958K1270K3583
50859A127808K6452L0098L4056L7956M2186M7292N2993N8402O3165O7899P3314
50848A661621P9220Q4627Q8700R1484R3563R5148R5663R4321R0807Q5166P7286
$$ plain form
50837 2637606 2704717 2760038 2803287 2835091 2856051 2866500 2867060 2859142 2845004 2827624 2810208 2795282
50825 2795282 2784227 2777897 2777308 2782922 2793363 2805817 2817952 2828746 2837082 2840402 2835533 2820458 2794750
50812 2794750 2758669 2712636 2657393 2593977 2523481 2447275 2367469 2286707 2207425 2131519 2060499
50801 2060499 1995415 1936700 1884647 1840131 1804422 1778195 1761116 1752487 1751766 1758340 1771385 1790355
50789 1790355 1815165 1845360 1879310 1914559 1948777 1980075 2006862 2028198 2044293 2055991 2063484
50778 2063484 2065958 2062749 2054481 2042733 2028764 2012800 1994282 1972386 1946444 1916276 1882213 1844560
50766 1844560 1803141 1757738 1709130 1659334 1610492 1563666 1518843 1475946 1435566 1398698 1365968
50755 1365968 1337177 1311605 1288806 1269144 1253407 1241869 1233953 1228935 1226706 1227489 1231101 1237117 1245865
$$ packed form
50837B637606O7111N5321M3249L1804K0960J0449N60p918j4138j7380j7416j4926
50825B795282j1055o330n89N614J0441J2454J2135J0794Q336L320m869j5075k5708
50812B794750l6081m6033n5243o3416p0496p6206p9806q0762p9282p5906p1020
50801B060499o5084n8715n2053m4516l5709k6227j7079q629p21O574J3045J8970
50789A790355K4810L0195L3950L5249L4218L1298K6787K1336J6095J1698P493
50778B063484K474l209q268j1748j3969j5964j8518k1896k5942l0168l4063l7653
50766A844560m1419m5403m8608m9796m8842m6826m4823m2897m0380l6868l2730
50755A365968k8791k5572k2799j9662j5737j1538p916n018k229P83L612O016Q748
$$ plain form
50742 1245865 1258655 1276568 1299261 1325398 1354126 1385747 1421009 1460174 1502940 1548874 1597565
50731 1597565 1648471 1700924 1754412 1808713 1863740 1919282 1974847 2029645 2082617 2132551 2178168
50720 2178168 2218093 2250758 2274620 2288698 2292962 2288141 2275231 2255422 2230546 2203255 2176358 2151855
50708 2151855 2130711 2113534 2101164 2094381 2093126 2096246 2102057 2108987 2115643 2120525 2122007 2118667 2109528
50695 2109528 2094088 2072471 2045655 2015289 1982973 1949870 1917240 1887073 1861606 1842041 1828109
50684 1828109 1819057 1814801 1815982 1823360 1837608 1859518 1889953 1929552 1978625 2037200 2104909 2180899
50672 2180899 2264105 2353449 2447408 2543431 2638203 2728548 2811928 2886337 2950452 3004116 3048265
50661 3048265 3084054 3112259 3133551 3148822 3158821 3163723 3163371 3157658 3146360 3128931 3105102 3075763
$$ packed form
50742A245865J2790J7913K2693K6137K8728L1621L5262L9165M2766M5934M8691
50731A597565N0906N2453N3488N4301N5027N5542N5565N4798N2972M9934M5617
50720B178168L9925L2665K3862J4078M264m821j2910j9809k4876k7291k6897k4503
50708B151855k1144j7177j2370o783j255L120N811O930O656M882J482l340r139
50695B109528j5440k1617k6816l0366l2316l3103l2630l0167k5467j9565j3932
50684A828109r052m256J181P378J4248K1910L0435L9599M9073N8575O7709P5990
50672B180899Q3206Q9344R3959R6023R4772R0345Q3380P4409O4115N3664M4149
50661C048265L5789K8205K1292J5271R999M902l52n713j1298j7429k3829k9339
$$ plain form
50649 3075763 3042921 3008810 2975252 2943719 2915559 2892070 2874564 2864296 2861931 2867008 2878282 2894720
50637 2894720 2915923 2941572 2970826 3002420 3035055 3067652 3099652 3131323 3163414 3196170 3228997
50626 3228997 3261158 3291782 3317932 3332719 3326902 3293875 3233710 3152729 3059911 2963866 2871878
50615 2871878 2789571 2720179 2664395 2621534 2590858 2571654 2562474 2560970 2564520 2570639 2576745 2580048
50603 2580048 2577958 2568457 2549963 2521130 2481149 2430224 2369642 2301405 2227900 2151639 2074918 1999481
50591 1999481 1926536 1857026 1791838 1731747 1677296 1628710 1585903 1548563 1516290 1488648 1465192
50580 1465192 1445659 1430182 1419154 1412798 1411062 1413972 1421705 1434013 1449828 1467849 1487375 1508251
50568 1508251 1530102 1552098 1573464 1593848 1613235 1631982 1651088 1671986 1695901 1723662 1756224
$$ packed form
50649C075763l2842l4111l3558l1533k8160k3489j7506j0268k365N077J1274J6438
50637B894720K1203K5649K9254L1594L2635L2597L2000L1671L2091L2756L2827
50626C228997L2161L0624K6150J4787n817l3027o0165q0981r2818r6045r1988
50615B871878q2307o9392n5784m2861l0676j9204r180j504L550O119O106L303
50603B580048k090r501j8494k8833l9981n0925o0582o8237p3505p6261p6721p5437
50591A999481p2945o9510o5188o0091n4451m8586m2807l7340l2273k7642k3456
50580A465192j9533j5477j1028o356j736K910P733J2308J5815J8021J9526K0876
50568A508251K1851K1996K1366K0384J9387J8747J9106K0898K3915K7761L2562
$$ plain form
50557 1756224 1794802 1840234 1892616 1951804 2017757 2089875 2166278 2244270 2321353 2395449 2464474
50546 2464474 2526517 2580668 2627411 2668267 2705451 2741690 2779591 2820610 2864733 2911218 2959463
50535 2959463 3009263 3060777 3114628 3171805 3233238 3299616 3371763 3450948 3538469 3634890 3739681
50524 3739681 3851411 3968125 4087669 4207737 4325599 4437821 4540541 4630188 4703869 4759121
50514 4759121 4793732 4806086 4795537 4762183 4706425 4629105 4532156 4418884 4293494 4160288 4023241
50503 4023241 3886214 3753388 3629268 3517933 3422273 3344050 3284600 3245015 3225439 3224552 3240079
50492 3240079 3269672 3310912 3360487 3413665 3464610 3507161 3535499 3544596 3530620 3491419 3427075
50481 3427075 3340111 3234835 3116074 2988309 2855760 2722658 2592831 2469021 2352847 2245291
$$ packed form
50557A756224L8578M5432N2382N9188O5953P2118P6403P7992P7083P4096O9025
50546B464474O2043N4151M6743M0856L7184L6239L7901M1019M4123M6485M8245
50535B959463M9800N1514N3851N7177O1433O6378P2147P9185Q7521R6421J04791
50524C739681J11730J16714J19544J20068J17862J12222J02720Q9647P3681N5252
50514D759121L4611J2354j0549l3354n5758p7320r6949j13272j25390j33206j37047
50503D023241j37027j32826j24120j11335r5660p8223n9450l9585j9576q87J5527
50492C240079K9593M1240M9575N3178N0945M2551K8338R097j3976l9201o4344
50481C427075q6964j05276j18761j27765j32549j33102j29827j23810j16174j07556
$$ plain form
50471 2245291 2146813 2057018 1974737 1898787 1828512 1763533 1703285 1647147 1594944 1546985 1503466
50460 1503466 1464082 1428429 1396646 1369280 1346347 1326829 1309451 1293859 1280581 1269874 1261114
50449 1261114 1253561 1247194 1242324 1238665 1235489 1232642 1230887 1231014 1232937 1235889 1239279 1243152 1247979 1254295
50435 1254295 1262547 1273060 1285933 1300961 1317849 1336674 1357997 1382306 1409464 1438994 1470821
50424 1470821 1505240 1542085 1580517 1620027 1661170 1704914 1751646 1801359 1854480 1911783 1973536
50413 1973536 2039341 2108827 2181899 2258224 2337024 2417621 2499771 2583132 2666541 2747933 2824904
50402 2824904 2895484 2958654 3013990 3060533 3096113 3118128 3124763 3114968 3087632 3041791 2977880 2898137
50390 2898137 2805594 2703351 2595146 2485733 2379820 2280701 2190136 2109214 2038948 1980354
$$ packed form
50471B245291r8478q9795q2281p5950p0275o4979o0248n6138n2203m7959m3519
50460A503466l9384l5653l1783k7366k2933j9518j7378j5592j3278j0707q760
50449A261114p553o367m870l659l176k847j755J27J923K952L390L873M827O316
50435A254295Q252J0513J2873J5028J6888J8825K1323K4309K7158K9530L1827
50424A470821L4419L6845L8432L9510M1143M3744M6732M9713N3121N7303O1753
50413A973536O5805O9486P3072P6325P8800Q0597Q2150Q3361Q3409Q1392P6971
50402B824904P0580O3170N5336M6543L5580K2015O635r795k7336m5841o3911p9743
50390B898137r2543j02243j08205j09413j05913r9119r0565q0922p0266n8594
$$ plain form
50380 1980354 1934358 1901462 1881262 1872534 1873965 1884396 1902102 1924269 1947601 1969212 1986662 1997565
50368 1997565 1999750 1991720 1972706 1942576 1902071 1852924 1797393 1737779 1676487 1615938 1557824 1502552
50356 1502552 1449876 1399962 1353536 1311200 1272968 1238268 1206169 1175926 1147705 1122422 1100446
50345 1100446 1080856 1062492 1045264 1029731 1015684 1002037 988048 973917 960073 946684 933995
50334 933995 922512 912440 903409 894949 886945 879504 872779 867028 862529 859289 857140 856025 855867 856275
50320 856275 856981 858574 862131 867913 875033 882668 891033 900806 912150 924769 938519 953382 969022
50307 969022 984847 1000493 1015933 1031135 1045866 1059750 1072312 1083032 1091556 1097912 1102439 1105557
50295 1105557 1107468 1107908 1106191 1101812 1095121 1087110 1078399 1068752 1057833 1046244 1035531 1027209 1021962
$$ packed form
50380A980354m5996l2896k0200q728J431J0431J7706K2167K3332K1611J7450J0903
50368A997565K185q030j9014l0130m0505m9147n5531n9614o1292o0549n8114n5272
50356A502552n2676m9914m6426m2336l8232l4700l2099l0243k8221k5283k1976
50345A100446j9590j8364j7228j5533j4047j3647j3989j4131j3844j3389j2689
50334I33995j1483j0072r031q460q004p441o725n751m499l240k149j115j58M08
50320H56275P06J593L557N782P120P635Q365R773J1344J2619J3750J4863J5640
50307I69022J5825J5646J5440J5202J4731J3884J2562J0720Q524O356M527L118
50295A105557J911M40j717m379o691q011q711r647j0919j1589j0713q322n247
$$ plain form
50282 1021962 1019696 1020127 1023299 1029588 1039360 1052682 1069326 1088679 1109370 1129194 1145811 1157612
50270 1157612 1163818 1164122 1158796 1149147 1137258 1125035 1113774 1104509 1098115 1094831 1094219 1095868 1099656 1105026
50256 1105026 1110565 1114839 1117416 1118660 1118911 1118371 1117497 1116837 1116383 1115560 1113926 1111550 1108609 1104948 1100189
50241 1100189 1094168 1087087 1079296 1071007 1062300 1053423 1044900 1037124 1029944 1022955 1016152 1009926 1004473 999678
50227 999678 995658 992841 991209 990003 988580 987137 986250 986122 986728 988172 990277 992188 993162 993581 994467 996134
50211 996134 998045 999952 1002336 1005557 1009324 1013329 1017748 1022796 1028355 1034530 1042145 1052212 1065206 1081286
50197 1081286 1100883 1124572 1152567 1184940 1222294 1265748 1316048 1372987 1435653 1502864 1573214
50186 1573214 1644949 1716102 1784772 1849392 1909172 1964538 2016999 2068271 2119358 2170336 2220546
$$ packed form
50282A021962k266M31L172O289R772J3322J6644J9353K0691J9824J6617J1801
50270A157612O206L04n326r649j1889j2223j1261r265o394l284o12J649L788N370
50256A105026N539M274K577J244K51n40q74o60m54q23j634k376k941l661m759
50241A100189o021p081p791q289q707q877q523p776p180o989o803o226n453m795
50227I99678m020k817j632j206j423j443q87j28O06J444K105J911R74M19Q86J667
50211I96134J911J907K384L221L767M005M419N048N559O175P615J0067J2994J6080
50197A081286J9597K3689K7995L2373L7354M3454N0300N6939O2666O7211P0350
50186A573214P1735P1153O8670O4620N9780N5366N2461N1272N1087N0978N0210
$$ plain form
50175 2220546 2268488 2311457 2345737 2367555 2373918 2362695 2332569 2283686 2218465 2141279 2056915
50164 2056915 1969366 1882025 1798398 1721907 1654905 1598259 1552048 1516324 1490919 1474609 1464763
50153 1464763 1457877 1450452 1439519 1422792 1398897 1367806 1331068 1291300 1251058 1211869 1174191 1138216
50141 1138216 1104666 1074837 1049932 1030441 1016168 1006688 1001525 999842 1000229 1001131 1001540 1001248 1000452 999256
50127 999256 997478 994717 990590 985009 978291 970958 963489 956289 949637 943428 937144 930553 924433 920164
50113 920164 918380 918321 918740 919170 920099 922147 925456 929833 935145 941448 948823 957243 966681 977337 989580
50098 989580 1003458 1018343 1033334 1048095 1063151 1079390 1097436 1117410 1138839 1160732 1182227
50087 1182227 1203406 1225261 1248715 1274014 1301314 1331446 1365759 1405394 1451061 1503376 1563185
$$ packed form
50175B220546M7942M2969L4280K1818O363j1223l0126m8883o5221p7186q4364
50164B056915q7549q7341q3627p6491o7002n6646m6211l5724k5405j6310r846
50153A464763o886p425j0933j6727k3895l1091l6738l9768m0242l9189l7678l5975
50141A138216l3550k9829k4905j9491j4273r480n163j683L87R02M09k92p96j196
50127I99256j778k761m127n581o718p333p469p200o652o209o284o591o120m269
50113I20164j784n9M19M30R29K048L309M377N312O303P375Q420R438J0656J2243
50098I89580J3878J4885J4991J4761J5056J6239J8046J9974K1429K1893K1495
50087A182227K1179K1855K3454K5299K7300L0132L4313L9635M5667N2315N9809
$$ plain form
50076 1563185 1631685 1710300 1800074 1900844 2011187 2129321 2253681 2382249 2511812 2638607
50066 2638607 2759896 2874894 2984598 3091159 3196959 3303297 3409559 3513622 3612647 3702877
50056 3702877 3778953 3834381 3863291 3861828 3828431 3763848 3671310 3556096 3424202 3281203 3132042
50045 3132042 2981114 2832007 2687393 2549484 2420361 2301643 2194043 2097704 2012932 1940249
50035 1940249 1879598 1829682 1788297 1753324 1723219 1696485 1671113 1645300 1618919 1593663 1571227
50024 1571227 1551754 1534497 1519382 1506791 1495888 1484341 1470242 1453671 1436000 1418350 1401343
50013 1401343 1385803 1372718 1362402 1354097 1346487 1338478 1329717 1320803 1312972 1307305 1304077 1302786 1302550
50000 1302550 1302411 1301565 1299630 1296554 1292092 1285562 1276253 1263821 1248125 1229068 1207002 1183043 1158500
$$ packed form
50076A563185O8500P8615Q9774J00770J10343J18134J24360J28568J29563J26795
50066B638607J21289J14998J09704J06561J05800J06338J06262J04063R9025R0230
50056C702877P6076N5428K8910j463l3397o4583r2538j15214j31894j42999j49161
50045C132042j50928j49107j44614j37909j29123j18718j07600r6339q4772p2683
50035A940249o0651m9916m1385l4973l0105k6734k5372k5813k6381k5256k2436
50024A571227j9473j7257j5115j2591j0903j1547j4099j6571j7671j7650j7007
50013A401343j5540j3085j0316q305p610q009q761q914p831n667l228j291k36
50000A302550j39q46j935l076m462o530r309j2432j5696j9057k2066k3959k4543
$$ plain form
49987 1158500 1134148 1110423 1088167 1068591 1052461 1039782 1030340 1024078 1020741 1019665 1020286 1022657 1027080
49974 1027080 1033453 1041314 1050533 1061610 1075186 1091464 1110200 1131111 1154163 1179584 1207794 1239347
49962 1239347 1274875 1315033 1360506 1411911 1469495 1532956 1601640 1674861 1751791 1831126 1911283
49951 1911283 1991192 2070576 2149099 2225351 2296918 2361291 2416476 2461201 2495438 2521034 2541351
49940 2541351 2559712 2578035 2596501 2613672 2626429 2630251 2620340 2592864 2545458 2477235 2389159 2284517
49928 2284517 2168613 2047528 1926789 1810674 1702229 1603619 1516362 1441183 1377763 1324945
49918 1324945 1281369 1245820 1217021 1193558 1174430 1159561 1149512 1144799 1145594 1151708 1162309 1175610
49906 1175610 1189261 1201390 1211282 1219164 1225512 1230467 1233618 1234125 1231051 1223572 1211016 1193010 1169823
$$ packed form
49987A158500k4352k3725k2256j9576j6130j2679r442o262l337j076O21K371M423
49974A027080O373P861R219J1077J3576J6278J8736K0911K3052K5421K8210L1553
49962A239347L5528M0158M5473N1405N7584O3461O8684P3221P6930P9335Q0157
49951A911283P9909P9384P8523P6252P1567O4373N5185M4725L4237K5596K0317
49940B541351J8361J8323J8466J7171J2757L822r911k7476m7406o8223q8076j04642
49928B284517j15904j21085j20739j16115j08445r8610q7257p5179o3420n2818
49918A324945m3576l5549k8799k3463j9128j4869j0049m713P95O114J0601J3301
49906A175610J3651J2129R892P882O348M955L151N07l074p479j2556j8006k3187
$$ plain form
49893 1169823 1142434 1112049 1079746 1046757 1014783 985493 959722 937494 918761 903581 891389
49882 891389 880580 869250 856395 842377 828421 815654 804386 794216 784966 777399 772626 770831
$$ packed form
49893A169823k7389l0385l2303l2989l1974k9290k5771k2228j8733j5180j2192
49882H91389j0809j1330j2855j4018j3956j2767j1268j0170r250p567m773j795
$$ [...]
##END NTUPLES=NMR SPECTRUM
##END=
