##TITLE=AC1715_NARAH15001_9207329_vqpc6y24Qk
##JCAMPDX= 6.0         $$ Bruker NMR JCAMP-DX V2.0
##DATA TYPE= NMR SPECTRUM
##DATA CLASS= NTUPLES
##ORIGIN= BRUKER
##OWNER= Administrator
$$ 1.72 TOPSPIN		Version 2.1
$$ 2015-06-01 22:29:17.905 -0700  Administrator@X
$$ Compression mode = diff/dup
##.OBSERVE FREQUENCY= 400.02188249412
##.OBSERVE NUCLEUS= ^1H
##.ACQUISITION MODE= SIMULTANEOUS (DQD)
##.ACQUISITION SCHEME= undefined
##.AVERAGES= 64
##.DIGITISER RES= 22
##SPECTROMETER/DATA SYSTEM= spect
##.PULSE SEQUENCE= noesygpps1d.comp
##.SOLVENT NAME= COFFEE_meoh
##.SHIFT REFERENCE= INTERNAL, COFFEE_meoh, 1, 14.9608
##AUDIT TRAIL= $$ (NUMBER, WHEN, WHO, WHERE, PROCESS, VERSION, WHAT)
$$ ##TITLE= Audit trail, TOPSPIN		Version 2.1
$$ ##JCAMPDX= 5.01
$$ ##ORIGIN= Bruker BioSpin GmbH
$$ ##OWNER= Administrator
$$ $$ E:\/data/COFFEE/nmr/AC1715_NARAH15001_9207329_vqpc6y24Qk/12/pdata/1/auditp.txt
$$ ##AUDIT TRAIL=  $$ (NUMBER, WHEN, WHO, WHERE, PROCESS, VERSION, WHAT)
(   1,<2015-06-01 22:29:12.780 -0700>,<Administrator>,<X>,<go>,<TOPSPIN 2.1>,
      <created by zg
	started at 2015-06-01 22:17:43.201 -0700,
	POWCHK enabled, PULCHK disabled,
       configuration hash MD5:
       21 0F 79 D6 B3 7B B4 F6 88 20 88 DB 03 48 BD 9F
       data hash MD5: 64K
       CC 45 5F 06 8E 9F 7A 16 84 F2 F1 45 0E 26 BF 78>)
(   2,<2015-06-01 22:29:15.873 -0700>,<Administrator>,<X>,<proc1d>,<TOPSPIN 2.1>,
      <Start of raw data processing
       efp LB = 0.3 FT_mod = 6 PKNL = 1 PHC0 = 0 PHC1 = 0 SI = 128K 
       data hash MD5: 128K
       1C 32 D7 E9 EF 64 EA 1C F3 7A E6 1B BC 66 69 43>)
(   3,<2015-06-01 22:29:16.733 -0700>,<Administrator>,<X>,<proc1d>,<TOPSPIN 2.1>,
      <pk PHC0 = -87.63245 PHC1 = 0 
       data hash MD5: 128K
       AC 7F 48 D0 2F B3 E6 36 DB 65 0B D7 03 E8 5E B5>)
(   4,<2015-06-01 22:29:17.108 -0700>,<Administrator>,<X>,<proc1d>,<TOPSPIN 2.1>,
      <abs ABSG = 1 
       data hash MD5: 128K
       B0 16 98 EB 77 37 B0 6A 9B D2 52 82 A3 22 5E F7>)
(   5,<2015-06-01 22:29:17.201 -0700>,<Administrator>,<X>,<proc1d>,<TOPSPIN 2.1>,
      <abs ABSG = 2 
       data hash MD5: 128K
       1E 44 43 34 33 41 96 65 03 33 6D D8 9F 71 CC 83>)
(   6,<2015-06-01 22:29:17.295 -0700>,<Administrator>,<X>,<proc1d>,<TOPSPIN 2.1>,
      <abs ABSG = 3 
       data hash MD5: 128K
       90 FE 03 FF 93 0C EC 59 5E 90 D5 BF 23 25 EC 31>)
(   7,<2015-06-01 22:29:17.389 -0700>,<Administrator>,<X>,<proc1d>,<TOPSPIN 2.1>,
      <abs ABSG = 4 
       data hash MD5: 128K
       89 16 2D 7D FC C9 70 7E 8C EC A9 25 CC 9D DE D5>)
(   8,<2015-06-01 22:29:17.498 -0700>,<Administrator>,<X>,<proc1d>,<TOPSPIN 2.1>,
      <abs ABSG = 5 
       data hash MD5: 128K
       D9 FD 4E 0C 9F 03 92 E3 7D 51 11 C3 31 BE 26 B2>)
$$ ##END=
$$ 
$$ $$ hash MD5
$$ $$ 45 FB F9 32 8D 12 72 DD D9 65 EB 8F 78 65 25 11
##$RELAX= 
##$RELAX= 
##$RELAX= 
##$RELAX= 
##$RELAX= 
##$RELAX= 
##$RELAX= 
##$RELAX= 
$$ Bruker specific parameters
$$ --------------------------
##$DU= <E:\>
##$EXPNO= 12
$$ [...]
150 150 150 150 150 150 150 150
##$TP07= 0
##$TPNAME0= <>
##$TPNAME1= <>
##$TPNAME2= <>
##$TPNAME3= <>
##$TPNAME4= <>
##$TPNAME5= <>
##$TPNAME6= <>
##$TPNAME7= <>
##$TPOAL= (0..7)
0.5 0.5 0.5 0.5 0.5 0.5 0.5 0.5
##$TPOFFS= (0..7)
0 0 0 0 0 0 0 0
##$TUNHIN= 0
##$TUNHOUT= 0
##$TUNXOUT= 0
##$USERA1= <user>
##$USERA2= <user>
##$USERA3= <user>
##$USERA4= <user>
##$USERA5= <user>
##$V9= 5
##$VALIST= <valist>
##$VCLIST= <CCCCCCCCCCCCCCC>
##$VD= 0
##$VDLIST= <DDDDDDDDDDDDDDD>
##$VPLIST= <PPPPPPPPPPPPPPP>
##$VTLIST= <TTTTTTTTTTTTTTT>
##$WBST= 2048
##$WBSW= 25
##$XGAIN= (0..3)
0 0 0 0
##$XL= 0
##$YL= 0
##$YMAX_a= 6020986
##$YMIN_a= -11317314
##$ZGOPTNS= <>
##$ZL1= 120
##$ZL2= 120
##$ZL3= 120
##$ZL4= 120
##$ABSF1= 14.9608
##$ABSF2= -5.597382
##$ABSG= 5
##$ABSL= 3
##$ALPHA= 0
##$AQORDER= 0
##$ASSFAC= 0
##$ASSFACI= 0
##$ASSFACX= 0
##$ASSWID= 0
##$AUNMP= <proc_prof1d_extract.lims>
##$AXLEFT= 0
##$AXNAME= <>
##$AXNUC= <1H>
##$AXRIGHT= 0
##$AXTYPE= 0
##$AXUNIT= <>
##$AZFE= 0.1
##$AZFW= 0.1
##$BCFW= 0
##$BC_mod= 0
##$BYTORDP= 0
##$COROFFS= 0
##$CY= 15
##$DATMOD= 1
##$DC= 0
##$DFILT= <>
##$DTYPP= 0
##$F1P= 0
##$F2P= 0
##$FCOR= 0.5
##$FTSIZE= 131072
##$FT_mod= 6
##$GAMMA= 0
##$GB= 0
##$INTBC= 1
##$INTSCL= 1
##$ISEN= 128
##$LB= 0.3
##$LEV0= 0
##$LPBIN= 0
##$MAXI= 10000
##$MC2= 0
##$MEAN= 0
##$ME_mod= 0
##$MI= 0
##$NCOEF= 0
##$NC_proc= -2
##$NLEV= 6
##$NOISF1= 0
##$NOISF2= 0
##$NSP= 0
##$NTH_PI= 0
##$NZP= 0
##$OFFSET= 14.9608
##$PC= 1
##$PHC0= -87.63245
##$PHC1= 0
##$PH_mod= 1
##$PKNL= yes
##$PPARMOD= 0
##$PPDIAG= 0
##$PPIPTYP= 0
##$PPMPNUM= 2147483647
##$PPRESOL= 1
##$PSCAL= 4
##$PSIGN= 0
##$PYNMP= <proc.py>
##$REVERSE= no
##$SF= 400.020009716141
##$SI= 131072
##$SIGF1= 0
##$SIGF2= 0
##$SINO= 400
##$SIOLD= 131072
##$SPECTYP= <>
##$SREGLST= <1H.CDCl3>
##$SSB= 0
##$STSI= 131072
##$STSR= 0
##$SW_p= 8223.68421052631
##$SYMM= 0
##$S_DEV= 0
##$TDeff= 65536
##$TDoff= 0
##$TI= <>
##$TILT= no
##$TM1= 0
##$TM2= 0
##$TOPLEV= 0
##$USERP1= <user>
##$USERP2= <user>
##$USERP3= <user>
##$USERP4= <user>
##$USERP5= <user>
##$WDW= 1
##$XDIM= 131072
##$YMAX_p= 426698730
##$YMIN_p= -13603
##$CURPLOT= <Network HP LaserJet P1505>
##$CURPRIN= <$Network HP LaserJet P1505>
##$DFORMAT= <normdp>
##$LAYOUT= <+/1D_H.xwp>
##$LFORMAT= <normlp>
##$PFORMAT= <normpl>
##$SURQMSG= 1
$$ End of Bruker specific parameters
$$ ---------------------------------
##NTUPLES= NMR SPECTRUM
##VAR_NAME=  FREQUENCY,     SPECTRUM/REAL,   SPECTRUM/IMAG
##SYMBOL=    X,             R,               I
##VAR_TYPE=  INDEPENDENT,   DEPENDENT,       DEPENDENT
##VAR_FORM=  AFFN,          ASDF,            ASDF
##VAR_DIM=   131072,        131072,          131072
##UNITS=     HZ,            ARBITRARY UNITS, ARBITRARY UNITS
##FACTOR=    0.0627417313425164, 1,          1
##FIRST=     8223.62146879497, -684,         -51150
##LAST=      0,             415,             -51963
##MIN=       0,             -13603,          0
##MAX=       8223.62146879497, 426698730,    0
$$ Real data points
##PAGE= N=1
##DATA TABLE= (X++(R..R)), XYDATA
$$ [...]
61678D02446l595l785l377k553j577n91J59J59q47k153k484j343L38J205Q77M1
61662C82920n04n14j80J84L10K25L19R06J737K239K252K212K537L072L285K847
61646D03847J914R51L64L11P67J681K835L633L384K086O58N0K99P36Q80O67J4
61629D25077j216k635l346k932k135k145l286m665n121m316k911j850j493j507
61615C85519j469j409j559j811j798j589j795k735l806m080l416k591k376k769
61601C52316l270l506l450l235l077l202l578l761l340k541k061k162k338k065
61587C10730j568j439j739j951j792j502j283r45l59J53J84k32p48j129j326j318
61571B93736j192j151j161q03J59J223J610J165M15j80n40n20J25J120J588J114
$$ plain form
61678 402446 398851 395066 391689 389136 387559 386968 387127 387286 386439 384286 381802 380459 380797 382002 382879 382920
61662 382920 382416 381902 381722 381906 382216 382441 382760 383666 385403 387642 389894 392106 394643 397715 401000 403847
61646 403847 405761 406712 407076 407387 408154 409835 412670 416303 419687 421773 422431 422481 422780 423516 424396 425063 425077
61629 425077 423861 421226 417880 414948 412813 410668 407382 402717 397596 393280 390369 388519 387026 385519
61615 385519 384050 382641 381082 379271 377473 375884 374089 371354 367548 363468 360052 357461 355085 352316
61601 352316 349046 345540 342090 338855 335778 332576 328998 325237 321897 319356 317295 315133 312795 310730
61587 310730 309162 307723 305984 304033 302241 300739 299456 298511 298152 298305 298489 298257 297509 296380 295054 293736
61571 293736 292544 291393 290232 289429 289588 290811 292421 293586 294001 293821 293281 292761 292886 294006 295594 296708
61555B96708N01Q34J985K697K254J347J025J308J426J080Q15J083J579J699J312
61540C17653P43L23K40O04J266J715J485O85j24n83p72q62q42o77m75l44k84k98
61522C19453m44o48o84m54k36m25j040j593j540q50o5L15L58M99Q60J100R56O01
61504C16163K33k25p70r81n86j5Q8k24l67j15K30N27R54J436J582J354J191J212
61486C21687R09J9q50q87o1R74J697K061K258K481K777K975K894K675K588K465
61470C46662J775M76p13j110p72j37N45J084J169P85M41M37L22l82j214j225k59
61453C47884Q56J346J219Q63M80J01j72j88Q9N07P52N58pn39p09n31j42L96R53
61434C53716J239J195J178J477J856J870J494J078Q11O20M13J90l1j44Q0O81J301
$$ plain form
61555 296708 297209 298043 300028 302725 304979 306326 307351 308659 310085 311165 311980 313063 314642 316341 317653
61540 317653 318396 318719 318959 319563 320829 322544 324029 324714 324590 324007 323235 322373 321531 320854 320379 320035 319751 319453
61522 319453 319009 318361 317677 317223 316987 316562 315522 313929 312389 311539 311474 311789 312147 312646 313506 314606 315562 316163
61504 316163 316396 316171 315401 314420 313834 313819 313907 313683 313316 313201 313431 313958 314912 316348 317930 319284 320475 321687
61486 321687 322596 322615 321765 320878 320817 321791 323488 325549 327807 330288 333065 336040 338934 341609 344197 346662
61470 346662 348437 348913 348200 347090 346318 346181 346726 347810 348979 349764 350205 350642 350964 350582 349368 348143 347884
61453 347884 348740 350086 351305 352168 352648 352749 352577 352389 352478 352985 353737 354295 354288 353749 353040 352509 352367 352763 353716
61434 353716 354955 356150 357328 358805 360661 362531 364025 365103 365914 366534 366947 367137 367106 366962 367042 367723 369024
61417C69024J533J346R94O78N07N94Q62Q99L24p42j740k155j875j217p20o45p07
61400C66960n16k23k37l71KP62R09O7o65j42J229K098J905J154L45l89p45l12
61382C71831P58J795K332K324J798R58M20O48J258J531J461J559J784J638J206
61367C93301J176J681K096K126K231K620K737K195J548J504J959K266K169K031
61353D21640K434L709N543O991P351P055P088P451O994N102K728J214P39N73L59
61338D86971L62P40J215J400J073K54o98j290j494j846k655l502l904m041m323
61323D68262m541m094k888j466l33L88P57R63J445K506L837M813N312N795O534
61308D87290P355Q220R538J1441J3231J4069J3963J3521J2786J0990P739L909
$$ plain form
61417 369024 370557 371903 372897 373575 374082 374676 375538 376437 376761 376019 374279 372124 370249 369032 368312 367667 366960
61400 366960 366444 366221 365984 365613 365615 366377 367286 367353 366688 366546 367775 369873 371778 372932 373277 372888 372143 371831
61382 371831 372589 374384 376716 379040 380838 381796 382216 382864 384122 385653 387114 388673 390457 392095 393301
61367 393301 394477 396158 398254 400380 402611 405231 407968 410163 411711 413215 415174 417440 419609 421640
61353 421640 424074 427783 433326 440317 447668 454723 461811 469262 476256 481358 484086 485300 486039 486612 486971
61338 486971 487333 488073 489288 490688 491761 492015 491317 490027 488533 486687 484032 480530 476626 472585 468262
61323 468262 463721 459627 456739 455273 454940 455328 456085 457048 458493 460999 464836 469649 474961 480756 487290
61308 487290 494645 502865 512403 523844 537075 551144 565107 578628 591414 602404 610143 614052
61296F14052Q58j008k333l603m537m825m877n288n986o425o472o527o835p167
61282E49027p283p231p042o501n448m056k599j215j4P95J169J454K120L191M164
61267E20531M476M035L254K665K596L115M081N088N662N771O006O788P468O822
61253E88358M613K081N92K57K65l8p99j890k810k854k046j568k420l932m510l675
61237E69624k522k110k346k649k834k944k843k378j539k48J532L298M227M115
61223E60383L698L710M120M477M595M608M730N188O085P119P749P719P118O058
61209F37357M696L496K865K500J810J043J213K592M144M918N300O259P942R716
61195F95851J1317J3149J5444J7622J8638J7813J5350J2096Q795N608K592K98
$$ plain form
61296 614052 614910 613902 611569 607966 603429 598604 593727 588439 582453 576028 569556 563029 556194 549027
61282 549027 541744 534513 527471 520970 515522 511466 508867 507652 507638 508433 509602 511056 513176 516367 520531
61267 520531 525007 529042 532296 534961 537557 540672 544753 549841 555503 561274 567280 574068 581536 588358
61253 588358 592971 595052 595644 595901 596166 596128 595329 593439 590629 587775 585729 584161 581741 577809 573299 569624
61237 569624 567102 564992 562646 559997 557163 554219 551376 548998 547459 547211 548743 552041 556268 560383
61223 560383 564081 567791 571911 576388 580983 585591 590321 595509 601594 608713 616462 624181 631299 637357
61209 637357 642053 645549 648414 650914 652724 653767 654980 657572 661716 666634 671934 678193 686135 695851
61195 695851 707168 720317 735761 753383 772021 789834 805184 817280 826075 831683 834275 834573
61183H34573o67o11o44j426k622l725m757n881o916p696q413r212r826r950r659
61168G52568r199q770q689r270j0298j1057j1190j1060j1028j0966j0748j0614
61156F29679j0615j0239r022p148n082l068j330j50O16J493K407K310M31k576
61142E87706n294o926p579p630p443p328p164o366m686k665q99O35K105L241L908
61127E33615M617N760O839P327P817R334J1799J4123J5689J6860J8072J9294K0460
61114F91606K1649K2708K3320K3544K3713K3796K3451K2718K2015K1413K0515
61103I40448J9139J7481J5472J2562Q452L622j114n257q673j1324j3244j4632
61091I62932j5844j7247j8923k0463k1197k0912k0114j9372j8621j7463j5980
$$ plain form
61183 834573 833906 833295 832651 831225 828603 824878 820121 814240 807324 799628 791215 782003 772177 762227 752568
61168 752568 743369 734599 725910 716640 706342 695285 684095 673035 662007 651041 640293 629679
61156 629679 619064 608825 599803 592655 587573 584505 583175 583025 583641 585134 587541 589851 590282 587706
61142 587706 582412 575486 567907 560277 552834 545506 538342 531976 527290 524625 523726 524361 526466 529707 533615
61127 533615 538232 543992 550831 558158 565975 575309 587108 601231 616920 633780 651852 671146 691606
61114 691606 713255 735963 759283 782827 806540 830336 853787 876505 898520 919933 940448
61103 940448 959587 977068 992540 1005102 1013554 1017176 1016062 1010805 1002132 990808 977564 962932
61091 962932 947088 929841 910918 890455 869258 848346 828232 808860 790239 772776 756796
61080G56796j4755j4088j3579j2596j1021r403q374p825o848m712j900K86J181
61067F53162J356J709K504L554M769O099P354Q407R291R985J0519J1306J2788
61054G42803J4609J5957J6798J7909J9417K0506K1025K2199K4851K7969L0046
61043I74089L1040L2033L3652L5770L8095M0146M1306M1805M2872M5019M7151
61032A402978M8393M9729N2513N6366N9963O2906O5127O5579O3679O1370O1489
61021B050092O4413O8453P3080P9282Q6928R4460J01493J09343J18910J30705
61011B977159J47335J72767K08150K51065K99774L55264M18393M89490N73078
61002E892475O78868Q15519R88754J207694J477590J762974J955680J909014J541800
$$ plain form
61080 756796 742041 727953 714374 701778 690757 681354 672980 665155 658307 653595 651695 651981 653162
61067 653162 654518 656227 658731 662285 667054 673153 680507 688914 698205 708190 718709 730015 742803
61054 742803 757412 773369 790167 808076 827493 847999 869024 891223 916074 944043 974089
61043 974089 1005129 1037162 1070814 1106584 1144679 1184825 1226131 1267936 1310808 1355827 1402978
61032 1402978 1451371 1501100 1553613 1609979 1669942 1732848 1797975 1863554 1927233 1988603 2050092
61021 2050092 2114505 2182958 2256038 2335320 2422248 2516708 2618201 2727544 2846454 2977159
61011 2977159 3124494 3297261 3505411 3756476 4056250 4411514 4829907 5319397 5892475
61002 5892475 6571343 7386862 8375616 9583310 11060900 12823874 14779554 16688568 18230368
60993A8230368R24836K56708k57391n11382n05788k93336M5939L82110N39641
60984A8811705L80120r5549p32339j317673j702462j850968j809555j651331j441844
60975H590104j227444j032904q64954p21419n99135m95605m08030l34134k73250
60966B633229k25083j88078j59757j37886j20642j06575r4997q5772p8299p1402
60956A364738o4366n7230m9956m2391l5316l0280k7814k6795k6082k5723k5929
60945I52856k5920k4817k2891k0962j9123j7074j5243j4514j4946j5685j6146
60934G45535j6462j6727j6571j5797j4866j4272j3841j2954j1360r459p886o999
60922E88341o706o562o055n021l852l102k878k721k223j524j044r12r03p80m20
$$ plain form
60993 18230368 19155204 19411912 19154521 18643139 18137351 17844015 17889954 18272064 18811705
60984 18811705 19191825 19096276 18363937 17046264 15343802 13492834 11683279 10031948 8590104
60975 8590104 7362660 6329756 5464802 4743383 4144248 3648643 3240613 2906479 2633229
60966 2633229 2408146 2220068 2060311 1922425 1801783 1695208 1600211 1514439 1436140 1364738
60956 1364738 1300372 1243142 1193186 1150795 1115479 1085199 1057385 1030590 1004508 978785 952856
60945 952856 926936 902119 879228 858266 839143 822069 806826 792312 777366 761681 745535
60934 745535 729073 712346 695775 679978 665112 650840 636999 624045 612685 603226 595340 588341
60922 588341 581635 575073 569018 563997 560145 557043 554165 551444 549221 547697 546653 545741 544838 544058 543638
60907E43638K71J161J746J621J085Q78J240J747K058K257K353K046J270L48o86
60892E63033k216m099n319n237m604m575n244n917o499p509q890r739r513q742
60878D74930q273q342q558q407p587o199m766l759l097k364j468p15k55J14N62
60863D11816J069J649K346K917K951K452J940J889K220K509K454K153K031K415
60849D42811L108L498L329L009K891K673J985J242J170J674J919J512P73j99j760
60834D69635l703m897m602l603l231l685l998l542k792k471k562k503k050j539
60820D24457j410j730k254k690k861k744k578k801l595m517m893m663m463m717
60806C78541n081n033m613m177l735l102k413j911j419o22J77K51m55j095j005
$$ plain form
60907 543638 543909 545070 546816 548437 549522 550400 551640 553387 555445 557702 560055 562101 563371 563719 563033
60892 563033 560817 556718 551399 546162 541558 536983 531739 525822 519323 511814 502924 493185 483672 474930
60878 474930 466657 458315 449757 441350 433763 427564 422798 419039 415942 413578 412110 411395 411140 411254 411816
60863 411816 412885 414534 416880 419797 422748 425200 427140 429029 431249 433758 436212 438365 440396 442811
60849 442811 445919 449417 452746 455755 458646 461319 463304 464546 465716 467390 469309 470821 471594 471395 469635
60834 469635 465932 461035 456433 452830 449599 445914 441916 438374 435582 433111 430549 428046 425996 424457
60820 424457 423047 421317 419063 416373 413512 410768 408190 405389 401794 397277 392384 387721 383258 378541
60806 378541 373460 368427 363814 359637 355902 352800 350387 348476 347057 346435 346612 346863 346408 345313 344308
60791C44308m49l6R7J63J92O5j66k98k08J62Q37J598K004J878J606J687K122K529
60773C58091K708K801K884K783K410K069K211K890L534L387K246P19l08m54o8
60758C87903K30N9n94j545k516l214l415l085k409j676j092o38j74L41P69R37
60742C69881P73K61n60j511k334k912l361l837m393n025n580n634m776l233j842
60727C25917j190j047q93o35m69l56j71j08m03p86p03r5N50R33J209J499J611
60710C24863J432J209J255J619K132K569K706K509K298K417K730K786K517K355
60696C55397K525K653K304J559Q16K75r1k26L9O55J205J204N93j04k59J51N29
60679C69225N01L91N85P83M43k45m68R1R32J541J838J699P91p15j929k283k327
$$ plain form
60791 344308 343859 343823 343920 344083 344275 344340 344174 343876 343668 343830 344667 346265 348269 350147 351753 353440 355562 358091
60773 358091 360799 363600 366484 369267 371677 373746 375957 378847 382381 385768 388014 388733 388425 387971 387903
60758 387903 388133 388192 387598 386053 383537 380323 376908 373823 371414 369738 368646 368008 367834 368175 368944 369881
60742 369881 370654 370915 370355 368844 366510 363598 360237 356400 352007 346982 341402 335768 330992 327759 325917
60727 325917 324727 323680 322787 322152 321683 321327 321156 321048 320645 319859 319156 319061 319611 320544 321753 323252 324863
60710 324863 326295 327504 328759 330378 332510 335079 337785 340294 342592 345009 347739 350525 353042 355397
60696 355397 357922 360575 362879 364438 365254 365529 365438 365212 365251 365906 367111 368315 368908 368804 368545 368696 369225
60679 369225 369726 370117 370702 371485 371928 371683 371215 371306 372238 373779 375617 377316 378107 377392 375463 373180 370853
60662C70853k881l771m078l443k483j883j606j181l84N55J272J624J813K149K636
60647C59192K922K753K336K030J804J298M28m03q11r69j368k155k910l181l010
60632C57956k725k347j619o61j65n53j257j332o42M2J74J01L98R89J221O70m41
60615C49809j433j703j176l49K63O84J236J813J908J462J157J561K357K789K550
60600C62928J867J031L06nJ79M69M70L23M04O75Q37R05J081J145O68j65n93l45
60582C72180jPN5N69J182J348J334J836K809L545L852M341N343O371P028P774
60566D19573R185J0924J2113J2408J2063J1084R087O066K657m73l071n018o146
60553D90452o553o605o351n390l613j604P5J597L370N163O331O779P104P821Q912
$$ plain form
60662 370853 367972 364201 360123 356680 354197 352314 350708 349527 349143 349698 350970 352594 354407 356556 359192
60647 359192 362114 364867 367203 369233 371037 372335 372763 372360 371549 370580 369212 367057 364147 360966 357956
60632 357956 355231 352884 351265 350604 350439 349886 348629 347297 346655 346697 346871 346972 347370 348359 349580 350250 349809
60615 349809 348376 346673 345497 345148 345411 346095 347331 349144 351052 352514 353671 355232 357589 360378 362928
60600 362928 364795 365826 366132 366127 366306 366775 367245 367568 367972 368647 369484 370389 371470 372615 373283 373118 372525 372180
60582 372180 372179 372186 372241 372810 373992 375340 376674 378510 381319 384864 388716 393057 398400 404771 411799 419573
60566 419573 428758 439682 451795 464203 476266 487350 496437 502503 505160 504687 501616 496598 490452
60553 490452 483899 477294 470943 465553 461940 460336 460411 462008 465378 470541 476872 483651 490755 498576 507488
60538E07488J0214J1774J3625J5461J6707J6845J5636J3210R910O034J854k035
60526F36723m786o050o468o960p651p927p439o560n796n219m590l716k600j438
60512E59523n86j77J29P88J808K889M094N852Q257J0892J3464J6185J9303K2770
60498F65191K6522L0712L5317L9811M3514M6007M7056M6459M4300M0990L6729
60487A102608L1118K3570J3962K754r249k1065l1758m0784m7907n2686n4504n3400
60475H62659n0460m6908m3141l9010l4689l0679k7159k3966k1162j8933j7000
60464E09552j4707j1926r326p586o720o394o367o366n942m958l954l561l728l884
60450D14133l736l432l026k346j498r59r08q21j92O54Q79J95q66j685k136k356
$$ plain form
60538 507488 517702 529476 543101 558562 575269 592114 607750 620960 630870 636904 638758 636723
60526 636723 631937 625887 619419 612459 604808 596881 589442 582882 577086 571867 567277 563561 560961 559523
60512 559523 558937 558760 558889 559677 561485 564374 568468 574320 582577 593469 606933 623118 642421 665191
60498 665191 691713 722425 757742 797553 841067 887074 934130 980589 1024889 1065879 1102608
60487 1102608 1133726 1157296 1171258 1174012 1164763 1143698 1111940 1071156 1023249 970563 916059 862659
60475 862659 812199 765291 722150 683140 648451 617772 590613 566647 545485 526552 509552
60464 509552 494845 482919 473593 466007 459287 452893 446526 440160 434218 429260 425306 421745 418017 414133
60450 414133 410397 406965 403939 401593 400095 399136 398228 397407 397215 397869 398748 398943 398077 396392 394256 391900
60434C91900k367k165j922j816j814j738j434q03Q7Q66J068O75J55j35k69l49
60418C79939k09K34P66J323K142L049L164K038O52L78J102J413O25l39m02L20
60402C96195J063J541J924K188K178J992J809J541J106P85R40J496K060K369K398
60387D21585K223K024K028K170K057J527R79Q60J166J704K475L372L877L583K815
60372D54445K163J679J101O83J018J982K565K076R62J95K62J021K112L120L678
60357D79062L819M034M664N465O113O812P922R094R406Q454O778N093L524J858
60343E62098M8j879m015o195p708p924p135o235n646n116m513m139m108m046l736
60328D89751l530l712l948l790l358l045k857k501j798p25O76K005K644K641K941
$$ plain form
60434 391900 389533 387368 385446 383630 381816 380078 378644 377841 377928 378794 379862 380537 380692 380557 380288 379939
60418 379939 379730 379964 380730 382053 384195 387244 390408 392446 393098 393476 394578 395991 396616 396277 395875 396195
60402 396195 397258 398799 400723 402911 405089 407081 408890 410431 411537 412322 413262 414758 416818 419187 421585
60387 421585 423808 425832 427860 430030 432087 433614 434593 435453 436619 438323 440798 444170 448047 451630 454445
60372 454445 456608 458287 459388 460071 461089 463071 465636 467712 468674 468869 469131 470152 472264 475384 479062
60357 479062 482881 486915 491579 497044 503157 509969 517891 526985 536391 544845 551623 556716 560240 562098
60343 562098 562146 560267 556252 550057 542349 534425 527290 521055 515409 510293 505780 501641 497533 493487 489751
60328 489751 486221 482509 478561 474771 471413 468368 465511 463010 461212 460487 461163 463168 465812 468453 471394
60313D71394M148N593O422P053Q503J0641J2263J2860J3053J3308J3398J3335
60301E91971J3473J3260J1179O789J706k359n678r493j3677j6607j7236j6123
60289E57205j4458j2831j1171r211o885m601l056k452k085j131J95P85r5k015
60275D88194l829m585m121l096k469k718l532m244m376l766k607j484j019j167
60261D45181j290j129j176j747k233j900j007m52n03n49J0J104K253L001L093
60246D42656K589J805J033M06J11L27P76P66N2p86j204j368j573j526q86kO19
60229D43795J206K214L331L803L610L347L182K802K364K485L225L993M624N594
60215D89575O936P818P621O817O321O570P444Q515R101Q724P815P407P792Q156
$$ plain form
60313 471394 475542 481135 487557 494610 503113 513754 526017 538877 551930 565238 578636 591971
60301 591971 605444 618704 629883 636672 638378 636019 630341 620848 607171 590564 573328 557205
60289 557205 542747 529916 518745 509534 502649 498048 494992 492540 490455 489324 489519 490304 490209 488194
60275 488194 484365 479780 475659 472563 470094 467376 463844 459600 455224 451458 448851 447367 446348 445181
60261 445181 443891 442762 441586 439839 437606 435706 434699 434247 433744 433195 433205 434309 436562 439563 442656
60246 442656 445245 447050 448083 448489 448600 448927 449703 450469 450521 449735 448531 447163 445590 444064 443178 443176 443795
60229 443795 445001 447215 450546 454349 457959 461306 464488 467290 469654 472139 475364 479357 483981 489575
60215 489575 496511 504329 511950 518767 525088 531658 539102 547617 556718 565442 573257 580664 588456 596612
60201E96612P836P248P033O948O301N099M038L556L428L160K326P54j206k748
60187F50385l390l531l874m576n342o119p047p814p776o887n970n787o148o282
60173E69842n841n137m538l991l298k529j926j499j071o84o69j108j536j472j059
60158E33484q33r06q24k50N93J272J659J842J759J243L77m13p35n59j28M42J294
60141E39317K485L626M195M239M491N542P146Q519R151R047Q414P521O739O289
60127F26721N931N230M105K842J700Q44M94O83R46Q48P87J562K999L843L415K631
60111F65581K689L306L175J885L53o90j660l089m498n027m739m487m648m827m814
60096F38510n014n554n733m900l465k368j899j649j413j317j212p42q5J89J19
$$ plain form
60201 596612 604448 611696 618729 625677 631978 637077 641115 644671 648099 651259 653585 654339 653133 650385
60187 650385 646995 643464 639590 635014 629672 623553 616506 608692 600916 594029 588059 582272 576124 569842
60173 569842 564001 558864 554326 550335 547037 544508 542582 541083 540012 539328 538659 537551 536015 534543 533484
60158 533484 532651 531745 530921 530671 531264 532536 534195 536037 537796 539039 539416 539003 538268 537709 537581 538023 539317
60141 539317 541802 545428 549623 553862 558353 563895 571041 579560 588711 597758 606172 613693 620432 626721
60127 626721 632652 637882 641987 644829 646529 647373 647867 648550 649496 650344 651131 652693 655692 659535 662950 665581
60111 665581 668270 671576 674751 676636 676989 676299 674639 671550 667052 662025 657286 652799 648151 643324 638510
60096 638510 633496 627942 622209 617309 613844 611476 609577 607928 606515 605198 603986 603244 603159 603348 603467
60081F03467L53R43J046L40k09K80J172J150o2j701l314n052o816q048q481q407
60065E66661q105p624p109o745o430n979n611n539n301m229k588j405j081r66
60051D97949m74K33Q30J407K058K620L193M224N697O805O950O524O215O079N822
60036E56132N532N526N670N443M559L113J319n70k211l409m295n008n410n384
60022E61007n252n538o414p636q892r929j0437j0121r030p627o498n918n661n270
60008D56784m575l886l468l062k241j145l82k13l46n51q89j177q72J15J044J240
59992D36376J040J300K280L432M212M557M671M715M728M624M212L404K354J300
59978D83205L99k95q43j544k698m061m804m386l188k015j160l89L38O97N89M59
$$ plain form
60081 603467 603820 604763 605809 606149 605940 606220 607392 608542 608480 606779 603465 598413 591597 583549 575068 566661
60065 566661 558556 550932 543823 537078 530648 524669 519058 513519 508218 503989 501401 499996 498915 497949
60051 497949 497475 497708 498538 499945 502003 504623 507816 512040 517737 524542 531492 538016 544231 550310 556132
60036 556132 561664 567190 572860 578303 582862 585975 587294 586724 584513 581104 576809 571801 566391 561007
60022 561007 555755 550217 543803 536167 527275 517346 506909 496788 487758 480131 473633 467715 462054 456784
60008 456784 452209 448323 444855 441793 439552 438407 438025 437812 437466 436915 436026 434849 433977 434092 435136 436376
59992 436376 437416 438716 440996 444428 448640 453197 457868 462583 467311 471935 476147 479551 481905 483205
59978 483205 483604 483309 482466 480922 478224 474163 469359 464973 461785 459770 458610 458221 458559 459256 459845 460304
59962D60304P69J446K063K426K723L146L574L673L189K135Q28j91n14l06k50p37
59946D84278j287j146l99K8m08j246j826k145k490k765k807k797k813k336j003
59931D58838N08J188J125J267J935K526K817L492N005O703P571P246N914L864
59917E09999J619n3p79r93j292j643j489l64J653L847N155N019M043L356L314
59902E31392L324K903K255J680J158P11M63J81m83j130q55L38J346J642K108L538
59886E50571N267O172O311O521P013P277P097O755O435O191O162O223N766M500
59872F38261L062K107J230k85k035k872k596k255k632l300l390k658j633j090
59858F19914j527k663l564l598l158k935k778j944k64J668L443N144O540O823
$$ plain form
59962 460304 461073 462519 464582 467008 469731 472877 476451 480124 483313 485448 486276 486085 485571 485265 485015 484278
59946 484278 482991 481845 481446 481474 481066 479820 477994 475849 473359 470594 467787 464990 462177 459841 458838
59931 458838 459346 460534 461659 462926 464861 467387 470204 473696 478701 485404 492975 500221 506135 509999
59917 509999 511618 511565 510786 509793 508501 506858 505369 505005 506658 510505 515660 520679 524722 528078 531392
59902 531392 534716 537619 539874 541554 542712 543423 543886 544067 543584 542454 541599 541937 543283 544925 547033 550571
59886 550571 555838 562010 568321 574842 581855 589132 596229 602984 609419 615610 621772 627995 633761 638261
59872 638261 641323 643430 644660 644375 642340 639468 636872 634617 631985 628685 625295 622637 621004 619914
59858 619914 618387 615724 612160 608562 605404 602469 599691 597747 597483 599151 602594 607738 614278 621101
59844F21101N433K793j04k451l831m066l171j425N55J795J390o25l063m604m945
59829F04782m602l928k874j558l97L51O78N04k16j171j986k802m019n408o199
59814E71155o007n177m134l054k281k404l453m586m934m511l915l480l055k496
59800E17668j978j809k039k397k589k635k760k927k762k083j233o64m07k40j37
59785D91008j88l33m65o20p47n24J66Q45J020R11J110J675K159K392K692L244
59769E04345L817M100L991L544K999K743K935L303L620M038M585M775M350L975
59755E57120M448N486O213O599P348Q424Q827Q079O959O390O358O378O309O239
59741F51177O133N974N780N298M189K762J854J703J593Q98j65j150j980k540k331
$$ plain form
59844 621101 626534 629327 629223 626772 622941 618875 615704 614279 614834 616629 618019 617394 614331 609727 604782
59829 604782 600180 596252 593378 591820 591423 591774 592452 592956 592740 591569 589583 586781 582762 577354 571155
59814 571155 565148 559971 555837 552783 550502 548098 544645 540059 535125 530614 526699 523219 520164 517668
59800 517668 515690 513881 511842 509445 506856 504221 501461 498534 495772 493689 492456 491792 491385 491145 491008
59785 491008 490820 490487 490022 489402 488655 488131 488297 489142 490162 491073 492183 493858 496017 498409 501101 504345
59769 504345 508162 512262 516253 519797 522796 525539 528474 531777 535397 539435 544020 548795 553145 557120
59755 557120 561568 567054 573267 579866 587214 595638 604465 612544 619503 625893 632251 638629 644938 651177
59741 651177 657310 663284 669064 674362 678551 681313 683167 684870 686463 687361 687196 686046 684066 681526 679195
59726F79195j197O1M24l46j703k944l424k845j814j609k745m174m554l847l040
59711F45438k675k493k285k214k287k251k087j995j864j320m27K79O03R64J637
59696F27023K223K288K163K568L594M442M248K977J354R2p15j415k192k837l113
59681F42700l087k972k802k519k283k475l341m727o112o808o406n234m241m088
59667E85605m426m400l843l434l555l573k691j121J91Q71J454K397L380L890L983
59652E74728M058M158M048L719L457L396L340K998K105N26j501l339m570n442
59638E91681o330o967o821o004n186m589l839k908k360k447k636k497k343k664
59624E34090l356l935m127l897l440l282l819m541m450l572l112l688m308l831
$$ plain form
59726 679195 677998 678059 678483 678137 676434 673490 670066 667221 665407 663798 661053 656879 652325 648478 645438
59711 645438 642763 640270 637985 635771 633484 631233 629146 627151 625287 623967 623540 623819 624422 625386 627023
59696 627023 629246 631534 633697 636265 639859 644301 648549 651526 652880 652972 652257 650842 648650 645813 642700
59681 642700 639613 636641 633839 631320 629037 626562 623221 618494 612382 605574 599168 593934 589693 585605
59667 585605 581179 576779 572936 569502 565947 562374 559683 558562 558753 559624 561078 563475 566855 570745 574728
59652 574728 578786 582944 586992 590711 594168 597564 600904 603902 606007 606533 605032 601693 597123 591681
59638 591681 585351 578384 571563 565559 560373 555784 551945 549037 546677 544230 541594 539097 536754 534090
59624 534090 530734 526799 522672 518775 515335 512053 508234 503693 499243 495671 492559 488871 484563 480732
59610D80732k510j195R3J668K946L031K171J464J336J339J259J272J192O32j15
59595D95315l49p6J26J74M68Q78R23Q53J327K014J737K58j300k089k377k427j853
59578D93602o78J19r2o83r07j035j577k143k019j321p69o50p18q54j163j580j832
59561D75700j728j241n41l5l5k60j28L73O66N53N07Q78J403J759J983K122K115
59544D84091K255L062M491N947P206Q582J0155J1805J4082J7538K0791K0700J5602
59531F26307P366o27o563j0296j1732j0723q054n004k128N48K493L058K602K068
59517E89315J559M54j169k431l093l970n573p241q019p749o946o152n682n576
59503E27727n591n419n022m518l941l440l390l749l643k329m68M45Mn56n1J219
$$ plain form
59610 480732 478222 477027 477120 478788 481734 484765 486936 488400 489736 491075 492334 493606 494798 495430 495315
59595 495315 494966 494890 495016 495190 495658 496536 497459 498312 499639 501653 503390 503648 502348 500259 497882 495455 493602
59578 493602 492924 493043 492951 492268 491361 490326 488749 486606 484587 483266 482497 481847 481129 480275 479112 477532 475700
59561 475700 473972 472731 472190 472155 472120 471860 471732 472105 472771 473324 473831 474709 476112 477871 479854 481976 484091
59544 484091 486346 489408 493899 499846 507052 515634 525789 537594 551676 569214 590005 610705 626307
59531 626307 633673 633046 626483 616187 604455 593732 585678 580674 578546 579094 581587 584645 587247 589315
59517 589315 590874 591328 590159 587728 584635 580665 575092 567851 559832 552083 545137 538985 533303 527727
59503 527727 522136 516717 511695 507177 503236 499796 496406 492657 489014 486685 486217 486662 486666 486110 486059 487278
59487D87278K159K472K779L442L914L538K603K202L025M627O074P038P811Q409
59473E47371Q329P365O019M796L567K055N21n44j083j342j329q49L4R66J595J761
59457E79232J622J795K912M765O322O907O893O870O804O596O748P569Q189P329
59443F60553M941K128m38l086o004q435r470r073p943o745n736m913m182l496
59429E98101k941k655k603k444j667mK139L852M823O029Q630J2195J4983J6216
59415F54654J6992J8405K0103K1718K4422K9082L3246L2083K3060Q623o017j6763
59403H59608k2135k2550j9419j4291p848J60R208J6487J8070J2111P25j1527k0871
59390G97728k6111k7790k6577k2971j8049j3438j0081p596n237l026j549r46o93
$$ plain form
59487 487278 489437 491909 494688 498130 502044 505582 508185 510387 513412 518039 524113 531151 538962 547371
59473 547371 555700 563065 569084 573880 577447 579502 580023 579479 578396 577054 575725 574876 574910 575876 577471 579232
59457 579232 580854 582649 585561 590326 596648 603555 610448 617318 624122 630718 637466 645035 653224 660553
59443 660553 665494 667622 667184 664098 658094 649659 640189 631116 623173 616428 610692 605779 601597 598101
59429 598101 595160 592505 589902 587458 585791 585787 587926 591778 596601 602630 611260 623455 638438 654654
59415 654654 671646 690051 710154 731872 756294 785376 818622 850705 873765 882388 876371 859608
59403 859608 837473 814923 795504 781213 773365 773525 782733 799220 817290 829401 830126 818599 797728
59390 797728 771617 743827 717250 694279 676230 662792 652711 645115 639878 636852 635303 634357 633664
59377F33664j52R87K599M121M902M864M580M436M138L395K561K133K041J988J991
59362F78248K052J772J033N21Q80J769K531L355M766O434P529Q095Q900J0061
59348G37946J0906J1267J1749J2580J3281J3630J3937J4125J3577J2257J0872
59337H76127R551P387M015N87j688l188n121p637r747j0876j1528j2347j3170
59324H22365j3355j2655j1555j0798j0575j0314r470q381p890q081q042p135n919
59311F98195n303n283n143m605l991l357k194k86J801L503N128P306R590J0209
59297G05570P604J939n120j1741j6723j9353j9405j7442j4618j1847r417p387
59285E82060n821m487k981j361r2Q37K051L746N206N925O388P237Q330R371J0694
$$ plain form
59377 633664 633512 634499 637098 641219 646121 650985 655565 660001 664139 667534 670095 672228 674269 676257 678248
59362 678248 680300 682072 683105 683626 684506 686275 688806 692161 696927 703361 710890 718985 727885 737946
59348 737946 748852 760119 771868 784448 797729 811359 825296 839421 852998 865255 876127
59337 876127 885678 893065 897080 897667 895979 892791 887670 880033 870286 859410 847882 835535 822365
59324 822365 809010 796355 784800 774002 763427 753113 743643 735262 727372 719291 711249 704114 698195
59311 698195 692892 687609 682466 677861 673870 670513 668319 668033 669834 673337 678465 685771 695361 705570
59297 705570 713174 715113 709993 698252 681529 662176 642771 625329 610711 598864 589447 582060
59285 582060 576239 571752 568771 567410 567318 568155 570206 573952 579158 585083 591471 598708 607038 616409 627103
59270F27103J2490J3990J4391J4143J4194J4408J3861J2367J0433P987M496M01
59258G60264k880m674n714o851q072r029r525r281q093o521n505n076m343k944
59244F71756j501m29O65J968K869L009K968L402M175M909N597O153O095N242M107
59229G20985L041J676k58k265l797n028o286p306p671p525p266p016o829o942
59215F57513p293p313o719n976n507n042m330l867m160m757m816m246l620l200
59201E86667k774k217j582q32qN58P14Q41J239J545J377J205J812L120M283M817
59185F00765M917M801M547M587N482O987P991P787O896O288O223O251O086N940
59171F85548O010O013N553M786M460M990N775N747M611L132K116J424L23j531
$$ plain form
59270 627103 639593 653583 667974 682117 696311 710719 724580 736947 747380 755367 759863 760264
59258 760264 757384 752710 746996 740145 732073 723044 713519 704238 696145 689624 684119 679043 674700 671756
59244 671756 670255 669826 670491 672459 675328 678337 681305 684707 688882 693791 699388 705541 711636 716878 720985
59229 720985 724026 725702 725444 723179 719382 714354 708068 700762 693091 685566 678300 671284 664455 657513
59215 657513 650220 642907 636188 630212 624705 619663 615333 611466 607306 602549 597733 593487 589867 586667
59201 586667 583893 581676 580094 579262 579254 579812 580526 581367 582606 584151 585528 586733 588545 591665 595948 600765
59185 600765 605682 610483 615030 619617 625099 632086 640077 647864 654760 661048 667271 673522 679608 685548
59171 685548 691558 697571 703124 707910 712370 717360 723135 728882 733493 736625 738741 740165 740488 738957
59157G38957l724n563o661p172p663q652j0123j1563j2453j2589j1927j0636r326
59144F20905q795r168r615r286q266p270o648o136n464m715m028l329k531j770
59130E33884j221p49L3J237K446L148L399L751M478N269N869O611P918R517J0715
59115E96305J1205J1184J0769J0001R292R225R716R930R246P857O303M896L749
59102G09678K926K277J464M05o32j445k171k977l777m328m460m132l522k972k585
59087F83749k074j336q80j210k008k538k794l520n036o729p754p781p031o102
59073F26956n725o107o577o409n841n612n705n443m691l984l490k892k363k519
59059E59598l210l465k974k502k485k345j755j358j542j575q50j8O7k54j41L19
$$ plain form
59157 738957 735233 729670 723009 715837 708174 699522 689399 677836 665383 652794 640867 630231 620905
59144 620905 612110 602942 593327 584041 575775 568505 561857 555721 550257 545542 541514 538185 535654 533884
59130 533884 532663 531914 531947 533184 535630 538778 542177 545928 550406 555675 561544 568155 576073 585590 596305
59115 596305 607510 618694 629463 639464 648756 657981 667697 677627 686873 694730 701033 705929 709678
59102 709678 712604 714881 716345 716750 716118 714673 712502 709525 705748 701420 696960 692828 689306 686334 683749
59087 683749 681675 680339 679459 678249 676241 673703 670909 667389 662353 655624 647870 640089 633058 626956
59073 626956 621231 615124 608547 602138 596297 590685 584980 579537 574846 570862 567372 564480 562117 559598
59059 559598 556388 552923 549949 547447 544962 542617 540862 539504 537962 536387 535537 535519 535586 535332 535191 535510
59043E35510M24J26l0J16L04N86J181J772J708R76L13L20R73J943L003M074N110
59026E58409O023O711P341Q485J0533J2955J4703J5428J5709J5905J5492J3781
59014G01475J0735O828K717p57k983m280n550o934p602p085n918m585k812m81
59000F72768J679L003L772M479M924M676L867K877J861J057Q64J065P18n34j823
58985G05253k288k144j930j599j092q90j104q00P38K804M314N306O471P761Q690
58970G29490R424J0455J1540J2024J1893J1658J1479J1183J0739J0006Q527O386
58958H54804M570L567K315l34l838o814r076j1389j3698j5136j5637j6051j6558
58945G56725j6374j5237j3978j3200j2361j0698q326o080m676m213m146l719k720
$$ plain form
59043 535510 535934 536060 536030 536146 536450 537036 538217 539989 541697 542673 542986 543306 544279 546222 549225 553299 558409
59026 558409 564432 571143 578484 586969 597502 610457 625160 640588 656297 672202 687694 701475
59014 701475 712210 719038 721755 720998 718015 713735 708185 701251 693649 686564 680646 676061 673249 672768
59000 672768 674447 677450 681222 685701 690625 695301 699168 702045 703906 704963 705827 706892 707610 707076 705253
58985 705253 702965 700821 698891 697292 696200 695310 694206 693406 694144 696948 701262 706568 713039 720800 729490
58970 729490 738914 749369 760909 772933 784826 796484 807963 819146 829885 839891 848418 854804
58958 854804 859374 862941 865256 864922 861084 854270 845194 833805 820107 804971 789334 773283 756725
58945 756725 740351 725114 711136 697936 685575 674877 666551 660471 655795 651582 647436 643717 640997
58932F40997j665j013n90j47J51L24Q79J874K334J534J63o85j047j525j904j632
58916F38048j123j178j461j027j16O9n99q09K38J850L081L893M688N678P037Q919
58900F67188J1031J2812J4085J4939J5068J4065J2340J0905J0241J0125J0398
58889H03197J1114J2042J2935J4123J5916J7551J7734J6241J3977J1508Q637N440
58877I60415K596L58j827m389p041r341j1104j2146j2308j1850j1135j0020q221
58864H63987o247n038m779m876n101n837p069q083q448q527q824r371r916j0173
58850G61698r867r027q097p368o574n605n132n725o778p255p123p186p777q574
58836F59610r350r956r900q953p877p459p223o191m561l361k786k188j455r85
$$ plain form
58932 640997 639332 638319 637729 637582 637733 638057 638936 640810 643144 644678 644841 644156 643109 641584 639680 638048
58916 638048 636925 635747 634286 633259 633143 633212 632613 631804 632042 633892 636973 640866 645554 651232 658269 667188
58900 667188 678219 691031 705116 720055 735123 749188 761528 772433 782674 792799 803197
58889 803197 814311 826353 839288 853411 869327 886878 904612 920853 934830 946338 954975 960415
58877 960415 963011 963369 961542 957153 950112 940771 929667 917521 905213 893363 882228 872208 863987
58864 863987 857740 852702 847923 843047 837946 832109 825040 816957 808509 799982 791158 781787 771871 761698
58850 761698 751831 742804 734707 727339 720765 715160 710028 704303 697525 690270 683147 675961 668184 659610
58836 659610 650260 640304 630404 621451 613574 606115 598892 592701 588140 584779 581993 579805 578350 577365
58822E77365m89P02K224L028L159L690M796N354M741L679L002K787K927L398L755
58807F24118L444K681K018J158n17k427l272l045l024l673m141m091m350n354
58793E99525o393o843o824o284m900l163k178j998j510l13Q29J602K651M013M754
58778E72968M617M494M725M568L875L533L504K343m52l318m916n898p158q000
58764E74885p453o137n310n022m539l746k945k002q03J77O41J109J990K845L240
58749E46930L432L477K754J149k42m52K55J358K992N040O469O665O513P013P725
58734F01078P652O934O530O759P075O860N828M201K946L048M073M427L435K164
58720F73010J618J491J368J768K990M211M845N611P088Q341Q260P232O174M860
$$ plain form
58822 577365 576876 577578 579802 582830 585989 589679 594475 599829 604570 608249 611251 614038 616965 620363 624118
58807 624118 627562 630243 632261 633419 632902 630475 627203 624158 621134 617461 613320 609229 604879 599525
58793 599525 593132 586289 579465 573181 568281 565118 562940 560942 559432 559119 559948 561550 564201 568214 572968
58778 572968 577585 582079 586804 591372 595247 598780 602284 604627 604175 600857 595941 590043 582885 574885
58764 574885 567432 561295 555985 550963 546424 542678 539733 537731 536928 537105 537746 538855 540845 543690 546930
58749 546930 550362 553839 556593 557742 557500 557048 557303 558661 561653 566693 573162 579827 586340 593353 601078
58734 601078 608730 615664 622194 628953 636028 642888 648716 652917 655863 658911 662984 667411 670846 673010
58720 673010 674628 676119 677487 679255 682245 686456 691301 696912 704000 712341 720601 727833 734007 738867
58706G38867K624r0k349m310o800r754j2335j4270j5964j7483j8477j8862j8806
58693F01991j8187j6780j4769j2601j0577q910p649o415m856l526l373m240m940
58680D85168n068n345n789n175l107j067l45k92K45J047J365J528K362L796N210
58665D74533O500P789Q854R618J0388J0851R874P113L765Q94j745m394o173o462
58651E31405o146o273o596o484o151n826m983l538k573k670k753j888q57o34o50
58636D73383q0N92Q34J474L061M207L524J985J377J467Q31m26j000p72p24r54
58620D88779p65k68n4K95J577L294M341M924N957P061P017N879M911M583M381
58605E41912M240M545M912M534L578K841K369J715J076Q05L55p98j795j556o75
$$ plain form
58706 738867 741491 741401 739052 734742 727942 718188 705853 691583 675619 658136 639659 620797 601991
58693 601991 583804 567024 552255 539654 529077 520167 512518 506103 501247 497721 494348 490108 485168
58680 485168 480100 474755 468966 463791 460684 459617 459272 458980 459225 460272 461637 463165 465527 469323 474533
58665 474533 481033 488822 497676 507294 517682 528533 538407 545520 549285 550179 548434 544040 537867 531405
58651 531405 525259 518986 512390 505906 499755 493929 488946 485408 482835 480165 477412 475524 474667 474033 473383
58636 473383 473303 473895 474729 476203 479264 483471 486995 488980 490357 491824 492655 492229 491229 490457 489733 488779
58620 488779 488014 487746 487692 487987 489564 492858 497199 502123 508080 515141 522158 528037 532948 537531 541912
58605 541912 546152 550697 555609 560143 563721 566562 568931 570646 571722 572527 572882 572084 570289 568733 568058
58590E68058m89q47m97P69K128L418N098O846P939Q659R700J0618J0531R886R773
58575F51590R891R035P269N855N314N331O210Q564J1789J4549J6665J8849K1001
58562G91912K2435K3531K5298K7524K8946K8957K7602K4436J9156J2867O976J399
58550A041039m300q839j0513r990r444r353q583p296p078q191r307j0199j2252
58537I25694j5839j9528k2335k4573k6052k5631k3254k0462j8273j6181j3742
58526F99824j1351r108o615m341l464m018m733m990n316n776n623m789m100l750
58512F21850l136k241j657j247m51J99k87j405j745j354j460j971j525q8P99O23
58496F04904N22R77J085N57L63R23J575K190L400M927N650N668O309P856R298
$$ plain form
58590 568058 567569 566722 566225 566994 569122 572540 577638 584484 592423 601082 610782 621400 631931 641817 651590
58575 651590 661481 670516 677785 683640 688954 694285 700495 709059 720848 735397 752062 770911 791912
58562 791912 814347 837878 863176 890700 919646 948603 976205 1000641 1019797 1032664 1039640 1041039
58550 1041039 1036739 1027900 1017387 1007397 997953 988600 980017 972721 965643 957452 948145 937946 925694
58537 925694 909855 890327 867992 843419 817367 791736 768482 748020 729747 713566 699824
58526 699824 688473 679365 672750 668409 664945 660927 656194 651204 645888 640112 634489 629700 625600 621850
58512 621850 618714 616473 614816 613569 613118 613317 613030 611625 609880 608526 607066 605095 603570 603482 604281 604904
58496 604904 605426 606403 607488 608045 608408 609331 610906 613096 616496 621423 627073 632741 639050 646906 656204
58481F56204J0402J1987J3944J5182J5845J7232J9254K0151J9091J6761J3223
58470H29276P715J029m481p968j0787j3558j4962j4215j2341j0187p392m073j236
58457G36820J138M244P997J0809J2383J4183J6393J6985J4897J1556Q153L834
58445H59392k012p923j2209j4819j6238j6368j5433j4255j2821j0400p484n479
58433G23951m196k055Q04K456K748L872O407Q027P531P017Q385J0363J0960J0315
58419G96585R246P312M228J137j305m085p535r968j0247r668r657r672q962q339
58405G39070q496q479p470o253n452m160j859K34J156J661K477L022L139L928
58391G12518N511O115M822L126K386J986J359J430K443K655J066o37n79Q43K511
$$ plain form
58481 656204 666606 678593 692537 707719 723564 740796 760050 780201 799292 816053 829276
58470 829276 836991 838020 833539 825571 814784 801226 786264 772049 759708 749521 742129 738056 736820
58457 736820 737958 742202 750199 761008 773391 787574 803967 820952 835849 847405 855558 859392
58445 859392 857380 849457 837248 822429 806191 789823 774390 760135 747314 736914 729430 723951
58433 723951 719755 717700 718504 720960 723708 727580 733987 742014 749545 756562 764947 775310 786270 796585
58419 796585 805831 813143 817371 818508 817203 813118 805583 795615 785368 775700 766043 756371 747409 739070
58405 739070 730574 722095 714625 708372 702920 698760 696901 697135 698291 699952 702429 705451 708590 712518
58391 712518 718029 724144 728966 732092 734478 736464 737823 739253 741696 744351 745417 744780 744201 745044 747555
58376G47555M494O804Q219Q074P497P523P821Q195R273J0610J0512Q889P861Q466
58362H61793R385R893J1160J3305J4354J3628J3093J3638J3162J0238O638M202
58350I94489K202j26j456r51j28J5Q81L283N460O112O545P768Q576Q455R217J1634
58334A061976J3724J4500J5791J8223J9204J7513J5957J6527J6792J4341J1039
58323A235587R426Q421O202L990L362L007J733J475L669N830N479M430N393P448
58309A305452Q590R666J1947J3833J3889J4117J6398J8642J8418J7307J7719J8566
58297A484544J8021J7482J8624J9724J9014J8520K0334K2349K1984K0895K1624
58286A703115K2940K2889K3078K5349K7571K7438K6988K8734L0878L1142L1672
$$ plain form
58376 747555 752049 758853 767072 775146 782643 790166 797987 806182 815455 826065 836577 845466 853327 861793
58362 861793 871178 881071 892231 905536 919890 933518 946611 960249 973411 983649 990287 994489
58350 994489 996691 996565 995109 994158 994030 994045 994926 998209 1003669 1009781 1016326 1024094 1032670 1041125 1050342 1061976
58334 1061976 1075700 1090200 1105991 1124214 1143418 1160931 1176888 1193415 1210207 1224548 1235587
58323 1235587 1245013 1253434 1259636 1263626 1266988 1269995 1271728 1273203 1276872 1282702 1288181 1292611 1298004 1305452
58309 1305452 1314042 1323708 1335655 1349488 1363377 1377494 1393892 1412534 1430952 1448259 1465978 1484544
58297 1484544 1502565 1520047 1538671 1558395 1577409 1595929 1616263 1638612 1660596 1681491 1703115
58286 1703115 1726055 1748944 1772022 1797371 1824942 1852380 1879368 1908102 1938980 1970122 2001794
58275B001794L5114L9469M1958M4177M8296N2020N2673N2498N4417N6654N6942
58264B536012N7701O1303O4789O5369O6403P1360P6771P8071P7672P9845Q2428
58253C317724Q1419P9280Q0643Q4094Q6143Q8846R5314J02331J05905J09372J17347
58242D348418J26619J32217J37226J46902J58251J65754J72296J83721J97641
58233E769045K08678K19563K35583K53330K66995K80453L00640L24518L45593
58224H204398L67530L97460M31810M63480M96851N40173N89435O36398O86175
58215A2813710P49344Q23348R00475R87251J096062J224891J366937J532364J737428
58206B3231810J980786K256594K582378K986440L478553M064843M778756N657612
$$ plain form
58275 2001794 2036908 2076377 2118335 2162512 2210808 2262828 2315501 2367999 2422416 2479070 2536012
58264 2536012 2593713 2655016 2719805 2785174 2851577 2922937 2999708 3077779 3155451 3235296 3317724
58253 3317724 3399143 3478423 3559066 3643160 3729303 3818149 3913463 4015794 4121699 4231071 4348418
58242 4348418 4475037 4607254 4744480 4891382 5049633 5215387 5387683 5571404 5769045
58233 5769045 5977723 6197286 6432869 6686199 6953194 7233647 7534287 7858805 8204398
58224 8204398 8571928 8969388 9401198 9864678 10361529 10901702 11491137 12127535 12813710
58215 12813710 13563054 14386402 15286877 16274128 17370190 18595081 19962018 21494382 23231810
58206 23231810 25212596 27469190 30051568 33038008 36516561 40581404 45360160 51017772
58198E1017772O697814P875426R202004J0717220J2447840J4439802J6818756
58191A29216634J9746940K3336786K7674722L2793713L8246484M2482187M2916967
58184C56414433L7208840K4925935Q149522r511723k4609732l5041763m0309065
58177C17226447m1149113l8930168l5054301l0573926k6122484k2033903j8451848
58170A04910704j5386699j2784858j0598572q793247p316400o102554n105836
58163C8822538m298835l645634l104557k653563k287070j990388j740045j525877
58155A7576569j350471j208298j085015r75350q83000q04255p29037o56787n94978
58146I289378n43029m92813m43743m02571l69367l37794l08421k88090k76268
$$ plain form
58198 51017772 57715586 65591012 74793016 85510236 97958076 112397878 129216634
58191 129216634 148963574 172300360 199975082 232768795 271015279 313497466 356414433
58184 356414433 393623273 418549208 426698730 417187007 392577275 357535512 317226447
58177 317226447 276077334 237147166 202092865 171518939 145396455 123362552 104910704
58170 104910704 89524005 76739147 66140575 57347328 50030928 43928374 38822538
58163 38822538 34523703 30878069 27773512 25119949 22832879 20842491 19102446 17576569
58155 17576569 16226098 15017800 13932785 12957435 12074435 11270180 10541143 9884356 9289378
58146 9289378 8746349 8253536 7809793 7407222 7037855 6700061 6391640 6103550 5827282
58137E827282k64750k50717k38262k27409k13355j96719j83470j74309j64174
58128C914117j52258j42790j36021j27780j17983j10686j05898r9775r2497q7605
58118B740824q4290p8607p1568o7829o7015o4580o0472n8661n8746n6404n1804
58107B020848m9401m9495m8077m5000m4277m6017m5896m3103m1286m1039l8790
58096A528467l3848k9597k7008k3764k0366k0169k2615k3177k0946j9725k0690
58085A266562k0607j8486j7485j8723j9307j8184j8069j9957k1127k0242j9306
58074A055069j9121j7869j5555j4828j6082j6478j5089j4222j4579j3967j2023
58063H85256j1213j1876j1130q236o326p121q458q651q999j0287j0912j0282j0084
$$ plain form
58137 5827282 5562532 5311815 5073553 4846144 4632789 4436070 4252600 4078291 3914117
58128 3914117 3761859 3619069 3483048 3355268 3237285 3126599 3020701 2920926 2828429 2740824
58118 2740824 2656534 2577927 2506359 2438530 2371515 2306935 2246463 2187802 2129056 2072652 2020848
58107 2020848 1971447 1921952 1873875 1828875 1784598 1738581 1692685 1649582 1608296 1567257 1528467
58096 1528467 1494619 1465022 1438014 1414250 1393884 1373715 1351100 1327923 1306977 1287252 1266562
58085 1266562 1245955 1227469 1209984 1191261 1171954 1153770 1135701 1115744 1094617 1074375 1055069
58074 1055069 1035948 1018079 1002524 987696 971614 955136 940047 925825 911246 897279 885256
58063 885256 874043 862167 851037 842801 836475 829354 820896 812245 803246 792959 782047 771765 761681
58050G61681j0654r920p415n600n677n803m856m260m709m780m220m891o974p933
58036F73989o825o033p012p828o866n665o079p448q451r208r889r734q824q508
58022E65619q924q576p216o497o902o790n483m481m619m739m203m017m449m266
58008D84457l288k985l653l739k836k488l131l103j823r80j433j692p32L48O97
57993D53619J185K327L235L607M302N039M154J614n21j440k619m493n202l916
57979D60891k511k482k879k756k862l510l391k145j431j963k016n66P40M54k75
57964D33298o0L33j62q04o95n79j217j758j426j082j548k091k032k059k581k608
57948D12929j675j014j349j431k39J158J477J315J805K846L969N469P323Q543
$$ plain form
58050 761681 751027 741107 733692 728092 722415 716612 711756 707496 702787 698007 693787 688896 681922 673989
58036 673989 667164 661131 654119 646291 639425 633760 627681 620233 611782 602574 592685 582951 574127 565619
58022 565619 556695 548119 540903 534406 527504 520714 515231 510750 506131 501392 497189 493172 488723 484457
58008 484457 481169 478184 474531 470792 467956 465468 462337 459234 457411 456431 454998 453306 452574 452922 453619
57993 453619 454804 457131 460366 463973 468275 473314 477468 479082 478561 477121 474502 470009 464807 460891
57979 460891 458380 455898 453019 450263 447401 443891 440500 438355 436924 434961 432945 432379 433119 433573 433298
57964 433298 433238 433571 433409 432605 431910 431331 430114 428356 426930 425848 424300 422209 420177 418118 415537 412929
57948 412929 411254 410240 408891 407460 407221 408379 409856 411171 412976 415822 419791 425260 432583 441126
57934D41126Q735Q757Q908Q227O592N375M991L843J074j857l626m962o614p605
57920D72964p292p106q298r695r620q399p229o075m588l572l643l727k620r28
57906C90172J50O85J193J192J87j047j549j561j615j423p65k26m2N34J723K622
57890C90230K975L822N377O147N337M248M018L878L014K171J955J509L88l17k80
57875D34472j114l445n139m550l288l379l860k908j391j283k073j862r06r67j908
57860C96399j925o12Q62K203L990N592N663M622M268M952N320M814M285M071L449
57845D47953K206J067L50l18q64q34n23p44j517k130k307k239j812j009n36q59
57829D35884j180o30J70P2p05j042p30l63j14Ro39k290l612l208j692q02j061
$$ plain form
57934 441126 449861 458618 467526 475753 482345 487720 492711 496554 497628 495771 492145 487183 480569 472964
57920 472964 465672 458566 450268 440573 430953 422554 415325 409250 404662 401090 397447 393720 391100 390172
57906 390172 390322 391007 392200 393392 393579 392532 390983 389422 387807 386384 385619 385393 385351 385885 387608 390230
57890 390230 393205 397027 402404 408551 413888 418136 422154 426032 429046 431217 433172 434681 435069 434752 434472
57875 434472 433358 429913 424774 420224 416936 413557 409697 406789 405398 404115 402042 400180 399274 398307 396399
57860 396399 394474 393862 394724 396927 400917 406509 412172 416794 421062 426014 431334 436148 440433 444504 447953
57845 447953 450159 451226 451576 451258 450394 449560 449037 448293 446776 444646 442339 440100 438288 437279 436743 435884
57829 435884 434704 434074 434244 434316 433611 432569 431839 431476 431362 431371 430732 428442 424830 421622 419930 419128 418067
57812D18067j950l621o419r222j0304r732r077q887q215o616m882l709l105l141
57798C29187l804m190l324j705o87m65j79K61J14m08p6J372K694K990K759K734
57782C27273K923L179L705M545N382O092O730P041O724O144N928N943N509M498
57768D01616L391K399J307R5j104k351l550m118l740l057k815k832k559k048j497
57753C79137n97P11J590J493J231J653K109J575N53K69O42O07M4l04m61j140k212
57736C86900k720k364j695j045m65l47p97q62K67J711K043J426J102J227R70M39
57720C85790O06J471K053K124K287K410J756O31J80M74M83K7m8L33K36m76r14
57703C99423r43j422k344k560j751j074j246j664j853k247k878k909k118j526
$$ plain form
57812 418067 416117 412496 406077 396855 386551 376819 367742 358855 350640 344024 339142 335433 332328 329187
57798 329187 325383 321193 317869 316164 315477 315012 314833 315094 315208 314800 314724 316096 318790 321780 324539 327273
57782 327273 330196 333375 337080 341625 347007 353099 359829 366870 373594 379738 385666 391609 397118 401616
57768 401616 405007 407406 408713 408808 407704 405353 401803 397685 393945 390888 388073 385241 382682 380634 379137
57753 379137 378540 379251 380841 382334 383565 385218 387327 388902 389455 389724 390366 390973 391017 390713 390252 389112 386900
57736 386900 384180 381816 380121 379076 378611 378264 377467 376605 376872 378583 380626 382052 383154 384381 385351 385790
57720 385790 386396 387867 389920 392044 394331 396741 398497 399128 399308 399782 400265 400292 400244 400577 400813 400337 399423
57703 399423 398480 397058 394714 392154 390403 389329 388083 386419 384566 382319 379441 376532 374414 372888
57689C72888j840k519k898l083l195k959k424j962j175Q03L674O020P462R253
57675C78045J2226J5724J9112K2857K7345L2109L7162M3812N3076O4041P4051
57664G79560P9142P4183N5189K3645j2401m3246o3495p3087p4293o9538o1296
57653F14363n1992m3302l5951l0069k5278k0927j6801j3323j0727q584o516m790
57641C46103l712k983k142j114j5J069J821J845J363J090J169J011L99o8n1m3
57625C45742m63r73j226j478j955k308k247k096k187k306k151j777j306q08o78
57610C21783j331k235k162q45N00P64K58j15j84k88m26l98l87p37j395j964k143
57593C08695j887j458j370j860k456k590k532k909l445l173j997r78q02r63q00
$$ plain form
57689 372888 371048 368529 365631 362548 359353 356394 353970 352008 350833 351636 355310 361330 368792 378045
57675 378045 390271 405995 425107 447964 475309 507418 544580 588392 641468 705509 779560
57664 779560 858702 932885 988074 1011719 999318 956072 892577 819490 745197 675659 614363
57653 614363 562371 519069 483118 453049 427771 406844 390043 376720 365993 357409 350893 346103
57641 346103 342391 339408 337266 336152 336137 337206 339027 340872 342235 343325 344494 345505 345904 345836 345785 345742
57625 345742 345279 344306 343080 341602 339647 337339 335092 332996 330809 328503 326352 324575 323269 322461 321783
57610 321783 320452 318217 316055 315210 315710 316474 316732 316617 316433 316145 315719 315321 314934 314197 312802 310838 308695
57593 308695 306808 305350 303980 302120 299664 297074 294542 291633 288188 285015 283018 282040 281238 280275 279475
57578B79475m13j29O9Q1m43j331j753j332o88n23q64j523k418l112k887j790q33
57561B59586p38j080j058m72M17J305J807J681J280J240J564J740J710J881K209
57546B73072K215J897J629J231K90o87p97l18k68l91N48K285K877J676M75P40
57530B86474J572J583J110J095J273R93P06J066J494J015j60j108j512j405m73
57515B93723J211K573K757K327K234K423K439K479K701K432J261R2j75j30p18
57500C17629j473j312m92j85o53j227j691k251k477j758o42l31r77j573j541j209
57484B97837q55l49J97M29M54P63J438K071K330K095J294J82o03q33j021j482
57468C03947j701j323r65j214j592j479j195j185q91K78J602K000J710J688J899
$$ plain form
57578 279475 279062 278933 279002 279083 278640 277309 275556 274224 273536 273013 272149 270626 268208 265096 262209 260419 259586
57561 259586 258848 257768 256710 256238 256655 257960 259767 261448 262728 263968 265532 267272 268982 270863 273072
57546 273072 275287 277184 278813 280044 280334 279647 278850 278532 278264 277873 278421 280706 283583 285259 285734 286474
57530 286474 288046 289629 290739 291834 293107 294100 294806 295872 297366 298381 298221 297113 295601 294196 293723
57515 293723 294934 297507 300264 302591 304825 307248 309687 312166 314867 317299 318560 318652 318477 318347 317629
57500 317629 316156 314844 314352 314167 313514 312287 310596 308345 305868 304110 303468 303137 302160 300587 299046 297837
57484 297837 296982 296633 296830 297259 297713 298476 299914 301985 304315 306410 307704 307886 307283 306450 305429 303947
57468 303947 302246 300923 299958 298744 297152 295673 294478 293293 292402 292680 294282 296282 297992 299680 301579
57453C01579J701J402J892K907L210K498J721J556J741J966K156J954J106M02
57439C27791R63K488L432L050K224K004K397K825K915K562J916J433J438J704
57425C59142J972K441L148L375K672J799J594J493N61n34k90J211K361K541K774
57410C86260L635M223L870L317L360L576L216K452J869J532J207R79J013J226
57396D21735J534J991K420K492K334K472L044L655M116M618N123N294N196N319
57382D71343N782O149O160N971N629N011M371M214M494M613M243L572K762J890
57368E36204J262J136J191J104J313K273L287L284K608K658L699M499M405M308
57354E73231N053O140O724O803O691O289N620N233N400N570N259M872N055N754
$$ plain form
57453 301579 303280 304682 306574 309481 312691 315189 316910 318466 320207 322173 324329 326283 327389 327791
57439 327791 328754 331242 334674 337724 339948 341952 344349 347174 350089 352651 354567 356000 357438 359142
57425 359142 361114 363555 366703 370078 372750 374549 376143 377636 378197 377663 377373 378584 380945 383486 386260
57410 386260 389895 394118 397988 401305 404665 408241 411457 413909 415778 417310 418517 419496 420509 421735
57396 421735 423269 425260 427680 430172 432506 434978 438022 441677 445793 450411 455534 460828 466024 471343
57382 471343 477125 483274 489434 495405 501034 506045 510416 514630 519124 523737 527980 531552 534314 536204
57368 536204 537466 538602 539793 540897 542210 544483 547770 551054 553662 556320 560019 564518 568923 573231
57354 573231 578284 584424 591148 597951 604642 610931 616551 621784 627184 632754 638013 642885 647940 653694
57340F53694O459O857O901O648O397O510O894P140P208P326P300O768O154O363
57326G48619P305P841P504P225P873R087J0069J0585J0602R897Q731Q152Q810
57313H62300J0100J1051J1464J1639J1628J1392J1118J0919J0646J0455J0838
57302I83550J1751J2445J2607J2830J3457J3834J3462J3018J3319J4034J4379
57291A128686J4518J5193J6294J6906J6712J6411J6605J7039J7224J7274J7756
57280A310618J8844J9966K0431K0309K0360K0950K1630K2095K2949K4673K6425
57269A549250K7093K7189K8218L0221L1572L1582L1613L2798L4139L4014L2465
57258A890154L0791K9771K9364K9535L0239L1059L1817L2985L4710L6158L6668
$$ plain form
57340 653694 660153 667010 673911 680559 686956 693466 700360 707500 714708 722034 729334 736102 742256 748619
57326 748619 755924 763765 771269 778494 786367 795454 805523 816108 826710 836607 845338 853490 862300
57313 862300 872400 883451 894915 906554 918182 929574 940692 951611 962257 972712 983550
57302 983550 995301 1007746 1020353 1033183 1046640 1060474 1073936 1086954 1100273 1114307 1128686
57291 1128686 1143204 1158397 1174691 1191597 1208309 1224720 1241325 1258364 1275588 1292862 1310618
57280 1310618 1329462 1349428 1369859 1390168 1410528 1431478 1453108 1475203 1498152 1522825 1549250
57269 1549250 1576343 1603532 1631750 1661971 1693543 1725125 1756738 1789536 1823675 1857689 1890154
57258 1890154 1920945 1950716 1980080 2009615 2039854 2070913 2102730 2135715 2170425 2206583 2243251
57247B243251L6913L7864L9286M0374M1270M2673M4324M5228M5244M5238M5702
57236B707367M6237M6491M6648M6882M7150M7612M8511M9767N1368N4099N8941
57225C251073O5754P3246Q0199Q5935Q9669R0556Q8731Q5514Q2223P9281P6599
57214D148780P4113P1635O8906O6206O4427O4119O4777O5366O5184O3918O1298
57203D878729N7275N2449M7907M4541M2626M1971M2297M3360M4847M6358M7595
57192E389955M8447M8799M8460M7540M6710M6590M6868M6592M5499M4420M4102
57181E903982M4055M3122M0864L7934L5288L3360L1910L0372K8498K6734K5684
57170F281803K5131K4084K2024J9598J7702J6393J5223J4174J3649J3757J4257
$$ plain form
57247 2243251 2280164 2318028 2357314 2397688 2438958 2481631 2525955 2571183 2616427 2661665 2707367
57236 2707367 2753604 2800095 2846743 2893625 2940775 2988387 3036898 3086665 3138033 3192132 3251073
57225 3251073 3316827 3390073 3470272 3556207 3645876 3736432 3825163 3910677 3992900 4072181 4148780
57214 4148780 4222893 4294528 4363434 4429640 4494067 4558186 4622963 4688329 4753513 4817431 4878729
57203 4878729 4936004 4988453 5036360 5080901 5123527 5165498 5207795 5251155 5296002 5342360 5389955
57192 5389955 5438402 5487201 5535661 5583201 5629911 5676501 5723369 5769961 5815460 5859880 5903982
57181 5903982 5948037 5991159 6032023 6069957 6105245 6138605 6170515 6200887 6229385 6256119 6281803
57170 6281803 6306934 6331018 6353042 6372640 6390342 6406735 6421958 6436132 6449781 6463538 6477795
57159F477795J5090J6478J8534K1147K4097K6993K9309L0909L2277L3931L5730
57148F762290L7099L7619L7044L5083L1729K7627K3568J9643J5379J0621N849
57137G043551J603k051n170p029n690R27J2498K4582L0507K6312J4144N95q313
57124G126466j0559p694k167M712J3019K3102L4430M5588N5289O3099O9327P4754
57112G489366Q0775Q9278J01998J20073J44104J74105K09361K49378K95470L50882
57102I304790M19082N02676O04322P27498Q75493J050330J253268J485157J745142
57093A7967758K030091K337067K665976L018041L391347L778163M164360M527481
57085D3880284M833597N037515N087640M931771M523362L833709K870864J693146
$$ plain form
57159 6477795 6492885 6509363 6527897 6549044 6573141 6600134 6629443 6660352 6692629 6726560 6762290
57148 6762290 6799389 6837008 6874052 6909135 6940864 6968491 6992059 7011702 7027081 7037702 7043551
57137 7043551 7045154 7043103 7037933 7030904 7025214 7026141 7038639 7063221 7093728 7120040 7134184 7134779 7126466
57124 7126466 7115907 7108213 7106046 7110758 7123777 7146879 7181309 7226897 7282186 7345285 7414612 7489366
57112 7489366 7570141 7659419 7761417 7881490 8025594 8199699 8409060 8658438 8953908 9304790
57102 9304790 9723872 10226548 10830870 11558368 12433861 13484191 14737459 16222616 17967758
57093 17967758 19997849 22334916 25000892 28018933 31410280 35188443 39352803 43880284
57085 43880284 48713881 53751396 58839036 63770807 68294169 72127878 74998742 76691888
57077G6691888M02106q85276k068124l078844l882565m468417m842607n025049
57069E2843112n045747m938551m734353m457493m126684l758420l369538k977266
57061A9435060k597350k242157j919873j634622j387056j175354r96532q47281
57053F634835p23799o21505n35848m63550m02695l51659l08503k71557k39885
57044B715834k12881j89778j69752j52100j36177j21591j08482r7077q6880p6942
57034A364174o6976n7480m8467l8951k7916j5117r67J2871K2104K0822N956j9129
57022A150924m6366o8224q1036q4682q1045p3007o3483n4403m6537l9998l4586
57011D77557k9940k5923k2773k0437j8290j5954j3897j2690j2150j1840j1813
$$ plain form
57077 76691888 77093994 76208718 74140594 71061750 67179185 62710768 57868161 52843112
57069 52843112 47797365 42858814 38124461 33666968 29540284 25781864 22412326 19435060
57061 19435060 16837710 14595553 12675680 11041058 9654002 8478648 7482116 6634835
57053 6634835 5911036 5289531 4753683 4290133 3887438 3535779 3227276 2955719 2715834
57044 2715834 2502953 2313175 2143423 1991323 1855146 1733555 1625073 1527996 1441116 1364174
57034 1364174 1297198 1239718 1191251 1152300 1124384 1109267 1108300 1121171 1143275 1164097 1170053 1150924
57022 1150924 1104558 1036334 955298 870616 789571 716564 653081 598678 552141 512143 477557
57011 477557 447617 421694 398921 378484 360194 344240 330343 317653 305503 293663 281850
57000B81850j2111j2122j1427j0713j0795j1157j0567q891p096n698m364k969
56988A73940j838q30P44L131N902Q633J0849J1311Q634L043l435q808j2442j4455
56974A84379j4848j3770j1861r735p573n492l774k428j008P82K712M406N852P435
56960A35077R722J3114J7233K0722K2089K0672J6472R586O25q571j5675j9561
56948B21505k0708k0109j8411j6068j3394j0376p000l740j121J054L362N806Q057
56935A28857J0437J3717J7933K2280K6051K8694K8947K5111J6670N030p377j8147
56923B98203k5298k8028k7412k5570k3754k1863j9646j7395j5304j3199j1134
56912F9600r385p739n717l667k568k555k649k213j599j046j52J123J987K050J994
$$ plain form
57000 281850 269739 257617 246190 235477 224682 213525 202958 194067 186971 181273 176909 173940
56988 173940 172102 171272 172016 175147 181049 189682 200531 211842 220476 223519 220084 211276 198834 184379
56974 184379 169531 155761 143900 134165 126592 121100 117326 114898 113890 114672 117384 121790 127642 135077
56960 135077 144799 157913 175146 195868 217957 238629 255101 264687 265312 256741 241066 221505
56948 221505 200797 180688 162277 146209 132815 122439 115439 111699 110578 111632 114994 120800 128857
56935 128857 139294 153011 170944 193224 219275 247969 276916 302027 318697 323727 316350 298203
56923 298203 272905 244877 217465 191895 168141 146278 126632 109237 93933 80734 69600
56912 69600 60215 52476 46759 43092 40524 37969 35320 33107 31508 30462 30310 31433 33420 35470 37464
56897C7464K441L043L381L840M891O202P255Q256R686J1481J3321J5286J7442
56884A43989J8952J8275J4368P726L51n473q783j0273j0820j0224q116n404l448
56871A41120k037K43L630O690Q614J0443J3343J7014K0671K4528K9239L4510L8921
56858C46929M0485L7126K7731J3571j953j5450k5030k9973l0430k7876k4431k0920
56846B89779j6597j1174n689p69M360J0159J5641K0158K4931L1366L9100M7139
56834D48404N5514O3737O8393O4524M9796K6383p30k6051m5145n6124o0137n9496
56822E29068n5347m8058l9090l0745k3971j7809j1322m844R58O156J1287J6733
56810C33016K2836K9927L7798M5234N0112M9819M2124K6617N655j6359l4838m6637
$$ plain form
56897 37464 39905 42948 46329 50169 55060 61262 68517 76773 86459 97940 111261 126547 143989
56884 143989 162941 181216 195584 203310 203661 198188 189405 179132 168312 158088 149972 144568 141120
56871 141120 139083 139326 142956 149646 158260 168703 182046 199060 219731 244259 273498 308008 346929
56858 346929 387414 424540 452271 465842 463889 448439 423409 393436 363006 335130 310699 289779
56846 289779 273182 262008 256319 255550 259910 270069 285710 305868 330799 362165 401265 448404
56834 448404 503918 567655 636048 700572 750368 776751 776021 749970 704825 648701 588564 529068
56822 529068 473721 425663 386573 355828 331857 314048 302726 297882 298840 304996 316283 333016
56810 333016 355852 385779 423577 468811 518923 568742 610866 637483 643138 626779 591941 545304
56798E45304n0961m9483m5156m0138l4878k9248k3700j8773j4205r499m896r52
56786B23415K452N900R581J3393J7487K1805K5285K6185K3172J5801M640q283
56774C80833j9769k7257l0393l0497k8948k6604k4086k1578j8701j5385j2456
56763A25159j0656r501q005o117m613l863l585l467l255k553j315l02k62r54j622
56748F5089j996k179j999j301m45J65O19R56P52n5o32m20q3l45p13l98K24L32
56730E7571Q3R8J77j09k02O06J667J819J262J066J243R66L38J99M14J51l11J70
56712F7208J446K004J356O98Q64J212J123J076J506J918J779J305Q08K33k69l18
56696H3949j29l63r11r41l26R1o0j70R6K83K58O06J434J877J455Q45Q04J188J564
$$ plain form
56798 545304 494343 444860 399704 359566 324688 295440 271740 252967 238762 229263 224367 223415
56786 223415 225867 231767 241348 254741 272228 294033 319318 345503 368675 384476 389116 380833
56774 380833 361064 333807 303414 272917 243969 217365 193279 171701 153000 137615 125159
56763 125159 114503 105002 96997 90880 86267 82404 78819 75352 72097 69544 68229 67927 67665 66711 65089
56748 65089 63093 60914 58915 57614 57169 57334 57953 58909 59661 59606 58974 58554 58471 58126 57413 57015 57239 57571
56730 57571 57654 57752 57929 57820 57618 58224 59891 61710 62972 64038 65281 66247 66585 66784 67198 67349 67038 67208
56712 67208 68654 70658 72014 72712 73576 74788 75911 76987 78493 80411 82190 83495 84303 84536 84267 83949
56696 83949 83820 83457 82546 81605 81279 81370 81310 81140 81236 81519 81777 82383 83817 85694 87149 87994 88798 89986 91550
56677I1550J927K328K569K588K467J901N63r70j680j534j401j439q97L00J176
56662I9448J332J460J812J626P12J94P50J457J329Q22P60Q12K37o40q94m28K4
56645A10813l9n45j178j497j151m12K7O5L12Q86R75Q9j097j662j417n48Q00K003
56627A06424K026P73m92p75n92q49j315j189m69K27O73R94J018N63L8k7J79N6
56609A07263m05o00k17L50N08J38k80k29J44J29m85r26n67l3k15o41p6J398K304
56590A07560J896R89M55K64L19Q62J578J598R12M47L91q5r53q99L93J343R37M13
56572A18420J118K252K329J656J563K153K664L218M421N760O180O025O710Q503
56558A72972J0128J0600J0151R184P492M856J584j709m337n672n659n031m429
$$ plain form
56677 91550 93477 95805 98374 100962 103429 105330 105893 104923 103243 101709 100308 98869 97972 98272 99448
56662 99448 100780 102240 104052 105678 106390 106584 107334 108791 110120 110942 111702 112514 112751 112111 111217 110789 110813
56645 110813 110774 110229 109051 107554 106403 105991 106018 106083 106395 107281 108256 108345 107248 105586 104169 103621 104421 106424
56627 106424 108450 109223 108731 107956 107364 106515 105200 104011 103542 103769 104442 105436 106454 107017 107055 107028 107207 107263
56609 107263 106858 106258 106041 106391 106899 107037 106757 106528 106672 106801 106316 105390 104823 104790 104575 103934 103858 105256 107560
56590 107560 109456 110445 110900 111164 111483 112345 113923 115521 116433 116880 117271 117186 116233 115334 115727 117070 118007 118420
56572 118420 119538 121790 124119 125775 127338 129491 132155 135373 139794 145554 151734 157759 164469 172972
56558 172972 183100 193700 203851 213035 220527 225383 226967 225258 220921 215249 209590 204559 200130
56545B00130l686k639k088k920m527n222m270k648j643j445j361r18m55o92j747
56530A63869k701k497j239o2L61L68K89j32q91j280r43m94m87n82l95l09o44q96
56512A51335o66n24j004j551j383p83m88m82l87m58j033j532j086P5R54J155J135
56495A43277J238J336J261R32L29k20j86L13M74N4j79K67Q23J060J502K315K437
56478A57033J238n0MQ06P72j72p53n26k38k27k4M39N97L46K32M55O40N64L72J36
56458A61644n2R4N49P54N35N63J146J374N14o19q45l30J38O92J723K456J900O85
56440A72921K16M51K62l55l40L14L79n37j421j608j534j473j016j49M20L46k0
56423A66856m97j130j403o79N41J050P13N39Q89J089R21J093J833K333K099J609
$$ plain form
56545 200130 196444 193805 191717 188797 184270 179048 174778 172130 170487 169042 167681 166763 166308 165616 163869
56530 163869 161168 158671 157432 157370 157731 158099 158388 158256 157365 156085 155142 154648 154161 153579 153184 152875 152231 151335
56512 151335 150669 150145 149141 147590 146207 145424 144936 144454 144067 143609 142576 141044 139958 140033 140987 142142 143277
56495 143277 144515 145851 147112 148044 148373 148153 147967 148280 148754 148808 148629 148896 149719 150779 152281 154596 157033
56478 157033 158271 158221 158225 159031 159803 159631 158878 158352 158114 157887 157863 158302 158899 159245 159477 159932 160572 161136 161508 161644
56458 161644 161592 161686 162235 162989 163524 164087 165233 166607 167121 166502 165657 165327 165465 166157 167880 170336 172236 172921
56440 172921 173137 173588 173850 173495 173155 173469 173848 173311 171890 170282 168748 167275 166259 166110 166530 166876 166856
56423 166856 166359 165229 163826 163147 163688 164738 165451 165990 166879 167968 168889 169982 171815 174148 176247 177856
56407A77856J250O50l77j222j261n58M59J314J454P83J79N41J347J243R0p42l07
56390A82699Q16J616J843J791J688J622J486J001L31L09J273K136J717N71K01
56375B01100Q39J372J244R53O78Nq42r47j31P90J348J810K153J899J197P53P00
56358B14921O30P14J466K385K400J689J496K008K043J168M53O28J015R41P63Q89
56342B35609J002Q59P59P58M99J91N77J656K632L282M083M742M186K444J032R12
56326B65223J406J721K098K770L147K830K341K172K102J917J747J356K62j030
56312B90062j246k12Q01R66Q34R69J159J438K399L829M544M272M268N265O311
56297C25659O409N928N460M727L570K746K698K746K387K308L071M000M382M675
$$ plain form
56407 177856 179106 179756 179379 178157 176896 176338 176797 178111 179565 180348 180527 181068 182415 183658 183748 183006 182699
56390 182699 183515 185131 186974 188765 190453 192075 193561 194562 194893 195202 196475 198611 200328 200899 201100
56375 201100 201939 203311 204555 205508 206186 206191 205349 204402 204271 205061 206409 208219 210372 212271 213468 214221 214921
56358 214921 215551 216265 217731 220116 222516 224205 225701 227709 229752 230920 231373 232001 233016 233957 234720 235609
56342 235609 236611 237470 238229 238987 239486 239677 240254 241910 244542 247824 251907 256649 260835 263279 264311 265223
56326 265223 266629 268350 270448 273218 276365 279195 281536 283708 285810 287727 289474 290830 291092 290062
56312 290062 288816 288604 289405 290371 291205 292174 293333 294771 297170 300999 305543 309815 314083 319348 325659
56297 325659 332068 337996 343456 348183 351753 354499 357197 359943 362330 364638 367709 371709 376091 380766
56283C80766N497O415O775O864P253P849Q407R108R858R995R541R759J1459J3628
56269E03174J4700J4574J4438J5232J6992J9243K1374K3076K4817K7342L0553
56258G25515L3612L6304L9374M3413M8423N4534O1948P0005P7629Q4965R3156
56247A368878J02277J10994J18586J25616J32093J36659J38364J37666J34855
56238B505988J28953J19141J05858Q9624P0107M7306K2455k871k7513n0061o9035
56227B939952q4388r7364j08235j15762j19567j21228j21981j21058j17521j12269
56217A820579j06901j01744r6158q9788q2709p5299o8617o3640n9733n5239n0003
56206I70748m5590m2593l9691l6077l2691l0124k7399k3964k0839j8620j6339
$$ plain form
56283 380766 386263 392678 399453 406317 413570 421419 429826 438934 448792 458787 468328 478087 489546 503174
56269 503174 517874 532448 546886 562118 579110 598353 619727 642803 667620 694962 725515
56258 725515 759127 795431 834805 878218 926641 981175 1043123 1113128 1190757 1275722 1368878
56247 1368878 1471155 1582149 1700735 1826351 1958444 2095103 2233467 2371133 2505988
56238 2505988 2634941 2754082 2859940 2949564 3019671 3066977 3089432 3086561 3059048 3008987 2939952
56227 2939952 2855564 2758200 2649965 2534203 2414636 2293408 2171427 2050369 1932848 1820579
56217 1820579 1713678 1611934 1515776 1425988 1343279 1267980 1199363 1135723 1075990 1020751 970748
56206 970748 925158 882565 842874 806797 774106 743982 716583 692619 671780 653160 636821
56195F36821j3573j1626j1130j0577q718o613n608n105m064k983k688k658k227
56182E49251j957k312k483j943j586j884j704l60R47J214J318J954K057J028N06
56167E44046J897L923M802M999N758O604O636O711Q031R913J1022J1566J2370
56154F38278J3156J3686J5004J7674K0403K2392K5154K9913L5110L8933M2636
56143I12339M8705N7325O7102P7762Q9389J00315J08354J12993J13977J09289
56133A797550R7360Q0441O3345M9626M0737L7143L7510L7941L4659K6891J5739
56122B318942K080j2248k3369k8561k9508l0211l3209l9810n1516o7916q4788
56111A919886r7423j04697j07578j05723r8693q8549p7882o6744n4599m3443l5516
$$ plain form
56195 636821 623248 611622 600492 589915 581197 574584 568976 563871 559807 556824 554136 551478 549251
56182 549251 547294 544982 542499 540556 538970 537086 535382 535022 535969 537183 538501 540455 542512 543540 544046
56167 544046 545943 549866 554668 559667 565425 572029 578665 585376 593407 603320 614342 625908 638278
56154 638278 651434 665120 680124 697798 718201 740593 765747 795660 830770 869703 912339
56143 912339 961044 1018369 1085471 1163233 1252622 1352937 1461291 1574284 1688261 1797550
56133 1797550 1894910 1975351 2038696 2088322 2129059 2166202 2203712 2241653 2276312 2303203 2318942
56122 2318942 2321022 2308774 2285405 2256844 2227336 2197125 2163916 2124106 2072590 2004674 1919886
56111 1919886 1822463 1717766 1610188 1504465 1405772 1317223 1239341 1172597 1117998 1074555 1039039
56100A039039k9580k3162j6895j3002j0913q307n321l835l528k375k49J435K746
56087I26053M559N932N580M890N967P899Q392P847Q218R202R278R161J0414J1980
56073A035372J1963J1431J2484J4102J4102J3618J5153J7671J8326J7670J8363
56062A200255J9975K0073J9258J9999K1518K1057J9328J9426K1007K0984J9359
56051A422239J8949J9804J9321J7610J7360J8603J8920J8493J9660K1869K2506
56040A635334K2200K3816K6759K8038K8395L1237L6011L8937M0076M3006M7608
56029B001417M9883M9197M9067N0324N0218M8787M9347N1985N3251N2995N4875
56018B561346N9343O2880O4865O8446P3808P7478P9051Q1894Q6593R0492R3916
$$ plain form
56100 1039039 1009459 986297 969402 956400 945487 937180 931859 928024 924496 922121 921872 923307 926053
56087 926053 930612 936544 942124 947014 952981 960880 969272 977119 985337 994539 1003817 1012978 1023392 1035372
56073 1035372 1047335 1058766 1071250 1085352 1099454 1113072 1128225 1145896 1164222 1181892 1200255
56062 1200255 1220230 1240303 1259561 1279560 1301078 1322135 1341463 1360889 1381896 1402880 1422239
56051 1422239 1441188 1460992 1480313 1497923 1515283 1533886 1552806 1571299 1590959 1612828 1635334
56040 1635334 1657534 1681350 1708109 1736147 1764542 1795779 1831790 1870727 1910803 1953809 2001417
56029 2001417 2051300 2100497 2149564 2199888 2250106 2298893 2348240 2400225 2453476 2506471 2561346
56018 2561346 2620689 2683569 2748434 2816880 2890688 2968166 3047217 3129111 3215704 3306196 3400112
56007C400112R9672J06354J09768J11055J15445J22931J28630J32347J38831J48352
55997D613497J56399J63183J73645J87435J98838K07403K18487K32687K45461
55988F397035K57740K75453K97839L18270L37350L62509L93787M23657M52092
55979I515732M87391N30602N74393O19098O73823P39714Q09379Q85033R78824
55970A5813989J092922J219286J361740J536729J749617J994795K283177K643103
55962B9695358L089858L624053M264444N046208N977556P036266Q220830R566086
55954G6520659J1104243J2869679J4959919J7528634K0701243K4566368K9188913
55947B07439658L4298113L8649333L9837781L5329074K4242350Q353494q663193
$$ plain form
56007 3400112 3499784 3606138 3715906 3826961 3942406 4065337 4193967 4326314 4465145 4613497
55997 4613497 4769896 4933079 5106724 5294159 5492997 5700400 5918887 6151574 6397035
55988 6397035 6654775 6930228 7228067 7546337 7883687 8246196 8639983 9063640 9515732
55979 9515732 10003123 10533725 11108118 11727216 12401039 13140753 13950132 14835165 15813989
55970 15813989 16906911 18126197 19487937 21024666 22774283 24769078 27052255 29695358
55962 29695358 32785216 36409269 40673713 45719921 51697477 58733743 66954573 76520659
55954 76520659 87624902 100494581 115454500 132983134 153684377 178250745 207439658
55947 207439658 241737771 280387104 320224885 355553959 379796309 388149803 379486610
55940C79486610k3113274l2799248l7362385l7734678l5365783l1620822k7465151
55933A54025269k3434692j9776697j6584506j3856669j1539205r580934p952650
55926E1299916o619297n527149m629295l899122l310285k826849k422492k088859
55918A9976568j816595j586458j386147j217640j080115r61650q54425p62439
55910A0311099o87334o20938n58388n04849m62784m25334l88412l57125l34129
55901E971806l13156k90013k69078k53194k37573k19337k03097j91482j79673
55892C815203j64801j51645j43416j35583j24377j13241j05414r7900q8303q0421
55882B610102p7705p7672p7530p8819q1828q2016p6874p0450o6592o3407n8676
$$ plain form
55940 379486610 356373336 323574088 286211703 248477025 213111242 181490420 154025269
55933 154025269 130590577 110813880 94229374 80372705 68833500 59252566 51299916
55926 51299916 44680619 39153470 34524175 30625053 27314768 24487919 22065427 19976568
55918 19976568 18159973 16573515 15187368 13969728 12889613 11927963 11073538 10311099
55910 10311099 9623765 9002827 8444439 7939590 7476806 7051472 6663060 6305935 5971806
55901 5971806 5658650 5368637 5099559 4846365 4608792 4389455 4186358 3994876 3815203
55892 3815203 3650402 3498757 3355341 3219758 3095381 2982140 2876726 2778826 2690523 2610102
55882 2610102 2532397 2454725 2377195 2298376 2216548 2134532 2057658 1987208 1920616 1857209 1798533
55871A798533n4912n4378n4396n2213m9690m9024m8431m6061m3670m2695m1105
55860A261958l7636l4749l3894l2233k7550k2233j9029j6956j4660j3707j5187
55849I94124j6987j7609j8934k2145k4818k5005k4434k4687k4052k1247j8462
55838G55744j7566j6875j4792j3045j3233j3557j2176j0516j0275j0241r079q088
55826F06301q309q040o213n060o414q389q756q686r982j1446j1176j0009r610
55813D94211r395q202o827o212n312l309j617j288q05J056K700K561K059L081
55799D62701M787N554N816O388O227M458K485J611O51j600l827m644n290p073
55785D78244q430p439n386m909o276q232j0722j3925j6201j5951j4204j2811j1448
$$ plain form
55871 1798533 1743621 1689243 1634847 1582634 1532944 1483920 1435489 1389428 1345758 1303063 1261958
55860 1261958 1224322 1189573 1155679 1123446 1095896 1073663 1054634 1037678 1023018 1009311 994124
55849 994124 977137 959528 940594 918449 893631 868626 844192 819505 795453 774206 755744
55838 755744 738178 721303 706511 693466 680233 666676 654500 643984 633709 623468 614389 606301
55826 606301 597992 589952 583739 578679 572265 563876 555120 546434 536452 525006 513830 503821 494211
55813 494211 484816 476614 469787 463575 458263 454954 453337 452049 451244 452300 455000 457561 459620 462701
55799 462701 467488 473042 478858 485246 491473 495931 498416 500027 500678 499078 495251 490607 485317 478244
55785 478244 469814 462375 456989 452080 445804 437572 426850 412925 396724 380773 366569 353758 342310
55772C42310q996o381n259n032l903j944o56l37j96k35q97j629j689j579j956
55757C01621k218j808j667k614l591l294k329j922j901j701j968l257m537m873
55743B63941n188o416p383o614m902l946l756l454l352l999m400l411j927j529
55729B03664j926j811j283j305j735j901k239l301m113l553k493k471l078k798
55715A69657j665r43q04m23J50K04NL82J020R50L18Q0L46M95N27P70Q06P4r47
55696A71002j448j572j828j996j785j688j995j924j021k80n46r68m74M04P06Q47
55680A55434J593K376K351K033K190K266J558P97P93P58j08p02K14J504J271m2
55664A74286n13J52O49N69N36M69j17n63L3R16P53L3K12J109J382J102J417K041
$$ plain form
55772 342310 333314 326933 321674 316642 312739 310795 310139 309802 309606 309371 308474 306845 305156 303577 301621
55757 301621 299403 297595 295928 293314 289723 286429 284100 282178 280277 278576 276608 273351 268814 263941
55743 263941 258753 252337 244954 238340 233438 229492 225736 222282 218930 214931 210531 207120 205193 203664
55729 203664 201738 199927 198644 197339 195604 193703 191464 188163 184050 180497 178004 175533 172455 169657
55715 169657 167992 167049 166245 165822 165972 166176 166181 166563 167583 168533 168851 168931 169277 169772 170299 171069 171875 171949 171002
55696 171002 169554 167982 166154 164158 162373 160685 158690 156766 155745 155465 154919 153951 153477 153881 154587 155434
55680 155434 157027 159403 161754 163787 165977 168243 169801 170598 171391 172149 172041 171339 171553 173057 174328 174286
55664 174286 173773 173925 174574 175143 175679 176148 176031 175468 175501 176417 177170 177203 177415 178524 179906 181008 182425 184466
55646A84466J524p8j159j235j473k420l311l792m403n127n274m911m744m591l763
55631A39709k805k946l818l714k272r64o67o23k36m5l86o54n19n15r39j318j328
55614A15960j223j126q51m82k55r7j56j223l413n020m257j776J46N31K57K2l71
55597I6666p81o29j53k43q74j143q68o89o90l38K26L64K88P00J211P78l30o82
55579I2813J05R59J248J525K132K615K741K834K981L067L477M466N146M534L233
55564A33876K468J954O11j036j454r23j402l317m814m763m230m277m398l983l540
55549A00772l453l135k210j174k86P11J394Q59m40q16O9O29J01j45R43K196K072
55532I8087R09m8n23q35q42m75l52p71r99n89l15q70j626j790j751k163k590k288
$$ plain form
55646 184466 185990 185912 184753 183518 182045 179625 176314 172522 168119 162992 157718 152807 148063 143472 139709
55631 139709 136904 133958 130140 126426 124154 123190 122523 121900 121664 121619 121233 120579 120060 119545 118606 117288 115960
55614 115960 114737 113611 112760 112278 112023 111926 111770 110547 107134 102114 97857 96081 96227 96758 97015 97037 96666
55597 96666 95885 95256 95103 94860 93986 92843 91975 91286 90596 90258 90484 90848 91136 91836 93047 93825 93495 92813
55579 92813 92918 93877 95125 96650 98782 101397 104138 106972 109953 113020 116497 120963 126109 130643 133876
55564 133876 136344 138298 138909 137873 136419 135496 134094 130777 125963 121200 116970 112693 108295 104312 100772
55549 100772 97319 94184 91974 90800 90514 91225 92619 93478 93038 92222 92291 92920 93021 92876 93819 96015 98087
55532 98087 98996 98948 98425 97590 96748 96273 95921 95150 94151 93562 93247 92377 90751 88961 87210 85047 82457 80169
55514H0169j612j434j669j500p69j70k01o39r43p66k23J63Mm19o07o23p47o71
55496F7343J5P24N13k05p8R35J268K12r27q80j64J29J6N7J11j51l20J05P15P15
55476G0133Q7n01n31J38J346K518K862K105O05j195k841l471k457n90M70J63n76
55459F8265j008j353j605j130J5P58O95P53J423J759J074K49K11L85o5n72j89
55442F9665N72M99l33p41l08K55M28M38N65P60R85J216J241R07M58J82N8P7L90
55423G7314P62N31l56r55n85J32K42j50k84j3J52j6k77n10p83r99j008r39r33
55404G1325p59j83M78N91j1p73r05r7J076J527P51n35j227j066n37J51J059J689
55386G2554J318K99j43K90M81l51j467j770j246o16k65j98l34m20j23L58M57J84
$$ plain form
55514 80169 78557 77123 75454 73954 73185 73015 72814 72175 71232 70466 70243 70406 70410 69991 69384 68761 68014 67343
55496 67343 67358 68082 68595 68390 68312 69247 70515 70727 69800 68920 68756 68885 68901 68958 69069 68918 68598 68703 69418 70133
55476 70133 70220 69719 69188 69326 70672 73190 76052 78157 78762 77567 74726 71255 68798 68208 68678 68841 68265
55459 68265 67257 65904 64299 63169 63184 63942 64637 65390 66813 68572 69646 69895 70106 70491 70426 69854 69665
55442 69665 70237 70736 70403 69662 69354 69609 70037 70475 71040 71800 72785 74001 75242 76149 76607 76789 76847 76924 77314
55423 77314 78076 78607 78251 77296 76711 76843 77085 76935 76651 76638 76790 76774 76497 75987 75204 74205 73197 72258 71325
55404 71325 70566 70383 70861 71452 71441 70668 69763 69666 70742 72269 73020 72485 71258 70192 69655 69806 70865 72554
55386 72554 73872 74171 74028 74318 74799 74448 72981 71211 69965 69349 69084 68886 68552 68132 68009 68367 68824 69008
55368F9008J62M95N29k5o49j074j649k315k305j427n40j37L65J290J787J160O4
55351F4739m78m39k90k1M36O25L01L7K79N49L65J52L77N96K56k37j94K25M21L09
55331F8008O5m29j093j286o90N5L34M09N89M76j56o05l68j38o11j127o78M86J419
55312F4660J944K347K200R65p10j550j349q99n68p1N57Q99R88J179J330J005L67
55295G3294Ml1j81n31p74q36q26o05q2L11J95q3J7L17L29R9k0q1k14n0O63J306
55273G2221J097K66l45m86n23n24k74J36M25O63R33Q39M8r93j593j654j382o74
55255F8180L93J092Q83K96O9k2n37j133j034l50J05R3L2J05J59K72N75P39M31
55236G0348j02n34r95j434j163pQ82M66n59q35l08R2J92N13R69J023Q67J078J407
$$ plain form
55368 69008 69170 69665 70194 70169 69520 68446 66797 64482 62177 60750 60210 60073 60438 61728 63515 64675 64739
55351 64739 64261 63822 63532 63511 63947 64572 64873 64910 65189 65738 66103 66255 66632 67228 67484 67247 67053 67278 67699 68008
55331 68008 68073 67644 66551 65265 64575 64630 64964 65373 65962 66438 66282 65677 65309 65171 64560 63433 62755 63241 64660
55312 64660 66604 68951 71151 72116 71406 69856 68507 67608 67040 66969 67526 68425 69413 70592 71922 72927 73294
55295 73294 73298 73267 73086 72555 71781 70945 70119 69514 69432 69743 69938 69855 69872 70189 70518 70617 70597 70516 70302 70252 70915 72221
55273 72221 73318 73584 73239 72753 72230 71706 71432 71568 71993 72656 73589 74428 74476 73483 71890 70236 68854 68180
55255 68180 68573 69665 70548 70844 70913 70891 70354 69221 68187 67837 67942 68035 68067 68172 68331 68603 69178 69917 70348
55236 70348 70246 69712 68717 67283 66120 66113 66995 67461 66902 66067 65759 65851 66043 66556 67525 68548 69415 70493 71900
55217G1900J216P82P40O87j42j071o88Q26J740J334O42M60K65l63q25o21j54J73
55199G6901N69J032R89K65m96p55o47l11L24R08P34k66j386k174k669k572j337
55182F9109O31J999K092J588J327J337J357J333J141O11R3K07P76R44M47j09m05
55165H4478q13j449j793j594j145n43M30J402J490O03k68l77NL85O21M94k78j305
55147H0343j724j458j282j473j401p37k1K99L80K69j94n30L5J113J368O34L38
55130G5959J164J851J190j18p53p53r08j145q57k04J53J68K82N50P58J046J576
55113G9959J948J711J079M93j20q93j311p75M08J267J246M96n48j373j461p78
55097H1348P0N39P51J070J412J462J232R51P12N59N43M98J10m84p28n13m55q98
$$ plain form
55217 71900 73116 73898 74638 75325 75183 74112 73424 74250 75990 77324 77966 78426 78691 78328 77503 76882 76728 76901
55199 76901 77470 78502 79491 79756 79260 78505 77858 77547 77871 78779 79513 79247 77861 75687 73018 70446 69109
55182 69109 69740 71739 73831 75419 76746 78083 79440 80773 81914 82525 82618 82825 83601 84545 84992 84883 84478
55165 84478 83665 82216 80423 78829 77684 77141 77571 78973 80463 81066 80798 80421 80426 80811 81432 81926 81648 80343
55147 80343 78619 77161 75879 74406 73005 72268 72247 72546 72926 73195 73001 72471 72506 73619 74987 75621 75959
55130 75959 77123 78974 80164 80046 79293 78540 77632 76487 75630 75426 75579 75747 76029 76579 77337 78383 79959
55113 79959 81907 83618 84697 85190 85070 84177 82866 82091 82499 83766 85012 85508 84960 83587 82126 81348
55097 81348 81418 81957 82708 83778 85190 86652 87884 88835 89547 90106 90649 91147 91257 90773 90045 89532 89077 88179
55079H8179j277r07K5P72R11N32q5n64n82k05K02N20Q88J120P59q0o22m75o9J36
55059H9178J97J52k06o67n36K42P56M17j58j82J66L09J98N6k25o49p38k68J44
55040H8186j5k90k7M78M93j1m87p48r19q43l20K52K70j43k98P2N31O35M23K52
55020H7491M53J018J427J075J12n47l04L65O60M17J6k89m32l41j01j6j79l44m27
55001I0054o59r17o13L93J331J477J107R15J007R94P21L93K31L71P47R12M32l75
54983I8521o91l52kO2L00Q48J023M79j44l44n39j019j123l79M64N14J28J47M98
54964I8391O01N19O22P13M90L75P98J237J054O62P33Q21J07r89j351r79p79q43
54946A02182m69J60qj065j752j319m73j9J93M94N94K79%J42L97L99L98Q01J504
$$ plain form
55079 88179 86902 85995 86020 86792 87703 88235 88150 87586 87004 86799 87001 87521 88409 89529 90288 90208 89586 89111 89042 89178
55059 89178 89375 89527 89321 88654 88118 88360 89116 89533 89375 89193 89359 89668 89866 89922 89697 89048 88310 88042 88186
55040 88186 88171 87881 87854 88332 88825 88814 88327 87579 86660 85817 85497 85749 86019 85876 85578 85650 86181 86816 87239 87491
55020 87491 87944 88962 90389 91464 91576 91029 90725 91090 91750 92167 92183 91894 91462 91121 91020 91004 90825 90481 90054
55001 90054 89395 88478 87865 88258 89589 91066 92173 93088 94095 95089 95810 96203 96434 96805 97552 98464 98896 98521
54983 98521 97830 97478 97476 97538 97838 98686 99709 100188 100044 99700 99161 98142 97019 96640 97104 97618 97746 97893 98391
54964 98391 98992 99511 100133 100846 101336 101711 102509 103746 104800 105462 106195 107016 107123 106134 104783 103804 103025 102182
54946 102182 101713 101873 101865 100800 99048 97729 97256 97237 97430 97924 98518 98797 98797 98939 99336 99735 100133 100934 102438
54927A02438K129K560K866L076L237L415L548L571L737M387N452O532P376P803
54913A62127P337N584K983M99j485l327n174o556p125p096o719n973m973m187
54899A25915l780l319k420j374p51o41o54n60n66q86j179o95P65K217K381J233
54883A15686J47J62Q63J406J911K924M163M894N279O145P423P951P144N798M845
54868A76741M114K865R30j220l222n080o831q257q877q284o678m973m021l687
54854A23520l126j975q93p81j778l158l984l791k822j672p44j60j12q00j837k306
54838I3581j814j019o56m67J72J069J471J220Q38N70J88k83m42k11M3J26J61Q8
54820I4635l00p54o81PO94Q70O35K58j63m42k02O55J650K161J978J351P22M04
$$ plain form
54927 102438 104567 107127 109993 113069 116306 119721 123269 126840 130577 134964 140416 146948 154324 162127
54913 162127 169464 175048 178031 178530 177045 173718 168544 161988 154863 147767 141048 135075 130102 125915
54899 125915 122135 118816 116396 115022 114271 113630 112976 112416 111850 110964 109785 109090 109855 112072 114453 115686
54883 115686 115833 115995 116858 118264 120175 123099 127262 132156 137435 143580 151003 158954 166098 171896 176741
54868 176741 180855 183720 184650 183430 180208 175128 168297 160040 151163 142879 136201 131228 127207 123520
54854 123520 120394 118419 117526 116745 114967 111809 107825 104034 101212 99540 98796 98636 98524 97724 95887 93581
54838 93581 91767 90748 90092 89625 89797 90866 92337 93557 94395 94965 95153 94870 94428 94217 94260 94386 94547 94635
54820 94635 94335 93581 92900 92907 93601 94471 95106 95364 95201 94759 94557 95212 96862 99023 101001 102352 103074 103478
54802A03478L64L66L66N74R55J078P18K06j48n01r38r97l55M96Q59P44N63L29
54784A08157r9l97k20J39K73M07Q32J059N10k60j21J118K655L890M645M540L447
54767A30575K315K358L431M380M912N772P109P999P801O726M979K573J69j368
54753A89731k399m085o245p285o735o129o518o822n784m112l171k721j578J17
54739A26264R48L03q73j460j251o89k39j44k75k05K84R16J299J312R81N32O29
54722A28332J893L876N275N532N455N827O252N974M978L593J784l65k140l098
54708A73168l818m885n687n346m319l980m701n442n254m256l005j760p02k01m70
54693A19342j227j910k162k030j844j809j677j017J13J079J373J102O43K44P0
$$ plain form
54802 103478 103842 104208 104574 105148 106103 107181 107899 108105 107957 107456 106518 105521 105166 105662 106521 107265 107828 108157
54784 108157 108058 107661 107441 107580 107853 108260 109092 110151 110661 110401 110280 111398 114053 117943 122588 127128 130575
54767 130575 132890 135248 138679 143059 147971 153743 160852 168851 176652 183378 188357 190930 191099 189731
54753 189731 187332 183247 177002 169717 162982 156853 150335 143513 137729 133617 130446 127725 126147 126264
54739 126264 127212 127515 126642 125182 123931 123242 123003 122859 122584 122379 122663 123579 124878 126190 127171 127703 128332
54722 128332 130225 134101 139376 144908 150363 156190 162442 168416 173394 176987 178771 178406 176266 173168
54708 173168 169350 164465 158778 153432 149113 145133 140432 134990 129736 125480 122475 120715 120013 119812 119342
54693 119342 118115 116205 114043 112013 110169 108360 106683 105666 105779 106858 108231 109333 109976 110220 110290
54678A10290K24M44K52l80r21j057j045j105j062q09n83m23m3M20L28m11r26o25
54660A02568n6P2j3J75L63Q2k71L1P99J158Q19L28J48K20L13J78l98j114j098
54641A04304K4J259J283R5j099j471j227q21l73J9J36j9j96l01l70k28L43J109
54623A02467J605J700J583J242N69j85n83n96n45m80j24N23J004R42M11j99m95
54606A08839l63j18k09o07p84m91q4J54M88J027J217O37j47l54j62l27q96j202
54588A06618r05k84L40P48O02j12o60m15J02l8o17n45L77J108R92N54L52Q4n85
54569A07716j227j309r75o08j61M85R73R07N54N48J082J771K131J907J124J05
54553A15023o46q00m00K54Q08R60O85L34K41K92J55j40k31O7O21J243J650J388
$$ plain form
54678 110290 110514 110958 111210 110830 109909 108852 107807 106702 105640 104831 104248 103825 103782 104202 104530 104119 103193 102568
54660 102568 102512 102584 102571 102746 103109 103191 102920 102951 103750 104908 105727 106055 106203 106423 106736 106914 106516 105402 104304
54641 104304 104328 105587 106870 106965 105866 104395 103168 102347 101974 101993 102129 102110 101914 101613 101243 101015 101358 102467
54623 102467 104072 105772 107355 108597 109166 108981 108398 107802 107257 106777 106653 107176 108180 109122 109533 109334 108839
54606 108839 108476 108358 108149 107542 106758 106267 106183 106337 106825 107852 109069 109706 109559 109205 109043 108716 107820 106618
54588 106618 105713 105429 105769 106517 107119 107007 106347 105932 106034 105996 105379 104834 105211 106319 107311 107865 108217 108301 107716
54569 107716 106489 105180 104205 103597 103436 103921 104894 105801 106355 106903 107985 109756 111887 113794 114918 115023
54553 115023 114377 113577 113177 113431 114239 115199 115884 116218 116459 116751 116906 116766 116535 116602 117223 118466 120116 121504
54535A21504L74o53q76n25m48o86m52L25N55m07j668k047j663j415j448j082R
54518A09397J357K345K596J886L71j154j837j683j354j162q97n94o43r08n34P89
54502A07975K033J982Q21j22r8L86O07N38L69j01r54j492r26L70J116P82K49M85
54484A14020J212J430R19M51N85Q75N79k29o05J42J535K338J895Q78M29P99J185
54467A28438R19K66j35j46r1j99m49p72r83p45O8J003J390R91J15p53j224j110
54449A26583n19J33M40K51l54j101j536j385r76q72r56n07N50J210P24k47n46
54432A20892p2L31J61l69r61j376j109J52J717K327J619N03JK90R54J512J544
54415A28116Q57j72q66r38o39k26J89L77J75o0J58N83M61k47o10JJ059J680J677
$$ plain form
54535 121504 121878 121225 120349 119824 119376 118690 118238 118563 119118 118711 117043 114996 113333 111918 110470 109388 109397
54518 109397 110754 113099 115695 117581 117952 116798 114961 113278 111924 110762 109865 109271 108628 107720 107186 107975
54502 107975 110008 111990 112811 112689 112591 112977 113584 114122 114491 114390 113436 111944 111018 111388 112504 113286 113535 114020
54484 114020 115232 116662 117581 118032 118617 119492 120071 119842 119237 119379 120914 123252 125147 126025 126454 127253 128438
54467 128438 129357 129623 129488 129342 129251 129052 128603 127831 126848 126103 126171 127174 128564 129555 129670 128917 127693 126583
54449 126583 126064 126197 126637 126888 126534 125433 123897 122512 121536 120664 119708 119201 119751 120961 121685 121438 120892
54432 120892 120820 121151 121312 120943 119982 118606 117497 117649 119366 121693 123312 123815 123816 124106 125060 126572 128116
54415 128116 128973 128801 127935 126997 126358 126132 126321 126698 126873 126813 126971 127554 128015 127768 127158 127159 128218 129898 131575
54396A31575J372R60N30L60O05R33R01N70L28K76J84m9j80L1M77P22L85m27j054
54377A38499q85o5N60L62l43o35l2R60J444J243J239K249L759M281L207J656J098
54360A58597J606K058J719R02K16j44l37n99j115j753k059j872j726k139k781
54345A50573k959k656k394k238j809j181q46p53l28M10O39K4o68o45o4M39N73
54328A36117L37j73n56k49O66J328J186O78M48M89M32J95j78p80j488j785j422
54311A35245q52n70m52j52K59N09N48L51k71j136j513j026l24j81m48n03l39l64
54293A28781l66K93J451K017J384K58k63jL18J20l96o11k39L67N91J68n76j063
54275A32233q89n5R92J542J212M52J23M60P85N31P3K36J140J988J901Q40l59p50
$$ plain form
54396 131575 132947 133907 134437 134797 135402 136335 137236 137806 138134 138410 138594 138545 138365 138396 138873 139595 139980 139553 138499
54377 138499 137614 137549 138109 138471 138128 137493 137461 138421 139865 141108 142347 144596 148355 152636 155843 157499 158597
54360 158597 160203 162261 163980 164882 165098 164954 164617 164018 162903 161150 159091 157219 155493 153354 150573
54345 150573 147614 144958 142564 140326 138517 137336 136490 135737 135409 135819 136458 136482 135814 135169 135105 135544 136117
54328 136117 136454 136281 135725 135476 136142 137470 138656 139334 139782 140271 140703 140898 140720 139940 138452 136667 135245
54311 135245 134393 133823 133371 133219 133478 133987 134535 134886 134615 133479 131966 130940 130616 130435 129987 129484 129145 128781
54293 128781 128415 128708 130159 132176 133560 133818 133555 133554 133872 133992 133596 132985 132746 133113 133704 133872 133296 132233
54275 132233 131344 131289 132281 133823 135035 135487 135610 136070 136855 137386 137459 137695 138835 140823 142724 143564 143205 142455
54257A42455j81N40O24L14M93J321J889J419K38p90j261j219o86J80P83O18q1
54240A46656o46q28q59q31o14l23l44p19r31n19L39R76R30L80l9R9N77P76M21
54221A44501j24l05J5M92O63L23l05p39p30n55n44n08n1N63N24l54j217j216n13
54202A39920J32L87M88O73R28J162J266J142Q33M91Q6n34j211j471j189q03o71
54185A41629o03l24Q3M70Q88J228J076L97j56r3K27K68J99N07J073J328J081N89
54167A49867L4m22m00K44Q53O23k78q67o81k33j05k55l99n16o88p74o12l04j02
54148A44985o7K1L50P05N41l49j308j436p78k74l88m34J99R47Q99K46r5M6n6o61
54128A43093j055o11L12R61J107J031R79R35P79M02j41n35m16K56J126J757J948
$$ plain form
54257 142455 142274 142814 143438 143752 144245 145566 147455 148874 149112 148322 147061 145842 145156 145336 146119 146737 146656
54240 146656 146010 145182 144323 143492 142878 142555 142211 141492 140561 140042 140381 141357 142287 142667 142628 142727 143304 144080 144501
54221 144501 144377 144072 144087 144579 145242 145565 145260 144521 143791 143236 142692 142184 142133 142696 143220 142866 141649 140433 139920
54202 139920 140052 140439 140927 141600 142528 143690 144956 146098 146931 147422 147508 146974 145763 144292 143103 142300 141629
54185 141629 141026 140702 140785 141255 142143 143371 144447 144844 144688 144595 144822 145090 145289 145796 146869 148197 149278 149867
54167 149867 149901 149479 149079 149323 150176 150799 150521 149654 148973 148740 148635 148380 147981 147465 146777 146003 145391 145087 144985
54148 144985 144918 144939 145289 145994 146535 146186 144878 143442 142664 142390 142002 141568 141767 142714 143613 143859 143764 143810 143754 143093
54128 143093 142038 141427 141739 142700 143807 144838 145817 146752 147531 147933 147792 147257 146841 147097 148223 149980 151928
54111A51928J812J660J687J724J399O57j31o00p03n09n6M71Q67J341K364L857
54095A67768N086N556N430M810L401J292p56k321l805n240n613m296k335j151
54081A67826o89j21L77P4n78l87N59J036R05J387K812L863L757L554M334N375
54065A94084N266L829J884m2j743k731k752k417k388k385j834j091r75j387j367
54050A83951m88O85J571K224K907L553L943L998L840L751M055M733N280N259M973
54035B34235N149O006O928P178O650N824N186M877M791M759M549L799K337O33
54021C02901l94l39K23M55K43o2m97j492l014m411n147n257n003m736m962n887
54005B62621o746o406m857l347k816k917k957k954l163l292k951k415k237k461
$$ plain form
54111 151928 153740 155400 157087 158811 160210 160867 160736 160136 159433 158924 158868 159339 160206 161547 163911 167768
54095 167768 172854 178410 183840 188650 192051 193343 192587 190266 186461 181221 175608 171312 168977 167826
54081 167826 167137 167016 167393 167467 166889 166502 167061 168097 169002 170389 173201 177064 180821 184375 188709 194084
54065 194084 199350 203179 205063 205021 203278 200547 197795 195378 192990 190605 188771 187680 186705 185318 183951
54050 183951 183463 184148 185719 187943 190850 194403 198346 202344 206184 209935 213990 218723 224003 229262 234235
54035 234235 239384 245390 252318 259496 266146 271970 277156 282033 286824 291583 296132 299931 302268 302901
54021 302901 302507 302168 302391 302846 303089 303027 302530 301038 298024 293613 288466 283209 278206 273470 268508 262621
54005 262621 255875 249469 244612 241265 238449 235532 232575 229621 226458 223166 220215 217800 215563 213102
53991B13102k726k851k778k316j516r16q19p67k59L52L89o9m21n97j027j603j576
53974A93602o86K96N17M7l46j59M45J002J371J881K847L982M646M755M992N882
53958B25074P118Q211R244J0230J0234Q031L740j000m553o353o572n590m109k952
53944B50753k290j521k87R36J591J869K242K630K695K640K973L615L923L696L501
53929B78966L735L983L781L507L929N024N932O140O082O284O544O458O351O956
53915C53672Q176R006Q837Q213P901P729P019N762M665L964K992J209q36k130
53901D26179k520k870l753m576m392l370k864l860n800p248p569p492q032r276
53887C52557j0374j0527r768q813q240p859p057n717m553m210m401m292l623k935
$$ plain form
53991 213102 210376 207525 204747 202431 200915 199999 199180 198413 198154 198506 198895 198826 198405 197808 196781 195178 193602
53974 193602 192916 193212 193729 193776 193430 193271 193716 194718 196089 197970 200817 204799 209445 214200 219192 225074
53958 225074 232192 240403 249647 259877 270111 278142 281882 280882 276329 269976 263404 257814 253705 250753
53944 250753 248463 246942 246655 247591 249182 251051 253293 255923 258618 261258 264231 267846 271769 275465 278966
53929 278966 282701 286684 290465 293972 297901 302925 308857 314997 321079 327363 333907 340365 346716 353672
53915 353672 361848 370854 379691 387904 395805 403534 410553 416315 420980 424944 427936 429145 428309 426179
53901 426179 423659 420789 417036 412460 408068 404698 401834 397974 392174 384926 377357 369865 361833 352557
53887 352557 342183 331656 321888 313075 304835 296976 289919 284202 279649 275439 271038 266746 263123 260188
53873B60188k712k854l043l154l119k856k513k404k531k535k332k297k588k749
53859B22501k375j762j500j683j950j991j733j208o13k70k89m87q16j430k069
53844B02325j970r04J87K60m52q98p32n46o72o42o5O80R76P51M36M52Q87J424
53826B01497J534R98L21K45Q76J606J869J604J020L70N0L66J110J716J965K107
53810B19254K243K153J890J942K526L262L882M704N920O935P009O265N454N023
53796B78462M927N090N375N272M302K810J668J227J097J064J368J837J613K77
53782C16389j326k094k115k355l209m156m763n235n785o189o264o215o166n848
53768B54669n156m558m427m405l955l248k911k975k782j942q58j79j77p48j611
$$ plain form
53873 260188 257476 254622 251579 248425 245306 242450 239937 237533 235002 232467 230135 227838 225250 222501
53859 222501 220126 218364 216864 215181 213231 211240 209507 208299 207686 207416 207127 206640 205824 204394 202325
53844 202325 200355 199451 199638 199898 199446 198548 197816 197270 196598 195956 195891 196571 197547 198298 198734 199186 200073 201497
53826 201497 203031 204029 204350 204595 205471 207077 208946 210550 211570 211940 211990 212356 213466 215182 217147 219254
53810 219254 221497 223650 225540 227482 230008 233270 237152 241856 247776 254711 261720 267985 273439 278462
53796 278462 283389 288479 293854 299126 303428 306238 307906 309133 310230 311294 312662 314499 316112 316389
53782 316389 315063 312969 310854 308499 305290 301134 296371 291136 285351 279162 272898 266683 260517 254669
53768 254669 249513 244955 240528 236123 232168 228920 226009 223034 220252 218310 217452 217273 217096 216348 214737
53753B14737k308k447k122j812j755j693j355q61m64k11m6L4O1J19J76J24J10
53736B00287M33J026J398J285R60O99L56j77n59m48n3J93K83M97Q43J113J303
53719B09439J530J661J499J260J353J684J695J186O39O04J100J741K191K331K252
53704B32165K218K468K947L341L449L309L028K693K501K702L272L775L700K864
53690B74432J559L38l46m27k18p5j12k79m92o22n81n71r37j587j890j492r29r08
53672B64863j209r84q6O48N82R8j19J5J50J74J19j69p54j157q06R7O89N27Q8k3
53652B62743J06j4m31o76m03K01P26R69R77Q47P03P05R50J340J644J729J723J931
53634B75770K528L268L598L236K582K295K499K768K887L175L810M362M442M369
$$ plain form
53753 214737 212429 209982 207860 206048 204293 202600 201245 200384 199920 199709 199663 199697 199758 199877 200053 200177 200287
53736 200287 200720 201746 203144 204429 205389 206088 206444 206267 205708 205260 205207 205400 205683 206180 207023 208136 209439
53719 209439 210969 212630 214129 215389 216742 218426 220121 221307 221946 222550 223650 225391 227582 229913 232165
53704 232165 234383 236851 239798 243139 246588 249897 252925 255618 258119 260821 264093 267868 271568 274432
53690 274432 275991 276329 275983 275556 275338 275263 275151 274872 274380 273758 273177 272606 271669 270082 268192 266700 265771 264863
53672 264863 263654 262670 262584 263232 263814 263912 263793 263808 263958 264132 264251 264082 263328 262171 261365 261462 262151 262678 262766 262743
53652 262743 262849 262835 262404 261728 261325 261526 262252 263221 264198 265045 265748 266453 267403 268743 270387 272116 273839 275770
53634 275770 278298 281566 285164 288400 290982 293277 295776 298544 301431 304606 308416 312778 317220 321589
53620C21589M590M745M056K543J150O26R22J722K792L659L741L186K907L413M153
53605C65794M403M103L445K367J106N63J214K168K202J367O49L51j47j024j497
53590C87064r84k1M40R0o54j225j370j283j407j885k284k191j892j936k208k122
53574C66132j684j556j992k453k564k638k859k683j588L7J333J896J814J164J62
53559C52521n24l29L57M97k79j146j063j2J012J148N94K61O36J265J482J417J815
53542C59652K882L855L916L242K766L192M403N712O399O222N636N434O018P057
53528D26386P947Q442Q731R098R726J0606J1450J1883J1930J2146J2986J4191
53516E55522J5111J5588J6139J7225J8674J9939K0751K1299K1929K2745K3535
$$ plain form
53620 321589 326179 330924 334980 337523 338673 339299 340221 341943 344735 348394 352135 355321 358228 361641 365794
53605 365794 370197 374300 377745 380112 381218 381781 382995 385163 387365 388732 389381 389732 389585 388561 387064
53590 387064 386080 386059 386499 386589 385935 384710 383340 382057 380650 378765 376481 374290 372398 370462 368254 366132
53574 366132 364448 362892 360900 358447 355883 353245 350386 347703 346115 346152 347485 349381 351195 352359 352521
53559 352521 351997 351668 352025 352522 352243 351097 350034 350022 351034 352182 352776 353037 353673 354938 356420 357837 359652
53542 359652 362534 366389 370305 373547 376313 379505 383908 389620 396019 402241 407877 413311 419329 426386
53528 426386 434333 442775 451506 460604 470330 480936 492386 504269 516199 528345 541331 555522
53516 555522 570633 586221 602360 619585 638259 658198 678949 700248 722177 744922 768457
53505G68457K3947K3725K2910K1824K0826K0040J9317J8516J7754J7314J7300
53494I91930J7431J7278J6636J5701J4935J4754J5199J5841J6101J5773J5107
53483A166686J4458J4017J3907J4197J4627J4625J3834J2493J1054R613P975O102
53471A313588M138K069k92k992n841q551j0826j2435j3383j3881j4011j3657j3069
53458A210857j3031j3992j5349j6234j6781j7849j9483k0528k0051j8507j7075
53447A021977j6344j6080j5886j5586j5110j4395j3354j1784r487o567l588j342
53435H82454m06p90j682j816n65J326K588K938L279M336N828P198Q437R705J0849
53420I33679J1816J3098J5071J7238J8811J9850K1104K2783K4205K4813K4984
$$ plain form
53505 768457 792404 816129 839039 860863 881689 901729 921046 939562 957316 974630 991930
53494 991930 1009361 1026639 1043275 1058976 1073911 1088665 1103864 1119705 1135806 1151579 1166686
53483 1166686 1181144 1195161 1209068 1223265 1237892 1252517 1266351 1278844 1289898 1299511 1307486 1313588
53471 1313588 1317726 1319795 1319503 1316511 1310670 1302119 1291293 1278858 1265475 1251594 1237583 1223926 1210857
53458 1210857 1197826 1183834 1168485 1152251 1135470 1117621 1098138 1077610 1057559 1039052 1021977
53447 1021977 1005633 989553 973667 958081 942971 928576 915222 903438 893951 887384 883796 882454
53435 882454 882048 881258 879576 877760 877195 878521 881109 884047 887326 891662 897490 904688 913125 922830 933679
53420 933679 945495 958593 973664 990902 1009713 1029563 1050667 1073450 1097655 1122468 1147452
53409A147452K5532K6786K8476L0252L2012L3715L5201L6317L7215L8391M0282
53398A511631M2801M5328M7246M8351M8845M9066M9327M9810N0391N0653N0191
53387B043640M8959M7302M5619M4018M2284M0248L8088L6052L3871L0863K6835
53376B477779K2540J8733J5109J0801N792J019l015p018j1937j7891k4378l0970
53364B456564l7196m2285m5665m7617m8805m9389m9100m8160m7402m7251m7119
53353A946575m6101m4057m1655l9483l7565l5758l4300l3644l3907l4726l5575
53342A529804l5917l5130l2914k9966k7610k6335k5179k3159k0760j9107j8045
53331A235682j6222j3201j0355r220r794j1004j2079j2789j2948j2508j1936j1766
$$ plain form
53409 1147452 1172984 1199770 1228246 1258498 1290510 1324225 1359426 1395743 1432958 1471349 1511631
53398 1511631 1554432 1599760 1647006 1695357 1744202 1793268 1842595 1892405 1942796 1993449 2043640
53387 2043640 2092599 2139901 2185520 2229538 2271822 2312070 2350158 2386210 2420081 2450944 2477779
53376 2477779 2500319 2519052 2534161 2544962 2550754 2551773 2548758 2541740 2529803 2511912 2487534 2456564
53364 2456564 2419368 2377083 2331418 2283801 2234996 2185607 2136507 2088347 2040945 1993694 1946575
53353 1946575 1900474 1856417 1814762 1775279 1737714 1701956 1667656 1634012 1600105 1565379 1529804
53342 1529804 1493887 1458757 1425843 1395877 1368267 1341932 1316753 1293594 1272834 1253727 1235682
53331 1235682 1219460 1206259 1195904 1186684 1176890 1165886 1153807 1141018 1128070 1115562 1103626 1091860
53319A091860j1836j1479j0408r045p970p300o640n479l663j601J68J479K499
53306A020585L278L819M526N938P906R621J0720J1766J3389J5475J7554J9396
53294A143973K0887K1813K2269K2793K3633K4287K4180K3348K2069K0355J8351
53283A387958J6687J5755J5004J3545J1183Q263M927J157k638n773p968r420j0488
53270A438192j1640j3358j5644j7931j9940k2068k4424k6159k6537k6121k5932
53259A208438k5928k5421k4684k4779k5810k6536k6065k4908k3999k3527k3126
53248I33655k2528k1631k0521j9720j9825k0618k1055k0445j9157j7951j7153
53237G13051j6722j6567j6433j5891j4784j3359j1767r882p810o140n371n404
$$ plain form
53319 1091860 1080024 1068545 1058137 1049092 1041122 1033822 1027182 1021703 1018040 1016439 1016607 1018086 1020585
53306 1020585 1023863 1027682 1032208 1038146 1046052 1055673 1066393 1078159 1091548 1107023 1124577 1143973
53294 1143973 1164860 1186673 1208942 1231735 1255368 1279655 1303835 1327183 1349252 1369607 1387958
53283 1387958 1404645 1420400 1435404 1448949 1460132 1468395 1473322 1474479 1471841 1466068 1458100 1448680 1438192
53270 1438192 1426552 1413194 1397550 1379619 1359679 1337611 1313187 1287028 1260491 1234370 1208438
53259 1208438 1182510 1157089 1132405 1107626 1081816 1055280 1029215 1004307 980308 956781 933655
53248 933655 911127 889496 868975 849255 829430 808812 787757 767312 748155 730204 713051
53237 713051 696329 679762 663329 647438 632654 619295 607528 597646 589836 583696 578325 572921
53225E72921n886o663p676q718r643j0562j1535j2276j2437j2106j1798j1877
53213D51744j2015j1384r584p441o373o796p571p481o755o391o492o289n637n368
53199C46167n890o467o394n977n845n920n717n196m690m291l898l654l787m118
53185B74323m174l832l492l551l874l894l204k071j205r86j056q93n60m79o84
53170B40368p55m74q8J93M56P02O30M5q14j511j835j899j930j970j715q34L84
53153B28953J040O18l11q33p86o04m85l82m82r34j238q33q9J62m3O0N64P57M75
53134B25609M10Q01R90P05O35J140J492J071L97J93L02K88L71Q69J388J382J043
53117B39086R00R78J014J052J130R25L58K9L27O57K56o99j506j982k290k261j695
$$ plain form
53225 572921 567035 560372 552696 543978 534335 523773 512238 499962 487525 475419 463621 451744
53213 451744 439729 428345 418761 411320 404947 398151 390580 383099 376344 369953 363461 357172 351535 346167
53199 346167 340277 333810 327416 321439 315594 309674 303957 298761 294071 289780 285882 282228 278441 274323
53185 274323 270149 266317 262825 259274 255400 251506 248302 246231 245026 244040 242984 242091 241531 241052 240368
53170 240368 239613 239139 239051 239244 239700 240402 241032 241077 240263 238752 236917 235018 233088 231118 229403 228569 228953
53153 228953 229993 230611 230300 229467 228681 228077 227592 227210 226728 225794 224556 223723 223634 223796 223753 223813 224377 225134 225609
53134 225609 226019 226820 227810 228515 229150 230290 231782 232853 233250 233443 233745 234033 234404 235273 236661 238043 239086
53117 239086 239986 240964 241978 243030 244160 245085 245443 245472 245799 246456 246712 246013 244507 242525 240235 237974 236279
53100B36279r95p03p34p66r22j319j423p59J83O38O89P98O89j56j226j435p62
53083B28076k84n18q70q08n88n64o77q03r01p10m9O09N83J9l31l25m51p33o35
53064B20040j62J5l07o42q91j450j982j406K78J436R37j97l02O67J460J508J327
53047B20329J292J119O09J6m15p08q35p07m57l52m24m77m38l81l16k27j80j80
53029B17268n6K58N19M55Q4l73o67n22J57Q85Q79P1n84k51P00J218R02K86l8k
53009B21189J49K35K53L61O72R14N67l86j189j157n74k35l45l53J65R70J522J503
52991B24261R73L33J33N47J048R50K51l59l23K75J003J499J574J265R27J042J801
52974B37200K919L790L803K719J024k98o53m21k93l34j21L67O86O53M93J83n98
$$ plain form
53100 236279 235284 234581 233847 233081 232159 230840 229417 228658 228841 229479 230168 230966 231655 231499 230273 228838 228076
53083 228076 227792 227274 226404 225596 225008 224444 223767 222964 222063 221353 221304 221913 222496 222515 222184 221859 221408 220675 220040
53064 220040 219878 219893 219586 218944 218053 216603 214621 213215 213493 214929 215866 215669 215367 216034 217494 219002 220329
53047 220329 221621 222740 223349 223365 222950 222242 221407 220700 220243 219891 219467 218990 218552 218171 217855 217628 217448 217268
53029 217268 217212 217470 217989 218444 218528 218155 217488 216966 217123 218008 218887 218958 218374 218123 218823 220041 220943 221229 221191 221189
53009 221189 221338 221573 221826 222187 222859 223773 224340 223954 222765 221608 221034 220799 220454 220101 220266 221236 222758 224261
52991 224261 225234 225567 225700 226247 227295 228245 228496 228137 227814 228089 229092 230591 232165 233430 234357 235399 237200
52974 237200 240119 243909 247712 250431 251455 251157 250504 250083 249790 249456 249335 249702 250388 251041 251534 251717 251119
52957B51119j668k160j643q15o39j142j593j586j370j272j314j386j379j185q28
52942B31139n62n55n78l28J04M02N05N23L37j86o81o36k99n41j548k275j728k89
52924B22804P56P77K52j09j12Q6L61O53Q86R79P82J15q85j571j390o85l95q26
52906B22478j236q73L8P12Q40P46P23P12N92L63O0k20k53N7L47J75k93l75K09
52887B24802R33J241J221J176Q43k09j558j987r21P15J508J183P20R61J704K246
52871B34578K305K074J685J079L37k86o51p75o17j25M60P11N68M74P64J190J261
52854B45032Q43J44o49j484k212k666k933l297l807m121l904l194k322j550r58
52839B12922n87n53q87j351j536j193m51M18J234J846J947J384N48K04O18J222
$$ plain form
52957 251119 249451 247291 245648 244833 244194 243052 241459 239873 238503 237231 235917 234531 233152 231967 231139
52942 231139 230577 230022 229444 229116 229220 229622 230127 230650 230987 230801 230120 229484 229185 228644 227096 224821 223093 222804
52924 222804 223560 224337 224589 224480 224368 224454 224815 225468 226354 227333 228115 228230 227345 225774 224384 223699 223304 222478
52906 222478 221242 220369 220407 221119 221959 222705 223428 224140 224732 225095 225155 224935 224682 224739 225086 225261 224968 224593 224802
52887 224802 225735 226976 228197 229373 230216 230007 228449 226462 225541 226256 227764 228947 229667 230628 232332 234578
52871 234578 236883 238957 240642 241721 242058 241772 241121 240346 239729 239604 240064 240775 241343 241817 242581 243771 245032
52854 245032 245875 246019 245370 243886 241674 239008 236075 232778 228971 224850 220946 217752 215430 213880 212922
52839 212922 212335 211782 210895 209544 208008 206815 206364 206782 208016 209862 211809 213193 213741 213945 214563 215785
52823B15785J274O52k36j025j607j866j628r33j27M30O29O56P91J140J452J374
52807B16761R57O89Q44J041P07j33r25j322j479j582j519j166p64o59q26q71n66
52790B09187k07k57p08j006p43j99J0k67o02n59m1Q49J853K400K028J100N07M45
52772B13790J50p77j561j408q01o89r34o21L10R22P58L62J65j2j62K15J045J344
52754B12096O55o9J98R95J134N45L23J067K095K404J776P23j35m08n8O10J244
52737B25195J781K319K760K819K372J580O91p8n49o59n84n63o24o64o76p83j045
52720B33292j380j612j519j036m59k67n39p99n84LN37P91P64M11k38q58j061q17
52702B24629m28j52q4k18l46j24M12N84j67j348j771q75P15J952K342K017J371
$$ plain form
52823 215785 217059 217711 217475 216450 214843 212977 211349 210416 210289 210719 211348 212004 212795 213935 215387 216761
52807 216761 217718 218407 219251 220292 220999 220866 219941 218619 217140 215558 214039 212873 212109 211450 210624 209753 209187
52790 209187 208980 208723 208015 207009 206266 206067 206077 205810 205208 204649 204608 205457 207310 209710 211738 212838 213345 213790
52772 213790 213940 213163 211602 210194 209393 208704 207770 207149 207459 208381 209139 209501 209666 209654 209492 209707 210752 212096
52754 212096 212751 212682 212880 213875 215009 215554 215877 216944 219039 221443 223219 223942 223807 223399 223341 223951 225195
52737 225195 226976 229295 232055 234874 237246 238826 239517 239439 238890 238231 237647 237084 236460 235796 235120 234337 233292
52720 233292 231912 230300 228781 227745 227286 227019 226480 225681 225097 225100 225637 226428 227192 227603 227365 226507 225446 224629
52702 224629 224201 224049 223965 223747 223401 223277 223689 224273 224106 222758 220987 220112 220827 222779 225121 227138 228509
52685B28509P42K45k85r93j616j710j264p83o28o37n07j96J80N54Q13P73M74K44
52667B23915K86M32M55L34J06k15l83rQ87J764K324K863L514L653K805J679J413
52650B45823J880J741L40j337k029j763j477j622j812j655j218p65m28j99M2M75
52634B35996J057J434J360J089J036J255J601K186L147M039M007K686N11j867
52620B59537l985n322n317m014k256q78rN46O60J28o62r22l34O60J422J639J286
52603B42179M34p04j679j977j411m14K14R2k10J59J111J566R05q0j97N98J327
52586B41913J374J068R09Q98P83M60Ol21j55N06R76O08k33n44j12J64l55j118
52568B46827j192n45P5J35k31n61n01j11O7m75j458j998j728j256j176j227r16
$$ plain form
52685 228509 229251 229496 229211 228218 226602 224892 223628 222845 222217 221580 221073 220877 221057 221611 222424 223197 223671 223915
52667 223915 224201 224633 225088 225422 225528 225313 224930 224921 225808 227572 229896 232759 236273 239926 242731 244410 245823
52650 245823 247703 249444 249784 248447 246418 244655 243178 241556 239744 238089 236871 236106 235678 235479 235521 235996
52634 235996 237053 238487 239847 240936 241972 243227 244828 247014 250161 254200 258207 260893 261404 259537
52620 259537 255552 250230 244913 240899 238643 237765 237756 238302 238962 239090 238428 237506 237172 237832 239254 240893 242179
52603 242179 242613 241909 240230 238253 236842 236428 236642 236734 236524 236683 237794 239360 240265 240185 239988 240586 241913
52586 241913 243287 244355 245264 246162 246945 247405 247411 247090 246935 247441 248417 249025 248792 248248 248136 248300 247945 246827
52568 246827 245635 245090 245165 245300 245069 244508 244007 243896 243963 243488 242030 240032 238304 237048 235872 234645 233729
52551B33729m67l77m27Q5J206K132K216J524M64n58j055p12Q1M95K84R8N13J248
52533B40479J630J498J200J054J115J356J629J565Q74k31j102j209n59L58R67
52518B50624J045Q58Q30R72R42O84P17J452K479L048L083L218L678L807L041J783
52502B82261P59j66j636l477m539m225l464l562m538n191m613l035j297k3O42
52487B43896R20J146J389J380J048Q15J020J243Q60R9j39M15J026J011N09J4k01
52470B56451M7Q56J719J770R97N66J309K569L260L442L840M289L874K457R48j27
52454B88267j248k745l953m131l558l063k882k647k178j678j231o59OL35K4o27
52438B58032r93q39n24m36m58k75q5m93j520k167j505M4J071Q08j25o93n90k00
$$ plain form
52551 233729 233262 232885 232458 232543 233749 235881 238097 239621 240085 239527 238472 237760 237841 238336 238620 238718 239231 240479
52533 240479 242109 243607 244807 245861 246976 248332 249961 251526 252400 252169 251067 249858 249299 249657 250624
52518 250624 251669 252527 253357 254329 255271 255955 256672 258124 260603 263651 266734 269952 273630 277437 280478 282261
52502 282261 283020 282854 281218 277741 273202 268977 265513 261951 257413 252222 247609 244574 243277 243254 243896
52487 243896 244816 245962 247351 248731 249779 250594 251614 252857 253717 253816 253677 254092 255118 256129 256638 256652 256451
52470 256451 256498 257354 259073 260843 261840 262406 263715 266284 269544 272986 276826 281115 284989 287446 288394 288267
52454 288267 287019 284274 280321 276190 272632 269569 266687 264040 261862 260184 258953 258294 258300 258635 258659 258032
52438 258032 257039 256200 255676 255240 254782 254507 254422 253929 252409 250242 248737 248781 249852 250660 250535 249842 249252 249052
52420B49052K06P00J273J679J808J961K480L187L500L224K971L505M816O226P396
52405B93984Q677J0275J1507J1242Q866M662l34m676p185p907p961q108p852o506
52391B98684m567l217k739k399j686q25k6P72J369J406J150J406K299L065L249
52376B97941L253L313K940J970J283J668K705L609M499N756O707O145M109K007
52362C47905Q52K93l83j193j775k045k083j841j342q12l28L13J110J594J432J001
52346C42698R75J493K067K269K166K114K446L332M700O172P254P731P883Q189
52332D01489Q896R864J0781J1458J1990J2722J3980J5725J7459J8634J9184J9517
52320E71699J9913K0136J9788J8917J7940J7112J6365J5697J5372J5612J6263
$$ plain form
52420 249052 249258 249958 251231 252910 254718 256679 259159 262346 265846 269070 272041 275546 280362 286588 293984
52405 293984 302661 312936 324443 335685 344551 349213 348879 344203 337018 329111 321150 313042 305190 298684
52391 298684 294117 290900 288161 285762 284076 283251 283225 283997 285366 286772 287922 289328 291627 294692 297941
52376 297941 301194 304507 307447 309417 310700 312368 315073 318682 323181 328937 335644 341789 345898 347905
52362 347905 348757 349050 348667 347474 345699 343654 341571 339730 338388 337576 337248 337561 338671 340265 341697 342698
52346 342698 343673 345166 347233 349502 351668 353782 356228 359560 364260 370432 377686 385417 393300 401489
52332 401489 410385 420249 431030 442488 454478 467200 481180 496905 514364 532998 552182 571699
52320 571699 591612 611748 631536 650453 668393 685505 701870 717567 732939 748551 764814
52309G64814J6846J6789J5717J3826J1950J0906J0600J0239R505R013R224R487
52297I08916Q780P120N448M157K502k12l484o146p664q457r089r659r999j0054
52283H72159r812r058p560n411l053q89R51K480L720M834O153P818R562J1061
52269H82955J2373J3589J4270J3845J2667J1941J2186J2456J1733J0550J0260
52258A018825J0963J1282J0365R045Q516Q737Q904Q784Q609Q034O274L309Q3k665
52244A119065m992p031q542r592j0847j2580j3948j4014j3109j2388j2317j2346
52232I87359j1901j0915r460p654o106n552n822n873n128m077l246k386j268m53
52218I07518m43o56j21J084K075K610L317M411N192N241N256O138P596Q361P640
$$ plain form
52309 764814 781660 798449 814166 827992 839942 850848 861448 871687 881192 890205 899429 908916
52297 908916 917696 924816 930264 934421 936923 936711 933227 927081 919417 910960 901871 892212 882213 872159
52283 872159 862347 853289 845729 840318 837265 836376 837327 839807 843527 848361 854514 862332 871894 882955
52269 882955 895328 908917 923187 937032 949699 961640 973826 986282 998015 1008565 1018825
52258 1018825 1029788 1041070 1051435 1060480 1068996 1077733 1086637 1095421 1104030 1112064 1118338 1121647 1121730 1119065
52244 1119065 1114073 1107042 1098500 1088908 1078061 1065481 1051533 1037519 1024410 1012022 999705 987359
52232 987359 975458 964543 955083 947429 941323 935771 929949 924076 918948 914871 911625 909239 907971 907518
52218 907518 907075 906419 906298 907382 909457 912067 915384 919795 924987 930228 935484 941622 949218 957579 965219
52203I65219O000M586L838L279K553K281L307N273O672O567N596M862M581M422
52189A029036M509N098N642N232L800K058L82j295k677l407m107n899q624j0685
52175A019063j1052j0396r788r337q649p631o175m043j724m17l64j93J140K702
52161I53136L081K618K722L596M157M019L931M168L898K543O91p80j623j884j497
52146I82776o42J98Q48J572K373K763K527K077J776J446R01M27M92J314K920N172
52130A008940P551R455J0952J2733J5139J7763K0210K2612K4985K6718K7293K7136
52118A231487K7187K7804K8500K8511K7347K5123K2664K0887J9690J7826J4404
52107A491430J0133O460L781J371j028k620k833k388k393k958l425l714m559o326
$$ plain form
52203 965219 971219 975805 979643 982922 985475 987756 991063 996336 1003008 1009575 1015171 1020033 1024614 1029036
52189 1029036 1033545 1038643 1044285 1049517 1053317 1055375 1055757 1054462 1051785 1048378 1044271 1038372 1029748 1019063
52175 1019063 1008011 997615 987827 978490 969841 962210 956035 951992 950268 949851 949487 949294 950434 953136
52161 953136 956217 958835 961557 965153 969310 973329 977260 981428 985326 987869 988560 987780 986157 984273 982776
52146 982776 982134 982332 983180 984752 987125 989888 992415 994492 996268 997714 998615 999042 999534 1000848 1003768 1008940
52130 1008940 1016491 1025946 1036898 1049631 1064770 1082533 1102743 1125355 1150340 1177058 1204351 1231487
52118 1231487 1258674 1286478 1314978 1343489 1370836 1395959 1418623 1439510 1459200 1477026 1491430
52107 1491430 1501563 1508023 1511804 1513175 1512147 1509527 1506694 1504306 1501913 1498955 1495530 1491816 1487257 1480931
52093A480931q406j0144j1775j3834j6061j7583j8080j8059j7898j7339j6071
52082A315681j4230j1986r250o154l315j120P57K625M139N068O160Q350J1324
52069A308049J3861J5429J6504J7309J7328J6354J5112J4364J4028J3599J2810
52058A474747J1535R594P215N149L872L072K281J489O34r80m069q325j2540j5754
52044A477920j7909j9519k1089k2759k4227k5009k4895k4082k2840k1338j9823
52033A234430j8515j7218j5466j3275j1272r869q824p978p741q374r348r961j0200
52020A086389j0364j0318r816r195q964q980q758q396q385q654q712q762r692
52007I67393j1712j3860j5178j5786j6359j7071j7550j7512j7046j6480j6129
$$ plain form
52093 1480931 1472525 1462381 1450606 1436772 1420711 1403128 1385048 1366989 1349091 1331752 1315681
52082 1315681 1301451 1289465 1280215 1274061 1270746 1269626 1270383 1273008 1277147 1282215 1288375 1296725 1308049
52069 1308049 1321910 1337339 1353843 1371152 1388480 1404834 1419946 1434310 1448338 1461937 1474747
52058 1474747 1486282 1495876 1503091 1508240 1512112 1515184 1517465 1518954 1519588 1518608 1514539 1506214 1493674 1477920
52044 1477920 1460011 1440492 1419403 1396644 1372417 1347408 1322513 1298431 1275591 1254253 1234430
52033 1234430 1215915 1198697 1183231 1169956 1158684 1148815 1139991 1132013 1124272 1115898 1106550 1096589 1086389
52020 1086389 1076025 1065707 1055891 1046696 1037732 1028752 1019994 1011598 1003213 994559 985847 977085 967393
52007 967393 955681 941821 926643 910857 894498 877427 859877 842365 825319 808839 792710
51996G92710j5966j5409j3801j1258q686o880n907n564n887o852p973q665q858
51983F71004q956r298r948j0754j1433j1692j1597j1639j2149j2817j2985j2313
51971E35423j0908q974o726m539k749j209N97K850N065O661P627Q303Q697Q370
51957E48488P101N241L241J077j469m115o123p102p357p262o690n394l592j760
51943E14284O1K234M919P834J0607J3010J4808J5834J6357J7009J8110J9293J9883
51930F74243J9475J7967J5295J1235N512j818r897j7173k2426k5719k7949k9414
51918F09331k9452k7603k4533k1331j8407j5548j2744j0302q313o529m792l174
51906D26603j675j51J469L105M690O092P027P331P215O938O276M696K039j297
$$ plain form
51996 792710 776744 761335 747534 736276 727590 720710 714803 709239 703352 696500 688527 679862 671004
51983 671004 662048 652750 642802 632048 620615 608923 597326 585687 573538 560721 547736 535423
51971 535423 524515 515541 508815 504276 501527 500318 500915 503765 508830 515491 523118 531421 540118 548488
51957 548488 555589 560830 564071 565148 563679 559564 553441 546339 538982 531720 525030 519636 516044 514284
51943 514284 514345 516579 521498 529332 539939 552949 567757 583591 599948 616957 635067 654360 674243
51930 674243 693718 711685 726980 738215 743727 741909 732012 714839 692413 666694 638745 609331
51918 609331 579879 552276 527743 506412 488005 472457 459713 449411 441098 434569 429777 426603
51906 426603 424928 424777 426246 429351 434041 440133 447160 454491 461706 468644 474920 479616 481655 480358
51892D80358m725p676r575j0165r881r456r075q307o972n443m018k553r78L73
51878C91907J343K391L974N854P430Q434Q833Q423P126N471M100K957J506l41
51864D59408k080l364m266m773m662l984l056j878j04K153M135N250N578N287
51850D53644M266K666J188K12q43k606m642n977o418o599o900p113p125p115o917
51835C99721n972m207k413j374j013o76N7J033J774J802J036l7q10j225j731k503
51819C83462l155l306k998k399j552o83k62l51k83N52J854K753K827K377J858
51804C80694J443J111P95M23K9j94j65j11l35q13j243j376j233j081j322k150
51788C74472l198l716l259k001l40J380K595K652J711J009J538K697L051K188
$$ plain form
51892 480358 475633 467957 458382 448217 438336 428880 419805 411498 404526 399083 395065 392512 391534 391907
51878 391907 393250 395641 399615 405469 412899 421333 430166 438589 445715 451186 455286 458243 459749 459408
51864 459408 457328 453964 449698 444925 440263 436279 433223 431345 431241 433394 437529 442779 448357 453644
51850 453644 457910 460576 461764 461976 461133 458527 453885 447908 441490 434891 427991 420878 413753 406638 399721
51835 399721 393749 389542 387129 385755 384742 384066 384123 385156 386930 388732 389768 389731 388921 387696 385965 383462
51819 383462 380307 377001 374003 371604 370052 369369 369107 368756 368473 369025 370879 373632 376459 378836 380694
51804 380694 382137 383248 384043 384466 384495 384301 384136 384025 383690 382877 381634 380258 379025 377944 376622 374472
51788 374472 371274 367558 364299 362298 361958 363338 365933 368585 370296 371305 372843 375540 378591 380779
51774C80779J102P41J042J557K268L298M442N453O476P715Q892R400Q953P771
51760D49889O217M456K447P9k668n599q268j0130j0855j0545r713q872q180p549
51746C80709o988o508n730m134j957k03O21J228K424L879M882N757P368R313R970
51731D00631Q573O099L800J852O5j151j240l04J172K705L391K048j343m964o849
51716D14485o763n644l953j737J71N13p67k387l321l587l398k616j295J64J684
51701C81549L499N173N547M094J674m70j835k405k114j055L04J605K762L323K459
51686D04110J79k150l270l442l662m051l998l466l032k707j839k62J269K164K706
51671C78549L395M199M859N454O306P550R041J0381J0929J0171Q207N533K276
$$ plain form
51774 380779 381881 382622 383664 385221 387489 390787 395229 400682 407158 414873 423765 433165 442118 449889
51760 449889 456106 460562 463009 463088 460420 454821 446553 436423 425568 415023 405310 396438 388258 380709
51746 380709 373721 367213 361483 357349 355392 355189 355810 357038 359462 363341 368223 373980 381348 390661 400631
51731 400631 409204 415303 419103 420955 421020 419869 418629 418325 419497 422202 425593 427641 426298 421334 414485
51716 414485 407722 402078 398125 396388 396559 397072 396305 393918 390597 387010 383612 380996 379701 379865 381549
51701 381549 385048 390221 395768 399862 401536 401066 399231 396826 394712 393657 393961 395566 398328 401651 404110
51686 404110 404289 402139 398869 395427 391765 387714 383716 380250 377218 374511 372672 372410 373679 375843 378549
51671 378549 381944 386143 391002 396456 402762 410312 419353 429734 440663 450834 459041 464574 466850
51658D66850j809o313r771j0808r431o753l697m84K747N462O997O940N156J842
51644D46928k246n970q466r637r865r409q351o968n778m954m015k393k80J452
51630C70048K254K530K939L400L176J912J42j323k197k756l326l969m567m922
51616C63341m873m452l917l452k957k252j518j232j626k245k299j434r3R98J530
51601C33519J769K092K640L422M499N888P493R197J0790J1638J0766P675L015
51588D14403j878n913q467r069p670n144k856j359q5J534L263M705O104P932J0040
51573D05540J1848J3080J3845J4190J4210J4414J5301J6479J6847J5829J4071
51562E65654J2814J2933J4627J7621K1391K5414K9321L2610L4276L3121K8769
$$ plain form
51658 466850 465041 458728 448957 438149 428718 421965 418268 417784 420531 425993 432990 439930 445086 446928
51644 446928 444682 438712 430246 420609 410744 401335 392984 386016 380238 375284 371269 368876 368596 370048
51630 370048 372302 374832 377771 381171 384347 386259 386401 385078 382881 380125 376799 372830 368263 363341
51616 363341 358468 354016 350099 346647 343690 341438 339920 338688 337062 334817 332518 331084 330991 331989 333519
51601 333519 335288 337380 340020 343442 347941 353829 361322 370519 381309 392947 403713 411388 414403
51588 414403 412525 406612 398145 389076 381406 376262 373406 372047 371962 373496 376759 381464 387568 395500 405540
51573 405540 417388 430468 444313 458503 472713 487127 502428 518907 535754 551583 565654
51562 565654 578468 591401 606028 623649 645040 670454 699775 732385 766661 799782 828551
51551H28551K2124J4699P540Q21n778j2461j8924k4411k8266l0469l1438l1385
51539F90603l0200k7967k5212k2407j9555j6523j3488j0801q539o569m973m074
51527E00295m020m572n409o445p714q966r617r274q240p281o808o564o206n856
51513D03323n778n768n385m680m141l961l823l504l109k622j818q27k12j35j8
51498C57542N28J051J056R16J174J418Q63j06j35J145K409K386J509J015J090
51483C73861Q34j62j200j639j794k231k791k936k731k802l306l594l092k025r89
51468C43403k73L4l32j454k703l209k944k748l143l626l380k234o58P72J616J680
51452C20801J292J176J715K546L218L865M862O128P334Q535J0061J1808J3109
$$ plain form
51551 828551 850675 865374 872914 873735 867957 855496 836572 812161 783895 753426 721988 690603
51539 690603 660403 632436 607224 584817 565262 548739 535251 524450 515911 509342 504369 500295
51527 500295 496275 491703 486294 479849 472135 463169 453552 444278 436038 428757 421949 415385 409179 403323
51513 403323 397545 391777 386392 381712 377571 373610 369787 366283 363174 360552 358734 357907 357695 357560 357542
51498 357542 358070 359121 360177 361093 362267 363685 364548 364442 364307 365452 367861 370247 371756 372771 373861
51483 373861 374695 374533 373333 371694 369900 367669 364878 361942 359211 356409 353103 349509 346417 344392 343403
51468 343403 343130 343164 342832 341378 338675 335466 332522 329774 326631 323005 319625 317391 316733 317505 319121 320801
51452 320801 322093 323269 324984 327530 330748 334613 339475 345603 352937 361472 371533 383341 396450
51439C96450J3333J2207R687O078K253o63k028j863n11J388K719K426N02k023
51425D39955m163n652o453o327n325m189l709l888m146m166m111m074l766k855
51411C77131j400J19J174J552J430J086O71K96J98N04R05R31N85L77O87J392K216
51394C89854L089M024M911N712O535P384Q116Q809R886J1632J3908J6562J9818
51381E10240K3899K8480L2834L6499L9651M2922M6842N1045N3793N2757M6726
51370I65688L6594K4588J2797K490n990j3253k0512k8327l5828m1597m5183m7171
51358H04296m7964m7297m5034m1778l8294l4766l0908k6610k2220j8404j5637
51347D35384j3710j1824r527p381o209n843n302m172l037k379j852j134o27o99
$$ plain form
51439 396450 409783 421990 431677 437755 440008 439345 437317 435454 434943 436331 439050 441476 441978 439955
51425 439955 435792 430140 423687 417360 412035 407846 404137 400249 396103 391937 387826 383752 379986 377131
51411 377131 375731 375850 377024 378576 380006 381092 381763 382059 382257 382761 383666 384597 385182 385559 386246 387638 389854
51394 389854 392943 396967 401878 407590 414125 421509 429625 438434 448320 459952 473860 490422 510240
51381 510240 534139 562619 595453 631952 671603 714525 761367 812412 866205 918962 965688
51370 965688 1002282 1026870 1039667 1042157 1036167 1022914 1002402 974075 938247 896650 851467 804296
51358 804296 756332 709035 664001 622223 583929 549163 518255 491645 469425 451021 435384
51347 435384 421674 409850 400323 392942 386733 380890 375588 371416 368379 366000 364148 363014 362387 361688
51333C61688p98j58R79J683J725J749K072K125J392K45n70r36j380k280l386m079
51317C60071l915l003j915j189q23l65M53J373J944J964J441L73j105k492l166
51302C49646k944k235j554j096q17o99p37p61n91l44l61o80q14k98O58J376J576
51285C39325J694K172K764K896K626K766L920N638O753O430M798K678R33k1k79
51270C85093k37k10j69J96J103K347L410L918L897L472K467N56k051m377n476
51255C93939n379m942m757m648m313l981m043m309m217l637l010k650k334j816
51241C39903j327j239j450j499j173o87l10o8J06K15K44K62L97P76J452K244K697
51224C40543K436J640R46P95J007J078O99q6j058j838j951j183J25J352K150K548
$$ plain form
51333 361688 360890 360732 361711 363394 365119 366868 368940 371065 372457 372702 372132 371196 369816 367536 364150 360071
51317 360071 356156 353153 351238 350049 349226 348861 349314 350687 352631 354595 356036 356409 355304 352812 349646
51302 349646 346702 344467 342913 341817 341000 340301 339564 338803 338212 337868 337507 336827 336013 335715 336373 337749 339325
51285 339325 341019 343191 345955 348851 351477 354243 358163 363801 370554 376984 381782 384460 385393 385372 385093
51270 385093 384856 384646 384477 384673 385776 388123 391533 395451 399348 402820 405287 405843 403792 399415 393939
51255 393939 388560 383618 378861 374213 369900 365919 361876 357567 353350 349713 346703 344053 341719 339903
51241 339903 338576 337337 335887 334388 333215 332528 332218 332150 332256 332471 332715 332977 333374 334150 335602 337846 340543
51224 340543 342979 344619 345565 346360 347367 348445 349144 349058 348000 346162 344211 343028 343153 344505 346655 349203
51208C49203K583K245J781J683K085K518K520K266K210K321K097J350N36J99L58
51193C75955O11N42m1r41j550j305m17J76j11q09j116j005j121j710k258k289
51177C62611j899j347o08L51J178J508J488J583J862J901J412P08L38L90L89m9
51161C71816o12n48L92J543K033J755J280R04K83r06k344l387l750l568l052k408
51145C59431j907j723j740j696j509j230q98n23j19L65J030J732K067J894J593
51130C56767J603J833J838J449R05N11M63P85J197J190O67K47N13J167J476J400
51114C74011J521J929J938J236N55O95J416J838J684J504J741K125K112J680J369
51099C97354J565J934J792J049M19M38O32J96p00j033m09L55M50J84L68J048J530
$$ plain form
51208 349203 351786 354031 355812 357495 359580 362098 364618 366884 369094 371415 373512 374862 375398 375597 375955
51193 375955 376566 377108 377067 376126 374576 373271 372854 373030 372919 372110 370994 369989 368868 367158 364900 362611
51177 362611 360712 359365 358757 359108 360286 361794 363282 364865 366727 368628 370040 370748 371086 371476 371865 371816
51161 371816 371204 370656 371048 372591 374624 376379 377659 378563 378846 377940 375596 372209 368459 364891 361839 359431
51145 359431 357524 355801 354061 352365 350856 349626 348728 348205 348086 348451 349481 351213 353280 355174 356767
51130 356767 358370 360203 362041 363490 364395 364906 365369 366154 367351 368541 369208 369455 369968 371135 372611 374011
51114 374011 375532 377461 379399 380635 381190 381885 383301 385139 386823 388327 390068 392193 394305 395985 397354
51099 397354 398919 400853 402645 403694 404113 404551 405183 405379 404679 403646 403237 403592 404042 404226 404594 405642 407172
51082D07172J397R19M93K41J19O8r2m96q86o93L64J928L330M191M606M868N150
51065D32679N498O071P173Q928J1187J3959J7605K2021K5682K6266K2753J6557
51053F16379J0333O059M524N855R478J3585J5629J4107R775M959J559m52k694
51040G09096o591j1675j5707j6585j4017r440m763j569j002l485q174j3197j6805
51027E86086j8292j7860j6008j3310j0478q145o410m788k722k57J964L386M208
51014D97374N164O725Q653J0367J1506J2052J2117J1774J1011R821Q423P326O891
51001F19204O782O270N090L690K496J370Q4j169k104k806l411l630l069j883n94
50986F26320N63J795L340N370Q090J1436J4691J6869J7534J7013J5880J4623J3725
$$ plain form
51082 407172 408569 409488 409981 410222 410341 410409 410317 409821 408935 408242 408606 410534 413864 418055 422661 427529 432679
51065 432679 438177 444248 451421 460349 471536 485495 503100 525121 550803 577069 599822 616379
51053 616379 626712 632771 637295 643150 652628 666213 681842 695949 705724 710683 712242 711790 709096
51040 709096 702505 690830 675123 658538 644521 635081 630318 628749 627747 624262 616088 602891 586086
51027 586086 567794 549934 533926 520616 510138 501993 495583 490795 488073 487816 489780 493166 497374
51014 497374 502538 509263 517916 528283 539789 551841 563958 575732 586743 596564 604987 612313 619204
51001 619204 625986 632256 637346 641036 643532 644902 644986 643817 641713 638907 635496 631866 628797 626914 626320
50986 626320 626883 628678 632018 637388 645478 656914 671605 688474 706008 723021 738901 753524 767249
50973G67249J3667J4749J7059K0507K4685K8974L3101L7321M1757M5957M9585
50962A094611N3061N6780O0042O1748O2017O2096O2505O2241O0151N6264N1299
50951A742815M5661L9528L3367K7664K2399J7258J2219P665M162K290K168K895
50939A960091K855J114j811m778p241r301j1043j2487j3948j5890j8457k1501
50927A847603k4979k8972l3431l8176m3023m7650n1559n4513n6731n8233n8341
50916A351995n6416n2987m9442m6488m3476l9495l4680l0071k6554k4254k2774
50905I25358k1584k0168j8194j5824j3769j2716j2609j2581j1704r784p406n346
50893G63673m049l484l237k823k112j402q81k11R93K341K938K578K133K489L544
$$ plain form
50973 767249 780916 795665 812724 833231 857916 886890 919991 957312 999069 1045026 1094611
50962 1094611 1147672 1204452 1264494 1326242 1388259 1450355 1512860 1575101 1635252 1691516 1742815
50951 1742815 1788476 1828004 1861371 1889035 1911434 1928692 1940911 1948576 1952738 1955028 1957196 1960091
50939 1960091 1962946 1964060 1962249 1957471 1950230 1940929 1929886 1917399 1903451 1887561 1869104 1847603
50927 1847603 1822624 1793652 1760221 1722045 1679022 1631372 1579813 1525300 1468569 1410336 1351995
50916 1351995 1295579 1242592 1193150 1146662 1103186 1063691 1029011 998940 972386 948132 925358
50905 925358 903774 883606 865412 849588 835819 823103 810494 797913 786209 776425 769019 763673
50893 763673 759624 756140 752903 750080 747968 746566 745685 745474 746467 748808 751746 754324 756457 758946 762490
50878G62490M595N325N971O763P685Q688R743J0728J1614J2655J4069J5618J6898
50865H92842J8044J9681K2047K4580K6664K8509L0925L4292L8151M1932M5767
50854A223434N0384N6289O3383P1290P9766Q8584R7338J05657J13443J20713J27294
50843B197575J32910J37463J40908J42974J43186J41094J36171J27720J15279
50834C415280R9201Q0538O0487M0232K1095M163j0224k2170l1366l7078l8972
50823C581186l7432l2967k5953j7096p639J117P952J1384J0016L600o763j9802
50811C467603l4849n1219o7727q3383r7985j11436j23092j32272j38745j42097
50801B484798j41392j36441j28763j20248j11200j00786q9032p7268o6558n6890
$$ plain form
50878 762490 767085 772410 778381 785144 792829 801517 811260 821988 833602 846257 860326 875944 892842
50865 892842 910886 930567 952614 977194 1003858 1032367 1063292 1097584 1135735 1177667 1223434
50854 1223434 1273818 1330107 1393490 1464780 1544546 1633130 1730468 1836125 1949568 2070281 2197575
50843 2197575 2330485 2467948 2608856 2751830 2895016 3036110 3172281 3300001 3415280
50834 3415280 3514481 3595019 3655506 3695738 3716833 3720996 3710772 3688602 3657236 3620158 3581186
50823 3581186 3543754 3510787 3484834 3467738 3460099 3461216 3469168 3480552 3490568 3494168 3487405 3467603
50811 3467603 3432754 3381535 3313808 3230425 3132440 3021004 2897912 2765640 2626895 2484798
50801 2484798 2343406 2206965 2078202 1957954 1846754 1745968 1656936 1579668 1513110 1456220
50791A456220m7982l9945l2860k6533k0957j6282j2268q489n231l344k852k678
50779A236799k151j944k877m528n857o703p732r148j0336j0850j1052j1596j2712
50766A139313j4170j5577j6529j6777j6528j6349j6506j6497j5567j3640j1454
50755I69719r702q332o919n384l887k158M16L951P709J0929J3568J6076J8853
50742A004839K2125K5965L0012L3625L6704L9975M4016M8379N2213N5427N8583
50731A451863O1955O5260O8136P0257P1220P0993P0315O9921O9512O8113O5376
50720B202921O1618N6725M9950M0952L0170J7946M295j0085k3352l3716m0532
50709B356892m3922m3913m0685l5066k8118k0391j2108l879L252Q400J1204J1677
$$ plain form
50791 1456220 1408238 1368293 1335433 1308900 1287943 1271661 1259393 1250904 1245673 1242329 1239477 1236799
50779 1236799 1234648 1232704 1229827 1225299 1219442 1212739 1205007 1195859 1185523 1174673 1163621 1152025 1139313
50766 1139313 1125143 1109566 1093037 1076260 1059732 1043383 1026877 1010380 994813 981173 969719
50755 969719 960017 951685 944766 939382 935495 933337 933753 937704 945413 956342 969910 985986 1004839
50742 1004839 1026964 1052929 1082941 1116566 1153270 1193245 1237261 1285640 1337853 1393280 1451863
50731 1451863 1513818 1579078 1647214 1717471 1788691 1859684 1929999 1999920 2069432 2137545 2202921
50720 2202921 2264539 2321264 2371214 2412166 2442336 2460282 2464577 2454492 2431140 2397424 2356892
50709 2356892 2312970 2269057 2228372 2193306 2165188 2144797 2132689 2128810 2132062 2140462 2151666 2163343
50697B163343R891N715j164j0842k2741l5806m8988o1193p1025p7303q0011q0119
50685A689757p8309p4477o8630o1460n3685m5483l7086k9185k2183j5587q799
50674A194873k111L817R084J4363J9749K4352K7140K7816K6957K5530K4011K1949
50662A417530J8759J5121J2842J2818J3850J4233J3869J3859J4560J5227J5463
50651A578131J5754J6366J6872J7228J8395K1114K4752K8046L0655L3251L6349
50640A836913L9653M2603M4972M6763M7846M8001M7184M5544M3193M0099L6332
50629B319103L2501K9851K9716L2307L5635L5691K8433J2540r278l1608m9107
50618B465784n8600n9639n4051m4907l5021k5831j7564j0210l904J336N488Q035
$$ plain form
50697 2163343 2173234 2178949 2177785 2166943 2144202 2108396 2059408 1998215 1927190 1849887 1769876 1689757
50685 1689757 1611448 1536971 1468341 1406881 1353196 1307713 1270627 1241442 1219259 1203672 1194873
50674 1194873 1192762 1196579 1205663 1220026 1239775 1264127 1291267 1319083 1346040 1371570 1395581 1417530
50662 1417530 1436289 1451410 1464252 1477070 1490920 1505153 1519022 1532881 1547441 1562668 1578131
50651 1578131 1593885 1610251 1627123 1644351 1662746 1683860 1708612 1736658 1767313 1800564 1836913
50640 1836913 1876566 1919169 1964141 2010904 2058750 2106751 2153935 2199479 2242672 2282771 2319103
50629 2319103 2351604 2381455 2411171 2443478 2479113 2514804 2543237 2555777 2546499 2514891 2465784
50618 2465784 2407184 2347545 2293494 2248587 2213566 2187735 2170171 2159961 2156057 2157393 2162881 2170916
50606B170916Q203N888J713m012j1675k1439l2503m3629n3717o1699o6628o8592
50594A822826o8785o8201o6773o4318o1453n8755n5846n2204m8319m4980m1883
50583A191309l8142l3809k9759k6276k2936j9666j6727j3788j0262o583l854k068
50571I67439rK759N214O687P992R962J2014J3259J4120J5752J8290K0809K2631
50558A116919K3892K4967K6088K7358K8581K9285K9291K9029K8828K8396K7496
50547A420130K6641K6448K6600K6373K5964K6522K8774L2278L6155M0043M4148
50536A760076M8758N3852N9042O3907O8512P3362P8647Q3933Q8955R4263J00410
50525B573717J06774J11996J15512J17857J19349J19303J16817J11662J03939
$$ plain form
50606 2170916 2179119 2185007 2186720 2182708 2171033 2149594 2117091 2073462 2019745 1958046 1891418 1822826
50594 1822826 1754041 1685840 1619067 1554749 1493296 1434541 1378695 1326491 1278172 1233192 1191309
50583 1191309 1153167 1119358 1089599 1063323 1040387 1020721 1003994 990206 979944 973361 969507 967439
50571 967439 967430 970189 975403 982090 990082 1000044 1012058 1025317 1039437 1055189 1073479 1094288 1116919
50558 1116919 1140811 1165778 1191866 1219224 1247805 1277090 1306381 1335410 1364238 1392634 1420130
50547 1420130 1446771 1473219 1499819 1526192 1552156 1578678 1607452 1639730 1675885 1715928 1760076
50536 1760076 1808834 1862686 1921728 1985635 2054147 2127509 2206156 2290089 2379044 2473307 2573717
50525 2573717 2680491 2792487 2907999 3025856 3145205 3264508 3381325 3492987 3596926
50516C596926R3407P9701O3012M4185K4270M203j5423l4590n3624p2257q9068
50505C640742j02245j10868j15138j15357j11253j02532q9716p4051n6711l8408
50495B724463j9736j492J5517L0660M3258N2303N6665N5504M8298L4730J4997
50484C055167r629l6775o3592q7432j06265j19110j26280j28907j27999j24131
50474B125047j17964j10396j01984r2680q2586p2597o3794n6543n0700m6336m3534
50463A285933m1514l8804l4664k9754k5178k1296j7775j4299j0722o894k904O70
50451A042799L282N253P504J0325J2858J4187J4605J5449J7729K1261K4922K7341
50439A217515K7396K4664J9812J4236R091M765J385o83j269r80o61l89M47K053
$$ plain form
50516 3596926 3690333 3770034 3833046 3877231 3901501 3905704 3890281 3855691 3802067 3729810 3640742
50505 3640742 3538497 3427629 3312491 3197134 3085881 2983349 2893633 2819582 2762871 2724463
50495 2724463 2704727 2703235 2718752 2749412 2792670 2844973 2901638 2957142 3005440 3040170 3055167
50484 3055167 3045538 3008763 2945171 2857739 2751474 2632364 2506084 2377177 2249178 2125047
50474 2125047 2007083 1896687 1794703 1702023 1619437 1546840 1483046 1426503 1375803 1329467 1285933
50463 1285933 1244419 1205615 1170951 1141197 1116019 1094723 1076948 1062649 1051927 1045033 1042129 1042799
50451 1042799 1046081 1051334 1058838 1069163 1082021 1096208 1110813 1126262 1143991 1165252 1190174 1217515
50439 1217515 1244911 1269575 1289387 1303623 1312714 1317479 1318864 1318181 1316912 1315932 1315271 1314882 1315329 1317382
50425A317382L873N407O729P988R068J0203J2317J6078K0916K5637K9805L3936
50413A499339L8467M3232M8013N2884N7677O1606O3840O4314O3609O2178N9936
50402B115095N6531N1845M6123L9739L2869K5305J6536O076o143j9545l3171m6219
50390B285041n8208o8468p5789p9082p8412p4914o9525o2332n3357m3310l3099
50379A588545k3045j3180l935M171J1262J7657K2794K5293K4264J9879J2653L010
50367A689368q142j9269k9241l8042m5874n2069n5543n6067n4419n1366m7156
50356A232180m2109l7076l2897k9627k6558k2965j8715j4267j0363p851p609j0141
50344I72002j4813j9737k2911k3598k2398k0000j6525j2223q066m999k840o62
$$ plain form
50425 1317382 1321255 1326662 1333391 1341379 1350447 1360650 1372967 1389045 1409961 1435598 1465403 1499339
50413 1499339 1537806 1581038 1629051 1681935 1739612 1801218 1865058 1929372 1992981 2055159 2115095
50402 2115095 2171626 2223471 2269594 2309333 2342202 2367507 2384043 2390119 2383976 2364431 2331260 2285041
50390 2285041 2226833 2158365 2082576 2003494 1925082 1850168 1780643 1718311 1664954 1621644 1588545
50379 1588545 1565500 1552320 1548385 1552556 1563818 1581475 1604269 1629562 1653826 1673705 1686358 1689368
50367 1689368 1681226 1661957 1632716 1594674 1548800 1496731 1441188 1385121 1330702 1279336 1232180
50356 1232180 1190071 1152995 1120098 1090471 1063913 1040948 1022233 1007966 997603 989752 982143 972002
50344 972002 957189 937452 914541 890943 868545 848545 832020 819797 811731 806732 803892 803230
50332H03230J839L952M972N088N028N225N626O089O597P105P397P252O715O142
50318H82257N851N697N199M157L006K270J915J504R38O24Q63J451K046K673L578
50303I24029M740N795O437O753P138P983R373J1088J2833J4455J5936J7238J8256
50290A062054J8999J9807K1478K5160L1580L9745M6168M6067L6274J7746m481
50279A360597k3996l6368m0847l9610l5631l0995k6613k2742j9316j6087j2902
50268A055490j0016p801o179m680l069j527r0J624L863O313Q618J0993J3810J6757
50254A084106J8902J9621J9091J7893J6484J5156J4153J3678J3864J4702J5748
50243A263398J6053J4716J1576P086J657m402j0386j5298j8687k0816k1732k0811
$$ plain form
50332 803230 805069 809021 813993 819081 824109 829334 834960 841049 847646 854751 862148 869400 876115 882257
50318 882257 888108 893805 899004 903161 906167 908437 910352 911856 912794 913418 914281 915732 917778 920451 924029
50303 924029 928769 934564 941001 947754 954892 962875 972248 983336 996169 1010624 1026560 1043798 1062054
50290 1062054 1081053 1100860 1122338 1147498 1179078 1218823 1264991 1311058 1347332 1365078 1360597
50279 1360597 1336601 1300233 1259386 1219776 1184145 1153150 1126537 1103795 1084479 1068392 1055490
50268 1055490 1045474 1037673 1031494 1026814 1023745 1022218 1022128 1023752 1027615 1033928 1042546 1053539 1067349 1084106
50254 1084106 1103008 1122629 1141720 1159613 1176097 1191253 1205406 1219084 1232948 1247650 1263398
50243 1263398 1279451 1294167 1305743 1312829 1314486 1310084 1299698 1284400 1265713 1244897 1223165 1202354
50231A202354j7823j3938j0828r064q213q459j1082j6791k4317l1229l5797l7587
50219I77226l6754l3727k9614k5948k3475k1549j9192j6389j3930j2175j0629
50208G33844q795o919n600m993m725m343l568k367j103m50p93j689k353k564k672
50193F80910k793k588k085k049l017m381n042m816m544m788n099m789l925l155
50179F27839k909l131l647m283m688m440l481k170q40M55J592K151J894J297J163
50164F06802J653K198K426K731L627M950O144P006P621P879P779Q081R807J2845
50150F91549J5805J7521J8142J8381J8504J8596J9244K1033K3699K6483K9092
50139I18049L1659L3965L5497L6169L6300L5973L5123L4190L3882L4239L4688
$$ plain form
50231 1202354 1184531 1170593 1159765 1150701 1142488 1134029 1122947 1106156 1081839 1050610 1014813 977226
50219 977226 940472 906745 877131 851183 827708 806159 786967 770578 756648 744473 733844
50208 733844 725049 718130 712530 707537 702812 698469 694901 692534 691431 690981 690188 688499 686146 683582 680910
50193 680910 678117 675529 673444 671395 668378 663997 658955 654139 649595 644807 639708 634919 630994 627839
50179 627839 624930 621799 618152 613869 609181 604741 601260 599090 598250 598705 600297 602448 604342 605639 606802
50164 606802 608455 610653 613079 615810 619437 624387 630531 637537 645158 653037 660816 668897 678704 691549
50150 691549 707354 724875 743017 761398 779902 798498 817742 838775 862474 888957 918049
50139 918049 949708 983673 1019170 1055339 1091639 1127612 1162735 1196925 1230807 1265046 1299734
50128A299734L4954L4982L3869L0014K2886J3644L569p089j8050k7880l5086l9698
50116A345849m2632m4013m3379m1202l8794l6602l3813k9950k5793k2289j9518
50105I67864j7267j5757j5167j5021j4705j4173j3585j2727j1440j0198r516r035
50093H09273p958o257m676l492k057J31K554M394N583O636P653Q119P714O800
50079H34417N921N259M770M495M305L692K282N39o22r87j281k053k908l212l088
50064H51529l110l382l614l938m781n864o150n115l485k326j894j772j622j312
50050H03164o97J85R75J617K769M935P426Q975R423R922J1283J2867J3558J3197
50036H99599J2446J1674J0762R854R536J0017J0684J0771J0274R876J0121J0863
$$ plain form
50128 1299734 1334688 1369670 1403539 1433553 1456439 1470083 1473652 1466563 1448513 1420633 1385547 1345849
50116 1345849 1303217 1259204 1215825 1174623 1135829 1099227 1065414 1035464 1009671 987382 967864
50105 967864 950597 934840 919673 904652 889947 875774 862189 849462 838022 827824 818308 809273
50093 809273 801315 795058 790382 786890 784833 784964 787518 791912 797495 804131 811784 819903 827617 834417
50079 834417 840338 845597 850367 854862 859167 862859 865141 865680 865058 864071 862790 860737 857829 854617 851529
50064 851529 848419 845037 841423 837485 832704 826840 820690 815575 812090 809764 807870 806098 804476 803164
50050 803164 802467 802652 803627 805244 808013 812948 820374 829349 838772 848694 859977 872844 886402 899599
50036 899599 912045 923719 934481 944335 953871 963888 974572 985343 995617 1005493 1015614 1026477
50024A026477J1473J1506J1156J1122J1971J3593J5359J6743J7584J7672J6429
50013A181085J3450R270N303K844K222K831L668L733K276j017n993j2153j8742
50000A188777k4739k9183l1668l2365l1503k9201k5977k2920k0790j9244j7473
49989I03714j5481j3986j3202j2559j1833j1757j2941j4809j6205j6690j6641
49978G47610j6339j5698j4785j3888j3059j2032j0694r208p667o074m688l889
49966F19589l566l199k700k605l148l704l596k993k474k032j107M62K215L782
49952E94924N257O764Q141R312J0477J1589J1978J0981Q844O598N077M288L817
49939F98047L404K982K361J185p42l252n962q578j1069j3501j5682j6935j6459
$$ plain form
50024 1026477 1037950 1049456 1060612 1071734 1083705 1097298 1112657 1129400 1146984 1164656 1181085
50013 1181085 1194535 1203805 1209108 1211952 1214174 1217005 1220673 1224406 1226682 1225665 1219672 1207519 1188777
50000 1188777 1164038 1134855 1103187 1070822 1039319 1010118 984141 961221 940431 921187 903714
49989 903714 888233 874247 861045 848486 836653 824896 811955 797146 780941 764251 747610
49978 747610 731271 715573 700788 686900 673841 661809 651115 641907 634240 628166 623478 619589
49966 619589 616023 612824 610124 607519 604371 600667 597071 594078 591604 589572 588465 588927 591142 594924
49952 594924 600181 606945 615086 624398 634875 646464 658442 669423 678267 684865 689942 694230 698047
49939 698047 701451 704433 706794 707979 707237 703985 698023 689445 678376 664875 649193 632258 615799
49926F15799j4151j1014q454p071o347n481m184k581p98R44K146K447K134J836
49912E65225J840K065K560L422M269M540M476M994O330P496P721P715Q725J0684
49898F42062J2279J2674J2238J1452J0046P674M826K466R97j4j204k863m862o880
49884G00891q662j0098j1160j1824j2185j2446j2627j2383j1444j0107q903p869
49872E71183o631n120l768k870k238j604q88O8J441K972M022M433M843N795P042
49857E78680Q066Q804R505J0220J0920J1745J2667J3180J2790J1551R778P592
49845G05498N185L045J401j92k126m032n498p052r417j2019j3269j2497j0651
49832F38376q905p408n819m259l138k464j906j288p09k95j6L78J348L164N452
$$ plain form
49926 615799 601648 590634 582180 575109 568762 563281 559097 556516 555718 556662 558808 561255 563389 565225
49912 565225 567065 569130 571690 575112 579381 583921 588397 593391 599721 607217 614938 622653 631378 642062
49898 642062 654341 667015 679253 690705 700751 708425 713251 715717 716714 716700 715496 712633 707771 700891
49884 700891 692229 682131 670971 659147 646962 634516 621889 609506 598062 587955 579052 571183
49872 571183 564552 559432 555664 552794 550556 548952 548064 548132 549573 552545 556567 561000 565843 571638 578680
49857 578680 586746 595550 605055 615275 626195 637940 650607 663787 676577 688128 697906 705498
49845 705498 710683 713728 715129 714937 712811 708779 703281 696229 686812 674793 661524 649027 638376
49832 638376 629471 622063 616244 611985 608847 606383 604477 603189 602480 602185 602169 602547 603895 607059 612511
49817F12511P442Q699R342R631R681R582R275Q426O836N069M025L882L950L601
49803G11952K736J325p17k993m647n285n335n332n546o417q402j0994j2777j3094
$$ plain form
49817 612511 619953 628652 637994 647625 657306 666888 676163 684589 691425 696494 700519 704401 708351 711952
49803 711952 714688 716013 715296 712303 707656 702371 697036 691704 686158 679741 671339 660345 647568 634474
$$ [...]
##END NTUPLES=NMR SPECTRUM
##END=
