##TITLE=AC1716_NUNAH15002_9207373_qqZutFL7Wh
##JCAMPDX= 6.0         $$ Bruker NMR JCAMP-DX V2.0
##DATA TYPE= NMR SPECTRUM
##DATA CLASS= NTUPLES
##ORIGIN= BRUKER
##OWNER= Administrator
$$ 1.72 TOPSPIN		Version 2.1
$$ 2015-06-01 19:50:04.170 -0700  Administrator@X
$$ Compression mode = diff/dup
##.OBSERVE FREQUENCY= 400.02188249412
##.OBSERVE NUCLEUS= ^1H
##.ACQUISITION MODE= SIMULTANEOUS (DQD)
##.ACQUISITION SCHEME= undefined
##.AVERAGES= 8
##.DIGITISER RES= 22
##SPECTROMETER/DATA SYSTEM= spect
##.PULSE SEQUENCE= zg30
##.SOLVENT NAME= COFFEE_meoh
##.SHIFT REFERENCE= INTERNAL, COFFEE_meoh, 1, 14.98509
##AUDIT TRAIL= $$ (NUMBER, WHEN, WHO, WHERE, PROCESS, VERSION, WHAT)
$$ ##TITLE= Audit trail, TOPSPIN		Version 2.1
$$ ##JCAMPDX= 5.01
$$ ##ORIGIN= Bruker BioSpin GmbH
$$ ##OWNER= Administrator
$$ $$ E:\/data/COFFEE/nmr/AC1716_NUNAH15002_9207373_qqZutFL7Wh/10/pdata/1/auditp.txt
$$ ##AUDIT TRAIL=  $$ (NUMBER, WHEN, WHO, WHERE, PROCESS, VERSION, WHAT)
(   1,<2015-06-01 19:49:56.998 -0700>,<Administrator>,<X>,<go>,<TOPSPIN 2.1>,
      <created by zg
	started at 2015-06-01 19:48:50.530 -0700,
	POWCHK enabled, PULCHK disabled,
       configuration hash MD5:
       21 0F 79 D6 B3 7B B4 F6 88 20 88 DB 03 48 BD 9F
       data hash MD5: 64K
       98 2C 98 1D D3 58 51 77 39 27 1C E9 29 10 5F F7>)
(   2,<2015-06-01 19:50:00.108 -0700>,<Administrator>,<X>,<proc1d>,<TOPSPIN 2.1>,
      <Start of raw data processing
       efp LB = 0 FT_mod = 6 PKNL = 1 PHC0 = 0 PHC1 = 0 SI = 32K 
       data hash MD5: 32K
       CD CA B6 CF B6 B9 02 8E BD E9 8B D4 B2 74 7A 00>)
(   3,<2015-06-01 19:50:00.389 -0700>,<Administrator>,<X>,<proc1d>,<TOPSPIN 2.1>,
      <pk PHC0 = 91.13159 PHC1 = 0 
       data hash MD5: 32K
       E5 34 C9 EB 41 6C 6F 40 5A 03 36 AF E7 FE C4 D5>)
(   4,<2015-06-01 19:50:00.498 -0700>,<Administrator>,<X>,<proc1d>,<TOPSPIN 2.1>,
      <abs ABSG = 1 
       data hash MD5: 32K
       E5 C0 4A 1B 48 3D 2C 10 CE F5 05 BD 3C BA 78 62>)
(   5,<2015-06-01 19:50:00.576 -0700>,<Administrator>,<X>,<proc1d>,<TOPSPIN 2.1>,
      <abs ABSG = 2 
       data hash MD5: 32K
       CD F6 10 91 5D 6E 74 B9 DE 54 70 5A 2C 4C EE 85>)
(   6,<2015-06-01 19:50:00.639 -0700>,<Administrator>,<X>,<proc1d>,<TOPSPIN 2.1>,
      <abs ABSG = 3 
       data hash MD5: 32K
       C0 29 6F 19 23 FD 46 9E 88 0C 61 2C F5 C0 39 22>)
(   7,<2015-06-01 19:50:00.701 -0700>,<Administrator>,<X>,<proc1d>,<TOPSPIN 2.1>,
      <abs ABSG = 4 
       data hash MD5: 32K
       01 D0 70 F6 19 46 80 F8 0E 2B EB 6C 94 F5 5D B5>)
(   8,<2015-06-01 19:50:00.748 -0700>,<Administrator>,<X>,<proc1d>,<TOPSPIN 2.1>,
      <abs ABSG = 5 
       data hash MD5: 32K
       D3 9A FD A2 28 5A C9 DD 78 D1 17 E7 E5 D1 45 7A>)
$$ ##END=
$$ 
$$ $$ hash MD5
$$ $$ E9 02 8C 67 1C C6 EC 84 E7 38 AC 04 7F 9E ED 2E
##$RELAX= 
##$RELAX= 
##$RELAX= 
##$RELAX= 
##$RELAX= 
##$RELAX= 
##$RELAX= 
$$ Bruker specific parameters
$$ --------------------------
##$DU= <E:\>
##$EXPNO= 10
##$NAME= <AC1716_NUNAH15002_9207373_qqZutFL7Wh>
$$ [...]
150 150 150 150 150 150 150 150
##$TP07= 0
##$TPNAME0= <>
##$TPNAME1= <>
##$TPNAME2= <>
##$TPNAME3= <>
##$TPNAME4= <>
##$TPNAME5= <>
##$TPNAME6= <>
##$TPNAME7= <>
##$TPOAL= (0..7)
0.5 0.5 0.5 0.5 0.5 0.5 0.5 0.5
##$TPOFFS= (0..7)
0 0 0 0 0 0 0 0
##$TUNHIN= 0
##$TUNHOUT= 0
##$TUNXOUT= 0
##$USERA1= <user>
##$USERA2= <user>
##$USERA3= <user>
##$USERA4= <user>
##$USERA5= <user>
##$V9= 5
##$VALIST= <valist>
##$VCLIST= <CCCCCCCCCCCCCCC>
##$VD= 0
##$VDLIST= <DDDDDDDDDDDDDDD>
##$VPLIST= <PPPPPPPPPPPPPPP>
##$VTLIST= <TTTTTTTTTTTTTTT>
##$WBST= 2048
##$WBSW= 25
##$XGAIN= (0..3)
0 0 0 0
##$XL= 0
##$YL= 0
##$YMAX_a= 606282
##$YMIN_a= -519608
##$ZGOPTNS= <>
##$ZL1= 120
##$ZL2= 120
##$ZL3= 120
##$ZL4= 120
##$ABSF1= 14.98509
##$ABSF2= -5.573092
##$ABSG= 5
##$ABSL= 3
##$ALPHA= 0
##$AQORDER= 0
##$ASSFAC= 0
##$ASSFACI= 0
##$ASSFACX= 0
##$ASSWID= 0
##$AUNMP= <proc_prof1d_extract_pilot.lims>
##$AXLEFT= 0
##$AXNAME= <>
##$AXNUC= <1H>
##$AXRIGHT= 0
##$AXTYPE= 0
##$AXUNIT= <>
##$AZFE= 0.1
##$AZFW= 0.1
##$BCFW= 0
##$BC_mod= 0
##$BYTORDP= 0
##$COROFFS= 0
##$CY= 15
##$DATMOD= 1
##$DC= 0
##$DFILT= <>
##$DTYPP= 0
##$F1P= 0
##$F2P= 0
##$FCOR= 0.5
##$FTSIZE= 32768
##$FT_mod= 6
##$GAMMA= 0
##$GB= 0
##$INTBC= 1
##$INTSCL= 1
##$ISEN= 128
##$LB= 0
##$LEV0= 0
##$LPBIN= 0
##$MAXI= 10000
##$MC2= 0
##$MEAN= 0
##$ME_mod= 0
##$MI= 0
##$NCOEF= 0
##$NC_proc= -8
##$NLEV= 6
##$NOISF1= 0
##$NOISF2= 0
##$NSP= 0
##$NTH_PI= 0
##$NZP= 0
##$OFFSET= 14.98509
##$PC= 1
##$PHC0= 91.13159
##$PHC1= 0
##$PH_mod= 1
##$PKNL= yes
##$PPARMOD= 0
##$PPDIAG= 0
##$PPIPTYP= 0
##$PPMPNUM= 2147483647
##$PPRESOL= 1
##$PSCAL= 4
##$PSIGN= 0
##$PYNMP= <proc.py>
##$REVERSE= no
##$SF= 400.02
##$SI= 32768
##$SIGF1= 0
##$SIGF2= 0
##$SINO= 400
##$SIOLD= 32768
##$SPECTYP= <>
##$SREGLST= <1H.CDCl3>
##$SSB= 0
##$STSI= 32768
##$STSR= 0
##$SW_p= 8223.68421052631
##$SYMM= 0
##$S_DEV= 0
##$TDeff= 65536
##$TDoff= 0
##$TI= <>
##$TILT= no
##$TM1= 0
##$TM2= 0
##$TOPLEV= 0
##$USERP1= <user>
##$USERP2= <user>
##$USERP3= <user>
##$USERP4= <user>
##$USERP5= <user>
##$WDW= 1
##$XDIM= 32768
##$YMAX_p= 438352937
##$YMIN_p= -662911
##$CURPLOT= <Network HP LaserJet P1505>
##$CURPRIN= <$Network HP LaserJet P1505>
##$DFORMAT= <normdp>
##$LAYOUT= <+/1D_H.xwp>
##$LFORMAT= <normlp>
##$PFORMAT= <normpl>
##$SURQMSG= 1
$$ End of Bruker specific parameters
$$ ---------------------------------
##NTUPLES= NMR SPECTRUM
##VAR_NAME=  FREQUENCY,     SPECTRUM/REAL,   SPECTRUM/IMAG
##SYMBOL=    X,             R,               I
##VAR_TYPE=  INDEPENDENT,   DEPENDENT,       DEPENDENT
##VAR_FORM=  AFFN,          ASDF,            ASDF
##VAR_DIM=   32768,         32768,           32768
##UNITS=     HZ,            ARBITRARY UNITS, ARBITRARY UNITS
##FACTOR=    0.250966925370066, 1,           1
##FIRST=     8223.43324360094, -71447,       127492
##LAST=      0,             -9021,           -76526
##MIN=       0,             -662911,         0
##MAX=       8223.43324360094, 438352937,    0
$$ Real data points
##PAGE= N=1
##DATA TABLE= (X++(R..R)), XYDATA
$$ [...]
23881 -266774 197946 -118729 -65706 275031 -144328 -105145 -263404 12320 99930 115182
23871 115182 161658 -90286 -105782 -174228 59248 -51489 -125564 -64622 -210006 104325 -168682
23859 210914 85202 420405 136687 182719 192446 75491 218868 -114830 366568 -258244
23848 -63337 102074 154360 150927 -137630 -74086 -270559 -185777 -79381 -88273 -209303 314820
23836 109163 153649 -163290 107972 -269247 -154807 -96076 -159313 -144595 172743 -184007
23825 125084 -128804 -168729 -106862 -109199 -379724 -393783 70027 237377 -310768 97255 -279869
23813 -227892 -372379 13903 -125404 -75834 -259937 55105 319713 166539 -282980 -25316
23802 379571 169792 98025 -342560 -7205 -45705 -433058 41718 110766 205519 33535 -271602
23790 184468 -4990 -257489 -111926 35223 61364 -48797 -171595 120006 77990 33161 -240002
23778 -10960 -291104 20874 102328 -43316 -162966 148672 91215 157627 161298 90678 177140
23767 177140 -364542 -372852 -42087 -198479 -33863 -193869 -211672 -73262 105500 -26656 191719
23755 66478 -91199 -404971 139586 129274 299363 119349 37334 118110 -60921 -10881 -100470
23744 -100470 -101213 45843 -231314 -66946 -22006 -87629 310136 -30306 -191265 -145838 -55 120907
23731 -21075 77850 -67379 -365323 353082 -208513 -54158 292256 81698 -95106 -54052 114660
23719 333080 -305283 203284 -62045 -193818 -131466 45617 53257 -357134 7661 39073 -99238
23707 213432 -10001 85289 39254 -79380 76489 -132465 -31706 -67595 -102206 -32185 -3926
23695 -52004 -28039 -33448 -84064 -442102 -109822 -139484 262505 185082 15929 -227752 -82776
23683 276010 25212 -227950 426529 104460 -2138 -252698 206378 -13214 -34123 -235867
23673 -235867 -124194 169301 -45264 -82177 -53725 137503 328736 40434 131384 -16557 -139121
23662 -139121 -26038 -94061 -46373 -24365 -130738 12548 187533 121050 284925 -295353 -89468
23650 313332 191935 -69617 -85398 83684 -117054 299015 110413 135621 -204235 -99204
23639 134986 -131418 106063 -132428 16860 85235 -75537 93334 -154007 -71276 -135083 -107221
23628 -107221 -24554 183243 44809 14686 -201786 31201 -185045 -101775 -47294 149458 -166524
23616 96563 17164 334808 13662 -178559 36338 226749 163064 271620 -215852 169439
23605 82553 195266 -137423 -212321 -30190 121630 -5598 -72627 -249434 -124897 198489 54374
23593 -34312 150641 -389291 -29051 163754 63154 682 306717 -55426 225322 83128 -151738
23581 -199300 118779 -113875 90205 35481 42783 -57066 73644 -138588 -316593 -22391 -55594
23570 -55594 -237 118774 -126719 -162345 241047 -15226 340620 -366833 -165665 -27998 288502
23558 -108687 152219 -17923 -376585 -21404 -64922 111744 -71450 60638 -409593 84385 236208
23547 236208 -195886 -87056 177302 99318 -9013 80207 -165776 -165709 105769 -402502 24960
23535 -54878 -220756 18685 181038 -235431 -185666 -33449 81755 -332424 50197 -61876 187017
23523 53143 -175857 -45167 -33044 -118728 50009 -329498 -64266 -294515 50080 10208 54179
23512 54179 78049 207767 290112 245596 155926 56642 -237882 42118 -236492 -151391 -35381
23500 -122805 18732 -98508 280569 318412 -71004 -41279 146742 35093 68741 -226344 -304532
23489 -304532 -200558 61479 110012 123119 -45629 139870 80796 -74386 -167896 -286826 -59257
23477 -23068 124399 122319 78625 -107519 -14530 82223 129826 -114301 54603 93658 27474
23465 286351 -195862 -79779 36169 239071 9369 -134517 -205331 -77189 -96782 3096 -16102
23453 -47059 -232307 13251 236694 -189489 -107872 188894 -1169 -144856 112962 -46887 53797
23441 -90146 151934 -127539 -64516 108493 -13631 -63252 247983 158430 29059 -199224 72752
23429 -296221 72688 -94116 86413 68102 -43554 203451 27610 -80080 443548 47492 -240502
23417 140590 -59705 -68691 -49975 143185 -114981 -125467 -54640 -116606 -83217 130085 27692
23405 -181825 -57745 -186348 199877 -662911 166692 -60930 157092 55548 78098 77762 -10301
23393 -91303 331 -57114 97374 -315520 143520 192989 226272 187068 -572370 -251711 50662
23381 187834 215697 4289 63409 -52204 26187 243207 82609 -26806 19200 196547 -382226
23369 -4651 104973 -93451 89421 94291 -181231 -32018 -170722 176702 28687 -71944 74286
23357 -79885 -6718 7174 56931 -274697 242280 145785 -102328 -31656 -316410 -258868 -14650
23345 -151420 212832 -305326 -130121 -147659 -48341 -14955 16294 130982 -8678 -127283 -106560
23334 -106560 250627 -207 -272449 -278618 -162337 92763 239123 493202 140023 41435 101240
23323 101240 -167564 219166 85279 -178384 -183058 -36765 -125125 85873 -94560 199652 -124286
23311 110494 -632797 -182931 71682 -24619 -106326 -142984 156951 -39721 25738 -151971 69809
23299 -182467 89196 -56835 68172 -282224 -913 167912 -123885 290358 -310639 -9539 -229119
23288 -229119 70023 91426 -315455 88919 -34737 -19248 -110558 209545 -129019 41076 101732
23277 101732 33867 5727 307946 -67173 178033 -306286 -132162 -120567 149601 5692 -36817
23265 -108661 125826 -94209 -160661 -83135 163096 183004 -235470 -47421 181179 228882 -85451
23253 -213548 84574 354599 -176478 -212268 -131630 82553 362 42400 -40715 173003 175006
23242 175006 -183968 153250 40867 -49382 -31940 309515 -24249 2375 -43038 -242760 72402
23230 24145 -280918 265348 238601 278274 -247928 179706 -86044 -171593 -107010 -186889 121636
23218 -115453 -386977 113610 -40339 266041 163753 178258 27205 -423305 138884 -278805
23207 31539 -129008 4816 -162170 -216677 174896 98376 191625 -38491 13318 -164462 -62243
23195 -49295 154152 -143592 -48443 -103910 265573 -80056 220728 -271904 178380 -23091
23184 -236394 -21245 101349 11658 -212375 -98508 166983 -35146 -16400 -102874 49410 6466
23172 -80962 -337779 -36814 193516 72629 -1727 262 272304 -248101 327299 -292371 153418
23160 -45485 -64342 -218380 79181 -247323 -167047 303288 -229580 128049 158250 -85467 78980
23148 48091 -338243 -71325 129822 -309988 -57871 -235693 72689 -302457 61196 -29930 -122418
23137 -122418 72946 197575 27842 136600 -130220 -60353 99484 -71421 -411837 56603 -288985
23125 397138 80264 -311536 -33125 48635 102111 94920 19163 55922 233722 -227249 274425
23113 103090 -67437 47302 281855 -184877 -27215 -100 116904 36696 -70606 -96112 -74914
23102 -74914 -3501 -5402 -23492 -288440 38749 -12179 23257 -144859 171274 -160324 215199
23090 109034 101660 -28675 450378 -136713 92117 -239616 -70698 -303504 44406 166030 87648
23079 87648 268346 -47730 43174 -199600 144410 28657 77669 67746 -173263 -217968 -125501
23068 -125501 -80483 -83467 42361 -95200 -81280 12116 -278029 16482 127130 -218769 -257155
23057 -257155 129917 241854 -98974 135802 165555 -217509 -83731 267862 190961 273682
23047 273682 105976 -156856 258230 267346 212693 -62616 -92752 100692 -73347 -94484 -62587
23036 -62587 34756 -181333 -229340 -21515 20259 -114935 -62271 -182455 -157326 198641 42530
23024 118815 -238428 -116408 209633 -111549 -34052 9670 -151715 -5465 7702 -17848 -120865
23013 -120865 -340883 98956 -233757 -166552 183164 51683 -21502 -50384 -55532 42682 122423
23002 122423 -39452 128179 -103879 139506 -87717 -394857 -56204 -2147 66292 -213265 314677
22990 -195520 -44838 -8249 17163 14888 -38311 -339391 319511 213010 -51918 188529 30252
22978 45633 110916 143121 -119297 -221716 114579 -278760 -76558 100739 101989 25661 -10046
22966 -142547 -31537 -91064 -89112 261955 111612 -48243 57491 -166747 57495 -69186 -19121
22954 -140262 19118 82172 -212480 -195954 -73733 115867 -6751 -105852 335442 48721 85123
22943 85123 -173868 229107 149043 69675 -68884 242247 84427 92622 -114083 67986 -389665
22931 31162 137378 -148423 169419 7168 -110797 111359 416497 36685 -159526 96515
22920 -33448 -25853 -115053 -14956 282666 102558 -246497 3543 58033 43887 228498 -93086
22908 -12461 -23220 26316 -463631 66138 -387418 59368 -61454 265521 197738 -63047 -239428
22897 -239428 -10773 71550 45079 -146607 -9455 -219609 -4241 -198276 43617 159346 -84375
22885 -352884 -42525 54761 128299 276788 -413125 -270094 223845 -334885 -522082 -187228
22874 -238751 197968 282698 -134595 468996 36260 -4340 30230 70929 -121226 121153 95260
22863 95260 -103999 -62679 -78302 -193915 -220385 -199042 -287424 169964 264580 12642 -207649
22851 -90389 -233376 -117064 6168 256017 -122671 123317 -305482 1795 -86201 -44400 45762
22839 -198651 90914 -107401 31873 63510 117590 -76673 -59690 -130057 -456344 -119700 -81096
22828 -81096 -82306 -281003 161324 -128052 -374066 203043 -22153 118744 -224037 384259
22817 -208009 -148865 22865 -76476 -321241 -23723 148954 -121121 -31600 -215237 -63053 -93615
22806 -93615 42516 -16231 -95712 208338 104748 -181260 -73579 -327914 -123909 -27203 209081
22794 -191144 -213351 90337 -187850 13702 -145270 -83640 72831 -1792 -304501 30145 -107138
22782 214821 58293 -42595 -8132 256200 -123088 170243 -131358 123151 -82616 38424 -18134
22770 67376 -41652 -219378 -28461 -240555 -175410 111034 138899 51167 -32245 162651 -116677
22758 -90857 -80902 -283333 15812 -88309 -137506 388489 -211336 -69620 42387 97817 158165
22747 158165 -29578 -131432 99753 152962 154436 245623 -124691 237178 -1496 -156161 363882
22735 85452 -85340 -312899 -89856 -209085 -219309 77881 -65489 -294916 147036 138695 87762
22724 87762 -321251 10427 153782 132378 -106088 297718 -190112 -53533 27823 286 -100915
22712 -184033 131796 -190920 -144938 -202592 -78567 -92841 -42025 -24865 -162155 84358 203916
22701 203916 -53539 101167 -53317 4949 -195668 74175 -205890 -46940 423516 74361 -9010
22689 255792 -219980 119436 -95246 -237486 -2835 148282 -104874 -241268 245779 -78416
22678 219266 -16649 -242212 288576 -351240 413268 161051 45265 96989 -43417 -53704
22668 -53704 -165321 -168502 -50395 -81727 -297061 -17661 13449 130750 32708 -30845 115943
22656 79998 -119961 322350 -272081 -106253 -232603 349860 -91230 -41842 276529 119728
22645 -91314 -230998 -14548 -113773 -139992 -115144 194812 -33393 -128175 -11873 -125702 -282925
22634 -282925 35028 210392 -34285 104745 -10602 -24835 -113668 10621 -74391 -4361 -257982
22623 -257982 -386842 -157823 112665 82716 69989 -22557 402526 215661 71984 -90547
22612 111212 -323936 73074 -27757 67166 -372927 -29464 31032 -65526 114823 -78031 -126440
22601 -126440 168733 -21047 -34589 -143409 -22101 -180280 17606 -130169 62004 -71063 -55655
22590 -55655 195519 33960 51308 30403 -146798 -56256 37820 296374 -141562 -204079 65344
22578 -66669 125761 -247846 -27364 64660 90310 -108037 218677 -214129 111534 -4429 -27930
22567 -27930 22936 165565 -23425 -10654 -249800 -56576 54783 -180386 -115287 96412 -55729
22555 14331 167758 90174 395008 -138027 313312 387833 -285059 -42923 119432 227065
22545 227065 -334157 85548 -97008 36036 123044 10366 -68280 -480508 126964 76840 -131280
22533 34025 -107984 29820 -177894 -97789 153254 -156671 -97541 -347247 -219081 90709
22522 177106 76930 -28705 192967 -125846 -23893 -350272 123253 -65797 -469612 81659
22511 -114287 15331 -96616 -35006 164171 20397 -316493 -92120 165772 -420060 63934 -156278
22499 -10707 -10786 -243465 -119051 -32978 -8858 -7484 -236458 -135026 -132685 -216517 153682 -101468
22486 -59413 -153521 -160691 -143676 -85488 131455 36300 -176086 -284436 -203926 39155 -395 220748
22473 232320 94729 -163305 72933 -36263 27020 -43185 30570 29220 -234921 100763 50763
22462 50763 -90123 -179461 173412 -203720 -31344 22923 -158880 177869 -24743 -196160 151528
22450 40252 245235 -217196 -81517 -141648 95890 -169104 -221180 -245762 -82516 140597 -245584
22438 86071 37657 -109815 11601 -154309 -83404 -166695 -20971 92840 -4292 53076 -227179
22426 -9833 -281788 -240155 15146 76510 52483 62177 -149253 28339 -38061 -193905 45474
22414 27702 -178957 -325916 130951 36766 88511 -37734 -114538 -433184 18544 85031 -204565
22402 210416 -76674 126918 -161800 -101413 -263707 -157951 -100667 -65954 -165002 -63444 154723
22390 70967 90205 -307074 -133140 22926 185080 -170024 172854 -235514 170286 71169
22379 -43778 165197 -170436 311867 172032 -200026 -120028 45355 88378 211844 -55416
22368 3860 -32801 77102 512 217829 100215 229894 -109597 572 -122583 -109382 -233367
22357 -233367 68947 152365 368882 176663 -163781 74218 286764 -126738 -280538 188262
22346 -68715 190317 -109361 50492 -130053 -40860 -181231 117419 -136125 25625 -76787
22335 -33995 10542 65962 35113 173372 -61950 135786 -126547 -61007 125452 -48205 -190592
22324 -190592 -196839 379310 163490 237165 5045 58083 -173478 42089 145008 -150935 48270
22312 -156872 -23594 72733 -135113 -287368 108781 -290964 -35958 -287832 -109754 121461
22301 -22061 -14289 -4213 -176399 -107093 -383460 111061 47479 -48913 185109 -189706 -239186
22290 -239186 -174979 -253972 173184 118597 -195785 75079 -447001 40140 -148536 -123566 181582
22278 31850 -56752 -217282 -38574 -38355 -276621 -122479 99839 244495 -121164 -133517 67915
22266 3371 -183386 174951 188135 -224028 145134 117720 -55460 -34305 -12521 -152492 -52365
22254 -62601 57069 123578 -550271 -6431 -257503 19332 -230996 296241 -200496 58667 -52707
22242 26222 98349 -254510 -167232 230795 -238363 -90768 52652 237050 55967 -12977 341069
22230 -120306 -155689 -392638 9474 -3084 19803 -367717 -62031 193796 33184 -159997 -176865
22219 -176865 -51272 -253404 -79492 246021 -28854 -65011 -197991 -69878 54639 224165 -11710
22207 -325365 4309 16741 -71668 -239603 35968 -468039 -256095 -151174 34148 246325 224069
22196 224069 -32176 137272 -135638 -165071 156174 -149865 -31430 -97592 70817 1990 -177109
22184 113237 -149042 21311 -121026 -251402 -32945 -243317 202267 49581 -136157 -158037
22174 -158037 -78632 141746 132014 445 96147 332040 -27661 -161378 -52674 -146087 -98952
22163 -98952 -1806 -182837 -40240 -193490 200161 -18324 63862 -134928 -192904 -218804 244211
22151 -60069 348926 -147905 -181370 -64597 -43904 -476487 211061 -83111 142700 -20122 291716
22139 102826 90413 -31809 -289790 -345955 242038 113234 112149 7805 -140637 118125 90893
22128 90893 -264708 -79688 -201297 120924 -446200 915 -195856 -58991 -329547 -51369 291385
22116 305535 -64913 -56301 -123800 -202822 -183014 40153 176562 -24765 -160585 77559 -296163
22104 -186767 -143139 -97629 -37619 -48847 -80591 82677 -120552 -79974 130405 -232437 -281204
22093 -281204 -296733 76154 125793 207034 -117651 -87198 -155022 152727 32339 -45049 -213729
22082 -213729 286265 62748 57370 -195045 -22252 64042 166130 32066 -153408 -177747 35887
22070 -83910 -71326 -152861 -63783 -124145 -97221 -61023 -91719 -127921 -54711 52119 -109173
22058 31078 162834 18317 -318605 -141542 -203285 31244 -115117 -54800 -73431 -431690 -300490
22047 -300490 -99090 211647 178255 2728 -177836 65432 -181662 -22371 -144209 -281943 -237465
22036 -237465 -48724 -43188 -105646 -224716 36537 140167 10161 -470222 109043 -240641 -115631
22024 -100629 163977 262982 33667 77766 -108877 -13605 -188689 -7741 80318 -267333 210215
22012 -88625 194244 -314304 128705 -211530 -224621 -64871 178264 36146 196986 -205170
22001 -47750 -103861 321804 170772 -15733 6338 -112127 -198476 -6857 -37552 -286601 1121
21989 -26118 -53413 -274803 -137795 -58372 -12820 181734 -301692 -135694 141497 37790
21978 -55441 -82761 78858 15576 -3206 -120535 -168526 179176 296293 75721 69199 40295
21967 40295 -10631 -196789 -150758 -442570 183704 -292578 -197856 -50872 -39851 -219543 52394
21955 279263 192887 -95946 184625 161755 -185802 20218 -65419 94241 2812 -265772 -212137
21944 -212137 197397 226002 -37781 -72956 30844 55835 -78639 -224824 113073 -94378 -27008
21932 -103610 -153688 160256 -195928 -119814 -140674 -72667 -146086 -179607 -16510 -26484 -293458
21921 -293458 -255347 -341812 102367 225617 214868 -62669 17862 157432 -9819 -336020 212717
21909 21687 -58943 -122840 85423 73831 -29018 -54702 140074 -64317 -268956 -162498 -34028
21897 -36438 190024 -287433 -136962 -101379 -237266 87246 283509 92338 118022 -102271
21886 -198227 -31840 -31509 -80126 90322 -83164 -444294 39660 21958 135527 139095 -182291
21874 9721 -148016 -99348 -235185 -208789 -199682 -247790 44473 -182998 -7986 -1918 -93888 213154
21861 -206155 7793 -244598 -112889 178834 90059 453355 -345412 47114 275482 -225722
21850 42311 88732 85076 -280755 41047 -311463 79948 1016 414666 -54465 -566923 107979
21838 -154524 -51872 134516 103259 482402 166200 -37678 28487 -57916 -30932 231652 77795
21826 -175932 -177126 233614 -23741 126307 -100962 -42834 -162446 -76829 78981 -202937 -290956
21815 -290956 113499 77925 96611 -129810 -4435 330475 51442 464 -99427 193607 -86206
21803 -45933 90815 229789 110126 2728 -264143 98741 -241662 46609 -54533 19845 66417
21792 66417 -93137 213339 -211246 -60642 10334 -34262 54130 -92349 -149019 -220314 126544
21780 154732 498546 -619124 -443509 -13111 -185171 -122789 -235627 -201878 12270 -138718
21769 45165 49147 1621 -111584 -69176 -10578 51979 -109845 16621 82637 74216 -258895 -338018
21757 -338018 -43882 -267789 201811 -317430 179440 -73110 -244148 -4124 65237 -187085
21746 -35368 215562 81230 48516 64582 103864 43910 -315447 205881 -211019 18954 -180855
21734 303504 60224 51344 -40444 216097 27563 -116593 -198557 85049 30974 154644 107512
21723 107512 75586 -214006 -41442 553540 -25988 -375601 -102468 229802 -403649 -567966
21713 -567966 -335526 -115581 -160406 -190944 -14703 92685 123485 -62943 -39588 -55677 -9188
21701 -499121 -220651 21616 -110906 -25929 -15858 375911 -187565 183774 288550 -177413
21690 -75041 -113988 -108461 75556 -5740 -212099 -114901 -327706 7083 -158835 213539 -192690
21678 -139986 -211840 -286194 -139171 -117439 115690 -203094 -332244 -277372 -83474 106130
21667 -183555 -185019 -153783 -269121 -236659 -50244 48787 4005 -118752 -223271 23521 -235039
21655 91483 -97487 95309 106005 -5251 -43763 58311 166115 -236794 88545 -285352 -119227
21643 197749 136361 -226042 102773 96361 -107554 -50263 73269 -36241 196347 -470257 47342
21631 -11781 -43812 123826 -227385 -176558 -21213 -155203 -73390 -155455 102104 158658 -120707
21619 15042 191917 -114159 187270 245784 -79119 -199178 -394269 100901 391810 -159396
21608 -485242 284874 -268906 -211913 -68292 -32452 38028 -95120 -15342 -109499 89474 -235933
21596 -528137 -59774 -97563 -298409 -74192 -41865 -68473 201050 -112196 -88440 274325 -168317
21584 -88665 70745 -5023 -264571 308782 20424 -247002 -176417 -48780 -39356 -155916 -83184
21573 -83184 -163580 -221644 -128811 74104 -119330 24846 -54300 -218947 -37295 -335547 -135387
21561 -91398 -134597 62184 85112 -189550 60416 -41253 -301217 -54810 -53682 12357 177299
21550 177299 13558 -207140 -113827 -10791 -548067 -226226 -77383 110323 158241 -212801
21539 223648 -19025 -189342 -104388 -65706 -66512 -168705 -89336 158292 -12344 -248868 169907
21527 61032 56269 306717 -138441 -36656 -150777 -57125 100121 -109521 -151144 -148062 -72887
21515 -75653 -226731 131455 144603 -173933 80269 -292557 -71433 -67204 40356 -21894 -281952
21504 -281952 -4881 167028 109676 179603 20849 -116342 -113807 -111102 -74915 -291001 99583
21492 -571552 -57859 -253424 -27002 214545 131357 43158 -123306 -169264 -184075 -117640 113182
21480 5255 4093 13223 150341 71873 -95189 -60228 -122360 45917 -15606 13174 -159555 317600
21467 -164493 2819 -100704 -43085 -100763 -17876 -295724 -204950 11595 -322132 -295587 -24405
21455 -26003 -42987 2273 -199125 -44967 -50771 -7411 -370231 -369925 203754 -304093 231318 2159
21442 202576 -34683 202745 204401 -49430 -13252 397684 547082 -68195 -90477 323792 -102236
21430 -50621 48398 95970 -317170 52063 145434 -105004 198242 224072 57504 -243162 10834
21418 -70250 -557576 -6240 -42276 89893 -88422 -173611 105525 -235893 29283 107399 -172207
21406 -56658 178660 31622 -172833 -133506 -250857 -30287 -20291 -33826 -222065 -67285 -151394
21395 -151394 203728 -53384 99374 -15234 26961 -133143 -198265 301511 -31079 112070 136752
21384 136752 -81111 271792 16435 -27863 -104127 232356 -49624 302313 132943 -209603
21373 -63697 -109650 -165235 -91826 158064 -101116 -230372 -85580 -122050 -4121 185310 -252186
21361 -168623 -111478 95697 -68871 356284 -45718 -450 -14752 -101000 -47926 98106 186316 -93120
21348 -145119 259674 163610 79241 -109208 -317850 -124261 -98541 -235355 89788 210992
21338 210992 192161 21254 -85129 -130053 240066 82040 -426500 -293765 120201 -168334
21327 121952 -181629 -259182 -73417 -276275 -108681 76445 -17292 -66215 30019 -52150 -216764
21316 -216764 -88573 -67892 146774 -31437 -152706 130966 -226805 201398 -221818 74976
21305 89396 -299794 56599 256029 -391699 -4749 -366265 -118549 7537 -204780 24324 -186166
21293 -540968 -228003 -90678 -275449 -28884 -74722 -11349 -59552 -73849 -285887 -158491 -312745
21282 -312745 124668 -243148 -153024 -140698 -378113 -275129 80867 -8369 161115 108764 102743
21271 102743 -92996 -75538 96277 109175 74156 -123103 -424530 135878 223911 97435 -462077
21259 -105477 215831 -262595 -19680 271331 116018 -506364 -177565 294333 -328472 -157385
21248 438380 27838 -196106 -53604 -116871 81915 56066 -196537 14461 46473 -19242 -129817
21237 -129817 -141944 146973 67931 49891 -501135 -254256 -305149 -340724 -2835 80191 -168141
21225 -157762 -223927 -123493 119519 -113401 -29371 -44070 217117 -32750 36562 -38285 -35399
21214 -35399 290230 -255815 -388800 13769 -236393 17357 103398 77431 77963 173234 -157774
21202 -365506 -53912 21052 299015 246941 -254184 -53180 44207 -200456 93478 237838 -461681
21190 126616 -169164 -18931 -9457 -95044 61250 -89910 114731 -222759 -1281 -23823 112477
21178 -10667 -75824 -108211 85018 195697 -18203 113090 -59022 122223 -314142 -125113 37717
21166 -9076 36976 144881 -45393 -75743 -19418 177617 -15440 -54337 -205 111980 127628 152798
21154 152798 -126897 -281705 112152 -31998 16341 109589 84556 -91666 187845 -122930
21143 88781 -16792 148185 -187597 -252501 -179444 -126579 40253 -91282 25979 -144341 -17741
21131 181072 -226512 -36335 22908 -179626 -255231 -145211 -127625 -105827 17135 -195233 200196
21119 112078 279562 -59739 33070 274247 132674 -44741 30114 225626 40850 -141416
21108 35884 -190809 23897 -294543 -161167 -316507 -52882 29405 114258 -83513 -54295 8465
21096 91988 -75873 -92599 -4664 -141592 -104871 -263188 48971 -338606 -288201 -144929 -14640
21084 -134987 26381 57844 -4348 -314149 -249245 72380 -119785 -345557 -40168 362833 8347
21072 -117327 -114611 -93382 -434400 -36850 16744 -72769 11858 141324 -9570 -247096 -58914
21060 -211655 -113152 81831 -154991 -79586 134887 6003 6386 322880 100494 -132939 67777
21048 -61001 -221063 118822 246914 -113533 107493 44785 -105643 256714 325957 34600
21037 143560 259921 -126495 -62575 -65682 -75117 146433 -456638 -40352 -115974 -162831 -241012
21026 -241012 32021 142088 23914 -48460 -138639 -72045 91397 -269154 -375683 -20728 207706
21014 185767 -136380 172581 -35723 38425 2397 27665 124618 17601 -168927 -104459 -105809
21003 -105809 -375169 -190948 -150024 186422 -44969 -348596 -258616 122298 -24261 246305
20992 236090 -170261 24859 -70090 -13349 -7973 -11321 61863 -399261 -300492 85482 57454
20981 57454 -192132 20218 2219 -299841 -27705 3159 25590 40921 40675 217693 243966 -94884
20968 -50571 66066 29186 -209933 -190830 -65138 -144930 124579 -25873 -16333 -230266 -136406
20957 -136406 -210129 -86543 -37409 -121789 -123674 134941 -51524 -192007 -140416 149644 -114590
20945 -528902 -95762 150392 -215250 39348 -310214 -410600 59574 390247 -138632 35762
20934 161020 -63579 -120966 -85195 1709 411705 -353312 -418491 -204701 21583 -42354 -171114
20923 -171114 -103917 -98986 83103 189290 98271 -133273 289061 -75055 403089 186369 86881
20911 65888 -247208 -130778 -168083 -115550 -281357 -69530 113428 9146 -9300 -200573 17621
20899 -4688 -9543 69454 44106 -104924 -87871 278504 -196750 -284615 15764 -133812 -13293
20887 -218840 67937 -142982 -13397 -316947 121813 -65871 -294227 -427230 55673 -106524
20876 142110 72924 60142 -77750 113225 69978 -6868 -233595 -145109 33790 -639734 -10113
20864 -120539 156829 -18799 -186895 -10061 -39854 -360192 151177 -159436 183761 75543
20853 12205 -22290 -141677 59216 11545 2763 -155671 178442 -321450 -4435 -302979 -9173
20841 73496 -106528 -99551 -88794 -296440 9126 -53898 -273782 206621 -259145 -141961 -134041
20830 -134041 -247222 -16720 232422 -95987 -463696 -359266 -180993 -150639 32258 78422
20820 78422 133562 -3717 -304295 -11496 12216 -306050 95396 76365 55223 -162950 -227042
20809 -227042 -160765 197264 -101711 66699 58800 -167489 182268 3104 -156002 301172 -199573
20797 373300 -390755 9684 179239 -154749 -85010 148536 -53585 111753 242907 -133965
20786 -117498 -239701 -1030 -126112 -43665 -77833 -129891 64129 -90087 238458 -220432 105419
20774 61898 -161355 182367 -79204 48196 -124086 -75690 60796 97165 -62511 153150 -12714
20762 -270989 -41172 -84345 -206835 -200887 34156 -157909 -233777 34704 -102922 52083 26456
20751 26456 -243403 -70694 -312621 -165796 -310102 -40172 2947 -135906 -109225 -5768 -272550
20740 -272550 -413889 -262066 -143610 355020 -296569 116843 -89022 -173340 -374724 -547181
20730 -547181 134588 -211118 -43791 200862 217340 -322742 -51545 34629 -157243 -144158
20720 -144158 87915 -159750 417049 -374794 -291597 -152982 -127488 250724 -19397 186219
20709 -64535 45415 30502 -217833 33565 -17916 -383397 65704 80055 124818 63488 105511
20698 105511 -75038 309841 -287382 -124224 -203079 136669 -141132 -161457 17558 15974 -181278
20686 277473 -207301 85826 -252054 -159795 -264445 3811 -239952 62617 -48675 66086 -18688
20674 -149228 -37039 -210072 73642 -105713 -628489 -119835 67560 113395 102163 148969 -6294
20662 -80289 49636 -185949 -311471 200330 -118963 286286 -162048 -130610 13713 -175819
20651 -144034 64734 225782 37347 77525 112485 -80074 -48793 -249123 60238 -44863 -239154
20640 -239154 -101632 -47811 156401 82060 -151090 -194798 -96902 -134715 -83782 72553 125340
20629 125340 -104247 -85092 -538547 4657 -75630 -69071 -294121 -14533 319267 25859 -313259
20617 37344 23150 -323086 -31441 -149537 -168735 236971 44436 -425101 -129839 241856
20606 176926 134970 -392896 340552 -165312 43674 26778 2978 99968 -86170 118281 -66282
20594 34985 37534 -301964 21536 -4207 127435 -408541 60724 201764 186830 366234 192156
20583 192156 22371 -8954 -93648 57414 226971 219240 79181 23986 -218714 -229997 -212983
20572 -212983 -57487 -90147 -159626 66386 -185099 254116 -42707 50910 -147903 -117363 -139313
20561 -139313 -8854 86623 -108009 189471 -87977 381540 -145469 -280486 -115950 -293006
20551 -293006 -239460 71214 17777 -208203 29106 -268540 71490 -275920 284474 -314719
20540 -250201 113238 -185068 -280650 -108438 -260320 461335 69883 79123 -90640 -141690 -182007
20529 -182007 -110389 18813 -44090 -97585 190101 29049 -206262 -34522 83717 -82322 236966
20517 93664 256412 -69569 -409286 -255068 -281597 -81622 -53172 182426 -134590 91914 41205
20505 -50062 -149898 -121528 -54694 -185362 -14502 125072 -59810 -263313 -194673 -230762 -180256
20494 -180256 184850 54959 -78986 -72263 -148970 -46635 180447 -57757 -183622 -67944 -17130
20482 -101800 -295051 -108074 -21926 -150723 81608 -128408 -1301 65228 292042 -230103
20471 -70650 79989 -42598 23698 -159478 53415 -149849 -300054 -36602 48568 -307285 -91772
20459 -207530 346420 163321 -434158 138874 72431 206014 -275739 -216513 124589 -279122
20448 -289299 -192475 6672 140364 -124968 -164869 -4516 200544 -93025 -121916 -39925 -6041
20436 -217473 -99567 90777 51585 -77767 -57796 -177171 -46140 124201 -74593 338011 -361
20424 -21251 -274974 -273138 -219166 48999 -104748 -208917 -67128 104081 6040 -35668 -3932
20412 -155686 -68465 31835 -235592 -233585 -116062 -25997 -100136 -263210 313216 -19934 -90615
20401 -90615 44799 -170041 13155 -338108 9186 -114309 -22952 -225189 -228455 -314513 44902
20389 -231364 -57115 122929 -196388 7980 -147107 -51162 -73146 -72421 190993 63443 126484
20378 126484 -221896 235917 63988 -16443 -154854 51215 -332299 -310587 -74410 199251
20367 -166250 -8642 -126715 183105 223063 136377 -120582 197865 -288391 -98607 99120 25373
20355 -47155 -23539 -150357 -100344 -175757 -177571 94728 -306366 -116980 225460 -138326 32156
20343 -283478 -140466 397286 -205129 -345474 -364245 -90677 146274 110874 203135 -191301
20332 -187036 -44019 151435 6195 -26616 -43268 -337780 -156998 336404 128698 -41084 32680
20320 169966 -229887 7754 -286577 -54080 -215773 -156699 -99679 81948 73325 -25572 178897
20308 -157897 -13101 101787 -221307 -95472 15411 45283 203660 -56902 -206278 -347557
20298 -347557 -109023 -240098 -115542 -44131 194148 -184980 -42387 -139203 344771 37441
20287 -87499 -7051 188747 70677 -181568 156886 -261519 -60943 114342 83969 -226799 -92766
20275 52460 -287382 -94423 92709 -217496 -280271 -394821 -317090 -106106 -39154 288754 -423049
20263 -193376 325374 -1591 259825 -148421 -345423 -13127 -25502 37059 -338420 -115028
20252 -194905 139465 74460 -468168 -204023 -291943 82280 -17388 51651 -220058 -31386 -32440
20241 -32440 80740 106583 -16316 -54792 -448590 -100676 1238 -73220 330153 -63273 -67948
20230 -67948 2510 -23982 -180356 -304355 -103775 213703 84508 -158498 -261334 224492
20219 25130 -33781 -60056 -195128 255052 71949 -60112 71839 -38812 -1359 19853 3447 -27231
20206 8642 -72934 355548 -396793 -83625 -228918 223877 66701 -45233 20422 67111 104663
20195 104663 65473 -187058 362693 -169991 -21603 -3946 24166 14401 109546 -26194 70714
20183 4661 177882 -68477 -579 -171257 -119211 93044 -161465 -48335 124285 -116010 21529
20171 -311490 -291950 -42637 -184002 -129075 -33822 -17949 -119269 -50288 77965 -138942 46412
20159 5360 -260278 22166 177492 15064 203103 146855 -312264 -6814 -38127 -202598 -10358
20147 34444 -57864 -182083 -98008 -2937 124659 -203469 -56261 -84546 -223074 -20048 -22290
20136 -22290 2417 -32379 -400310 96806 178461 150801 345893 43157 -66411 181763 120621
20125 120621 20130 98496 -118708 -6904 51022 -176140 -344265 -83678 -20868 113048 -32741
20113 -37089 -52406 -477980 -194013 -51625 -301717 -184476 87515 108547 15197 -119051 68257
20101 71532 79379 102848 -111104 -83490 -274865 3594 -45855 91931 -80671 -33535 72216 -22283
20088 37521 265523 -233682 227463 222150 -198956 -147367 -201474 -357729 -108012 -382437
20078 -382437 13050 -114117 80870 -76427 -235291 18110 -62558 -229080 143804 107197 -67966
20066 17000 -215142 -171230 -147587 84315 -179050 34823 35909 -24144 -21157 -922 75759 -244642
20053 199049 4135 92977 370135 84143 -117727 -277791 -174842 106880 -275236 29186
20042 12124 31116 -206772 -97999 148141 76959 -63281 93529 -133358 -28713 -191340 2332
20030 39286 -40610 -268055 101090 -159569 11750 -77033 18097 -185540 -112646 -150845 57189
20018 -131421 156280 51575 -101034 420 -20708 -97338 82629 -253687 -194415 -60815 -100081
20007 -100081 -245535 118674 87380 -242296 -249936 126700 -127705 40324 -21000 65935 -102610
19995 101828 -63474 -136642 -309346 -19018 77505 213889 -98599 92126 -145701 -227685 80965
19983 -21954 77336 -117753 165037 38909 -50421 86793 -85391 158171 -798 55382 -151317
19971 -70292 -638375 46299 78191 -33026 140819 301278 90649 -167544 -50851 180055 11899
19959 -294615 -192887 213228 -61646 -171816 21252 -148540 -133785 85666 -316572 -114557
19948 26696 108826 -190224 144120 -42738 -132787 -38654 273579 -44409 -264251 -102843 -38894
19936 112738 -164346 -16026 -175328 -234254 -27575 172444 105687 120990 159325 28181 -283639
19924 4622 -117208 -196753 -222940 62339 26111 16024 55217 193939 42445 -30792 -80781
19913 -80781 -189390 233556 58000 258173 89233 113211 -135317 -99009 -159048 -92078 108924
19901 -61972 119968 -84094 -171274 108042 -238517 -8844 -343598 -163159 21996 -494040 101431
19889 59393 -43026 -128748 1066 -154783 -136340 -89659 -176842 10786 408576 -195168 119404
19877 87739 -23326 -89850 -43248 -219193 -135656 -145403 -358565 -76281 -134613 -172194 -246494
19866 -246494 24501 -518533 167066 -460406 212918 -201341 180163 -385842 -91992 12003
19855 45383 -278449 114434 109233 106988 -184689 -273516 -70653 31410 74945 -193371 46627
19843 -76809 192871 -145182 -344258 -27003 -368670 42004 98616 137016 -147507 154637
19832 -92181 89805 -148037 -142320 -306317 -272464 -35185 224159 118422 -210741 178487 158105
19821 158105 -227991 -57165 -77208 52431 -251192 -14400 -170290 -82199 -262479 1195 -137251
19809 414173 -88494 -256859 160142 36240 -353966 -263662 33862 -126877 50952 256837
19799 256837 9665 118053 -101578 -25846 -1296 275385 -204589 -502188 5227 64060 -133476
19787 -255105 -285321 -68633 -82785 -294674 79679 -393278 33082 -116299 53804 -70717 232076
19775 -163839 104329 86217 -154476 313395 -91775 -161093 139887 155459 -105582 44686
19764 -155455 215248 -216108 -291320 -102219 -32321 92408 -80084 7639 -90648 -44189 84670
19752 -324911 -70231 -262649 23620 -43432 -275518 -118465 139896 89236 -67447 3285 -63070
19740 179316 182378 -25520 -153185 -346333 -85817 282792 117915 283186 -32523 -309001
19730 -309001 132448 134518 -82349 44741 109677 142057 69709 -61776 -377140 -34895 -6687
19718 -218251 315 196508 26433 -74418 -47365 45493 -150594 360312 -141273 -116903 280291
19706 -362570 33407 30635 -150736 129730 -247503 -64691 -38496 84241 -158002 121517 -1078
19694 -11428 -146498 -251126 -300442 -33063 134759 42609 -14858 -72881 -1328 16665 -92085
19682 -12071 -294353 214181 140070 -80992 -74222 -175006 -292071 -96159 101812 34230 -50278
19670 -220744 -173614 96983 67507 -51479 168198 -405279 -72867 -293469 -119975 105690
19659 -210177 -150554 -217788 -149363 -154586 -149189 152759 -144059 -41940 19303 28467 -215851
19647 -23829 -497322 77650 110812 -69816 -11424 -263347 54342 -237575 -14871 -133393 -223367
19636 -223367 -11910 37568 -557519 18373 -100883 118164 201128 -25577 -93312 100669 -339355
19624 -105657 -185873 -166670 -191468 -318716 -336828 -259275 58417 -25542 -9047 13494 -33427
19612 71731 128400 -333529 -374958 22890 202797 -182121 125718 -86087 -178669 -206596 -37400
19600 31965 -462086 -103575 -256589 -286464 -286049 38708 -406138 -13443 122423 -259600 -500983
19589 -500983 -436828 14485 -112459 -343268 88779 -110745 98392 55182 338469 -250488
19578 -69404 411751 79544 -131193 70638 -108040 -153797 39207 -219215 191390 -45950 -123531
19567 -123531 67423 251335 -8223 -53702 45714 -151201 65286 -279737 -149104 -39270 -340000
19556 -340000 98871 -135866 -111656 -224889 174919 9644 -94242 31210 -97410 189115 89510
19544 -101382 -235193 -75322 100153 400210 -148419 67583 270628 45588 -235220 -11211
19533 -86429 -182753 -44073 52538 -54982 67969 -222968 -168942 -285376 13047 -257023 -224736
19522 -224736 -1324 -136657 95481 16260 -8018 -198689 -8091 223439 -171459 146930 101641
19511 101641 -200035 -239801 152170 -156009 23395 -51551 -21858 -336149 -36410 -341116
19501 -341116 40885 260520 1357 -34957 -65736 -159997 -48817 145878 -328880 -193561 -3630
19489 263370 -119476 -3589 71664 -455618 -306066 -21206 -43568 152589 -88394 93561 59629
19478 59629 156798 -159857 255530 -39150 -67623 35250 -61089 -14650 -118483 -208094 -54670
19466 101464 -270398 -76930 -3897 -412759 -17603 -302736 -25734 259125 101438 -252624
19455 286598 256271 -21417 -52944 -29617 -15324 -74716 175068 -132370 -120996 -90383 141792
19443 -53475 61186 141218 -118603 -83634 -160514 -341344 -221314 -234129 18163 109161 -222214
19431 109255 139986 -27023 71230 -180055 -36531 100030 -191923 -239677 -227516 -230209 127104
19419 -132152 113400 -75209 -179286 30799 221132 91731 103399 37044 105081 -58908 360245
19407 50980 107258 -164667 -112201 -303020 70463 -484393 -46770 -211687 -130028 -113309 27824
19395 96938 163313 -110580 7174 -220900 -149363 -79585 1743 -159128 -252655 8168 119630
19384 119630 14013 -192180 191232 84150 -66422 226935 -129755 -42230 -101144 43135 -275956
19372 -235035 -147552 -156448 27023 7528 -161702 117833 -220911 -134152 -149780 78609 86219
19361 86219 168059 225039 253091 85217 -82756 -337108 -304035 -160634 -293919 -104664 -64756
19350 -64756 -27792 -57514 207155 19140 128923 239635 -84912 173987 -114275 63626 -3563
19338 -170382 -2691 -311653 189582 -85657 237016 74408 -34264 -171320 -132414 109959 55301
19327 55301 137376 -265560 22816 -147033 59433 -159508 58653 -292578 -27210 100903 -171685
19315 -28112 -142027 -54186 -108426 44834 -77077 66941 -16913 -243440 -304242 -184871 -123890
19304 -123890 -111631 -31819 52046 -144364 -122817 -234263 100359 -112826 -425716 -13217
19293 -35196 -154871 16409 -245791 -72910 -419575 -61575 35925 32444 129 280327 15727
19281 -166538 11254 14688 -335911 -243760 25446 -157262 83376 -31603 -12776 72096 -313528
19269 -3660 -18534 -102373 188502 -84437 245954 -104696 -426630 -50140 -247420 -119875 106262
19257 -240145 -287133 -322007 -107096 196904 -157872 -186109 221476 -125535 -82907 -216503
19247 -216503 -68067 -53919 -241987 -173060 298957 69127 -176008 -286874 -102895 -67057
19237 -67057 -57413 -163929 -244246 -226948 -123133 -83505 67756 -56897 391261 -257038 233083
19225 53589 -35075 -5136 -20960 -271669 124114 -765 -152690 -346611 -148493 -81232 -203790
19214 -203790 93982 -287260 -259053 137160 94529 -14788 64842 -77234 -320754 -551608 -64110
19202 20656 -196423 -258144 125942 142261 -329073 46886 2301 -83009 -505650 -21331 -50194
19191 -50194 -241359 -165777 -155986 67604 793 250911 -189741 -303761 -68861 -31174 163325
19179 155126 -206443 50453 247001 34330 -99102 -235124 346 337 -285421 -127189 81028 -124738
19166 259697 -108749 -141571 34961 -175044 -322796 -195031 180105 70965 -47638 50718
19155 -71563 -14012 36378 3680 114588 -210215 -73412 -178089 291075 53800 -102708 -349170
19144 -349170 -87112 -66655 -60913 -189170 92765 -295140 -162601 322989 502020 64778 -308498
19132 223454 166963 -124310 -82478 -96413 45140 -235787 -125059 52474 35597 348095 47778
19120 -279088 -45510 -238011 -140433 -61998 198282 -363487 -63479 28027 -307394 220005
19109 7657 -97391 244929 14941 -83321 -180718 -119301 224355 132845 66065 -42897 -1689 -77722
19097 -77722 86970 -112951 -54790 228762 -165329 112322 97059 -509429 -179997 -368195
19087 -368195 50535 -60871 -23641 -469325 -322006 133 -227796 208030 334324 -141091 188933
19075 16648 24628 -8890 198604 -80258 -101188 -226036 -266881 -44894 12163 31008 -25146 116856
19062 -84108 91109 -141312 -79406 -817 -250880 -24639 -442195 75496 58637 331346 -34161
19050 -71781 134702 -179467 -47936 -292016 -359387 -349215 -18625 -41076 -75969 135666 168030
19039 168030 -253445 -139311 -102041 -242693 130916 6222 277998 405740 284945 243973
19029 243973 28887 -162574 89049 -43573 113773 225719 135504 336555 401291 -36709 79129
19017 294751 -73899 35243 270590 11863 -41614 -223616 -47150 -368 -42115 -439177 -84841
19005 -360113 89414 -48502 -157009 -115689 -139679 68768 -127969 154662 -87987 -72296 -63469
18994 -63469 -65282 83971 -64909 -184810 212736 -170185 -271154 -34428 -61289 -56008 -38266
18983 -38266 -8975 8205 -230196 -38055 -59336 32266 -53026 -214051 -29992 -283549 81209
18971 19336 -229948 37054 -95743 -232485 -24968 -289753 -12789 -277257 -178321 -13885 -18451
18960 -18451 -56281 -156024 -7690 -63338 -44087 -254300 -303790 -216340 -220338 43902 4954 -63363
18947 -268374 124094 -102872 65575 -66790 -85838 140484 -266579 105752 -345312 189041
18936 -115493 93568 -257071 -319997 57295 -30468 -247985 194292 53530 199756 2913 -83573
18924 -245324 -94501 20921 -9697 -1668 -192018 86672 97094 -184117 -173798 -5111 131008
18912 -87661 87129 -18400 -122431 187079 87190 145851 -29735 -10013 -76372 -69331 82613
18900 -40658 -174205 -130309 -102740 254767 408 82162 -144097 -541581 151015 -231755 -14706
18888 -116026 78336 -6729 -248142 -102049 2222 -29160 -57603 21823 -217575 -228974 -169454
18877 -169454 155500 113690 -51413 225383 -224947 -28573 -128179 -136649 -142128 232880 -240327
18865 -127902 -128820 47048 301531 35405 138549 -150920 120069 33474 -263068 -82351 -350848
18854 -350848 -143528 131021 -257115 175334 -92748 42556 316903 -201745 131628 -125347
18843 -214301 -15860 -81136 85168 -138104 8417 -79856 -89329 -99706 -56293 -299079 144985
18831 -38209 -134555 107863 -63256 -106644 -163861 -287851 337129 -38989 -194329 -45620 57120
18819 195041 48615 90962 58503 75715 380052 -108310 161586 148387 388017 520390
18809 520390 58538 358974 117934 -100575 -186213 78982 -347205 -36260 35771 -37672 -208212
18798 -208212 -55616 19725 -244197 18419 184602 -58211 -148144 -487824 205575 118999 -154212
18786 -244199 -169272 99136 -150706 235900 -368015 -307578 62394 -61435 -277565 215007
18775 119746 144440 -187627 -114024 -250107 284485 -210238 212125 -53130 145608 7046
18764 -92754 257687 -12731 -447381 -159137 116810 -94720 -111576 144668 -109830 196374
18753 -193482 6311 -354613 -153501 267296 79145 -103205 -213624 -59994 104718 18160
18742 203321 -57243 -18939 -59508 -141563 -156020 -59609 -77191 -358120 88062 -268302 -385945
18731 -385945 75817 -19792 261450 19297 -199422 -103082 -215928 -205620 144540 -59700 -66829
18720 -66829 17558 -19120 98323 -273401 -76856 -281191 -309820 53377 -185929 -108728 -210806
18709 -210806 -145030 -44923 68870 87405 -45793 -21045 -285237 24165 -330395 -63622 -109152
18698 -109152 -31451 -203811 -304154 -241103 37634 -67135 127108 -46183 -394197 181925
18687 54001 80957 119341 -65736 -240120 81472 -74542 244395 -263891 271817 -282128 24554
18675 -89200 64889 25482 46988 56682 -209822 199711 -205376 -175621 -251306 27670 192826
18664 192826 -209211 -113498 559 18640 29451 -194732 -159580 -149592 -242244 54011 -344577
18652 -55626 86886 98483 -245957 6219 269274 -116863 173340 210888 -92485 -256280 -138531
18641 -138531 -152827 72378 -102809 -130051 -90143 -22896 192548 41222 96196 -386366 4143
18629 5384 -310176 -190876 -155819 -119613 -13501 -14447 -215066 -36776 14241 230666 243834
18618 243834 -72332 107448 -166038 -327408 -161158 6887 -163567 288983 -422960 20040
18607 -120837 -214837 -56301 143132 -25932 -150185 233925 -398492 90960 -327931 -156345
18596 -23298 -191789 97925 205160 -240121 -304866 174537 -134656 78895 -447618 -116553
18585 64338 115126 78689 -88320 -105365 -182724 -173300 255932 16550 165853 328921 117537
18573 -95738 -55745 -53521 35176 42408 -299453 222903 -299951 -89583 -21386 295031 -199399
18561 125028 41482 -315931 -86445 -109328 -294308 -9352 -94798 -151175 -109584 129957 -209491
18549 93233 -78200 303654 -214409 -199152 56929 -250275 -283647 91853 -215906 186736 -623
18537 220859 138109 -50754 135774 -321641 -117371 189150 -139715 223548 29421 157531
18527 157531 59116 -56877 -199140 242552 -259598 137839 15592 58368 -65356 135605
18516 -106339 168303 82303 -414095 -58434 -102431 -181169 -91230 -8933 -361365 -38492 -93836
18505 -93836 143746 -304729 -180377 -14043 -83221 -13278 103002 -209861 -198982 -239691 194107
18493 -273795 23864 45608 -266761 137343 58043 -58707 96078 -146335 300284 33142 -142015
18481 -220950 2898 280 82472 259180 143715 -4350 2947 44112 -223042 -49673 282434 32980
18468 52455 -35796 -188387 335785 -121134 -194250 79678 -193318 116443 177196 -109027
18457 -16562 164046 80240 58242 -232806 -259224 -313754 202286 50114 -296605 -141017 -4396
18445 6537 21869 -184411 30962 112945 102009 -104037 104125 280579 7275 -205451 -273448
18434 -273448 -60730 -165685 189817 167879 -233352 86536 26360 -99154 101896 -68619 -60789
18423 -60789 31016 -132616 -131469 -103487 21389 -271139 -190897 65549 194244 277751 33101
18411 -148952 -46703 239273 -67126 -37490 -26505 -206823 -83198 179646 198699 76242 54576
18400 54576 864 -92715 -101072 106898 -240469 -194049 14580 386860 60485 -263096 -183486
18389 -183486 -91534 32779 134666 20081 44854 65477 -111695 -87562 -35598 -132360 2546
18377 -239508 32994 153772 74558 93808 -215105 -149290 -67780 137320 -182606 -203597 -102456
18366 -102456 276066 21271 446322 -179487 -47413 82301 6657 171071 -16739 131161 -70236
18354 3290 119783 -179715 308379 -86170 250810 -276485 91080 -351771 -7679 -26508 -143768
18343 -143768 -1609 69668 118655 83000 -252208 90933 206975 18110 -47651 -313356 -3141
18331 57952 44756 95418 92057 -29635 58085 210627 -361713 215446 77271 -56332 -127562
18320 -127562 -114999 -321576 -93947 -61306 183487 134823 174125 -374972 -108067 -57792 -160654
18309 -160654 -144724 10283 102806 12505 367915 -409928 -117954 -13779 113889 44268 -99494
18297 -235550 38063 99751 92767 -7449 -42114 -61446 149535 -30290 -204602 13226 -321071
18285 -53619 103434 -194655 23579 -55959 -104022 -97985 -14786 -64692 -38576 -132265 55641
18273 -19505 -293184 -258471 -335040 125385 -178575 -159447 -252560 7617 -90400 -330586 -189911
18262 -189911 244007 -43904 117300 -526467 -223718 -175932 68173 15808 69908 -351701
18251 100896 243576 -279626 -158349 67692 -170953 80298 153536 -198073 -39414 41362
18240 109329 171250 -67560 207707 -255725 -152834 51225 -126251 -487362 34148 -74774
18229 -312559 -140060 -63701 -92487 -235969 77826 97073 -96358 -12322 -178020 -259671 -127788
18217 186813 137132 -14922 143386 3401 -110706 66155 -95993 66560 233291 116444 -42730
18205 -287874 244905 -113675 -116053 -124022 -319924 1503 12543 -92892 -101074 -131601 80743 87192
18193 87192 -119790 -14771 254860 33896 228164 93934 -74759 38287 -176054 -113622 -221405
18182 -221405 117809 -128074 12635 -187103 58412 -205908 -75443 168087 -77905 -283609
18172 -283609 -155163 -64338 -151957 -64394 81993 -59763 849 -397482 -13158 29766 -99143
18160 -229000 2100 -254584 164706 25212 -478264 -194213 -250904 -292160 -53471 -117882 82122
18148 -379729 -451335 32851 -93289 15980 -183764 24104 41801 -103161 160120 -391460 -34705
18136 83098 -101042 134096 6843 -102578 -115505 63519 -152235 -16149 -446158 77747 -257272
18124 -59922 9454 -156090 -127246 -68772 -31040 -328337 152660 55316 226210 -148353 -278853
18113 -278853 308719 137058 -214136 91450 146540 164806 -88523 346403 -37705 -106280 24015
18101 -205278 67018 -64515 -181600 30183 129909 109001 108071 -157175 10633 53577 -110611
18089 101468 267347 337420 -248783 -16193 -81747 97490 -123198 69081 -97779 -60206 -132763
18078 -132763 108601 -349425 -252051 -179295 140578 -127058 56290 -56892 -119948 -86392 -106251
18067 -106251 232333 77917 380086 -973 102716 67310 -162985 -224468 -116969 179913 68401
18055 20303 -46750 -30729 -139654 -33752 109607 -353444 -121079 -96232 -20296 117071 195004
18044 195004 -154322 206743 92245 28799 -28272 -242029 79613 -213042 100424 -127223
18033 71123 144237 -286533 -97379 184324 -396489 2786 -302212 -126158 39511 -76983 144469
18021 285214 -128802 346 -142105 21354 -132534 96104 -18571 -198255 -89632 7240 18897
18010 18897 -162048 -4719 102109 -92870 -469002 -157358 -191173 102896 -195364 -241971 49536
17998 122191 146333 -281367 -163708 -196462 98267 -233140 6540 134582 -173036 -142080 -385907
17987 -385907 -78180 83861 -81284 337 -325819 435059 189925 -234621 -138668 -14143 271297
17975 -321425 19317 -14676 67970 -104930 -79744 13143 -127105 -148085 -433111 233495 7535
17963 -181119 -166104 -96297 -94329 202667 150942 222844 -60078 20527 173667 -112419 -7094
17951 207853 161810 -326477 -204157 -6688 -127783 137325 -29265 -129598 137840 -309129
17940 160994 -159188 -174034 -210021 41358 -43334 -86808 -212570 -93337 91352 3411 -185573
17928 78291 -68700 135334 -97765 309430 -84067 299008 -169857 -17474 -99200 135851 -46951
17916 -168159 -69669 -26316 99583 28683 -294111 74165 50616 -85635 -83961 -156164 -214713
17905 -214713 611 105250 -168615 -589574 124369 129195 -165631 -49222 -327441 -54360 177219
17893 -43845 -39146 -110568 -94582 -2610 -59501 -55813 -141385 -86772 50438 359261 -1025 215951
17880 36246 -145648 -372583 63601 211558 182536 72799 118482 -153447 -121499 -157845 -387344
17869 -387344 -28386 289563 138850 28661 241702 -261485 48866 -73179 -61841 232581
17858 55614 -34526 -64869 227384 84730 19095 167015 -51362 -225803 -211144 -285935 -95446
17846 187561 -319779 -174862 368411 -80437 121116 150326 -157190 35122 -109541 34324
17835 -101305 -53765 335541 90821 -35473 115138 -64392 -221006 -282364 27004 -238031 -345957
17824 -345957 -122944 12139 139484 -281956 -232693 113550 75255 128084 -368840 -225037
17814 -225037 183217 124798 121686 -46610 4673 110623 108078 -136851 32287 -95755 -557081
17803 -557081 39920 -109571 -86814 -258725 137490 -22512 -145331 141023 105694 -115671
17792 58311 -9586 -41638 32508 -173510 -117224 219701 -347747 -294454 150642 -80447 -379470
17781 -379470 -136065 -141414 34107 -126359 -135669 140010 -3772 175635 44873 238588 -152625
17769 134612 -192982 -15127 64099 -14810 45458 -58123 16598 -32507 -179291 -82107 152729
17757 221481 -285270 151026 -301555 -107589 53146 -199465 172014 -87087 6076 79591
17747 79591 183241 -33224 112959 -125997 -50212 128252 -116633 -205173 -21326 126916
17736 227442 80641 13140 -140727 -102749 27609 -319661 107367 18732 9574 126785 23166
17724 -30893 -40125 -42204 -248410 167078 224018 -250843 -19325 90932 -232740 -24711 27836
17712 -91369 276191 -81493 -309698 33356 -202329 17741 -257962 -89593 -4901 137341 -62962
17700 152566 320362 247163 -282651 -8942 78132 -30710 -105892 -155039 19026 177953 264837
17689 264837 148239 241356 -54193 -211731 27105 -183501 124373 -287064 -32315 153044
17678 75961 442365 4455 -129474 112946 19417 -276956 -150372 159879 -68040 -41423 -140856
17667 -140856 207610 -4569 -130354 -31401 153447 -126527 61258 -104794 151562 19003
17656 -189579 -24093 -69509 95083 52329 137470 -340837 175533 -220310 -261370 33786 29170
17645 29170 -406322 96000 -38110 95079 184091 155645 93474 243807 -28904 -62166 152289
17633 -63930 -56420 226865 -128177 -75167 -132909 -321248 143383 46186 183737 -305841 396114
17621 297613 -57929 231488 84733 17876 -97353 334138 -190661 -217656 126363 65713 -37627
17609 -80442 99743 10994 -14432 -95653 -31650 87514 -59215 106347 237453 -280618 162161
17597 58871 62867 -68490 55955 149418 94687 -191978 244715 -8784 -180621 140398 -12113
17585 35222 1774 -33464 -56784 277083 260338 -1661 192829 450585 -307208 -226976 -24650
17573 -99278 181595 263835 -34005 -40003 -44215 -115570 67538 -191650 108752 -57074 397401
17561 7944 112658 -7489 199240 101069 -73809 -454925 42774 -371429 93576 18675 -124070
17549 253247 105868 -725 125563 61882 109875 -134608 161414 229637 126440 52917 27208
17538 27208 -240880 48134 345977 -108517 -65657 198432 -170541 27885 282731 60268
17527 -106846 407850 -2484 -98894 -3785 138254 60677 -165809 297360 43606 59741 -101174
17515 47572 -3593 31089 137876 -7101 29448 154894 222738 67864 127038 -373081 216966
17503 -102073 34373 123900 -88212 -96203 166561 -150416 33117 158397 309129 -112963 133432
17491 -287506 -75613 137814 135611 233281 288639 130877 180540 55429 423138 389684 241966
17480 241966 415486 86876 -251398 146891 107623 -106093 108996 130354 224520 -224395
17469 -77952 309918 598592 360977 347778 -10660 147310 -98044 173389 51976 84220 358955
17458 358955 210580 58148 268322 139600 176162 78241 262634 239783 523910 311310
17448 311310 92730 135598 597494 524718 63469 74706 570464 149843 282429 105337
17437 109247 74284 57821 239244 14249 68261 597353 179021 -12032 108735 116532 432794
17426 432794 114530 315556 367552 164610 402798 177790 317094 -78281 -67831 444492
17415 -192455 453784 -41828 279922 25407 279068 87687 15458 98371 52415 129982 107792
17404 107792 212085 57521 278778 216874 115295 104569 214409 277684 -52037 413100
17393 287755 298976 62799 75234 297449 285937 205099 109940 42890 187570 92672 -14564
17381 464721 63660 81078 97231 225110 249045 118105 31039 -124166 -6442 475332 55404
17369 -159229 90504 -33612 114547 221620 203055 -195144 312671 166485 360692 143547
17358 379597 -122653 278583 246810 113916 273833 136146 130481 -68587 315352 226857
17348 226857 61446 201593 170583 346192 -70774 127939 276664 395472 -96066 52517
17337 249163 213578 39637 32104 -3691 122689 9041 97423 264336 400725 29233 -53623
17325 151594 63021 60940 157859 456554 113370 -47210 193637 61928 136885 -112901 89178
17313 47266 128860 206589 -12774 297614 266317 -47906 193658 350191 402592 112376 183433
17302 183433 298442 296203 135054 82469 -4627 213207 156296 132077 -51494 185459 266535
17291 266535 247489 271703 196678 417695 407013 172528 36013 227009 238331 282912 11942
17279 35038 152390 353358 -56836 390034 333802 -95818 108241 -649 -71001 120613 207981
17268 207981 246389 410806 162831 175796 -8466 221679 279812 148068 166941 392715 -181710
17256 265678 149479 -54279 153326 44520 52460 220824 189102 230686 251736 177895 434257
17245 434257 -17602 80811 168715 231926 293880 140876 113988 2294 445746 -38964 74925
17233 -63270 74520 388536 -30374 172759 -67754 308424 219459 -103471 467761 239986
17223 239986 345211 330298 269677 -104657 138140 -105555 81029 194371 49948 30459
17213 30459 158022 -176219 385587 209941 160956 -34974 246659 353764 225718 411418
17203 411418 146042 147407 290273 158225 40007 247175 136228 496901 80444 -5739 -13537
17192 -13537 -218373 57788 332179 263167 27948 85525 383521 147818 115889 -227528 259920
17180 667546 116978 434010 118885 155231 232615 307058 285321 262614 124750 -62014 254124
17168 436144 311124 222420 221255 22840 496563 163795 172754 108097 280137 277321 275396
17157 275396 389829 199081 162698 196988 392967 -1146 -7532 206796 106479 193875 -148602
17145 473949 279232 446563 -100785 206691 361764 169204 392019 240476 114655 129133
17135 129133 328047 291707 242570 418540 612678 572593 174502 29446 301796 171697
17125 171697 14071 451394 28567 571101 116046 408846 630826 4103 95973 227903
17115 227903 310347 187764 -2715 45022 421306 476485 191840 405052 182480 226136 143795
17104 143795 501888 267492 292964 201628 175758 559751 421220 402259 141437 530347
17094 530347 283736 323203 376356 398989 238173 211692 513128 322212 268546 441933
17084 441933 213258 326514 470977 324794 826304 293340 356668 243312 500502 595082
17074 595082 249077 224677 534459 498898 244889 340840 459705 743988 618794 291662
17063 202720 304161 464862 481398 480767 652870 184942 541429 620885 643554 649426 645367
17052 645367 272557 605846 641012 552292 316904 399050 836554 489764 494373 410865 545968
17041 545968 502257 426237 627169 400227 506515 552458 423914 615817 463458 583448
17031 583448 285941 281822 387672 485110 632372 820876 268836 464432 609691 379997
17021 379997 609692 463714 620252 577632 551696 857850 698329 211046 570074 582363
17011 582363 714304 335462 521943 584810 779703 967509 902210 800841 748054 714177
17001 714177 754568 590470 499245 701689 927530 505215 222097 685741 832585 373129
16990 787970 948815 702016 754762 642465 830639 732527 826266 883612 733517 1134542
16980 1134542 752170 778928 767845 736706 651290 685842 976009 825280 759957 927813
16970 927813 1015014 911395 965500 1044930 1151419 892495 932823 796727 986396 948924
16960 948924 948671 924342 991736 758990 754582 794595 974504 726880 877310 1024221 1037627
16949 1037627 854485 1007039 1073024 1134204 1042211 906196 1099576 1071654 1165955 1223537
16939 1223537 766462 1087753 1040624 1159639 1324052 960319 984861 1018899 1101253 1086796
16929 1086796 1285537 1289172 1219570 1425233 1327907 1387060 1500257 1228708 1305012 1236499 1114753
16918 1114753 1268739 1245457 1110965 1212300 1532769 1191501 1577626 1664024 1557267 1541511
16908 1541511 1408085 1301962 1374109 1727177 1501494 1482129 1432265 1723285 1692910 1788043
16898 1788043 1549921 1884137 1934083 1923652 1349652 1718086 1385678 1711973 1809801 1990210
16888 1990210 1997018 2003587 1975764 1959055 1887406 2166138 2141738 2167169 1844863 1903909 1953579
16877 1953579 2190629 2357414 2219857 2278815 2145457 2137693 2239218 2205833 2411452 2235688
16867 2235688 2566508 2422165 2625375 2531551 2374860 2442582 2511545 2806791 2589536 2781232
16857 2781232 2627475 2892170 2742924 2862163 3259913 3277894 3013510 3037735 3139203 2932013
16847 2932013 3168511 3476524 3541501 3425104 3447906 3863149 3622421 3758993 3586752 3910784
16837 3910784 3890683 3560146 3953204 3895663 3923375 4065076 4507107 4313345 4413236 4520610
16827 4520610 4423549 4404865 4860360 4893036 4671562 4894283 5081140 4952979 5369836 5222324
16817 5222324 5297309 5701632 5621336 6169275 5983013 6129872 6227148 6476750 6523527 6899962
16807 6899962 6620642 6951616 7108421 7239635 7279038 7395591 7803103 7860377 7939710 8441539
16797 8441539 8316126 8730643 8823448 9398573 9497314 9434371 10104553 10194158 10825032 10914953
16787 10914953 11275441 11419162 11744638 11910280 12042859 12535781 13215793 13413834 14103722
16778 14103722 14213154 15057687 14953255 15800994 16374483 16720927 17531645 17820856 18762044
16769 18762044 19484372 19943777 20581934 21503109 22568563 23473232 24389238 25355586 26310869
16760 26310869 27480415 28323151 29823225 31008025 32280294 33954349 35340690 37173697
16752 37173697 38668427 40515286 42491278 44883151 47659146 49573237 52597246 55051729
16744 55051729 58320627 61492484 65095187 68612664 72700514 77089389 81551813 86135732
16736 86135732 91458406 97079887 102602456 108824747 114923012 121360991 127979147 134921318
16728 134921318 141263274 147951170 154866626 160805811 166469516 171345274 175484451 178458454
16720 178458454 180822949 181187818 181248493 179989096 177033583 173500176 169281785 164102045
16712 164102045 157625103 151676936 145100395 138008385 131163638 124632942 117689966 111234689
16704 111234689 104914505 98577549 93210771 87853746 83086174 78422245 73925396 69668193
16696 69668193 65838358 62192745 58650810 55483372 52708084 50169176 47499982 45085394
16688 45085394 42714386 40670376 38735632 37027684 35162691 33642707 31782998 30812014
16680 30812014 29390757 28116435 27081477 25917205 24717449 23723691 22827238 22378884
16672 22378884 20861177 20523046 19543943 18783684 18240031 17542733 16918160 16466473 16011763
16663 16011763 15667985 14779899 14297659 13799840 13717932 13175913 12597098 11921314 12216315
16654 12216315 11620992 11103207 10845902 10350996 10504993 9695684 9786619 9415603 9110751
16645 9110751 9256354 8660368 8324084 8250930 7916757 7882808 7690340 7609324 7456753 6913647
16635 6913647 6715559 6658768 6771866 6594279 6412265 6212210 6217559 6159926 5789940 5548012
16625 5548012 5966158 5593447 5357523 5514406 4991738 4759590 4803109 4707384 4881431 4525451
16615 4525451 4409433 4377289 4183779 4041058 4218085 3974004 4130408 3838192 3996221 3846637
16605 3846637 3714722 3957931 3793886 3283813 3717934 3317117 3299585 3195112 3286736 3330642
16595 3330642 2898661 3157050 3208794 3086417 3035734 2730339 2490683 2783673 2942436 3042870
16585 3042870 2488977 2509565 2673920 2181431 2815281 2573279 2678015 2557700 2659991 2184547
16575 2184547 2340470 2255055 2438143 2355656 2174706 2285349 2251783 2189492 2140528 2152828
16565 2152828 2049567 1948469 1818905 1983746 2223932 2132967 1865846 2161216 2139287 1536967
16555 1536967 2007185 1603574 1578007 1643778 1653984 1642093 1606359 1667616 1489107 1530668 1810216
16544 1810216 1610247 1312509 1601726 1514851 1565966 1367436 1285585 1411391 1293457 1215572
16534 1215572 1246331 999632 1457184 1163115 1367218 1112030 1170856 1469212 1459206 1223991
16524 1223991 1366398 1169615 785950 1235537 1240191 961882 1259026 1055602 1193950 827591
16514 827591 962704 1118501 883425 1045759 805683 1245931 1088541 826753 965029 811958
16504 811958 846320 865454 829964 957610 799210 935332 729011 1107584 776955 1220592
16494 1220592 924805 1035186 926452 1290402 751027 610319 955149 1103601 915568
16485 915568 792985 989753 713853 697092 809846 711050 618997 826168 662995 719299
16475 719299 847410 652956 754310 479411 711147 651693 569261 575323 827211 662576
16465 662576 561504 953660 695036 589219 1091380 678536 643961 636493 869986 713070
16455 713070 801976 601525 701714 673011 813172 579244 500778 682855 345564 759618
16445 759618 515739 257309 696772 528242 278053 340769 679043 239940 722571 388773
16435 388773 452399 271361 1080296 549616 752921 471114 356407 469080 430739 499518
16425 499518 560474 741937 857308 364409 627521 341230 350591 703477 523846 477648
16415 477648 322294 195276 337517 190482 464338 277294 228202 280329 303836 231139
16405 231139 325855 317184 337691 196993 371866 368647 596185 103411 498992 560136 197802
16393 553854 334143 513124 513246 559151 384019 152078 424871 94203 440504 484748 -103431
16381 291167 216366 312933 572689 19622 245476 236489 115044 422059 413164 238157 481257
16370 481257 259342 410017 292141 363093 369714 309200 292338 278378 412854 92270 18474
16358 119566 231861 66616 119305 50967 297593 329724 265038 363886 360649 228542 345471
16347 345471 198895 341367 347329 274912 163705 -63389 414698 520308 184893 292589
16337 292589 327884 248712 314801 434580 19609 473953 220133 431077 310403 410317
16327 410317 -41831 487328 275972 360707 142863 262736 140097 193879 354236 123161
16316 -52594 -87868 319914 295319 213362 100857 128553 59265 239161 -65821 130981 88046
16305 88046 216621 122513 446137 235363 530672 307981 254533 148839 315635 267970
16295 267970 141295 -50799 163672 151589 271472 199146 264770 44942 273439 96441 397738
16284 397738 319443 416722 362220 74817 284008 334656 278584 195887 -58229 145853 69412
16272 127243 42384 -252490 264726 290662 122646 211122 35951 95171 69143 237816 444308
16261 444308 60281 232033 -75704 380686 230162 337207 368323 122089 105109 184468
16251 184468 -197530 113995 -9579 115313 132359 295981 280570 -12941 125675 177240 77061
16239 -13688 -22351 16222 155253 -181744 377331 256852 4840 -241512 115849 36235 250345
16228 250345 169784 220624 306013 -13469 172122 -132777 188425 365861 52160 51662 170772
16217 170772 239130 204891 152022 -281030 296094 216162 303962 -143057 -137253 -48865 256084
16205 113394 -124053 -16362 -96286 74940 100484 265556 287111 211880 111732 169206 229555
16194 229555 5798 111028 49436 -17541 -217590 23573 51745 101384 -20225 176059 216847
16183 216847 434920 -103885 1040 -253749 168092 -111729 -187742 131560 228934 271339
16173 271339 189571 -165315 156906 163727 206213 117596 -16471 39727 -130196 155882 259376
16162 259376 291886 25854 324859 -19853 251242 -102862 13568 87583 -121869 157980
16151 5405 104395 30270 64669 -228698 -280118 330953 31883 -102187 -312988 -379 200831
16139 -67522 -216859 154750 -184419 -276868 14359 -22920 253910 159646 -394083 118978
16128 -175960 -198339 314098 94662 -121688 66361 380590 295785 26690 -50070 178080 26342
16116 -48234 249365 61558 133343 165755 43315 -175170 -168654 -237337 423545 -12951 31989
16104 78936 14803 362756 -185430 -225602 -185009 68478 -128 -52484 195643 51788 -175148
16092 181614 81816 -13857 -240806 308126 246657 -36326 -68479 -148467 92791 160437 -229378
16080 -24879 -110392 350128 -52237 -77647 -30246 -145214 301329 -65163 191609 -106609 69093
16068 115648 28382 -60722 -198702 96842 103726 -324800 -62808 25117 -108812 -428434 -31879
16056 22301 -62524 317488 -187146 67147 33820 -99063 252323 -135147 38374 -107376 5687
16044 -57679 145632 43140 -5029 321558 -56282 -173673 128412 -229630 -418370 -199112
16033 -152609 121012 -301317 -49668 -85192 -234587 38605 -309015 -161002 136055 28135
16022 15524 -53392 206497 81259 -269722 42444 -344853 -5999 -159642 181351 -38363 136872
16010 37518 -228049 30176 -243441 -84933 -26494 -362413 415989 109527 -123998 -69913
16000 -69913 39826 169973 86936 220032 -120874 46871 139161 -414748 179639 85860 43257
15989 43257 -73199 -199440 -221859 473554 93125 368057 330743 -105256 205187 35043 -120726
15977 214352 79568 -89685 -182519 -41675 -77702 238352 -27891 337121 41609 318669 252698
15966 252698 10302 -38918 164036 -164351 -217179 -70842 114672 75095 -268293 411764
15955 -165516 50786 102826 159469 188170 7148 -46649 108485 -185330 -91506 29679 -9138
15943 283200 -47166 -266990 34840 148963 -348188 22186 299250 63551 133555 59466 17513
15931 227581 278905 -80329 -262930 -22336 75898 -255066 -139018 79205 -40309 165706 -19286
15919 -20538 66040 -77272 -552734 94346 355909 -173001 -66038 -166372 -187972 47064 -207902
15907 35101 30810 -366967 311973 143923 -139263 20773 -194170 -126185 94487 -324859 137247
15895 122844 -8014 56804 -128720 497 -28641 5681 -170226 89702 -87850 -208740 -78561 -281490
15883 -281490 104083 -353188 6371 74051 40582 99100 207848 -131190 -332057 4500 -186889
15871 52247 172463 25112 220409 -323301 -583462 -201818 58408 -302923 -217277 -198176
15861 -198176 -160380 -174931 18006 -248950 -140526 6951 -77635 22766 306214 92115 111407
15850 111407 11454 246186 -273292 -133339 -115599 -265452 -283448 -299291 -359689 203291
15839 -479980 46541 153697 131495 77346 -7317 -110747 358 -381020 -52710 -37072 -181732
15828 -181732 107225 39736 173744 -112951 -76206 -111540 -178576 126408 -163988 -536031
15818 -536031 -406331 -193951 -196158 85733 50672 -16829 243502 -81072 -174278 21710 -263915
15806 -147829 125008 154181 230274 -53855 -89582 29621 140777 -171111 25080 189263 115088
15795 115088 44835 -86931 -252089 40076 81169 -28406 142731 150987 -179054 -166896 -272302
15784 -272302 93967 9582 248023 127173 64728 -163791 93568 191024 65919 -291844 57630
15772 -158087 248231 -296108 102425 -174209 114852 229364 -360122 151245 158140 -57690
15761 103778 -202106 -41813 -357364 314883 283809 471652 17382 328435 213196 -225951
15750 327945 108855 -161734 57821 -215736 288971 -20097 113011 172455 -258838 -152933
15740 -152933 -275962 69750 -57225 166361 -147316 -199530 -66196 -185539 -234333 -131174
15730 -131174 59641 -160729 122737 265805 -12526 -284718 -687 34291 -217584 -206006 283809
15718 -156533 175693 -59426 -190569 -631024 131324 -241987 194624 225063 -87231 41706
15707 83072 -263448 -59453 -82757 -138702 360827 -103651 -222298 -79336 253238 -18558 73092
15695 -401337 99076 398683 238427 211676 164702 175364 244711 96968 159667 -163689 33093
15683 -53009 134926 48925 134197 -167454 352715 -34508 -125238 19548 125829 -108189 -142436
15672 -142436 220528 20489 327475 112072 -126414 115650 145776 -220655 -103823 12562
15661 -114462 -447843 -264042 -24522 -9031 272107 -58242 -133834 -129967 119862 -115454 -198042
15650 -198042 -24915 -239882 237561 -79998 234249 314645 -55960 -76647 -205938 -105344
15640 -105344 271379 -267746 -269765 -265087 -286337 -322453 169143 -247522 -146564 -122933 132802
15628 65567 232191 -92246 -318057 -259556 168073 16234 -366194 -8602 39446 125177 -207367
15616 43837 -186679 73812 -194421 119443 -162757 313 -100474 130346 -112007 -70487 -249039
15605 -249039 -225615 147046 281433 -367108 -76249 -5082 -80812 -183755 -139608 5013 -21589
15593 -47413 -250043 -11524 73923 -50607 1982 347396 -368640 -104058 51127 -18227 -114737
15582 -114737 -3920 -35682 -137010 28435 -231010 -84784 -115506 -176932 -89321 96952 -133981
15570 -15905 120675 -244187 -42178 -10547 24526 164818 173128 -89400 237364 -166068 182954
15558 -132133 11671 94184 -19225 -310019 -47963 382452 39485 -253497 223257 175168 -87724
15546 218604 208096 113443 -76298 -243184 -127185 -140278 5058 -26185 -69970 -309761 -20105
15534 -17969 -307871 -38344 -53481 123133 70402 -115780 208099 -113566 99204 238913
15524 238913 -63604 -110068 -343802 212393 -221154 38820 216633 311835 -33298 -204158
15514 -204158 79310 -186727 93968 -344396 343292 167643 2637 -105303 -166273 -23238 38854
15502 184221 -38446 -6180 -380641 -54685 -122452 -217583 56967 -273212 111570 -114417 -12580
15490 18044 -50969 -79092 -376198 -25377 -136332 -99229 73144 181197 1791 -90014 -162890
15479 -162890 -64647 -86233 173285 -66625 219895 -134483 174555 69365 298302 13853
15468 334128 -16829 -206271 218568 -6546 -231262 -69151 16779 -79887 234421 -240917 -191538
15457 -191538 213325 -310877 -68336 -74671 98507 314628 40982 -210370 205411 376755
15447 376755 408024 -131069 -153879 -319599 -240369 132102 -314305 56528 -67937 -131953 -154397
15436 -154397 -182412 -38880 31127 -124690 -443471 -143540 -265732 -113641 -135108 117610
15425 154323 199121 278425 -112144 37043 173420 -213374 62500 249161 347698 66666 -107058
15413 -6630 -3299 71858 133864 -47184 -222741 47798 -260384 -99611 31201 166350 24850
15401 -75791 -135916 -223622 -366479 -12157 -269729 26753 -82577 -112199 -141766 -124602 -206732
15390 -206732 -65504 -113583 -352805 -53274 -17719 105399 142205 34492 -167429 157706 -34921
15378 -174126 94821 -25796 81106 -31296 5983 -160103 -428296 -42417 49895 122840 -246227
15366 -122717 -23949 259873 -155052 -129958 242814 -8332 -124710 -6944 -123831 130857 -48704
15354 316784 -16291 179421 -10492 -40418 -102598 -140476 -175701 -114490 69868 -148419 -19430
15342 -86810 55225 -169714 193866 -133870 130260 16640 -159722 123346 -102069 -12208
15331 94663 -154282 67687 -39219 84608 1241 -811 20045 56876 -63666 -44695 12001 -39071
15318 -49821 -161591 82207 234893 77070 98632 -45840 51826 -61734 6924 -321090 -4680
15306 -79029 106775 -28427 -227713 261839 -275737 159543 182653 26075 -162097 162823
15295 -13699 -357661 120968 -44430 -77765 20464 96123 -224830 36907 -110942 329442 226749
15284 226749 325156 97442 316966 -66939 226797 -85076 -79212 -159916 -312249 -181984 -62427
15272 84612 -168875 -58049 144148 -372887 -30924 228968 82252 237618 -113481 312893
15261 178723 197620 -158247 181602 325385 38975 306875 178674 72000 63712 -9016 313788
15249 226077 412278 1462083 1191692 955005 1409000 671940 635405 374017 18514 208164
15239 208164 -106250 153287 -6462 -78896 17682 190733 -44728 83255 -398427 -10016 64218
15227 -360644 -48652 -154423 -78995 -105289 118496 145702 231168 -317533 119402 191271 117205
15216 117205 70192 -164074 42470 191091 11754 -26695 35362 94635 -74843 -189336 -168867
15205 -168867 161360 -112539 256253 -64236 -8165 -48267 30674 -119513 -13421 310737 77965
15193 192452 35207 76204 171275 -29166 394721 12952 -118630 -98327 -277031 46193 513560
15182 513560 8308 -301219 154847 47582 -157883 2107 600 194494 131968 -77232 106205
15170 -4374 6114 247146 87278 17740 355182 295087 278576 -153238 -138056 75498 -44959
15158 106188 98159 212856 157124 100201 415 -68600 78438 -13988 14097 -122334 -270917
15147 -270917 -41772 -195569 -3425 184327 264275 -94269 26945 259555 203796 119728 83467
15136 83467 -215074 239206 -130919 122747 -101296 -161094 121134 41825 -82880 -59391
15126 -59391 391455 118662 -63442 186152 47065 139061 212724 -13428 136027 203076 181810
15115 181810 225727 69343 51334 94320 53022 -140379 457897 59739 163503 85941 210659
15104 210659 151618 107303 -180579 72192 164425 111533 13023 -29864 116967 110405 -23686
15092 -96245 171993 72158 314161 226125 -50697 -106983 47807 33085 65819 -78398 300268
15080 116655 81691 110950 101164 -69655 121599 65652 241255 -90038 105029 306204 96972
15068 -207932 187350 -240092 -10351 59721 423332 40694 183346 214749 -28092 183242
15057 95943 69832 251099 -96452 149758 97428 17357 245879 137344 424250 -71031 69223
15045 292204 82095 -39780 258163 317382 349272 133621 323711 137850 72565 58908 51478
15034 51478 159373 126252 -9508 -54326 357358 24514 -19742 62138 488982 -36354 -210673
15023 -210673 -24866 231488 121880 273639 54036 326302 -69447 12429 297750 159790
15013 159790 192083 37944 288683 84275 112685 292708 324974 238908 -42116 199601 235550
15002 235550 111176 27358 270079 241018 265861 273970 127130 499144 207151 127658 37120
14990 -58913 282064 299158 -90020 -95799 568200 125714 111761 -134132 187783 233540 386076
14979 386076 30494 236521 -8551 216405 302493 522233 284912 103774 245705 119528
14968 -98426 432002 154487 324936 156011 369914 85641 172808 333303 52609 70287
14958 70287 34525 375064 252078 213939 484032 308091 290625 356606 416226 199309 196240
14947 196240 439095 171731 77670 341396 374817 98155 431899 325208 275230 129381
14936 593846 109919 158716 370957 207136 463514 -23715 66034 153203 421759 381152
14926 381152 239571 83307 188568 171539 193962 193932 565926 438023 94394 326834 233296
14915 233296 239456 110956 605655 220289 358064 262989 472568 308394 273581 160033
14905 160033 268457 328448 455597 -62831 621987 523934 342983 221573 287411 308969
14895 308969 322032 340839 494404 292904 391219 318903 437354 337090 347832 371706 454887
14884 454887 463346 419020 675946 281185 685749 473892 346291 381414 410090 308627
14874 308627 243880 430591 64754 250851 -47894 212699 398618 138719 79517 615762
14864 615762 942 371721 236463 -63716 594354 447657 60370 144918 615818 264340 415190
14853 415190 217044 383531 136288 420073 719808 375940 58252 357766 455034 180742
14842 355354 183746 433918 507425 209504 684971 612931 317402 17554 340720 401808
14832 401808 387382 597612 483413 493624 188101 202404 480375 408282 316091 176848
14822 176848 408809 395238 239713 281881 377520 143452 235054 493644 466490 336269
14812 336269 302760 452725 620098 581628 681343 472263 430630 795101 479730 626285
14802 626285 618425 488114 516496 410336 286623 495470 721036 288807 849906 657870
14792 657870 372838 524048 580827 739147 613717 183816 332239 391262 256062 425443
14782 425443 456193 346936 248600 103243 396419 431178 346175 550194 217536 550244
14772 550244 300628 451200 442176 627787 663617 622942 319989 503345 674520 478442
14762 478442 17634 503839 593484 824530 545715 462450 612728 200101 662821 769049
14752 769049 645506 447648 490365 811955 301959 669296 909876 583087 693453 618513
14742 618513 697617 716555 692119 677957 477742 923415 515039 758974 511968 846752
14732 846752 598651 815213 623382 684648 495317 752524 553077 742708 719844 797811
14722 797811 434039 611922 509492 686293 899235 779150 753410 865820 120689 568856
14712 568856 635352 810611 777968 668705 504459 915415 807382 580050 880641 834521
14702 834521 759198 1027299 409722 686883 575193 783132 546095 903214 992381 638802
14692 638802 807985 874858 769760 739421 769494 1075233 604449 1074758 595231 714123
14682 714123 576523 1202038 956349 1027348 713187 978540 739446 684441 1023977 889267
14672 889267 605427 858211 878733 903014 1059317 762454 887231 1195208 1024814 1175745
14662 1175745 472239 1071131 1065832 1145975 896225 1249935 942078 1227811 996916 993479
14652 993479 1286159 1440147 1330780 869321 1068776 867772 1271554 1010878 1054529 1226763
14642 1226763 681893 1204721 1127611 1194986 950744 1071420 1194234 1119258 1192716 1247884
14632 1247884 918285 1440327 1647532 1077796 1074805 1203121 1398814 1100108 1302772 1272014
14622 1272014 1133689 1127659 1411756 1450025 1239437 1478001 1587604 937978 1453340 1200877
14612 1200877 1334116 1340366 1437810 1594628 1456870 1519196 1381885 1619963 1598413 1456686
14602 1456686 1588145 1549259 1852967 1427236 1554739 1273324 1440448 1913642 1611906 2039643
14592 2039643 1619947 1557367 1621110 1610455 1594146 1664221 1825344 1549741 1938662 1848125
14582 1848125 1894050 1599444 1653850 1864304 1869111 1798367 1895435 1982561 1883965 1781255 1828907
14571 1828907 2157184 2161692 1904440 2286535 2217708 2433629 2098236 2182184 2683469 2574560
14561 2574560 2751553 2331949 2726988 2875436 2620211 2834021 3155592 3516204 3647071
14552 3647071 4065223 4529220 5695782 7577108 11801666 22475734 44882245 38307632
14544 38307632 18525516 7757132 3832396 2399968 1842793 1679254 1704317 1720176 1842406
14535 1842406 1725246 2126867 1886708 1726753 1940337 1811251 2065515 2256189 1900431
14526 1900431 2220985 2450163 2268938 2410698 2265454 2210417 2465680 2188704 2309548 2459678
14516 2459678 2582822 2471494 2595072 2596602 2659168 2734586 2750606 2600443 2544973 2814855
14506 2814855 2879150 2817445 2875383 2717426 2754313 2979752 3028297 3049210 3125333 3078847 3358738
14495 3358738 3215123 3422596 3189759 3056767 3007705 3342118 3069887 3234241 3385445 3339559
14485 3339559 3443788 3778204 3305255 3828547 3450341 3445217 3701395 3701581 3698536 3977384 4010910
14474 4010910 3769739 3829073 4230278 4138730 3886608 4214728 3995100 4040691 4396339 4006968
14464 4006968 4138003 4528389 4569086 4585454 4412575 4580909 4708452 4778309 4747423 5044462
14454 5044462 4921469 5194343 4943432 5008996 5283474 5173473 5179649 4965529 5445191 5317550
14444 5317550 5417848 5569211 5405630 5961093 5895733 5853885 5786326 5924362 6116285 5908209
14434 5908209 6251970 6393606 6418617 6382826 6528911 6628827 6566287 6526486 7070232 7240380
14424 7240380 7008795 7026734 6908663 7540668 7556472 7884576 7768185 7878226 7857642 8386849
14414 8386849 8043084 8008546 8472625 8175973 8659557 8693428 9193244 8969252 9226994 9509731
14404 9509731 9521330 9686407 9580727 9603362 10164565 10014578 10439599 10333361 10744704 10607922
14394 10607922 10836135 11275475 11311149 11313771 11837043 11999356 12062834 12561485 12533609 12884349
14384 12884349 13096055 13488892 13692826 14198989 14097648 14453869 14640517 15019091 14842977
14375 14842977 15254461 15824102 16242259 16409333 16717648 16964998 17397851 17677500 18258847
14366 18258847 18382803 18914798 19120015 19552231 19893998 20413240 20938780 21468552 21456264
14357 21456264 22354859 23039782 23447539 24047481 24466884 25028387 25627750 26475908 27215625
14348 27215625 27639924 28739198 29032822 29672670 30559919 31294873 32194054 33438664 34209908
14339 34209908 34670697 35925719 36833247 38096402 39221152 40043902 41453426 43009881
14331 43009881 44029400 45449755 46819064 48453404 49945554 51332346 53223657 54961769
14323 54961769 56713289 58839562 60937785 63255955 65306024 67736706 70402614 72924629
14315 72924629 75844922 78683562 81884859 85058524 88654665 92052610 96225260 100409173
14307 100409173 104565221 109533944 114225967 119261254 125084798 130854137 136953341 143435111
14299 143435111 150168243 157453434 165176845 173840426 182640696 191642600 201589292 211518576
14291 211518576 221991848 233518098 244988028 257080576 269862903 283302057 297007723
14284 297007723 310901791 325246984 339479773 353840058 367842180 381069306 394439583
14277 394439583 406342364 416806182 426063822 433270532 437395797 438159843 438352937 437728261
14269 437728261 434624483 430654368 426915945 420707374 412173582 401989395 390127075 377073362
14261 377073362 363056314 348519547 333846065 319241667 304813559 290654513 277251014
14254 277251014 264751815 251767107 238969436 227484515 216377487 205752945 195654465
14247 195654465 186055012 177074609 168730745 161115789 153553697 146161846 139522988 133386030
14239 133386030 127226142 122251499 117097218 111981509 107169964 102722251 98325164 94551222
14231 94551222 91138299 87152078 84133350 80694463 77741767 74853021 72103325 69355633
14223 69355633 66885294 64779620 62354453 60620710 58543931 56516495 54383455 52676150
14215 52676150 51050360 49864225 48182098 47091384 45194234 43882530 42409430 41630915
14207 41630915 40647179 39638879 38149620 37382076 36124373 35043661 34253025 33796802 32685241
14198 32685241 31883716 31003079 29896680 29358399 28949263 28110827 27238649 26742825 25788695
14189 25788695 25172482 24607759 24316838 23893828 23063753 22582380 22302475 21469507 21287312
14180 21287312 20965010 20560466 19813285 19513958 19130526 18862212 18290669 17997181 17949131
14171 17949131 17376191 16902716 16677467 16218446 16280222 15714308 15421694 15347958 14873994 14675100
14161 14675100 14375950 14323621 13939586 13754492 13439073 13247031 13005089 12992378 12564619 12144180
14151 12144180 12215027 11869879 11889007 11457950 11687302 11242421 11115190 10665882 10511886 10887057
14141 10887057 10271791 10489341 10237430 9845465 10035650 9550177 9342683 9248290 9320575 9014277
14131 9014277 9256689 8896163 8798632 8608466 8744171 8254748 8332894 8265774 7689508 7884352
14121 7884352 7759076 7381883 7696516 7411234 7522662 7342186 7473574 7136066 7106884 7044140
14111 7044140 6894875 6797551 6651897 6420880 7008965 6213057 6381251 6086122 6190999 6221109
14101 6221109 6089153 5996920 5892876 5645288 5933135 5769486 5613092 5579438 5382926 5251302
14091 5251302 5700505 5465704 5206661 5626055 5457096 5360413 4950687 5045750 5064996 4704477
14081 4704477 4671099 4789657 4684388 4741777 4289810 4667685 4621940 4653960 4315978 4342541
14071 4342541 4112819 4447582 4429074 4368617 3949524 4000517 4178638 4335552 3984660 4316699
14061 4316699 4122710 4137084 4188223 3679002 3375547 3800348 3739070 3542811 3557902 3735400
14051 3735400 3620617 3756013 3606084 3189448 3144995 3361007 3275164 3560621 3338739 3544329
14041 3544329 3472355 3429356 2909503 2928584 3236948 3080300 3160103 2964007 3147206 3234458
14031 3234458 3325401 2724508 3035834 2891967 2796821 2573483 2986170 2722499 2860342 2627622
14021 2627622 2707146 2628181 2848539 2463142 2647286 2742860 2379792 2383986 2195807 2783718
14011 2783718 2179423 2545875 2505348 2270589 2520799 2442611 2512239 2057417 2207629 2504877
14001 2504877 1996936 2143574 2069596 2229780 2134976 1807184 1951233 1887788 1976826 2436116
13991 2436116 2285704 2823271 3294282 6702279 15032569 38042606 42341824 22300548
13983 22300548 11816504 7191475 5568555 4158615 3608533 3521191 3198434 2951590 3191470
13974 3191470 2593481 2543399 2835598 2702676 2871430 2572337 2361744 2356868 2369763 2178460
13964 2178460 2329243 2250461 2349315 2386988 2262665 1997843 1933515 1971111 1997385 1951639 1985700
13953 1985700 1953340 2163821 1903145 1967385 1923509 2138844 2026936 1757992 1714933 1798230
13943 1798230 1822515 1658190 1700500 1769625 1766723 1771523 1602873 1675065 1776539 1786095 1592950
13932 1592950 1613958 2020863 1782591 1483217 1538099 1557888 1594803 1632018 1853290 1529063
13922 1529063 1532298 1628556 1802092 1755952 1392014 1513913 1464665 1584563 1442173 1480458
13912 1480458 1356176 1574331 1591919 1300383 1389168 1109969 1296637 1596620 1393601 1385229
13902 1385229 1424079 1387181 953065 1299560 1822351 1410624 1259001 1471348 1284583 1052803
13892 1052803 1186152 1467637 1333552 820209 1113200 1372809 1294968 1447123 972137 1235296
13882 1235296 1322013 945160 1087042 1279632 1153366 1201367 1214985 1146654 1202143 1325887
13872 1325887 1311003 963001 1226138 1158790 1028734 883520 1283457 1034304 1041762 941628
13862 941628 890824 1177170 1064634 1147640 1043388 1059621 1288220 1010723 1071505 936025
13852 936025 1052206 757594 1159719 993052 1005855 815032 1060646 881008 1095624 979708
13842 979708 1194586 676786 755178 933811 797100 818918 1287550 1231038 1015867 824288
13832 824288 961432 939591 1070986 1016479 739498 1247707 865962 1014342 1061165 1021149
13822 1021149 1009172 1039322 1067209 606612 1048454 649057 713091 510774 575911 1003701
13812 1003701 782398 792238 790051 871173 740451 832396 982257 844590 934485 764994 819191
13801 819191 456921 938842 816712 519865 729262 968742 737081 845295 653215 617188
13791 617188 789989 924264 681004 1046570 781820 992594 590978 788223 817845 666555
13781 666555 551308 923126 865840 1157397 690111 703254 847336 915236 784843 805729
13771 805729 806445 624407 303617 964810 728591 822459 774037 822965 690389 332543 922356
13760 922356 1037405 707253 264944 900536 832225 373398 606129 654207 731580 574313
13750 574313 1013550 762935 558378 706888 595361 857261 594138 916453 922161 590011
13740 590011 677879 719928 844394 760011 435464 800951 959582 545079 576595 353803
13730 353803 625642 623556 825859 387161 660924 648991 670043 549603 865169 534086
13720 534086 444556 655682 416333 568478 476033 605056 791409 249938 557169 221998
13709 674824 485407 391926 711835 605693 432823 597120 539999 875345 729986 346106
13698 427996 710593 510656 850089 550644 459684 555742 493988 439495 585718 493459
13688 493459 506786 422536 564730 723159 359779 400501 472702 769007 413827 566977
13678 566977 295475 204656 481773 671876 721544 732804 594566 326148 397899 350189
13668 350189 636825 216357 391594 281732 614433 410593 170282 845163 322110 413429
13658 413429 643184 689584 333271 367853 247039 420884 606138 288315 522443 123401
13647 536889 656294 344821 355131 495037 447095 354946 381380 456946 355615 391311 315875
13636 315875 474519 409934 245168 744099 93963 224883 37636 503995 283807 680159
13626 680159 207979 238057 582866 450040 610242 249295 402896 353185 438824 194976
13615 196511 540890 383629 541662 188269 352873 351456 359189 415192 388145 559753 491521
13604 491521 392580 450349 435117 371947 144538 422470 124232 391744 271326 243874
13594 243874 133873 446197 274854 518597 49864 404808 233410 471354 142544 519247
13584 519247 213807 389369 130488 714298 163035 399257 288365 426046 520213 255366
13573 265170 255612 337249 380915 386349 57304 356159 283645 171812 416347 259722 375214
13562 375214 120391 68779 429164 118000 265721 297180 531287 312796 164630 147403
13552 147403 212297 216898 421335 -87800 365798 490402 243340 238416 123364 195548 203162
13541 203162 532565 52150 746375 344738 221269 263067 484166 397125 405063 377331 320927
13530 320927 374635 316924 263389 429879 178247 223953 137234 102612 57987 38130 598823
13519 598823 284954 85305 128539 120481 557062 -40880 49418 423901 -243484 430488 -36657
13507 396741 -142767 402468 175246 475443 204517 359788 281003 143624 573064 548439
13497 548439 86007 42425 318853 258760 183525 610664 422523 154975 175094 193253 248801
13486 248801 211168 356597 150880 418556 294202 229295 333750 153192 278837 347148
13476 347148 319651 75061 -10125 132294 196692 249363 106042 -73162 -73103 355314 518140
13465 518140 -35084 222245 515276 348047 497878 61418 174037 158334 81877 366260
13455 366260 412603 472070 146298 114227 513190 47278 379775 136019 267440 440252
13445 440252 144342 460800 189596 2246 358042 -29402 296042 353375 230059 48084
13434 97724 250122 45540 276506 312473 223500 -55244 156530 37339 54961 115469 275894
13423 275894 271825 121365 361430 173280 166050 213118 31632 270870 182400 181061 244172
13412 244172 7346 119425 380194 121936 554790 518291 165273 -7192 172282 4161 287011
13401 287011 -87219 201455 188398 618340 24395 147717 98651 376452 311966 87748 411639
13390 411639 472186 90914 -12483 148547 10359 243597 488913 227955 368966 -158976
13379 279639 107826 429142 222412 342558 -115154 503931 280024 206301 113070 269575
13369 269575 103335 166610 127770 272407 407121 246159 196881 -157327 295104 339758
13359 339758 157358 62659 -93642 168276 264497 316744 183279 442099 269051 -35304
13348 -78705 231129 605278 261640 401774 284242 369130 533365 484930 472100 414873
13338 414873 127993 223251 455122 183381 171237 139763 419154 202682 406790 363327
13328 363327 -14027 440844 59989 228299 157522 336267 180547 586630 418749 143062
13317 13156 204678 261900 57116 363864 156386 148463 -30027 243542 69538 288067 205669
13306 205669 -198210 -65011 -50632 318960 43529 169751 20946 16280 -236902 138295 -50626
13294 -89593 110911 149771 -124392 101734 -120965 -43280 234167 8190 309840 -183504
13283 418114 208290 530393 34194 216303 103294 -42904 296185 -246875 78170 -162953
13272 -28740 196522 472738 4631 71722 177180 -396586 -167765 158661 -206321 -350388
13262 -350388 19027 161279 178205 307635 -130894 134732 94971 -105275 48428 274087
13252 274087 367258 224647 87994 79584 228519 113248 86470 -14245 -2573 413969 341972
13241 341972 -34882 44927 242500 65736 116237 103767 -178992 580578 208197 192364 3339
13229 16900 113158 54918 64724 -131337 339346 162696 36362 352386 -88286 73968 13624
13217 207145 334406 184742 392283 508606 19828 182209 210553 182791 70999 -9453 -9538
13206 -9538 -139283 106750 -39095 177469 179589 -54478 322920 61810 -13116 241277 143949
13195 143949 70980 156854 115571 47697 59233 228019 -32263 -166678 25030 185279 328975
13184 328975 85948 159925 205770 -1744 -114309 46217 308558 218096 474895 160060 -63166
13172 122112 426297 17229 235985 -4382 150036 180769 63013 255685 235299 161059 193347
13161 193347 -89832 110603 122718 -20633 265989 61047 160141 -11757 284258 1494 -109612
13149 42733 74475 22178 5913 203215 36474 -24120 310067 89548 -145252 316117 240530
13138 240530 120931 234929 325669 118750 -302893 193909 6129 263410 -297070 -169700
13128 -169700 -75592 3971 297138 187690 244076 -56683 -32044 202822 178799 106392 176476
13117 176476 308840 -192172 633 106493 191815 311447 -13036 -79372 -132374 122378 27302
13105 22921 -89589 -78838 80948 375779 95242 100046 208718 237749 -39613 134566 23683
13093 -126389 295664 -241574 -38873 186165 85854 71612 107657 -92349 71757 -41524 318464
13081 -258156 106055 194074 -19320 148585 117959 147944 77926 -33970 -1676 105772 56788
13070 56788 93954 247919 492511 175511 252365 138971 -21736 -147509 -65889 203529
13059 245373 165460 188689 273735 392713 -195672 -29816 233102 40284 59292 150890 -122069
13047 444861 108093 -224863 1085 294503 77163 15104 330328 159583 295094 -86879
13036 128717 -38399 57602 205063 -64442 358407 116764 62987 -54227 190179 -324151
13025 -66783 148058 -337565 249970 40702 277857 256378 179754 26409 71121 417915 45980
13013 137096 -244510 312785 27014 108724 250789 194484 41593 -81504 177089 645348
13003 645348 -34004 -200704 -57135 175887 -111767 -1512 -130830 55232 -159694 366177
12992 -355147 365678 -182533 -9191 -390126 -13315 156210 12453 80100 -107283 134114
12981 249541 319211 -68826 335441 83757 146681 305675 -211277 104577 313832 63494
12970 -204249 -142526 328212 133089 -144168 -55457 223788 670 -128449 292214 -70695 168305
12958 -5606 185302 206800 -52880 -78523 208460 133061 12786 61969 -64630 228550 -167023
12946 155059 -79410 -34 97820 -73379 166053 -93459 8104 -44917 168027 528958 -67600 117057
12933 -222858 106441 48037 333913 -120218 366204 224991 -101827 38319 231224 -287193
12922 272024 -11231 -91390 53979 142203 -139878 381240 -83121 15491 328111 88888 105055
12911 105055 138849 -164790 141383 113769 -191356 -153964 110940 212886 -43641 255592
12900 -116961 156044 317004 -240462 17693 382853 -101901 317342 72740 206220 -164506
12889 205056 -253476 79987 316842 9649 -17469 84930 83184 181071 206647 129651 -166927
12877 13221 -61116 93481 -44018 -90358 -167035 12519 -36430 65504 -85171 120712 52828
12865 -41810 -48497 196692 -52543 59884 -115484 -99104 -31604 -198670 -104764 61117 243055
12854 243055 -248198 132376 -6981 240893 721 162222 73243 158923 64035 -200588 -85671
12842 19762 201910 -5841 369444 206192 -63213 -175917 366032 -48488 53230 62565 218275
12831 218275 -63165 -16449 -175277 55336 68275 75073 15848 218767 -137900 -7983 62596
12819 -33124 382864 -360181 -40978 -6527 99344 99043 -42931 38993 -79459 268365 22526 9703
12806 371152 163174 78594 303373 -100522 -104089 199048 120127 333971 -305585 -283214
12796 -283214 10371 19683 74505 31132 147909 86607 296462 -86953 -223209 286256 57501
12784 -42618 16017 4702 227999 -119310 -10919 256689 202363 188780 178671 208660 171503
12773 171503 15903 20355 49410 132367 297512 183296 299640 -64667 54033 26538 118529
12762 118529 435010 -53363 424542 -2883 -91730 46759 95643 -287691 -116675 216485 253010
12751 253010 38239 -151025 -108905 98470 166642 64324 -200290 142686 -122993 50594 4032
12739 78263 74750 160464 256383 217166 95172 137345 171266 217572 192746 -140745 173455
12727 -182211 56344 80865 213660 -252251 -153821 -76245 -76732 115732 756 -2962 -270174 -25268
12714 116916 -112602 176537 222795 4089 28982 427320 339071 340604 27293 184452 6001
12702 295155 -12890 402349 121909 39275 106187 214612 -65282 -205513 174601 177343 10887
12690 -183946 20934 -77146 200757 -70219 31280 137478 37097 -33916 -139068 257233 280926
12679 280926 -105184 20500 57382 557467 99754 -58353 555715 373700 38397 -180748
12668 -243289 288442 -65160 159160 129934 -70723 27148 53510 -116502 351338 125445
12657 112233 363561 -242346 96069 158008 -253155 315810 68578 370556 -292318 144410
12646 90506 -95057 144276 -73998 -229229 -89897 258723 152928 151695 -73771 -158878 -167877
12635 -167877 -166475 81719 213003 219642 41447 -130651 93863 95348 96959 17305 348784 28543
12622 172334 154084 151390 130857 356060 384200 -24193 -59317 -133375 62279 -152111 -110522
12611 -110522 -42443 6559 -4751 130799 62119 275549 681 -143179 -120799 -37710 -146412
12600 -146412 -51188 367190 16454 326288 508078 226104 -146450 -52469 367629 273201
12590 273201 322870 -174366 205614 169419 49997 3725 -262203 -27907 -103050 13338 62270
12579 62270 250305 -270190 165928 163186 -194096 72258 316289 -50425 44963 -998 71226
12567 5837 -29350 25974 211918 -14835 242371 -81916 101843 -65004 90088 120453 21259
12555 114735 146988 -98681 204310 -99584 149222 68391 185607 301122 -19834 129337
12544 116149 186134 24216 -268554 81459 132324 -39173 -25698 195742 -1661 95662 -235327
12532 -42706 45544 -13889 72499 111196 189610 113899 118722 -38597 253075 47919 102312 21806
12519 240451 84196 91466 -886 57084 -166854 -45397 253809 -220177 -3591 186885 26169
12507 36104 64358 37103 -197418 -36522 33184 80866 200051 -8329 -141865 -107934 -240998
12496 -240998 472725 -141181 380780 317699 53241 12625 -56049 -84340 -188625 342244
12485 208252 160312 74637 -77908 -71856 67610 148806 20103 121024 4252 -26082 -127375
12474 -127375 103077 -96127 -168033 -79336 100349 -117583 157738 -38186 -151619 -221268
12464 -221268 -146866 11599 -384624 -2765 133250 -34053 7475 178360 45951 291640 -57841
12452 -177554 76996 41259 337378 -175090 16570 -99431 -21288 -36777 135056 -23734 77124
12440 -34051 112215 178540 75801 -185711 -4038 -325318 -243326 488832 186399 97010 185879
12429 185879 38143 185782 138819 63645 -154198 -134323 -203112 3569 -102485 -252 384324
12417 140967 38089 61842 40786 102149 -191009 -128587 267602 -63626 -20698 -155349 -113103
12406 -113103 27368 -62706 -40529 47810 -215162 113107 -150058 38132 -125937 156320
12395 78639 -409058 59198 146053 -33786 -253595 -75203 -21070 194504 41858 384475 109509
12383 -473877 114399 -193528 233451 -75177 -184823 155092 160255 -118348 78677 -26689
12372 -51746 -169788 82453 -123268 -84331 231232 -106687 14553 -87365 -128770 105838 -28775
12360 186072 -182448 -147254 -77718 138395 199242 -54589 110970 -207706 138996 -212191
12349 -111568 10965 178503 -99192 -174446 -29416 -307249 -34922 312016 -134003 20379 63612
12338 63612 -159922 -12536 138556 -198067 76095 -275617 54875 49265 137377 77732 -90184
12326 249259 59572 -263681 -17474 193784 149705 255341 -25253 -97276 153820 -328033
12315 362085 197222 -55147 -15214 90168 -27220 123427 248056 77321 -22615 -58292 -253352
12304 -253352 147471 -83706 169547 -139636 -64969 -74533 159942 100967 7491 413392 83452
12292 11758 70511 -266910 -80652 110990 423118 -111173 -18402 68992 -99032 264100 -262251
12280 394908 153277 307221 18034 -129044 17920 438002 471196 254427 483720 -37317
12269 111514 -98588 183882 -143729 -21393 85009 -128272 -195239 -36862 34002 -131152 189215
12257 336061 203821 -137514 43624 220470 -131773 155072 -103501 59552 77563 300211
12247 300211 -125022 -163069 -42769 -102412 109090 -125921 92005 39506 146222 193807 -387444
12235 274540 25493 -77742 105026 56378 -106162 -36348 321832 38710 633159 266124
12224 292544 58385 166055 166538 58785 152130 -162584 299732 85527 20476 206993 427524
12213 427524 309928 79540 296211 93423 165411 286812 -115333 38902 256189 451490
12203 451490 25913 -41267 103343 759 225500 370167 476861 474048 -36458 289581 219251
12192 219251 -127953 61306 27738 473664 317688 233997 42686 58277 238774 154275 164035
12181 164035 145567 -10388 239893 -48330 459698 397443 195460 -37833 -50029 93518 194547
12170 194547 248680 129189 78589 10074 273296 377991 -7285 121507 206750 -159918 -156397
12159 -156397 -18275 6602 50586 252599 343305 -247886 -221978 236097 114282 110879 28206
12147 25338 248570 -301185 311185 -7627 80598 527269 -24946 159776 -39856 116507 124194
12136 124194 -110847 118066 126987 -99944 -115124 212752 -736 175663 195320 350544 10995
12124 -184120 302229 -21043 267237 -127387 140340 347693 217233 317044 269683 12191
12113 -26301 175442 -42975 -54451 -26626 126196 18285 -260792 -75879 -57304 209129 33499
12101 -188445 12618 -191406 97875 18516 -91648 91280 35879 270308 65837 33029 399133
12090 399133 -46611 186623 -135875 324994 -153055 183795 -440252 -61391 -116933 -51992
12079 -187168 -147416 -242521 -232060 203001 -19983 66887 206376 140323 157892 55094 471162
12068 471162 1208321 2208101 297210 118192 73992 -63389 152559 -248974 -117831 -26901
12057 43892 271062 46005 -83357 -138430 -168926 -339077 -34186 64597 289965 -211897 -28181
12045 -114283 -151787 36321 79539 103313 -19090 -29739 -79318 -254311 -188401 157205 16626
12033 48856 9270 -307352 35028 -118144 -156461 -144406 -57214 275078 -51828 131193 -201512
12021 -83032 -14439 -1283 252527 -12877 308998 196279 98202 7840 153064 -57800 92665
12009 -32729 -125639 -251279 299145 -72920 302200 -56077 -5651 -181962 42865 128672 -59078
11997 -92827 24094 -12142 46448 -141646 138736 151788 183249 21244 -84872 -62681 -385389
11986 -385389 69818 166283 73910 10830 -103288 175441 -31206 32705 -69266 -74144 49902
11974 7507 -104526 150330 162145 -42441 -100058 -145894 -120409 7796 120764 182504 -141398
11962 89903 176964 -50903 -380 17778 -65697 155432 -318766 20977 -17431 202712 -108846
11950 -128696 -58079 476544 130377 -40401 -337300 -144879 -101703 -120925 12023 -108489
11939 -36802 -132435 -327914 -22748 -86193 -52880 -26730 204163 163420 -85953 64895 277259
11928 277259 251522 152500 -89658 -16334 -244736 -27477 37947 103443 -182684 215389 197933
11917 197933 -22262 115987 83873 94831 -17817 -270255 -74604 437285 -10386 -73957 292132
11905 82606 98360 442929 6542 -101378 138542 -183605 -176957 -244955 86589 127521 -44837
11893 -325464 11707 -96190 20732 44212 -174444 -281841 6162 -192148 223602 207334 -187436
11881 -225668 -228877 -108425 70519 62852 30732 -71930 183670 -301337 34309 -28838 357961
11869 -216767 90625 -157044 81241 33849 -21496 -172857 432 141751 211403 25885 220206
11858 220206 188648 148916 69846 -152319 316863 -194661 131562 158588 -25518 -355151
11848 -355151 -21987 -38138 -296448 -110403 262038 -33433 -70294 108554 133921 -65971 200460
11836 -420459 -137514 53081 27508 100415 -17622 -46429 -343022 -66418 -85025 331366 56859
11824 40622 -305619 237982 -57815 16591 -87927 -381712 -285256 -116838 -138698 -158244 61918
11812 265311 26723 107056 -30301 1628 76178 250014 21650 -159565 -57040 -174888 -165696
11801 -165696 -25409 9814 126704 -321002 70022 42985 -95953 -7175 154874 -238480 82015
11789 -287358 -104006 -24026 -172628 -264804 42758 -141077 -57171 207232 -3850 -11710 213281
11777 -206508 -199550 90251 133929 67144 124568 122929 -80834 -177178 -108432 -51132 182105 -60206
11764 219791 263641 26447 -78917 -7328 52401 -365849 279353 -200265 77519 195495 196597
11753 196597 163026 -315396 452367 256370 183518 71976 332811 117497 212180 248651
11743 248651 -31528 257456 -76461 126810 274972 -211592 117098 285127 261716 196266
11733 196266 -438459 154713 79318 66635 -139043 12923 -81823 -19873 56071 -34207 125047
11721 -169949 115327 -378322 -168127 -150717 -121550 -98642 297998 46350 42011 -162922 137133
11709 351529 -80404 -122325 272260 214913 297744 -45239 -107599 347057 -40598 -77322 -68055
11698 -68055 250887 -50433 -105688 -142539 162702 -68517 174437 -49971 228191 -61809 189561
11686 -121053 360086 -27575 119035 81039 24309 147100 -178752 61160 -178237 17441
11675 182336 -41519 9722 -3263 100339 271707 344218 118765 51082 -36722 -65058 165421
11663 395328 219461 132404 247008 -200147 244834 -179870 -10504 138440 -166606 -129787
11653 -129787 -21362 48668 61346 183477 -244484 -240700 -62682 -76046 142046 -344617 84530
11641 -11508 -47304 -131433 168332 152324 73567 -321835 -191014 53826 305698 174527 133084
11630 133084 -276744 304130 -231291 210069 -183964 148752 -16664 295800 325402 49 -95550
11618 -121749 241335 10974 186450 191569 53533 121826 157062 191766 351209 -49437 -134206
11607 -134206 -12946 134010 67543 -46189 -8545 227281 -78782 -12661 193848 -36333 201571
11595 353898 -53019 -334082 398808 -161414 -46445 165715 33300 89646 -59377 253469
11584 284117 120109 125400 95105 189506 -17279 -72329 100669 164892 257949 -2819 129655
11572 235626 -232094 71140 250600 60296 -137403 300076 99759 33307 237547 77446
11561 59853 -159108 369636 -2404 -321257 315240 144841 -97012 94884 -78830 70980 43237
11550 43237 -30571 -107284 -40781 3520 -155856 -111674 525572 74411 -84118 98425 -31363
11538 293900 165816 126363 -138913 -133646 -221 46452 301870 2257 36390 8540 167527 375933
11526 375933 57823 198569 115826 168705 243904 -226337 -16710 -15007 140747 -205118 115435
11514 40810 96279 -208230 -12535 -87859 -119712 455740 186942 119636 -177014 116790 273241
11503 273241 138047 97286 27118 -10481 72235 66930 177683 220570 244889 134283 176982
11492 176982 242694 -22125 92032 360178 44460 261786 -65421 66536 -271002 -36928 147765
11480 -144236 210250 178994 103899 364539 83141 -136757 13362 110424 353682 -30047 -13626
11468 122812 276814 261618 104937 225969 73881 203759 -147358 -43517 121520 167578
11458 167578 271785 305728 -31783 -99166 161566 204965 44284 181537 144799 135820 -168402
11446 -72365 166215 92330 285214 -106630 3598 294538 245331 -5998 -33177 -6160 44410
11434 240365 25163 132291 120828 -15291 -326590 -111493 -290664 -62712 302637 -6197 89697
11422 173019 76931 70061 206985 149578 10636 -149918 151543 27252 -57125 157675 114500
11411 114500 -36294 -15097 -982 -37234 25025 361983 -8862 289971 117217 26114 -155375
11399 296921 -172554 222224 -54929 -37220 127864 74885 112639 -106496 331565 124957
11388 -107706 -31437 118872 189539 177610 -151213 163611 -155452 -27599 -224577 198366
11377 -244799 156828 84736 -100529 -225986 106230 -160672 48764 -102617 -167008 -72337
11366 196839 -14149 -24151 235564 67123 150569 -167935 210461 -12202 -13573 -137696 -551676
11355 -551676 -155313 78 -261589 -68371 14082 281830 79217 281408 45245 -147991 445221
11343 -62768 299109 -63686 -195737 8207 260363 -105048 -208616 -489064 26605 -166939
11332 -40255 -369564 -108932 267008 22727 -139624 -318353 52070 -108268 -121813 -23851
11321 -77376 187770 111677 -158589 -128016 270313 -159552 29204 170535 60126 68880 -87679
11309 -110021 -6491 -6188 -155401 64068 78352 -80889 45456 -14928 -249898 -61141 -142087 172603
11296 97411 51411 -141520 -358952 46931 37403 -3220 163172 -268794 166177 -365001 141496
11284 267738 57187 127873 86557 -196241 -116249 228194 121494 93045 299832 -176390
11273 -59744 -52466 -108312 42645 48605 9701 -501419 -55470 64039 -132056 203962 75624 192243
11261 192243 -55101 107294 -113945 58419 -689 31715 -172107 -84460 -255409 67865 89096
11250 89096 61267 152512 -188331 295030 144920 131074 -137354 43162 -255363 58890 -40110
11238 -230980 85118 47977 -332403 -309361 -134054 -267847 233999 -83890 -358512 153157
11227 -35216 -211212 114253 45864 -117771 48047 -160296 165266 188845 87094 70184 -25735
11215 98845 -117837 -294447 -117662 112194 -47612 -30479 93432 166137 -13359 114890 -1411
11203 -89710 -80309 -227350 252096 206142 -180792 -104163 38888 100188 166431 -156157 518468
11191 -125742 -155262 -118873 444760 9258 239979 -76732 349954 -51198 -60898 20028 -156587
11179 255638 -238753 -76649 -274043 -21986 71627 -198933 69566 -118791 -198838 -196501 -15869
11167 242039 -19700 -43872 9097 158907 -272135 -221346 -207775 -77630 23228 92533 203108
11156 203108 -24841 -473193 -180724 204378 43142 -233675 -113368 27841 396794 -311627
11145 453323 238472 20879 -242427 118751 -166535 -55308 -181540 182949 53393 184326
11135 184326 58345 -141423 69397 207987 -180224 42914 176022 -137141 277222 34233
11124 -193854 -111431 -32612 176170 -194303 169543 -56432 -167721 112523 58685 70508
11114 70508 -136683 -316742 195968 -72687 122217 46213 -56769 104045 320851 -83624
11103 91379 210477 397042 44236 195809 55998 -89544 96268 287744 205102 199850 419804
11092 419804 31775 387918 231081 442018 242298 288837 111494 331521 309939 296641
11082 296641 -192556 -21628 224158 42657 492369 58519 -5521 430256 223314 -78183 638454
11070 206935 -36695 225468 429018 187507 19991 279815 566574 472915 317904 569536
11060 569536 640178 399127 764130 422050 646126 471956 161771 732751 654934 445557
11050 445557 791534 682589 819730 598401 775952 919408 634540 812285 761014 1050190
11040 1050190 806042 825872 1032774 698295 791272 802449 943841 517404 905462 686388
11030 686388 633260 847595 741946 615418 282661 332774 877825 740482 796671 687640
11020 687640 375912 684312 504460 723428 630814 1108356 570267 575349 749421 207961
11009 618368 984642 468978 779977 685473 537856 590653 404507 917958 925201 674482
10999 674482 732666 859220 854594 734573 631051 608349 704672 473616 778717 854342 659066
10988 659066 809206 1123222 748468 974628 934685 1158725 1120015 1141053 1331471 1126310
10978 1126310 1602738 1964403 1685069 1951451 2341955 2988094 2573068 2903372 2929773 2780443
10968 2780443 2667545 2935415 2282185 2188749 1704193 1828040 1921833 1586419 1667808 1948406
10958 1948406 1784502 1959508 1910825 1743274 1350301 1687246 1361303 1284199 1046313 941781
10948 941781 730815 337649 320215 446831 696837 457131 214293 438135 17092 112612
10938 112612 -23902 -85265 -132663 396593 81288 228584 21113 171040 -24252 -16899 34898
10926 -30550 213831 -198704 134772 222743 204391 236017 192974 -183054 109423 224634
10916 224634 154080 -130987 38279 103319 -131962 -104870 15398 -60907 -4565 46450 357394
10905 357394 13140 -84407 -181409 28103 57239 60088 28540 168198 17452 189341 13717
10893 -2513 -96334 -41888 -76192 -44307 -4373 -81452 -359032 -102648 147994 -193109 -160010
10882 -160010 -133491 167347 78027 -53592 319201 -118910 -241382 88948 76612 35084 -40933
10870 -349549 -320488 44376 17345 372394 153987 -296847 -190423 145077 119358 123974 325690
10859 325690 119741 -127557 -38974 -195968 93398 -182292 60564 -29990 164485 -236506
10848 117293 -63897 27450 81630 27425 217944 -184006 -265912 -545176 127519 117659 243391
10837 243391 120672 -181345 -283838 10623 -138505 -245298 -32742 -52361 163076 193136
10827 193136 16903 226523 149084 66932 -105708 -322827 514655 247384 -116586 136717
10816 -94791 171004 -307857 82035 -24651 -286259 -251814 121844 60352 -65631 168727 30195
10804 37992 -191572 186376 -132214 48313 77230 -80296 -244090 244458 -138662 -59752
10793 60620 32472 -79219 -60244 -8153 -242785 3394 -236030 -30768 -175790 125785 92424
10782 92424 -406485 152 -290825 107851 -234592 6900 -216549 178112 -272154 137290 -111523
10770 55439 -127585 266862 -20056 -17819 -19759 238381 169399 -12953 -47628 981 274637 41547
10757 75421 72606 -159575 68273 -23900 -199948 -200666 -19869 49676 -71548 -478601 -95862 344714
10744 -178102 321876 -73650 3415 -206346 64658 -86597 -129993 -16126 -108337 -124500 47920
10732 65669 -137288 -128645 149204 74998 68463 -226449 13400 -215460 65366 -169011 53523
10720 8372 163611 475968 175826 -201088 74367 -127828 3218 163797 218436 -8208 -132559
10709 -132559 -192501 -158878 50936 -81605 -93660 190565 -119612 54553 -36724 212247 23219
10697 181170 -96749 133835 44499 220987 271277 94923 -78839 43771 -361560 -7895 -91416
10686 -91416 283361 -105786 149119 -174184 -248098 26940 -223126 -47530 -147109 -69865 -23430
10674 27709 135206 187113 60816 -130349 -8107 -198320 -130419 67933 4339 103564 86640
10663 86640 -131599 -45581 -78866 -323217 -61110 -11321 87646 -51438 105890 -269688 17897
10651 1267 195622 -78358 -71786 -93634 -36808 -26284 120813 -181124 -97746 33831 -28487
10639 19732 229038 -480943 -280215 -237964 -30547 395193 199534 58377 40993 -66556 111509
10627 -33538 -143314 94316 -124833 -207385 -265227 -240268 -103643 88874 -22395 -237103 156388
10615 -157609 -214334 -331383 -67308 -26617 183399 269721 97641 -103693 148027 96788 -23967
10603 -252353 86185 29931 -62808 55001 -40011 -125790 84550 19317 90448 -46564 -94463
10592 -94463 -74223 -233884 -189142 -227125 -74483 -1884 -209343 35281 128873 -102925 66864
10580 176366 165206 85455 20895 55727 -106109 -236671 136074 9605 196090 -285522 -395932
10569 -395932 69307 -75085 -537092 346814 26788 -143162 -214073 -92726 -212325 13476 -34483
10557 85982 -428897 130446 19280 -133055 279597 -57615 -84087 257815 251036 87910 -179386
10545 41837 -224510 -16134 -223201 86074 -157521 -212438 -130883 -57704 162972 12541 126418
10534 126418 -83837 -14921 204776 25508 -102387 -119944 13628 -326009 -322594 21974 -145525
10522 226066 -60054 -162397 -355247 30305 19900 132241 2642 72550 144802 129937 -167084
10510 391411 77487 82530 -342178 -36783 266925 -134445 -290588 -61313 70375 5804 -76076
10498 126042 -17235 -43113 -53824 -118541 -23369 41205 -151381 -182838 -262922 149541 151430
10487 151430 -148766 -15405 -215879 206481 266704 172143 393524 662467 620714 332903
10477 332903 223513 20446 432309 133094 26371 30000 157792 66037 -188638 204306
10466 -289277 -137439 41361 -188223 -268849 -27600 -335425 -191511 -177338 -109431 -63701 -141247
10455 -141247 -225094 158559 -1006 -249032 234332 -174784 61077 23845 5258 -172394 -157726
10444 -157726 251449 3115 44678 10922 141111 -132766 17276 151556 226452 -151628 -228724
10433 -228724 -325676 -167352 -220755 326989 165475 -32198 -87968 -149501 -193158 30821 155353
10422 155353 79166 173741 -158965 -111305 96114 -206647 341140 1429 -391457 -16102 -25905
10411 -25905 87751 134946 127109 -351228 -31542 -246626 -481490 -172929 51892 92847 69405
10400 69405 158838 -250458 -232011 116040 -243260 198463 214112 120744 207132 235172 -36405
10388 73275 204350 -175711 55415 214085 -7692 7706 535480 -1622 -194516 124971 216579
10377 216579 87157 193420 181626 297878 387012 403686 287753 453675 476663 182055
10366 503356 228726 494531 187376 652453 404670 246172 -190893 294867 247062 262437
10356 262437 -98151 -56229 130552 525347 145065 434836 371328 467784 503561 221198
10345 361203 534464 272676 297074 123090 282028 607311 180672 408391 262259 173302
10335 173302 151151 -189932 578680 195292 -107188 67043 40736 358487 158978 349837
10325 349837 330284 -75787 91512 295326 304076 84861 317002 -40219 -289683 128732 31414
10313 292945 216726 222398 568833 107126 -3204 -259267 -92991 184764 244567 359472 148883
10301 87816 317090 291453 81813 183062 -259051 -353922 -86091 129564 -24186 -162397 -299473
10290 -299473 -83663 -41907 -210886 -15266 -341640 -103380 -182284 -74731 -59581 -25570 -214834
10279 -214834 203439 -35232 433231 -191483 -44887 -48475 -31893 -1532 -263275 -54052 99977
10267 5252 -169583 -33912 18647 -211579 -223504 18453 -189838 422976 -27125 112623 206488
10256 206488 363174 425593 163559 271135 190498 -100106 176626 -152120 -135005 -214506
10246 -214506 -44146 -50260 -21566 -135495 -71618 148469 261714 -193535 -286 -71525 -17613
10234 -225646 216126 -7122 -71055 -10834 -262321 -13310 -173937 -56658 -186609 208163 122895
10223 122895 -63051 -58449 -166419 199393 -76611 138847 -324030 -257443 -233192 -73208 -253615
10212 -253615 75785 -46752 78379 8645 -12882 -356788 -230964 -94942 396803 -138033 -322860
10201 -322860 -217801 -121381 -95750 -221764 44721 -56900 -325635 28277 128047 -80092 -139876
10190 -139876 -66835 -110436 -139474 -56978 33316 -264175 -293591 343885 58765 -218689 57940
10178 -244554 -86959 221254 -49231 176060 -185287 235860 10420 -99972 -98065 75601 -174723
10166 -141580 40198 226074 178954 -346071 -149702 -97409 -235628 -1093 -199470 50744 -140048
10154 119862 132748 412702 -178645 -108183 49772 -57098 -263258 -413911 103238 -68024
10143 -234838 -433182 -206879 -129365 -128088 8701 124941 -218366 -262935 209351 131096 -124116
10131 -80257 85297 -97219 -483599 -337576 63808 -116293 -146090 44740 -106793 -96621 -184633
10120 -184633 55902 95568 26188 22990 -284108 -62506 60403 -118521 93553 58641 61054
10109 61054 -23158 274838 -293533 -48169 118468 171827 -314320 -125592 -268565 -167204
10099 -167204 -44185 130190 5805 -209305 -124094 304891 -20850 -52346 -41908 -207699 -75950
10087 -237723 -213315 -109524 -333548 -293470 -270473 -5986 20531 -202065 244248 78756 -159097
10075 -192857 54809 -114765 150678 168305 -242822 -206856 -82327 -249684 -437736 -250258
10065 -250258 -141019 -9494 -117638 63761 134169 -201701 18332 -172710 -231380 -54011 -69160
10054 -69160 -84348 -110173 -12555 -64280 -129498 66325 -20562 -102066 -176527 -26050 123723
10042 -499420 -273906 -68271 221580 100648 114995 -34527 -129433 -334425 -74592 -19303 -20809
10031 -20809 -73362 218118 -140889 127806 8685 197460 56738 163111 134339 28892 188890
10020 188890 -396891 151077 -95193 -26215 -177745 -296453 -49038 -141965 -273739 -301258
10010 -301258 -83001 -53514 -11097 -92651 -109900 43522 37426 -211772 9578 -117447 -147605
9999 -147605 -233710 297636 -29700 -44275 44879 -67508 79471 -276584 -268255 34918 43776 253
9986 61625 -66067 101492 -259071 -112647 -90599 -91304 -128591 98447 -29665 331873 -89759
9974 -325400 -289617 -191426 194580 26595 81183 -59693 214759 19753 -83290 64660 -173885
9962 34825 24987 -78559 487469 -29902 -148913 -246299 -253340 -281319 6785 -186456 -204678 334492
9949 314085 98910 -123073 -377837 38791 -104726 -56778 -100493 15100 -108025 121944 -335737
9937 59588 80521 27147 -76325 -238612 -386056 -107666 -229242 -170813 82787 90823 -154849
9925 -230872 -127425 -137434 799 187935 -95497 340073 -57972 -225228 51105 9036 -57294
9913 -346462 -383814 25276 -228670 3852 4501 58588 154952 -59384 40081 -94087 -100487 -61199
9901 -61199 -77888 337633 290093 -259453 123351 -286042 285753 -257599 135270 -40019
9890 -242983 -250898 94383 -116929 112300 -35208 174803 -256682 -244903 170186 -258227 96508
9878 29659 15390 -44718 -18052 168036 -428291 -48406 -126077 85472 99283 -377495 -33736
9866 127447 -35018 -61478 167700 -235514 -117870 -71839 -338813 -73320 109267 -198376
9855 -94059 -24162 64221 -139572 -34473 -155660 -279519 -140710 33718 -66925 -95357 -86805
9844 -86805 -131703 3839 -99408 -174522 -203850 -146636 17872 -133145 -38858 -69205 -166929 2114
9831 69239 -129055 -14365 9661 129526 -373165 58514 133452 -71318 124148 -207508 -243631
9820 -243631 -297965 93071 13175 -45830 -84382 219121 69130 -64442 142051 107356 -233493
9808 70441 -49052 -118077 -57958 -249229 -81588 218124 -50641 313262 108173 17519 -75510
9796 322806 -60508 -111809 -356606 -186992 39593 -281868 -152412 -156625 -203713 -278058 -187850
9785 -187850 -346797 -75974 -17885 -200198 145702 -18416 111369 64759 164425 -45997 -183498
9774 -183498 21762 -103547 -14032 -49173 -103892 135082 25092 235640 -22778 -43911 -25169
9763 -25169 123087 -192198 -252157 -39786 -361111 -133257 121320 91380 124366 -118090 17531
9751 192321 2174 -528683 20836 337707 126328 -181121 223488 18817 -270036 -39245 -128665
9740 -128665 136772 -42197 180833 -129801 229509 -388225 -484777 -97753 -147415 193666
9729 -36254 46122 295448 38570 -126969 -45107 -203355 -170147 -97887 55375 225412 -70137
9717 -67424 -101056 14407 -332226 125073 101215 -167383 57743 159670 -102002 212125 -39092
9705 -43234 -272763 -18060 -64234 21816 -83278 -45217 -68797 51732 -48560 24735 285941
9694 285941 -168344 319262 -36872 144154 163297 -279756 -100940 -393440 -40207 -20582
9684 -20582 -344141 -101253 -112723 46931 -14838 -172620 33684 -123132 -153583 -104545 -17778
9672 -28050 -223460 -90415 -1790 -2104 -57578 -179309 122816 -78653 -347481 -70583 -112270 92119
9659 -274423 105525 -194429 -280598 117877 -149802 -11675 90602 -289742 429851 -88326
9648 144910 -199114 100554 -12864 -134731 19146 87165 -103429 40724 -260533 130585
9637 -156779 131680 75321 -100794 19552 -226497 170322 65168 149164 45931 -243000 -37772
9625 128821 126538 -46561 66279 -98556 -94391 -190506 105732 -58423 5632 -99773 305372 -22261
9612 163934 -9186 19166 120657 -34992 -92087 -35906 -33683 141683 -91353 -112751 201181
9600 -124261 -79277 -112403 14515 -283164 -64413 -139974 -184049 -77586 -379360 23121 71198
9589 71198 18606 -45389 -58426 -108786 74397 -68767 -56972 -309254 -135142 -357278 -200410
9578 -200410 -362067 -76504 102866 -373964 204671 -129991 -260186 -215740 81130 -411756
9567 153911 -17676 100503 -269370 -142137 -362119 -40472 -377053 -33913 12366 130756
9557 130756 -146718 45959 -63068 -64887 -320018 -217220 39164 217073 -79839 -56809 -187985
9546 -187985 -353074 268123 -124282 29092 163044 -148270 27998 -70531 -143086 1704 45479
9535 45479 -173599 444500 -99417 221763 148954 249689 -69529 177540 -334196 -116773
9524 65251 -37848 -89088 -206511 -17074 -42806 -104956 -149565 -24057 -195672 -144840 265263
9512 -446207 -52205 -242297 50370 53568 -138608 -83040 -81821 -76487 48626 -8114 -249231 -134409
9500 -134409 -263816 84604 25879 -226412 -45500 30567 -80971 146033 -85190 229816 38600
9488 -291876 -83457 -228970 -177019 -138473 -308305 -229096 -280999 -108897 -19793 108083 76466
9477 76466 142439 23060 307334 250367 9563 -80096 158590 -205092 -167827 -92632 -159052
9466 -159052 -293528 185480 -39008 51237 -197362 79796 -106742 -282642 -137046 113567
9455 388533 -421888 -78879 -62643 -134983 -84155 -50763 134651 84523 -22982 -138996 88243
9443 -92454 51776 -285824 -56017 -111948 -216501 -719 -52599 18968 144971 -165296 181464
9431 -66529 -150328 -99674 69890 -427473 -158362 -341634 -53572 -258489 -83075 43805 272922
9420 272922 -58808 140920 101621 52226 -32170 19087 -124503 135799 -1497 145024 -31956
9408 106455 -3086 -192190 -167815 145846 178459 103775 89254 -213231 -466633 19272 -146015
9396 -59405 7021 -77871 31057 -7727 -15656 190476 -392560 -396814 -229003 367110 -148959 -164883
9384 -164883 -310459 -85889 -64122 -240170 165208 18553 159561 -97271 -82667 -152377 -3797
9372 -68830 -164455 -164322 153287 143079 -528922 -112278 -19043 -185797 -177141 136718 146121 306861
9360 306861 85149 -279347 -108513 -89170 112788 44163 -36612 -32423 180064 -156787 68622
9348 -212909 154162 -102534 -236945 399538 -226047 13262 -103692 -216801 230457 171814
9338 171814 -49472 172758 -85223 -29716 -376589 154298 266237 -261304 -259961 -384791 183385
9326 -220707 135661 50434 -176671 79857 -227231 -392124 -140207 130930 13430 156529
9316 156529 135087 -151381 -225027 196465 -89503 -167188 -183991 -139257 -81716 -54396 -49556
9305 -49556 -56760 -64769 -273863 -130084 -113538 -189967 -38089 -138502 6623 -57711 -306701 -208344
9293 -208344 130981 25031 -83824 113682 2488 -175351 -262404 -247545 119302 -211312 -181291
9282 -181291 207543 -57838 96133 -90037 -143257 67723 -44945 89875 348660 27644 -42700
9270 -166294 29608 33176 119044 -297380 -24578 109937 30469 81138 -77609 -118753 -48354
9258 62372 -273195 -87628 -318256 67907 -199898 2489 65851 -323057 -230229 151047 -32303
9246 -351562 -284880 -224617 -5029 163198 30753 -45798 131394 -303405 -229310 -4454 115434
9234 -235770 66662 115704 75247 -55494 -105825 -207703 -147022 -88324 -194500 173304 -525057
9222 32845 191774 197731 -259731 -121723 -223299 -37565 363784 -246405 -38055 13434 37683
9211 37683 -182743 -123975 -99907 274567 75088 20298 -144232 -176114 235980 -273481 19075
9199 41596 90201 186020 70583 80890 -41149 58449 -52477 -6145 -151391 -118601 -126565 -40734
9186 -109161 -128941 230736 -134586 -14599 -224621 -387767 -298618 85056 -164738 20474 138113
9175 138113 206365 35498 -66195 154588 -89857 -332952 170393 33111 101887 -75320 70315
9163 34811 115449 -40356 -216071 -156391 53208 -151247 118961 -13698 -2207 -40099 -13169
9151 -165330 -254694 235408 179959 -153059 -101558 247356 -222338 -380916 -160854 176308
9140 -55759 -12519 -73336 -208946 -221294 -188666 -82798 -79772 -213965 -297516 -236195 97749 -214427
9127 7147 333515 -81886 -60300 -39399 -181407 -185148 -2016 -86447 -314751 -78703 30139 111327
9115 111327 145479 -20161 95638 -114237 105825 54891 -49421 -43296 -248770 -86339 125967
9103 244070 -88350 -75343 -41706 26346 10907 -356 91913 133123 -14705 -78916 23284 -319207
9090 -374883 29695 125351 -35625 -20516 -152934 46683 161231 -4101 -253315 183734 -52020
9078 -734 -32057 183237 -32602 -88894 -96944 -107188 -181052 -207905 -125390 -173886 -184583 193437
9065 62366 106712 -154797 306637 -248484 -107616 -107797 -393782 17243 91181 -269580 -61123
9053 -42062 -15083 -150509 187558 -16864 175042 -20905 -29913 -132991 -312838 324469 -215426
9041 -135662 36155 -73042 128164 -247682 -74406 -30491 162018 38996 -27324 -306263 164414
9029 -115730 79276 -135899 139750 -1126 -280438 124203 -133387 20462 14333 277156 218931
9018 218931 117095 -87861 5387 -250421 -30118 -319669 104957 158493 -102045 334253 -17740
9006 6184 -9336 -311992 -129986 186335 111091 -235362 53755 455 180611 -314239 -150693
8994 -407478 -163224 58325 -120829 6811 31188 593 -208527 -103451 175118 -116609 -365159
8983 -365159 -196014 -115300 -372213 -173877 -176709 -332880 -181081 -271644 -59681 229405 95719
8971 -17066 309710 -332604 -242327 -161257 267531 -209101 272367 -286077 14816 334559
8961 334559 18425 -232895 -65969 73939 411978 -99468 160555 202677 83600 24718 -361417
8949 -169250 122212 -108671 88850 -200503 38288 -223715 255916 124253 -117647 136184
8938 -80737 -68212 183489 -33424 -45288 -165227 216698 153530 -284735 21582 -107952 -162836
8927 -162836 39620 90375 32585 -16491 158052 1440822 1963701 315244 401516 52384 -65943
8915 59406 -68632 -27828 -4485 4517 -122823 -194369 -149226 -153889 -12288 184314 -79340 -188634
8903 -188634 -43740 13144 -9810 -120921 -64795 -59237 50828 -205105 -66799 -228289 17208
8891 206109 22254 -79665 -152635 23898 -80914 -178633 -10441 -254811 -46181 -338595 -270701
8880 -270701 -89442 173233 -27436 -136289 -195416 184753 84336 71370 -178698 -41571 -92323
8869 -92323 -180804 -1825 -86286 -108129 -326949 -55418 -79076 -24703 -281975 15178 61644 -114628
8856 -16325 -50387 -125849 -61695 -220233 -130246 258975 182477 -216384 -147104 -358912 313208
8844 -43941 145600 -90588 27789 154433 -1320 89712 4329 -117254 16998 -119510 -493891
8833 -493891 -249692 65465 1788 123720 -97688 -98514 -198010 212636 5333 -332992 29957 3547
8820 -190124 -159042 131893 28754 -375685 -123711 141539 -182538 -399118 81869 -127437
8809 -185676 -387872 26753 -369100 -139854 -403846 -54594 96988 -110309 111674 -141500
8798 -382682 -238613 -53252 -199113 10624 -52719 175962 -151827 -576371 -248829 -184607
8788 -184607 136940 126698 -82862 -114935 145599 25926 223948 -330897 160306 177433 208397
8777 208397 42717 -202018 -94257 51298 50787 -79297 -11423 -549139 -213689 -2771 -153032
8766 -153032 35555 37082 86300 38536 -51378 -174108 -305518 -286058 -12596 -52453 57349
8754 -57388 24944 193663 -295597 171375 107126 -250978 -199356 126458 -138423 -175216 129901
8742 17744 88828 12898 -201883 177187 162252 114942 -658438 -563858 151848 -319309 120168
8730 176645 2274 77716 -40297 51331 45400 -211336 209901 -138904 97039 -270802 136851
8718 -4449 -271113 -218772 -34109 -198686 37400 -276733 -186188 10368 -205107 -222992 161605
8706 -137527 59236 -198826 115106 17472 22171 22017 57352 30269 40464 134104 -35686 -359052
8694 -359052 56359 -48709 -32359 -321947 91113 -342932 90283 -68733 -50150 -163352 -218916
8683 -218916 -56611 54407 108606 -366775 41601 -367139 -78753 148703 -123926 -69193 378524
8671 -54610 -147445 -206237 44264 -251602 -86776 -164324 -52947 185075 -117735 -11068 -405722
8660 -405722 -34147 126561 37171 -218574 116318 -76551 29031 -130736 48953 -209239 96346
8648 -12543 159598 528 -308951 75022 109348 208460 -60183 31550 -203668 -247825 -186015 84686
8635 178151 -269714 -106569 -26855 42640 -27461 5296 -339652 -275645 -158676 -39224 -7760
8623 -9929 -184046 -108364 -132390 -86461 -173750 312780 6560 -375676 -96155 -132379 358544
8611 98099 -432021 -90995 -178735 111312 -202281 -246194 129278 34052 69181 74920 -341185
8599 143418 291410 105599 52865 165542 -40289 -115960 329207 -267789 -81155 35524 212814
8588 212814 60537 -107420 -217781 109523 -378442 -347533 -91777 -102768 164312 12365 -8231
8576 103560 -256813 -133826 -129079 -213162 89104 219482 -9017 36815 -53748 30250 27095 -216572
8563 279879 115028 -54668 -89484 -158036 -263033 33359 258586 -180758 -494516 148243
8552 -286382 -148631 26613 69378 -48845 -325045 -160685 -190777 -174136 73872 -495430 -213958
8540 -248256 -3188 -4330 293526 -184109 77598 -16765 -107770 217805 -176238 125277 113578
8529 113578 -186540 278785 -345204 173588 1144 -162107 59125 -21039 27223 239223 -80541
8517 53152 13433 -185491 -402874 -183587 -182767 238793 27645 13689 -56682 141512 45628
8505 7989 136023 14840 251447 -93439 3413 146883 320991 -61886 -97700 -78850 -205163
8494 -205163 218464 -207461 -474286 -130164 80108 91568 -164295 -158188 -77080 72697 73587
8483 73587 -201368 39807 -137138 41223 152445 23169 -79373 -296988 -33273 223609 -155113
8471 288870 -215296 -122009 -75914 46972 127425 -175839 35367 47888 -187077 -380950 14986
8459 69963 17178 -134705 122439 -65143 54434 -111310 12041 139975 -114721 -21341 -123159
8448 -123159 42266 6185 -76873 -93579 202763 -186551 -154597 164041 -83782 -308476 -149104
8436 -104405 -502416 -417996 236278 -155055 -156099 108901 -15608 -89372 -178921 12173 -14438
8424 -63125 34652 -5476 -144125 46476 220813 -107517 -41961 70242 144097 222745 -130147
8412 -18430 -104778 87099 -38577 52139 6245 -216512 117979 130401 646 -115185 41391 -301088
8399 -222850 -1103 109710 183838 -55007 17321 -118863 -17585 194249 -143393 -138329 55114
8387 219766 -450572 99326 -383933 -237205 -76379 220287 144653 -253538 -92849 -122200 -149245
8376 -149245 95763 -121115 87165 254295 -30860 -358617 80912 52303 -177679 -292997 -211024
8365 -211024 -385293 -44168 59282 -51934 -166539 26543 -332202 -141562 -53203 150191 -91413
8353 76125 -114278 -215277 229295 208951 39779 -367 -124 -53440 96562 126476 142957 -177041
8340 -112436 107718 -461447 -58012 291841 228001 123473 -97116 61550 -280726 -188193 57314
8328 65294 21074 -67706 188969 -332946 -28995 -155501 -36713 75979 -30412 -284707 -207403
8317 -207403 -186353 -288626 121759 -140841 124859 325824 -196387 33332 -125617 -99282
8307 -99282 -11091 -65487 81079 -264171 176955 -168793 -93862 36362 177290 -10786 -160526
8296 -160526 -67612 -152482 111815 -344843 -196763 -58564 94516 -190298 -271575 -352352 -287213
8285 -287213 -257751 -297865 -373693 29606 169637 -169018 -116843 46407 259913 -122017 -327843
8274 -327843 -51883 -149357 -191316 -25206 -250726 -111621 -197815 296155 22418 153631 133101
8263 133101 165716 -141129 136810 -107678 -281342 -136282 113261 -267258 -79655 -73831
8253 -73831 23136 231259 -138167 -145539 -137117 -12720 173986 158186 177910 97323 -251906
8241 140239 -190463 -194529 170276 -95142 -66526 -86018 308094 -217461 94880 -105849 -22713
8229 262888 -125471 -25611 -34616 66062 240415 227543 -23730 -219856 -270037 39126 -19137
8217 -260284 48805 23711 509480 -42482 93047 156736 -67708 -64770 -108476 -144198 49810 -198149
8204 383996 -245437 -287259 -409968 152129 -168989 188791 2482 -113608 -177653 -67171 -208465
8193 -208465 -89702 -11704 -263776 -238545 -75053 -87962 -265794 -261501 80114 -195107 178346
8181 58585 -58801 152200 83534 -208066 -9238 -34655 172472 30273 14066 181532 61130
8169 -133798 113249 167768 -99082 -353351 55704 -284883 -263068 -119521 -126086 -155197 -326596
8158 -326596 65512 89457 -78060 -11222 -23372 28501 -24429 106439 -120011 -240129 10540
8146 -298252 -128938 82731 -73547 166155 -80593 -330819 233294 -28253 -322178 -373935 -87919
8134 -80251 -276529 -204647 -122484 -99683 45496 -36803 16500 -281182 -64924 114317 -183738
8122 102674 18075 -9040 -90193 -86715 49511 213105 -373491 89705 -327881 -153322 -177943
8111 -177943 -72076 -221537 -219444 -17377 -324790 -354698 -30493 -174780 -124781 270972 25633
8099 -84084 -119819 -30825 82192 117222 -128818 -91666 378527 419947 -37487 -176159 140268
8087 -186769 -71282 -158368 19200 -231633 -123876 57588 135404 -30439 -47854 -85475 -96546
8076 -96546 247902 -7221 -168095 -217788 14247 145642 -130996 39659 -434342 -111934 -82370
8065 -82370 107392 -191599 154700 35395 67604 168810 55561 -66663 391214 -381897 -41727
8053 -189178 115477 76899 338130 -13373 -84061 -78298 154939 -45197 302255 80188 -129059
8041 -285823 168167 -484271 169997 31301 -429037 113398 170997 -363793 17806 -294871
8030 -180436 -105433 36734 -171499 -233036 25094 -258258 -162699 26468 -56042 65440 239401
8019 239401 -126135 -293305 -64175 46935 -139698 73460 122482 -163069 -174008 212698 -144988
8007 176172 150620 -343524 172760 -124075 -185158 -106323 -239006 -274614 468662 14096 -258485
7995 10918 -213205 -59431 259957 59633 -174272 -66842 -21656 9341 -169046 -77169 -115010
7984 -115010 -17675 114784 -31040 82033 -126290 -60886 -26995 -25250 109337 161369 -102215
7972 -25658 6087 -158764 -171673 10042 72051 -180843 -142445 -31281 -159981 -90440 193994
7960 46490 44814 -9285 197361 146820 -78253 -52320 379789 173381 -245176 65098 -180044
7948 -119129 -98560 -32406 -119045 -354014 -160527 -123625 40703 -71878 45436 52971 -167912
7936 -110275 -285704 -114374 -12831 -228518 -172999 -69651 -59791 91648 223914 -275843 -23971
7924 -143867 -70605 -160321 -214570 -119914 -98976 9210 -99077 17828 -32957 -10142 -168982 -60264
7911 -130617 252294 149194 -142413 -164493 -43310 -116573 -25532 75226 35225 -56351 -89956
7900 -89956 -508865 32143 -312561 124299 -16799 67613 309224 10785 -48207 -172093 219877
7888 -2367 -107958 81459 -174129 158517 -120366 51063 -26847 78968 156229 145474 107561
7877 107561 30317 94114 156609 -369533 90158 -184880 -359335 139490 -240162 116163
7866 -112180 -101523 2036 -162782 -51638 176029 218126 144388 -42936 -45783 -270338 -239284
7855 -239284 -151262 -168301 132448 -52645 -43392 -112477 -139732 -96617 -126882 -180493 125295
7843 -183959 -40239 -172432 -6890 -442776 -113674 -189814 -287322 -131954 37209 -82893 100123
7831 124800 105902 115530 -102568 167594 17210 137047 89782 -54017 -80581 -550529 -713
7819 84728 249143 22922 -81572 -373882 108461 93162 -166141 -361850 85815 34524 -75339
7807 471456 27418 191613 -169611 161529 109417 352825 127002 108475 -9126 -131748 -315013
7796 -315013 -241602 -287734 -287339 -222128 -73577 -95344 -22915 384544 -207991 -104808 -324762
7785 -324762 -212420 65275 72093 122298 332701 -86018 278037 -135810 -31606 -275889 59312
7773 36647 61366 -67863 -46672 -16712 80472 130521 -184494 -178248 -62748 94863 -80255 -35985
7760 120559 -200750 33300 763 -113258 -125980 -66687 -313254 -295798 -29391 -97630 195176
7748 89788 113990 -1185 225141 -97790 -41830 -135179 -114267 27120 -95849 -14212 218889 38967
7735 148002 -315412 -264387 95782 -246081 113551 -127731 -242961 -97424 -93551 233608 224762
7724 224762 -116361 -157509 -61301 -32906 -224386 20627 47126 -219933 -41729 -127183 3060
7712 52284 220555 -27638 13543 -118123 -41394 50625 -102224 187047 -382332 117126 -189006
7700 -7083 82710 -77516 104323 -102328 65536 99600 -59341 192308 -27481 76008 212085
7689 212085 -130403 17137 -228550 -224261 200521 213016 9626 16538 -209974 98449 50975
7678 50975 -74638 -149210 -29549 -119259 19571 -125069 26927 -141303 302995 177505 -158215
7666 -143451 -264042 -141347 -85444 -45203 105546 7392 -190193 -252369 101503 -361176 18102
7654 -100136 152634 158365 -101047 69829 -30383 -99908 207283 -169795 -134914 22102 -391753
7642 54679 -132264 -128561 -271003 -320468 -26469 -116184 159843 -31369 184751 -261980 -39975
7630 67041 -29048 -208285 -194609 -214049 -35513 3612 -85757 -198719 97462 119196 -206299
7618 -119867 -51980 55740 -121908 138713 39669 -130354 28407 -398488 -6420 151276 11990
7606 -176776 61913 240832 255414 30184 -149680 -223841 -32485 141355 82743 168160 155227
7595 155227 55094 -59820 -126656 -246430 300005 35511 17376 145430 -14559 -114616 23471
7583 -258890 -267492 165768 345440 109850 -51437 -15015 -266160 -124281 381761 169 -58375
7571 -151096 -314819 66937 -234517 6969 -127652 -281831 36330 -27172 189168 -87702 103744
7559 -75323 244478 187803 -92135 -95710 -55071 55177 -49398 122882 -186618 -20937 166700
7547 -208514 -105265 225412 -63905 -219033 -195453 -28437 -152823 288429 -113910 -150012
7537 -150012 -90553 240370 -138568 74294 -255127 40392 -55908 166945 64797 6075 -27085
7525 -72721 133580 -16786 36520 24158 304353 -42561 -73345 216981 -20055 -223483 60303
7513 120461 203142 -194714 104862 36454 -26943 -83419 31159 36446 -336888 -126768 -238109
7502 -238109 -60837 -309430 -195053 198545 -212792 -21249 270943 -49140 -33947 -132859 183148
7490 134007 35041 -172536 -85182 -376347 -200567 100799 224363 -121584 -177986 213445
7479 19489 -182887 9794 -75588 -188720 387691 -317698 -242975 -21345 397755 -57261 -124174
7468 -124174 -284630 -97036 110858 -98864 -263112 -406362 -28693 415353 -300400 -51804
7457 -131628 -41114 -822 64062 -134860 112311 -109034 -65222 -170858 -263730 93104 -161384
7445 -201339 62758 31327 -81318 76596 -274763 149330 261052 -57428 -259971 150514 60023
7433 -410929 -43315 -297093 157081 -110347 -3303 -45428 -79692 127025 379595 -156406 -65566
7421 -21276 -62086 400089 166761 -34151 36279 -114965 131722 -254387 -231489 -66830 87099
7409 -32686 95650 -17544 160542 -111789 -151247 -39292 -54122 16653 -185579 33993 81460
7398 81460 -149164 -220380 61401 -33742 263964 -144455 175233 9587 -77404 147957 -63686
7386 -34121 -4219 187678 12741 90816 91238 -32284 38831 9433 -113776 -145042 -95980 224307
7373 84919 -2528 124234 -39798 -32287 -27012 209316 -10418 31851 -42250 -209630 -47084 -2930
7360 27551 204390 67714 -52099 95398 -330122 306644 -102045 -164761 112097 -101728 -284165
7349 -284165 -101754 -45661 -256705 -190432 310064 54903 216071 69510 210849 188663 47686
7337 67546 258470 79620 -89139 -256706 -56938 -547164 -103113 92931 117227 91058 -52398
7325 -84167 126090 -187423 76060 -295184 -289877 -286455 198815 75205 162382 276963 107649
7313 -64066 85451 -92637 -245372 -386449 -343957 54925 -12257 123867 -50869 27144 179717
7302 179717 -24418 92923 -82506 101802 -414640 -63098 124861 -20692 -147604 -239702 -62507
7290 20528 56920 109432 -150893 112937 71076 229960 -52042 20926 111709 -142709 8366
7278 69589 -41219 218478 -42935 -155737 267229 -233072 129126 -26078 -58071 -192196 -377611
7267 -377611 -4616 -81727 -93232 -82320 -226022 -329345 52725 -253823 -421938 -105199 -50874
7255 -275308 -250348 -56453 117612 193495 62902 -105081 -72586 -57177 -120939 -249793 -256043
7244 -256043 -38966 24907 -122420 53155 311063 -149493 196218 -59061 -41824 -114927 -13442
7232 332031 -28790 -124438 27249 63738 265114 -45781 133278 108287 -67408 -111505 -164701
7221 -164701 9147 63671 -145040 244446 -46659 163134 -113787 150831 -19146 -45031 -298901
7210 -298901 -178588 -26819 -314114 277920 -147457 -202305 -261404 16636 -312705 137920
7199 238512 -115878 -9873 -149616 -374594 176101 -43823 -112776 226412 266266 60054 144967
7188 144967 -114659 -138214 -37214 182129 -9173 -137415 -121986 -46587 -63273 -188239 174774
7176 150987 -315004 55849 -134926 -253427 -63702 -50024 91640 225097 -108610 -44337 139896
7164 -29034 -100621 12181 263516 136075 7794 -47932 -94629 31639 -291739 -144246 -95081
7153 -95081 156588 -39092 -3818 109675 78537 85850 40902 93123 97498 104802 60971 -147345
7140 -22147 336587 248269 -116482 99324 -167378 -30602 -88531 142738 -33129 -38373 -283238
7129 -283238 -185672 155448 -69553 77211 -94725 96715 -118237 -58783 109537 -49584 -136535
7118 -136535 171641 -55092 -95865 270370 173908 257396 46495 92423 45541 -178111 -66700
7106 -66174 84562 115940 -357482 -112394 -175600 88004 59919 32858 -253174 65968 -313692
7094 -152049 20303 -64547 -125951 -144165 301691 119997 -28935 191577 107877 24558 -3970
7082 64386 49144 -376448 52811 -74473 34251 -187979 370752 100553 -101545 -26280 -179903
7071 -179903 -111871 -74849 126732 11618 -102700 -468989 -67202 -191983 51659 -414218 -90973
7059 -64906 60807 72440 36922 74950 -341968 24748 104853 88423 -102352 -163805 173613
7047 180815 -4812 1257 334313 141940 51919 97558 -31343 -16619 134894 65445 95604
7036 95604 -141465 341439 -146509 85607 -133180 -127317 -204353 164885 15412 -152830 93436
7024 -40003 -155682 150136 223219 -60813 116850 -147638 -160464 -41386 -138117 -179149 -84242
7012 -66172 77982 -106539 -37596 8422 89062 -62660 -149453 235215 -84756 -77006 55712 -366749
6999 5887 -285098 -27536 -160106 183085 28808 -244377 84292 -36404 71388 -133595 -631
6987 -118127 -93874 -7526 -58293 -33989 228078 -179349 -268666 -53436 -331369 100044 -64657
6975 -60022 200193 -252393 -195703 -398606 -38141 175020 16752 3677 -19083 -407281 -146241
6963 -418611 114724 264800 -161810 -245585 -302694 -14921 -114956 -147253 181018 -159940
6952 -162018 -35463 -95020 -475076 150178 -251900 76280 42625 -195598 -125156 152610 -79508
6940 -57266 163590 44069 192171 -94019 -342884 -156024 330149 -150538 -170039 -290460
6930 -290460 -74814 -49543 30779 -122918 -20563 -86645 70213 340537 36643 -6822 245004
6918 -234776 -6682 110428 -222831 -64343 248856 40556 -88258 -205647 -258375 -131327 -85863
6907 -85863 -120410 -31732 -97599 -265671 70119 75666 -9102 46394 -88828 130966 136606 26445
6894 385 -101114 -210846 23099 20496 959 261761 31600 172017 235240 -153220 8671 173653
6882 173653 -92677 143641 -311793 -33652 -14853 -246785 -270721 115266 60438 -158341 -319434
6871 -319434 70350 -170896 -37986 101090 212425 -134610 -445554 -64612 82555 -81903 130034
6859 -16235 240189 177574 -216315 114853 -350311 -243116 -55448 -159805 -229211 -107098
6848 -197001 -104647 135173 -268966 -121307 21981 -27677 76487 -103658 50765 122234 -204304
6836 5998 151526 -165231 -3539 -184936 27121 -157912 163956 204590 -146830 89880 151984
6825 151984 -75875 215602 152420 128846 61528 -12709 -1380 -343395 -48554 -113356 70017
6813 66979 -196491 -204339 218165 -350611 -26155 91639 39327 17013 344751 33104 96488
6802 96488 -76763 132497 93179 -237047 8270 -22791 -126101 94612 -81287 -73067 280303
6790 -196629 -80262 -204491 4917 -234750 -121686 63095 100002 -46938 -15311 136387 -70430
6778 -8270 84952 100012 33878 -51033 -209306 432377 27308 124835 -156201 31051 -93815
6766 -124357 -96432 -75622 230385 108061 87507 -191559 -43415 -49898 80290 -266473 -92520
6754 -89518 214159 62261 21647 -55575 198402 531509 -38270 -390038 161165 118546 83058
6743 83058 35336 -199177 -77017 13538 -108633 115612 -244437 71168 -689 -110797 -188514
6732 -188514 -282911 48671 -155356 -234598 114283 57838 -290089 335798 -133107 -106868 -164810
6721 -164810 67603 76466 70234 -177493 166683 -113068 171892 16744 102992 -131472 106653
6709 9653 -51282 70052 -283725 -191731 -232494 -134673 -17202 208 -194755 128567 -210709 -140324
6697 -140324 -156928 -156842 -268037 -416145 -152611 19332 -165499 -354729 160328 91001 -62480
6685 155996 -20185 -63847 -246871 340917 -126813 91935 -304014 381753 206234 -72281
6674 133998 -27819 291851 152888 -207945 -139583 -128282 235411 -121920 129827 -67861
6663 135393 211975 166924 341463 -75665 -499570 -124853 -183336 146275 -17622 -52866 -65999
6652 -65999 -396613 -72889 -141149 -135144 -106860 -89286 36597 -87707 183651 294794 241464
6641 241464 215792 58610 170338 -31498 -78977 -45149 92958 28178 -9538 -69623 -46073 245010
6628 -20485 -241231 71057 186424 16882 -115791 -273081 104981 -158974 -1443 -135479 -195423
6617 -195423 15839 -6254 -46929 99717 159265 265749 -59207 49095 -180570 -134052 -84518
6606 -84518 229034 -11533 -70411 -36320 -79583 -94707 -132032 255085 -237669 13858 -9300
6594 336307 -103720 -306477 -139296 -94260 486033 -115695 323542 -147549 -35479 -17535
6583 89751 -78672 93307 -23712 -111854 -249097 -200814 235534 -124051 -257996 -16382 195570
6571 -170184 -157967 2463 217672 32664 240181 -373174 -58164 31929 -309252 28847 21239
6560 21239 174082 274301 -161202 -328150 147692 -196334 -179850 -176438 -155455 16799 -18298
6548 88851 17898 105567 -61476 197079 74296 -61326 -194694 112137 -110728 51533 -378951
6536 -117798 192634 96084 -103146 -115817 32287 468701 114789 -399037 -129331 39608
6525 8012 -63081 113826 143800 -101323 105596 218488 186580 -123995 -104895 36042 188281
6514 188281 62019 251654 -113100 -35776 213248 -34403 -160718 -36193 -236101 159267
6503 -17114 -366496 253055 -159133 -253293 -307088 58528 33811 99845 345103 36936 -62759
6491 -3851 -118442 -41451 -167111 -196630 -5698 30455 -173239 -38211 -381828 -211466 -36722
6479 -8341 -124461 -109640 -373246 -142676 341324 -27705 -176707 -4042 335597 125801 -123943
6467 -45475 47479 -279278 183049 258142 73563 200172 51141 18127 115621 28431 97443
6456 97443 -133846 244049 23559 -41761 -93077 79065 6194 109112 67000 -40204 18278
6444 91152 32334 -195638 173090 111052 119972 -215065 12286 146014 -564729 24800 -146983
6432 30035 -199154 72281 12702 -141100 125926 22659 -31828 -33288 293898 99995 25052
6420 -745 128267 -21904 123576 -56166 -80547 73508 159620 142432 -24596 -325600 -295274 -351528
6408 -351528 101558 -194459 143831 387888 -303758 5173 26095 186134 261697 98426 -222491
6396 17641 -38130 95820 36691 69061 -31963 -426285 19235 -54809 372845 218964 -70331
6384 -121449 -13119 -100770 74857 -275119 -202320 -172626 27847 100270 4658 47296 -304034
6372 -233390 83731 -21328 74869 314944 -71478 -99555 442803 -112159 180906 -73915 -204706
6361 -204706 -122028 -141594 -79972 126837 -173499 204800 206959 989 -3499 -16806 -248242 49333
6348 8499 46051 -113763 110008 217822 66206 -181631 -142645 -16428 82798 71231 73715
6337 73715 -40848 -427516 -133116 102663 -62883 -81787 137074 -28970 -85747 -76523 -331266
6326 -331266 222020 -179211 -11558 -445163 -82190 -62939 -93210 19609 -126056 73048 105069
6315 105069 -322112 -195725 210604 -246460 249939 -27589 119018 -131242 -203095 -152692
6305 -152692 -84279 272757 -131530 -267471 350627 -136879 182243 -160385 -102652 69354
6294 129010 131090 -106258 -157178 160068 80509 244078 -407257 -48632 -57574 31230 -145572
6282 -178627 -116009 144932 23889 68521 123010 54042 34134 118809 -114902 -11224 -63339
6271 -63339 -248569 -62433 -116492 -147297 -112759 -369420 -160139 92957 -308741 -11386 -254725
6260 -254725 -75690 -104043 -19156 -191363 237308 135766 -7785 -97204 -143843 168072 288648
6249 288648 24761 -3680 -308768 47741 78277 -137776 -19817 22533 198777 -263780 59003
6237 281246 99598 -48148 -292120 -24233 -83456 -39465 -21007 -432435 -377914 81711 -59252
6225 -102314 -51292 -251461 -19295 139115 8147 -348374 144450 -120728 -147934 -72913 -420592
6214 -420592 -358188 190423 -31845 313466 -192611 -102600 90614 68300 -214232 -232251 -144656
6203 -144656 360768 153341 -150143 -177968 6185 27653 -195062 111387 116603 23901 160728
6192 160728 100075 101918 118391 -262216 19829 408031 -292854 139373 119014 157773 -304952
6180 -86219 285391 -410347 116987 347697 -79726 -179646 -136537 -55933 -241806 -91940 -59677
6169 -59677 -124663 -43336 223576 -86014 227787 60944 -119597 218760 -5347 -266919 63694
6157 -52150 -131248 124710 -335479 179070 -20161 24155 20746 -59721 -157398 -388759 173656
6145 188365 11002 -57290 -153401 -92968 222666 -245502 -217012 -36941 -55789 -181449 -164822
6134 -164822 142494 167682 -209538 6847 -12094 -366931 -175965 -204800 235504 5 -281271
6122 -90426 262648 40799 35786 76106 64137 84082 148119 181813 6616 62923 178393 277075
6110 277075 119161 226432 33566 -221789 -67122 -117154 25122 177659 -262170 -214459 -69963
6098 -276133 31908 -214181 123975 61198 325530 -26221 131489 -7534 218321 137714 66047
6086 23856 -237804 -66925 -13584 74511 211529 -343166 19669 -101174 -58078 302498 -139448
6074 -8278 -187125 -135163 -175331 -127933 -92671 -64937 143022 -307303 -333097 32007 66521
6063 66521 34608 248340 -321131 -56409 313408 -376611 166179 -24715 -78801 -115921 317778
6051 -23596 415602 -148372 165136 103567 -252959 -53425 36061 56372 -75238 270426 304157
6040 304157 -47286 -52939 -139597 -131470 -120494 -117205 -138446 -26239 -148842 41411 -454379 -29343
6027 -125846 -373820 159565 -238744 -154823 -14642 282029 -41666 -307 252730 7243 -190536
6015 10626 142821 11510 2448 4504 -100723 213394 155843 -61332 -170409 -193028 -88654
6003 132258 -180425 -81778 130552 -151326 21788 -150190 -244946 419410 -58581 54333 -157884
5991 -199281 39504 -65626 -74451 -25311 -15124 66569 104681 -111762 -51790 165755 292513
5980 292513 -225337 207569 -252996 6192 -310621 -58847 30203 18140 53588 162943 167944
5969 167944 -112865 -138146 -263739 57405 -111880 35119 -117958 -69263 280230 -131955
5958 94186 -126782 -101139 -216720 -64297 22918 10210 -64495 -215453 -12523 -62928 10104
5946 -95078 -54556 93266 97904 56028 -14634 55649 6654 -222548 -40301 -48233 209102 -158522
5933 267462 -232784 28856 129016 -31227 54958 -26117 97040 252298 215655 -243250 -258818
5922 -258818 -54074 -234122 108633 57569 -77154 1665 -132121 182531 -29281 -236707 278426
5910 53414 -230209 -237793 198239 -352621 -99369 80034 -39202 68668 384935 93403 24605
5898 198359 -197370 14256 -167253 26951 120633 -147816 124442 -245461 -285490 35107 -396858
5886 37399 -123119 76286 -30874 32395 -100567 -77500 517353 -114168 14432 -3988 24231
5874 -62330 -244444 198107 9211 109594 -212335 153828 125471 -184208 -148160 -219471 31368
5862 -424845 18718 178553 348868 -64835 -208015 135174 208428 -82366 162636 84217 -29608
5850 274945 -110197 -70108 83561 -10017 -200945 -233017 -71689 429885 311892 -99818 -128240
5839 -128240 178223 -73659 60662 106696 79767 -231830 -43861 92116 -248423 157532 136229
5828 136229 -5388 20953 -78113 281 -225736 -81099 8501 468982 109923 338197 -113761
5816 35683 84935 -98774 40437 5667 72300 -154191 -145135 34825 -74514 -178135 -154865 -133824
5804 -133824 -165673 28634 -53752 -145118 5276 41942 480788 -70533 -342470 11962 237395
5793 237395 -147638 43360 -114637 -47349 -53347 275474 -169580 -468154 66166 -9437 88265
5781 -51607 -123593 190446 16880 343810 -77998 -52343 38488 97795 216450 85605 -146926
5769 -182233 -172610 213774 -230247 289846 2644 99583 -207640 -109775 -144794 -91622 -146539
5758 -146539 -220111 183383 -131371 -111985 -113807 146639 -65343 50539 -153805 -141629 100368
5746 34455 -379530 -130718 14192 -68438 210944 -172039 -201693 -34023 -150929 53889 -112096
5734 60345 74943 -145027 134260 154800 -85284 -156086 -150463 -75254 -140095 -79950 -653076
5723 -653076 158695 38206 241465 55890 -230036 -96968 -9427 175833 -33072 127470 137086
5712 137086 198437 32805 238145 -174188 -16654 -5817 25904 -317531 59291 -44256 -190162
5701 -190162 431750 -107365 -15034 128763 -82939 -30340 330126 350919 -28277 90121 133434
5690 133434 371041 -316978 -258181 48945 172529 58786 105861 -5536 -61899 197780 189748
5679 189748 -42031 38742 -26364 326985 -8416 -127706 -83237 -41924 292813 -86833 -119263
5668 -119263 30289 131663 -97982 72406 108817 107897 140419 -137886 -301600 -137046 176225
5656 112498 193086 78399 -392565 70866 67640 -49076 -40689 -4913 -224955 83358 -67342 62361
5643 -422950 -356022 -145263 74098 -84938 102782 164381 3894 154779 -127624 -207742 81552
5631 -77857 42703 229657 135211 156933 -11349 -165955 318967 425546 -283897 -34064 14458
5619 -12586 -18537 -153751 -264221 292041 123432 145777 -201040 48777 -19696 -2457 -90019
5608 -90019 139453 -139116 -52465 -248280 64769 59450 28843 130888 84853 -56011 -230571
5597 -230571 -43305 -259212 172959 1090 -90750 108999 -40915 -24729 188497 -213088 160315
5585 143785 32184 111352 345288 -8430 113982 -356573 170840 -5054 141556 -57438 -152820
5574 -152820 -177790 68912 46370 316947 -152087 44660 -122203 -27235 25191 -28689 -100260
5563 -100260 69358 190943 107098 206218 -104775 -3417 -102792 -170843 181382 39865 95688
5552 95688 114260 63832 -169263 177842 -153690 147371 -70088 -1881 76166 -299082 84705
5540 369811 -288796 214283 10803 300506 200106 -163652 282573 -154332 37707 24051
5530 24051 -67893 -301414 -99232 -144270 -71664 18155 175949 15512 -79099 -72201 210197
5518 -278484 89069 -47659 54322 55957 -125890 162887 113021 115684 -128551 -2679 -269726
5507 -269726 230897 -211778 -40311 -46231 128387 -10753 220095 215600 80189 57795 -376665
5495 -10605 42669 92713 15746 -382956 68678 -255073 -348682 72678 -106142 -123959 -148330
5484 -148330 361439 -191387 -97666 -201073 199125 115857 90163 -15207 -47904 -96654 130322
5472 162596 56576 352819 -55065 216046 -125634 -6594 -109083 141244 185971 -192569 30464
5460 -16325 6054 246573 -103166 -416095 -69385 38842 -103171 78800 -150040 -60703 -67407
5449 -67407 75297 -110463 86126 -34583 246838 76461 -13166 -114067 230673 -62293 -208188
5438 -208188 316928 -58571 27835 92691 85223 -171305 -205738 63936 -254314 199249 121464
5427 121464 -162484 225880 89211 -87083 -174210 -35217 80082 -233791 -128772 116363 -140187
5415 619303 -246431 57654 -40791 32217 -197735 -32626 -80268 2571 49578 -101698 16258
5403 169290 7650 -150289 107866 283949 -88814 -71831 137470 122409 -333063 -33095 -2397
5391 -70129 340461 4219 157676 -451939 -24990 179759 -145147 91659 -192477 189719 101302
5380 101302 -166989 -210426 259917 102173 27447 -126777 191197 -136415 214497 -62911
5369 -339450 -193887 -344922 -208535 -88372 131110 193472 194478 -436364 180744 -67819 44170
5357 -227436 -81103 -206148 31256 138597 178452 32414 -174422 202810 -72130 232775 112288
5345 126109 81992 89855 -7758 -126229 -38503 -232109 387525 34865 -24863 -407014 201962
5333 -489228 -306010 103000 -222009 45005 260459 69966 198905 -124578 56251 76781
5323 76781 -39629 75731 308894 -19070 223470 -195171 182786 -55185 -127227 305902 233335
5312 233335 -160132 -37322 130014 -19900 -122178 -67554 8017 85789 -6717 -268155 -69165
5300 250251 -102098 -259555 236922 114864 40124 14692 -133006 165051 7652 -2079 41532
5288 -133833 79332 272782 219085 19805 48083 -72140 287877 202557 151213 -284543 -24729
5276 -57411 76619 82498 88895 37693 -35798 278127 106057 23826 262969 87207 -274938
5264 -221281 -323182 116338 -38219 -210515 -160689 -313926 -304292 -188676 128431 -154658
5253 329414 38994 -233250 445503 -62347 139348 87371 -42998 -90690 205316 11352 -215517
5241 6761 -300848 -175212 -233066 140671 90226 3018 -328350 -341079 54749 -146729 273078
5229 192325 47443 38099 -38090 226656 287237 266548 -215854 -41888 -168221 -128671 -257563
5218 -257563 233430 -11698 226344 222954 -247447 114120 149245 205923 -507124 166291 -67379
5206 -146044 -30919 -141005 -105524 -1663 158271 39681 193076 -128949 -81138 -310565 -116248
5194 264 -164483 -235991 300657 95369 198775 330446 -77213 -223058 153711 -215551 177300
5182 -121380 -54350 239351 -23171 -122328 147972 239462 129201 -381724 19036 180735 83394
5170 -100880 74342 -291212 2428 196686 9098 -130287 188102 134998 58265 -80103 149418
5158 -104042 312136 203213 -58730 360834 -134023 -125638 110329 30855 -234721 -144149 16387
5146 -5928 34844 48149 -28004 -282784 332045 34911 -63494 121778 119894 69150 15121 157679
5134 157679 184848 5803 108362 -480399 -160252 53618 333345 82080 200375 -122363 -91845
5123 -91845 200015 -209959 -85013 14582 -127186 393399 127533 -145323 260627 -106461
5112 -81777 -192092 -87748 95820 152380 -181237 -12170 -107166 -245880 204828 -119328 -16997
5100 -39024 -303453 -119775 -205482 106275 -199032 -64627 50646 -83260 -195840 21043 -1706
5088 -26178 111616 34525 -123604 171961 129774 11632 -246054 280708 261610 -187366 -44243
5076 -51756 -110113 52550 3648 291209 -31626 11441 41988 41894 43786 112598 12621 88614 -323908
5062 -54264 6641 63667 -57799 -158892 146241 92307 68934 -175118 -66602 -36786 210254
5050 115978 -152906 -20644 8846 -52673 -89871 -211964 83214 -292992 -77152 -102447 214777
5038 75727 -21007 -116967 -77189 136322 -352034 125035 -1537 -106694 170259 -137005 183413
5026 129332 42600 -158037 2368 -200648 -103437 -132969 145307 122242 -97647 -169561 48908
5014 -120573 -236434 100682 125170 -358858 -43018 -216429 68595 -33198 197489 332740
5004 332740 -38451 -88234 31951 -7673 233184 66125 106802 -257188 -225448 -23450 85226
4992 141085 -164633 -116430 11867 88158 -106353 31058 250529 69558 22610 -12788 -42949
4981 -42949 -30380 45116 341864 261694 326639 -33123 -229018 -92857 132248 25376 161831
4970 161831 -200416 10134 101617 -13298 238205 -90711 -9820 4913 61788 -101111 -34202
4958 -145537 -50124 46481 -293028 -152318 -170913 183738 116492 17388 -49490 -102113 -16936
4946 30761 158242 -283211 148830 128703 -358932 55791 11835 27067 -10205 -21135 -105847
4935 -105847 -55560 226217 158959 -190907 -262031 268982 -16209 166123 159342 -29438 20164
4923 46933 -95398 156571 -125950 -166896 -55877 -192042 169088 -31986 -33880 -49563 -110423
4912 -110423 66148 -287466 188617 -55134 7668 28686 -106120 -116193 147064 3171 -10761
4900 310099 84653 -241479 145844 36489 -97804 -191504 -61386 -13789 322839 -267195 173894
4888 93398 -43707 147548 119248 -102044 -20703 54238 155194 2126 230413 211249 -285754
4876 -91112 -183684 -116346 164071 -137262 -258404 -81543 96155 -5813 81559 420821 -9482
4864 -90711 134992 -441800 -135872 1352 170245 149268 -89114 -99305 -174571 -11897 -163800
4853 -163800 -17567 -204337 148721 178185 74732 -34564 -145394 -87637 296848 -73540 -86616
4842 -86616 -217888 -112331 -316050 152997 256255 82479 -148477 -62161 111002 -38338
4831 78646 213207 133599 -236490 -195357 -155091 209335 150089 159808 -64369 66417 -76773
4819 42946 -40747 367680 156900 29677 -130637 231599 -181009 -247085 62705 58871 -5969
4807 -85648 142091 -70561 76498 16499 -53841 -217897 95116 8526 6772 131907 124891 -124161
4794 10910 141417 403285 312620 14305 144233 116149 -273198 -120680 -20546 59488 163259
4783 163259 -63747 -55455 40046 66608 -153053 -67975 14553 -89818 -113534 201166 -190728
4771 -292131 -56959 -99643 134221 -95338 147473 116716 43907 92231 -171684 199653 56491
4759 143102 43712 -91543 -88146 22409 54126 72414 -188464 122578 63334 -48773 188230
4747 70390 84740 -208897 -194669 17771 -137248 16230 -22975 -27377 259401 -113865 -195963
4736 -195963 -206737 45895 73453 213969 149283 -181051 -54400 -281580 -33953 -325188 195601
4724 -128455 222380 -340586 -202686 -274706 32188 -88682 52518 129196 109444 -197436 -358520
4713 -358520 269658 39966 328369 -113597 6573 -198600 -270646 -121190 -340427 137133
4702 154251 59632 61116 262645 321916 -55859 -247588 -135233 124607 13382 444798 -362200
4690 123928 115457 -245737 -183862 82540 -61542 115452 357839 -170140 278490 -201778 75500
4678 52331 151499 -243892 -205463 51485 172573 20599 -188912 -113903 -31431 207369 324019
4667 324019 127003 117293 -163019 129198 -178613 5665 46707 237066 46704 -123917 -68087
4656 -68087 246591 -77720 160225 137902 -241803 35730 139604 -82824 96912 415239 -103708
4644 226964 453673 17812 4995 156202 -119212 221392 -225896 373021 -184228 -141355
4634 -141355 64331 35975 222191 -995 -176 -121206 -30082 19598 -97086 -13665 -112221 -12928
4621 -185135 -96148 -27697 -159673 -184024 -181231 405695 -306226 -139056 219275 -71277 -338093
4610 -338093 282375 -9870 80209 -123134 -65146 54753 219872 -259159 105357 263241 -109282
4598 -10302 -1622 -69988 -132327 182359 -71893 -252360 111825 -155814 106949 36827 14345
4586 -168659 11879 40048 -155631 -10019 272717 329549 174052 -72484 -38107 217802 -43890
4574 -192630 -112342 176549 7824 -125538 181762 169494 58189 -55548 266656 -44602 -213330
4563 -213330 -24024 -78193 -6981 -188303 -170522 82089 168505 324538 -170849 -115933 196044
4551 47286 -188971 25737 29902 64278 115075 115382 -106628 162466 262141 28885 -98239 63541
4538 -98321 -119625 -97564 -292080 172514 47379 27417 -152207 -207517 9140 -136607 -22208
4526 8248 -64819 45231 -100399 193509 40997 157890 251219 322841 111524 104408 -122048
4514 92059 77551 -80543 247980 -214312 433157 -218223 -277322 415284 192349 -128824
4503 16900 42032 -252812 166850 -100251 158228 -45997 139790 -57576 -11672 -147038 -144022
4492 -144022 90111 230803 126873 118877 -148148 213172 87222 -131285 194399 258611 -1624
4480 214253 95251 -128026 -72668 -251946 -106217 27770 -186121 -208701 213713 232440 22248
$$ [...]
##END NTUPLES=NMR SPECTRUM
##END=
