##TITLE=AC1716_NUNAH15002_9207373_qqZutFL7Wh
##JCAMPDX= 6.0         $$ Bruker NMR JCAMP-DX V2.0
##DATA TYPE= NMR SPECTRUM
##DATA CLASS= NTUPLES
##ORIGIN= BRUKER
##OWNER= Administrator
$$ 1.72 TOPSPIN		Version 2.1
$$ 2015-06-01 20:03:07.842 -0700  Administrator@X
$$ Compression mode = diff/dup
##.OBSERVE FREQUENCY= 400.02188249412
##.OBSERVE NUCLEUS= ^1H
##.ACQUISITION MODE= SIMULTANEOUS (DQD)
##.ACQUISITION SCHEME= undefined
##.AVERAGES= 64
##.DIGITISER RES= 22
##SPECTROMETER/DATA SYSTEM= spect
##.PULSE SEQUENCE= noesygpps1d.comp
##.SOLVENT NAME= COFFEE_meoh
##.SHIFT REFERENCE= INTERNAL, COFFEE_meoh, 1, 14.9609
##AUDIT TRAIL= $$ (NUMBER, WHEN, WHO, WHERE, PROCESS, VERSION, WHAT)
$$ ##TITLE= Audit trail, TOPSPIN		Version 2.1
$$ ##JCAMPDX= 5.01
$$ ##ORIGIN= Bruker BioSpin GmbH
$$ ##OWNER= Administrator
$$ $$ E:\/data/COFFEE/nmr/AC1716_NUNAH15002_9207373_qqZutFL7Wh/12/pdata/1/auditp.txt
$$ ##AUDIT TRAIL=  $$ (NUMBER, WHEN, WHO, WHERE, PROCESS, VERSION, WHAT)
(   1,<2015-06-01 20:03:02.405 -0700>,<Administrator>,<X>,<go>,<TOPSPIN 2.1>,
      <created by zg
	started at 2015-06-01 19:51:32.608 -0700,
	POWCHK enabled, PULCHK disabled,
       configuration hash MD5:
       21 0F 79 D6 B3 7B B4 F6 88 20 88 DB 03 48 BD 9F
       data hash MD5: 64K
       3C 9D 92 DA 04 51 F2 0A 04 B0 80 24 F0 62 7E 6D>)
(   2,<2015-06-01 20:03:05.780 -0700>,<Administrator>,<X>,<proc1d>,<TOPSPIN 2.1>,
      <Start of raw data processing
       efp LB = 0.3 FT_mod = 6 PKNL = 1 PHC0 = 0 PHC1 = 0 SI = 128K 
       data hash MD5: 128K
       FE 0E 3C 80 44 A4 B6 59 F2 7D 66 7C 42 27 65 FD>)
(   3,<2015-06-01 20:03:06.655 -0700>,<Administrator>,<X>,<proc1d>,<TOPSPIN 2.1>,
      <pk PHC0 = -87.09412 PHC1 = 0 
       data hash MD5: 128K
       23 5D 87 73 4B B1 11 ED D3 3B 4D 8C 44 81 3E 44>)
(   4,<2015-06-01 20:03:07.030 -0700>,<Administrator>,<X>,<proc1d>,<TOPSPIN 2.1>,
      <abs ABSG = 1 
       data hash MD5: 128K
       0C 97 5A 95 44 96 30 51 02 A4 CC 5A 64 89 3A F2>)
(   5,<2015-06-01 20:03:07.139 -0700>,<Administrator>,<X>,<proc1d>,<TOPSPIN 2.1>,
      <abs ABSG = 2 
       data hash MD5: 128K
       E4 F0 D5 F0 08 4D F1 D5 78 7D 91 6C 93 29 CF AE>)
(   6,<2015-06-01 20:03:07.233 -0700>,<Administrator>,<X>,<proc1d>,<TOPSPIN 2.1>,
      <abs ABSG = 3 
       data hash MD5: 128K
       97 64 2A D3 F9 B0 33 56 37 1E 08 3E 23 B3 72 AF>)
(   7,<2015-06-01 20:03:07.311 -0700>,<Administrator>,<X>,<proc1d>,<TOPSPIN 2.1>,
      <abs ABSG = 4 
       data hash MD5: 128K
       37 8C 34 E3 D9 3E 09 38 42 E0 8B 00 33 78 EC 01>)
(   8,<2015-06-01 20:03:07.405 -0700>,<Administrator>,<X>,<proc1d>,<TOPSPIN 2.1>,
      <abs ABSG = 5 
       data hash MD5: 128K
       77 F3 6B 6C 4F 49 B8 6C F1 30 DA 4F 18 05 65 94>)
$$ ##END=
$$ 
$$ $$ hash MD5
$$ $$ 0B E1 2E 90 35 21 D1 D5 12 9B 6E 95 BA 02 25 FB
##$RELAX= 
##$RELAX= 
##$RELAX= 
##$RELAX= 
##$RELAX= 
##$RELAX= 
##$RELAX= 
##$RELAX= 
$$ Bruker specific parameters
$$ --------------------------
##$DU= <E:\>
##$EXPNO= 12
$$ [...]
150 150 150 150 150 150 150 150
##$TP07= 0
##$TPNAME0= <>
##$TPNAME1= <>
##$TPNAME2= <>
##$TPNAME3= <>
##$TPNAME4= <>
##$TPNAME5= <>
##$TPNAME6= <>
##$TPNAME7= <>
##$TPOAL= (0..7)
0.5 0.5 0.5 0.5 0.5 0.5 0.5 0.5
##$TPOFFS= (0..7)
0 0 0 0 0 0 0 0
##$TUNHIN= 0
##$TUNHOUT= 0
##$TUNXOUT= 0
##$USERA1= <user>
##$USERA2= <user>
##$USERA3= <user>
##$USERA4= <user>
##$USERA5= <user>
##$V9= 5
##$VALIST= <valist>
##$VCLIST= <CCCCCCCCCCCCCCC>
##$VD= 0
##$VDLIST= <DDDDDDDDDDDDDDD>
##$VPLIST= <PPPPPPPPPPPPPPP>
##$VTLIST= <TTTTTTTTTTTTTTT>
##$WBST= 2048
##$WBSW= 25
##$XGAIN= (0..3)
0 0 0 0
##$XL= 0
##$YL= 0
##$YMAX_a= 6350234
##$YMIN_a= -12120648
##$ZGOPTNS= <>
##$ZL1= 120
##$ZL2= 120
##$ZL3= 120
##$ZL4= 120
##$ABSF1= 14.9609
##$ABSF2= -5.597281
##$ABSG= 5
##$ABSL= 3
##$ALPHA= 0
##$AQORDER= 0
##$ASSFAC= 0
##$ASSFACI= 0
##$ASSFACX= 0
##$ASSWID= 0
##$AUNMP= <proc_prof1d_extract.lims>
##$AXLEFT= 0
##$AXNAME= <>
##$AXNUC= <1H>
##$AXRIGHT= 0
##$AXTYPE= 0
##$AXUNIT= <>
##$AZFE= 0.1
##$AZFW= 0.1
##$BCFW= 0
##$BC_mod= 0
##$BYTORDP= 0
##$COROFFS= 0
##$CY= 15
##$DATMOD= 1
##$DC= 0
##$DFILT= <>
##$DTYPP= 0
##$F1P= 0
##$F2P= 0
##$FCOR= 0.5
##$FTSIZE= 131072
##$FT_mod= 6
##$GAMMA= 0
##$GB= 0
##$INTBC= 1
##$INTSCL= 1
##$ISEN= 128
##$LB= 0.3
##$LEV0= 0
##$LPBIN= 0
##$MAXI= 10000
##$MC2= 0
##$MEAN= 0
##$ME_mod= 0
##$MI= 0
##$NCOEF= 0
##$NC_proc= -2
##$NLEV= 6
##$NOISF1= 0
##$NOISF2= 0
##$NSP= 0
##$NTH_PI= 0
##$NZP= 0
##$OFFSET= 14.9609
##$PC= 1
##$PHC0= -87.09412
##$PHC1= 0
##$PH_mod= 1
##$PKNL= yes
##$PPARMOD= 0
##$PPDIAG= 0
##$PPIPTYP= 0
##$PPMPNUM= 2147483647
##$PPRESOL= 1
##$PSCAL= 4
##$PSIGN= 0
##$PYNMP= <proc.py>
##$REVERSE= no
##$SF= 400.020009675948
##$SI= 131072
##$SIGF1= 0
##$SIGF2= 0
##$SINO= 400
##$SIOLD= 131072
##$SPECTYP= <>
##$SREGLST= <1H.CDCl3>
##$SSB= 0
##$STSI= 131072
##$STSR= 0
##$SW_p= 8223.68421052631
##$SYMM= 0
##$S_DEV= 0
##$TDeff= 65536
##$TDoff= 0
##$TI= <>
##$TILT= no
##$TM1= 0
##$TM2= 0
##$TOPLEV= 0
##$USERP1= <user>
##$USERP2= <user>
##$USERP3= <user>
##$USERP4= <user>
##$USERP5= <user>
##$WDW= 1
##$XDIM= 131072
##$YMAX_p= 422757252
##$YMIN_p= -10507
##$CURPLOT= <Network HP LaserJet P1505>
##$CURPRIN= <$Network HP LaserJet P1505>
##$DFORMAT= <normdp>
##$LAYOUT= <+/1D_H.xwp>
##$LFORMAT= <normlp>
##$PFORMAT= <normpl>
##$SURQMSG= 1
$$ End of Bruker specific parameters
$$ ---------------------------------
##NTUPLES= NMR SPECTRUM
##VAR_NAME=  FREQUENCY,     SPECTRUM/REAL,   SPECTRUM/IMAG
##SYMBOL=    X,             R,               I
##VAR_TYPE=  INDEPENDENT,   DEPENDENT,       DEPENDENT
##VAR_FORM=  AFFN,          ASDF,            ASDF
##VAR_DIM=   131072,        131072,          131072
##UNITS=     HZ,            ARBITRARY UNITS, ARBITRARY UNITS
##FACTOR=    0.0627417313425164, 1,          1
##FIRST=     8223.62146879497, -399,         -59657
##LAST=      0,             2330,            -60127
##MIN=       0,             -10507,          0
##MAX=       8223.62146879497, 422757252,    0
$$ Real data points
##PAGE= N=1
##DATA TABLE= (X++(R..R)), XYDATA
$$ [...]
61660D09625N69N48N82L09k26m31j63k1l35n74k01M47O91N40N83J092J769K326
61642D17130K866L620M573N420N675M960L408J714N08k45r94j887k632k985k989
61627D38142k781k478k334k575l044l268l043k574k010j171M9J285J990J955J369
61612D19512N09m44j358k179k943l724m602n699p050q304q771p994o278m527l543
61597C52605l503l980m329m179l686l300l217l134k640j766j031r35j483k193
61583C13229k552k426k046j659j294q99n56m18m75n57n51n14n89q75j312j618
61567B94888j463r02m39m56p05o85l82k30l87m97k66J58N08Q00J178J602J932
61550B94654K048J823J229N89L75O19P91N71L47O47J379J952K058J938K010K451
$$ y = [409625, 410194, 410742, 411324, 411633, 411407, 410976, 410813, 410792, 410457, 409883, 409682, 410129, 410820, 411360, 411943, 413035, 414804, 417130, 419996, 423616, 428189, 433609, 439284, 444244, 447652, 449366, 449874, 449629, 448635, 446748, 444116, 441131, 438142, 435361, 432883, 430549, 427974, 424930, 421662, 418619, 416045, 414035, 412864, 412913, 414198, 416188, 418143, 419512, 420021, 419577, 418219, 416040, 413097, 409373, 404771, 399072, 392022, 383718, 374947, 366953, 360675, 356148, 352605, 349102, 345122, 340793, 336614, 332928, 329628, 326411, 323277, 320637, 318871, 317840, 316905, 315422, 313229, 310677, 308251, 306205, 304546, 303252, 302353, 301797, 301379, 300904, 300347, 299796, 299282, 298693, 297818, 296506, 294888, 293425, 292523, 292084, 291628, 290923, 290238, 289856, 289626, 289239, 288742, 288476, 288634, 289142, 289942, 291120, 292722, 294654, 296702, 298525, 299754, 300343, 300718, 301337, 302128, 302699, 303046, 303693, 305072, 307024, 309082, 311020, 313030, 315481]
61534C15481L064L389L016K055J161Q31Q64O66j4q94j616k111k538l006l363l262
61518C13723k614j906j751k053k066j399n19N4M69J008J368J128N82L44L20q4
61502C06604q51j231r34o13q42j258j184o71l33l53k23M72J374J647R17k72r88
61485C01261q76l98j20n6Q3K96L82M77R78J938K882L350L283K842K105J091n5
61468C19463j041j503j229m40L32P87J076J266J018J48q18j230j122q32k07R93
61452C16661K175K389J751J329J453J274L72l95k26L51M65L19P51J851K927L488
61436C36935L527L192K907L359M581N404M749L115J876J358P56j82o57k05N81
61421C71296J151J772K650L138K640J675J235J431J540J144N48R4l09q85j647
$$ y = [315481, 318545, 321934, 324950, 327005, 328166, 328997, 329861, 330527, 330513, 329619, 328003, 325892, 323354, 320348, 316985, 313723, 311109, 309203, 307452, 305399, 303333, 301934, 301415, 301469, 301938, 302946, 304314, 305442, 306024, 306368, 306688, 306604, 305753, 304522, 303588, 302975, 302133, 300875, 299691, 299020, 298687, 298334, 298111, 298583, 299957, 301604, 302521, 302249, 301261, 300385, 299987, 299867, 299811, 299894, 300190, 300572, 301049, 302027, 303965, 306847, 310197, 313480, 316322, 318427, 319518, 319463, 318422, 316919, 315690, 315250, 315582, 316369, 317445, 318711, 319729, 319877, 319059, 317829, 316707, 315875, 315668, 316661, 318836, 321225, 322976, 324305, 325758, 327032, 327404, 327009, 326783, 327134, 327599, 327918, 328669, 330520, 333447, 336935, 340462, 343654, 346561, 349920, 354501, 359905, 364654, 367769, 369645, 371003, 371759, 371577, 370920, 370715, 371296, 372447, 374219, 376869, 380007, 382647, 384322, 385557, 386988, 388528, 389672, 390220, 390314, 390005, 389120, 387473]
61406C87473k501l348l963l987l262k138j254r73j031q96m14N7K42L35N88P81
61390C65709N42ol61l78l54m07l24p8P9J78O00J364J928K002K017K381K801K866
61372C80559K766K783K566J707P36O60J419J760Q39o82j531j330o79r1O21J836
61356C93939L388M623N193N542O402P867R375J0496J1270J1569J0850R017P023
61343D96554N842N232M347L253K812L143L341K983K768L150L329K390O68q17j721
61328E37274k347k818l148l785m992n943n470l731k129j488j220n81K55Q30J299
61313E02006K001K722L151L671M978P027Q998J0324J1261J2359J3641J4438J3896
61300F10473J1690Q366M940J994o11l123n281o636p168p219o988o490n992n961
$$ y = [387473, 384972, 381624, 377661, 373674, 370412, 368274, 367020, 366047, 365016, 364120, 363706, 363763, 364005, 364340, 364928, 365709, 366251, 366245, 365884, 365506, 365152, 364745, 364421, 364343, 364422, 364600, 365200, 366564, 368492, 370494, 372511, 374892, 377693, 380559, 383325, 386108, 388674, 390381, 391117, 391777, 393196, 394956, 395795, 395113, 393582, 392252, 391573, 391482, 392103, 393939, 397327, 401950, 407143, 412685, 419087, 426954, 436329, 446825, 458095, 469664, 480514, 489531, 496554, 502396, 507628, 511975, 515228, 518040, 521183, 524524, 527507, 530275, 533425, 536754, 539144, 539812, 538995, 537274, 534927, 532109, 528961, 525176, 520184, 514241, 508771, 505040, 502911, 501423, 500203, 499622, 499877, 500707, 502006, 504007, 506729, 509880, 513551, 518529, 525556, 534554, 544878, 556139, 568498, 582139, 596577, 610473, 622163, 630529, 635469, 637463, 636852, 633729, 628448, 621812, 614644, 607425, 600437, 593947, 587955, 581994]
61286E81994o482p117p411p272o710n612m028k381j078j9J165K438L315L530L433
61271E47765L549L946M305M477M566M510M022L161K652L258M989P168R236J1035
61257F18639J2389J2809J1902R851P330M997L137J692N25l09o59p26j235k735
61243F77607m770o172o332n786n401n395n444n355n186m933m534m136l988m006
61229F06169l740k783j172O66K204L163L647L887L882L527L078L096L792M797
61215F34213N777O878Q148R013Q809P629O130M654L048J287k17r85q32J24J522
61200F95198K949M326O000Q153J0453J2705J5448J9238K3355K6027K5991K3356
61188H73199J9001J3859Q977N407L577L058L218L640L799K955Q74j742l987n599
$$ y = [581994, 575512, 568395, 560984, 553712, 547002, 541390, 537362, 534981, 533903, 533884, 535049, 537487, 540802, 544332, 547765, 551314, 555260, 559565, 564042, 568608, 573118, 577140, 580301, 582953, 586211, 591200, 598368, 607604, 618639, 631028, 643837, 655739, 665590, 672920, 677917, 681054, 682746, 683271, 682962, 682303, 681577, 680342, 677607, 672837, 666665, 660333, 654547, 649146, 643751, 638307, 632952, 627766, 622833, 618299, 614163, 610175, 606169, 602429, 599646, 598474, 599140, 601344, 604507, 608154, 612041, 615923, 619450, 622528, 625624, 629416, 634213, 639990, 646868, 655016, 664029, 672838, 680467, 686597, 691251, 694299, 695586, 695369, 694384, 693552, 693676, 695198, 698147, 702473, 708473, 716626, 727079, 739784, 755232, 774470, 797825, 823852, 849843, 873199, 892200, 906059, 915036, 920443, 924020, 927078, 930296, 933936, 937735, 940690, 941564, 939822, 935835, 930236]
61174I30236o829p847q718r656j0744j1601j1766j1395j1165j1545j2434j3540
61162H02996j4705j5831j6742j7270j7341j6853j5605j3567j1174r122p675o296
61150F40815m221j399J430L569M781M746K770j295o242j0303j2649j3483j3012
61137E95507j1213q637o448n218m362l123j479K52K066L949N432O199O817Q263
61123E88005J0760J3586J5946J7708J9258K0986K2934K4798K6264K7306K8141
61112H15692K8874K9442K9824L0042K9900K9079K7566K5715K3851K2046K0201
61101A112232J7905J4376R106K708l417q441j2707j6829k0743k3882k5840k6685
61089A017783k6932k7285k7978k8475k8231k7624k7342k7078k5775k3328k0955
$$ y = [930236, 923407, 915560, 906842, 897186, 886442, 874841, 863075, 851680, 840515, 828970, 816536, 802996, 788291, 772460, 755718, 738448, 721107, 704254, 688649, 675082, 663908, 654786, 647111, 640815, 636594, 635195, 636625, 640194, 644975, 649721, 652491, 651196, 644954, 634651, 622002, 608519, 595507, 584294, 575657, 569209, 563991, 559629, 556506, 555027, 555279, 557345, 561294, 566726, 572925, 579742, 588005, 598765, 612351, 628297, 646005, 665263, 686249, 709183, 733981, 760245, 787551, 815692, 844566, 874008, 903832, 933874, 963774, 992853, 1020419, 1046134, 1069985, 1092031, 1112232, 1130137, 1144513, 1153619, 1156327, 1152910, 1144469, 1131762, 1114933, 1094190, 1070308, 1044468, 1017783, 990851, 963566, 935588, 907113, 878882, 851258, 823916, 796838, 771063, 747735, 726780]
61078G26780j9560j8687j7504j5856j3900j1656r458p992p259o335m726l090k100
61065E88657j531j088j042j271p30J045K958L888M341N360O655P181O984P093
61051F28500P977R283J0719J2199J3457J4554J6205J8697K1087K2465K3295K4411
61039H22849K5506K5947K6227K7208K8571K9535L0360L1629L2805L3240L3822
61028A147699L5759L8355L9910M0182L9965L9036L6904L5033L5695L8999M3618
61017A571155M9901N9134P0003P9266Q6211R3232J01987J12868J28613J53913
61007B506283J90297K35756K90488L57889M38680N31178O40685P81572R66365
60998F939193J202370J502053J870662K248230K467838K325281J745244Q87404
$$ y = [726780, 707220, 688533, 671029, 655173, 641273, 629617, 620159, 612167, 604908, 598573, 593847, 590757, 588657, 587126, 586038, 584996, 583725, 582995, 584040, 586998, 590886, 595227, 600587, 607242, 614423, 621407, 628500, 636477, 645760, 656479, 668678, 682135, 696689, 712894, 731591, 752678, 775143, 798438, 822849, 848355, 874302, 900529, 927737, 956308, 985843, 1016203, 1047832, 1080637, 1113877, 1147699, 1183458, 1221813, 1261723, 1301905, 1341870, 1380906, 1417810, 1452843, 1488538, 1527537, 1571155, 1621056, 1680190, 1750193, 1829459, 1915670, 2008902, 2110889, 2223757, 2352370, 2506283, 2696580, 2932336, 3222824, 3580713, 4019393, 4550571, 5191256, 5972828, 6939193, 8141563, 9643616, 11514278, 13762508, 16230346, 18555627, 20300871, 21188275]
60990B1188275O2635m72557o42970n07809j53369L21110P40357Q64136N32519
60981B1932327j89665j036042j718442k091475k173795k061833j848862j600212
60973I212001j357090j139208r49314p84852o45522n30452m35143l55274k90060
60964B725086k39349k00564j70673j48207j31439j17191j03660r1931q2861p4670
60954A364541o5436n5804m7154l9193l1474k5583k3340k4016k5331k6245k6877
60943I74088k6845k5676k4142k3252k2516k0844j8608j7132j6633j6243j5767
60932G46430j5788j6164j5967j4890j3519j2148j0541q900p956p840p775p063
60920F07879n863m825m514n093o111o679o293n341m473l789l063k322j716j093
$$ y = [21188275, 21250910, 20778353, 20135383, 19627574, 19474205, 19795315, 20535672, 21399808, 21932327, 21742662, 20706620, 18988178, 16896703, 14722908, 12661075, 10812213, 9212001, 7854911, 6715703, 5766389, 4981537, 4336015, 3805563, 3370420, 3015146, 2725086, 2485737, 2285173, 2114500, 1966293, 1834854, 1717663, 1614003, 1522072, 1439211, 1364541, 1299105, 1243301, 1196147, 1156954, 1125480, 1099897, 1076557, 1052541, 1027210, 1000965, 974088, 947243, 921567, 897425, 874173, 851657, 830813, 812205, 795073, 778440, 762197, 746430, 730642, 714478, 698511, 683621, 670102, 657954, 647413, 638513, 630557, 622717, 614942, 607879, 602016, 597191, 592677, 587584, 581473, 574794, 568501, 563160, 558687, 554898, 551835, 549513, 547797, 546704]
60906E46704k95N34J332K350L521M193M013L600L660L958L896L614L570L526K873
60891E91049J850J477K265L730N195O402P310P909Q314Q690R000R194R474J0147
60877F82006J1291J2776J4330J5525J6096J6543J7792K0004K2276K3904K5235
60866H77778K6745K8141K9093L0144L1891L3819L4934L5113L4858L4005L1779
60855A228300K7983K3196J7950J2486P161K210k795q364j4092j9131k3503k7921
60843A223480l2284l5432l6702l6823l6945l7448l7985l8087l7384l5799l3739
60832H24852l1729k9803k7705k5563k3770k2223k0388j8197j6175j4591j3236
60821E81472j2108j1517j1217j0295q368o312n266n344n757n790n255m299l266
$$ y = [546704, 546409, 546943, 548275, 550625, 554146, 558339, 562352, 565952, 569612, 573570, 577466, 581080, 584650, 588176, 591049, 592899, 594376, 596641, 600371, 605566, 611968, 619278, 627187, 635501, 644191, 653191, 662385, 671859, 682006, 693297, 706073, 720403, 735928, 752024, 768567, 786359, 806363, 828639, 852543, 877778, 904523, 932664, 961757, 991901, 1023792, 1057611, 1092545, 1127658, 1162516, 1196521, 1228300, 1256283, 1279479, 1297429, 1309915, 1317076, 1319286, 1316491, 1308127, 1294035, 1274904, 1251401, 1223480, 1191196, 1155764, 1119062, 1082239, 1045294, 1007846, 969861, 931774, 894390, 858591, 824852, 793123, 763320, 735615, 710052, 686282, 664059, 643671, 625474, 609299, 594708, 581472, 569364, 557847, 546630, 536335, 527967, 521655, 516389, 511045, 505288, 499498, 494243, 489944, 486678]
60808D86678k536k166j808j180m59nJ03P6R4J62J53o6n10r81j228j182r91r22
60790D73232j245j990k643k411j146J94M35n84j965k807k974k917l073l463l744
60775D42899l677l567l909m568m850m550m286m419m383l700k886k602k501j899
60761C91102j027n91m82j37K05k07j199j779j623j343j170o67J61P20R71J532
60745C84466K351K554K018J805K402K777J968N27m21o90p15n88l52m44j008j315
60729C95335p95n3l3o62j214j579k237l271m225m762m833m442l823l564l896m219
60713C51727l904l192k733k574k375k170k189k140j523n17K12M30M29L05j40q04
60697C28842j229j201q83m62m4J56K6j45k9K07J75q1j34K38R30J797K611L001
$$ y = [486678, 484142, 481976, 480168, 478988, 478529, 478524, 478627, 478703, 478797, 478959, 479112, 479046, 478536, 477555, 476327, 475145, 474154, 473232, 471987, 469997, 467354, 464943, 463797, 463991, 464426, 463842, 461877, 459070, 456096, 453179, 450106, 446643, 442899, 439222, 435655, 431746, 427178, 422328, 417778, 413492, 409073, 404690, 400990, 398104, 395502, 393001, 391102, 390075, 389484, 389002, 388865, 389070, 388863, 387664, 385885, 384262, 382919, 381749, 381082, 381243, 381963, 382934, 384466, 386817, 389371, 391389, 393194, 395596, 398373, 400341, 400868, 400447, 399757, 399042, 398454, 398102, 397658, 396650, 395335, 394540, 394487, 394454, 393792, 392578, 390999, 388762, 385491, 381266, 376504, 371671, 367229, 363406, 359842, 355946, 351727, 347823, 344631, 341898, 339324, 336949, 334779, 332590, 330450, 328927, 328410, 328622, 329052, 329481, 329786, 329646, 328842, 327613, 326412, 325529, 325067, 325023, 325179, 325205, 325060, 325031, 325238, 325413, 325332, 325198, 325436, 326366, 328163, 330774, 333775]
60679C33775K911K797K972L122L014L183M157N329N573M789L995L907M331M829
60665C88684N087M624L169J459P44J206J776J770J738K211K665K393J688J323
60651D20537J409J539J642J863J932J426N84K0l12j141k717m309n187n575o142
60636D05569o893p098o310m981l917l335k753j684k60R03J332J066N19Rm19p41
60620C71007o63J32J312J889J228j02j009j200j271j463j230l12N00L83l57p96
60604C68048o67m17k49J2K45M2n45r32q29n18j65M97J585K631L097K934K433J757
60586C78959R42P5o45r95q31l16R1J28Q9K87M37R7l53L8J470L047M028M696N579
60567C96823O487P019P504Q625J0276J1506J1599J0671R128P112M691K159k27
$$ y = [333775, 336686, 339483, 342455, 345577, 348591, 351774, 355931, 361260, 366833, 371622, 375617, 379524, 383855, 388684, 393771, 398395, 401564, 403023, 403767, 404973, 406749, 408519, 410257, 412468, 415133, 417526, 419214, 420537, 421946, 423485, 425127, 426990, 428922, 430348, 430932, 430952, 430640, 429499, 426782, 422473, 417286, 411711, 405569, 398676, 391578, 385268, 380287, 376370, 373035, 370282, 368598, 368338, 369241, 370573, 371639, 372158, 372167, 371748, 371007, 370344, 370476, 371788, 373677, 374905, 374803, 373794, 372594, 371323, 369860, 368630, 368318, 368818, 369201, 368844, 368048, 367381, 366964, 366715, 366727, 366972, 367014, 366469, 365537, 364708, 364190, 364025, 364522, 366107, 368738, 371835, 374769, 377202, 378959, 379901, 379976, 379331, 378336, 377505, 377189, 377280, 377408, 377497, 377784, 378221, 378318, 377965, 378003, 379473, 382520, 386548, 391244, 396823, 403310, 410329, 417833, 426458, 436734, 448240, 459839, 470510, 479638, 486750, 491441, 493600, 493373]
60554D93373k542m881o804p527o742n053l357k016q14L84J410K193K937L712M282
60539D68555M674N488P209R412J1185J2101J2278J1711J0194P890N334K784J49
60526E68964k327l995m633m787m900m674l732k493j797j857k121k061j681j249
60512E26657q80m87j0M42O99Q28J234K238L560M569N171O068P952J0697J3628
60497E82366J6359J9068K2116K5632K9414L2998L5891L7800L8565L7772L4791
60486I12772K9399K2179J3904M723n646j6755k6933l4320l8360l9969m0273l9488
60474G41233l7275l3903l0385k7426k4758k1877j8936j6438j4358j2292j0305
60463D93280q877p981o997n702m771m804n433n781n475m719l792k892k321k309
$$ y = [493373, 490831, 485950, 479146, 471619, 464877, 459824, 456467, 454451, 453637, 454021, 455431, 457624, 460561, 464273, 468555, 473229, 478717, 485926, 495338, 506523, 518624, 530902, 542613, 552807, 560697, 566031, 568815, 568964, 566637, 562642, 558009, 553222, 548322, 543648, 539916, 537423, 535626, 533769, 531648, 529587, 527906, 526657, 525777, 525290, 525280, 525722, 526421, 527249, 528483, 530721, 534281, 538850, 544021, 550089, 558041, 568738, 582366, 598725, 617793, 639909, 665541, 694955, 727953, 763844, 801644, 840209, 877981, 912772, 942171, 964350, 978254, 982977, 977331, 960576, 933643, 899323, 860963, 820994, 780721, 741233, 703958, 670055, 639670, 612244, 587486, 565609, 546673, 530235, 515877, 503585, 493280, 484403, 476422, 469425, 463723, 458952, 454148, 448715, 442934, 437459, 432740, 428948, 426056, 423735, 421426]
60449D21426k651k858k683k258j815j514j465j667j835j519n47O28J122M68p19
60434D02113j162l41P54P69k58r47m06O27Q63Q1q04r86n01J59O78J074J466J826
60416D05005K000J963J914J936J727J018J29l81n59r26j451j336j67J392K420
60401D14684K706K468J722N81k85k70L00O34O30R09J787K809L463L703L699L459
60385D42999K941K260J613J158J009J145J379J554J767K144K468K299J501N37
60371D66774Q6M50J219J621J337R14J083J776K233K071J731J688J926K404L271
60356D90584M165M108K883J926K792N136P226Q273R142J0687J2424J3287J2834
60343E85467J1285Q977O336L854J619q74l964p147r457j0394j0226r545q790q115
$$ y = [421426, 418775, 415917, 413234, 410976, 409161, 407647, 406182, 404515, 402680, 401161, 400614, 401242, 402364, 402832, 402113, 400951, 400610, 401364, 402133, 401875, 400928, 400522, 401149, 402012, 402093, 401289, 400303, 399802, 399961, 400639, 401713, 403179, 405005, 407005, 408968, 410882, 412818, 414545, 415563, 415692, 415311, 414752, 413826, 412375, 411039, 410872, 412264, 414684, 417390, 419858, 421580, 422161, 421876, 421606, 421906, 422540, 423170, 424079, 425866, 428675, 432138, 435841, 439540, 442999, 445940, 448200, 449813, 450971, 451980, 453125, 454504, 456058, 457825, 459969, 462437, 464736, 466237, 466774, 466860, 467310, 468529, 470150, 471487, 472401, 473484, 475260, 477493, 479564, 481295, 482983, 484909, 487313, 490584, 494749, 498857, 501740, 503666, 506458, 511594, 518820, 527093, 536235, 546922, 559346, 572633, 585467, 596752, 605729, 612065, 615919, 617538, 616664, 612700, 605553, 596096, 585702, 575476, 565931, 557141, 549026]
60329E49026p482o815o097n343m550l789l219k908k701k433k134j868j551j173
60315D96963r34q95o83R2J340K664L787M522M665M483M930O710R410J2246J5288
60300E64588J8952K2437K3897K2476J9202J5334J0847N072j879r029j5283j9632
60288F56982k1249k0240j7899j5484j3043j0116p179n420n134n325n096m655m618
60275E21524m925n043m807m519m323m016l561l381l832m608n035m893m615m484
60261D59482m081k915j358l45k10l37o9N66J249J799J984J380N7j044j028j73
60245D54957M71N05N28J018J565J522R30L33l7m35r68j255r01j23M00L08L7L65
60227D59220J549L087M291M824M669L851K591J497J272K055L336M527N439O099
$$ y = [549026, 541544, 534729, 528632, 523289, 518739, 514950, 511731, 508823, 506122, 503689, 501555, 499687, 498136, 496963, 496029, 495134, 494451, 494543, 495883, 498547, 502334, 506856, 511521, 516004, 520934, 527644, 537054, 549300, 564588, 583540, 605977, 629874, 652350, 671552, 686886, 697733, 702805, 700926, 691897, 676614, 656982, 635733, 615493, 597594, 582110, 569067, 558951, 551772, 546352, 541218, 535893, 530797, 526142, 521524, 516599, 511556, 506749, 502230, 497907, 493891, 490330, 486949, 483117, 478509, 473474, 468581, 463966, 459482, 455401, 452486, 451128, 450783, 450573, 450236, 450167, 450733, 451982, 453781, 455765, 457145, 457202, 456158, 455130, 454957, 455428, 455933, 456461, 457479, 459044, 460566, 461496, 461829, 461792, 461357, 460389, 459134, 458233, 458110, 458510, 458818, 458855, 459220, 460769, 463856, 468147, 472971, 477640, 481491, 484082, 485579, 486851, 488906, 492242, 496769, 502208, 508307]
60213E08307O458O556O736P314Q086Q481Q304P956P791P624P135O478O120O139
60199F09485O147N822N234M539L770K923J981Q59m29j507k075k523l560n151o436
60184F19079o974p320p958q361p865o866o308o292o107n495m955m759m482l724
60170E31613k672j697r37m38k84l92n64q29j369k027k307j937j098r2P63J073
60154E16806P27L08N18J163J375R26O05J064K021K896L578M172M546M610M651
60139E49966N003N666O500P394Q062Q121P633P105O764O358N784N280M666L261
60125F37563J052p50j044j77P19J182J463J620J495J356J669K240K340J764J093
60110F53585Q31P92M91k87j393k525l424m109m913o009p044p468p163o456n684
$$ y = [508307, 514765, 521321, 528057, 535371, 543457, 551938, 560242, 568198, 575989, 583613, 590748, 597226, 603346, 609485, 615632, 621454, 626688, 631227, 634997, 637920, 639901, 640760, 640331, 638824, 636749, 634226, 630666, 625515, 619079, 612105, 604785, 596827, 588466, 580601, 573735, 567427, 561135, 555028, 549533, 544578, 539819, 535337, 531613, 528941, 527244, 526307, 525869, 525585, 525193, 524629, 523800, 522431, 520404, 518097, 516160, 515062, 514970, 515733, 516806, 517533, 517841, 518359, 519522, 520897, 521823, 522428, 523492, 525513, 528409, 531987, 536159, 540705, 545315, 549966, 554969, 560635, 567135, 574529, 582591, 590712, 598345, 605450, 612214, 618572, 624356, 629636, 634302, 637563, 638615, 637865, 636821, 636644, 637363, 638545, 640008, 641628, 643123, 644479, 646148, 648388, 650728, 652492, 653585, 654416, 655208, 655699, 655412, 654019, 651494, 648070, 643961, 639048, 633039, 625995, 618527, 611364, 604908, 599224]
60095E99224n018m577m269l644k315n18J017J827K070K179K352K441K226J816
60081E94811J704K241L094L527L224K419J280l19k214l786m664n133n545n891
60067E84748o196o702p224p050o000m947m635m673m404m057m108m148l463k356
60053E14785j758j777j706j222n42N11K285M183N062M945N135O246P303P325O754
60038E57529O543O678O457N623M468L113J475k98j882l181m299n281o161p102
60024E63682q193r253j0050j0525j0684j0460r849r001q111p358o880o509n677
60011D51132l985j861k07O11R41J017O52j32p41o70j13L87N58M42J92N4K31N73
59993D49081P17O73R66J926L239M331M977N335N608N862N916N459M404L049J647
$$ y = [599224, 594206, 589629, 585360, 581716, 579401, 578883, 579900, 581727, 583797, 585976, 588328, 590769, 592995, 594811, 596515, 598756, 601850, 605377, 608601, 611020, 612300, 611981, 609767, 605981, 601317, 596184, 590639, 584748, 578552, 571850, 564626, 557576, 551576, 546629, 541994, 537321, 532917, 528860, 524752, 520604, 517141, 514785, 513027, 511250, 509544, 508322, 507780, 508291, 510576, 514759, 519821, 524766, 529901, 536147, 543450, 550775, 557529, 564072, 570750, 577207, 582830, 587298, 590411, 591886, 591588, 589706, 586525, 582226, 576945, 570784, 563682, 555489, 546236, 536186, 525661, 514977, 504517, 494668, 485667, 477556, 470198, 463318, 456809, 451132, 447147, 445286, 445079, 445690, 446631, 447648, 448300, 448168, 447427, 446757, 446644, 447031, 447589, 448031, 448223, 448277, 448508, 449081, 449798, 450471, 451437, 453363, 456602, 460933, 465910, 471245, 476853, 482715, 488631, 494090, 498494, 501543, 503190]
59978E03190P1j704l111l673l846m373m932m496l070j964k000k522k665k528k421
59963D59956j910n75R62J747J839K076K795L537L817L534K752J755J137J321K046
59948D86789K693K950K821K364J769J382J166N84n68j677k216k610l473m483m887
59933D82604m750m756m906m472l325k299j937j721r56J77R51J074R13R75J468
59918D59040K227K940L502M111M929N744O208O313O336O450O681P091P543P451
59904E36566O246M080J673m30k006k728k388j573j367j995k412j630l5J248J884
59889E35133K561L739M851M994M059K821K030J808J922K285K912L566L856L735
59875E80272L521L352K928J956N59r85k562m060n194n811o127o346o281n750n067
$$ y = [503190, 503261, 501557, 498446, 494773, 490927, 486554, 481622, 477126, 474056, 472092, 470092, 467570, 464905, 462377, 459956, 458046, 457471, 458433, 460180, 462019, 464095, 466890, 470427, 474244, 477778, 480530, 482285, 483422, 484743, 486789, 489482, 492432, 495253, 497617, 499386, 500768, 501934, 502518, 501950, 500273, 498057, 495447, 491974, 487491, 482604, 477854, 473098, 468192, 463720, 460395, 458096, 456159, 454438, 453482, 453659, 454610, 455684, 456597, 457572, 459040, 461267, 464207, 467709, 471820, 476749, 482493, 488701, 495014, 501350, 507800, 514481, 521572, 529115, 536566, 542812, 546892, 548565, 548135, 546129, 543401, 541013, 539440, 538073, 536078, 533666, 532036, 532001, 533249, 535133, 537694, 541433, 546284, 551278, 555337, 558158, 560188, 561996, 563918, 566203, 569115, 572681, 576537, 580272, 583793, 587145, 590073, 592029, 592588, 591603, 589041, 584981, 579787, 573976, 567849, 561503, 555222, 549472, 544405]
59860E44405m685m466l868k746j499m64L66J059J619K290L465N162O935Q467R859
59845E65899J1138J1785J1015Q501M725P75k143l289k741j130Q76K719L664K909
59831F14703L01l147n857o891o548n782n225m923m876n276o071o676o659o473
59817E40600o815p329o743m627k132n59J36P02J190J073M82J98M74P02M40K3j14
59800E17701j23m89j471k873m170m734m399l645k955k175j105m24j057k647l579
59785D81855k937j577q38q87r95q43p50r01j005p91l70m5L3J3J99O76J095J128
59767D73060J048J412K137K447J926J091O34O34Q63J302J887K222K189K346L198
59752D98396M285M763M582M403M504M501M191L858L611L142K388J878K003K388
$$ y = [544405, 539720, 535254, 531386, 528640, 527141, 526677, 527043, 528102, 529721, 532011, 535476, 540638, 547573, 556040, 565899, 577037, 588822, 599837, 608338, 613063, 613838, 611695, 608406, 605665, 604535, 605411, 608130, 611794, 614703, 615004, 611857, 606000, 599109, 592561, 586779, 581554, 576631, 571755, 566479, 560408, 553732, 547073, 540600, 533785, 526456, 519713, 515086, 512954, 512395, 512531, 513233, 514423, 515496, 515978, 516176, 516650, 517352, 517792, 517815, 517701, 517578, 517089, 515618, 512745, 508575, 503841, 499442, 495797, 492842, 490667, 489562, 489138, 488081, 485434, 481855, 478918, 477341, 476503, 475616, 474621, 473778, 473028, 472127, 471122, 470331, 469961, 469916, 469949, 469962, 470161, 470837, 471932, 473060, 474108, 475520, 477657, 480104, 482030, 483121, 483755, 484389, 485252, 486554, 488441, 490663, 492852, 495198, 498396, 502681, 507444, 512026, 516429, 520933, 525434, 529625, 533483, 537094, 540236, 542624, 544502, 546505, 548893]
59738E48893K409J989J456R14K26m93q51p29m64l34j40N11J580K480K620J996
59722E62063J178P74Q73J035P65L0p24j030q27l99OL43O25Q41J077J497K041K332
59704E72500K119J692J534J640J551J105P79J070J872K693L274L747M250M662
59690F04488M647L819J990m53k528l292k619j260r8M98O20M02j65j071k152l152
59674E99674l900m382m689m842m799m577m360m303m270l881k961j854j144j033
59660E48679j166j090p48l81o3M80J511K882M042M458M074L384K958K791K361
59645E74172J410M04j19m71j535l532n515o320n676m226k816j965j743j792j621
59630E38655j109n66k62j98m91j502l205m736n094m099k392p46K59K60n90j500
$$ y = [548893, 551302, 553291, 554747, 555661, 555887, 555394, 554543, 553814, 553350, 553016, 552876, 553387, 554967, 557447, 560067, 562063, 563241, 564015, 564888, 565923, 566688, 566718, 565994, 564964, 564137, 563738, 563744, 564087, 564712, 565553, 566630, 568127, 570168, 572500, 574619, 576311, 577845, 579485, 581036, 582141, 582920, 583990, 585862, 588555, 591829, 595576, 599826, 604488, 609135, 612954, 614944, 614491, 611963, 608671, 606052, 604792, 604694, 605192, 605812, 606214, 606049, 604978, 602826, 599674, 595774, 591392, 586703, 581861, 577062, 572485, 568125, 563822, 559552, 555671, 552710, 550856, 549712, 548679, 547513, 546423, 545675, 545294, 545231, 545711, 547222, 550104, 554146, 558604, 562678, 566062, 569020, 571811, 574172, 575582, 575986, 575867, 575396, 573861, 570329, 564814, 558494, 552818, 548592, 545776, 543811, 542068, 540276, 538655, 537546, 536980, 536718, 536520, 536029, 534527, 531322, 526586, 521492, 517393, 515001, 514255, 514514, 514774, 514184, 512684]
59614E12684j803j747k022k549k415j118O46J776J967J783J799J940J702Q78p3
59599E13448n37n61p84j467k020j807j009k22L25O64N76qm05R9J016J086R5p22
59581E07767m30K82J25j081k358k906k888k961l455l975l828k890j941j736j934
59566D75791j543m71K61O8k37L11J324J583P07m81j089r74m21L12R95J419J662
59549D79217J987K346K277J610J008J369K676L929M497N088O778R394J1874J4290
59535E48340J8147K3588K7344K5112J6193M576m685r232r563p179l557q9K350
59522F31345L754M517M764M452L734K702J127j092l504n546p170q723j0331j1732
59508F08297j2492j2321j1402j0442r947r492q297o549n333n076m878l923k600
$$ y = [512684, 510881, 509134, 507112, 504563, 502148, 501030, 501676, 503452, 505419, 507202, 509001, 510941, 512643, 513521, 513448, 512911, 512350, 511566, 510099, 508079, 506272, 505263, 505041, 505366, 506030, 506606, 506598, 506193, 506292, 507308, 508394, 508489, 507767, 507337, 507619, 507744, 506663, 504305, 501399, 498511, 495550, 492095, 488120, 484292, 481402, 479461, 477725, 475791, 474248, 473777, 474038, 474106, 473869, 474180, 475504, 477087, 477794, 477313, 476224, 475250, 474829, 475141, 476136, 477555, 479217, 481204, 483550, 485827, 487437, 488445, 489814, 492490, 496419, 500916, 506004, 512782, 522176, 534050, 548340, 566487, 590075, 617419, 642531, 658724, 663300, 658615, 649383, 639820, 632641, 629084, 628995, 631345, 635099, 639616, 644380, 648832, 652566, 655268, 656395, 655303, 651799, 646253, 639083, 630360, 620029, 608297, 595805, 583484, 572082, 561640, 551693, 542201, 533904, 527355, 522022, 516946, 512068, 508145, 505545]
59495E05545j680j105m21K80O67R10J283J475J115O45P64J350J790K149K967M094
59479E21828M695M575M620N644P402R027R964J0199R885R002P330M903K421Q74
59465F12369M48K94k33p18n49kL92J084K934N659P892Q909R292R701R980R868
59449F77320R722R958J0301J0133R207P653N470K412j647o418j1137j4787j6523
59436F91664j6066j3789j0652p971o743o878p370p439p137o631n648m005k098
59423E89237j54K333N675R070J1486J3048J4500J5851J6602J6927J7567J8887
59411G31029K1165K5001K9573L0857K4155R339p982k1305k7945k8711k5313j9501
59399G40362j3025o267K018J1643J8326J6519N328r883k2210k8419k9454k7609
$$ y = [505545, 503865, 502760, 502339, 502619, 503286, 504196, 505479, 506954, 508069, 508714, 509478, 510828, 512618, 514767, 517734, 521828, 526523, 531098, 535718, 541362, 548764, 557791, 567755, 577954, 587839, 596841, 604171, 609074, 611495, 612369, 612817, 613111, 612878, 612160, 611611, 611609, 612001, 613085, 616019, 621678, 629570, 638479, 647771, 657472, 667452, 677320, 687042, 697000, 707301, 717434, 726641, 734294, 739764, 742176, 740529, 734111, 722974, 708187, 691664, 675598, 661809, 651157, 643186, 636443, 629565, 622195, 614756, 607619, 600988, 595340, 591335, 589237, 589083, 591416, 597091, 606161, 617647, 630695, 645195, 661046, 677648, 694575, 712142, 731029, 752194, 777195, 806768, 837625, 861780, 871119, 863137, 841832, 813887, 785176, 759863, 740362, 727337, 721070, 723088, 734731, 753057, 769576, 774904, 765021, 742811, 714392, 684938, 657329]
59387F57329k4438k0700j6903j3501j0818q912p447n899l974j888k07N88N23K60
59373E44013O31J826L194L939L923L705L978N001O364P215O989O090N519N740
59359F08127O297O706P157Q052R266J0355J1268J2322J3675J5181J6679J8052
59347G43137J9139J9840K0207K0211J9668J8568J7217J5744J3716J0663O760K677
59335I27547j144m718q189j1592j4780j7398j9085j9902k0315k0526k0141j8899
59323G50858j7312j6058j5012j3531j1539r679q363p333o290n386m852m503l978
59310F27022l142k051p46O63J882K720L404M426O062Q202J0618J3270J6146J8755
59296G07231J9770J7577J1507K724o215j2887j6313j7022j6164j4661j2942j1174
$$ y = [657329, 632891, 612191, 595288, 581787, 570969, 562057, 554610, 548711, 544737, 542849, 542642, 543230, 543753, 544013, 544644, 546470, 549664, 553603, 557526, 561231, 565209, 570210, 576574, 583789, 590778, 596868, 602387, 608127, 614424, 621130, 628287, 636339, 645605, 655960, 667228, 679550, 693225, 708406, 725085, 743137, 762276, 782116, 802323, 822534, 842202, 860770, 877987, 893731, 907447, 918110, 924870, 927547, 926403, 921685, 913496, 901904, 887124, 869726, 850641, 830739, 810424, 789898, 769757, 750858, 733546, 717488, 702476, 688945, 677406, 667727, 659364, 652031, 645741, 640355, 635503, 631000, 627022, 623880, 621829, 621083, 621746, 623628, 626348, 629752, 634178, 640240, 648442, 659060, 672330, 688476, 707231, 727001, 744578, 756085, 758809, 752594, 739707, 723394, 706372, 690208, 675547, 662605, 651431]
59284F51431r440p778o199m758l500k282q00J024K838M233N346O801Q980J1511
59270F57407J3556J4540J4557J4103J3450J2332J0338P606M794K234n92m286q490
59257G51549j1964j3756j3936j3279j2574j2225j2100j1641j0389q536o734n371
59245F19044m281l174j996q11M16J773L332N064O688P780Q239Q453Q652Q363P004
59230F74546M778K391Q5k319m631o330p431q508r628j0137r707q876q185p469
59216E98579o428n180l890k465j030r8K21N50J385K378L035L496M121M782N062
59201F04518M742L636J600p97k194j780l08R01J407J547J432J005O83R45J430
59186F18767J318O11K05N67J150J259R85R25J355J897J970J524J302K071L550
$$ y = [651431, 641991, 634213, 628014, 623256, 619756, 617474, 616674, 617698, 620536, 624769, 630115, 636916, 645896, 657407, 670963, 685503, 700060, 714163, 727613, 739945, 750283, 757889, 762683, 764917, 764325, 760039, 751549, 739585, 725829, 711893, 698614, 686040, 673815, 661715, 650074, 639685, 631149, 624415, 619044, 614763, 611589, 609593, 608782, 609198, 610971, 614303, 619367, 626055, 633835, 642074, 650527, 659179, 667542, 674546, 679324, 681715, 681800, 679481, 674850, 668520, 661089, 652581, 642953, 632816, 623109, 614233, 606048, 598579, 592151, 586971, 583081, 580616, 579586, 579488, 579709, 580259, 581644, 584022, 587057, 590553, 594674, 599456, 604518, 609260, 612896, 614496, 613699, 611505, 609725, 609417, 610318, 611725, 613272, 614704, 615709, 616392, 617337, 618767, 620085, 620696, 620901, 621468, 622618, 623877, 624862, 625787, 627142, 629039, 631009, 632533, 633835, 635906, 639456]
59171F39456M613M750M748N519O892Q116Q974R648R964R607Q795P951O906N254
59157G41193L223J380m14k831n902q685j0262j0506r879r065q656q654q396p472
59143F55074o424n882n522m798m263m867o108o353n197m139m358n066m824l556
59129E83717k250j402o52L80J627K823L678M003M045M447N571P066Q364R252R797
59114F40466J0151J0616J1472J2404J2630J1918J0982J0423R858Q648P021N812
59102G62401N290M941M267L170J638k92k117l043k864k327k304k825l212k985
59088G59738k362j858j666j617j600j828k654m203o277q406j0031j0797j0775
59075F95664j0352r842r402r222r353r326q395o563m854m174m260m216l772l387
$$ y = [639456, 644069, 648819, 653567, 659086, 665978, 674094, 683068, 692716, 702680, 712287, 721082, 729033, 735939, 741193, 744416, 745796, 745382, 742551, 736649, 727964, 717702, 707196, 697317, 688252, 679596, 670942, 662546, 655074, 648650, 642768, 637246, 632448, 628185, 623318, 617210, 610857, 605660, 601521, 597163, 592097, 587273, 583717, 581467, 580065, 579413, 579793, 581420, 584243, 587921, 591924, 595969, 600416, 605987, 613053, 621417, 630669, 640466, 650617, 661233, 672705, 685109, 697739, 709657, 720639, 731062, 740920, 749568, 756589, 762401, 767691, 772632, 776899, 780069, 781707, 781415, 779298, 776255, 773391, 771064, 768760, 765935, 762723, 759738, 757376, 755518, 753852, 752235, 750635, 748807, 746153, 741950, 735673, 727267, 717236, 706439, 695664, 685312, 675470, 666068, 656846, 647493, 638167, 629772, 623209, 618355, 614181, 609921, 605705, 601933, 598546]
59061E98546l314l313l192l018k767k302j802j665j910k094j933j554j146q05
59047E67731o77q38r84p55l42k91p02j131j324j369j174m47N91J191J028O41O58
59030E61806J146J973L185M680O057P145Q328R969J1853J3495J4609J5099J4941
59017F74286J4325J3434J1992R531O321L349J096r85l284n098n494m610l272j802
59003G09789M1K172M102N648O981P983Q212P632O793O023M959L185J052n76j313
58988G72683j698k547m022n630p000q277r469r884q833o736m778l450k146l45
58974F97868J578L108M451N985P443Q383R135J0481J2456J4099J4505J3739J2661
58961H15892J2080J2057J1745J0109O973L203l01l496o731r869j2435j4372j6012
$$ y = [598546, 595232, 591919, 588727, 585709, 582942, 580640, 578838, 577173, 575263, 573169, 571236, 569682, 568536, 567731, 567054, 566216, 565232, 564477, 564135, 563844, 563142, 562011, 560687, 559318, 558144, 557697, 558288, 559479, 560507, 561148, 561806, 562952, 564925, 568110, 572790, 578847, 585992, 594320, 604289, 616142, 629637, 644246, 659345, 674286, 688611, 702045, 714037, 723568, 729889, 733238, 734334, 733349, 730065, 724967, 719473, 714863, 711591, 709789, 709830, 712002, 716104, 721752, 728733, 736716, 744928, 752560, 759353, 765376, 770335, 773520, 774572, 773996, 772683, 770985, 768438, 764416, 758786, 751786, 743509, 734040, 724156, 715323, 708587, 703809, 700359, 698213, 697868, 699446, 702554, 707005, 712990, 720433, 728816, 737951, 748432, 760888, 774987, 789492, 803231, 815892, 827972, 840029, 851774, 861883, 868856, 872059, 871758, 868262, 861531, 851662, 839227, 824855, 808843]
58948H08843j7377j8130j8204j7842j6979j5246j2839j0672r263p961n878l347
58936F55105j673j490k009k218k267l042m619n855n735m564l486l175l405l644
58922F07923l542k955k006j118o44m68l17k90o07q83m00R01K237L046L612M383
58906F08872N259N941O506P263Q386J0056J2436J5171J7247J7872J7256J6173
58894G48438J5100J4181J3616J3529J3700J4007J4955J7136K0195K2821K3864
58883I31542K3171K1303J8751J5537J1418O495J543k537n806r306j3697j8163
58871I80251k1217k2267k1871k0672j8871j6729j4808j3369j2017j0360q732p885
58859G91453q111q929r667j0107j0521j1106j1603j1584j1053j0450j0007r386
$$ y = [808843, 791466, 773336, 755132, 737290, 720311, 705065, 692226, 681554, 672291, 664330, 658452, 655105, 653432, 651942, 649933, 647715, 645448, 642406, 637787, 631932, 626197, 621633, 618147, 614972, 611567, 607923, 604381, 601426, 599420, 598302, 597658, 597190, 596873, 596583, 595976, 595093, 594693, 595594, 597831, 600877, 604489, 608872, 614131, 620072, 626578, 633841, 642227, 652283, 664719, 679890, 697137, 715009, 732265, 748438, 763538, 777719, 791335, 804864, 818564, 832571, 847526, 864662, 884857, 907678, 931542, 954713, 976016, 994767, 1010304, 1021722, 1028217, 1029760, 1027223, 1021417, 1012111, 998414, 980251, 959034, 936767, 914896, 894224, 875353, 858624, 843816, 830447, 818430, 808070, 799338, 791453, 783342, 774413, 764746, 754639, 744118, 733012, 721409, 709825, 698772, 688322, 678315, 668929]
58847F68929q218o777n806n723o292p030p602p852p706p253o742o350n972n386
58833E74220m634m079l977m051l739k868j873j180o57MO25P74N78P81J795L151
58817E54870M049M226M005L835L909M073L927L191K092J209Q53P59M60k25j044
58802E90189j478j179n06m10j351k547k893k487k473l373m407m696m287l582k569
58787E51951j193J34J019J643K316K898L183L397L756L958L741L507L715L923
58773E87948L183J323q48k554l736m722n664o427o750o540o114n937n926n408
58759E31828m086k591j651j062j14J250K366K811K800K658K542K654L190L940
58745E46535M402M397M310M578N299O299P287P868P793P323P112P531Q270Q701
$$ y = [668929, 660711, 653934, 648128, 642405, 636113, 629083, 621481, 613629, 605923, 598670, 591928, 585578, 579606, 574220, 569586, 565507, 561530, 557479, 553740, 550872, 548999, 547819, 547162, 547166, 547791, 548565, 549143, 549924, 551719, 554870, 558919, 563145, 567150, 570985, 574894, 578967, 582894, 586085, 588177, 589386, 590239, 590998, 591458, 591233, 590189, 588711, 587532, 587026, 586616, 585265, 582718, 579825, 577338, 574865, 571492, 567085, 562389, 558102, 554520, 551951, 550758, 550892, 551911, 553554, 555870, 558768, 561951, 565348, 569104, 573062, 576803, 580310, 584025, 587948, 591131, 592454, 591606, 589052, 585316, 580594, 574930, 568503, 561753, 555213, 549099, 543162, 537236, 531828, 527742, 525151, 523500, 522438, 522324, 523574, 525940, 528751, 531551, 534209, 536751, 539405, 542595, 546535, 550937, 555334, 559644, 564222, 569521, 575820, 583107, 590975, 598768, 606091, 613203, 620734, 629004, 637705]
58731F37705Q537Q043P629P303O659N464M114L247K973K826K439J901J434J115
58717G01389J110J703K910M321N523O387O874O875O362N346L707J434r96l007
58703G49938m768o985r869j2884j5597j7916j9503j9884j9417j9106j9012j7920
58691E67077j5160j1797r290p847o873o143n636n016m311m319n369o358o122n012
58677D67824m049l181j782k64L43J69L79J290K120K655L766N871Q171R871J1188
58662E04371J2525J3447J3033J0826P211L257K40j307k162l494n367o802p221
58649E38557p024o696o168n349m549m018l649l348l281l437l385k626j051J053
58635D85029L159M729N533N683N202L917K016K68p64j300j663j622j023l90j22
$$ y = [637705, 646242, 654285, 661914, 669217, 675876, 681340, 685454, 688701, 691674, 694500, 696939, 698840, 700274, 701389, 702499, 704202, 707112, 711433, 716956, 723343, 730217, 737092, 743454, 748800, 752507, 753941, 752945, 749938, 745170, 738185, 728316, 715432, 699835, 681919, 662416, 642532, 623115, 604009, 584997, 567077, 551917, 540120, 530830, 522983, 516110, 509967, 504331, 499315, 495004, 490685, 485316, 478958, 472836, 467824, 463775, 460594, 458812, 458548, 458891, 459060, 459439, 460729, 462849, 465504, 469270, 475141, 483312, 493183, 504371, 516896, 530343, 543376, 554202, 561413, 564670, 564910, 563603, 561441, 557947, 552580, 545778, 538557, 531533, 524837, 518669, 513320, 508771, 504753, 501104, 497756, 494475, 491038, 487653, 485027, 483976, 485029, 488188, 492917, 498450, 504133, 509335, 513252, 515268, 515536, 514772, 513472, 511809, 510187, 509164, 508774, 508652]
58620E08652M14J958M061N696O750P801Q760R067Q932Q998Q857P342M535K077
58606E93900J048P01j61j564k693l047k749k291k270k892l583l662l333l247l211
58591E60946k351n98J069K181L452N540Q065J0280J1905J2859J2990J2533J2091
58578F50962J1758J0934R344P604O378N655N213N122N446O097P274R459J2632
58565G53878J6144J9511K2781K5866K8301K9947L1190L2072L1771K9354K4566
58554A045381J7792R990K720k560n698p677r125r644q914p519o318n745o134q071
58540I98478j1795j6699k1751k5992k8587k9068k7877k6048k4120k1887j9288
58529G45366j6756j4487j2121r505o998m762k525l43J149J660J710J747J559R49
$$ y = [508652, 509066, 511024, 515085, 520781, 527531, 535332, 544092, 553159, 562091, 571089, 579946, 587288, 591823, 593900, 594948, 595649, 595488, 593924, 591231, 588184, 585435, 583144, 580874, 577982, 574399, 570737, 567404, 564157, 560946, 558595, 557997, 559066, 561247, 564699, 570239, 578304, 588584, 600489, 613348, 626338, 638871, 650962, 662720, 673654, 682998, 690602, 696980, 702635, 707848, 712970, 718416, 724513, 731787, 741246, 753878, 770022, 789533, 812314, 838180, 866481, 896428, 927618, 959690, 991461, 1020815, 1045381, 1063173, 1073163, 1075883, 1073323, 1067625, 1059948, 1050823, 1041179, 1032265, 1024746, 1018428, 1012683, 1006549, 998478, 986683, 969984, 948233, 922241, 893654, 864586, 836709, 810661, 786541, 764654, 745366, 728610, 714123, 702002, 692497, 685499, 680737, 678212, 677869, 679018, 680678, 682388, 684135, 685694, 686643]
58515F86643L29O6j50p73j657k294k470k344k217k373k857l253l109k613k386
58500F58542k598k801k657k298k009k011k479l186l292k137j75J567K711L604
58486F40781M521N606P273R636J1858J3095J3848J5293J7478J9343K0290K0496
58474G99518J9786J7549J3737Q867L224k707p446r766j0481j1328j2310j1973
58462G96670j0225q568p334m964p32L791O962R000J0835J2593J4057J5188J5355
58449H52628J3465R499M608o62o620j2441j6006j6588j5913j5541j4947j3209
58437G68273j0834q709o707m540k617j027R09L248N029O096P690J0285J2673J4129
58423G93898J5563J7356J7993J6314J3261R891N616R6m957p855r279j0719j1964
$$ y = [686643, 686972, 687038, 686888, 686115, 684458, 682164, 679694, 677350, 675133, 672760, 669903, 666650, 663541, 660928, 658542, 655944, 653143, 650486, 648188, 646179, 644168, 641689, 638503, 635211, 633074, 632899, 634466, 637177, 640781, 645302, 650908, 658181, 667817, 679675, 692770, 706618, 721911, 739389, 758732, 779022, 799518, 819304, 836853, 850590, 859457, 862681, 859974, 852528, 842762, 832281, 820953, 808643, 796670, 786445, 777877, 770543, 765579, 764847, 768638, 775600, 784600, 795435, 808028, 822085, 837273, 852628, 866093, 875592, 880200, 879538, 872918, 860477, 844471, 827883, 811970, 796429, 781482, 768273, 757439, 748730, 742023, 737483, 734866, 733839, 734748, 737996, 743025, 749121, 756811, 767096, 779769, 793898, 809461, 826817, 844810, 861124, 874385, 884276, 889892, 889988, 885031, 877176, 867897, 857178, 845214]
58410H45214j2110j1615j1390j1088j0176r553j0019j0360q997o626n084m430
58398G33766l224j072J107K899M668O307P295P583P262N895L481J314N55P35Q22
58383G79393Q72J260J307K42j283k088k139k032j671p25L96J278K276L572M513
58368G85171M977O011P928R337R456R767J1730J4320J5702J5953J6267J6638J6166
58355I39423J4590J1960P989L299j71j524k183l267l606k119j28Q82J856M086
58341I71087O484P559Q298J0229J2329J2847J2768J4301J7048J8817J9177J9273
58329A130217J8943J7178J4594J2582J0665P458L522N25j543l546m591l267o69
58316A202068Q36J165J961L312M063M609O310Q677J0213J1353J3603J6270J7200
$$ y = [845214, 833104, 821489, 810099, 799011, 788835, 779282, 769263, 758903, 749906, 743280, 738196, 733766, 730542, 729470, 730577, 733476, 738144, 744451, 751746, 759329, 766591, 772486, 775967, 777281, 777836, 778571, 779393, 780265, 781525, 782832, 783074, 781791, 779703, 777564, 775532, 773861, 773136, 773532, 774810, 777086, 780658, 785171, 790148, 796159, 804087, 813424, 822880, 832647, 844377, 858697, 874399, 890352, 906619, 923257, 939423, 954013, 965973, 973962, 977261, 977090, 975566, 973383, 970116, 966510, 964391, 964263, 965145, 967001, 971087, 977571, 985130, 993428, 1003657, 1015986, 1028833, 1041601, 1055902, 1072950, 1091767, 1110944, 1130217, 1149160, 1166338, 1180932, 1193514, 1204179, 1211637, 1215159, 1215684, 1214141, 1210595, 1206004, 1202737, 1202068, 1202904, 1204069, 1206030, 1209342, 1213405, 1218014, 1224324, 1233001, 1243214, 1254567, 1268170, 1284440, 1301640]
58303A301640J6301J5409J5190J5000J5106J6028J6453J4874J2624J2177J3229
58292A464031J3624J3304J4004J5718J6967J7948J9970K2352K3240K3068K3872
58281A668098K5783K7411K8967L1602L4488L6009L7029L9441M2430M3727M3603
58270B058588M3949M4568M4212M3977M5673M8066M9002M9756N2869N7130N9493
58259B597283O0500O2708O5093O4517O1641N9913N9707N8968N8615O1338O5901
58248C276184O8676P0153P3992Q0283Q5917R0810R7445J05049J10777J15847J23772
58237D298905J33336J40488J46228J55116J66748J76691J85191J96790K11693
58228E811186K26028K40349K59074K81740L03735L25523L51919L82504M12559
$$ y = [1301640, 1317941, 1333350, 1348540, 1363540, 1378646, 1394674, 1411127, 1426001, 1438625, 1450802, 1464031, 1477655, 1490959, 1504963, 1520681, 1537648, 1555596, 1575566, 1597918, 1621158, 1644226, 1668098, 1693881, 1721292, 1750259, 1781861, 1816349, 1852358, 1889387, 1928828, 1971258, 2014985, 2058588, 2102537, 2147105, 2191317, 2235294, 2280967, 2329033, 2378035, 2427791, 2480660, 2537790, 2597283, 2657783, 2720491, 2785584, 2850101, 2911742, 2971655, 3031362, 3090330, 3148945, 3210283, 3276184, 3344860, 3415013, 3489005, 3569288, 3655205, 3746015, 3843460, 3948509, 4059286, 4175133, 4298905, 4432241, 4572729, 4718957, 4874073, 5040821, 5217512, 5402703, 5599493, 5811186, 6037214, 6277563, 6536637, 6818377, 7122112, 7447635, 7799554, 8182058, 8594617]
58219H594617M43268M80800N25444N72194O21833O80334P47879Q20425R01695
58210A4388489J000996J119757J253780J408140J595407J820268K082102K391994
58202B7060933K770392L230786L787105M477142N355886O463842P823437R466556
58194G0436079J1445652J3830559J6734626K0339626K4830039L0223473L6148291
58187B23988345M1582264M4671088M3047854L4988814K0871781L606443j2717136
58180D00039453k5024261l2474815l5937393l6664782l5513130l3004564k9618222
58173A71802286k5839994k2063112j8552100j5462003j2842203j0656332q843060
58166E7543482p356412o151819n172122m367821l710593l175352k729268k348763
$$ y = [8594617, 9037885, 9518685, 10044129, 10616323, 11238156, 11918490, 12666369, 13486794, 14388489, 15389485, 16509242, 17763022, 19171162, 20766569, 22586837, 24668939, 27060933, 29831325, 33062111, 36849216, 41326358, 46682244, 53146086, 60969523, 70436079, 81881731, 95712290, 112446916, 132786542, 157616581, 187840054, 223988345, 265570609, 310241697, 353289551, 388278365, 409150146, 412756589, 400039453, 375015192, 342540377, 306602984, 269938202, 234425072, 201420508, 171802286, 145962292, 123899180, 105347080, 89885077, 77042874, 66386542, 57543482, 50187070, 44035251, 38863129, 34495308, 30784715, 27609363, 24880095, 22531332]
58158B2531332k028915j766204j547008j359952j203918j076549r68097q72553
58150A1708136p92099p25381o63517o02360n46963m99638m54928m10445l71428
58141F641377l40125l11214k82155k58204k42733k31625k21241k13124k07116
58132D333840j98462j85704j73541j64295j54279j41849j31168j24413j17816
58123B942313j09015j01281r6738r2261q5712p9871p6680p3635o9149o5603o3948
58112B028420o1111n5872n1634n0374m9378m6940m5593m6605m6852m4411m2071
58101A487579m1911m1516l8860l6014l4562l2048k6646k1054j8156j6709j4676
58090A165427j3039j2943j2645j0731r132r844j1665j2932j4380j6669j8141j7755
$$ y = [22531332, 20502417, 18736213, 17189205, 15829253, 14625335, 13548786, 12580689, 11708136, 10916037, 10190656, 9527139, 8924779, 8377816, 7878178, 7423250, 7012805, 6641377, 6301252, 5990038, 5707883, 5449679, 5206946, 4975321, 4754080, 4540956, 4333840, 4135378, 3949674, 3776133, 3611838, 3457559, 3315710, 3184542, 3060129, 2942313, 2833298, 2732017, 2635279, 2543018, 2457306, 2377435, 2300755, 2227120, 2157971, 2092368, 2028420, 1967309, 1911437, 1859803, 1809429, 1760051, 1713111, 1667518, 1620913, 1574061, 1529650, 1487579, 1445668, 1404152, 1365292, 1329278, 1294716, 1262668, 1236022, 1214968, 1196812, 1180103, 1165427, 1152388, 1139445, 1126800, 1116069, 1106937, 1097093, 1085428, 1072496, 1058116, 1041447, 1023306, 1005551]
58078A005551j7329j8366j9447j9145j8591j8790j8378j6460j4840j4982j5436
58067H13787j4597j3374j2920j2283j0590r034q541p935o469n683o745q336r152
58054F88128r984j1368j1761j0145q110p251o868o076n835o812p564o862n714
58041E83778n228m708l675l442m741n944n595m617m294m220m025m780o877q711
58027E12921r244r685j0817j1154r647p828p136o499m776l352l790m985n102m470
58013D14436m219l829k444j055r24j295r25m17q29j317n53P73J095N39K94M05
57997C99735J22m70r35j692l093m268m401m073l973l518k203r91q23j009o09j28
57981C67671l81r17j074j251j771j829j009m37r72j669j515j163j426j703j413
$$ y = [1005551, 988222, 969856, 950409, 931264, 912673, 893883, 875505, 859045, 844205, 829223, 813787, 799190, 785816, 772896, 760613, 750023, 740989, 732448, 724513, 718044, 712361, 705616, 697280, 688128, 678144, 666776, 655015, 644870, 636760, 629509, 622641, 616565, 610730, 603918, 596354, 589492, 583778, 578550, 573842, 570167, 566725, 561984, 556040, 550445, 545828, 541534, 537314, 533289, 528509, 521632, 512921, 503677, 493992, 483175, 472021, 462374, 454546, 447410, 440911, 436135, 432783, 428993, 424008, 418906, 414436, 410217, 406388, 403944, 402889, 401965, 400670, 399745, 399328, 398499, 397182, 396629, 397402, 398497, 399036, 399330, 399735, 399857, 399387, 398452, 396760, 393667, 389399, 384998, 380925, 376952, 373434, 371231, 370240, 369417, 368408, 367799, 367671, 367290, 366373, 365299, 364048, 362277, 360448, 359439, 359002, 358030, 356361, 354846, 353683, 352257, 350554, 349141]
57966C49141j302j708j289O24K220J799M83J41K55p14k205k466j590j096j186
57951C41107q16J2L10M7J44P53J317J953L181M687N795O699P898R093R859J0652
57935D02691J1846J2704J2642J2357J2374J1712R591P110N382L395j29l994o077
57922D91604o739q226j1092j3586j4462j4225j3701j3162j2921j3071j2680j0757
57910C46982p863n426l813k446j339q98o90N0R29R65L00j23k47o59j039m65Q35
57893C25053J578J335J037J589K993M733O055O210N299M439M234L842K481Q64
57879C71742j12j025k773m617n189m751m782n694o593o885o640n789m402l337
57865C09153l234l290k465j188m53L8J121K377K860L026L969N186N203M124L596
$$ y = [349141, 347839, 346131, 344842, 345466, 347686, 349485, 349968, 350109, 350364, 349650, 347445, 344979, 343389, 342293, 341107, 340291, 340303, 340613, 340660, 340804, 341557, 342874, 344827, 348008, 352695, 358490, 365189, 373087, 382180, 392039, 402691, 414537, 427241, 439883, 452240, 464614, 476326, 485917, 493027, 498409, 501804, 501675, 497681, 491604, 484865, 476639, 465547, 451961, 437499, 423274, 409573, 396411, 383490, 370419, 357739, 346982, 339119, 333693, 329880, 327434, 326095, 325197, 324507, 324557, 325486, 326451, 326751, 326628, 326381, 325722, 324683, 324218, 325053, 326631, 327966, 329003, 330592, 333585, 338318, 344373, 350583, 355882, 360321, 364555, 368397, 370878, 371742, 371630, 370605, 367832, 363215, 358026, 353275, 348493, 342799, 336206, 329321, 322681, 316892, 312490, 309153, 305919, 302629, 300164, 298976, 298523, 298561, 299682, 302059, 304919, 307945, 311914, 317100, 322303, 326427, 330023]
57850C30023M232M923M760L893K494N23j379k306k471k869l685m332m721n089
57836C23996m964l963l098l475m160l350j341j26j52J69J548K790L218L781M922
57821C15795N415M463L279L349M368N073N030M660M207L509K207j53l554o870
57807C50778q665q817q426q108p481o443n662n416n102m304l427k802k157j379
57793B72589q97j033j575k254k830k782j736k50P26J137J672K489L128L641M580
57778B76605N861O738P051P379P841P845P189O344N505M381K991J629J4k363m972
57763C40038o485o505o039o010o348o628o594n948m634l371k952k995k524j626
57749B71379j288j584j462m78N26P85M21l26j465k599l065k949k888k815k130
$$ y = [330023, 334255, 339178, 343938, 347831, 350325, 350848, 349469, 347163, 344692, 341823, 338138, 333806, 329085, 323996, 319032, 315069, 311971, 308496, 304336, 300986, 299645, 299519, 299367, 299536, 301084, 303874, 307092, 310873, 315795, 321210, 325673, 328952, 332301, 336669, 341742, 346772, 351432, 355639, 359148, 361355, 361202, 357648, 350778, 342113, 333296, 324870, 316762, 309281, 302838, 297176, 291760, 286658, 282354, 278927, 276125, 273968, 272589, 271692, 270659, 269084, 266830, 264000, 261218, 259482, 259232, 259958, 261095, 262767, 265256, 268384, 272025, 276605, 282466, 289204, 296255, 303634, 311475, 319320, 326509, 332853, 338358, 342739, 345730, 347359, 347373, 345010, 340038, 333553, 327048, 321009, 314999, 308651, 302023, 295429, 289481, 284847, 281476, 278524, 275529, 273005, 271379, 270091, 268507, 267045, 266567, 267093, 267878, 268299, 267973, 266508, 263909, 260844, 257895, 255007, 252192, 250062]
57734B50062j197j182k102k507j578k26M38M56K84q2o11q33n74k49n5K49M83N0
57716B40826r15j443j186r03j142j458j442j397j591j736j714j903k388k716k718
57701B16174k718k663k069j053l33jO33J650K186J818J173P17Q6q76j546j541
57685B11637j283j106p31k4O95J460K738M362N610O676Q827J2518J6673K0507
57671B88559K4858L0916L8650M7527N7813O9867Q1999Q9391Q5482O5698L1701
57660I12461p824m2030o4548p5319p7121p2506o4021n4599m5962l7939l0329k4179
57648C16084k0263j7650j4958j1989r266o998n428n006n309m856l084j423j302
57635B08552k088k100q76P15J846K153J448L6j166j594j600j623j552j452j871
$$ y = [250062, 248865, 247683, 245581, 243074, 241496, 241270, 241708, 242164, 242448, 242366, 241755, 240922, 240348, 240099, 240044, 240293, 240776, 240826, 239911, 238468, 237282, 236379, 235237, 233779, 232337, 230940, 229349, 227613, 225899, 223996, 221608, 218892, 216174, 213456, 210793, 208724, 207671, 207338, 207337, 207970, 209620, 211806, 213624, 214797, 215514, 215600, 214724, 213178, 211637, 210354, 209248, 208517, 208493, 209188, 210648, 213386, 217748, 223358, 230034, 238861, 251379, 268052, 288559, 313417, 344333, 382983, 430510, 488323, 558190, 640189, 729580, 815062, 880760, 912461, 904637, 862607, 798059, 722740, 645619, 573113, 509092, 454493, 408531, 370592, 340263, 316084, 295821, 278171, 263213, 251224, 241958, 234960, 229532, 224526, 219217, 214361, 211277, 209854, 208552, 206464, 204364, 203488, 204203, 206049, 208202, 209650, 209686, 208520, 206926, 205326, 203703, 202151, 200699, 198828]
57620A98828k733l020k340j654j698j827j424j219j937k752k449j330n98n37n96
57605A72714o64r24r39j20J196K089K176J574L79j024j843j906k088k793l010
57590A64817j963p45q07j693j853j184r96j687k170j759j117r92j204j343j492
57575A43812j802k016j859j471j250j496k173k841k965k467j708q65J34R65J000
57560A22998L12k40l48o93j504j823j002J21N69P82J660K859L372L152K888K611
57544A35714J813N89m54j168j685j667p82M15J110J376J635J520M36j002j566
57529A36284j213j014j351j463r42l68j98o0M84J234J783J956J697J089N88O29
57513A39135J010J229J263J418J503J005oq68j235j310j198p00J01P10P72L80
$$ y = [198828, 196095, 193075, 190735, 189081, 187383, 185556, 184132, 182913, 180976, 178224, 175775, 174445, 173847, 173310, 172714, 172050, 171126, 170187, 170067, 171263, 173352, 175528, 177102, 177481, 176457, 174614, 172708, 170620, 167827, 164817, 162854, 162109, 161302, 159609, 157756, 156572, 155576, 153889, 151719, 149960, 148843, 147851, 146647, 145304, 143812, 142010, 139994, 138135, 136664, 135414, 133918, 131745, 128904, 125939, 123472, 121764, 120899, 121033, 121998, 122998, 123310, 123070, 122722, 122029, 120525, 118702, 117700, 117821, 118390, 119172, 120832, 123691, 127063, 130215, 133103, 135714, 137527, 138116, 137662, 136494, 134809, 133142, 132360, 132775, 133885, 135261, 136896, 138416, 138852, 137850, 136284, 135071, 134057, 132706, 131243, 130301, 129933, 129735, 129675, 130159, 131393, 133176, 135132, 136829, 137918, 138506, 139135, 140145, 141374, 142637, 144055, 145558, 146563, 146557, 145689, 144454, 143144, 141946, 141246, 141347, 142057, 142829, 143209]
57497A43209k24q34j269j524j800k145k275k094j957k016j809j040k64j23l37
57482A23498k63Mj15n34n34Q5O42M79l02j038j166p82o65j427k517k669j572l52
57464A10772qj81q8J78J57L4K26N01M24J78N3k66j028j513q81M65J296J054J37
57445A11510r13j649j641r61l88l54k77L01O84J79m46k3J145J762J514J218J226
57428A12887J081O09J75j52o20j088j236j231j281r81r9M66k26j510j892j150
57412A03752l65j54k41m71q15o39N07J567J103m37j195o55j22l71o97n90n33n80
57394I9064L9J199J471L43o56r0J415K409K607K550K340J979K096L093M057L726
57378A27642K201P70K12J82J19M3K13N87Q35P30L98J19r8m87j023j299j134q67
$$ y = [143209, 142985, 142151, 140882, 139358, 137558, 135413, 133138, 131044, 129087, 127071, 125262, 124222, 123958, 123835, 123498, 123235, 123239, 123124, 122590, 122056, 122141, 122783, 123262, 122960, 121922, 120756, 119974, 119309, 117882, 115365, 112696, 111124, 110772, 110764, 110583, 110495, 110673, 110830, 110864, 111090, 111591, 112015, 112193, 112246, 111980, 110952, 109439, 108558, 109023, 110319, 111373, 111510, 110597, 108948, 107307, 106346, 105958, 105604, 105327, 105628, 106312, 106491, 106045, 106022, 107167, 108929, 110443, 111661, 112887, 113968, 114577, 114752, 114600, 113980, 112892, 111656, 110425, 109144, 108163, 108064, 108530, 108304, 106794, 104902, 103752, 103387, 103233, 102992, 102521, 101706, 101067, 101574, 103141, 104244, 103807, 102612, 101957, 101835, 101464, 100767, 100177, 99644, 99064, 99103, 100302, 101773, 102116, 101460, 101370, 102785, 105194, 107801, 110351, 112691, 114670, 116766, 119859, 123916, 127642, 129843, 130613, 130825, 131007, 131126, 131169, 131382, 131969, 132804, 133534, 133932, 134051, 133953, 133466, 132443, 131144, 130010, 129143]
57360A29143o38l4J036J760J579J257J723K390K016Q26K59P15J101P72M19O33
57344A44957R77R81Q40O60J24n90o92r9J68m52j191j243r37q53p41j75M23L27
57326A42484l57q41o65k6N30M91j98q57o96J24O12L02k30l75k89l36m05k32J40
57307A39176N97J147J645J717J231M84j38l23J40J057J690J613J400J731K153
57292A55320J790R41P21J195J292P38N61J348K291K601K658L019L342L001K030
57277A82848Q19l37r44m02J014K047J897J116O63P67J157J657K095K209K059K017
57261B00682K097J939J551J319J201Q13M26Q01J832K460K172J569J190Q96Q13
57246B21761J531K810L301K372J125Q35J392J978K409K922L427L710L820L693
$$ y = [129143, 128505, 128471, 129507, 131267, 132846, 134103, 135826, 138216, 140232, 141058, 141317, 142032, 143133, 143905, 144324, 144957, 145934, 146915, 147755, 148415, 148539, 147949, 147257, 147158, 147326, 146874, 145683, 144440, 143503, 142650, 141909, 141734, 142157, 142484, 142127, 141286, 140621, 140595, 141125, 141616, 141418, 140561, 139865, 139989, 140601, 140903, 140673, 140298, 140009, 139673, 139268, 139036, 139176, 139773, 140920, 142565, 144282, 145513, 145997, 145859, 145536, 145676, 146733, 148423, 150036, 151436, 153167, 155320, 157110, 158051, 158772, 159967, 161259, 161997, 162558, 163906, 166197, 168798, 171456, 174475, 177817, 180818, 182848, 183667, 183330, 182386, 181984, 182998, 185045, 186942, 188058, 188721, 189488, 190645, 192302, 194397, 196606, 198665, 200682, 202779, 204718, 206269, 207588, 208789, 209602, 210028, 210829, 212661, 215121, 217293, 218862, 220052, 220948, 221761, 223292, 226102, 229403, 231775, 232900, 233735, 235127, 237105, 239514, 242436, 245863, 249573, 253393, 257086]
57232B57086L138K550K811L962M904M935M634M761N272N949O954Q081Q466P834
57218C31337P110P121P593Q008Q496R139R447R298R423J0183J0781J0615J0382
57205D48933J0944J1913J2394J2351J2381J2713J3223J3814J4150J3757J2981
57194E89554J2942J3961J5051J5495J5802J6357J6482J5812J5297J5661J6102
57183G58516J5805J5674J7063J9759K2732K6028L0320L5197L9461M2692M5113
57172A068360M6312M5529M3016L9818L6467L3059L0242K8837K8579K8336K7531
57161A456086K6422K5183K3731K2305K1271K0529J9827J9384J9442J9619J9513
57150A693312J9560K0330K1404K1867K1635K1408K1599K2177K3235K4776K6230
$$ y = [257086, 260224, 262774, 265585, 269547, 274451, 279386, 284020, 288781, 294053, 300002, 306956, 315037, 323503, 331337, 338447, 345568, 353161, 361169, 369665, 378804, 388251, 397549, 406972, 417155, 427936, 438551, 448933, 459877, 471790, 484184, 496535, 508916, 521629, 534852, 548666, 562816, 576573, 589554, 602496, 616457, 631508, 647003, 662805, 679162, 695644, 711456, 726753, 742414, 758516, 774321, 789995, 807058, 826817, 849549, 875577, 905897, 941094, 980555, 1023247, 1068360, 1114672, 1160201, 1203217, 1243035, 1279502, 1312561, 1342803, 1371640, 1400219, 1428555, 1456086, 1482508, 1507691, 1531422, 1553727, 1574998, 1595527, 1615354, 1634738, 1654180, 1673799, 1693312, 1712872, 1733202, 1754606, 1776473, 1798108, 1819516, 1841115, 1863292, 1886527, 1911303, 1937533]
57139A937533K7003K7379K8127K9482L1107L2809L4551L6055L7016L7540L7964
57128B296566L8579L9772M1839M4353M6436M8099N0517N4569O0061O6796P5213
57117B862800Q5313R6093J07047J19114J33291J49210J66080J83992K03412K24411
57107D330763K47504K74438L07334L47919L98311M61536N40693O38954P61203
57098H308655R14290J105148J340225J626973J972780K380349K845360L359304
57090B3853084L911974M489854N074490N643094O166517O604614O907936P026232
57082F9677795O909169O496665N724620M565574L075953J397695k96102j864700
57074I5686669l225608m343358n209913n832345o224982o404272o389300o205392
$$ y = [1937533, 1964536, 1991915, 2020042, 2049524, 2080631, 2113440, 2147991, 2184046, 2221062, 2258602, 2296566, 2335145, 2374917, 2416756, 2461109, 2507545, 2555644, 2606161, 2660730, 2720791, 2787587, 2862800, 2948113, 3044206, 3151253, 3270367, 3403658, 3552868, 3718948, 3902940, 4106352, 4330763, 4578267, 4852705, 5160039, 5507958, 5906269, 6367805, 6908498, 7547452, 8308655, 9222945, 10328093, 11668318, 13295291, 15268071, 17648420, 20493780, 23853084, 27765058, 32254912, 37329402, 42972496, 49139013, 55743627, 62651563, 69677795, 76586964, 83083629, 88808249, 93373823, 96449776, 97847471, 97551369, 95686669, 92461061, 88117703, 82907790, 77075445, 70850463, 64446191, 58056891, 51851499]
57066E1851499n884550n462336m974964m456902l937470l438526k975332k558009
57058A8163410k191087j873431j601037j369794j175278j011785q73584p56453
57050G310961o57134n72489n00265m39401l88420l44688l06248k72966k44755
57041C584595k20133j97771j77911j60849j45491j30832j17381j05647r4631q3299
57031B150650p1921o0402m7036l0575j1324J1696M0893P2454R0628P6875K7909
57020B249847l8213r6067j31008j43604j41385j31004j16899j02306q9025p7285
57010A183051o6993n8555n2182m7161m2478l7851l3652l0135k7198k4923k3674
56999G38249k3355k2989k1576j9213j6832j4929j3088j0816q175n329k110J613
$$ y = [51851499, 45966949, 40504613, 35529649, 31072747, 27135277, 23696751, 20721419, 18163410, 15972323, 14098892, 12497855, 11128061, 9952783, 8940998, 8067414, 7310961, 6653827, 6081338, 5581073, 5141672, 4753252, 4408564, 4102316, 3829350, 3584595, 3364462, 3166691, 2988780, 2827931, 2682440, 2551608, 2434227, 2328580, 2233949, 2150650, 2078729, 2018327, 1971291, 1940716, 1929392, 1941088, 1981981, 2054435, 2145063, 2221938, 2249847, 2211634, 2115567, 1984559, 1840955, 1699570, 1568566, 1451667, 1349361, 1260336, 1183051, 1116058, 1057503, 1005321, 958160, 915682, 877831, 844179, 814044, 786846, 761923, 738249, 714894, 691905, 670329, 651116, 634284, 619355, 606267, 595451, 587276, 581947, 579837, 581450]
56987E81450N464Q938J2033J5119J8128J9942J8698J3151M107n743j3818j9234
56975F58235k2220k2841k1305j8894j7108j5894j4027j1215q480o337m133j527
56963D94254Q88L092O278J1108J6547K1235K4776K6617K4982J8490Q193l178j3536
56950F39746k1969k7692k9976k9121k6450k3181j9814j6446j3049r587o238l291
56938D12932n22K742O726J0950J5329K0645K7204L3546L7160L6091K9478J7602
56926F49883K370j2823k4819l2290l5482l5157l2512k9221k6484k4202k1761j9123
56914C58379j6580j4055j1507r468q298p433o240n131m782m752l979k424j111
56901B62619o50o55n90l33K01J129K186K897L286L902N124O888R043J1544J4253
$$ y = [581450, 586914, 595852, 607885, 623004, 641132, 661074, 679772, 692923, 697030, 691287, 677469, 658235, 636015, 613174, 591869, 572975, 555867, 539973, 525946, 514731, 506251, 499914, 495781, 494254, 495142, 498234, 504512, 515620, 532167, 553402, 578178, 604795, 629777, 648267, 656460, 653282, 639746, 617777, 590085, 560109, 530988, 504538, 481357, 461543, 445097, 432048, 422461, 416223, 412932, 412410, 415152, 421878, 432828, 448157, 468802, 496006, 529552, 566712, 602803, 632281, 649883, 652253, 639430, 614611, 582321, 546839, 511682, 479170, 449949, 423465, 399263, 377502, 358379, 341799, 327744, 316237, 306769, 298471, 291038, 284798, 279667, 274885, 270133, 266154, 263730, 262619, 261969, 261314, 260724, 260391, 260592, 261721, 263907, 266804, 270090, 273992, 279116, 286004, 295047, 306591, 320844]
56886C20844J6824J8643J8695J5938J0334L263l514r046j3092j5343j5472j3698
56874C34376j0823p720n049l070j379P91L667O716R584J2732J6721K1515K6922
56861D04983L3037L9440M4426M5686M1571L1574J6546p99j6420k7227l2828l4563
56849E45426l3509l0143k5227j9751j4141q420k884K132O999J2428J8624K5498
56837D77032L3446M2950N3529O3667P1437P4343O9145N3497K8492q78k8238m8821
56825H89601o0774o4849o3207n8045n0896m3000l5591k9158k2901j5807q116j018
56813D36239N023J0869J7620K5580L4327M3057N0413N4277N2126M2061K4291K038
56801G97921j9564l6278m6698n1520n1812m8543m3119l7139l1475k6028k0421
$$ y = [320844, 337668, 356311, 375006, 390944, 401278, 404541, 401027, 391981, 378889, 363546, 348074, 334376, 323553, 315833, 310784, 307714, 306335, 307126, 310793, 317509, 327093, 339825, 356546, 378061, 404983, 438020, 477460, 521886, 567572, 609143, 640717, 657263, 656464, 640044, 612817, 579989, 545426, 511917, 481774, 456547, 436796, 422655, 414235, 411351, 413483, 420482, 432910, 451534, 477032, 510478, 553428, 606957, 670624, 742061, 816404, 885549, 939046, 967538, 966660, 938422, 889601, 828827, 763978, 700771, 642726, 591830, 548830, 513239, 484081, 461180, 445373, 437257, 436239, 441262, 452131, 469751, 495331, 529658, 572715, 623128, 677405, 729531, 771592, 795883, 797921, 778357, 742079, 695381, 643861, 592049, 543506, 500387, 463248, 431773, 405745, 385324]
56790C85324j4608r011m315p81K372O299J1102J5802J9964K4097K7714K8259K3349
56777E15567J3501J478j0306k0494k7758l1094l1174k9879k8232k5914k2797j9594
56765B83304j6792j4159j1703r951q925p849o376n105m503m113l454k869k857
56752A84648l212l389l274k994k408j339j15N86M48j58n12k14L78M41l40j252
56736A67294j312m59M53P52N87M18L77L44L08L76N46O83P23Q33J228J778K007
56719A76936J753J599K042K489J830J51j074q11L63J292J622J539J069M31L02
56704A91533Q70J287R10L90N85J077Q95K27J03P22J228J087N97O4m75p34l50L09
56686B00325L62m49j474k019j885j154j46M87L40j73l10L8M84Q66J178J092L14
$$ y = [385324, 370716, 361705, 357390, 356609, 358981, 365280, 376382, 392184, 412148, 436245, 463959, 492218, 515567, 529068, 530546, 520240, 499746, 471988, 440894, 409720, 379841, 351609, 325695, 302898, 283304, 266512, 252353, 240650, 230699, 221774, 213925, 207549, 202444, 197941, 193828, 190374, 187505, 184648, 181436, 178047, 174773, 171779, 169371, 168032, 167917, 168503, 168951, 168793, 168281, 168067, 168445, 168886, 168546, 167294, 165982, 165523, 165976, 166728, 167315, 167733, 168110, 168454, 168762, 169138, 169684, 170367, 171090, 171923, 173151, 174929, 176936, 178689, 180288, 182330, 184819, 186649, 186800, 185726, 184915, 185278, 186570, 188192, 189731, 190800, 191231, 191533, 192403, 193690, 194600, 194990, 195575, 196652, 197547, 197774, 197877, 198599, 199827, 200914, 201511, 201575, 201100, 200366, 200016, 200325, 200687, 200238, 198764, 196745, 194860, 193706, 193560, 194047, 194387, 194214, 193904, 193942, 194426, 195292, 196470, 197562, 197876]
56669A97876p82j535j835j885j520n82M16P78N84L84K96J70K95R87J823K139K074
56652A99683K163K350K252K058K125K120J598J034J121J489J362J124J704K666
56638B24849K497Q55r20j688j573j006j01P22Q35M10K49L12l11j728k852l021
56622B17529k804k747k504j811j234j297j678j839j701j323p01k04l50q70q52
56607A95614r7N46N39L55L61N0r66j983k033j157k25J83K18K84M91N80L82L19
56589A93461R83K079K406J511N66P23J352J139K42p1M00O15J78j85j58k71n97
56572B04373m08N04J418J910K263K481K187J690J888K881L889M754O092P862R267
56557B53051J0260J1469J2281J0914P013K503q37l042m534m856l989l289l694
$$ y = [197876, 197094, 195559, 193724, 191839, 190319, 189737, 190153, 190931, 191515, 191899, 192195, 192365, 192660, 193647, 195470, 197609, 199683, 201846, 204196, 206448, 208506, 210631, 212751, 214349, 215383, 216504, 217993, 219355, 220479, 222183, 224849, 227346, 228201, 227281, 225593, 224020, 223014, 222913, 223635, 224470, 224880, 225129, 225441, 225130, 223402, 220550, 217529, 214725, 211978, 209474, 207663, 206429, 205132, 203454, 201615, 199914, 198591, 197890, 197686, 197336, 196466, 195614, 195517, 196063, 196602, 196957, 197318, 197368, 196402, 194419, 192386, 191229, 191004, 191187, 191405, 191689, 192180, 192760, 193142, 193461, 194444, 196523, 198929, 200440, 201006, 201729, 203081, 204220, 204462, 204391, 204791, 205406, 205584, 205399, 205241, 204970, 204373, 203965, 204469, 205887, 207797, 210060, 212541, 214728, 216418, 218306, 221187, 225076, 229830, 235922, 243784, 253051, 263311, 274780, 287061, 297975, 304988, 307491, 306654, 303612, 299078, 294222, 290233, 286944, 283250]
56544B83250m255l711k442j646j559j712k085k833l525l653l370k988k445j856
56530B45170j734k032j958j343j086j529j574m15R94J370R34P30Q90P58J14p54
56514B38535j640k243k071j288q71j257j651j437j225j583j851j337p14r59j666
56499B16742j767j243q30n57Q6R48J369J310J233J116O21k2k39m3R8J21L34O92
56481B19969Q69Q31P80P14N06J87k29p83j152p68K91J194J505J664J937J811J046
56464B30372L57L45N75N07M14O02N47k07j017r53j22O40Q57N56q2n46j68Q93J533
56445B35103J171N55M97P94J024J362J782J561N13l35l08k35r10j512r35K63P09
56428B41099K98J7K44N72Q07R96Q92N16O16J494K057J289q3o80n76q11j383j338
$$ y = [283250, 278995, 275284, 272842, 271196, 269637, 267925, 265840, 263007, 259482, 255829, 252459, 249471, 247026, 245170, 243436, 241404, 239446, 238103, 237017, 235488, 233914, 233499, 234493, 235863, 236797, 237527, 238417, 239175, 239289, 238535, 236895, 234652, 232581, 231293, 230422, 229165, 227514, 226077, 224852, 223269, 221418, 220081, 219367, 218408, 216742, 214975, 213732, 212902, 212345, 212431, 213379, 214748, 216058, 217291, 218407, 219028, 219006, 218767, 218724, 218822, 218943, 219277, 219969, 220838, 221669, 222449, 223163, 223669, 223856, 223627, 222844, 221692, 220924, 221215, 222409, 223914, 225578, 227515, 229326, 230372, 230729, 231074, 231649, 232156, 232570, 233172, 233719, 233512, 232495, 231542, 231420, 232060, 232917, 233473, 233391, 232845, 232677, 233570, 235103, 236274, 236829, 237326, 238120, 239144, 240506, 242288, 243849, 244362, 244027, 243719, 243484, 242574, 241062, 240127, 240390, 241099, 241397, 241414, 241658, 242230, 243037, 244033, 244925, 245441, 246057, 247551, 249608, 250897, 250814, 250134, 249558, 248747, 247364, 246026]
56410B46026n99q0n3J82Q85J346J061M00o6j78o0M8m2j31K62R99J185M35l65k98
56390B50957L91J031J629K239K219J166m8k93K73P84J061J391J575J323J036J119
56374B67853J036J95q39j027k94O97J538J944J440K55l36L25J127Q94K79N72J565
56357B77224K150K183K186J894Q55j40O5J063J457R44L28r5n90q36l39L56M02
56340B89107J85O24J349J308P67J023K265L371L777L991M330M496M330L814K705
56325C27442J303Q97K075L311K846J280M57N64M11n6J65P88L98r94j718j037L0
56308C38162P06J323J909J840J270J232J927K530K893L763N098N824N525M888
56294C78890M309L580L001L088L227K347R82P67J812K578K570K985M347N505N662
$$ y = [246026, 245427, 245347, 245294, 245476, 246361, 247707, 248768, 249168, 249102, 248924, 248864, 248912, 248870, 248739, 249001, 250000, 251185, 251620, 251255, 250957, 251348, 252379, 254008, 256247, 258466, 259632, 259584, 259291, 259564, 260348, 261409, 262800, 264375, 265698, 266734, 267853, 268889, 269084, 268245, 267218, 266924, 267621, 269159, 271103, 272543, 272798, 272462, 272787, 273914, 274808, 275087, 275659, 277224, 279374, 281557, 283743, 285637, 286492, 286352, 286417, 287480, 288937, 289881, 290209, 290114, 289524, 288688, 288349, 288705, 289107, 289292, 289916, 291265, 292573, 293340, 294363, 296628, 299999, 303776, 307767, 312097, 316593, 320923, 324737, 327442, 328745, 329642, 331717, 335028, 337874, 339154, 339611, 340175, 340586, 340530, 340695, 341483, 341881, 340887, 339169, 338132, 338162, 338868, 340191, 342100, 343940, 345210, 346442, 348369, 350899, 353792, 357555, 362653, 368477, 374002, 378890, 383199, 386779, 389780, 392868, 396095, 398442, 399424, 400191, 402003, 404581, 407151, 410136, 414483, 419988, 425650]
56279D25650N464N472N355N188N799P101P829P645P748Q773R724R865J0001J0973
56265E32587J2353J3478J4534J5773J6918J8048J9910K2696K5653K8453L1785
56254G52188L6091M0921M5935N1392N7305O3343O9832P7464Q5729R3073R8837
56243A472110J03607J07371J09016J08081J05333J00954R3770Q2980O9244N3423
56233B405889L5687J6528k659k0718l7305n1918o3633p2309p8869q3945q7377
56222A959371q9250r0036q9543q7145q3337p9539p6092p1981o6849o1714n7322
56211A106563n3266m9073m4736m0110l5298l1513k9724k8556k5661k1244j7853
56200G29529j6509j5567j3903j2472j1775j0540q194o302o024o192n428m275l683
$$ y = [425650, 431114, 436586, 441941, 447129, 452928, 460029, 467858, 475503, 483251, 492024, 501748, 511613, 521614, 532587, 544940, 558418, 572952, 588725, 605643, 623691, 643601, 666297, 691950, 720403, 752188, 788279, 829200, 875135, 926527, 983832, 1047175, 1117007, 1194471, 1280200, 1373273, 1472110, 1575717, 1683088, 1792104, 1900185, 2005518, 2106472, 2200242, 2283222, 2352466, 2405889, 2441576, 2458104, 2455445, 2434727, 2397422, 2345504, 2281871, 2209562, 2130693, 2046748, 1959371, 1870121, 1780085, 1690542, 1603397, 1520060, 1440521, 1364429, 1292448, 1225599, 1163885, 1106563, 1053297, 1004224, 959488, 919378, 884080, 852567, 822843, 794287, 768626, 747382, 729529, 713020, 697453, 683550, 671078, 659303, 648763, 640569, 634267, 628243, 622051, 616623, 612348, 608665]
56187F08665l165k010q36l92j87L72P03K32l63k57K46N45Q44J491K224K740L057
56170F13909K890J912R76J549L588N468O403P189Q244Q884R053R785J1195J2028
56156G03073J1938J2304J3926J5853J7342J9107K1778K4930K8371L2670L7780
56145I39072M3070M9163N7642O8538Q0436R3408J09050J26783J42965J54551J60759
56134B025437J60097J49473J28579J02764P9284O2500N3696N2451N5561N6898
56124B926740N1249L7889J9557q8j7014k7549l1080l1033l2155l8158n1904p4486
56112B731968j02460j28605j47301j57388j59284j52720j39057j22442j06192
56103A516519r0353p4655o0946n0572m2076l3938k7109k2590j8989j4835j0955
$$ y = [608665, 605500, 603490, 602654, 602262, 602075, 602447, 603150, 603382, 603019, 602762, 603008, 603553, 604397, 605888, 608112, 610852, 613909, 616799, 618711, 619687, 621236, 624824, 630292, 636695, 643884, 652128, 661012, 670065, 679850, 691045, 703073, 715011, 727315, 741241, 757094, 774436, 793543, 815321, 840251, 868622, 901292, 939072, 982142, 1031305, 1088947, 1157485, 1237921, 1331329, 1440379, 1567162, 1710127, 1864678, 2025437, 2185534, 2335007, 2463586, 2566350, 2645634, 2708134, 2761830, 2814281, 2869842, 2926740, 2977989, 3015878, 3035435, 3035347, 3018333, 2990784, 2959704, 2928671, 2896516, 2858358, 2806454, 2731968, 2629508, 2500903, 2353602, 2196214, 2036930, 1884210, 1745153, 1622711, 1516519, 1426166, 1351511, 1290565, 1239993, 1197917, 1163979, 1136870, 1114280, 1095291, 1080456, 1069501]
56092A069501q305n855k852p61o10q39O1J130J319J669K989L951L744L892N232
56077A074266O026N340N224P005Q666Q587Q612J0437J2277J2390J2648J4994J7491
56064A203963J7602J6572J6794J7506J7021J6516J7758J9332J9001J7568J6851
56053A396484J6188J4481J3207J3800J4610J4067J4026J6319J8889J9383J9525
56042A570979K1730K4423K5227K5858K9115L3640L6531L8565M1932M5213M5664
56031A938877M4271M3696M3428M1765M0318M1533M3860M4228M3197M3177M3926
56020B412276M4399M6310N1010N5738N7874N9734O4127O8642P0047P0732P4688
56009C075577Q0408Q4140Q6857R1442R6329R8729J00994J06688J13561J17598
$$ y = [1069501, 1061196, 1055341, 1052489, 1051728, 1051118, 1050279, 1050340, 1051470, 1052789, 1054458, 1057447, 1061398, 1065142, 1069034, 1074266, 1080292, 1085632, 1090856, 1097861, 1106527, 1115114, 1123726, 1134163, 1146440, 1158830, 1171478, 1186472, 1203963, 1221565, 1238137, 1254931, 1272437, 1289458, 1305974, 1323732, 1343064, 1362065, 1379633, 1396484, 1412672, 1427153, 1440360, 1454160, 1468770, 1482837, 1496863, 1513182, 1532071, 1551454, 1570979, 1592709, 1617132, 1642359, 1668217, 1697332, 1730972, 1767503, 1806068, 1848000, 1893213, 1938877, 1983148, 2026844, 2070272, 2112037, 2152355, 2193888, 2237748, 2281976, 2325173, 2368350, 2412276, 2456675, 2502985, 2553995, 2609733, 2667607, 2727341, 2791468, 2860110, 2930157, 3000889, 3075577, 3155985, 3240125, 3326982, 3418424, 3514753, 3613482, 3714476, 3821164, 3934725, 4052323]
55999D052323J20865J27852J37261J45031J52249J62224J73030J81124J89099
55990E441058K01488K16406K29694K43650K62708K84550L04875L26654L54736
55981G865819L85763M14247M44044M82452N27508N73157O22187O81297P48401
55972A2744875Q18611Q97792R95760J111357J239740J388818J571861J790213
55964B2559027K042125K342895K716814L176799L735314M429510N310613O413282
55956E2726379P759739R386777J1345048J3691663J6527795K0034385K4411673
55949A55883459K9730234L5741626M1603467M5583192M5199210L8271509K4496527
55942D16509224O248028j2334732k7388417l6916090m0968075m0805550l7987871
$$ y = [4052323, 4173188, 4301040, 4438301, 4583332, 4735581, 4897805, 5070835, 5251959, 5441058, 5642546, 5858952, 6088646, 6332296, 6595004, 6879554, 7184429, 7511083, 7865819, 8251582, 8665829, 9109873, 9592325, 10119833, 10692990, 11315177, 11996474, 12744875, 13563486, 14461278, 15457038, 16568395, 17808135, 19196953, 20768814, 22559027, 24601152, 26944047, 29660861, 32837660, 36572974, 41002484, 46313097, 52726379, 60486118, 69872895, 81217943, 94909606, 111437401, 131471786, 155883459, 185613693, 221355319, 262958786, 308541978, 353741188, 392012697, 416509224, 422757252, 410422520, 383034103, 346118013, 305149938, 264344388, 226356517]
55935B26356517l3856147k9343518k4971076k0975053j7462262j4476192j1992578
55928G3279691r941250q257262o892594n791455m891312m149672l544538l050017
55920B6761591k634515k280806j985699j740129j527967j342740j187272j057303
55912A3005160r41641q37456p50033o78045o13231n53977n05436m66620m30141
55903G228580l94664l65556l43114l21385k98714k78926k62020k43719k24323
55894D496159k08482j96108j82525j67576j55770j47411j38125j27219j18299
55885C054644j11410j02558r1403q1990p5715p0636o7656o9951p5856p9399p8495
55874B149575p6185p3670o8949o2770n9245n9300n9411n7713n5895n4479n1686
$$ y = [226356517, 192500370, 163156852, 138185776, 117210723, 99748461, 85272269, 73279691, 63338441, 55081179, 48188585, 42397130, 37505818, 33356146, 29811608, 26761591, 24127076, 21846270, 19860571, 18120442, 16592475, 15249735, 14062463, 13005160, 12063519, 11226063, 10476030, 9797985, 9184754, 8630777, 8125341, 7658721, 7228580, 6833916, 6468360, 6125246, 5803861, 5505147, 5226221, 4964201, 4720482, 4496159, 4287677, 4091569, 3909044, 3741468, 3585698, 3438287, 3300162, 3172943, 3054644, 2943234, 2840676, 2749273, 2667283, 2591568, 2520932, 2453276, 2383325, 2307469, 2228070, 2149575, 2073390, 1999720, 1930771, 1868001, 1808756, 1749456, 1690045, 1632332, 1576437, 1521958, 1470272]
55863A470272m7662m4697m2696l9370l5147l2812l2092k9686k5028k1034j8774
55852A101274j6416j3863j3422j5186j6497j6700j7821j9970k0659j9446j8818
55841I12476j9597j9726j8501j7850j8468j8536j7239j5995j5396j4382j2958
55830G23828j2359j2134j0555q168p376q295q640p995q335j0019j0974j0509j0202
55817E98267j0464r886q494q160r049r189q087p304o974n402k754j391j729j358
55803E08026P75K869L948N402P684Q887Q053O737N906M332J454j121k404l618
55789E56930n664p588q717r700j0310q936n635l164l552n882q567j1391j4119
55776D53705j5485j5026j3866j2630j0575p704n462m332k990q92N33M20l2K10
$$ y = [1470272, 1422610, 1377913, 1335217, 1295847, 1260700, 1227888, 1195796, 1166110, 1141082, 1120048, 1101274, 1084858, 1070995, 1057573, 1042387, 1025890, 1009190, 991369, 971399, 950740, 931294, 912476, 892879, 873153, 854652, 836802, 818334, 799798, 782559, 766564, 751168, 736786, 723828, 711469, 699335, 688780, 680612, 673236, 664941, 656301, 648306, 639971, 629952, 618978, 608469, 598267, 587803, 577917, 569423, 561263, 552214, 543025, 534938, 527634, 520660, 515258, 512504, 511113, 509384, 508026, 508801, 511670, 515618, 521020, 528704, 537591, 545644, 552381, 558287, 562619, 564073, 562952, 560548, 556930, 551266, 543678, 534961, 525261, 514951, 506015, 500380, 497216, 493664, 487782, 479215, 467824, 453705, 438220, 423194, 409328, 396698, 386123, 378419, 372957, 368625, 365635, 364743, 365276, 365696, 365664, 365874]
55762C65874L90k77j162j725k575m011n289o254p791r772j0600r798r034r506
55748B88470j0234j0010r163q299p020n084l238j959r15k78q93k358k865j815
55734B24339p07o68r74q50p44q92n71J56q9j706l172l401l299l742l948l071j777
55717A94884j000n98l31o20j318j294k56N74N09M86J154J678J501J512K283K788
55701B01952K136R59j29j725m084n858n859m736l697k893k178j970k208j856o67
55686A67187l0q23j891j807p86L73J776L441M313L659K333J406P57O7j65K05K08
55669A80223n64r88l89J42j91k13J144K663K721K002K263L418M026L844L801L975
55653B07877L550K541J777J406Q57J10l13l98n05o00o49j280k885m615n412n516
$$ y = [365874, 366264, 365987, 364825, 363100, 360525, 356514, 351225, 344971, 337180, 327408, 316808, 307010, 297976, 288470, 278236, 268226, 259063, 250764, 243744, 238660, 235422, 233463, 232548, 232270, 231377, 229019, 226154, 224339, 223632, 222964, 221990, 221140, 220396, 219504, 218933, 219089, 219000, 217294, 214122, 210721, 207422, 203680, 199732, 196661, 194884, 193884, 193286, 192955, 192335, 191017, 189723, 189467, 190041, 190550, 191036, 192190, 193868, 195369, 196881, 199164, 201952, 204088, 205047, 204918, 203193, 199109, 193251, 187392, 182656, 178959, 176066, 173888, 171918, 169710, 167854, 167187, 167157, 166334, 164443, 162636, 161850, 162223, 163999, 167440, 171753, 175412, 177745, 179151, 179908, 179975, 179810, 180015, 180223, 179659, 178671, 178282, 178424, 178233, 178020, 179164, 181827, 184548, 186550, 188813, 192231, 196257, 200101, 203902, 207877, 211427, 213968, 215745, 217151, 218008, 218118, 217805, 217407, 216902, 216302, 215653, 214373, 211488, 206873, 201461, 195945]
55637A95945n806o219o040n252m418l635k727j997j714j430p90m54j033j791j581
55622A51058o09jj37o06j320k333k931k263p43L26L93k3m83r60j228r47l85k20
55604A36588o32j197j617j893j991j877j639j258o24o9k04q39r70l44m3p24j401
55587A19266r79j0L06L7N6L94M53L71P81J492J705J381J251J589K050K492L016
55570A35651L338L186L090L769M835N129M288L010J823N55r15k248l161l737m047
55555A54566m042l807l547l314l082k903k713k314j772j452j349r59j75K95k2
55540A23410n48n11m7J87M7q9K7L42O09M00m75j368j348n48o0k60l98j82l57j085
55520A17746j294n33Jn45j136o94q3n84j580j634r53q24j259j191n63l75q27j121
$$ y = [195945, 190139, 183920, 177880, 172628, 168210, 164575, 161848, 159851, 158137, 156707, 155917, 155463, 154430, 152639, 151058, 150449, 150448, 150311, 149705, 148385, 146052, 143121, 140858, 140115, 140441, 140834, 140811, 140328, 139368, 138140, 137193, 136808, 136588, 135956, 134759, 133142, 131249, 129258, 127381, 125742, 124484, 123860, 123791, 123587, 122748, 121778, 121434, 121391, 120667, 119266, 118287, 118277, 118583, 118620, 118676, 119070, 119523, 119894, 120675, 122167, 123872, 125253, 126504, 128093, 130143, 132635, 135651, 138989, 142175, 145265, 149034, 153869, 158998, 163286, 166296, 168119, 168674, 167759, 165511, 162350, 158613, 154566, 150524, 146717, 143170, 139856, 136774, 133871, 131158, 128844, 127072, 125620, 124271, 123312, 123137, 123432, 123410, 122862, 122351, 122304, 122491, 122538, 122449, 122476, 122818, 123427, 123827, 123352, 121984, 120636, 120088, 120028, 119768, 119370, 119188, 118831, 117746, 116452, 115919, 115920, 115375, 114239, 113545, 113462, 112878, 111298, 109664, 108711, 107887, 106628, 105437, 104874, 104499, 103672, 102551]
55502A02551j025j029j115q30m13m14m60J36Q14M97l72l09P56J329Q35M11Q01
55485A02163J174O75k86r58j279j378j104o14m48n79k91N94J330J378J073P99
55469A02249M36n1l23l10l72n60n82o14j125j790j532r2J429J999J717J133L79
55452A01991m80j042j033o54j29M97R29O69j91q91r34n21J08R50J674J562M53
55435A02958q87j608j518p75L50J241J103o6j289j672j239m98L33J226J955K140
55419A01754J647Q07L38P40J603J829J014O4p9K12L1n44p98q34j358k142k129
55402A02155j147k12O1J17K41k6p12r15j21R16J282J069P97M80q3o67r47r45p74
55383A00569l80J33M18M51N39O37L70j15j46K94L09n19j356j304o10o9J01J92
$$ y = [102551, 101526, 100497, 99382, 98552, 98139, 97725, 97265, 97401, 98215, 98712, 98340, 98031, 98787, 100116, 100951, 101362, 102163, 103337, 104012, 103726, 102768, 101489, 100111, 99007, 98393, 97945, 97366, 97075, 97669, 98999, 100377, 101450, 102249, 102685, 102634, 102311, 102001, 101629, 101069, 100487, 99873, 98748, 96958, 95426, 95334, 96763, 98762, 100479, 101612, 101991, 101511, 100469, 99436, 98782, 98653, 99150, 100079, 100748, 100557, 99666, 98732, 98211, 98319, 99269, 100943, 102505, 102958, 102071, 100463, 98945, 98170, 98520, 99761, 100864, 100798, 99509, 97837, 96598, 96100, 96433, 97659, 99614, 101754, 103401, 104208, 104546, 105286, 106889, 108718, 109732, 109796, 109717, 109929, 109960, 109416, 108618, 107784, 106426, 104284, 102155, 101008, 100796, 100857, 100974, 101215, 101189, 100477, 99562, 99441, 100357, 101639, 102708, 103505, 103985, 103902, 103235, 102288, 101343, 100569, 100189, 100322, 100740, 101191, 101730, 102367, 102737, 102622, 102476, 102770, 103079, 102560, 101204, 99900, 99290, 99221, 99322, 99514]
55365I9514L37N74J017J413J067k46j675k194j726r74m95l93n21n56j47N60R22
55348I6477N82m3m16n40p04r21j023r52o62o3O61J080J058R24R00Q49P32P48Q29
55329I9516N61l3k56K98J035J090L29o80j334j261m60M93P48J24o44q45n86l05
55311I7790p4J58J27l81r58r36j26J020J867J938J135o5q82r38n22r6J49K09J74
55292I9589L52R98J740J792J031K70J52L36K05r6L3O17R87O90jn29p26q07q89
55273A05744p34j92L01J33n43q54n00k81p46j124m89N96Q03Q4l75j11J64J49N14
55254A02539J411J823J107Qo22r95j491j609q25K59O87M83L17L14N9m83q98r44
55236A01140o91k62J32K08k1k36l71o68r54o22L01R06O87K59K59M31M09N08R01
$$ y = [99514, 99851, 100425, 101442, 102855, 103922, 103676, 102001, 99807, 98081, 97107, 96612, 96219, 95698, 95142, 94995, 95555, 96477, 97059, 97016, 96600, 96060, 95356, 94435, 93412, 92460, 91798, 91735, 92396, 93476, 94534, 95458, 96358, 97207, 97939, 98687, 99516, 100077, 100044, 99788, 100086, 101121, 102211, 102540, 101860, 100526, 99265, 98805, 99298, 100046, 100170, 99526, 98681, 98095, 97790, 97716, 97874, 98001, 97620, 96662, 95726, 95600, 96620, 98487, 100425, 101560, 101495, 100613, 99675, 99153, 99057, 99206, 99415, 99589, 99941, 100939, 102679, 104471, 105502, 105772, 105924, 106260, 106465, 106369, 106402, 107019, 108006, 108696, 108695, 108166, 107440, 106633, 105744, 105010, 104818, 105119, 105252, 104709, 103855, 103355, 103074, 102328, 101204, 100715, 101311, 102114, 102198, 101823, 101712, 101876, 102025, 102539, 103950, 105773, 106880, 106888, 106266, 105271, 103780, 102171, 101346, 101605, 102292, 102775, 103092, 103406, 103465, 102982, 102084, 101140, 100449, 100187, 100319, 100527, 100506, 100270, 99899, 99231, 98277, 97655, 97956, 98862, 99549, 99808, 100067, 100498, 100907, 101415, 102316]
55217A02316R14Q5q05p86j16L49N79R86J249P43k25p71p78p33n69J02Q52P94J06
55198A04292j30L42N65j1o76o38j34J65N5k67n99p24n17k47k36j63N62J569J613
55179A04821K52j304j643q19K7J95p0l09l00J15J004J979K305J664N66k38n87
55162A07658q70j212j147l41P29J240J025O15L62R4k42l27o6M2l78r83j212j012
55144A03975o35j04O23J268J448J104L83n81j465j702j119k80K16M13O00P23O88
55127A05555Q31J345J687J213J96n25o64n59l96j10O7k21p25p80k56K96M50K91
55109A07695J0k80l13J29P45R78Q00P10R65J312J472J346P97j00o73k24Q62J318
55091A17549N48o12r89m20K92L98j30p24p60j19O62R89Q08M88K56Q9qr5m30j063
$$ y = [102316, 103230, 103315, 102510, 101724, 101608, 101957, 102536, 103522, 104771, 105514, 105289, 104518, 103740, 103007, 102438, 102540, 103392, 104186, 104292, 104162, 104504, 105069, 105058, 104382, 103744, 103610, 103775, 103830, 103563, 102964, 102240, 101723, 101476, 101240, 101077, 101639, 103208, 104821, 105073, 103769, 102126, 101307, 101334, 101529, 101459, 101150, 100850, 100965, 101969, 103948, 106253, 107917, 108483, 108245, 107658, 106788, 105576, 104429, 104088, 104817, 106057, 107082, 107697, 108059, 108153, 107911, 107584, 107518, 107560, 107182, 106199, 104987, 103975, 103340, 103236, 103859, 105127, 106575, 107679, 108062, 107481, 106016, 104314, 103195, 102915, 103131, 103544, 104144, 104867, 105555, 106386, 107731, 109418, 110631, 110827, 110302, 109638, 109079, 108683, 108573, 108640, 108419, 107694, 106914, 106658, 106954, 107404, 107695, 107705, 107425, 107112, 107241, 107986, 108964, 109764, 110474, 111439, 112751, 114223, 115569, 116366, 116266, 115593, 115369, 116231, 117549, 118097, 117485, 116496, 116076, 116368, 116766, 116636, 115912, 115152, 115033, 115695, 116684, 117492, 117980, 118236, 118325, 118317, 118222, 117792, 116729]
55071A16729j405q43K98R77P07l3n97p93o17o5N34O63K98K4J93M69M82L87M40
55052A17848M85K66n5j49n3j13m73r04j063p03J56J074J281K96j410k559k116
55035A11808l76J209J459P00J66L25M31j02p16o13o2Q7j89j24M82Q70M88k25n11
55016A15107k47J62L82L47J29j44l20l25j67Q8K28K3l48l10L60J106J324J155
54998A18550J008P00j38j079j247o15j39m25r75r25M5J636L138L685K941J563
54982A27723N02o3m81o52k05M25L27l08k34Q67J749J477Q26Q60J275J208Q69J068
54964A37233J633J612Q50K10J46J10l88j022j240j110j113j413j630j262l54L04
54948A32566j20j414k263j634j5J160J097K51m43m63J39R21J297R26J03m94m28
$$ y = [116729, 115324, 114481, 114779, 115756, 116463, 116430, 115833, 115040, 114423, 114358, 114892, 115555, 115853, 115877, 116070, 116539, 117021, 117408, 117848, 118333, 118599, 118544, 118395, 118342, 118229, 117756, 116852, 115789, 115086, 115242, 116316, 117597, 117893, 116483, 113924, 111808, 111432, 112641, 114100, 114800, 114966, 115291, 115722, 115620, 114904, 114291, 114229, 114316, 114127, 114003, 114485, 115355, 115843, 115618, 115107, 114860, 115022, 115404, 115751, 115880, 115736, 115416, 115091, 114924, 115012, 115240, 115263, 114915, 114605, 114965, 116071, 117395, 118550, 119558, 120258, 120120, 119041, 117794, 117179, 117040, 116615, 115640, 114715, 114760, 116396, 119534, 123219, 126160, 127723, 128225, 128162, 127681, 127029, 126824, 127249, 127576, 127268, 127034, 127901, 129650, 131127, 131953, 132813, 134088, 135296, 136165, 137233, 138866, 140478, 141328, 141538, 141684, 141794, 141406, 140384, 139144, 138034, 136921, 135508, 133878, 132616, 132262, 132566, 132446, 131032, 128769, 127135, 127120, 128280, 129377, 129628, 129185, 128722, 128861, 129782, 131079, 132005, 132108, 131614, 131186]
54931A31186J69Q24J116J001R60J626L005M260M576M178M044M724N789O550O885
54916A80893P153P552P761P146N190J937j819m879o452o719o538o500o464o044
54902A72217n338m789m419l723k541j529j345j712j855j620j463j484j248o71
54888A38480l34n72r04p44r5Q46K146L605M331L712K590K629M438O965Q795R418
54872A85306R041P878O103M115K300O00j279l294n048o333p312q022q073p177
54858A68805n809m879m690m573l753k242p55J1k10j257k553l287l006j982q78
54843A28942j08K24J16k79n68n53n95j067j615j553q40q8L66P27R86P61O8m23
54825A24501k82J14K78K97L55K15k32m38M2O22L63n67r44j98P68Q12M0m76j51
$$ y = [131186, 131355, 132179, 133295, 134296, 135256, 136882, 139887, 144147, 148723, 152901, 156945, 161669, 167458, 174008, 180893, 188046, 195598, 203359, 210505, 215695, 217632, 215813, 210934, 204482, 197763, 191225, 184725, 178261, 172217, 166879, 162090, 157671, 153948, 151407, 149878, 148533, 146821, 144966, 143346, 141883, 140399, 139151, 138480, 138146, 137574, 136670, 135926, 135831, 136677, 138823, 142428, 146759, 150471, 153061, 155690, 160128, 167093, 175888, 185306, 194347, 202225, 208328, 212443, 214743, 215343, 214064, 210770, 205722, 199389, 192077, 184055, 175982, 168805, 162996, 158117, 153427, 148854, 145101, 142859, 142104, 142115, 141905, 140648, 138095, 134808, 131802, 129820, 128942, 128834, 129058, 129174, 128895, 128327, 127774, 127179, 126112, 124497, 122944, 122104, 122016, 122382, 123109, 124095, 124856, 124924, 124501, 124219, 124333, 124611, 124908, 125263, 125478, 125246, 124808, 124850, 125472, 125835, 125268, 124324, 124126, 124894, 125706, 125746, 125270, 125119]
54806A25119N22Q70R23J056J154P06k74r15m78P13J630J702J188N77M4m28p64
54789A33345q04m57J54O40O23K94L13Q85J261P39j65k27R01K295K951K700J979
54772A47427J359J412K330L559M361M752N277N969O429O880P979R338R486P865
54758B24423N655L877J836j415n073p393p957p853p890p876p532o968o117m741
54744A64976l152k162k058k348k557k653k531j915r76m08n56r28q79l25M66J293
54728A43287K026K526K850L296M005M788N491O244P168Q052Q543Q455P719O230
54714B20680L940J065j954m700o892q350q919q498p243n650m306l456k971k733
54700A60013k780l002l016k649k240k139k137j792j180q49j027j297j138n30J35
$$ y = [125119, 125641, 126511, 127434, 128490, 129644, 130350, 130076, 129161, 128683, 129396, 131026, 132728, 133916, 134493, 134537, 134109, 133345, 132541, 132084, 132238, 132878, 133501, 133795, 134108, 134993, 136254, 136993, 136828, 136601, 137502, 139797, 142748, 145448, 147427, 148786, 150198, 152528, 156087, 160448, 165200, 170477, 176446, 182875, 189755, 197734, 207072, 216558, 224423, 230078, 233955, 235791, 234376, 229303, 221910, 213953, 206100, 198210, 190334, 182802, 175834, 169717, 164976, 161824, 159662, 157604, 155256, 152699, 150046, 147515, 145600, 144624, 144216, 143660, 142732, 141853, 141528, 141994, 143287, 145313, 147839, 150689, 153985, 157990, 162778, 168269, 174513, 181681, 189733, 198276, 206731, 214450, 220680, 224620, 225685, 223731, 219031, 212139, 203789, 194870, 186372, 179129, 173479, 169173, 165717, 162746, 160013, 157233, 154231, 151215, 148566, 146326, 144187, 142050, 140258, 139078, 138229, 137202, 135905, 134767, 134237, 134372]
54685A34372N11N45L62J26l9o9j4p6m51j036j415j327r84o93l36L11R06Q18J41
54666A31652k51Q7N00K54l88o56m15j83k14k46p1J22Q5j84m52m33l0M47N55L26
54646A30505K52N14O70M19K14N62J192J422J099N77P5l79n78l96k46o33j253j260
54628A32756m33M99Q56P58O47N14l4j083k080k224j273Q1Q17O79L41L97O16N12
54610A32346J86O7J93L07M37P83J139J017L10n59j135j178o25K97J050J299J238
54593A37172J074N63l95j133r40k29o2o02q70k01Q58J341R57R0p52j234j274j033
54575A33330o68o7Q45J683J924J574J093P50M44J30j37m32p71p81j15Q37J296
54558A40935J083O82M15J39j95l49k92k32j97o4l8l81p73o00Q7O13P25Q36J128
$$ y = [134372, 134883, 135428, 135790, 135916, 135877, 135808, 135794, 135718, 135267, 134231, 132816, 131489, 130505, 129812, 129476, 129787, 130693, 131511, 131652, 131401, 131488, 131988, 132242, 131854, 131198, 130783, 130600, 130386, 130140, 130069, 130191, 130276, 130092, 129640, 129207, 129177, 129624, 130179, 130505, 130757, 131271, 131941, 132360, 132574, 133136, 134328, 135750, 136849, 137426, 137501, 137122, 136544, 136148, 135902, 135269, 134016, 132756, 132323, 132822, 133678, 134436, 135083, 135597, 135563, 134480, 132400, 130176, 128903, 128984, 129801, 130480, 130821, 131218, 131834, 132346, 132532, 132599, 132792, 133099, 133536, 134319, 135458, 136475, 136785, 136226, 135091, 133913, 133288, 133585, 134635, 135934, 137172, 138246, 138809, 138414, 137281, 136341, 136112, 136050, 135448, 134578, 134377, 135235, 136576, 137533, 137623, 136871, 135637, 134363, 133330, 132662, 132595, 133440, 135123, 137047, 138621, 139714, 140464, 140908, 141038, 140901, 140469, 139698, 138917, 138802, 139639, 140935, 142018, 142700, 143115, 143254, 143059, 142710, 142418, 142186, 141989, 141925, 141887, 141506, 140733, 140133, 140220, 140833, 141558, 142394, 143522]
54539A43522J230R63O71N88N67O27R91J412J276N90P7Oj72o78q73l42L39N45M89
54520A51828N28L92j61n84l44J47J86j15k19k14n45j054j193j025j125j526j567
54503A43409r16m5M85O42O47N37K67m8j91j6M16Q40R67P91N38K43l15j139j770
54484A45342j795j280m81N35J653K397K286J387K85l61j37Q96K033K389J800R59
54468A57908M51J13l02m36J07R09J151P17K34J54L31M88N77N79L84r6p86j484
54450A60999j871j725j219p92n33q1O21R83N61j98n83o02p34r82r07m48k7J63
54432A52625L71O66P27L71j25m23m24j57L09P83J075J264J488J522R90M6o69p88
54414A59651o01m84l99j58J38K43J51N0P3K49N61Q45P84K80k53k15M00Q84O81
$$ y = [143522, 144752, 145715, 146386, 146974, 147541, 148168, 149159, 150571, 151847, 152437, 152514, 152520, 152348, 151670, 150797, 150455, 150794, 151339, 151828, 152356, 152748, 152587, 152003, 151659, 151806, 151992, 151877, 151658, 151444, 150899, 149845, 148652, 147627, 146502, 144976, 143409, 142493, 142448, 142933, 143575, 144222, 144759, 145026, 144978, 144787, 144771, 145187, 146027, 146994, 147785, 148323, 148566, 148251, 147112, 145342, 143547, 142267, 141786, 142321, 143974, 146371, 148657, 150044, 150329, 149968, 149831, 150727, 152760, 155149, 156949, 157908, 158359, 158472, 158170, 157734, 157841, 158750, 159901, 160618, 160852, 161006, 161337, 161825, 162402, 162981, 163365, 163269, 162483, 160999, 159128, 157403, 156184, 155392, 154859, 154778, 155399, 156382, 156943, 156745, 156162, 155560, 154826, 153844, 152937, 152489, 152462, 152625, 152996, 153662, 154389, 154760, 154635, 154212, 153788, 153631, 153940, 154723, 155798, 157062, 158550, 160072, 161062, 161108, 160439, 159651, 159050, 158566, 158167, 158009, 158147, 158390, 158541, 158591, 158664, 158913, 159474, 160319, 161103, 161383, 161130, 160915, 161315, 162199, 162880]
54395A62880K05L63J231J785J274L80L46J214J743J154J11l56k44k57o60j091
54379A70078j345j587j823j633p06O06J401J038j09q14k35J087J876J750J527
54364A71111J779J926J264J86l61j60L11P84J275J489R74k7o29l39M38R57P78
54347A81756j07j273j964j675o30N86J779K976L787L573K362R29j34r27j675k222
54331A87141k341k130j836j577j444j501j513j033mR65J163M76n80j345j469j095
54315A71877p18p29j056j294j155o13K18J046J372Q30l35j377j713j257k56Q73
54299A65713J598J551R14K67n1j98m64q00q37k78P17J462J287K84o44p90m14k29
54281A69088l83m30j75N3j9k40l72l47j13L70Q16P02p2r01j080n85j08k97j057
$$ y = [162880, 163085, 163448, 164679, 166464, 167738, 168118, 168464, 169678, 171421, 172575, 172686, 172330, 172086, 171829, 171169, 170078, 168733, 167146, 165323, 163690, 162984, 163590, 164991, 166029, 165920, 165106, 164871, 165958, 167834, 169584, 171111, 172890, 174816, 176080, 176266, 175905, 175745, 176056, 176840, 178115, 179604, 180578, 180551, 179922, 179583, 180021, 180978, 181756, 181649, 180376, 178412, 176737, 176107, 176693, 178472, 181448, 185235, 188808, 191170, 192099, 191965, 191038, 189363, 187141, 184800, 182670, 180834, 179257, 177813, 176312, 174799, 173766, 173762, 174727, 175890, 176366, 175786, 174441, 172972, 171877, 171159, 170430, 169374, 168080, 166925, 166312, 166530, 167576, 168948, 169778, 169443, 168066, 166353, 165096, 164840, 165713, 167311, 168862, 169776, 170043, 169992, 169794, 169330, 168530, 167693, 167415, 168132, 169594, 170881, 171165, 170521, 169731, 169317, 169088, 168705, 168275, 168100, 168153, 168134, 167894, 167522, 167175, 167062, 167432, 168248, 168950, 168878, 167977, 166897, 166312, 166204, 165907, 164850]
54262A64850j546r84M98J896K367K013J505J241J104R00O34M66N52Q15Q24J86
54246A77321q03j322j143r52j202j324p50k3M7j66L00J185J190j7j201j326q37
54229A68977o49q08q11n54k41Q3M19N65M33K46J14j12l48j89L71O66K55m47q61
54210A67109r79r76o62O4O54N57N1j42J49N55R03J265J435J093M13k2l7k2k06
54191A71202l08r2J57Jn20q78o98j86P3k62r15j267r53j13Q09J338J198N62N5
54172A69203J36N49O87M69L23L44R9n67j104j068p18n20m65l38k41l67n72o46
54154A65204o91p79o00J00R90J529J623J466J079N19K31N06Q18M15n57j172r51
54137A69730l30J54L93L78M1l21j51N02Q23K95n53r27q18p44p74m77L05J186J750
$$ y = [164850, 163304, 162320, 162818, 164714, 167081, 169094, 170599, 171840, 172944, 173844, 174478, 174944, 175496, 176311, 177135, 177321, 176518, 175196, 174053, 173101, 171899, 170575, 169825, 169802, 169849, 169683, 169983, 171168, 172358, 172341, 171140, 169814, 168977, 168328, 167520, 166709, 166155, 165914, 165997, 166416, 166981, 167414, 167660, 167774, 167662, 167314, 167125, 167496, 168162, 168417, 167970, 167109, 166130, 165154, 164492, 164556, 165210, 165767, 165818, 165676, 165825, 166380, 167283, 168548, 169983, 171076, 171489, 171467, 171430, 171408, 171202, 170894, 170802, 170959, 170960, 170440, 169562, 168864, 168678, 168751, 168489, 167574, 166307, 165354, 165241, 166050, 167388, 168586, 169148, 169203, 169339, 169888, 170575, 171044, 171367, 171711, 171810, 171243, 170139, 169071, 168353, 167833, 167368, 167030, 166789, 166422, 165850, 165204, 164513, 163734, 163134, 163234, 164224, 165753, 167376, 168842, 169921, 170440, 170671, 171177, 171995, 172410, 171853, 170681, 169730, 169400, 169554, 169947, 170325, 170366, 170045, 169894, 170396, 171219, 171514, 170961, 170034, 169216, 168472, 167698, 167221, 167526, 168712, 170462]
54118A70462J869J541Q87L60M76J072J361J006O34Q51J175P09l62q32k13M64N8
54101A81518j058j566r59j7L97K32j09l70m31k10J60L32J60r6j43J1J84K65K64
54082A78564L55P68J444J816J371L42n68j032j173q53K94J937K917K544J453O91
54066A90870M52K52n2j34R4K84K27J61M08R54J514J940K443L309M284M623M078
54049B15707L593M352O318Q453J0257J2035J3425J2961R847N262J083j934l911
54036B97448m665l969k471j156j27J108K339K766K312J734J456J188P93N38L72
54021B99666j33r15j307j025n07r6K68L98k57j681l078l894m394m842m928m467
54005B68808l948l832l894l779l648l751l824l544l065k624k043j178m91n46j221
$$ y = [170462, 172331, 173872, 174759, 175119, 175595, 176667, 178028, 179034, 179668, 180519, 181694, 182403, 182041, 181209, 180996, 181460, 181518, 180460, 178894, 177935, 177918, 178315, 178547, 178438, 178068, 177637, 177427, 177587, 177919, 178079, 177983, 177840, 177851, 178035, 178300, 178564, 178919, 179687, 181131, 182947, 184318, 184660, 184092, 183060, 181887, 181034, 181328, 183265, 186182, 188726, 190179, 190870, 191322, 191574, 191522, 191388, 191482, 191766, 191993, 192154, 192562, 193516, 195030, 196970, 199413, 202722, 207006, 211629, 215707, 219300, 223652, 229970, 238423, 248680, 260715, 274140, 287101, 296948, 302210, 303293, 301359, 297448, 292783, 288814, 286343, 285187, 285060, 286168, 288507, 291273, 293585, 295319, 296775, 297963, 298756, 299294, 299666, 299533, 298618, 297311, 296286, 295779, 295683, 295951, 296349, 296092, 294411, 291333, 287439, 283045, 278203, 273275, 268808, 264860, 261028, 257134, 253355, 249707, 245956, 242132, 238588, 235523, 232899, 230856, 229678, 229187, 228641, 227420]
53990B27420j925k284k206j665r90r05j631k263j796n05M10M02K6r6K3J05j3n32
53972B11575j491k256j868k77J351J915J508R15M73n5p07j059p41J32J128J790
53956B12333J861J431R59R62J551K329K747K529J860J224J063J474K212K982L689
53941B41206M381N056N664O238O891P645Q390Q994R401R536R210Q243O646M656
53927C42157K608Q24m28j022j091r36p45m83j06K92O93J353K502L927N114N886
53911C60545O571P383P959P758O736N349L999K797J814J123N84j08q85j080k3
53896D10522K229M891P181R006J0946J3461J5823J5885J1478K608p921j6518k1477
53883D58114k3451k3649k2401j9701j6308j3506j1915j1072j0208r060p822o693
$$ y = [227420, 225495, 223211, 221005, 219340, 218350, 217445, 215814, 213551, 211755, 211250, 211660, 212062, 212088, 211992, 212015, 212120, 212107, 211575, 210084, 207828, 205960, 205683, 207034, 208949, 210457, 211372, 211845, 211790, 211083, 210024, 209283, 209415, 210543, 212333, 214194, 215625, 216584, 217546, 219097, 221426, 224173, 226702, 228562, 229786, 230849, 232323, 234535, 237517, 241206, 245587, 250643, 256307, 262545, 269436, 277081, 285471, 294465, 303866, 313402, 322612, 330855, 337501, 342157, 344765, 345589, 345161, 344139, 343048, 342112, 341367, 340884, 340778, 341070, 341763, 343116, 345618, 349545, 354659, 360545, 367116, 374499, 382458, 390216, 396952, 402301, 406300, 409097, 410911, 412034, 412618, 412510, 411625, 410545, 410522, 412751, 417642, 424823, 433829, 444775, 458236, 474059, 489944, 501422, 504030, 496109, 479591, 458114, 434663, 411014, 388613, 368912, 352604, 339098, 327183, 316111, 305903, 296843, 289021, 282328]
53871B82328n631m558l662l352l736m190l844k658j634j588k128k300j959j800
53857B39288k168k576k526k119j654j158o81n02p24j041j263j569j952j889j122
53842B16344k83j20m10l89j3M2l80n66p3N02M26r7k80O7L91K82Mo9J1K3J45P84
53820B16341J824K453K000Q03o7K3P29J321J508J424J141O58L56Q98K433M138
53804B37983M970M828M655N231O160O381N532M363L725L659L741L873M127M126
53790C03354L332J979J007R14J159J011M88N4j14k45n63j158k036l018l759m130
53774B98275m387m767n176n388n301m856m084l370l188l398l322k814k563k943
53760B42718l237k643j514p94p25q76j076j388j487r76k63j57o78j128j274j460
$$ y = [282328, 276697, 272139, 268477, 265125, 261389, 257199, 253355, 250697, 249063, 247475, 245347, 243047, 241088, 239288, 237120, 234544, 232018, 229899, 228245, 227087, 226406, 225904, 225180, 224139, 222876, 221307, 219355, 217466, 216344, 216061, 215941, 215531, 215142, 215129, 215171, 214791, 214225, 214152, 214654, 215080, 214983, 214703, 214770, 215161, 215443, 215447, 215378, 215389, 215412, 215557, 216341, 218165, 220618, 222618, 223421, 223354, 223377, 224106, 225427, 226935, 228359, 229500, 230158, 230514, 231412, 233845, 237983, 242953, 247781, 252436, 257667, 263827, 270208, 275740, 280103, 283828, 287487, 291228, 295101, 299228, 303354, 306686, 308665, 309672, 310586, 311745, 312756, 313244, 313298, 313184, 312939, 312376, 311218, 309182, 306164, 302405, 298275, 293888, 289121, 283945, 278557, 273256, 268400, 264316, 260946, 257758, 254360, 251038, 248224, 245661, 242718, 239481, 236838, 235324, 234530, 233805, 232929, 231853, 230465, 228978, 228002, 227739, 227582, 226904, 225776, 224502, 223042]
53744B23042j596j072M1Q26Q84Q51J126J113M08j97J69J004J140M68k8J89N77
53727B28945N31K03Q7K87N11N81O63J067J849K608K831K438J838J355Q79K87r8
53710B46862J49R76J941K753L364L628L315K534J812J621J930K396K781L088L328
53695B82478L456L527L770M227M473L959K773J663J119P40q8j188j780j553r41
53680C06635l79J13M46K24o51j541j667r34Q3P80R39P30N15M68L01l98j444k050
53662C02170j748r95n54o10q26j029j322j622j514p47L52J095J067M80r6l61n10
53645B93230p17p06j38P27J276J432J743K407K793K296J228M76N49J229J964K241
53629C12030J842J056N09N50R31J265J546J983K593L246L824M093L677K566J489
$$ y = [223042, 221446, 220374, 220415, 221241, 222125, 222976, 224102, 225215, 225623, 225426, 225595, 226599, 227739, 228207, 228179, 228368, 228945, 229476, 229679, 229766, 230053, 230564, 231145, 231808, 232875, 234724, 237332, 240163, 242601, 244439, 245794, 246673, 246960, 246862, 247011, 247987, 249928, 252681, 256045, 259673, 262988, 265522, 267334, 268955, 270885, 273281, 276062, 279150, 282478, 285934, 289461, 293231, 297458, 301931, 305890, 308663, 310326, 311445, 312185, 312097, 310909, 309129, 307576, 306635, 306256, 306369, 306815, 307039, 306388, 304847, 303180, 302246, 302329, 303109, 304048, 304778, 305293, 305761, 306062, 305664, 304220, 302170, 300422, 299427, 298873, 298263, 297437, 296408, 295086, 293464, 291950, 291203, 291555, 292650, 293717, 294197, 294101, 293740, 293230, 292513, 291807, 291669, 292396, 293672, 295104, 296847, 299254, 302047, 304343, 305571, 306047, 306596, 307825, 309789, 312030, 313872, 314928, 315437, 315987, 316918, 318183, 319729, 321712, 324305, 327551, 331375, 335468, 339145, 341711, 343200]
53614C43200J365K417M034N400N996N724M888M027L501L277L188L220L365L446
53600C97048L359L281L303L152K594J945J733J985K223K114J685J002J45m60j80
53585D24929J067K461L015K500J515P22K68j69r01j903k839l377l510l545l786
53570D16447m195m398m119l553l139k948k562j694o92j41j30k18o7K32M10L11
53554C89544K5o8M74J519K184J760O84rpJ64K87Q31K023L322M163M563M647M344
53536D20450L909M079N093O190O595O518O542O671O715P121Q499J0518J2067J2524
53522E23491J2288J2126J2540J3604J4885J5579J5322J4785J5049J6403J8224
53511F84296J9852K1129K2178K3172K4297K5534K6521K6956K7034K7049K6827
$$ y = [343200, 344565, 346982, 351016, 356416, 362412, 368136, 373024, 377051, 380552, 383829, 387017, 390237, 393602, 397048, 400407, 403688, 406991, 410143, 412737, 414682, 416415, 418400, 420623, 422737, 424422, 425424, 425569, 425109, 424929, 425996, 428457, 431472, 433972, 435487, 436209, 436477, 436308, 435407, 433504, 430665, 427288, 423778, 420233, 416447, 412252, 407854, 403735, 400182, 397043, 394095, 391533, 389839, 389147, 389006, 388876, 388658, 388591, 388823, 389233, 389544, 389569, 389501, 389975, 391494, 393678, 395438, 396122, 396113, 396106, 396270, 396557, 397388, 399411, 402733, 406896, 411459, 416106, 420450, 424359, 428438, 433531, 439721, 446316, 452834, 459376, 466047, 472762, 479883, 488382, 498900, 510967, 523491, 535779, 547905, 560445, 574049, 588934, 604513, 619835, 634620, 649669, 666072, 684296, 704148, 725277, 747455, 770627, 794924, 820458, 846979, 873935, 900969, 928018, 954845]
53500I54845K6056K4975K4135K3584K2837K1707K0621K0048K0022K0297K0645
53489A199772K0877K0875K0582J9933J8907J7867J7413J7605J7761J7445J7206
53478A406243J7729J8637J8920J8257J7103J5648J3572J0872Q076N476K829Pk744
53465A550625n315p980j0807j3372j5193j6085j6014j5139j4127j3826j4467j5599
53453A392701j6892j8515k0540k2512k3855k4309k3814k2472k0818j9720j9638
53442A159616k0162k0398j9598j7502j4455j1253q562o454m781l727l530l769
53430A025425l579k540q39J280L529N187N620N399N970P882J0145J1715J2840
53417A088034J4381J6441J8387J9812K0847K1726K2557K3480K4676K6263K8215
$$ y = [954845, 980901, 1005876, 1030011, 1053595, 1076432, 1098139, 1118760, 1138808, 1158830, 1179127, 1199772, 1220649, 1241524, 1262106, 1282039, 1300946, 1318813, 1336226, 1353831, 1371592, 1389037, 1406243, 1423972, 1442609, 1461529, 1479786, 1496889, 1512537, 1526109, 1536981, 1545057, 1550533, 1553362, 1553369, 1550625, 1545310, 1537330, 1526523, 1513151, 1497958, 1481873, 1465859, 1450720, 1436593, 1422767, 1408300, 1392701, 1375809, 1357294, 1336754, 1314242, 1290387, 1266078, 1242264, 1219792, 1198974, 1179254, 1159616, 1139454, 1119056, 1099458, 1081956, 1067501, 1056248, 1047686, 1041232, 1036451, 1032724, 1029194, 1025425, 1021846, 1019306, 1018467, 1019747, 1023276, 1028463, 1034083, 1039482, 1045452, 1053334, 1063479, 1075194, 1088034, 1102415, 1118856, 1137243, 1157055, 1177902, 1199628, 1222185, 1245665, 1270341, 1296604, 1324819]
53406A324819L0255L1854L2691L3205L4269L6276L8937M1880M4943M7815N0100
53395A747044N1916N3786N5720N7114N7843N8630N9869O0798O0491N9152N7697
53384B380060N6438N4893N2718N0272M8128M6428M4706M2255L8774L4627L0325
53373B879624K5923K1324J7014J3633J0772P062J723m834j2223k0844l0658m0148
53361B868368m7490n2293n5408n7479n8578n8897n8883n8729n8357n7708n6500
53350B248046n4085n0380m6557m4003m2800m2076m1642m2166m3685m4935m4634
53339A751083m2728m0053l7349l4924l2742l0508k7934k5192k2709k0438j7805
53328A418701j4625j1689j0032r948j0993j2654j4619j6454j7496j7297j6060
$$ y = [1324819, 1355074, 1386928, 1419619, 1452824, 1487093, 1523369, 1562306, 1604186, 1649129, 1696944, 1747044, 1798960, 1852746, 1908466, 1965580, 2023423, 2082053, 2141922, 2202720, 2263211, 2322363, 2380060, 2436498, 2491391, 2544109, 2594381, 2642509, 2688937, 2733643, 2775898, 2814672, 2849299, 2879624, 2905547, 2926871, 2943885, 2957518, 2968290, 2975352, 2977075, 2972241, 2960018, 2939174, 2908516, 2868368, 2820878, 2768585, 2713177, 2655698, 2597120, 2538223, 2479340, 2420611, 2362254, 2304546, 2248046, 2193961, 2143581, 2097024, 2053021, 2010221, 1968145, 1926503, 1884337, 1840652, 1795717, 1751083, 1708355, 1668302, 1630953, 1596029, 1563287, 1532779, 1504845, 1479653, 1456944, 1436506, 1418701, 1404076, 1392387, 1382355, 1372407, 1361414, 1348760, 1334141, 1317687, 1300191, 1282894, 1266834]
53317A266834j4508j3272j2410j1563j0453r133p763o314m598k543m83R06J109
53304A175809M33l0O61K510M950P714J0759J3627J5677J7023J8474K0366K2193
53291A310166K3640K5150K7049K8847K9966L0429L0318K9243K7137K4874K3316
53280A610135K2221K0862J9205J7525J5333J1833P268K796r07m050o790q904j0529
53267A695998j2345j4748j7484k0234k2888k5210k6883k8061k9184l0187l0622
53256A438152l0579l0747l1310l1630l1295l0656l0000k8900k7018k4936k3566
53245A117515k3153k3368k3947k4701k5181k5009k4401k3893k3570k2972k1814
53234H55506k0376j9039j7676j5773j3190j0627r085q787q902q566p890p662q244
$$ y = [1266834, 1252326, 1239054, 1226644, 1215081, 1204628, 1195495, 1187732, 1181418, 1176820, 1174277, 1173794, 1174700, 1175809, 1176242, 1176212, 1176873, 1179383, 1184333, 1192047, 1202806, 1216433, 1232110, 1249133, 1267607, 1287973, 1310166, 1333806, 1358956, 1386005, 1414852, 1444818, 1475247, 1505565, 1534808, 1561945, 1586819, 1610135, 1632356, 1653218, 1672423, 1689948, 1705281, 1717114, 1724382, 1727178, 1726271, 1722221, 1715431, 1706527, 1695998, 1683653, 1668905, 1651421, 1631187, 1608299, 1583089, 1556206, 1528145, 1498961, 1468774, 1438152, 1407573, 1376826, 1345516, 1313886, 1282591, 1251935, 1221935, 1193035, 1166017, 1141081, 1117515, 1094362, 1070994, 1047047, 1022346, 997165, 972156, 947755, 923862, 900292, 877320, 855506, 835130, 816091, 798415, 782642, 769452, 758825, 749740, 740953, 732051, 723485, 715595, 707933, 699689]
53221F99689r245j0239j1257j2462j3752j4875j5661j6030j6054j5966j5820j5160
53209E33168j3509j1270r578r066r137q779p827p002o947p533q201q656r049r530
53195D07084r820r533q829q348q342q268p522o237m971m022l460l453l913m113
53181C16253l411k247j654j844k051j710j065m78lK24r2p25r53n81l52q80j819
53164B96612k423k457k107j562j128j240j857k212j655n31K48J65n70j412j808
53149B76063j545r68o68p20o52l43l50j006j756j882j446r63n80j74J26J36R4
53132B63366L38O94P21M37K74M05O32Q38J108J450J721J805J569Q99J8m91m19
53115B75365k85n88j014j043q89j120j574j556j068r46j586k319k372j746q44
$$ y = [699689, 690444, 680205, 668948, 656486, 642734, 627859, 612198, 596168, 580114, 564148, 548328, 533168, 519659, 508389, 498811, 489745, 480608, 471829, 464002, 457000, 450053, 442520, 434319, 425663, 416614, 407084, 397264, 387731, 378902, 370554, 362212, 353944, 346422, 340185, 335214, 331192, 327732, 324279, 320366, 316253, 312842, 310595, 308941, 307097, 305046, 303336, 302271, 301793, 301790, 302014, 301922, 301197, 300244, 299663, 299311, 298431, 296612, 294189, 291732, 289625, 288063, 286935, 285695, 283838, 281626, 279971, 279440, 279688, 279853, 279283, 277871, 276063, 274518, 273550, 272882, 272162, 271510, 271167, 270817, 269811, 268055, 266173, 264727, 263764, 263184, 263010, 263136, 263272, 263366, 263704, 264398, 265119, 265556, 265830, 266235, 266867, 267705, 268813, 270263, 271984, 273789, 275358, 276257, 276275, 275784, 275365, 275080, 274492, 273478, 272435, 271546, 270426, 268852, 267296, 266228, 265282, 263696, 261377, 259005, 257259, 256415]
53100B56415J43R81J139M39l63l07N34J115P38r8m06K8L82j63j347k027j471j67
53082B55565Q05J020Q92Q31P42N56O10J106J515J161K67j94J56N27R7o75n74O24
53064B65031J621J151m51j734j897j434j163j225j298j228j091r28q43j021j350
53049B52140j255l71Q18J418J186O60K96j0m06o96o72n23n07n03k56R9J51k33
53031B51336q04j334j740j815j284k87N72Q83Q27O59K68l54n89J68J456K142J867
53014B51971J430J489J662J355P93N97Q07J001J041J030P70N8o50o55n7L58L04
52997B63304K99O28Q31M95j02n47r45j469j792j484o93O3O24J222J918K348K124
52980B66824J276K61m02m80n5P39J734K486K407J578R78J342K077K080J402J124
$$ y = [256415, 256558, 257539, 258678, 259117, 258754, 258447, 258981, 260096, 260834, 260736, 260330, 260358, 260740, 260577, 259230, 257203, 255732, 255565, 256370, 257390, 258282, 259113, 259855, 260411, 261021, 262127, 263642, 264803, 265070, 264876, 265032, 265559, 265656, 264981, 264407, 265031, 266652, 267803, 267352, 265618, 263721, 262287, 261124, 259899, 258601, 257373, 256282, 255354, 254511, 253490, 252140, 250885, 250514, 251332, 252750, 253936, 254596, 254892, 254882, 254476, 253780, 253108, 252585, 252078, 251575, 251319, 251418, 251569, 251336, 250532, 249198, 247458, 245643, 244359, 244072, 244644, 245527, 246354, 247013, 247281, 246927, 246338, 246506, 247962, 250104, 251971, 253401, 254890, 256552, 257907, 258700, 259297, 260104, 261105, 262146, 263176, 263946, 264004, 263354, 262699, 262642, 263000, 263304, 263603, 264231, 265062, 265557, 265455, 264908, 263963, 262494, 260702, 259218, 258525, 258588, 259212, 260434, 262352, 264700, 266824, 268100, 268361, 267959, 267479, 267424, 268163, 269897, 272383, 274790, 276368, 277346, 278688, 280765, 282845, 284247, 285371]
52964B85371J589J868J286M18N9Q6J5j06r2k74r80j890k517k938l294l184k300
52947B73117j215o74n39k81j18n61j148q12L75J066N08m27n53Q3N47L17m07j268
52929B68010j997k309k038j423r25p05n05j52Q8j37n93o03pL82j00p88m32R40
52911B56706J875J515P25O01Q57N56k51p83q99j092j348j133m21J75L63L90L38
52894B58174M3k77k12P7J17J43P62J640J672P45J11N04J041P06j10m27k44k39
52876B64226m25k32K98L51m52j399j452l11J368K615K929K589K264K297K529K660
52860B79855K515J933Q33m98j578k201k376j932p86L29L20q12j771j705j320j681
52844B69125k608l169l166l104k958k125p21J26l45j470j987j487o86m19p62j091
$$ y = [285371, 286960, 288828, 290114, 290532, 290591, 290677, 290692, 290586, 290494, 290220, 289240, 287350, 284833, 281895, 278601, 275417, 273117, 271902, 271228, 270689, 270408, 270290, 269729, 268581, 267769, 268144, 269210, 269718, 269291, 268738, 268821, 269368, 269685, 269278, 268010, 266013, 263704, 261666, 260243, 259318, 258613, 258108, 257956, 258044, 257907, 257314, 256711, 256704, 257086, 256986, 256198, 255766, 256706, 258581, 260096, 260821, 261422, 262279, 262835, 262584, 261801, 260902, 259810, 258462, 257329, 256908, 257083, 257446, 257836, 258174, 258217, 257940, 257728, 257805, 257922, 258065, 258827, 260467, 262139, 262884, 262995, 263499, 264540, 265246, 265136, 264709, 264465, 264226, 263801, 263569, 263867, 264218, 263766, 262367, 260915, 260604, 261972, 264587, 267516, 270105, 272369, 274666, 277195, 279855, 282370, 284303, 285136, 284638, 283060, 280859, 278483, 276551, 275765, 276094, 276414, 275602, 273831, 272126, 270806, 269125, 266517, 263348, 260182, 257078, 254120, 251995, 251274, 251400, 251055, 249585, 247598, 246111, 245425, 245006, 244244, 243153]
52828B43153q31q0N94Q82J025J197J007K5j348k075j681p99l49m73n89k74K97
52811B39681P60J052J383J859K363K677K602K003R68r7q03j217j754k522l115
52796B45840l116k561j750r90p00j222k152k413j548m49j36l21p2N08M00n23j144
52779B27651o95L34J226J991K695K878K308J555J139P38r3j006j486j725k070
52764B35440k093j134M58J562J641J102M99O0o6K20O44P97O75N35L60m3m97o06
52746B39554l61r2J59O02J168J508J583J694J880J829J417R36P31R59J635K464
52730B57666K756K099J095P60J143J244M56o17j147j240j546k112k265j574m46
52715B56272L10K88k40p34r35j015j197j391j311q43j65M54P87O86J78m75r49
$$ y = [243153, 242322, 242242, 242836, 243718, 244743, 245940, 246947, 246972, 245624, 243549, 241868, 241069, 240720, 240247, 239658, 239384, 239681, 240441, 241493, 242876, 244735, 247098, 249775, 252377, 254380, 255348, 255251, 254448, 253231, 251477, 248955, 245840, 242724, 240163, 238413, 237423, 236723, 235501, 233349, 230936, 229388, 228939, 228803, 228482, 228410, 228918, 229318, 228795, 227651, 226956, 227290, 228516, 230507, 233202, 236080, 238388, 239943, 241082, 241820, 241727, 240721, 239235, 237510, 235440, 233347, 232213, 232671, 234233, 235874, 236976, 237475, 237535, 237469, 237689, 238333, 239130, 239805, 240340, 240700, 240657, 240160, 239554, 239193, 239101, 239260, 239862, 241030, 242538, 244121, 245815, 247695, 249524, 250941, 251877, 252608, 253567, 255202, 257666, 260422, 262521, 263616, 264376, 265519, 266763, 267219, 266602, 265455, 264215, 262669, 260557, 258292, 256718, 256272, 256582, 256870, 256630, 255896, 254961, 253946, 252749, 251358, 250047, 249204, 249039, 249493, 250280, 250966, 251144, 250669, 249720]
52698B49720j043p45k18J41K5l41l53J88P91J031J097J294J447J373J431J937
52682B57775K371J932P39l48q76j073j061p20l82o92j514j830j124r6L54K38M3
52665B53736j19l35l40J69Q90J163P92K23LL93J350K543L447L643L137K292J492
52648B74479Q77K19q01k053k799k509j677j305j589j738j203l76J75N10R02J210
52632B62322J185J023J108J617K673M487O719Q100P375M583R74k109l928m338
52618B91791l755l032k786k775k386j580r33p41p11n35l11j95n1L46J005J693
52602B75044K094K002J557J200J213J327J128P15N95R16J217R92K44o17j140j100
52586B87387o64l33l82l89L36J706K708K566J670J014Q94O99r3j144j728j628
$$ y = [249720, 248677, 247932, 247714, 247855, 247880, 247539, 247186, 247374, 248165, 249196, 250293, 251587, 253034, 254407, 255838, 257775, 260146, 262078, 262817, 262469, 261593, 260520, 259459, 258739, 258357, 257665, 256151, 254321, 253197, 253101, 253455, 253693, 253736, 253617, 253282, 252942, 253111, 254001, 255164, 255956, 256179, 256182, 256575, 257925, 260468, 263915, 267558, 270695, 272987, 274479, 275356, 275575, 274774, 272721, 269922, 267413, 265736, 264431, 262842, 261104, 259901, 259525, 259700, 260210, 261112, 262322, 263507, 264530, 265638, 267255, 269928, 274415, 281134, 289234, 296609, 301192, 302166, 300057, 296129, 291791, 288036, 285004, 282218, 279443, 277057, 275477, 274544, 273803, 273092, 272557, 272246, 272051, 272000, 272346, 273351, 275044, 277138, 279140, 280697, 281897, 283110, 284437, 285565, 286280, 286875, 287791, 289008, 290000, 290244, 289627, 288487, 287387, 286723, 286390, 286008, 285619, 285955, 287661, 290369, 292935, 294605, 295619, 296513, 297212, 297119, 295975, 294247, 292619]
52570B92619j221q19l49K56P18P40M31R5k28o75j090j166j007j077j417j430p37
52553B83643K04P07P15N79L17l46j300j920j734r19j43J1m77r33o17L33R38O11
52535B79669k7q1L33M23M0j99m1M8j46j46L63R07R05M29j18n58p43l24P86J962
52515B83482K468K299K038K108K529L197L959M584N005N389N698N386L947J594
52501C33683j001l336n053n654m967l790l336l838m317l896k758j652r25m84k24
52486B88452j05lJ27J78J97N27J280J930J867J260R08J243J821J901J228J70o26
52469C02355o19L10J696K731K889K355J774J696K253L179L988M145L303J508p53
52454C32810k768l969m256m005l667l412l187l083l322l818m005l416k291j313
$$ y = [292619, 291398, 290579, 290230, 290486, 291204, 291944, 292375, 292470, 292242, 291567, 290477, 289311, 288304, 287227, 285810, 284380, 283643, 283847, 284554, 285269, 285848, 286165, 285819, 284519, 282599, 280865, 279946, 279803, 279814, 279337, 278404, 277787, 278120, 279058, 279669, 279642, 279561, 279894, 280317, 280357, 280158, 280117, 280165, 280019, 279873, 280236, 281143, 282048, 282477, 282359, 281801, 281058, 280734, 281520, 283482, 285950, 288249, 290287, 292395, 294924, 298121, 302080, 306664, 311669, 317058, 322756, 328142, 332089, 333683, 332682, 329346, 324293, 318639, 313672, 309882, 306546, 302708, 298391, 294495, 291737, 290085, 289160, 288676, 288452, 288347, 288344, 288471, 288649, 288846, 289373, 290653, 292583, 294450, 295710, 296618, 297861, 299682, 301583, 302811, 302981, 302355, 301736, 302046, 303742, 306473, 309362, 311717, 313491, 315187, 317440, 320619, 324607, 328752, 332055, 333563, 332810, 330042, 326073, 321817, 317812, 314145, 310733, 307546, 304463, 301141, 297323, 293318, 289902, 287611, 286298]
52440B86298q10n33k12N7J08J1j61n45j141j484j126k71M38P43Q76R21O84L21
52422B84174M46J198J768J388M31r7J07N04Q03J359K393L511M325M979N687O314
52406C19290O899Q069J0338J3124J5080J5219J3313R440L926k153p183j0180j1454
52393C83728j1838j1629j0589q723o581m794l561k651j719o14M70J160J248Q82
52379C24789M33K29M31J007J772K547L345M295N325O073O265O111O115O486O756
52364C81979O123M209J542q11k126k495k367j951j288o92o29j066j424j238o11
52349C77155J29P86J229J421J714K624L979M800M494L774L711M337M854N051N516
52334D25574O455P243P538Q040R485J1432J2796J3335J3883J5135J6849J8477
$$ y = [286298, 285488, 284955, 284743, 284800, 284908, 284919, 284758, 284213, 283072, 281588, 280462, 280191, 280629, 281372, 282248, 283169, 283853, 284174, 284620, 285818, 287586, 288974, 289405, 289308, 289415, 289919, 290722, 292081, 294474, 297985, 302310, 307289, 312976, 319290, 326189, 334258, 344596, 357720, 372800, 388019, 401332, 410772, 414698, 412545, 405362, 395182, 383728, 371890, 360261, 349672, 340949, 334368, 329574, 326013, 323362, 321643, 321029, 321499, 322659, 323907, 324789, 325222, 325451, 325882, 326889, 328661, 331208, 334553, 338848, 344173, 350246, 356511, 362622, 368737, 375223, 381979, 388102, 392311, 393853, 393042, 390916, 388421, 386054, 384103, 382815, 382123, 381494, 380428, 379004, 377766, 377155, 377284, 378070, 379299, 380720, 382434, 385058, 389037, 393837, 398331, 402105, 405816, 410153, 415007, 420058, 425574, 432029, 439272, 446810, 454850, 464335, 475767, 488563, 501898, 515781, 530916, 547765, 566242]
52322E66242K0039K1874K3739K4750K4358K3042K1675K0561J9570J9004J9543
52311H04397K1079K2390K2547K2069K1946K2074K1608K0628K0200K0610K0733
52300A040281J9675J8066J7014J6497J5613J3862J1343Q073M070j45l892p090
52288A153367r989j2255j3211j2948j2358j1929j1302j0261r313q821q234o836
52276A025910m752k662q05J053K880M360N610P322R945J2999J5486J6808J7145
52263A111299J7071J6965J6797J6399J5875J5612J5891J6527J7032J7064J6608
52252A293140J5867J5055J4297J3475J2136R721O022J534k796o181q542j0402
52240A353326j2281j4142j5557j6296j6625j6893j7082j6972j6624j6387j6386
$$ y = [566242, 586281, 608155, 631894, 656644, 681002, 704044, 725719, 746280, 765850, 784854, 804397, 825476, 847866, 870413, 892482, 914428, 936502, 958110, 978738, 998938, 1019548, 1040281, 1059956, 1078022, 1095036, 1111533, 1127146, 1141008, 1152351, 1160424, 1164494, 1164349, 1160457, 1153367, 1143378, 1131123, 1117912, 1104964, 1092606, 1080677, 1069375, 1059114, 1049801, 1040980, 1032746, 1025910, 1021158, 1018496, 1017691, 1018744, 1021624, 1025984, 1031594, 1038916, 1048861, 1061860, 1077346, 1094154, 1111299, 1128370, 1145335, 1162132, 1178531, 1194406, 1210018, 1225909, 1242436, 1259468, 1276532, 1293140, 1309007, 1324062, 1338359, 1351834, 1363970, 1373691, 1379713, 1381247, 1378451, 1372270, 1363728, 1353326, 1341045, 1326903, 1311346, 1295050, 1278425, 1261532, 1244450, 1227478, 1210854, 1194467, 1178081]
52229A178081j6290j5712j4672j3472j2298j1189j0238r525q806p630n901m150
52217A048198l003k555k407k122j431j74J596L434M807N601O087O366O188N471
52203A076056M594L970L581L299L330M001N127O071O420O385O415O722P246P860
52189A151077Q356Q394P616N998L923J889L7j929m250o632q492r652j0523j1424
52175A134388j2047j1920j1128j0190r353q343o899n169l544k302j445o61N23
52162A051910K283M178N560O352P017P711P846O817M842K769J133j77j328j987
52148A104926j636l50J039J688J490J004P46Q19J118J461J479Q12k92r71o70K62
52132A112925J259K412M153O408Q850J1727J5529J9840K3455K5896K7930L0259
$$ y = [1178081, 1161791, 1146079, 1131407, 1117935, 1105637, 1094448, 1084210, 1074685, 1065879, 1058249, 1052348, 1048198, 1045195, 1042640, 1040233, 1038111, 1036680, 1036506, 1038102, 1041536, 1046343, 1051944, 1058031, 1064397, 1070585, 1076056, 1080650, 1084620, 1088201, 1091500, 1094830, 1098831, 1103958, 1110029, 1116449, 1122834, 1129249, 1135971, 1143217, 1151077, 1159433, 1167827, 1175443, 1181441, 1185364, 1187253, 1187290, 1185361, 1181111, 1174479, 1165987, 1156335, 1145812, 1134388, 1122341, 1110421, 1099293, 1089103, 1079750, 1071407, 1064508, 1059339, 1055795, 1053493, 1052048, 1051387, 1051910, 1054193, 1058371, 1063931, 1070283, 1077300, 1085011, 1092857, 1099674, 1104516, 1107285, 1108418, 1108241, 1106913, 1104926, 1103290, 1102940, 1103979, 1105667, 1107157, 1108161, 1108907, 1109726, 1110844, 1112305, 1113784, 1114596, 1114304, 1113333, 1112663, 1112925, 1114184, 1116596, 1120749, 1127157, 1136007, 1147734, 1163263, 1183103, 1206558, 1232454, 1260384, 1290643]
52120A290643L2516L4082L5080L5863L6098L5217L3473L1719L0377K9186K7785
52109A652039K5924K3299J9841J6150J3083J0944R557Q836Q700Q546P682O238
52097A810839M928L859K296k10l317o667j0459j4811j9221k3098k6255k8472k9196
52084A660216k8275k6467k4508k2126j8655j4322j0133o657l757j497l62j81M08
52071A503684K766O769J1003J4245J6373J7816J8725J9012J8999J9417K0498K1441
52059A690748K1198J9774J8221J7333J6780J5853J4489J3078J1598R524O559K925
52047A858080j061n272r502j3413j6854j9957k2762k4964k6263k6710k6607k6189
52035A638526k5537k4692k3749k2873k2186k1533k0598j9358j8268j7695j7418
$$ y = [1290643, 1323159, 1357241, 1392321, 1428184, 1464282, 1499499, 1532972, 1564691, 1595068, 1624254, 1652039, 1677963, 1701262, 1721103, 1737253, 1750336, 1761280, 1770837, 1779673, 1788373, 1796919, 1804601, 1810839, 1815767, 1819626, 1821922, 1821712, 1818395, 1811728, 1801269, 1786458, 1767237, 1744139, 1717884, 1689412, 1660216, 1631941, 1605474, 1580966, 1558840, 1540185, 1525863, 1515730, 1509073, 1505316, 1503819, 1503457, 1503276, 1503684, 1506450, 1513219, 1524222, 1538467, 1554840, 1572656, 1591381, 1610393, 1629392, 1648809, 1669307, 1690748, 1711946, 1731720, 1749941, 1767274, 1784054, 1799907, 1814396, 1827474, 1839072, 1848596, 1855155, 1858080, 1857019, 1851747, 1842245, 1828832, 1811978, 1792021, 1769259, 1744295, 1718032, 1691322, 1664715, 1638526, 1612989, 1588297, 1564548, 1541675, 1519489, 1497956, 1477358, 1458000, 1439732, 1422037, 1404619]
52024A404619j7095j6975j7496j8265j8234j7090j5681j4742j3897j2507j0860
52013A231777r779r462r448r461r518r449r151r188j0286j2109j3564j4393j5607
52000A090362j7794j9965k0788k0297j9541j8890j7665j5328j2271r361p382o955
51988I04125q317j0828j3195j4539j4978j5101j5183j5165j5021j4863j4879j5292
51976G36764j6184j7142j7457j6793j5429j3625j1172q000m741k149j21K041M424
51963F20416O302P204P583Q099Q720Q856Q025O034K893r79m697p506r335j0423
51949F51192j0690r949q553p132n665l504m54K719N249P214R111J0986J2554J3786
51935F66864J4763J5149J4479J2960J1216R176N908R72m579r105j2027j4051j6002
$$ y = [1404619, 1387524, 1370549, 1353053, 1334788, 1316554, 1299464, 1283783, 1269041, 1255144, 1242637, 1231777, 1221998, 1212536, 1203088, 1193627, 1184109, 1174660, 1165509, 1156321, 1146035, 1133926, 1120362, 1105969, 1090362, 1072568, 1052603, 1031815, 1011518, 991977, 973087, 955422, 940094, 927823, 918462, 911080, 904125, 895808, 884980, 871785, 857246, 842268, 827167, 811984, 796819, 781798, 766935, 752056, 736764, 720580, 703438, 685981, 669188, 653759, 640134, 628962, 620962, 616221, 614072, 613951, 615992, 620416, 626718, 633922, 641505, 649604, 658324, 667180, 675205, 681239, 684132, 683153, 678456, 670950, 661615, 651192, 640502, 630553, 622000, 614868, 609203, 605699, 605245, 607964, 613213, 620427, 629538, 640524, 653078, 666864, 681627, 696776, 711255, 724215, 735431, 744607, 750515, 751487, 746908, 737803, 725776, 711725, 695723]
51922F95723j7925j9342j9838j9319j8041j6585j5466j4500j2910j0290p236m774
51910E19497l281k308j274J05K002M571P594J0392J2410J3717J4760J5759J6602
51897F10546J7153J7320J6950J5920J4324J2224R157M272k824j1278j9089k4149
51885F60526k5590k4443k2701k1303j9283j5315r863m909j583R36L814O820Q915
51872E36021R778R790R038P341N072K890P13k017n090p470q656r138r218q439
51858E30615o623m502k660p16J634L580M190L821L498L268K309M35j569l194m671
51843E29415o055o912p169p376p715p577o610n442m768m338l483k156p98M99J892
51828D61407L101L500K923J827O88l64j329k192l018l814m275m024l080j826n49
$$ y = [695723, 677798, 658456, 638618, 619299, 601258, 584673, 569207, 554707, 541797, 531507, 524271, 519497, 516216, 513908, 512634, 512739, 514741, 519312, 526906, 537298, 549708, 563425, 578185, 593944, 610546, 627699, 645019, 661969, 677889, 692213, 704437, 713594, 717866, 715042, 703764, 684675, 660526, 634936, 610493, 587792, 566489, 547206, 531891, 522028, 517119, 515536, 516472, 520286, 527106, 536021, 545799, 555589, 564627, 571968, 577040, 579930, 580643, 578626, 573536, 566066, 557410, 548272, 539054, 530615, 523992, 519490, 516830, 516114, 517748, 521328, 525518, 529339, 532837, 536105, 538414, 538849, 537280, 534086, 529415, 523360, 516448, 509279, 501903, 494188, 486611, 480001, 474559, 469791, 465453, 461970, 459814, 459016, 459515, 461407, 464508, 468008, 470931, 472758, 473446, 473082, 471753, 469561, 466543, 462729, 458454, 454430, 451350, 449524, 448975]
51813D48975N82J267J248Q68Q49J339J587Q49o85k189l147l617l734l408k548
51798D38236j321n9R43J536J733J644J283M44j043k815l965l718k222m72N43N72
51782D31319Ro68j209j523j622j635j642j487r90l10K40Q40K160M453P054R116
51766D44105J0550J1719J2498J2344J1228R719P974N362J538k704o135q336r730
51753E00132j0709j1297j1444j1096j0077q454o851n869n151l762j525O73K074
51740D16644K935L867M988O168P566R257J0764J1572J1704J1198R445O047K085
51727E14240n88j356j184p63M18K503L925K789q25m940p731q668p975o110l898
51712D79837k298j686j838k651m128n627o035n001l261j366J050M187O910P592
$$ y = [448975, 449557, 450824, 452072, 452940, 453789, 455128, 456715, 457564, 456879, 454690, 451543, 447926, 444192, 440784, 438236, 436915, 436856, 437799, 439335, 441068, 442712, 443995, 444439, 443396, 440581, 436616, 432898, 430676, 430204, 430747, 431319, 431328, 430660, 429451, 427928, 426306, 424671, 423029, 421542, 420552, 420242, 420482, 421322, 423482, 427935, 434989, 444105, 454655, 466374, 478872, 491216, 502444, 512163, 520137, 525499, 527037, 524333, 518198, 509862, 500132, 489423, 478126, 466682, 455586, 445509, 437055, 430204, 424335, 419184, 415422, 413897, 414570, 416644, 419579, 423446, 428434, 434602, 442168, 451425, 462189, 473761, 485465, 496663, 506108, 512155, 514240, 513652, 512296, 511112, 510349, 510767, 513270, 517195, 519984, 519159, 514219, 506488, 497820, 489845, 483735, 479837, 477539, 475853, 474015, 471364, 467236, 461609, 455574, 450573, 447312, 445946, 446996, 451183, 458093, 465685]
51698D65685N803K630m03k192k299j123L18J440K659M298N274L948L05l699o204
51683D76440p066p130o803n990m809l518k037j86J714K992L289K797J918J018
51669D52629M02L00R17K531N184Q125J0056J0285R240P474M745P51l686p069q647
51654D93237q603p083m076k38L350O588J0378J4539J6725J4504Q088J45o703j1409
51640E29442j3988j4739j4237j3212j2053j0689r135p615o132m417k425m94J141
51627D21447K483L411L656L299K716J876L58j612k903k824k163k174k902l324
51613D21344k930k346k326k853l451l805l805l402k705j937j110k4J298K482L368
51598C97798M346N868P818R760J1665J3959J6582J8273J7233J2730O005o80n800
$$ y = [465685, 471488, 474118, 473715, 471523, 469224, 468101, 468419, 469859, 472518, 476816, 482090, 486038, 486343, 482644, 476440, 469374, 462244, 455441, 449451, 444642, 441124, 439087, 438901, 440615, 443607, 446896, 449693, 451611, 452629, 453031, 453331, 454248, 456779, 461963, 470088, 480144, 490429, 499669, 507143, 511888, 512639, 508953, 501884, 493237, 484634, 477551, 473475, 473237, 476587, 483175, 493553, 508092, 524817, 539321, 547409, 547554, 540851, 529442, 515454, 500715, 486478, 473266, 461213, 450524, 441389, 433774, 427642, 423225, 420800, 420306, 421447, 423930, 427341, 430997, 434296, 437012, 438888, 439246, 437634, 434731, 431907, 429744, 427570, 424668, 421344, 418414, 416068, 413742, 410889, 407438, 403633, 399828, 396426, 393721, 391784, 390674, 390650, 391948, 394430, 397798, 402144, 408012, 415830, 425590, 437255, 451214, 467796, 486069, 503302, 516032, 522037, 521357, 515557]
51585E15557r150j0887j0784q918o358m326k858j074J311L737O094R135J3017
51572D94496J6328J7524J6851J6097J6679J8676K1351K3687K4480K3082K0494
51561G09745J9166K1095K6311L3247M0289M6662N2051N5673N5850N0743M0017
51550A150849K5722J1129j611j2480k2485l2060m0668m7418n1632n3154n2479
51539H73713n0458m7620m3904l9201l3868k8462k3360j8957j5887j4468j4047
51528E43481j3421j1979j0011p972n990m287l476l914m992n643n521n246n388
51515D55641n610n209m195l345l143l167k790k085j642j706j958k065j961j587
51501D15178q73o5M07O42J281K574L946M867N671O810P760P470N776L617J802
$$ y = [515557, 506407, 495520, 484736, 475818, 469460, 465134, 462276, 461202, 462513, 466250, 472344, 481479, 494496, 510824, 528348, 545199, 561296, 577975, 596651, 618002, 641689, 666169, 689251, 709745, 728911, 750006, 776317, 809564, 849853, 896515, 948566, 1004239, 1060089, 1110832, 1150849, 1176571, 1187700, 1186089, 1173609, 1151124, 1119064, 1078396, 1030978, 979346, 926192, 873713, 823255, 775635, 731731, 692530, 658662, 630200, 606840, 587883, 571996, 557528, 543481, 530060, 518081, 508070, 500098, 494108, 489821, 486345, 482431, 477439, 471796, 466275, 461029, 455641, 450031, 444822, 440627, 437282, 434139, 430972, 428182, 426097, 424455, 422749, 420791, 418726, 416765, 415178, 414305, 414240, 414647, 415289, 416570, 419144, 423090, 427957, 433628, 440438, 448198, 455668, 461444, 465061, 466863]
51486D66863L58q40j575j866k289l198m087m322m166m425n311o210o593o535o291
51471D09513n883n285m724m437m376m262l864l114k153j310r30j070j442j717
51457C64946j768j586j120l37O54J644K467L063L459L780M203M862N846P295R439
51442D06847J2406J5977J9482K1804K1619J7985J1218L326k759m972l515n45J595
51429E20468J809J33l153p636j2154j4951j5028j3069j0595q436o548m896l766
51416D22178l142k539j763j210j052p39J86J255J730J740J993K530K629K064J668
51401D27528K189L198L648L288K901L292M418N679O644P358Q063Q843R606J0348
51387E07003J1263J2539J4116J5927J8288K1796K6755L2891L9658M6490N2863
$$ y = [466863, 467221, 466381, 464806, 462940, 460651, 457453, 453366, 449044, 444878, 440453, 435142, 428932, 422339, 415804, 409513, 403630, 398345, 393621, 389184, 384808, 380546, 376682, 373568, 371415, 370105, 369175, 368105, 366663, 364946, 363178, 361592, 360472, 360135, 360789, 362433, 364900, 367963, 371422, 375202, 379405, 384267, 390113, 397408, 406847, 419253, 435230, 454712, 476516, 498135, 516120, 527338, 530664, 527905, 522933, 519418, 518873, 520468, 522277, 522410, 519257, 511621, 499467, 484516, 469488, 456419, 445824, 437388, 430840, 425944, 422178, 419036, 416497, 414734, 413524, 412472, 411733, 411919, 413174, 414904, 416644, 418637, 421167, 423796, 425860, 427528, 429717, 432915, 436563, 439851, 442752, 446044, 450462, 456141, 462785, 470143, 478206, 487049, 496655, 507003, 518266, 530805, 544921, 560848, 579136, 600932, 627687, 660578, 700236, 746726, 799589]
51376G99589N8615O4362P0839P7082P9706P5030O2338M4703K6382R726n373j9708
51364A343291l3121m4551n3182n9215o3492o6443o7605o6336o2830n8041n2652
51353G15823m6684m0193l3866k8426k3882j9803j6126j3142j0875r064p711p042
51341D59009o854o509n781n116m758m222l089j897j474j734j782j204n28l33m95
51326D13233o50q67j434k248k860l030k945k898k945k849k243r82N18J450J353
51311C90603O75M12J098K248K793K006J73j634k404j985j002p5O93J402J851J619
51295C98473N92p49j569j269oJ298J772J471J171J171Q54k21j351j456m70P76
51279D00487J834K920L885L905K541M73j297k392k895k820k231j468p00L48J805
$$ y = [799589, 858204, 922566, 993405, 1070487, 1150193, 1225223, 1287561, 1332264, 1358646, 1368372, 1362999, 1343291, 1310170, 1265619, 1212437, 1153222, 1089730, 1023287, 955682, 889346, 826516, 768475, 715823, 669139, 628946, 595080, 566654, 542772, 522969, 506843, 493701, 482826, 473762, 466051, 459009, 452155, 445646, 439865, 434749, 429991, 425769, 422680, 420783, 419309, 417575, 415793, 414589, 414061, 413728, 413233, 412583, 411716, 410282, 408034, 405174, 402144, 399199, 396301, 393356, 390507, 388264, 387282, 387800, 389250, 390603, 391278, 391690, 392788, 395036, 397829, 399835, 400008, 398374, 395970, 393985, 392983, 392908, 393601, 395003, 396854, 398473, 399065, 398316, 396747, 395478, 395472, 396770, 398542, 400013, 401184, 402355, 403209, 402988, 401637, 400181, 399711, 400487, 402321, 405241, 409126, 413031, 415572, 416045, 414748, 412356, 409461, 406641, 404410, 402942, 402242, 402590, 404395]
51264D04395L193M000M314M319L552J516j196l153l512k656j447m76n7l02r65
51249D11525j648k184k540k435j732r87r11j252j053j77L52j40r89j231q36k92
51233C93470L26J049J371Q71J27J17Q72J527J546J109M17n13j341j534j199r37
51217C97278p38P0J448K155J234o02j796j716r01k0P47J388J905K461L184L798
51201D09895L865L402K810K263J648J075R28J233J421J006J93m12n00k57p6k68
51185D28226q48j513j895j951j945k005j993j839j718j681j457q68k39k6j80k83
51169D07785k42m31j056j677j626p19O15J854K797L485L898L946L740L635L780
51154D29784L798L183K050J032L90l36j508k604k860k409k187k665l273l260k577
$$ y = [404395, 407588, 411588, 415902, 420221, 423773, 425289, 424093, 420940, 417428, 414772, 413325, 412849, 412792, 412490, 411525, 409877, 407693, 405153, 402718, 400986, 399999, 399088, 397836, 396783, 396606, 396958, 396818, 395829, 394598, 393762, 393470, 393796, 394845, 396216, 397087, 397214, 397331, 398203, 399730, 401276, 402385, 402802, 402289, 400948, 399414, 398215, 397278, 396540, 396610, 398058, 400213, 401447, 400845, 399049, 397333, 396432, 396412, 397159, 398547, 400452, 402913, 406097, 409895, 413760, 417162, 419972, 422235, 423883, 424958, 425886, 427119, 428540, 429546, 429739, 429327, 428827, 428570, 428494, 428226, 427378, 425865, 423970, 422019, 420074, 418069, 416076, 414237, 412519, 410838, 409381, 408513, 408274, 408248, 408068, 407785, 407543, 407112, 406056, 404379, 402753, 402034, 402649, 404503, 407300, 410785, 414683, 418629, 422369, 426004, 429784, 433582, 436765, 438815, 439847, 440237, 439901, 438393, 435789, 432929, 430520, 428333, 425668, 422395, 419135, 416558]
51139D16558j684q70j69L20M95N40Q43J560K385K810K552J837J220R85P56j2j182
51122D28944j962j891j316p07J5R93J835K116K162K608L313L471K873K292K385
51107D47131K874L119K965K628K243J994K270L161M034M151L544K865K518K362
51093D87859K196J998J672J018M2r79j835k495k857k785k447k291k483k682k487
51078D71444j916j263p71n63o32p19m65J09N23N57O95J529K879M027M667N160
51062D85261N839O716Q051J0553J4404J8349K0304J8938J4553Q696L402N90J376
51049F17032N514J1471J7176K0806K1396J9410J6669J4904J3851J1348N837j542
51037G73872p839j0950j0841q658n837m213n724j0899j7821k3332k5397k4146
$$ y = [416558, 414874, 414004, 413835, 414155, 414650, 415190, 416033, 417593, 419978, 422788, 425340, 427177, 428397, 429382, 430138, 430126, 428944, 426982, 425091, 423775, 423068, 423083, 424076, 425911, 428027, 430189, 432797, 436110, 439581, 442454, 444746, 447131, 450005, 453124, 456089, 458717, 460960, 462954, 465224, 468385, 472419, 476570, 480114, 482979, 485497, 487859, 490055, 492053, 493725, 494743, 494785, 493806, 491971, 489476, 486619, 483834, 481387, 479096, 476613, 473931, 471444, 469528, 468265, 467494, 466931, 466299, 465580, 465115, 465224, 465747, 466304, 466999, 468528, 471407, 475434, 480101, 485261, 491100, 497816, 505867, 516420, 530824, 549173, 569477, 588415, 602968, 611664, 615066, 615656, 617032, 622546, 634017, 651193, 671999, 693395, 712805, 729474, 744378, 758229, 769577, 775414, 773872, 766033, 755083, 744242, 735584, 729747, 725534, 719810, 708911, 691090, 667758, 642361, 618215]
51025F18215k1022j7427j4095j1104q171n166k453n19O93J763L054M281N015N322
51011E58386N722O609P887R063R617R414Q860Q583Q840R363R868J0442J1265J2131
50997F86050J2654J2815J2978J3254J3294J2851J2209J1781J1474J0855R829Q869
50985H28913Q497Q765R295R684R857J0211J1304J3154J4870J5358J4498J3403
50973I67809J3352J4778J7466K1253K6127L1831L7891M3988M9940N5477O0417
50962A340329O5110P0159P5601Q0737Q4852Q7664Q8918Q8091Q4901P9734P3115
50951B219211O5125N5737M5516L5399K5895J6870Q185L7p195j2939j6408j7250
50939B418183j6543j6542j8832k2892k6755k8935k9418k9083k8689k8545k8752
$$ y = [618215, 597193, 579766, 565671, 554567, 546396, 541230, 538777, 538258, 538951, 540714, 543768, 548049, 553064, 558386, 564108, 570717, 578604, 587667, 597284, 606698, 615558, 624141, 632981, 642344, 652212, 662654, 673919, 686050, 698704, 711519, 724497, 737751, 751045, 763896, 776105, 787886, 799360, 810215, 820044, 828913, 837410, 846175, 855470, 865154, 875011, 885222, 896526, 909680, 924550, 939908, 954406, 967809, 981161, 995939, 1013405, 1034658, 1060785, 1092616, 1130507, 1174495, 1224435, 1279912, 1340329, 1405439, 1475598, 1551199, 1631936, 1716788, 1804452, 1893370, 1981461, 2066362, 2146096, 2219211, 2284336, 2340073, 2385589, 2420988, 2446883, 2463753, 2471938, 2471975, 2464780, 2451841, 2435433, 2418183, 2401640, 2385098, 2366266, 2343374, 2316619, 2287684, 2258266, 2229183, 2200494, 2171949, 2143197]
50928B143197k9487l1010l3513l6941m1013m5421m9923n4245n8022o0921o2689
50917A640012o3119o2154o0122n7548n4544n0669m5754m0536l6090l2663k9581
50906A107232k6303k3038k0250j8003j6146j4775j4067j3799j3400j2491j1143
50895I23817r634q205o976n944m935l732k294q37L49J142J746K504L497M353M708
50880H99559M798N240O122O812O934P109Q164R896J1286J1839J2101J2771J3937
50867A016568J5337J6902J8657K0519K2453K4616K7105K9864L3039L7055M2053
50856A304168M7617N3411N9834O7652P7121Q7758R8936J10337J21921J33725J45590
50845B308070J57001J67306J76254J84149J91233J97157K01125K02160J98948
$$ y = [2143197, 2113710, 2082700, 2049187, 2012246, 1971233, 1925812, 1875889, 1821644, 1763622, 1702701, 1640012, 1576893, 1514739, 1454617, 1397069, 1342525, 1291856, 1246102, 1205566, 1169476, 1136813, 1107232, 1080929, 1057891, 1037641, 1019638, 1003492, 988717, 974650, 960851, 947451, 934960, 923817, 914183, 905978, 899002, 893058, 888123, 884391, 882097, 881260, 881609, 882751, 884497, 887001, 890498, 894851, 899559, 904357, 909597, 915719, 922531, 929465, 936574, 944738, 954634, 965920, 977759, 989860, 1002631, 1016568, 1031905, 1048807, 1067464, 1087983, 1110436, 1135052, 1162157, 1192021, 1225060, 1262115, 1304168, 1351785, 1405196, 1465030, 1532682, 1609803, 1697561, 1796497, 1906834, 2028755, 2162480, 2308070, 2465071, 2632377, 2808631, 2992780, 3184013, 3381170, 3582295, 3784455, 3983403]
50836C983403J89874J73915J51478J24111R3671O2038L1074K093k4504m8429o8508
50825D670216q3186r1930r5354r3923q7459p6290o2099m7214l3527k2520j5741
50814C960973j4485j8974k8126m0202n3726o8077q3288r9055j14127j27104j37626
50803C176183j46002j51730j53347j50132j43121j33979j23629j12539j01393
50794A960311r0550p9458o7584n5637m4887l5555k6836j8414j0968n042l60L383
50782A528403N816O480N689M324K986J567l86k996n736p818r130j0473j2601j5262
50768A490863j7690j9740k1923k4334k6333k7458k8017k8538k8993k8869k7723
50757A211245k5547k2857k0405j8425j6276j3291r845o899m540j821J736N388
$$ y = [3983403, 4173277, 4347192, 4498670, 4622781, 4716452, 4778490, 4809564, 4811657, 4787153, 4738724, 4670216, 4587030, 4495100, 4399746, 4305823, 4218364, 4142074, 4079975, 4032761, 3999234, 3976714, 3960973, 3946488, 3927514, 3899388, 3859186, 3805460, 3737383, 3654095, 3555040, 3440913, 3313809, 3176183, 3030181, 2878451, 2725104, 2574972, 2431851, 2297872, 2174243, 2061704, 1960311, 1869761, 1790303, 1722719, 1667082, 1622195, 1586640, 1559804, 1541390, 1530422, 1525380, 1525020, 1528403, 1534219, 1540699, 1546388, 1550712, 1553698, 1555265, 1554879, 1551883, 1546147, 1538329, 1529199, 1518726, 1506125, 1490863, 1473173, 1453433, 1431510, 1407176, 1380843, 1353385, 1325368, 1296830, 1267837, 1238968, 1211245, 1185698, 1162841, 1142436, 1124011, 1107735, 1094444, 1084599, 1077700, 1073160, 1071339, 1073075, 1078463]
50745A078463Q385J1102J4235J7602K0635K3638K7600L2798L8490M4095M9984
50734A367027N6810O4571P2611Q0223Q7018R2963R8271J03112J07228J09910J10524
50723B350268J09028J06014J02263R8124R3089Q5891P5126N9967M0535J7869o271
50712C131903k9744n0469o6664p6994q0924p9181p3506o5523n5918m4937l3373
50701B474670k2519j3196n450N47L768K955k203j0861k1826l4252m7495o0586
50689B263552p2107q0609q5221q6025q3905p9920p4662o8171o0357n1478m2122
50678A478975l2865k3980j5443p107J131R278J7305K5178L2760L9641M5190M8819
50666A618882N0224M9399M6557M2165L6922L1459K6101K0952J6255J2490J0151
$$ y = [1078463, 1086848, 1097950, 1112185, 1129787, 1150422, 1174060, 1201660, 1234458, 1272948, 1317043, 1367027, 1423837, 1488408, 1561019, 1641242, 1728260, 1821223, 1919494, 2022606, 2129834, 2239744, 2350268, 2459296, 2565310, 2667573, 2765697, 2858786, 2944677, 3019803, 3079770, 3120305, 3138174, 3131903, 3102159, 3051690, 2985026, 2908032, 2827108, 2747927, 2674421, 2608898, 2552980, 2508043, 2474670, 2452151, 2438955, 2433505, 2434052, 2437820, 2440775, 2438572, 2427711, 2405885, 2371633, 2324138, 2263552, 2191445, 2110836, 2025615, 1939590, 1855685, 1775765, 1701103, 1632932, 1572575, 1521097, 1478975, 1446110, 1422130, 1406687, 1399580, 1400711, 1409989, 1427294, 1452472, 1485232, 1524873, 1570063, 1618882, 1669106, 1718505, 1765062, 1807227, 1844149, 1875608, 1901709, 1922661, 1938916, 1951406, 1961557]
50655A961557R418R811J0081Q825N710J955q37k202k679k453r90J882N464R214
50641B014756J3498J8756K4549L0156L5546M1008M6203N0289N2652N2967N1067
50630B431447M7551M4030M1837M1061M1787M5045N0167N1403M0274J3396k2919
50619B825079n6970p9951q9719q8683q0543o8767n5873m2967l0329j8543q523
50608B204211o06N581J0312J3388J4433J2966Q288O0j0939k3194l5565m7462n8117
50595B093356o6532p2225p5432p6452p5399p2658o8888o4427n9296n3748m8188
50584A360111m2475l6225k9974k5103k2080j9698j6742j3714j1971j1683j1561
50573A118885j0511q649o686m978l454j939l06J464L242M982O914R310J2082J4927
$$ y = [1961557, 1970975, 1980786, 1990867, 1999692, 2005402, 2007357, 2006520, 2004318, 2001639, 1999186, 1998196, 2000078, 2005542, 2014756, 2028254, 2047010, 2071559, 2101715, 2137261, 2178269, 2224472, 2274761, 2327413, 2380380, 2431447, 2478998, 2523028, 2564865, 2605926, 2647713, 2692758, 2742925, 2794328, 2834602, 2847998, 2825079, 2768109, 2688158, 2598439, 2509756, 2429213, 2360446, 2304573, 2261606, 2231277, 2212734, 2204211, 2203605, 2209186, 2219498, 2232886, 2247319, 2260285, 2268573, 2268633, 2257694, 2234500, 2198935, 2151473, 2093356, 2026824, 1954599, 1879167, 1802715, 1727316, 1654658, 1585770, 1521343, 1462047, 1408299, 1360111, 1317636, 1281411, 1251437, 1226334, 1204254, 1184556, 1167814, 1154100, 1142129, 1130446, 1118885, 1108374, 1099725, 1093039, 1088061, 1084607, 1082668, 1082362, 1083826, 1087068, 1092050, 1098964, 1108274, 1120356, 1135283]
50559A135283J7733K0575K3368K6062K9071L2950L7544M1917M5329M7754M9136
50548A506722M8784M6176M2023L7815L4362L1405K8703K6730K6076K6783K8689
50537A884268L1910L6334M1159M5606M9877N4656N9792O4416O8476P3310Q0153
50526B489957Q8748R7929J07009J15783J23603J29344J32437J33206J32016J28575
50516C678607J22262J12676R9625Q2994O3026M0620J7049o634k9872n2435p4058
50505D053860r4077j11308j24388j32403j35194j33082j26449j15541j00606q2140
50495B898672o1134l8938j6787M581K4626M2388N6469O5677O9358O6916N7404
50484C169232M0128J5812j2936m2535o9833r2962j11218j24479j32782j36283
$$ y = [1135283, 1153016, 1173591, 1196959, 1223021, 1252092, 1285042, 1322586, 1364503, 1409832, 1457586, 1506722, 1555506, 1601682, 1643705, 1681520, 1715882, 1747287, 1775990, 1802720, 1828796, 1855579, 1884268, 1916178, 1952512, 1993671, 2039277, 2089154, 2143810, 2203602, 2268018, 2336494, 2409804, 2489957, 2578705, 2676634, 2783643, 2899426, 3023029, 3152373, 3284810, 3418016, 3550032, 3678607, 3800869, 3913545, 4013170, 4096164, 4159190, 4199810, 4216859, 4210225, 4180353, 4127918, 4053860, 3959783, 3848475, 3724087, 3591684, 3456490, 3323408, 3196959, 3081418, 2980812, 2898672, 2837538, 2798600, 2781813, 2786394, 2811020, 2853408, 2909877, 2975554, 3044912, 3111828, 3169232, 3209360, 3225172, 3212236, 3169701, 3099868, 3006906, 2895688, 2771209, 2638427, 2502144]
50474B502144j35490j31395j25301j18284j10691j02276r2994q3516p4716o6802
50464A460679n9382n2350m6161m1000l6276l1384k6553k2410j8960j5676j2408
50453A098119r526p143m866k498l18J534L458N818Q417J0920J3346J5731J7601
50440A150593J8312J7719J6056J3375R735N895L072J776J374J179J499L081N787
50427A249453Q538J0625J2407J4393J6269J7400J7980J8973K0927K3535K6445
50416A436945K9816L3716L7662M1272M4915M9102N3572N7584O0922O3875O6346
50405A975727O7705O7621O6342O4055O0608N6140N1314M6475M0980L3808K4557
50394B555332J3456P61j3427k8778m4458n9218p1647q0643q5898q7770q6629q2558
$$ y = [2502144, 2366654, 2235259, 2109958, 1991674, 1880983, 1778707, 1685713, 1602197, 1527481, 1460679, 1401297, 1348947, 1302786, 1261786, 1225510, 1194126, 1167573, 1145163, 1126203, 1110527, 1098119, 1088593, 1081450, 1076584, 1074086, 1073768, 1075302, 1078760, 1084578, 1092995, 1103915, 1117261, 1132992, 1150593, 1168905, 1186624, 1202680, 1216055, 1225790, 1231685, 1234757, 1236533, 1237907, 1239086, 1240585, 1243666, 1249453, 1257991, 1268616, 1281023, 1295416, 1311685, 1329085, 1347065, 1366038, 1386965, 1410500, 1436945, 1466761, 1500477, 1538139, 1579411, 1624326, 1673428, 1727000, 1784584, 1845506, 1909381, 1975727, 2043432, 2111053, 2177395, 2241450, 2302058, 2358198, 2409512, 2455987, 2496967, 2530775, 2555332, 2568788, 2569549, 2556122, 2527344, 2482886, 2423668, 2352021, 2271378, 2185480, 2097710, 2011081, 1928523]
50382A928523p5847o7302n7702m7172l5535k3088j0682Q65J1111J9814K6690L1307
50370A700982L2972L0890K4747J5160L367r413k2100l3600m3051n0231n5299n8095
50358A536329n8189n5835n2406m9522m7807m6747m5675m4491m3398m2179m0092
50347A009988l6595l2002k7259k3105j9604j6466j3539j0892q619o761n207l584
50335H06355j451J073L152M025L966M137N421P673J0121J2239J4153J6327J9083
50322I06274K2289K5398K7646K8122K5830K0116J1493J919o198j1414j3693j3706
50310A024076j2119r614o952m611k536n05J313K483K894K919K910K806K426K018
50296A007508K236L443N175O459O706O183N593N327N263N185N191N667P029R719
$$ y = [1928523, 1852676, 1785374, 1727672, 1680500, 1644965, 1621877, 1611195, 1612060, 1623171, 1642985, 1669675, 1700982, 1733954, 1764844, 1789591, 1804751, 1808118, 1798705, 1776605, 1743005, 1699954, 1649723, 1594424, 1536329, 1478140, 1422305, 1369899, 1320377, 1272570, 1225823, 1180148, 1135657, 1092259, 1050080, 1009988, 973393, 941391, 914132, 891027, 871423, 854957, 841418, 830526, 821907, 815146, 809939, 806355, 804904, 805977, 809129, 813154, 817120, 821257, 826678, 834351, 844472, 856711, 870864, 887191, 906274, 928563, 953961, 981607, 1009729, 1035559, 1055675, 1067168, 1069087, 1062889, 1051475, 1037782, 1024076, 1011957, 1002343, 995391, 990780, 988244, 987739, 989052, 991535, 994429, 997348, 1000258, 1003064, 1005490, 1007508, 1009744, 1013187, 1018362, 1024821, 1031527, 1037710, 1043303, 1048630, 1053893, 1059078, 1064269, 1069936, 1076965, 1086684]
50282A086684J4303K0978K8371L2873L0189J8738J779j4378k4796k8552k7547
50271A138642k3843j8800j3755r937p398n120k686j119j441k952l774k963j360
50258A043494l03q9j9M37J000J075O14J96L08P19Q33N78N67J266K405L543M847
50241A061471O832R515J2431J5447J8936K3011K7206L1264L5651M0782M6020M9993
50229A378559N1764N1259M8732M4375L8572L2120K6063K1438J9018J8820J9777
50218A750497K0304J9254J6056J0068N82j2131k6367l9996n1695o0816o6598o8260
50206A490898o5905o0640n3630m5374l6117k6571j7956j1487q078q353j2499j9675
50194A124613k7656l3586l5698l4450l1780k9198k6850k4320k1665j9291j7272
$$ y = [1086684, 1100987, 1121965, 1150336, 1183209, 1213398, 1232136, 1233915, 1219537, 1194741, 1166189, 1138642, 1114799, 1095999, 1082244, 1072307, 1064909, 1059789, 1057103, 1055984, 1054543, 1051591, 1047817, 1044854, 1043494, 1043191, 1043102, 1043083, 1043520, 1044520, 1045595, 1046209, 1046405, 1046713, 1047432, 1048265, 1048843, 1049410, 1050676, 1053081, 1056624, 1061471, 1068303, 1077818, 1090249, 1105696, 1124632, 1147643, 1174849, 1206113, 1241764, 1282546, 1328566, 1378559, 1430323, 1481582, 1530314, 1574689, 1613261, 1645381, 1671444, 1692882, 1711900, 1730720, 1750497, 1770801, 1790055, 1806111, 1816179, 1816761, 1804630, 1778263, 1738267, 1686572, 1625756, 1559158, 1490898, 1424993, 1364353, 1310723, 1265349, 1229232, 1202661, 1184705, 1173218, 1165140, 1156787, 1144288, 1124613, 1096957, 1063371, 1027673, 993223, 961443, 932245, 905395, 881075, 859410, 840119, 822847]
50183H22847j5375j3539j1928j0586r463q588p916p180o260n456n015m593l828
50170G13120l145l288m087m433l593j954l63O53R24O27L77P72J562J970K004K665
50154G03811M555P017R138J0793J2145J2838J2522J1508J0208Q421O057L952K875
50141H15840K107L01k338m020l655k028l50J248L229N579P945J0229J2319J3782
50127H60188J4502J5201J6742J9171K2108K5676L0278L5674M1151M6698N3198
50116A180587O1209P0136P8941Q6996R3687R7679R7465R2916Q5827P8702P3250
50105B097395P0079O9277P0577P2834P3880P1339O3594N0034L0828P036j9018
50094B657855m4176o5764q2647r4997j03250j07553j08075j05439j00569r4191
$$ y = [822847, 807472, 793933, 782005, 771419, 761956, 753368, 745452, 738272, 732012, 726556, 721541, 716948, 713120, 709975, 706687, 702600, 698167, 694574, 692620, 692257, 692910, 693834, 694461, 694838, 695610, 697172, 699142, 701146, 703811, 708366, 715383, 724521, 735314, 747459, 760297, 772819, 784327, 794535, 802956, 809013, 812965, 815840, 817947, 818248, 815910, 811890, 808235, 806207, 805857, 807105, 810334, 815913, 823858, 834087, 846406, 860188, 874690, 889891, 906633, 925804, 947912, 973588, 1003866, 1039540, 1080691, 1127389, 1180587, 1241796, 1311932, 1390873, 1477869, 1571556, 1669235, 1766700, 1859616, 1945443, 2024145, 2097395, 2167474, 2236751, 2307328, 2380162, 2454042, 2525381, 2588975, 2639009, 2669837, 2676873, 2657855, 2613679, 2547915, 2465268, 2370271, 2267021, 2159468, 2051393, 1945954, 1845385, 1751194]
50084A751194q6568p7745o7969n7895m8367m0003l3069k7724k4272k2846k2838
50073A241898k2903k1863j9610j6964j4701j2971j1620j0698j0316j0293j0313
50062A079646j0387j0819j1625j2315j2426j2062j1712j1630j1593j1265j0533
50051I53279r551q556p726p038o165m627k289K79K180L142L932N553Q056J0407
50037I40876J1600J1635J1277J1193J1527J2055J2346J1958J0828R466Q475P850
50025A071086P011N465L237P61j383k723l245l478l888m298m331m291n066o975
50011A047882r203j0579j0610r506p686n570l598k018n49J630N536J1752J9856
49998A027337K8643L7244M5812N4658O2888O8715P1121P0469O7387O2038N4880
$$ y = [1751194, 1664626, 1586881, 1518912, 1461017, 1412650, 1372647, 1339578, 1311854, 1287582, 1264736, 1241898, 1218995, 1197132, 1177522, 1160558, 1145857, 1132886, 1121266, 1110568, 1100252, 1089959, 1079646, 1069259, 1058440, 1046815, 1034500, 1022074, 1010012, 998300, 986670, 975077, 963812, 953279, 943728, 935172, 927446, 920408, 914243, 909616, 907327, 907606, 909786, 912928, 916860, 922413, 930469, 940876, 952476, 964111, 975388, 986581, 998108, 1010163, 1022509, 1034467, 1045295, 1054761, 1063236, 1071086, 1078097, 1083562, 1086799, 1087560, 1086177, 1083454, 1080209, 1076731, 1072843, 1068545, 1064214, 1059923, 1054857, 1047882, 1038679, 1028100, 1017490, 1007984, 1000298, 994728, 991130, 989112, 988563, 990193, 995729, 1007481, 1027337, 1055980, 1093224, 1139036, 1193694, 1256582, 1325297, 1396418, 1466887, 1534274, 1596312, 1651192]
49987A651192M7191M0103L3697K7860K3357K1142K0805K0416J7790J1389M63j4642
49975A900763l2200m9778o5395p7720q5600q8292q6312q1377p5125o8271o1030
49964A129663n3769m6956m0797l5198k9971k4969k0253j6124j2807j0041p225
49953H31553l983m95K799N638Q114J0422J2348J3088J1858Q856N337K606J137
49940I09278O54N45O4j337l498n819q303j1721j6264k0700k3479k4281k3805k2559
49926G48775k0629j8293j6020j3956j2026j0267q549o342l509q78P27J556K232
49913F42821K530J991J260J404K158K388K260L375O307R525J1422J2235J3183
$$ y = [1651192, 1698383, 1738486, 1772183, 1800043, 1823400, 1844542, 1865347, 1885763, 1903553, 1914942, 1915405, 1900763, 1868563, 1818785, 1753390, 1675670, 1590070, 1501778, 1415466, 1334089, 1258964, 1190693, 1129663, 1075894, 1028938, 988141, 952943, 922972, 898003, 877750, 861626, 848819, 838778, 831553, 827570, 827075, 829874, 835512, 843626, 854048, 866396, 879484, 891342, 900198, 905535, 908141, 909278, 909932, 910477, 910541, 909204, 905706, 899887, 891584, 879863, 863599, 842899, 819420, 795139, 771334, 748775, 728146, 709853, 693833, 679877, 667851, 657584, 649035, 642693, 639184, 638306, 639033, 640589, 642821, 645351, 647342, 648602, 650006, 652164, 654552, 656812, 660187, 666494, 676019, 687441, 699676, 712859]
$$ [...]
##END NTUPLES=NMR SPECTRUM
##END=
