##TITLE=AC1717_NARAH15003_9207285_a228OBguqK
##JCAMPDX= 6.0         $$ Bruker NMR JCAMP-DX V2.0
##DATA TYPE= NMR SPECTRUM
##DATA CLASS= NTUPLES
##ORIGIN= BRUKER
##OWNER= Administrator
$$ 1.72 TOPSPIN		Version 2.1
$$ 2015-06-01 14:56:26.139 -0700  Administrator@X
$$ Compression mode = diff/dup
##.OBSERVE FREQUENCY= 400.02188249412
##.OBSERVE NUCLEUS= ^1H
##.ACQUISITION MODE= SIMULTANEOUS (DQD)
##.ACQUISITION SCHEME= undefined
##.AVERAGES= 8
##.DIGITISER RES= 22
##SPECTROMETER/DATA SYSTEM= spect
##.PULSE SEQUENCE= zg30
##.SOLVENT NAME= COFFEE_meoh
##.SHIFT REFERENCE= INTERNAL, COFFEE_meoh, 1, 14.98509
##AUDIT TRAIL= $$ (NUMBER, WHEN, WHO, WHERE, PROCESS, VERSION, WHAT)
$$ ##TITLE= Audit trail, TOPSPIN		Version 2.1
$$ ##JCAMPDX= 5.01
$$ ##ORIGIN= Bruker BioSpin GmbH
$$ ##OWNER= Administrator
$$ $$ E:\/data/COFFEE/nmr/AC1717_NARAH15003_9207285_a228OBguqK/10/pdata/1/auditp.txt
$$ ##AUDIT TRAIL=  $$ (NUMBER, WHEN, WHO, WHERE, PROCESS, VERSION, WHAT)
(   1,<2015-06-01 14:56:18.811 -0700>,<Administrator>,<X>,<go>,<TOPSPIN 2.1>,
      <created by zg
	started at 2015-06-01 14:55:12.108 -0700,
	POWCHK enabled, PULCHK disabled,
       configuration hash MD5:
       21 0F 79 D6 B3 7B B4 F6 88 20 88 DB 03 48 BD 9F
       data hash MD5: 64K
       D2 4F 3A 15 29 E4 2D 9C 43 AE 4A 86 95 C2 6A CF>)
(   2,<2015-06-01 14:56:22.092 -0700>,<Administrator>,<X>,<proc1d>,<TOPSPIN 2.1>,
      <Start of raw data processing
       efp LB = 0 FT_mod = 6 PKNL = 1 PHC0 = 0 PHC1 = 0 SI = 32K 
       data hash MD5: 32K
       9D 9E 8D 9C 34 F8 6D C3 D9 D5 15 EC 38 D1 56 06>)
(   3,<2015-06-01 14:56:22.389 -0700>,<Administrator>,<X>,<proc1d>,<TOPSPIN 2.1>,
      <pk PHC0 = 93.07068 PHC1 = 0 
       data hash MD5: 32K
       02 40 48 E6 42 E5 97 28 D5 71 08 E2 C3 18 80 6A>)
(   4,<2015-06-01 14:56:22.483 -0700>,<Administrator>,<X>,<proc1d>,<TOPSPIN 2.1>,
      <abs ABSG = 1 
       data hash MD5: 32K
       DB 69 C9 74 99 C0 9A C2 00 3D F6 82 A1 AE 5A AE>)
(   5,<2015-06-01 14:56:22.545 -0700>,<Administrator>,<X>,<proc1d>,<TOPSPIN 2.1>,
      <abs ABSG = 2 
       data hash MD5: 32K
       32 D5 FF 09 22 8D 54 3B 06 97 37 87 3C FA 88 B9>)
(   6,<2015-06-01 14:56:22.608 -0700>,<Administrator>,<X>,<proc1d>,<TOPSPIN 2.1>,
      <abs ABSG = 3 
       data hash MD5: 32K
       52 C2 01 18 19 82 A3 38 6D 20 C1 FA 2B 8E 83 8F>)
(   7,<2015-06-01 14:56:22.655 -0700>,<Administrator>,<X>,<proc1d>,<TOPSPIN 2.1>,
      <abs ABSG = 4 
       data hash MD5: 32K
       E2 4A 2E 11 04 A7 D1 F0 B3 EC C7 CB 09 73 C1 94>)
(   8,<2015-06-01 14:56:22.717 -0700>,<Administrator>,<X>,<proc1d>,<TOPSPIN 2.1>,
      <abs ABSG = 5 
       data hash MD5: 32K
       AB 92 EA C0 07 A6 6C 04 9E 63 84 75 4F E8 73 EC>)
$$ ##END=
$$ 
$$ $$ hash MD5
$$ $$ 54 2D F9 4B 2E 42 27 77 E9 CD 1D B5 EA 54 B3 06
##$RELAX= 
##$RELAX= 
##$RELAX= 
##$RELAX= 
##$RELAX= 
##$RELAX= 
##$RELAX= 
$$ Bruker specific parameters
$$ --------------------------
##$DU= <E:\>
##$EXPNO= 10
##$NAME= <AC1717_NARAH15003_9207285_a228OBguqK>
$$ [...]
150 150 150 150 150 150 150 150
##$TP07= 0
##$TPNAME0= <>
##$TPNAME1= <>
##$TPNAME2= <>
##$TPNAME3= <>
##$TPNAME4= <>
##$TPNAME5= <>
##$TPNAME6= <>
##$TPNAME7= <>
##$TPOAL= (0..7)
0.5 0.5 0.5 0.5 0.5 0.5 0.5 0.5
##$TPOFFS= (0..7)
0 0 0 0 0 0 0 0
##$TUNHIN= 0
##$TUNHOUT= 0
##$TUNXOUT= 0
##$USERA1= <user>
##$USERA2= <user>
##$USERA3= <user>
##$USERA4= <user>
##$USERA5= <user>
##$V9= 5
##$VALIST= <valist>
##$VCLIST= <CCCCCCCCCCCCCCC>
##$VD= 0
##$VDLIST= <DDDDDDDDDDDDDDD>
##$VPLIST= <PPPPPPPPPPPPPPP>
##$VTLIST= <TTTTTTTTTTTTTTT>
##$WBST= 2048
##$WBSW= 25
##$XGAIN= (0..3)
0 0 0 0
##$XL= 0
##$YL= 0
##$YMAX_a= 554390
##$YMIN_a= -473129
##$ZGOPTNS= <>
##$ZL1= 120
##$ZL2= 120
##$ZL3= 120
##$ZL4= 120
##$ABSF1= 14.98509
##$ABSF2= -5.573092
##$ABSG= 5
##$ABSL= 3
##$ALPHA= 0
##$AQORDER= 0
##$ASSFAC= 0
##$ASSFACI= 0
##$ASSFACX= 0
##$ASSWID= 0
##$AUNMP= <proc_prof1d_extract_pilot.lims>
##$AXLEFT= 0
##$AXNAME= <>
##$AXNUC= <1H>
##$AXRIGHT= 0
##$AXTYPE= 0
##$AXUNIT= <>
##$AZFE= 0.1
##$AZFW= 0.1
##$BCFW= 0
##$BC_mod= 0
##$BYTORDP= 0
##$COROFFS= 0
##$CY= 15
##$DATMOD= 1
##$DC= 0
##$DFILT= <>
##$DTYPP= 0
##$F1P= 0
##$F2P= 0
##$FCOR= 0.5
##$FTSIZE= 32768
##$FT_mod= 6
##$GAMMA= 0
##$GB= 0
##$INTBC= 1
##$INTSCL= 1
##$ISEN= 128
##$LB= 0
##$LEV0= 0
##$LPBIN= 0
##$MAXI= 10000
##$MC2= 0
##$MEAN= 0
##$ME_mod= 0
##$MI= 0
##$NCOEF= 0
##$NC_proc= -8
##$NLEV= 6
##$NOISF1= 0
##$NOISF2= 0
##$NSP= 0
##$NTH_PI= 0
##$NZP= 0
##$OFFSET= 14.98509
##$PC= 1
##$PHC0= 93.07068
##$PHC1= 0
##$PH_mod= 1
##$PKNL= yes
##$PPARMOD= 0
##$PPDIAG= 0
##$PPIPTYP= 0
##$PPMPNUM= 2147483647
##$PPRESOL= 1
##$PSCAL= 4
##$PSIGN= 0
##$PYNMP= <proc.py>
##$REVERSE= no
##$SF= 400.02
##$SI= 32768
##$SIGF1= 0
##$SIGF2= 0
##$SINO= 400
##$SIOLD= 32768
##$SPECTYP= <>
##$SREGLST= <1H.CDCl3>
##$SSB= 0
##$STSI= 32768
##$STSR= 0
##$SW_p= 8223.68421052631
##$SYMM= 0
##$S_DEV= 0
##$TDeff= 65536
##$TDoff= 0
##$TI= <>
##$TILT= no
##$TM1= 0
##$TM2= 0
##$TOPLEV= 0
##$USERP1= <user>
##$USERP2= <user>
##$USERP3= <user>
##$USERP4= <user>
##$USERP5= <user>
##$WDW= 1
##$XDIM= 32768
##$YMAX_p= 431036362
##$YMIN_p= -794795
##$CURPLOT= <Network HP LaserJet P1505>
##$CURPRIN= <$Network HP LaserJet P1505>
##$DFORMAT= <normdp>
##$LAYOUT= <+/1D_H.xwp>
##$LFORMAT= <normlp>
##$PFORMAT= <normpl>
##$SURQMSG= 1
$$ End of Bruker specific parameters
$$ ---------------------------------
##NTUPLES= NMR SPECTRUM
##VAR_NAME=  FREQUENCY,     SPECTRUM/REAL,   SPECTRUM/IMAG
##SYMBOL=    X,             R,               I
##VAR_TYPE=  INDEPENDENT,   DEPENDENT,       DEPENDENT
##VAR_FORM=  AFFN,          ASDF,            ASDF
##VAR_DIM=   32768,         32768,           32768
##UNITS=     HZ,            ARBITRARY UNITS, ARBITRARY UNITS
##FACTOR=    0.250966925370066, 1,           1
##FIRST=     8223.43324360094, 6643,         61913
##LAST=      0,             90360,           -101223
##MIN=       0,             -794795,         0
##MAX=       8223.43324360094, 431036362,    0
$$ Real data points
##PAGE= N=1
##DATA TABLE= (X++(R..R)), XYDATA
$$ [...]
19583g9745k47303R9207J3874P139b4783j13963k1925B00745e2125C3716j0564
19572B3152b52743j68205c3055k63655K9468J29256L6603A7310K73471j04650
19562A86131a82799J9148j25369a33104a3324j39556l89303A43026b1877l3591
19552e5468j03080n093c5600A0798K7205J89p841g6463C3304a44903b9371l3954
19540f3325C007J56431j765g8025E9459e1675B71537b00458H9370b8824k03626
19529b32450A52455r225F245J26985a83122Q8349A71012H4127B8008g7567b2131
19517b63654R0677O9690j22463f8851L3919I4810K46761c19976C1394a23434o6339
19506a89773B129J8036H652b70071K6106a6855r9772q8264h1122B11296b00407
$$ y = [-79745, -327048, -227841, -213967, -206828, -24783, -138746, -160671, 200745, -52125, 33716, 23152, -252743, -420948, -33055, -296710, -267242, -137986, -101383, 17310, 290781, 186131, -182799, -163651, -289020, -133104, -13324, -152880, -542183, 143026, -21877, -55468, -158548, -163641, -35600, 10798, 38003, 38192, 30351, -76463, 33304, -144903, -29371, -63325, 3007, 159438, 157673, -78025, 59459, -51675, 271537, -200458, 89370, -28824, -232450, 152455, 143230, 6245, 133230, -183122, -94773, 171012, 84127, 28008, -77567, -22131, -263654, -172977, -103287, -225750, -68851, -34932, 94810, 341571, -319976, 31394, -123434, -189773, 2129, 20165, 8652, -270071, -243965, -16855, -116627, -204891, -81122, 211296, -200407]
19494B9526A4626a91978A21392b16464A97292a9104j41791J9329c8414j33074
19484a71488M988A0374N1887c22334I6675d47939J66667A48606a76925A39177
19473a04635A70148a20273m9646K375b1257B55310d0636D15851b71245B53370
19462b2113C5930b84567G9676C3780b01278f067A53733J6219E5841g2286k04392
19451b76678J04278O8016j07127N3531m9130B8021f31A93801E5875J3945b08546
19439B1798J8228o948b84531N1467a04512q06L209d8824A8458a29235j01534A4822
19426a15333D321a31991j9884M6759N0471G7355b18733G3089b58286l7749a9204
19414b17509C2754M82840H4782a79842G9257a06605A52127o5275M3099a859H1931
$$ y = [29526, 14626, -191978, 121392, -216464, 197292, -19104, -160895, -141566, -38414, -171488, -166500, 10374, 62261, -322334, 96675, -447939, -281272, 148606, -176925, 139177, -104635, 170148, -120273, -169919, -167544, -21257, 255310, -40636, 415851, -271245, 253370, -22113, 35930, -284567, 79676, 33780, -201278, -6067, 153733, 169952, 55841, -72286, -276678, -172400, -104384, -211511, -157980, -207110, 28021, -631, 193801, 55875, 69820, -208546, 21798, 40026, 33078, -284531, -233064, -104512, -105318, -102109, -48824, 18458, -129235, -230769, 14822, -115333, 4321, -131991, -151875, -105116, -54645, 77355, -218733, 73089, -258286, -296035, -19204, -217509, 32754, 515594, 84782, -179842, 79257, -106605, 152127, 86852, 129951, -1859, 81931]
19402d79955a88050I9216b48186B94112b4692I1379d00552a77198l3785c9026
19391b58959g4572A07444c09488B26885b84474A69752b43857e9313I2508J06951
19381A99459m4698b95496g067A39072I295J19634a07537A07180b59463J13760
19371a45703B20907i8900d8045C555h2720A92408C7963L9071j9276e9483j7839
19360g7322j51469B15607a18989A44256d3400j23835D4472a66718N1883O43A43809
19348E239N174O6314I040b0203B30591g5932C8642d5384a0430A44862c75920b7325
19335e6087a0899j21401C5252h229k76609F0317a27751B2693J22240J62845c59510
19323C07678b91631b3777n9842L276c2330j8481B97660g1915j02001G1239a06883
$$ y = [-479955, -188050, 99216, -248186, 294112, -24692, 91379, -400552, -177198, -210983, -39026, -258959, -74572, 107444, -309488, 226885, -284474, 169752, -243857, -59313, 92508, 199459, 154761, -295496, -7067, 139072, 9295, 128929, -107537, 107180, -259463, -145703, 220907, -98900, -48045, 3555, -82720, 192408, 37963, 77034, 57758, -59483, -77322, -228791, 215607, -118989, 144256, -43400, -167235, 44472, -166718, -114835, -114192, 143809, 5239, 10413, 76727, 9040, -20203, 230591, -75932, 38642, -45384, -10430, 144862, -375920, -27325, -56087, -10899, -132300, 35252, -8229, -284838, 60317, -127751, 22693, 144933, 307778, -359510, 307678, -291631, -23777, -83619, -80343, -32330, -50811, 297660, -71915, -173916, 71239, -106883]
19311B025K9157P4385c4941j002C3760P5128b9975I150J20690N561j2683c25470
19298A46047g5350j74345a08355G0762c3263j20953I2916i0249j89167J01523
19288a77893d7856F1078a53486m2372P1562c8345G4150c3309q9626L0463j55950
19277b48422B48743A600K75785b9492j78186h2058b9943j29083A40304b40745
19266i3825A00351J80561o8790c01343a04768j21236a09343L4000c3250k06248
19256b39498M5317M7111k40788M1551A17734C3562b09726j18523J10718e2029
19245i9741M7532A1324a58940j8082r4819b7631j18145j9930l0703J5927g8150
19233A27366g8164e722B6728f6371q569C21378b5781l28818J14658A16172n8029
$$ y = [2025, 31182, 105567, -34941, -35943, 33760, 108888, -29975, 9150, 129840, 135401, 122718, -325470, 146047, -75350, -249695, -108355, 70762, -33263, -154216, 92916, -90249, -279416, -177893, -47856, 61078, -153486, -195858, -124296, -38345, 74150, -33309, -122935, -92472, -248422, 248743, 1600, 277385, -29492, -207678, -82058, -29943, -159026, 140304, -240745, -93825, 100351, 280912, 212122, -301343, -104768, -226004, -109343, -75343, -33250, -239498, -194181, -147070, -387858, -346307, 117734, 33562, -209726, -328249, -217531, -52029, -99741, -52209, 11324, -158940, -177022, -271841, -27631, -145776, -165706, -196409, -180482, -78150, 127366, -78164, -5722, 26728, -66371, -74940, 321378, -25781, -354599, -239941, 116172, 58143]
19222E8143O2909C5393b29686j0536k18756J03837a58143C79658A79871b03528
19211b47846R7047d1421A76422J5260c2190l48212J39239A79289g1942a1281C7881
19199a88993A10702a63739A25245i4378A60249b1461q9558p0082r1391N8727o9975
19188b83740a25943j42835C33162A26406c36249J32128i8274A98457r5589d6391
19177B35623a47040n3257E6524B2109b5689j07901H9878J44918C0792b29756j5633
19166b45389I359a35200k34459J69163e3913B04055c11671h8150a9763j43508
19156a63271M6881j77044o5800A6700b35877f0981n3574o3014A34224k928g4101
19144C2455c18816b4129j26314I3416b88308a8133j14472k4886B15122a79713
$$ y = [58143, 121052, 35393, -229686, -240222, -458978, -355141, -158143, 379658, 179871, -203528, -247846, -150799, -41421, 176422, 191682, -32190, -380402, -241163, 179289, -71942, -11281, 37881, -188993, 110702, -163739, 125245, -94378, 160249, -21461, -111019, -181101, -272492, -213765, -283740, -125943, -268778, 333162, 126406, -336249, -204121, -98274, 198457, 102868, -46391, 235623, -147040, -200297, 56524, 22109, -25689, -133590, 89878, 234796, 30792, -229756, -245389, 9359, -135200, -369659, -200496, -53913, 204055, -311671, -88150, -19763, -163271, -116390, -293434, -359234, 16700, -235877, -60981, -114555, -177569, 134224, 131296, -74101, 32455, -318816, -24129, -150443, 93416, -288308, -18133, -132605, -157491, 215122, -179713]
19133i7443A31519a48401G7463J2307O072P4712b71632k12471a11599D8678a67171
19121a82497G0846a19454d3210a2182j94125B09926b06168g3216C44426c90747
19110A72327c7597B7888b7459A4344a73040j56678a35996M531j77141B80698A6042
19098b55066A05325K0205a39907D7719O9342A4454a11931B8418b4906l46491f3381
19086D4674a51623B34314d4142n7547j32702j0244G2197e6473G0327a6315A4308
19074a4979j30943B96586A33381E2248h0920A64172R7111e0870j62266r4722f569
19062g5855l2165l77910A12701a71981M9199G4074a46396q8632a4974D5248c29708
19050c2569G0552B7553K5961K9286a30493B52303d4809j62928P2758g721B16206
$$ y = [-97443, 131519, -148401, 77463, 89770, 95842, 170554, -271632, -484103, -111599, 48678, -167171, -182497, 70846, -119454, -43210, -12182, -206307, 209926, -206168, -73216, 344426, -390747, 172327, -37597, 27888, -27459, 14344, -173040, -329718, -135996, -131465, -308606, 280698, 16042, -255066, 105325, 125530, -139907, 47719, 117061, 14454, -111931, 28418, -24906, -371397, -63381, 44674, -151623, 234314, -44142, -101689, -234391, -244635, 72197, -56473, 70327, -16315, 14308, -14979, -145922, 296586, 133381, 52248, -80920, 164172, 261283, -50870, -213136, -307858, -6569, -75855, -108020, -485930, 112701, -171981, -122782, 74074, -146396, -235028, -14974, 45248, -329708, -32569, 70552, 27553, 53514, 82800, -130493, 252303, -44809, -207737, -134979, -7721, 216206]
19038a50710B24274a92893I8679k9503a79607F3973a40514N1487B21114n5423
19028A65691P50O923K15610e1655G7560c7907A07246K96866A07223M7504G6979
19016C23117a64356c8811F093a29678I9599B7685d14624g5613j32051K9562P3066
19005a05036j2832k10383a49725C99312A77530a09160j1837i430B0075J95720
18995B15795b48495A6506b99502C7995a7999C39843l1578H1195a89803g6094j05667
18984a81761P1598j41849B682f6630a1464k40299A09074A1392b76063g8327j52408
18973b30735K8594A43409B2909A293c3931A95322a73927b9109B41219a1212n7303
18962f8515D794c08733K7646A44012q408J95355a20j0584C45788E2533p719L5900
$$ y = [-150710, 224274, -192893, 98679, 69176, -179607, 63973, -140514, -89027, 221114, 165691, 166441, 173364, 388974, -51655, 77560, -37907, 107246, 404112, 107223, 154727, 76979, 323117, -164356, -38811, 6093, -129678, 99599, 27685, -414624, -75613, -207664, -178102, -105036, -117868, -328251, -149725, 399312, 177530, -109160, -120997, -9430, 20075, 215795, -248495, 16506, -299502, 37995, -17999, 339843, 308265, 81195, -189803, -76094, -181761, -110163, -252012, 2682, -66630, -11464, -251763, 109074, 11392, -276063, -78327, -230735, -202141, 143409, 22909, 1293, -33931, 195322, -173927, -29109, 241219, -11212, -68515, 4794, -308733, -281087, 144012, 135604, 330959, -120, -10704, 345788, 52533, 44814, 80714]
18950H0714c66963a56237j4251A18619E0320b33124e25H393K61771r826a04519
18938a65656A93321d3286k4773A21264A5868d5207B0493J36681j5282D1055K03281
18927B44336c45982e5390A172g2226B00961j7340c5735J4190l6139J5070r1719
18916a34333j46568h3573J7927R74k60111I1647e37320A5133f7846m9839C6985
18904h2899j12682O1849D42384A5132g2553I4360C4235a89177G9684a91659H5499
18892a61922d3182F7925a14577e3442j72518c7816I4231a16974M8713B65697a56861
18880f0950k65296B32171a4526L325G9208B8466R4116n3150o662O8625f5119A79837
18867B9759a38746j0711H5480b15882B69338j04376E9025j5410J39637b3899j38764
$$ y = [80714, -366963, -156237, -170488, 118619, 50320, -233124, -525, 8393, 270164, 260338, -104519, -165656, 193321, -43286, -68059, 121264, 15868, -45207, 20493, 157174, 141892, 41055, 244336, -345982, -55390, 1172, -72226, 200961, 183621, -35735, -21545, -57684, -42614, -134333, -280901, -83573, -65646, -64672, -324783, 91647, -537320, 15133, -67846, -117685, 36985, -82899, -195581, -133732, 442384, 15132, -72553, 94360, 34235, -189177, 79684, -191659, 85499, -161922, -43182, 67925, -114577, -53442, -225960, -37816, 94231, -116974, -68261, 265697, -156861, -60950, -326246, 232171, -14526, -11201, 79208, 28466, 122582, 69432, 62770, 131395, -65119, 179837, 29759, -138746, -149457, 85480, -215882, 269338, 164962, 59025, 43615, 183252, -23899, -162663]
18856a62663l2795I5017a39361B48325I4028a80433C09290G3634f3209o3073A42529
18844a53103N4748C44157a94367A98580a67017F3984O3197j6243h9798C094b03264
18832c2913m606E9674L79a95995j48758B60886c88668A02671J18971A7512b10397
18820B21960B3171K2666b3263j7548B73454d9060k90642A41623K28986a8370o5162
18809h3532c332A10022d8155A21918a86112C68206c52380h9183p5923a6216l92168
18798d08384H0188r617b23889B85490a39229c3143j82830i7429p3586I731b4768
18786g4285A08681b72978R4095F5522a51279f3332E9527P4914b27119I4272d40265
18774A42377d09738I751f7058j80774P7689F4172j9563b43014g4418b730I409
$$ y = [-162663, -195458, 95017, -139361, 248325, 94028, -180433, 309290, 73634, -63209, -126282, 142529, -153103, -98355, 344157, -194367, 198580, -167017, 63984, 127181, 110938, -89798, 3094, -203264, -32913, -37519, 59674, 60053, -195995, -344753, 260886, -388668, 102671, 221642, 17512, -210397, 221960, 23171, 45837, -23263, -40811, 273454, -49060, -339702, 141623, 370609, -18370, -83532, -3332, 110022, -48155, 121918, -186112, 368206, -352380, -89183, -165106, -16216, -408384, 80188, 70571, -223889, 285490, -139229, -33143, -215973, -97429, -171015, 9731, -24768, -74285, 108681, -272978, -178883, 65522, -151279, -63332, 59527, 134441, -227119, 94272, -440265, 142377, -409738, 9751, -67058, -247832, -170143, 64172, 44609, -243014, -74418, -2730, 9409]
18762b2353j47917r2612C2399K36143c27891J02442O8758A96220c26169B62201
18751a98468b2896E6186a05834A65875H1128c22176A68626a57026j8288E776L1479
18740C7255g5942j98715A51393o5302a03206I2952a48220l1983o7918e7164j23399
18729a80563N4757Q242h665F5273P4280C7347b02364I7447C4898R5581b89642
18717F61c75704e6843K4850k58588A15494b82705a34959A86078D1370J02956d3415
18705a47531A06372b7015D5110a82257c3157j01426B02209E4771c73145J78195
18695a94950Q4736C34771A37142c8270k25125j0878e3614I8310B1448a52716g5210
18683d2427j85449i4808D9614K00998c39876e8433k72811J13689J06775B21656
$$ y = [-22353, -170270, -262882, 32399, 268542, -327891, -225449, -156691, 196220, -326169, 262201, -198468, -22896, 56186, -105834, 165875, 81128, -322176, 168626, -157026, -175314, 5776, 37255, -75942, -274657, 151393, 86091, -103206, 92952, -148220, -180203, -248121, -57164, -180563, -125806, -117564, -8665, 65273, 139553, 37347, -202364, 97447, 34898, 130479, -289642, 661, -375704, -56843, -31993, -290581, 115494, -282705, -134959, 186078, 41370, 144326, -43415, -147531, 106372, -27015, 45110, -182257, -33157, -134583, 202209, 54771, -373145, -194950, -110214, 334771, 137142, -38270, -263395, -274273, -53614, 98310, 21448, -152716, -75210, -42427, -227876, -94808, 49614, 250612, -339876, -58433, -331244, -217555, -110780, 221656]
18672a09639a182j02367b7959G77K08223a40086B53496a5244B06715b8603j07037
18661a35640a688j05846m1554n7145a2213k92046A52150c35355a16273J3450G41
18649a45662A64114a27388c9494J2146L699k61333A22924A9863c29830J54251
18639a75579A81064a29171C08777a25305A84358E2840A9009b56220D9222a90709
18628f5959I5359h467B32464J8098D7265j1620E749b76111A23258d4401l1304
18617g5705L3517j29667P3817L2265A89779d51903Q6557J36782N5509A09175J29582
18606B38757a85299B49944A3808c6347k41559k5944Q0474E5380a47474A89666
18595d6821A29489d6629l2492B07397a01561j55036R6058g6963B48512A4868c7089
$$ y = [-109639, -1182, -103549, -27959, 777, 209000, -140086, 253496, -15244, 206715, -28603, -135640, -1688, -107534, -149088, -206233, -12213, -304259, 152150, -335355, -116273, -102823, 741, -145662, 164114, -127388, -39494, -27348, -23649, -284982, 122924, 19863, -329830, -175579, 181064, -129171, 308777, -125305, 184358, 52840, 19009, -256220, 49222, -190709, -65959, 95359, -8467, 232464, 250562, 47265, 35645, 5749, -276111, 123258, -44401, -75705, -42188, -171855, -98038, -65773, 189779, -451903, -365346, -228564, -173055, 109175, 238757, -185299, 249944, 13808, -36347, -277906, -303850, -223376, 55380, -147474, 189666, -46821, 129489, -46629, -79121, 207397, -101561, -256597, -160539, -76963, 248512, 14868, -37089]
18583b00826A82168B4594L573i0320L4462j67557B8556a14235j22754J04022m605
18572a37572j33076Q4739f1482j27689G9961L552c21199a43624g263k38929h2212
18560b49806j09856e0350k7117A52188E4558a70033f6401K5086j53240F9821c07948
18548A36469Q4977h7061B67874a2317j24014c995B4699b21936A94631f6390J8968
18537d7422j5343l41077A29121f5443A96362C0245J36310E1193A8378b48359J00225
18526a48134f5060A21833a92080L8682M8718B83a13989d4425j23300A07128D490
18514A40904a15634K6758p9321e3478l9289F0719a47146A96425a56336a6505G5977
18502h5119A8364K39940P6253a36515B81576b15018e0724j77329O4824d352q7016
$$ y = [-200826, 182168, 24594, 28167, -90320, -55858, -223415, 28556, -114235, -236989, -132967, -137572, -270648, -185909, -61482, -189171, 79961, 83513, -321199, -143624, -7263, -246192, -82212, -249806, -359662, -50350, -77467, 152188, 54558, -170033, -66401, -41315, -194555, 69821, -307948, 136469, 221446, -87061, 267874, -12317, -136331, -3995, 24699, -221936, 194631, -66390, -47422, -62765, -403842, 129121, -65443, 196362, 30245, 166555, 51193, 18378, -248359, -148134, -65060, 121833, -192080, -153398, -104680, 283, -113989, -44425, -167725, 107128, 4490, 140904, -115634, -88876, -168197, -53478, -92767, 60719, -147146, 196425, -156336, -16505, 75977, -85119, 18364, 258304, 334557, -136515, 281576, -215018, -50724, -228053, -163229, -4352, -91368]
18491i1368C23569F9069a30262o4040A19082b29495h0117G5554c41047f7323a583
18479g9601k503J6924B26566j05658c7883r8991I663a18424C66539h3912A74354
18467a8253m7976A09059B0275a12297D5413f2303k23701A7853h7387m3457B6553
18455f602A2530P9808a08767m3041e188l9310o1047p7099d5539A59326J24094
18444B83420a28758G366L6193c37274b8493B17502a53625f8973A12916b09926
18433B12205g3609j60720C8766d6129A25813L3717a42430j34463a0415k46140
18423b56555A43291m7829b65654C29670c07193k07331g7338J0274l32438f6219
18412A44501a7765A62916b43688m4891h4673C3952A1477a22114A15768a10738
$$ y = [-91368, 323569, 69069, -130262, -194302, 119082, -229495, -80117, 75554, -341047, -67323, -1583, -79601, -82104, -65180, 226566, 120908, -37883, -136874, 9663, -118424, 366539, -83912, 174354, -18253, -66229, 109059, 20275, -112297, 45413, -62303, -286004, 17853, -87387, -130844, 26553, -6602, 12530, 92338, -108767, -151808, -5188, -44498, -105545, -182644, -45539, 159326, 283420, -128758, 7366, 43559, -337274, -28493, 217502, -153625, -68973, 112916, -209926, 212205, -73609, -234329, 38766, -46129, 125813, 159530, -142430, -276893, -10415, -256555, 143291, 95462, -265654, 329670, -307193, -514524, -77338, -67064, -399502, -66219, 144501, -17765, 162916, -243688, -288579, -84673, 33952, 11477, -122114, 115768, -110738]
18401B71823d46093B17122C4942g9177A04618D6800q085g1465j53853B6509M2344
18390F8853C1106c32123J45677E2134j8330a18421k3124a0088j96550B39192n0245
18379A88947a31261E6850a65340a2413j69443k337B32709H1602j719a34690H10
18367D2636O5529d6266A78426g6931k90002c6295A73629e8260I3769C1101a96163
18355c15899A0839k199a24728j0159M3800B88568A20146C1371a09461A80109f0923
18343i7891F4762D846P5580c28305G6524k7820c86846L2683C83781j68358A9805
18331d3521j04005B703J62094E779J41765m9284b00683m3391o8996c2364j30120
18320a62484Q0194a3592j39982j80546B1499b41795J20866l4747L861C787J38243
$$ y = [271823, -446093, 217122, 34942, -79177, 104618, 46800, 38715, -71465, -225318, 26509, 68853, 31106, -332123, -186446, 52134, 33804, -118421, -141545, -10088, -206638, 239192, 188947, -131261, 56850, -165340, -12413, -181856, -184193, 232709, 81602, 79883, -134690, 810, 42636, 108165, -46266, 178426, -76931, -366933, -36295, 173629, -58260, 93769, 31101, -196163, -315899, 10839, 8640, -124728, -134887, -91087, 288568, 120146, 31371, -109461, 180109, -60923, -97891, 64762, 4846, 80426, -328305, 76524, 48704, -386846, -354163, 383781, 215423, 19805, -43521, -147526, 2703, 164797, 5779, 147544, 98260, -200683, -244074, -313070, -32364, -162484, -82290, -13592, -153574, -334120, 21499, -241795, -120929, -155676, -151815, 3787, 142030]
18309A42030E0084K36205H744e1422C6422b5462I2276b38166j08013A12202J30424
18298B42626a2897k89765K6861A3814J9374j551a78803k6428A32117g6385A10085
18286a4952E9568a82185G4931J35127a43907B6207a12351k5437r776m8653e4786
18274B97164a95764A26786c99138a03926B1437J61422i8531r6389D3254b1993
18263e2737C3289b7239d995A05620a39057N6504A02404b44462a7135B88013e9004
18251B45685a27660K0077L7597B18306f6428B20373h8830k6939r3292d1369a4320
18239A46771J03923a54652j80714D12311I9153b59828J08925A1052f6566m0331
18229a06897c4591k09631K7687a07891d1057l560q3711d1938H7854l1156a23620
$$ y = [142030, 50084, 286289, 8744, -51422, 36422, -25462, 92276, -238166, -346179, 112202, 242626, -12897, -302662, -275801, 13814, 33188, 31637, -178803, -205231, 132117, -76385, 110085, -14952, 59568, -182185, 74931, 210058, -143907, 26207, -112351, -137788, -147564, -196217, -54786, 297164, -195764, 126786, -399138, -103926, 21437, 182859, -98531, -194920, 43254, -21993, -52737, 33289, -27239, -4995, 105620, -139057, -82553, 102404, -244462, -17135, 288013, -59004, 245685, -127660, -107583, -69986, 218306, -66428, 220373, -88830, -115769, -209061, -41369, -14320, 146771, 250694, -154652, -335366, 412311, 99153, -259828, -150903, 11052, -66566, -106897, -34591, -244222, -216535, -107891, -41057, -44617, -128328, -41938, 87854, 56698, -123620]
18217e1985q3654l0695e827B4912b05595J2045R4708b3682P823j16435A03549
18205c59536I8406J19496a31269i099F8765k5392K3362a5202E0594a63124A00440
18193A2779a5189B1346a84454c7131j8976R575C3723b84600a20135d1936k2902
18182f4838p7972A63624a55076C7325f555A4256c09094J87a1373A21794D6590
18170f2154j11314l17293A07821g462j16289I8998J77825i7437b2438m86673h6268
18158A64255L0703K313C5513J70992e580D92626G348N3145h0090A26486D0049
18146A80623c7269k93k58324b8585G6579b66826a4934j22552A6388c2095B84250
18134g8706A24573a63961D9199e560l2368j84817B54517P3258D1329J17801d7231
$$ y = [-51985, -135639, -166334, -5827, 24912, -205595, -193550, -98842, -23682, -15859, -132294, 103549, -359536, 98406, 217902, -131269, -9099, 68765, 43373, 66735, -15202, 50594, -163124, 100440, 12779, -15189, 21346, -184454, -37131, -56107, -46532, 33723, -284600, -120135, -41936, -64838, -142810, 163624, -155076, 37325, -6555, 14256, -309094, -308907, -11373, 121794, 46590, -62154, -173468, -490761, 107821, -7462, -123751, 98998, 276823, -97437, -22438, -509111, -86268, 164255, 194958, 197271, 35513, 206505, -5580, 492626, 7348, 60493, -80090, 126486, 40049, 180623, -37269, -37562, -295886, -28585, 76579, -266826, -14934, -137486, 16388, -32095, 284250, -78706, 124573, -163961, 49199, -5560, -37928, -222745, 254517, 327775, 41329, 159130, -47231]
18122A22253E5170a67564f0473k85660G0073b1425k81679C3121a4668j28249a2432
18110B31693J85256H9625c51976a07725A31768b70879d106B48125q8157d1380
18099g2494a3569k592b320A66127k5492a18173C63160A20300a02587l6554B19447
18087D6157j6231M8014J5913a65035e8181j08138A39640o7041a30378j13809a01908
18075a32877m2045p2666g9276A10612d0179A85318g8354j893N330p0268q1541
18064b26726C58985a91666j80057J75141C06321a49436A75735G6995k5742i6415
18053h3075I2219b02236M5385A97327f4396C10320a1942r554A18480J82683j31380
18042A69783a76961E8758n314L8931K8877a93778C461J08474A7892a66691j35192
$$ y = [122253, 55170, -167564, -60473, -346133, 70073, -21425, -303104, 33121, -14668, -142917, -12432, 231693, 416949, 89625, -351976, -107725, 131768, -270879, -4106, 248125, 159968, -41380, -72494, -13569, -16161, -2320, 166127, 140635, -118173, 363160, 120300, -102587, -139141, 219447, 46157, 29926, 77940, 93853, -165035, -58181, -166319, 139640, 72599, -130378, -244187, -101908, -132877, -174922, -247588, -79276, 110612, -40179, 185318, -78354, -80247, -74917, -145185, -226726, 358985, -191666, -371723, -196582, 306321, -149436, 175735, 76995, 51253, -96415, -83075, 92219, -202236, -156851, 197327, -64396, 310320, -11942, -21496, 118480, 301163, 169783, -176961, 58758, 53444, 92375, 121252, -193778, 3461, 111935, 17892, -166691, -301883]
18031c01883g1128r8198B8736L130J58644a12357J7932B13467O5331E925a06017
18019d19619I751K8905i957j64448K9872G8289K0376d9663b2070m3535k1053j24218
18007b10876e9262E7255i0782A815N4271J91433a22594B61877b05690e8720A10437
17995c3396k20151c0947A00L52717c34099G9825J1565M9263a71159B44763E9476
17983G2809a11570A06454a26426E0422b41641D758b80109b5178D6964g8124A26215
17971d09725P0322f7283j53777f4740j95410I656K58301C2102R6284b9632A9370
17959D6111R2216J07363b72008B9879R7008F2917b5165j34463q0239a9843j50892
17948a70735I3766g9282k03072a4233j77131H7715c03550c9982F1650A8089J08199
$$ y = [-301883, -71128, -169326, 28736, 31866, 190510, -112357, -94425, 213467, 278798, 5925, -106017, -419619, 9751, 38656, -9957, -174405, -144533, 78289, 98665, -49663, -22070, -65605, -86658, -210876, -59262, 57255, -90782, 1815, 56086, 247519, -122594, 261877, -205690, -58720, 110437, -33396, -253547, -30947, 100, 352817, -334099, 79825, 91390, 140653, -171159, 244763, 59476, 72809, -111570, 106454, -126426, 50422, -241641, 4758, -280109, -25178, 46964, -78124, 126215, -409725, -339403, -67283, -221060, -64740, -260150, 9656, 267957, 32102, 128386, -29632, 19370, 46111, 138327, 245690, -272008, 29879, 126887, 62917, -25165, -159628, -239867, -19843, -170735, 93766, -79282, -282354, -14233, -191364, 87715, -303550, -39982, 61650, 18089, 126288]
17937A26288r738a52686c8975B95694a09672H520K7261P2001D2474J89496a06537
17925d28691a68214P6107d3900j6124H1578O0281d2196G8425c1148A49284a03342
17913a83181B18605f2331A35606a82718A42771d7047k39319J4576f2865j02052
17903a64917G2956K5524N8937h0652j8607j62633C21045A49661g9571p4522L4229
17892a19864l5317r2354B69107q4258K9442e7218j53468B15749i4615k1655A14938
17880B21233p1078k6616K678a98656R4828a0197E8825J11342C4413A7083L23484
17869C40567b05723j75505I8998K48560H2124b3237l8924k5750C88442a25896
17858A01381b31128r2972a09820n4314B92441i6986a9957O520k07315h240A1084
$$ y = [126288, 116550, -152686, -38975, 295694, -109672, 8520, 35781, 107782, 42474, 231970, -106537, -428691, -168214, -92107, -43900, -60024, 81578, 141859, -42196, 78425, -31148, 149284, -103342, -183181, 218605, -62331, 135606, -182718, 142771, -47047, -286366, -271790, -62865, -164917, 72956, 98480, 157417, -80652, -99259, -261892, 321045, 149661, -79571, -154093, -119864, -155181, -247535, 269107, 184849, 214291, -57218, -210686, 215749, -94615, -116270, 114938, 221233, 150155, 123539, 126217, -198656, -103828, -10197, 58825, 170167, 34413, 17083, 340567, -205723, -381228, 98998, 347558, 82124, -23237, -62161, -87911, 388442, -125896, 101381, -231128, -324100, -109820, -164134, 292441, -96986, -19957, -13437, -220752, -8240, 11084]
17846A13597B5944h775m31454i6376B50722J90550h9223B03556n2148m086e0106
17834A1634a3105l27527H0364J96557a87206C4620a01465l2970A58027k2573f8898
17822a3718A00690a72542M1898A45879c7798A00119J43428b8448A63584h1684
17811A42632c2079j32173M5703H5785a26136C15368a29815G0746J01002g1508
17800f3237n7666l40882A8976O0450b4451A36279a4237j08100a3564n1371K3160
17789d1775H8274a58489A05788a29260d8463l71816d8438k73631E2772i9171A65394
17777h9566j67143r8601m3910a38247g361A0783P1595h6119B51605g230A55160
17765e4725o9886A77725N8304D2293a55061B34292A14113b06613G781Q0781i3325
$$ y = [113597, 25944, -8775, -440229, -96376, 250722, 441272, -89223, 203556, 151408, 147322, -50106, 11634, -13105, -340632, 80364, 276921, -187206, 34620, -101465, -134435, 158027, 135454, -68898, -13718, 100690, -172542, -130644, 145879, -37798, 100119, 243547, -28448, 163584, -81684, 142632, -32079, -164252, -118549, 85785, -126136, 315368, -129815, 70746, 171748, -71508, -63237, -120903, -461785, 18976, 79426, -24451, 136279, -14237, -122337, -13564, -64935, -41775, 88274, -158489, 105788, -129260, -48463, -420279, -48438, -322069, 52772, -99171, 165394, -89566, -256709, -355310, -399220, -138247, -7361, 10783, 82378, -86119, 251605, -7230, 155160, -54725, -124611, 177725, 236029, 42293, -155061, 234292, 114113, -206613, 7781, 88562, -93325]
17753A25215c05588B75725E4941g9404A1757b7040J835k1701E430a06082A8416
17741a77278P1051q1201N4939H538J35891A1709J28317l4742l1952c9802A02549
17729h8384R292A45485k7288b57761B00833J3720E6164i8965A59141O7487q4106
17718A42522a7675A35995Q7870c868j85995I240L0886a04277K1970j25359h8284
17706g2714p6171c409B47497h2296H8102a26667B11798A03297b11039g9895E4753
17694C0002n540h7740j99394i8555A95716b4845A67473c661C9239e4953I1673
17682a50403A74837i6263j10437n5142A70796K703J28571A40200a38046N9107
17672g8939A53610g6486A66614f9314j11293b7399o2746H1451a07318a3717j40400
$$ y = [125215, -305588, 275725, 54941, -79404, 11757, -27040, -25205, -46906, 5430, -106082, 18416, -177278, -106227, -187428, -132489, 8538, 144429, 11709, 140026, 105284, 73332, -39802, 102549, -88384, -79092, 145485, 118197, -257761, 200833, 214553, 56164, -98965, 159141, 226628, 142522, -17675, 135995, 223865, -3868, -189863, 9240, 40126, -104277, -82307, -207666, -88284, -72714, -148885, -3409, 247497, -82296, 88102, -126667, 211798, 103297, -211039, -79895, 54753, 30002, 24462, -87740, -287134, -98555, 195716, -24845, 167473, -3661, 39239, -54953, 91673, -150403, 174837, -96263, -206700, -261842, 170796, 173499, 302070, 140200, -138046, -78939, 153610, -76486, 166614, -69314, -180607, -27399, -90145, 81451, -107318, -13717, -154117]
17661a54117A60753d907C49080A74104b3873L577n1950j17728Q0882A73052G3248
17649F8068a28002e7360j8671A99136a06891N2718q5035A53165a77960o4847A51411
17637A77862a00709A4565b72329A62070B6024b25078b8858C4375K9215J0161N4713
17626A28464b23675d4056D6216P6450P0073B8851M6987R6669c5478a6042G305
17614E4055M39451b16328m8462R2744H173b10453J01309C94653A5104L9152a87620
17602C53630A30306F817J35906a89723C54661A50461a76083H9153k6589K39633
17592C02197C2605L72663A47904A7249J52070a87049e8887A9810a40525A73506
17581A21363a59077h854l02603F7922N730c9687k8096A81391i3653K2518o1380
$$ y = [-154117, 160753, -4907, 349080, 174104, -23873, -20296, -72246, -189974, -109092, 173052, 73248, 68068, -128002, -57360, -76031, 199136, -106891, -54173, -139208, 153165, -177960, -242807, 151411, 177862, -100709, 14565, -272329, 162070, 26024, -225078, -28858, 34375, 63590, 73751, 128464, -223675, -44056, 46216, 122666, 192739, 28851, 75838, 172507, -35478, -16042, 7305, 54055, 493506, -216328, -264790, -172046, 8173, -210453, -109144, 394653, 15104, 54256, -187620, 353630, 130306, 6817, 142723, -189723, 354661, 150461, -176083, 89153, 62564, 302197, 32605, 405268, 147904, 17249, 169319, -187049, -58887, 19810, -140525, 173506, 121363, -159077, -8854, -311457, 67922, 73652, -39687, -67783, 181391, -93653, -71135, -132515]
17570a32515J5096B8923b00446J0521Q6193A02337L05801A9368a54983A90961
17559a56393e5263j65186E6613K8784b0066B26080G8591h6803F632c09588B92662
17547a3611A97427l9184J67053e5542R139I8269b09168C409K64120d543n6796
17536f1339B46408b18456a7846G8804K00536e6190A61550a74007A02104A671J71088
17525A72759A4049J51848H2895a77143A39803L5984E2141q04a30096K7488B3075
17513a028A88926b53053e34A78390L2659D4796l055I293e0232m5161c6730A4607
17500A56195l0243E1213a31062A92888K8918o8918a04903A03630C3151g6352G4459
17488A92875b3082j13880A24049a73826h3201H2163c5955H1999J22940a15407
$$ y = [-132515, -117419, 28923, -200446, -189925, -103732, 102337, 408138, 19368, -154983, 190961, -156393, -55263, -220449, 56613, 85397, -20066, 226080, 78591, -86803, 6632, -309588, 292662, -13611, 197427, 158243, 325296, -55542, -46403, 98269, -209168, 3409, 267529, -4543, -61339, 246408, -218456, -17846, 78804, 279340, -56190, 161550, -174007, 102104, 1671, 172759, 14049, 165897, 82895, -177143, 139803, 175787, 52141, 51337, -130096, -102608, 23075, -1028, 188926, -253053, -534, 178390, 211049, 44796, 41741, 9293, -50232, -95393, -36730, 14607, 156195, 125952, 51213, -131062, 192888, 221806, 152888, -104903, 103630, 33151, -76352, 74459, 192875, -23082, -136962, 124049, -173826, -83201, 82163, -35955, 81999, 204939, -115407]
17477A99015M7059R8438j42852p9016J64892E9006J37337b57721A50424J37791
17467B88215A26933b8376A25363O8621F8069O1772h493C4540a9620B85100j08238
17456A76862J73883a29677A58378l8127K33596r7879p0662K71491j3053k20379
17446B23365N8997K98989j66314l1258a79680L884B89918b4587B3409R121J83200
17435B15730j05668J28752L01507k42545a01947B76882P4574j19794p5820A8713
17424A95635N3591o828l1898q9497L38942j35225N6463f2139B90284N8131n5842
17413B92573F5881K81589j9060o4795H2088J6896c5913D17121A04662m4942J62468
17402B22188c6102l0358D504K88246e0786b5115B35961J19468j00464f3880A0668
$$ y = [199015, 246074, 344512, 201660, 122644, 287536, 59006, 196343, -257721, 150424, 288215, 126933, -28376, 125363, 193984, 68069, 129841, -8493, 34540, -19620, 285100, 176862, 350745, -129677, 158378, 120251, 353847, 255968, 185306, 456797, 443744, 223365, 282362, 581351, 415037, 383779, -179680, -175796, 289918, -24587, 23409, 32530, 215730, 110062, 238814, 540321, 297776, -101947, 276882, 351456, 231662, 155842, 18713, 195635, 249226, 242398, 210500, 121003, 459945, 324720, 381183, -62139, 290284, 348415, 292573, 65881, 347470, 328410, 263615, 82088, 98984, -35913, 417121, 104662, 59720, 222188, -36102, -66460, 4504, 292750, -50786, -25115, 235961, 355429, 254965, -63880, 10668]
17390B08537r5704k4096K01791A2386c43596B43693A1807J97431O0137o8124A0439
17378e8078B72640q9113G1708P9000J74561l7947A22938J20260p2210P6451O276
17367B53715p6652C9827L14279j62131m9943e544L8G9932e4300A66082L20224
17356D86306o1563a08713A31905b2632p7723B12288a03168r0856A52895j5890
17346A37005b7631A43156j4091J6681J83029c57541B06223c1883B85504a19388
17335g1178H1805L01232D1865L72833A29386K72331c59370B31343j4364L9377
17325B56356a10985D4396J56941D4041L79148b31722B46179H5244m2035L15600
17315C58809f2436A32697b4675n8910m5061C57495A74857L5081J2005r6729H939
$$ y = [208537, 112833, 88737, 290528, 12386, -343596, 243693, 11807, 209238, 269375, 201251, 10439, -58078, 272640, 183527, 71708, 150708, 325269, 287322, 122938, 243198, 170988, 247439, 253715, 177063, 39827, 354106, 191975, 142032, -5544, -5506, 79932, -54300, 166082, 486306, 424743, -108713, 131905, -22632, -100355, 212288, -103168, -194024, 152895, 137005, -27631, 143156, 129065, 145746, 328775, -357541, 206223, -31883, 285504, -119388, -71178, 81805, 383037, 41865, 414698, 129386, 401717, -359370, 231343, 216979, 256356, -110985, 44396, 201337, 44041, 423189, -231722, 246179, 85244, 43209, 358809, -62436, 132697, -24675, -83585, -128646, 357495, 174857, 209938, 221943, 125214, 8939]
17303a41434B85604b5914F27881A33801N2971K10530j20230a566A62630D624j744
17292B880N6327c0175B36004J82551F8690Q4346h1033b4270P313j01356I4231
17280A09911l3561J23267J67055b17607G4289L0553K21420a55036C32438J2864
17270C45302o2027l2891J849i1417B67229L6246N0405o9967C2140K60635j5922
17259B76853H828M57429G3305K32769H2811J54530j02760C0553M0588L32261j67709
17248B35693A15750O729K8421f0632H6193K56201O4339j11428A03097P9450p7718
17237A04829l7498P4229K86110j21764r2242j9050b11637A6005O9610a88187H8799
17225C39831o6046n735k5371I2256M9189L23632h4670A93764M0642h3343D47021
$$ y = [-141434, 285604, -25914, 627881, 133801, 186772, 397302, 277072, -1566, 162630, 4624, 2880, 59207, -30175, 236004, 418555, 68690, 153036, -81033, -24270, -16957, -118313, 94231, 109911, 76350, 199617, 366672, -217607, 74289, 104842, 326262, -155036, 332438, 345302, 283275, 250384, 252233, -91417, 267229, 303475, 353880, 283913, 32140, 292775, 276853, 8828, 466257, 73305, 306074, 82811, 237341, 134581, 30553, 71141, 403402, 235693, 115750, 122479, 150900, -60632, 86193, 342394, 406733, 295305, 103097, 182547, 104829, 67331, 141560, 427670, 305906, 213664, 194614, -211637, 16005, 85615, -188187, 88799, 339831, 273785, 268050, 242679, 92256, 141445, 465077, -84670, 193764, 234406, -83343, 447021]
17213B73652l0723F5292A1789K0382b4958H6135J95529N6340O234j68758d0257
17201F7181J08446P7079j0584M4057j938K945d0361A39287O9986J01234m319j22394
17189A83794G3002J85551K36473j40443G9722M4819l2248J37515I7387K49832
17179C47219A21260O0313P6681k3722d2511C31744A48195J62886A48902O0374
17169B09276K72089r7628j87111K42343r7819j44247J30776I5832K10838d7121
17158F79297B97105J717a1312E43658B03637p4068j8410K99945B03925f6555C00205
17146a29402D15330r2151J01039j41125k1175A3383K44244K65079B34762E9412
17135e2787B36960r8501R4982Q4411j12372J94995L5770J47910A29405N983L4525
$$ y = [273652, 242929, 65292, 11789, 32171, -24958, 86135, 281664, 338004, 344238, 175480, -40257, 67181, 175627, 252706, 242122, 286179, 284241, 287186, -40361, 139287, 209273, 310507, 306188, 183794, 73002, 258553, 495026, 354583, 79722, 124541, 92293, 229808, 97387, 347219, 121260, 181573, 258254, 234532, -42511, 331744, 148195, 311081, 148902, 209276, 481365, 383737, 196626, 438969, 341150, 196903, 327679, 95832, 306670, -47121, 679297, 297105, 298822, -11312, 543658, 203637, 129569, 111159, 411104, 203925, -66555, 300205, -129402, 415330, 323179, 424218, 283093, 261918, 13383, 257627, 522706, 234762, 59412, -52787, 236960, 138459, 233441, 317852, 205480, 400475, 436245, 584155, 129405, 135388, 169913]
17124A69913K48141j1387p4998m5070K58392E911L58711K5750A22626D3743J79975
17113B23718J4191j01911g77C33532j06968K1986p8038D3204M92755B65693q0590
17102A85103q0361D5862K28253a61543B55405L07394k31606A52535J42891A36459
17091B08527p7489K01679J67198L4524k15585J02383j32506K30848j68551E8832
17080D23103j46439J28674O4961r6397j81148p5102J05203m4190o4108P7332J70752
17069C62641l6615n1920N8760q6611a02975E51403J25007C06215J68824j24661
17059C50378A08677O24748B71669L31834k56701J45488K56739B88825J93692j06757
17049C75760e3846E97492j98648p6601L43707k49119Q7491j48276M45091k74581
$$ y = [169913, 418054, 406667, 331669, 286599, 544991, 5911, 364622, 390372, 122626, 43743, 223718, 237909, 135998, -777, 333532, 226564, 248550, 170512, 43204, 535959, 265693, 185103, 104742, 45862, 274115, -161543, 255405, 562799, 331193, 152535, 295426, 136459, 208527, 131038, 332717, 499915, 534439, 318854, 421237, 288731, 519579, 351028, 58832, 423103, 276664, 405338, 470299, 373902, 192754, 117652, 222855, 178665, 114557, 191889, 362641, 326026, 274106, 332866, 246255, -102975, 551403, 676410, 306215, 475039, 350378, 108677, 733425, 271669, 603503, 346802, 492290, 749029, 288825, 482517, 375760, -53846, 597492, 398844, 322243, 665950, 416831, 504322, 356046, 801137, 526556]
17039E26556M7013K24490k78522j04670J10336m5764K38460j52253O4960o0888
17029E69718j16876N8321K84886k93355j79436K07432O2463k13838M6458J02685
17019E28458J37850O4495k15392R7012J07587n2955j50343j55815J42556j09483
17009C93970Q2142J71766l9302q8282J27774q7519J02356k02674J16772O7475
16999F44478j95424J30257j28586M10608l74623M8506Q2732p0408M16757l76389
16989E87908K8741K29730J9115j19115k11980L11714l72034L25598l45472K74398
16979G28603J55711l29099K95953j5153j27897K66377j77353p1393j0863K8630
16969G43516Q5150J01624l5057k65724K30861q3551J04723k21606L69835k32505
$$ y = [526556, 573569, 798059, 519537, 414867, 525203, 479439, 717899, 565646, 630606, 569718, 452842, 511163, 796049, 502694, 323258, 530690, 593153, 379315, 425773, 528458, 666308, 730803, 515411, 612423, 720010, 667055, 516712, 360897, 503453, 393970, 476112, 647878, 608576, 520294, 648068, 560549, 662905, 460231, 577003, 644478, 449054, 579311, 450725, 861333, 486710, 535216, 617948, 547540, 964297, 587908, 616649, 846379, 865494, 746379, 534399, 846113, 474079, 799677, 454205, 728603, 884314, 555215, 851168, 836015, 708118, 974495, 797142, 725749, 714886, 743516, 828666, 930290, 895233, 629509, 860370, 776819, 881542, 659936, 1029771, 797266]
16959G97266J25415l91450l1051M22798m40022J30060J61900J42442l2116M735
16949H89977R2835M0979j16930J28271k29420K32393Q7230Q5489k64338J23774
16939A070260l60300J07348J66570k38503L44242J58234k14189j09730k88993
16930F34939L70494n9921j09045J72957Q5322N7267M33954m97934K16312p1278
16920A233067j57667K64750p8554k89990K08345J49157j54500O8170K07832o9153
16910A381457M7016m50722M14229j32066k15631L03112J04387R1711j02784k56407
16900A184302M34875j4964l50640L01218k82563K87141L9398O9349k23452J62611
16890A607275R490J09622l23700Q8651J51369K63372j08395j12219p9392L02100
$$ y = [797266, 922681, 531231, 500180, 922978, 482956, 613016, 774916, 917358, 885242, 889977, 982812, 1023791, 906861, 1035132, 805712, 1038105, 1125335, 1210824, 946486, 1070260, 709960, 817308, 983878, 745375, 1089617, 1247851, 1033662, 923932, 634939, 1005433, 945512, 836467, 1009424, 1094746, 1152013, 1585967, 1088033, 1304345, 1233067, 1075400, 1340150, 1261596, 971606, 1179951, 1329108, 1174608, 1242778, 1450610, 1381457, 1428473, 977751, 1391980, 1259914, 1044283, 1347395, 1451782, 1543493, 1440709, 1184302, 1619177, 1604213, 1253573, 1554791, 1272228, 1559369, 1598767, 1668116, 1444664, 1607275, 1616765, 1726387, 1402687, 1491338, 1642707, 1906079, 1797684, 1685465, 1606073, 1908173]
16880A908173p4526l8823K93096Q0365o91283O63785k411j09705n8517K95224
16870B265378j95912j67285N22969l26791k19871N54870j9462q0620P2528j8189
16860B387615k4068K13759N7306k89053q8375N60125M1415k41819l2769J36863
16850B720999j20346K83284J7407j45053J53222J6385p7528K19433j08266J0193
16840B969730K44540O6499j87047J26090j15429L83405j32698N7275L94906P8589
16830C885860k14859l8071N84332l00820L12810L210k39705J57037L68425m44294
16820D073925P00046J77078p34954N91580R5127L10824R4145m20952M87112p6867
16810E297064K7729L38593J13711j19193R9035J84528K04447P3464M11590j68683
$$ y = [1908173, 1833647, 1794824, 2087920, 2168285, 1477002, 2140787, 2138376, 2028671, 1970154, 2265378, 2069466, 1902181, 2425150, 2098359, 1878488, 2433358, 2413896, 2333276, 2405804, 2387615, 2363547, 2577306, 2634612, 2345559, 2257184, 2817309, 2858724, 2616905, 2584136, 2720999, 2600653, 2883937, 2901344, 2756291, 2909513, 2925898, 2848370, 3067803, 2959537, 2969730, 3214270, 3280769, 3093722, 3219812, 3104383, 3487788, 3355090, 3412365, 3807271, 3885860, 3671001, 3632930, 4217262, 3916442, 4229252, 4232462, 3992757, 4149794, 4518219, 4073925, 4773971, 4951049, 4216095, 4807675, 4902802, 5213626, 5307771, 4886819, 5373931, 5297064, 5324793, 5663386, 5777097, 5657904, 5756939, 5941467, 6145914, 6219378, 6630968, 6462285]
16800F462285K9280K32279N13797J74995m2392L67834P6953K07209K18746L51571
16790H592557Q1918N7912K82610R197O28048j67292M01580N39485K27240K82936
16780A0936191L46866K56180L64571J02831M90685L72907N97035J79927L39286
16771A3986479P82323O83426L52853N72425K49955O70795P04781P60349N22878
16762A9286264Q36691Q15857L81910J104677R29135J038320J195967R69902J125439
16753B7684162J469723J278676J237758J372138J918536J853299J906893J535937
16745D0257122K607920K225865K074818K656701K879076K747826L472311K972056
16737F1893695L964567L811668M497228M339444M747842N215191N043287N568543
$$ y = [6462285, 6491565, 6723844, 7237641, 7412636, 7370244, 7738078, 7815031, 8022240, 8240986, 8592557, 8674475, 8732387, 9014997, 9024194, 9652242, 9484950, 9886530, 10426015, 10653255, 10936191, 11283057, 11539237, 11903808, 12006639, 12497324, 12870231, 13467266, 13647193, 13986479, 14768802, 15452228, 15805081, 16377506, 16627461, 17298256, 18003037, 18763386, 19286264, 20122955, 20938812, 21320722, 22425399, 23354534, 24392854, 25588821, 26558723, 27684162, 29153885, 30432561, 31670319, 33042457, 34960993, 36814292, 38721185, 40257122, 42865042, 45090907, 47165725, 49822426, 52701502, 55449328, 58921639, 61893695, 65858262, 69669930, 74167158, 78506602, 83254444, 88469635, 93512922, 99081465]
16729I9081465O256477N761105O268188O207044O231355O562966O404480N714728
16721A48487808M784153M815165L892664K912254J824571R15569l03632j268105
16713A66060447k234543l737417m188976m649494n539224o524585n928746o517639
16705A26739823o626085o194653o363245o122811n855162n618567n179798m825233
16697G9954269m506884m767059l840754l611367l967957l203822k741524l141370
16689E0173532k687612k292754k718849j988161k325394j507111j979052j687985
16681C2986614j394452j212393j700759j245087r50580j647307q30211j107682
16673B2898143j032294l39062j206254o82434p80318o26059o68486q37027o91030
$$ y = [99081465, 105337942, 111099047, 117367235, 123574279, 129805634, 136368600, 142773080, 148487808, 153271961, 158087126, 161979790, 164892044, 166716615, 167632184, 167328552, 166060447, 163825904, 160088487, 155899511, 151250017, 145710793, 139186208, 133257462, 126739823, 120113738, 113919085, 107555840, 101433029, 95577867, 89959300, 84779502, 79954269, 75447385, 70680326, 66839572, 63228205, 59260248, 56056426, 53314902, 50173532, 47485920, 45193166, 42474317, 40486156, 38160762, 36653651, 34674599, 32986614, 31592162, 30379769, 28679010, 27433923, 26483343, 24836036, 24005825, 22898143, 21865849, 21526787, 20320533, 19638099, 18857781, 18231722, 17563236, 16726209, 16035179]
16664A6035179k32050j040396R692o11315m43737r65795m05910n03661n292j90948
16654A1645767p88856m7985m19899k29247k2263q75837j89970k75244J7284j49409
16644H664341k66344p7851m20807k41499l20509j53382r7174l31615L2543n17293
16634F270410J8961m150J17123j82395m27211r4786n77955K67651Q5498k85255
16624E187891l8132j90424m9161j28458j4550l34675P4231m43608M97068l32408
16614D227774k2275J5674m32976K31115m40490r7923p9881L38930l00727J30140
16604C569361m5711k60343K03089l33780K36857j02969l79899M2374P5866l09191
16594B695654K17545k30418j07695j75537m7207K70827j46051L36433k78750n0903
$$ y = [16035179, 15803129, 14762733, 14772425, 14161110, 13717373, 12751578, 12345668, 11842007, 11836715, 11645767, 10856911, 10808926, 10389027, 10159780, 10137517, 9261680, 9071710, 8796466, 8813750, 8664341, 8397997, 8320146, 7899339, 7657840, 7337331, 7183949, 7086775, 6755160, 6787703, 6270410, 6289371, 6285221, 6402344, 6219949, 5792738, 5697952, 5119997, 5387648, 5473146, 5187891, 5149759, 4959335, 4910174, 4781716, 4767166, 4432491, 4506722, 4063114, 4560182, 4227774, 4205499, 4221173, 3788197, 4019312, 3578822, 3480899, 3401018, 3739948, 3439221, 3569361, 3523650, 3263307, 3466396, 3132616, 3369473, 3266504, 2886605, 2928979, 3004845, 2695654, 2913199, 2682781, 2575086, 2399549, 2352342, 2623169, 2477118, 2813551, 2534801, 2483898]
16584B483898j70382j06936O90m0706O7575J61668m01949K4301p240j23386K02739
16573B090272j56728J38989P9079l28695r2675J94065J70775n87591K24552K10374
16563A942417k25768p7612j02117L55475k58860l76674M69391J28610l17064L00218
16553A838016p01809M04826l55248K62357l44198L23014p3820j33919J81572k73917
16543A126874K99893R5873j83975J38406j86003k4621J99233k12096k38312j42698
16533H72574J70462J63573P2176k27906R9714J03343R7606k14516l2166m66658
16523F38202M38926m6049j02858n1659J24920j19803j91010P57926o26098K50636
16513A073133j55469k81751L92187l22970L7712K77717m26922K64555M938j58148
$$ y = [2483898, 2313516, 2206580, 2207270, 2166564, 2234139, 2395807, 1993858, 2018159, 2010919, 1887533, 2090272, 1933544, 2072533, 2151612, 1822917, 1730242, 1924307, 2095082, 1507491, 1732043, 1942417, 1716649, 1639037, 1536920, 1892395, 1633535, 1256861, 1726252, 1854862, 1537798, 1838016, 1136207, 1541033, 1185785, 1448142, 1103944, 1426958, 1353138, 1219219, 1400791, 1126874, 1426767, 1522640, 1338665, 1477071, 1291068, 1266447, 1465680, 1253584, 1015272, 872574, 1043036, 1206609, 1278785, 1050879, 1150593, 1253936, 1351542, 1137026, 1104860, 638202, 1077128, 1031079, 928221, 876562, 1001482, 881679, 690669, 1448595, 822497, 1073133, 917664, 635913, 1028100, 705130, 742842, 1020559, 593637, 858192, 863130, 704982]
16503G04982M97512l55798Q2141j09618j2536J39911k72214J80334j94990L312
16493F63036N3483o2872M7329o5306k130M9883n7896K93095l08333J32327m8176
16482F94440J97184j42554k41715L79671l65278J6861j69059L24712K5423j63290
16472E56395K36964j9694k50657O8741P6915j87322o232K41584o0691J02970l62673
16461C96300k7002M54062j68489j75725L28112j58837K77160l10306N0859L909
16451F70043Q1306r0941l25639J48379o8354J58699A53708L97842j45530L3739
16441D39759j10258j13583J80699N5597j91994L50781k83537K70171K49786k22854
16431F24567B53332N7116L51018l0698B65621J26259J26420B20650N6982K64828
$$ y = [704982, 1202494, 846696, 928837, 819219, 806683, 946594, 674380, 854714, 659724, 663036, 716519, 653647, 700976, 635670, 633540, 683423, 625527, 918622, 610289, 742616, 694440, 891624, 749070, 507355, 887026, 521748, 538609, 369550, 694262, 719685, 556395, 793359, 773665, 523008, 591749, 668664, 481342, 475110, 716694, 656003, 758973, 396300, 369298, 823360, 654871, 479146, 807258, 648421, 925581, 615275, 666134, 670043, 751349, 660408, 334769, 483148, 414794, 573493, 153708, 551550, 406020, 439759, 329501, 215918, 396617, 452214, 260220, 611001, 327464, 597635, 847421, 624567, 253332, 310448, 661466, 630768, 265621, 391880, 518300, 220650, 277632, 542460]
16421E42460o9997j3019J46746j14295B23758J0591M86166h9029F13115j4455
16411E98660B38404M0599n4080K17816G0484M27609B0840O00644k33651N3587
16401D41420q4064j13097M24316B51773Q8729o5478A36492J34677D951M43801
16391D48752k0528b7788D31276A00383K88581K5413B00719J84884p1565q5467
16381B28571j9001M6907q3975P5060A13796D00O5422J74394J79116p8961Q5716
16370D26087A27280M33662o7121o9720J7621p2962C5390J03479J26180A23130
16359G6059J36072m9788R5440J1917H2033K68505H5726L1136J24182K12912A79385
16347A03849K01650p4439K69186C3941R4517a110B09939G1100O65352g416I9524
$$ y = [542460, 472463, 459444, 606190, 491895, 223758, 234349, 720515, -89029, 613115, 598660, 238404, 279003, 224923, 442739, 70484, 498093, 20840, 621484, 387833, 441420, 357356, 244259, 668575, 251773, 340502, 275024, 136492, 271169, 4951, 448752, 428224, -27788, 431276, 100383, 388964, 414377, 200719, 385603, 314038, 228571, 209570, 256477, 172502, 247562, 113796, 400, 65822, 240216, 419332, 340371, 426087, 127280, 560942, 493821, 424101, 441722, 368760, 35390, 138869, 265049, 123130, 76059, 212131, 162343, 257783, 269700, 82033, 350538, 85726, 116862, 241044, 453956, 179385, 103849, 305499, 231060, 500246, 33941, 128458, -1110, 209939, 71100, 736452, -7416, 99524]
16335D80878D0356c2009A15156D1169b1865A13605F527N3961a39355B58564K64702
16324E23266C7024L5919J15858p3705C2463J72867n4755L01200a55402A78961
16313D33680j54553G6460K47647j29313E3876K0954J27292c32875A54123e8252
16302G3535J4255g924A67980R2070d460A42547k6492R5308f5639B84044C0485
16290A86736p7939L0947J26039r266p8066D5082J04458e8565A14121J35970m9669
16279B00422b30746A17557n3722L06215c3403B65541j5359n757a42659G2447J16766
16268A89213O22m1867n7837k4307A3318f2928A26647c7486B98926C5107j7159
16257A7948g2143r570C13309o5458l2410b2086A40143m0078J26630p3959a3810
$$ y = [480878, 40356, -32009, 115156, 41169, -21865, 113605, 6527, 60488, -139355, 258564, 523266, 37024, 72943, 188801, 115096, 32463, 205330, 150575, 451775, -155402, 178961, 433680, 279127, 76460, 324107, 194794, 53876, 74830, 202122, -332875, 154123, -58252, 73535, 87790, -7924, 167980, 260050, -4460, 142547, 116055, 211363, -65639, 284044, 30485, 186736, 108797, 139744, 265783, 256517, 178451, 45082, 149540, -58565, 114121, 250091, 200422, -230746, 117557, 63835, 370050, -33403, 265541, 250182, 244425, -142659, 72447, 189213, 189835, 147968, 90131, 65824, 13318, -62928, 126647, -37486, 298926, 35107, 17948, -72143, -81713, 313309, 247851, 215441, -22086, 140143, 100065, 226695, 152736, -13810]
16245B67235B3306b53338A55924n2517J44906a92345n2954a21369H6314M5541
16235A31855J23400P7723g0448A35657j9238J1137h7379I2393K31428P3596A42635
16223A75149J2298h7751A48303m2172m0855h3383G6349a48198f8386k6932C17822
16211g5477j04126A07976J5639a35105K8541I1989R5825K343J39381A208J12502
16200A13710a85150B45333I7048a22444A60761j3069L20885H6152e3904B8340
16189a33709D56313A9168J32559b3753k7004a2794B08118N4503a580C7230M4468
16178H1698A1255Q7302J34640m6375J05299c56452H9004k7677H021P8143C4791
16166I3570C3409a85909B7990J11930a64160P3767B13715q3737b54679E32790
$$ y = [267235, 23306, -253338, 155924, 103407, 248313, -192345, -245299, -121369, 86314, 131855, 255255, 332978, -70448, 135657, 116419, 127556, -87379, 92393, 323821, 397417, 142635, 175149, 187447, -87751, 148303, 106131, 65276, -83383, 76349, -148198, -68386, -95318, 317822, -75477, -179603, 107976, 123615, -135105, -106564, 91989, 187814, 190157, 329538, 1208, 113710, -185150, 245333, 97048, -122444, 160761, 147692, 468577, 86152, -53904, 28340, -133709, 456313, 19168, 151727, -23753, -50757, -12794, 208118, 262621, -1580, 37230, 81698, 11255, 98557, 233197, 186822, 292121, -356452, 89004, 61327, 8021, 86164, 34791, 93570, 33409, -185909, 27990, 139920, -164160, -90393, 213715, 129978, -254679, 532790]
16155b91806H9376a62711j5299d8345a1233j34738N8717A63075p1484K43972d0615
16143a28506r2627j7287A10812K8290f0827A3825B939K1225N9808e1439j05114
16132a56553D49818D8063M6666b0694K147j4522A91819D8705a58005B73141i4511
16120c7622B4841M2066j2047a77763H3269a50441G7744d1259I7475a00785L0249
16109g0536B50550p8486D0340o399M59395a34547A81917G5769M05217g9405r92
16098h0397A04575A2384c1644C10246a52459E9340a31195F5954J83970a03114
16087h3641B9982a95414i7694k65122A9311a23811e5868l2010b1742B39284H8585
16075c2102H8157c01452E1161a35714O3694J575A30033C8172a44869M3853A90568
$$ y = [-291806, 89376, -162711, -178010, -48345, -11233, -145971, -87254, 163075, 91591, 335563, -40615, -128506, -221133, -238420, 110812, 139102, -60827, 13825, 2939, 24164, 83972, -51439, -156553, 449818, 48063, 94729, -20694, -18547, -33069, 191819, 48705, -158005, 273141, -94511, -37622, 24841, 66907, 54860, -177763, 83269, -150441, 77744, -41259, 97475, -100785, -70536, 250550, 172064, 40340, 33941, 493336, -134547, 181917, 75769, 480986, -79405, -80397, 104575, 12384, -31644, 310246, -152459, 59340, -131195, 65954, 249924, -103114, -83641, 29982, -195414, -97694, -362816, 19311, -123811, -55868, -87878, -21742, 239284, 88585, -32102, 88157, -301452, 51161, -135714, -72020, -70445, 130033, 38172, -144869, -101016, 190568]
16063G0009B6799d7176n5580A65955g3773c180D16863a6856j79903D3J9896J02625
16051A22564a41503D174g6396A52177f7499g660j53498e8765B19717I9519b45959
16039b93988C4503O1767c85983A40524R5438a62327F2668k9665J02262L4668a05324
16027F3237J7520b53734m8024e5835j24335E0806A8016L14182I0189B4287d1316
16015c7774k9927B65961j8829q9116a50914N1889B6195b73552A36013c9437C47004
16003C083J78356J4081a79954g2612A62440D1376R301K2200N5845c3054n7779
15992i0833C3014e9290K4536p8261L0968a5630k48686A01997J35080B3861L08937
15981C32798A47543b4634A12045O6726J2500b72575A30405L3294b8250e62j46700
$$ y = [70009, 26799, -47176, -102756, 165955, -73773, -3180, 416863, -16856, -196759, 43, 19939, 122564, -141503, 4174, -76396, 152177, -67499, -7660, -161158, -58765, 219717, 99519, -245959, -293988, 34503, 96270, -385983, 140524, 235962, -162327, 62668, 33003, 135265, 169933, -105324, 63237, 80757, -253734, -301758, -55835, -180170, 50806, 18016, 332198, 90189, 24287, -41316, -37774, -67701, 265961, 247132, 158016, -150914, -99025, 26195, -273552, 136013, -39437, 347004, 3083, 181439, 195520, -179954, -72612, 162440, 41376, 50677, 72877, 128722, -33054, -90833, 33014, -59290, -34754, -113015, -82047, -15630, -264316, 101997, 237077, 23861, 332798, 147543, -24634, 112045, 178771, 191271, -272575, 130405, 163699, -28250, -562, -147262]
15970a47262E7418j3753J83546K919B3085h7266C21387a64664D4057a62837A58954
15958i1051B21586d498k06983B68268g0893H0732b3372j35767L9655k3037b5917
15946c68832H4723K07642A88b16297a1325A20422g0883j66971A01172b39482a2011
15934e0631B10547I6917B2444c59968e9210F2954K4778d9149D3433P764d6626
15922b00540i3903A26543l3500a9014q7486D0539d16514E3795J84475A4171a04001
15910A22247c8169j4042f35A08928j1400h1668G085L741K5074L810b7832G9488
15897d7114B40251J91857a45268F8984f1414j31688j53292A13082a63713r081
15887a72794A69231a0105A42771b40016a876A1086K17866a27508M6573B43825
$$ y = [-147262, 57418, 43665, 227211, 230130, 23085, -87266, 321387, -164664, 44057, -162837, 158954, -91051, 221586, -4498, -211481, 268268, -70893, 80732, -23372, -159139, -119484, -142521, -25917, -368832, 84723, 292365, 188, -216297, -11325, 120422, -70883, -237854, 101172, -239482, -12011, -50631, 210547, 96917, 22444, -359968, -59210, 62954, 87732, -49149, 43433, 51197, -46626, -200540, -93903, 126543, 93043, -19014, -106500, 40539, -416514, 53795, 238270, 14171, -104001, 122247, -38169, -52211, -635, 108928, 97528, -81668, 7085, 10826, 35900, 39710, -27832, 79488, -47114, 240251, 432108, -145268, 68984, -61414, -193102, -346394, 113082, -163713, -172794, 169231, -10105, 142771, -240016, -1876, 11086, 228952, -127508, -80935, 243825]
15876A43768L4328f6926j45918B0065b2008j15106n928q0565d6505q4163Q285
15865a22383b7529A15299J94023A32838C6892c08844a6986I7400b397j81551b0787
15853B79981A12625b0917B23528n155k1733M370a46132I1945C3077f4109J8943
15842d5166j34611p3965c7136C2101c2174C136Q5607B396J83494R0400h1166K2632
15830e8534E7104a85138H9765p004e7204A55786C1744O9074c31530a09328l42638
15819d51966A2559Q7253b44873N1339i0621B28332b72006O0441E0554a87149A14175
15807G2236b47826b6316q9050A32627a09021k6202j2539b4250b184l56952J58248
15796b00888M5351G1984b65959c3598k5830K2737C976a71487g7861r5270A82140
$$ y = [143768, 178096, -66926, -212844, 20065, -22008, -137114, -143042, -223607, -46505, -130668, -122383, -27529, 115299, 309322, 132838, 36892, -308844, -16986, 97400, -2397, -183948, -20787, 279981, 112625, -20917, 223528, 218373, 196640, 201010, -146132, 91945, 33077, -64109, -45166, -179777, -253742, -37136, 32101, -32174, 3136, 88743, 2396, 185890, 276290, -81166, -58534, 57104, -185138, 89765, 82761, -57204, 155786, 31744, 100818, -331530, -109328, -451966, 12559, 99812, -244873, -193534, -90621, 228332, -272006, -211565, 50554, -187149, 114175, 72236, -247826, -26316, -115366, 132627, -109021, -135223, -147762, -24250, -2184, -359136, -200888, -155537, 71984, -265959, -33598, -59428, -36691, 3976, -171487, -77861, -173131, 182140]
15784A8055a79194B23732a16917k70227E9508K38134A7810J97851E4850P2414
15774A27264a84603g3103B58912b15121j28070J30539A58167D9999A9213J05508
15764A24721i1489l36464i0617d4988j052n4145j6616A96636m5425L7635a40866
15752B27067I6766O6020g1571A24309a93165k06748E8764J99b7576j92349D7060
15740B27003f0585k18209A12020Q757J43679K4013b25259Q6308E1825K54213h0656
15728I5119K25216a31354N9845A10910B7880L58149f3382C18665b72203f2404
15717a22715D09309B267J43466B4273a42582B0832J15170K1309C6432c57612l7931
15706c95543D1320A1449J6257J67102C7842a26535c6715A76056b62340e5888B57801
$$ y = [18055, -179194, 223732, -116917, -387144, 59508, 297642, 17810, 215661, 54850, 127264, -184603, -73103, 258912, -215121, -343191, -212652, 158167, 49999, 19213, 124721, -91489, -427953, -90617, -44988, -46040, -100185, -116801, 196636, 151211, 188846, -140866, 227067, 96766, 162786, -71571, 124309, -193165, -399913, 58764, 58963, -27576, -219925, 47060, 227003, -60585, -278794, 112020, 120777, 264456, 288469, -225259, -138951, 51825, 306038, -80656, 95119, 320335, -131354, -71509, 110910, 27880, 386029, -63382, 318665, -272203, -62404, -122715, 409309, 2267, 145733, 24273, -142582, 20832, 136002, 157311, 36432, -357612, -395543, 41320, 11449, 27706, 194808, 37842, -126535, -36715, 176056, -262340, -55888, 257801]
15694e484A33286A8768a7668g319q1163j17859B1901M3556L4954B5388a45442
15682A79598q9419b16116j9793e2255l48911a80131A30677a75962N7127c3989
15671C03551I6696j4538B5482Q5166d3194F9053M5724D7066K05768g7801D2648
15659a30123B19579a5235B75822a17244D305a70877h4367j05801C8371b15471
15648b9882A89253c84787B38218O2736A08700a97287H2356h5289c9075F8905k4825
15637D4080e4270K4296E1650g7870a2876j02006B9149P2224a30373A66371a6939
15625f2438C40145C5003P6521b74778Q3939D9284a74558J8750c350j10218B13796
15613g8498M57A77132a91227g4598j37455e4533C1546a91829A9222a32805d2192
$$ y = [-5484, 133286, 18768, -17668, -7319, -88482, -206341, 21901, 65457, 100411, 25388, -145442, 179598, 90179, -216116, -235909, -52255, -401166, -180131, 130677, -175962, -118835, -33989, 303551, 96696, 82158, 25482, 110648, -43194, 69053, 114777, 47066, 252834, -77801, 42648, -130123, 219579, -15235, 275822, -117244, 4305, -170877, -84367, -190168, 38371, -215471, -29882, 189253, -384787, 238218, 300954, 108700, -197287, 82356, -85289, -39075, 68905, 44080, -54270, -29974, 51650, -77870, -12876, -114882, 29149, 101373, -130373, 166371, -16939, -62438, 340145, 35003, 111524, -274778, -190839, 49284, -174558, -155808, -3350, -113568, 213796, -78498, -78041, 177132, -191227, -74598, -212053, -54533, 31546, -191829, 19222, -132805, -42192]
15601e62253B59194A01340a90136h262B12547e4477q4932D8273g949E9647a43374
15589D6719J29711O655b8390J3857E3288a37307B7576f9438A96103m0728B9807
15577b98143A60482J87684b57481f421C7709J26963C7850b15582B53360N759a64262
15565F2680J01000G4027f8220a452n7284E26h1982p2063g4770G0174Q89J4561
15553H5624a53932G0621J6536a7218C6968e8580P191j24650G9460a233n4553B0455
15540b9799e864A3468P9825f9489H6638b85517E736K16662A7822L15756C1376
15528d1081k29893A69419a40737E1498e1254l29238I1440D3152b09234f2860C25181
15516a00182B24833a38026q0617A40764b92574a27526A55087c62093A90042p4784
$$ y = [-562253, 259194, 101340, -190136, -8262, 212547, -54477, -139409, 48273, -7949, 59647, -143374, 46719, 176430, 183085, -28390, -14533, 53288, -137307, 27576, -69438, 196103, 155375, 29807, -298143, 160482, 348166, -257481, -6421, 37709, 164672, 37850, -215582, 253360, 259119, -164262, 62680, 163680, 74027, -68220, -1452, -58736, 526, -81982, -154045, -74770, 70174, 71063, 85624, -153932, 70621, 87157, -17218, 36968, -58580, -51389, -176039, 79460, -1233, -55786, 20455, -29799, -5864, 13468, 93293, -69489, 86638, -285517, 5736, 222398, 17822, 333578, 31376, -41081, -270974, 169419, -140737, 51498, -51254, -380492, 91440, 43152, -209234, -62860, 325181, -100182, 224833, -138026, -218643, 140764, -292574, -127526, 155087, -362093, 190042, 115258]
15506A15258D1753J28314J8131p2387a3962E3120j1250P1553m3244A7141a17968
15494A40074J20079c78312d7736E4929b31365D394e3312j96920L3211h8821A68268
15482C16492A27230c27782N6554a22592H1511a44703A33907c45635a52481A6294
15471A52259b4535m9823A58057l0138N358b70698d4755G0870i0826L121J9664
15460f8041c160j12446N7314j73960J15416c5592r6257C3092O144f0379k19898
15449b80277h5829j9712A69032a52200A78320b19106i7768D2993h6714a2429n5234
15438f7663F3913N7379b346g54C35745a45070l0413b5263i83G1763l4276K406
15426C9893n164J07316L503d6035J7361k17283A45671g0968E1207i0904N118l8969
$$ y = [115258, 41753, 170067, 188198, 115811, -13962, 53120, 41870, 113423, 70179, 17141, -117968, 140074, 260153, -378312, -47736, 54929, -231365, 4394, -53312, -250232, -217021, -88821, 168268, 316492, 127230, -327782, -271228, -122592, 81511, -144703, 133907, -345635, -152481, 16294, 152259, -24535, -74358, 158057, 127919, 133277, -270698, -44755, 70870, -90826, -87705, -68041, -3160, -115606, -58292, -232252, -116836, -35592, -131849, 33092, 39236, -60379, -280277, -85829, -105541, 169032, -152200, 178320, -219106, -97768, 42993, -86714, -12429, -67663, 63913, 121292, -2346, -754, 335745, -145070, -175483, -25263, -983, 71763, 37487, 39893, 34729, 142045, 145548, -46035, -28674, -245957, 145671, -70968, 51207, -90904, -85786, -124755]
15414a24755K7178l3288B88787c09024E9400B2632e0956B11599a83516b029j61783
15403a63812A1951h2196A5057f3775B40357b0094k14851I2238a14791H2571a0480
15391c3194l770B07503M1939r2966a84504r21Q5493B26706L9527b068n9349j12909
15379a74326F8029b43435g5875D1613N6825a73294f4029B12005a27014D0812e0889
15367b40765A6250K80152A8438a84400a2127G6742k2460d7970A66716E6848f748
15355B6363a41242p0487M7679A11846a41233A10855C5395i5138J9159K9934b1116
15343B0225J24260a4044E1596e63C39000c4550p9872B36161o7506p602E7589c2356
15330c5245j32235A77095n8737n1172a06313A4396R6327J98473D0427a12132M6897
$$ y = [-124755, -97577, -130865, 288787, -309024, 59400, 22632, -50956, 211599, -183516, -2029, -163812, 11951, -82196, 15057, -63775, 240357, -20094, -234945, 92238, -114791, 82571, -10480, -33194, -36964, 207503, 249442, 156476, -184504, -185425, -99932, 226706, 266233, -2068, -61417, -174326, 68029, -243435, -75875, 41613, 98438, -173294, -64029, 212005, -127014, 40812, -50889, -240765, 16250, 296402, 18438, -184400, -12127, 76742, 54282, -47970, 166716, 56848, -6748, 26363, -141242, -211729, -164050, 111846, -141233, 110855, 35395, -95138, -75979, -46045, -21116, 20225, 144485, -14044, 51596, -563, 339000, -34550, -114422, 236161, 168655, 161053, 57589, -32356, -35245, -167480, 177095, 118358, 67186, -106313, 14396, 110723, 309196, 40427, -112132, -65235]
15319f5235D3424a26509c8168A26019b01937b2510f980n9893B7845e1113j4035
15308f5148A96776g7930m2551B15488a85508H9955J77354a4030o1413A25394a51015
15296A53276E2754J49789H0472a04893A72832R3508p9587g5645K2245A4275N1436
15285F5711k0490Q6164J45563b4404j03541A26202c07737A24594J94847E5219
15274a13597L9450A74028a12318l7492B15151F6273J34839F9835J29261F9406
15263G7028a35450m5120A03440a62572A18889j2858P2076a07423E0414h3835B40812
15251B9843h602C66196J00289M20852K73268k76817R4739j11958B89853g4886
15240B65287o6623I0391R5793J05955g4197F2836N6331b83807A62126J80661B6505
$$ y = [-65235, 43424, -126509, -38168, 126019, -201937, -22510, -6980, -66873, 27845, -51113, -65148, 196776, -77930, -120481, 215488, -185508, 89955, 267309, -14030, -75443, 125394, -151015, 153276, 52754, 202543, 80472, -104893, 172832, 266340, 186753, -75645, -53400, 14275, 65711, 45221, 131385, 276948, -24404, -127945, 126202, -307737, 124594, 319441, 55219, -113597, -74147, 174028, -112318, -149810, 215151, 66273, 201112, 69835, 199096, 69406, 77028, -135450, -180570, 103440, -162572, 118889, 106031, 178107, -107423, 50414, -83835, 240812, 29843, -8602, 366196, 466485, 887337, 1160605, 883788, 978527, 866569, 289853, -74886, 265287, 198664, 90391, 186184, 292139, -74197, 62836, 119167, -283807, 162126, 342787, 26505]
15228B55533J04268j54387E6543a07615j54803B06544o7555K1366a77674A64480
15217e7348A63259J71052b41520i4044A79620a81595A54810D7427d9638I043K0723
15206B9766R7018C6616J17868c4279A82946j4420e4874m4050o083b8254j88247
15195b16501c4747n3479a4771r8026p7577A96609a33955j5620d7683C16448j05388
15184B11060F8491J18289a77005r8535J26864e9577I6099a18546a7308A73494
15173A11415e49012B15404p0961n9016R0431p6856C8874j3443J22721g1611A9969
15161G2522a89730J8225B99724C1239a38367A57940N9284F9963J27005k4769f7753
15149I9630D5582a11790B62351j22476a1938j36711B81714j03321n9495l0676
$$ y = [255533, 359801, 205414, 56543, -107615, -262418, 206544, 138989, 160355, -177674, 164480, -57348, 163259, 334311, -241520, -94044, 179620, -181595, 154810, 47427, -49638, 9043, 29766, 126784, 36616, 154484, -34279, 182946, 168526, -54874, -98924, -105007, -28254, -216501, -34747, -88226, -14771, -112797, -190374, 196609, -133955, -149575, -47683, 316448, 211060, 68491, 186780, -177005, -275540, -148676, -59577, 96099, -118546, -17308, 173494, 111415, -549012, 215404, 144443, 85427, 175858, 99002, 38874, 25431, 148152, -71611, 19969, 72522, -189730, -171505, 299724, 31239, -138367, 157940, 217224, 69963, 196968, 172199, -67753, 99630, 45582, -111790, 262351, 139875, -11938, -148649, 281714, 178393, 118898, 88222]
15139H8222k9251J33026B3656K33519e771H0266J56497Q0675a30326A92776G1971
15127B9865e2653B13881C87a8682k2064C75756A51026N1478o7351J2955k6159
15116A21949c866F5085M332A1159J06235k2910k3140C0660O2945a01618m1576
15105a43194A82306j7079B6803a25381j8227A32192M8174E5304B1837J5705i7503
15093C51128c00338A9147a24123G7431a43092c6659B8682M0614k9117L33317A24418
15081H5902a55035q2986B4290K83254h4627k8554B88952K37780A26887E4706J32148
15070A86854K73077j35730a09539B70323p0698C0423c5796a3025n0302A59649
15059c0529o6116G1974K54748M2926k0924b02952G0292J09042n670l4966O6901
$$ y = [88222, 58971, 191997, 23656, 257175, -5771, 80266, 236763, 317438, -130326, 192776, 71971, 29865, -52653, 213881, 387, -18682, -40746, 375756, 151026, 202504, 135153, 148108, 121949, -3866, 65085, 69417, 11159, 117394, 94484, 71344, 30660, 93605, -101618, -143194, 182306, 165227, 26803, -125381, -143608, 132192, 180366, 55304, 21837, 37542, -97503, 351128, -300338, 19147, -124123, 77431, -143092, -36659, 28682, 69296, 40179, 373496, 124418, 85902, -155035, -238021, 24290, 307544, -84627, -113181, 288952, 526732, 126887, 54706, 186854, 459931, 324201, -109539, 270323, 199625, 30423, -35796, -13025, -63327, 159649, -30529, -96645, 71974, 326722, 369648, 348724, -202952, 70292, 179334, 173664, 138698, 205599]
15048B05599f1464B08265D8122M84324B30569G6759L45753C8291J70788E1194
15037G7643j3263a50561F2947J31813q4692J1496a47897B26318I1356J27903c3659
15025C67709A34503K05419F7297L79257A20445J16459Q4711a8129D80095a22788
15014A81517B1182O22868g1965B71297N1485I5189r758L46031A13139O4797J42017
15003C19953A34944K17235I7382Q0022K8935B3175J0030L10251O7709j98808g6472
14991A15726a7069j65135B55379H6587J99506J23877c2888A95908B5817L18556
14981C44373k9289Q8820j69815d769A82068O5568p5102P9040j19491K11439A2346
14969C68841a02877B46684f4832H3940K14147Q794j0433n9787j04955J56979j09896
$$ y = [205599, -61464, 208265, 48122, 532446, 230569, 76759, 422512, 38291, 209079, 51194, 77643, 64380, -150561, 62947, 194760, 110068, 121564, -147897, 226318, 91356, 219259, -33659, 367709, 134503, 339922, 67297, 446554, 120445, 236904, 321615, -18129, 480095, -122788, 181517, 21182, 644050, -71965, 271297, 322782, 95189, 85431, 431462, 113139, 177936, 319953, 134944, 352179, 97382, 177404, 206339, 23175, 33205, 343456, 411165, 212357, -76472, 115726, -17069, -182204, 255379, 86587, 286093, 409970, -32888, 195908, 25817, 344373, 315084, 403904, 234089, -4769, 182068, 247636, 172534, 251574, 132083, 343522, 12346, 368841, -102877, 246684, -64832, 83940, 298087, 306881, 296448, 236661, 131706, 288685, 178789]
14958A78789J98299A08844B510L9956a33945B49388m7363Q0799j21973k9309K38802
14947C70344j36513j0044E9800J80454m3006l8507G2814J47850P8798J15325k6734
14936C88053j03925j18790m7326J04656J2270L1993K21471A95046J41220O9777
14926D06043A31608b7630C86628l2201N8279o0513n4962g1634D02485Q9471j73728
14915C18228k5688k4624J63426j30213o4665J98477r2177J32426A70300E5365
14904a47756A87714J06320G1228K79201A38909Q7022j00607K33245j77081K3348
14894B04836q7860J76107l0600n6126N4449O5456k8350O3747J36017A12431K17184
14883C29615j11879N8826Q1305j11406J73843j54589q1429J41391K4371O8279
$$ y = [178789, 377088, 108844, 2510, 42466, -133945, 249388, 202025, 282824, 160851, 131542, 370344, 233831, 223787, 59800, 240254, 197248, 158741, 72814, 220664, 299462, 414787, 388053, 284128, 165338, 118012, 222668, 234938, 266931, 488402, 195046, 336266, 406043, 131608, -27630, 386628, 354427, 412706, 352193, 297231, -71634, 402485, 491956, 318228, 292540, 267916, 431342, 301129, 236464, 434941, 342764, 475190, 170300, 55365, -147756, 187714, 294034, 71228, 350429, 138909, 225931, 125324, 358569, 181488, 204836, 116976, 293083, 262483, 206357, 260806, 326262, 297912, 361659, 497676, 112431, 329615, 217736, 276562, 357867, 246461, 420304, 265715, 184286, 325677, 350048, 418327]
14873D18327A62602L41004j12446m9184J2970j46352M15216A72085N036J62212
14863C39333J87164A19478r231J55035M4376A04723A9828M61415j24814I7668
14852D17770j208j0136j56469I6050J53377K93559C8103K70949j24273J72994
14842C57773j7160K92046k59764J18274B06697L35934j94909A38247C8827M40783
14832D79610j28325J70156J5449j79913m154l2552N6330A59644L00110J0153B25150
14820C89888K44589l09114J03369j8317q4583J77031j15096L4627n8967A73192
14809E74450j82706j41822O9680L6156A72562J92682m4829J32837M4425A29089
14798C43464L20906k25013J27325A57343L12775n348j12899r9262L16532J38228
$$ y = [418327, 162602, 503606, 391160, 341976, 354946, 208594, 623810, 172085, 177121, 339333, 526497, 119478, 110247, 265282, 309658, 104723, 19828, 481243, 356429, 97668, 417770, 416562, 406426, 249957, 96050, 249427, 542986, 38103, 309052, 184779, 357773, 340613, 632659, 372895, 491169, 206697, 542631, 347722, 138247, 38827, 479610, 351285, 521441, 536890, 356977, 352823, 320271, 376601, 159644, 459754, 469907, 225150, 389888, 634477, 325363, 428732, 410415, 325832, 502863, 387767, 422394, 363427, 173192, 574450, 391744, 249922, 319602, 355758, 172562, 365244, 320415, 453252, 497677, 129089, 343464, 664370, 439357, 566682, 157343, 470118, 464770, 351871, 252609, 569141, 707369]
14788G07369l03464Q6605J44723k18083j55151N1924P5611M36897l02476L4585
14778E58540B75324M39530p0507o6557B28439J3326K59227n8035p5266k7755I5599
14766B73797L17708p0403o2846M0684j45540L93469k46758j57716J12939r2363
14756C62971L27982k73509K87227J32463l08297Q3148N6650k94528J19813O5931
14746E59851J17281J29269k23036K0183M9557j27725j34499L4995R5967P8064
14736E99907k47061J59457K4254j77787J8978J14503K91002j1522B47284L18945
14726E66229K20087k38477r1579J2309K51586L2438l13742L35047l76251K28493
14716F26140l0415K00198j75953L01259j90790L2028j64276K06060j2192n1467
$$ y = [707369, 403905, 490510, 635233, 417150, 261999, 313923, 389534, 826431, 523955, 558540, 275324, 714854, 644347, 577790, 228439, 241765, 500992, 442957, 367691, 339936, 95599, 273797, 591505, 521102, 458256, 498940, 353400, 746869, 500111, 342395, 455334, 362971, 690953, 417444, 704671, 837134, 528837, 611985, 668635, 374107, 493920, 559851, 677132, 806401, 583365, 603548, 653105, 525380, 390881, 425876, 521843, 599907, 352846, 512303, 536557, 358770, 377748, 492251, 783253, 771731, 247284, 566229, 786316, 547839, 456260, 468569, 720155, 752593, 438851, 773898, 397647, 626140, 595725, 795923, 619970, 921229, 730439, 762467, 598191, 804251, 792059, 740592]
14706G40592k65777L26203L6013j63843o5080J22622j71329M66644j39649l13008
14696E73388M94510l26140o7716j7845K4252M3373L83511m42135l1890M35452
14686A068760k86993J19067k13027M30026k97095J40602R248j28561C89111L55310
14676G44421L26968k09889Q1297k77837m4759K03502l5118J81513j46909J77385
14666A000574n367k02311j0814K01902k04772l4101J22963j77907J73491K17228
14656A080886l67565j20653M95194l14613M3033J2043O854j12016K01723J72859
14646A097745j81175J36468n1982j50036r312R7823k30281N35894K1335K68786
14636A535265o18874K45033N4247j79261j36351Q3209j16386N21812l64104o9585
$$ y = [740592, 474815, 801018, 837031, 673188, 608108, 730730, 559401, 1026045, 886396, 573388, 1067898, 741758, 674042, 656197, 680449, 723822, 1107333, 665198, 633308, 1068760, 781767, 900834, 687807, 1117833, 820738, 961340, 970588, 842027, 389111, 744421, 1071389, 861500, 942797, 664960, 620201, 823703, 788585, 970098, 823189, 1000574, 995207, 792896, 782082, 983984, 779212, 745111, 868074, 690167, 863658, 1080886, 713321, 592668, 1087862, 773249, 816282, 828325, 835179, 723163, 924886, 1097745, 916570, 1053038, 1001056, 851020, 841708, 939531, 709250, 1245144, 1266479, 1535265, 916391, 1161424, 1215671, 1036410, 900059, 983268, 866882, 1388694, 1024590, 955005]
14626I55005K26127m76472K37106J83805J20092l12387M34982l29553R0690K60347
14616A389742k24467j60871J59381K29288n0627j17292J48349J817k58065n9838
14606A057417R9347M5564m7147J90607q3940K6962j47621L08907K51392k21359
14596A480129K94753m85519P4950J23461k24692J81375q451m3033j3473M47084
14586A826584l99427J35343j71688J05686K8372L43708N78l77972k43232L63971
14576A611923J60347J84952j6581l67527M180L13856k63530j4519R8470K64873
14566A976444J14594J61034m96146N3817K98968k15863M10135M452J38623j37611
14556B308447L33929O8971L91108Q3999N62199J7856J231241K068025M089764
$$ y = [955005, 1181132, 704660, 941766, 1125571, 1245663, 933276, 1368258, 1038705, 1129395, 1389742, 1165275, 1004404, 1163785, 1393073, 1342446, 1225154, 1373503, 1375320, 1117255, 1057417, 1156764, 1202328, 1155181, 1345788, 1261848, 1288810, 1141189, 1450096, 1701488, 1480129, 1774882, 1289363, 1364313, 1487774, 1263082, 1444457, 1436006, 1392973, 1379500, 1826584, 1427157, 1562500, 1390812, 1496498, 1524870, 1868578, 1869156, 1491184, 1247952, 1611923, 1772270, 1957222, 1940641, 1573114, 1577294, 1891150, 1627620, 1613101, 1711571, 1976444, 2091038, 2252072, 1755926, 1809743, 2108711, 1892848, 2302983, 2307435, 2446058, 2308447, 2642376, 2711347, 3102455, 3186454, 3748653, 3766509, 4997750, 7065775, 11155539]
14547A1155539P978251J6601711j103865j6869180H254282l879264j734188n85885
14539B054945k08218l66643O0745J51842j24559K34000k14872l3249J23318o0239
14529A617070J91502J1243L6691n1691k94916N08875k18754K23360j15822O0838
14519A968396L18353j62238k2544o5413K5801J07575p2773j1399q5449L86052
14509B386361l47640N38760m47874K02964K90603Q9531m04170M07412j55912j94639
14499B365396Q2087P7109K32184j79986J6411R0047J65451J8682j83617K41068
14489B924832m00041L53899k10146M14573J7166n114j11023j30042q9148M86705
14479C251661l28322L72701Q6784J43497l53256j27917M33847j76043L9897N2896
$$ y = [11155539, 19133790, 35735501, 34631636, 17762456, 8254282, 4375018, 2640830, 2054945, 1846727, 1480084, 1540829, 1692671, 1568112, 1802112, 1587240, 1553991, 1677309, 1617070, 1808572, 1819815, 1856506, 1804815, 1509899, 2018774, 1800020, 2023380, 1907558, 1968396, 2286749, 2124511, 2101967, 2036554, 2062355, 2169930, 2097157, 2085758, 2000309, 2386361, 2038721, 2577481, 2129607, 2332571, 2623174, 2712705, 2308535, 2715947, 2560035, 2365396, 2447483, 2524592, 2756776, 2576790, 2593201, 2683248, 2848699, 2867381, 2683764, 2924832, 2524791, 2878690, 2668544, 3083117, 3100283, 3095169, 2984146, 2854104, 2764956, 3251661, 2923339, 3296040, 3382824, 3526321, 3173065, 3045148, 3478995, 3302952, 3342849, 3395745]
14469C395745k25137L22680J95754n3349r6334J88766j13281K27130N916L54813
14459D202703o41015K31372K82660L27743l05418P9564K28339j58952R5056M3311
14449D385363P3744k50250L19914K69857l17739K41932L1607j39843j40055N25888
14439E000418K42609l84056J74756J64567L22822l84048P0042K18362K34242j92460
14429E467254L28747K22341l72241R0839R5157L99364m5067J45952J90056j39657
14419F382745R2038k0592K16318J8919J26298K71342Q7576M84q7304L76650K21109
14408G685583j86261M96411N859k7200J95371l97489N83423P5359J77737K38334
14398H847127n07148K534R83423l46605M79199J61280K46483J6225L46085J25824
$$ y = [3395745, 3170608, 3493288, 3689042, 3635693, 3539359, 3728125, 3614844, 3841974, 3847890, 4202703, 3561688, 3793060, 4075720, 4403463, 4098045, 4177609, 4405948, 4246996, 4342052, 4385363, 4459107, 4208857, 4528771, 4798628, 4480889, 4722821, 4754428, 4614585, 4474530, 5000418, 5243027, 4858971, 5033727, 5198294, 5521116, 5137068, 5207110, 5425472, 5659714, 5467254, 5796001, 6018342, 5646101, 5736940, 5832097, 6231461, 6186394, 6332346, 6522402, 6382745, 6474783, 6454191, 6670509, 6689428, 6815726, 7087068, 7174644, 7175128, 7087824, 7464474, 7685583, 7499322, 7995733, 8001592, 7974392, 8169763, 7772274, 8355697, 8431056, 8608793, 8847127, 8339979, 8342513, 9325936, 8979331, 9458530, 9619810, 9866293, 9882518, 10228603, 10354427]
14388A0354427J06562J1577L50182J49517L6704L15729J33827Q5569N74158J7488
14378A2135740M89419L3263K88393R9368K70382K25503R6225M51995K20659O17090
14368A4928037L05808L80410j84226N97668L23796L34692L54244L60602K74993
14359A7676024Q12833N0154O76399Q210N61042M47514L57952N87497K64244J029410
14349B2471279M84062M00114O33456O13581L34873Q30822L94595J027225Q97221
14340B8087228M01906Q62829R80120J041931L22416R55266J224807Q32743J246044
14331C5955290J018845J422388Q30027J293865J162072J348363J522838J503485
14323D6057173J533923J520232K003536K103974J606542K124770J802885K582379
$$ y = [10354427, 10460989, 10472566, 10822748, 10972265, 11008969, 11324698, 11458525, 11544094, 12118252, 12135740, 12625159, 12658422, 12946815, 13046183, 13316565, 13542068, 13638293, 14090288, 14310947, 14928037, 15233845, 15614255, 15430029, 16027697, 16351493, 16686185, 17040429, 17401031, 17676024, 18488857, 18539011, 19215410, 19223620, 19784662, 20232176, 20590128, 21177625, 21441869, 22471279, 22955341, 23355455, 23988911, 24602492, 24937365, 25768187, 26162782, 27190007, 28087228, 28489134, 29351963, 30332083, 31374014, 31696430, 32651696, 33876503, 34709246, 35955290, 36974135, 38396523, 39226550, 40520415, 41682487, 43030850, 44553688, 46057173, 47591096, 49111328, 51114864, 53218838, 54825380, 56950150, 58753035, 61335414]
14315F1335414K142637K463371K694038K620541L072296L421017L048080L505190
14307H4302584M030658L932290M128189M210494M965744N254259N120525N935948
14299A21880691O267954O498556P166789P312345Q040187Q518687Q958194R807773
14291A84451176J0007734J0766214J1524203J1835969J2660478J3586339J3602489
14284B68434602J4155496J4474877J5124219J5226238J5358353J5065055J4680631
14277C72519471J4175256J3559483J1894768R565814L615788J879781J594883
14270D28805244K231118k58058n160868m776907n269545p080322r733440j2189926
14262C86567296j3954963j4931257j5904699j6101214j5805976j5812936j5126921
$$ y = [61335414, 63478051, 65941422, 68635460, 71256001, 74328297, 77749314, 80797394, 84302584, 88333242, 92265532, 96393721, 100604215, 105569959, 110824218, 115944743, 121880691, 128148645, 134647201, 141813990, 149126335, 157166522, 165685209, 174643403, 184451176, 194458910, 205225124, 216749327, 228585296, 241245774, 254832113, 268434602, 282590098, 297064975, 312189194, 327415432, 342773785, 357838840, 372519471, 386694727, 400254210, 412148978, 421714792, 425330580, 427210361, 428805244, 431036362, 430778304, 425617436, 420840529, 415570984, 408490662, 398757222, 386567296, 372612333, 357681076, 341776377, 325675163, 309869187, 294056251, 278929330]
14255B78929330j4570394j3457748j3313489j2673788j2211045j1282277j0678800
14248A90741789j0166153r510964q869609q164761p673225p011226o933091o768712
14240A25644048n869603n458743n347882m966975m785908m150022m361229m016945
14232H6686741l000675l439216l320234l503965l294661k526265k483157k285233
14224F2833335k562784k819515j624834j913055j864494j786852j905839j471257
14216D6884705j716192j431970j363390j062745j323653j565287j434032o89977
14208C6297459o00496j335460j030787j296548q32816q19884p69966q61001q28961
14199B7921540o38453p08640p94844p66401o85720l39391p49378m07704n25283
$$ y = [278929330, 264358936, 250901188, 237587699, 224913911, 212702866, 201420589, 190741789, 180575636, 171064672, 162195063, 154030302, 146357077, 139345851, 132412760, 125644048, 119774445, 114315702, 108967820, 104000845, 99214937, 95064915, 90703686, 86686741, 83686066, 80246850, 76926616, 73422651, 70127990, 67601725, 65118568, 62833335, 60270551, 57451036, 55826202, 53913147, 52048653, 50261801, 48355962, 46884705, 45168513, 43736543, 42373153, 41310408, 39986755, 38421468, 36987436, 36297459, 35696963, 34361503, 33330716, 32034168, 31201352, 30381468, 29611502, 28750501, 27921540, 27283087, 26574447, 25779603, 25013202, 24327482, 23988091, 23238713, 22831009, 22305726]
14190B2305726p81762m56110j26811q41641m28859o24687l44555o35197l4574
14181A8031530o92472o401o55458J4413o66317o2119k63901l04748o12556l63258
14171A4418713l2753k72558m60540j60992l31266m81622J34144k73041l12308
14162A2227777M3758l41416m32557j00784j64213j19735n05629k06545J07866
14153A0508522k4107k68994o07808J47531q3348m87914K53240j44966n21517L53281
14143I123920m33813j47295o9711l31066Q7535l62665K60581m28790m335j67593
14133G526768o6392O1855l45815J48727j84130n7855k84382o7936m7930j27155
14123F555755j83009k25022n6769J50512m13774L56116k27367k32476M5302l19917
$$ y = [22305726, 21523964, 21067854, 20941043, 20099402, 19670543, 19045856, 18701301, 18066104, 18031530, 17339058, 17332657, 16677199, 16691612, 16025295, 15963176, 15699275, 15394527, 14781971, 14418713, 14385960, 14113402, 13652862, 13491870, 13160604, 12678982, 12813126, 12540085, 12227777, 12271535, 11930119, 11497562, 11396778, 11232565, 11112830, 10607201, 10400656, 10508522, 10484415, 10215421, 9607613, 9755144, 9671796, 9183882, 9437122, 9292156, 8770639, 9123920, 8690107, 8542812, 8473101, 8142035, 8229570, 7866905, 8127486, 7698696, 7694361, 7526768, 7460376, 7522231, 7176416, 7325143, 7141013, 7083158, 6798776, 6730840, 6682910, 6555755, 6372746, 6147724, 6090955, 6241467, 5827693, 6183809, 5956442, 5723966, 5769268, 5449351]
14113E449351L14878m46088L85455k22576j36111P6575j81605K2219l26102j40155
14103D795841J68175L15936l18592k68330j98628L26634j54993j82775M02334
14094D885602r7284l36986k17998J14209k82800P5970k09186R1068j32206Q2003
14084C972392m954L48717k86457j40658o75123K66388J07419J54363O3691p3966
14074C731812l8095R520k60000k62154N19315j28126l82559J99027k46180M03739
14064C546299k19629j64961K0210j17715J73056j88319M8471q2455J31400r1558
14054C054799p6634k59787J37243J50946l35501K17132l02640L99814k64704J62121
14044B882789q4221m3712J99426l31302J17553L4181k29425j1138k36647j9305
$$ y = [5449351, 5764229, 5318141, 5703596, 5481020, 5344909, 5421484, 5239879, 5262098, 4935996, 4795841, 4964016, 5279952, 4961360, 4693030, 4494402, 4821036, 4666043, 4483268, 4885602, 4788318, 4451332, 4233334, 4347543, 4064743, 4140713, 3931527, 4022595, 3890389, 3972392, 3967438, 4316155, 4029698, 3889040, 3213917, 3480305, 3587724, 3742087, 3805778, 3731812, 3693717, 3703237, 3443237, 3181083, 3700398, 3572272, 3189713, 3388740, 3142560, 3546299, 3326670, 3161709, 3181919, 3064204, 3237260, 3048941, 3097412, 3014957, 3146357, 3054799, 2978165, 2718378, 2855621, 3006567, 2671066, 2888198, 2585558, 2985372, 2720668, 2882789, 2798568, 2754856, 2954282, 2622980, 2740533, 2774714, 2545289, 2534151, 2297504, 2278199]
14034B278199J25070j79765K69211k75800L55278l24177K35720r8138m01975K12019
14024B195642Q8570m5872O1481K33586k91497l0912J1767P7924m37011o9181L76530
14013B171027J37310k78187k78437j18983K40831J99514m80793K02817R3442q8816
14003A799725r5982J20764q1726J43120K68809k79348k31120M6174o6319j88379
13993A435718P15311l03639J72594L50520J655919K696106O985940J6392223O986980
13984C7087672j6616343r335303m357769j841153r78914p20783o13986m2262l88776
13975B192383j47654K28098R835j88007l29081J28217L07130k69507k59216L8366
13965A710564J20018k49383J74049J74075j95459P3565j30951j45999J5016J75596
$$ y = [2278199, 2403269, 2223504, 2492715, 2216915, 2572193, 2248016, 2483736, 2385598, 1983623, 2195642, 2284212, 2238340, 2299821, 2533407, 2241910, 2210998, 2222765, 2300689, 1863678, 1794497, 2171027, 2308337, 2030150, 1751713, 1632730, 1873561, 2073075, 1592282, 1795099, 1888541, 1799725, 1703743, 1824507, 1742781, 1885901, 2154710, 1875362, 1644242, 1690416, 1624097, 1435718, 2151029, 1847390, 2019984, 2370504, 4026423, 6722529, 13708469, 30100692, 37087672, 20471329, 11136026, 6778257, 4937104, 3958190, 3237407, 2623421, 2581159, 2192383, 2044729, 2272827, 2282662, 2094655, 1765574, 1893791, 2200921, 1931414, 1672198, 1710564, 1830582, 1581199, 1755248, 1929323, 1733864, 1807429, 1676478, 1530479, 1545495, 1721091]
13955A721091l27412J98206O2557j07376K13031n16736K41444k62845L33515j16072
13945A439403K34780j80903N2806K40672o38524M38126l92089J10289j72642K10828
13935A342746j9322O7413J59472j12176k36692k76276O59920j05314n09208M67631
13925A438194n6978l2205n7977j8803l578j21005l1626p6971n1055K37637k07869
13914A017764K77955l41504J60393L01846l54382K88571l7538m47258M766M5116
13904I15729J76939k68144J14201L78387l70634k97851M65436j2942M3261k28056
13894I16326j081O6206J03141O8010q8133J9259k82781L28789k28455J11057D99475
13882I44699k4473j62427J50133J30050j92899J03936r474j14652j03011K56653
$$ y = [1721091, 1393679, 1591885, 1654442, 1547066, 1760097, 1243361, 1484805, 1221960, 1555475, 1439403, 1674183, 1493280, 1546086, 1786758, 1148234, 1586360, 1194271, 1304560, 1131918, 1342746, 1323424, 1390837, 1550309, 1438133, 1201441, 925165, 1585085, 1479771, 970563, 1438194, 1381216, 1349011, 1291034, 1272231, 1268653, 1147648, 1116022, 1039051, 987996, 1225633, 1017764, 1295719, 954215, 1114608, 1416454, 1062072, 1350643, 1313105, 865847, 870613, 915729, 1092668, 824524, 938725, 1317112, 946478, 648627, 1114063, 1101121, 1144382, 916326, 915245, 981451, 1084592, 1152602, 1064469, 1083728, 800947, 1129736, 901281, 1012338, 499475, 944699, 920226, 757799, 907932, 1037982, 845083, 949019, 939545, 824893, 721882, 978535]
13872I78535j59019J61834J74873m67632L17836j5275j77051r6942K48372O8636
13862A034167m73114M88692m1292k69146n516J30992M8743o8843O3983l72892
13852E35774K65870R479J62719j07058l60280J80894j30943N16543l12737l1469
13842G28792n7868J67627M9680m5554j14188j1841j13848J3676K72437j4716j1853
13831H62344j10174J32222n0339m6898o9573j90415L04417p0170j05551l7013
13821F18850J75745k1269j00127k04751L53004k46612n430J27872p6295K26140
13811H47127k79476K26598J17659k77728k07472r3276L47097k94751O33108n8460
13801I60426B63872L02421q0923J60583j2217k11100J36454p0072J16590j1513
$$ y = [978535, 819516, 981350, 1156223, 688591, 1006427, 991152, 814101, 717159, 965531, 1034167, 561053, 1049745, 1008453, 739307, 733791, 864783, 913526, 844683, 908666, 535774, 801644, 811123, 973842, 866784, 506504, 687398, 556455, 1072998, 760261, 728792, 670924, 838551, 888231, 842677, 728489, 716648, 602800, 616476, 888913, 874197, 862344, 752170, 884392, 834053, 787155, 717582, 527167, 831584, 761414, 655863, 618850, 794595, 773326, 673199, 468448, 821452, 574840, 569410, 697282, 620987, 847127, 567651, 794249, 911908, 634180, 426708, 333432, 680529, 385778, 1018886, 960426, 263872, 566293, 485370, 645953, 633736, 422636, 559090, 489018, 605608, 594095]
13791E94095j88657k00814M02420k6400j63810J26928J92210j83399L1678r8537
13781D85714K15735k02290J30452k46477M77520k94146k54710K04235J19665k1071
13771F14627J56525l06417N6158J29191N8991l32067A07696N57093k00128J13116
13761E77777k53868M3355O8292K63235C35726J35167J09916A61622L6130M32499
13751F30251j32628j83513L53647j33223J7336k3075l6074A37345L21294r9029
13741C59610O7047E5039N58679N019C04395K3301m8296O5241M76068C84005O2323
13730D46328O33J24355A42646L75440M30976D38923m9423l6426l8100J80785K325
13719D98084p274K20700k04483K21740j06064o8346B73373J0514R4271e4205B92465
$$ y = [594095, 405438, 204624, 607044, 580644, 416834, 543762, 735972, 552573, 584251, 485714, 701449, 499159, 629611, 383134, 860654, 566508, 311798, 516033, 635698, 614627, 771152, 464735, 520893, 650084, 709075, 377008, 107696, 664789, 464661, 577777, 323909, 367264, 435556, 698791, 335726, 470893, 580809, 161622, 197752, 630251, 497623, 314110, 667757, 534534, 551870, 528795, 492721, 137345, 458639, 359610, 426657, 55039, 613718, 618737, 304395, 327696, 279400, 344641, 820709, 384005, 446328, 446961, 571316, 142646, 518086, 949062, 438923, 389500, 353074, 314974, 495759, 498084, 490810, 711510, 507027, 728767, 622703, 554357, 273373, 283887, 378158, -54205, 292465]
13707D01954J32065A63332K45244Q5376j00148K29888A08817K51625j55495L28073
13697E33020j47091K6801A82452L17430j46940J21605j26083e3196C72688m2547
13687C30141J66306J06464b7040C75690L1317A86736M1308N6707K11908N296J80172
13676F82127k68611J16731j43110l8537j7512o950J68873A12195O17176A87834
13665C20384J07227j82017O5881K6283j39816P9916j34349K51850n2056J04684
13655D47987j42865k9889M79042l10243R1809A68577L8609J81674k1660j20044
13645B47156J49025Q7599b13538D59060A60588b2191A38352L85310r591B39871
13634C13540p0024d4284B43764Q5366l0692J39809d6642D30174j16730J23108
$$ y = [401954, 534019, 163332, 408576, 493952, 393804, 623692, 108817, 360442, 204947, 533020, 385929, 412730, 182452, 499882, 352942, 474547, 348464, -53196, 372688, 330141, 496447, 602911, -27040, 375690, 407007, 186736, 228044, 284751, 496659, 501955, 682127, 413516, 530247, 387137, 348600, 331088, 324138, 493011, 112195, 729371, 187834, 320384, 427611, 245594, 311475, 337758, 197942, 277858, 143509, 395359, 343303, 447987, 305122, 275233, 754275, 444032, 535841, 168577, 207186, 388860, 367200, 247156, 396181, 483780, -213538, 459060, 160588, -22191, 138352, 523662, 514071, 239871, 313540, 243516, -44284, 243764, 329130, 298438, 438247, -46642, 430174, 313444, 436552]
13624D36552N5868L16601B7729K41297N8582q1325E3780K52892g6311C95461L4689
13613D30150B05244B2381M10061p677j66307A13086J80785M6386J39630B31229
13602B84193B4687L84820A96740n0763L15211B1671L56426O0006F1906L9232L12543
13591D13681A81732J12892p8009M8481K44301o841k7864k8315m5037P7449k34970
13580B43819L75735C9398J38295J85565J14696j50964J4034j37465b0352l8595
13570e8947C13317F7139K53101A55863K94770j53909A21755J27413K74326A13765
13559F7655Q6967K98372A15045Q9161J76405j58084k5341L01841j99645a10467
13548A19943J78840o9924a7786C87891j35864m0860H0730c0149l696C19076A44990
$$ y = [436552, 492420, 809021, 27729, 269026, 327608, 246283, 53780, 306672, -76311, 395461, 430150, 205244, 22381, 432442, 424765, 258458, 113086, 293871, 340257, 479887, 231229, 284193, 24687, 409507, 196740, 145977, 461188, 21671, 378097, 438103, 61906, 101138, 413681, 181732, 294624, 216615, 265096, 509397, 502556, 474692, 446377, 401340, 478789, 243819, 619554, 39398, 177693, 363258, 477954, 326990, 341024, 203559, -20352, -58947, 313317, 67139, 320240, 155863, 450633, 296724, 121755, 249168, 523494, 113765, 67655, 154622, 452994, 115045, 204206, 380611, 222527, 197186, 499027, 299382, -110467, 119943, 298783, 228859, -17786, 387891, 252027, 211167, 80730, -30149, -33845, 319076, 144990]
13536B64223c3991B4973M36896A42084K28329j5791O3170B04987E2375J32667
13526A85042M46561l047A917O7041B1308L9942J5644L3631J33360G3259J86845
13515B60104m6536n8952J2286D3820Q2935K1616l6441J6812e8308A28064J17721
13504B45785q0435J50361A11045C4113J78042J14579J20891A53814j811B3895
13493A10724f0313D79357C1261J50543O674q0816J13507k5380O4305L16666B75276
13481i5820B04123n2899J6443M5685E1421K14988c4408G0673a74175B43210D3194
13469C02172c5461j62310e9053A51268J0579h7649C34673N706F2919L23329R8748
13458D84996A44250J44539j14111P6039o8228M64716d6272c471A55250K44016
$$ y = [264223, -33991, 24973, 461869, 142084, 370413, 354622, 417792, 204987, 52375, 185042, 631603, 628556, 1917, 68958, 21308, 61250, 76894, 110525, 243885, 73259, 260104, 213568, 154616, 166902, 43820, 126755, 148371, 111930, 128742, -58308, 128064, 245785, 165350, 315711, 111045, 34113, 212155, 326734, 447625, 153814, 152003, 23895, 110724, -60313, 479357, 31261, 181804, 188478, 107662, 221169, 195789, 260094, 576760, 275276, -95820, 204123, 151224, 167667, 213352, 51421, 266409, -34408, 70673, -174175, 243210, 43194, 302172, -35461, -197771, -59053, 151268, 161847, -87649, 334673, 340379, 62919, 386248, 484996, 144250, 288789, 174678, 250717, 182489, 647205, -46272, -3471, 155250, 399266]
13448C99266j43656A21011f4003H0379K35780o6621m4971M3147E0953c8020A44202
13436I3543J59181J73383a90481a5167A25732J11433a02304F525K41362J49266
13426C97153a75159B3714L43804A23959a54577F3044f1521i548B82070b21136
13415B54149O7784a08779A76793g0013B11356E5004N4225J55192J03261n5583
13405C12099A55056b45208B24105N5856c9498a2858A4855J41900k4977C4303M2073
13394G6376J19823J17530K0306e9222A74112o8450K34209a46841D4632i5127A65802
13382A91520K13111A08650J1497i0759F1951P5150m4685P6923C9255N9721K2892
13371A21868j1736i220E13402A31787a1449D5800j8265a04171A39997E5357d7632
$$ y = [399266, 255610, 121011, -64003, 80379, 316159, 249538, 204567, 247714, 50953, -38020, 144202, 93543, 252724, 426107, -190481, -15167, 125732, 237165, -102304, 6525, 247887, 397153, -175159, 23714, 367518, 123959, -154577, 63044, -61521, -9548, 282070, -221136, 254149, 321933, -108779, 176793, -70013, 211356, 55004, 109229, 264421, 367682, 312099, 155056, -245208, 224105, 279961, -39498, -12858, 14855, 156755, 131778, 34303, 76376, 196199, 313729, 334035, -59222, 174112, 105662, 339871, -146841, 44632, -95127, 165802, 191520, 404631, 108650, 120147, -90759, 61951, 137101, 92416, 169339, 39255, 98976, 121868, 110132, -9220, 513402, 131787, -11449, 45800, 27535, -104171, 139997, 55357, -47632]
13359C32793B5709P6786b3204A31382M3723N2552l4391R1499A00971J20972m6686
13348A75257J8676J30401j61524n0879J70864Q0232j64466K43956A48829K32586
13338C81415d6432B81603c4219A85734K1323f1725A00736A1162K64475j19281
13328A56356c5013k2227C9896J33413J78898a27226A26501j4957f0061B5996P5385
13317A01381j1192L95286B03833f5320A21746Q2243k8664f2021A83586D8735R8026
13306A46761e3884I3806J18421K9403b29482i9247C9952K65261b59526d9082C24727
13294c4951l800B03637o0879L4980n2037K40285a45878E8432J14338h5544A75260
13282B1912L74113b53673A18092a68756B98595H1866a56594A57062A376J93831
$$ y = [332793, 25709, 102495, -23204, 131382, 175105, 227657, 193266, 284765, 100971, 221943, 175257, 193933, 324334, 162810, 111931, 282795, 363027, 198561, 442517, 148829, 381415, -46432, 281603, -34219, 185734, 207057, -61725, 100736, 11162, 275637, 156356, -35013, -57240, 39896, 173309, 352207, -127226, 126501, 111544, -60061, 25996, 101381, 90189, 485475, 203833, -65320, 121746, 203989, 175325, -62021, 183586, 48735, 146761, -53884, 93806, 212227, 241630, -229482, -99247, 39952, 305213, -259526, -49082, 324727, -34951, -38751, 203637, 142758, 177738, 125701, 365986, -145878, 58432, 172770, -85544, 175260, 21912, 396025, -253673, 118092, -168756, 298595, 81866, -156594, 157062, 1376, 195207]
13272A95207e87855D91121A06684M32029A40406J41195M196b481A4245J4654J59166
13261A88065J3439p2668P5635m5695a59711C4394J07923e1706k37766f1513C74220
13249b49742D26349A74235a87422A0816a47431j5191A2406J98876q3692h5218
13238a19149A53986B0923Q9125K80260A16947J4691J4442a6168A62701K27065
13228C89766C0255a381m5745n2440j17810B16928R5056n6304D9520J4877i0963
13216C60583a3051F7228j2474e047n6888K1511A28368D1135O6617G083c32686
13204C22593a12903H1982L21401A41889d3282a5350j43330C2999g3249E9022J00906
13193A59928g8366k712A26381b85253I7646J01247A2256b2980g795A25282a86046
$$ y = [195207, -587855, 491121, 106684, 538713, 140406, 281601, 285797, -2481, 14245, 28899, 188065, 201504, 128836, 204471, 158776, -159711, 34394, 142317, -51706, -289472, -61513, 374220, -249742, 426349, 174235, -187422, 10816, -147431, -162622, 12406, 211282, 127590, -85218, -119149, 153986, 20923, 110048, 390308, 116947, 131638, 146080, -16168, 162701, 389766, 30255, -1381, -47126, -99566, -217376, 216928, 311984, 255680, 49520, 64397, -90963, 360583, -13051, 67228, 54754, -5047, -61935, -40424, 128368, 41135, 107752, 7083, -332686, 322593, -112903, 81982, 403383, 141889, -43282, -15350, -158680, 32999, -73249, 59022, 159928, -78366, -81078, 126381, -285253, 97646, 198893, 12256, -22980, -7795, 125282, -186046]
13181F5925K99536C0089e1731F1633h367A86200G7850a0679A56236a64816B12081
13169H4778P8339a98150B23985E9567L12273A45588a22337I9900J84147A10417
13158H961a59221J6356B88575H8339J16758c206j11391j86623B49092l8887d1095
13146A03576b3160A31153D446R0897L2041L0484C6530K10406a04807a0327H2786
13134A85496d8952A14092J02291o8721D8721M6170e5966D02314b57451A67571
13123C64811G0623g3492C10190j52299K59269b30022C15708a10446A1239g7991
13112C66486A23612c2787A08693n0132J9702a40458H6162b73428A84433F3536
13101B07583p9254c94401h8178B21187A418J51646a13234A69499p9902K54761
$$ y = [65925, 365461, 30089, -51731, 61633, -8367, 186200, 77850, -10679, 156236, -164816, 212081, 84778, 163117, -198150, 223985, 59567, 371840, 145588, -122337, 99900, 284047, 110417, 8961, -159221, -142865, 288575, 88339, 205097, -3206, -114597, -301220, 249092, 210205, -41095, 103576, -23160, 131153, 4446, 95343, 127384, 157868, 36530, 246936, -104807, -10327, 82786, 185496, -48952, 114092, 216383, 147662, 48721, 94891, -55966, 402314, -257451, 167571, 364811, 70623, -73492, 310190, 157891, 417160, -230022, 315708, -110446, 11239, -77991, 366486, 123612, -32787, 108693, 58561, 78263, -140458, 86162, -273428, 184433, 63536, 207583, 128329, -394401, -88178, 221187, 1418, 153064, -113234, 169499, 89597, 344358]
13091C44358r5051b3356k64318A75363a54486B96225E4771c2132O084n7870A86824
13079I5380d1006b0363C37599A60750R2189j06736J50656m2363c1582B24757a77893
13067A74797G7675a00865G1456k9126A2060K05997I0459J76689I6243J45714A04809
13055A49631i2926j41353E5639L9843K15583r6896Q4989j42484a02307C24976
13044g8130G4797k5115Q1578B5609a52261I0163a63214I0368a6016j15765E6089
13032b13541E9055a49580C10478j44389L2776H6370a2407A18834P9060J5564M0381
13021B53839o2909D986K69911a36424I1094J33339a45250N2681m3877M7916K2301
13010f6229D9752J1043J08907a35352A77395l815a9107D3907K71019r8881H2345
$$ y = [344358, 249307, -23356, -287674, 175363, -154486, 296225, 54771, -32132, -26048, -83918, 186824, 95380, -41006, -20363, 337599, 160750, 252939, 146203, 296859, 254496, -31582, 224757, -177893, 174797, 77675, -100865, 71456, 42330, 12060, 218057, 90459, 267148, 96243, 241957, 104809, 149631, -92926, -234279, 55639, 95482, 311065, 214169, 299158, 156674, -102307, 324976, -78130, 74797, 49682, 131260, 25609, -152261, 90163, -163214, 90368, -16016, -131781, 56089, -213541, 59055, -149580, 310478, 166089, 198865, 86370, -12407, 118834, 197894, 213458, 253839, 190930, 4986, 274897, -136424, 91094, 224433, -145250, -92569, -136446, -88530, -66229, 49752, 60795, 169702, -135352, 177395, 173580, -19107, 43907, 314926, 216045, 82345]
12998f5387A93609K45067g1730I9572N5113b60286C55029E3011K91575j22071
12988B22515a30564j82294A35197R80F0942b54446A74918a04168A97805G2847
12977a17707A5905P5988P8735R8123A20739A8889a00098D1167d8207D3931h1426
12965A32821i4991p9352P3436F7438K5208J15498b004F7923b19317A88887C9410
12953h6491B21098E4628c5315A41047A8068a6414j11096p0723g1570c3655k1561
12942e5216j47255R675A46524F9172d44803i3961l8535D584O4763f5771b6552
12930B53925A21448A5228b70434C35237f3608G33d2396k4079Q880F5186b53823
12918B43889j16811d603k12100A28674B9177b805l37812D1481b6670k42945D04263
$$ y = [-65387, 193609, 438676, -71730, 99572, 154685, -260286, 355029, 53011, 344586, 222515, -130564, -312858, 135197, 136177, 60942, -254446, 174918, -104168, 197805, 72847, -117707, 15905, 91893, 170628, 268751, 120739, 18889, -100098, 41167, -48207, 43931, -81426, 132821, -94991, -174343, -100907, 67438, 92646, 208144, -2004, 67923, -219317, 188887, 39410, -86491, 221098, 54628, -35315, 141047, 18068, -16414, -127510, -198233, -71570, -33655, -55216, -202471, -192796, 146524, 69172, -444803, -93961, -132496, 4584, 69347, -65771, -26552, 253925, 121448, 15228, -270434, 335237, -63608, 733, -42396, -66475, -57595, 65186, -253823, 243889, 127078, -4603, -216703, 128674, 29177, -2805, -340617, 41481, -26670, -269615, 404263]
12906B1690J11964b92622I6203A6336c11313N5399C5944c91767D9838K26010h9149
12894a59776C44763o2689e2922B74964h3041B62511b12021i4538p4124f9931b0491
12882F6848J46920C0576K76303j11475c24480B9478a10629B47004a7504B56747
12871f2280A33164B8507a11430L1887E699M2454K35173H8765A1206c74581B64490
12859I2156e6622k37722C4788O0630l1949K9395a40816A22766c600o2053B32813
12847a71967d1901A20296J09798q657f4768A11642b05479J7756A92533H0382J2523
12836I2905b34081h9595F4455A2963k125d8346A6013J45601d3497A2749a61232
12824g3396B3322J17794K54861A30578L9191d8199A40465J30702a24931A18081
$$ y = [21690, 133654, -292622, 96203, 16336, -311313, -255914, 35944, -391767, 49838, 275848, -89149, -159776, 344763, 282074, -52922, 274964, -83041, 262511, -212021, -94538, -168662, -69931, -20491, 66848, 213768, 30576, 306879, 195404, -324480, 29478, -110629, 247004, -17504, 256747, -62280, 133164, 28507, -111430, -79543, 5699, 48153, 283326, 88765, 11206, -374581, 264490, 92156, -56622, -294344, 34788, 95418, 63469, 92864, -140816, 122766, -3600, -65653, 232813, -171967, -41901, 120296, 230094, 221437, -64768, 111642, -205479, -187723, 192533, 80382, 92905, -234081, -89595, 64455, 12963, 10838, -48346, 16013, 161614, -43497, 12749, -161232, -73396, 23322, 141116, 395977, 130578, 169769, -48199, 140465, 271167, -124931, 118081]
12813d1858j54449K7449A00527C9615A8129P4891a91895O0289o486A51541c4125
12801h9755A69897a43516a9711B1595a77557B61111A959R0324k8472P0492e9522
12789B9473O6204J12435b94205a2060k68387A84591n7422P2354f4241A29282a35833
12777e6104j107b760B55232D9884M7173a01311p7984c3516j66174A9090J36802
12766A55892C0365n668q298J02961D7580M4079b9842k56825A42562N0329K3594
12755B16485j01539c79741E5161K61369A23532m0905A8861b2221m0997q097q3449
12744a54764d6738B76665j23523F9095b19934e4291F930L67336c39003A24923
12733b63162J06664b4993H3324a51718A37680R7818a10981o0229Q4130E0233i7955
$$ y = [-41858, -196307, -168858, 100527, 39615, 18129, 93020, -191895, -131606, -138092, 151541, -34125, -89755, 169897, -143516, -19711, 21595, -177557, 261111, 1959, 92283, 63811, 134303, -59522, 29473, 95677, 208112, -294205, -12060, -280447, 184591, 127169, 199523, -64241, 129282, -135833, -56104, -57211, -2760, 255232, 49884, 97057, -101311, -179295, -33516, -199690, 19090, 155892, 30365, 24697, 16399, 119360, 47580, 91659, -29842, -286667, 142562, 192891, 216485, 114946, -379741, 55161, 316530, 123532, 82627, 18861, -22221, -63218, -71315, -154764, -46738, 276665, 153142, 69095, -219934, -54291, 6930, 374266, -339003, 124923, -263162, -156498, -24993, 83324, -151718, 137680, 235498, -110981, -171210, -87080, 50233, -97955]
12721b93825A73121j6127D449j024J08386j2783a08653A04612B6094J1332b13708
12709a90084B59971J77575B1463a52038M4433B24021M14312B17491r6554l7975
12699H2962d815A68407R4954M667G4635M7299e4559n7339A09844j6685e2014a024
12686A71112a45127I4121R1603A5119J39275g3754A75616C9906b18891A18116
12675C37870J29132f9122B78411l2041B2593R026J34087D4807P6893Q4356n6749
12664A49307D1194J58075K2070n5189i3955C7659M7083J92417Q0615C9780P3960
12653A13740J08360b08366A23575F0984K3778K13923D6947A9510J39622d1322
12642a90744j9304A51310a28522a9984A6152K58936f9269B15074b16959J497A83468
$$ y = [-293825, 173121, 156994, 4449, 3425, 111811, 99028, -108653, 104612, 26094, 37426, -213708, -190084, 259971, 437546, 21463, -152038, -107605, 224021, 638333, 217491, 120937, 82962, -4815, 168407, 263361, 268028, 74635, 121934, -54559, -111898, 109844, 93159, -52014, -1024, 171112, -145127, 94121, 185724, 15119, 154394, -73754, 175616, 39906, -218891, 118116, 337870, 467002, -69122, 278411, 246370, 22593, 31619, 165706, 44807, 121700, 206056, 149307, 41194, 199269, 221339, 166150, -93955, 37659, 84742, 277159, 357774, 39780, 113740, 222100, -208366, 123575, 60984, 84762, 298685, 46947, 19510, 159132, -41322, -190744, -210048, 151310, -128522, -19984, 16152, 275088, -69269, 215074, -216959, -215462, 183468]
12630a07612m259k4084b3301C16973C6120J47312b11269D0374B325J44857C8728
12618e2555j6166j19166A82028M05787a469A75510B6405J1231M2356c7605j52063
12607a89668i0694M4514l4581D6761J25669f3900E7992a21530l9035j1325A34542
12595E3888j6170a43668O0648j19622A37441n5755l8267b36012A44898d6412C0406
12583A89283K2392A6789h30A43453n020a82813B83920g7493A22052f5524k52036
12572c17560B59154a88940g1773I2620n016a3465C39480h2916b5425A29820K4830
12561A54650o0197l0792a59713f5799L0777B07999a84460L9208A76703i8082C8066
12549a03209K3278A10131J38307j6716a6431m1704j20858c7251m525n5264p1182
$$ y = [-107612, -111871, -135955, -23301, 316973, 36120, 183432, -211269, 40374, 2325, 147182, 38728, -52555, -68721, -187887, 182028, 587815, -1469, 175510, 26405, 37636, 79992, -37605, -189668, -90694, -46180, -80761, 46761, 172430, -63900, 57992, -121530, -160565, -171890, 134542, 53888, 37718, -143668, -83020, -202642, 137441, 81686, 43419, -236012, 144898, -46412, 30406, 189283, 211675, 16789, -830, 143453, 138433, -182813, 283920, -77493, 122052, -65524, -317560, 259154, -188940, -71773, 92620, 87604, -13465, 339480, -82916, -25425, 129820, 154650, 94453, 63661, -159713, -65799, -35022, 207999, -184460, -145252, 176703, -98082, 38066, -103209, -79931, 110131, 248438, 231722, -16431, -58135, -178993, -37251, -41776, -97040, -168222]
12538a68222l3847C05494h4408A00394K10472a63035A11718q058a48628C1264
12527b59945B88680A31911B1254f3657A14009j1714b2497j7034l19565j32467
12517d91563F5436a66820D3792M36534F4016K83665I5375d1599A57805n0971b19391
12505B23602f5631A23534a2804k5039j04883J5717A57761B7834J04715D2988g2266
12493f2387j94349R6912k9140h6010A30119d8970j31636A49653C8612b12575i3375
12481B16150b85890c5886B28643a47224J7227B50684A5656B913N3657a57258b7552
12469I0889b01436G0769N6043b79618A9264c4783J5152B0268J79208A2568K45739
12458B58307C8806Q8128c2399p5372c1919B74245e5384A528R0648D5403b39352
$$ y = [-168222, -202069, 305494, -84408, 100394, 310866, -163035, 111718, 103660, -148628, 31264, -259945, 288680, 131911, 21254, -63657, 114009, 102295, -22497, -39531, -359096, -491563, 65436, -166820, 43792, 480326, 64016, 347681, 95375, -41599, 157805, 106834, -219391, 223602, -65631, 123534, -12804, -37843, -142726, -127009, 157761, 27834, 132549, 42988, -72266, -62387, -256736, -159824, -188964, -86010, 130119, -48970, -180606, 149653, 38612, -212575, -93375, 216150, -285890, -35886, 228643, -147224, -129997, 250684, 15656, 2913, 56570, -157258, -27552, 90889, -201436, 70769, 126812, -279618, 19264, -34783, -19631, 20268, 199476, 12568, 258307, 38806, 126934, -32399, -107771, -31919, 274245, -55384, 1528, 92176, 45403, -239352]
12446b15225A15815g5301B9478K35988h0504F5391a29472I718J71507E2977j2877
12435D0100i8456A0877K0154J49595f7441r5249D3185k013J48227A2360P5154
12424H7514J80796b0363E4108B957g2722A94574d6803A07025d4753j57645i0734
12412c6117A59112G7860L608M5342a85155A0959P2561K8615c2133A13279q282
12401A04997c444j81344A36169M7935b55408P8895j32949a51933E1405b29689
12390A07201C1106Q8405o900M2760a21593E7243J42287b77744b6761n171n1185
12379h3117B9414l075J83081f2067k32367b8607L067n2043H846a6721j48307A08809
12366b68125B92340a16932K7406A23458l1261M8449B0505J03531f1596j0359B9227
$$ y = [-215225, 115815, -75301, 29478, 265466, -80504, 65391, -129472, 9718, 181225, 52977, 40100, -98456, 10877, 31031, 180626, -67441, -162690, 43185, 41172, 189399, 12360, 87514, 268310, -20363, 54108, 2957, -72722, 194574, -46803, 107025, -44753, -202398, -90734, -36117, 159112, 77860, 81468, 126810, -185155, 10959, 83520, 112135, -32133, 113279, 104997, -3444, -184788, 136169, 184104, -255408, -176513, -309462, -151933, 51405, -229689, 107201, 31106, 119511, 112611, 155371, -121593, 57243, 199530, -277744, -26761, -31932, -83117, 29414, 26339, 209420, -62067, -294434, -28607, -25540, -77583, 8846, -16721, -165028, 108809, -268125, 292340, -116932, -89526, 123458, 92197, 140646, 20505, 124036, -61596, -71955, 29227]
12354b2296B21050d11637J28588A60464a14837m551A63937E8197b6538o0057j97842
12343b84437g4004F0562a60825A28754a19994j19063o5731B1331j464b29392e4281
12331b1030q8845M362A1185K48198a01406A17460c59590A57281o0973i7932B47743
12319E988a29133B26793F5553a00635D05333D7413p987K47613I238K64826p5940
12308A98124c20641C33524G9899c07105A97691d8319A51048a19671I4859h1644
12297C957O4139P2396N9801O7607D4639C042J31193i4259H2925a39552b6980A82335
12284d4901A82556i3448C30555A45639K02936B1788b4961G7602a24943d9652C31987
12272a83053E67774B37836a94490G7543L7554a87637K8708O2397A43308a59328
$$ y = [-22296, 221050, -411637, -283049, 160464, -114837, -119388, 163937, 58197, -26538, -86595, -284437, -74004, 60562, -160825, 128754, -119994, -239057, -304788, 21331, 19867, -229392, -54281, -21030, -109875, -105513, 11185, 259383, -101406, 117460, -359590, 157281, 96308, -97932, 247743, 5988, -129133, 226793, 65553, -100635, 405333, 47413, 39426, 287039, 9238, 274064, 198124, -320641, 333524, 79899, -307105, 197691, -48319, 151048, -119671, 94859, -81644, 3957, 68096, 140492, 200293, 267900, 44639, 3042, 134235, -94259, 82925, -139552, -26980, 182335, -44901, 182556, -93448, 330555, 145639, 348575, 21788, -24961, 77602, -124943, -49652, 331987, -183053, 567774, 237836, -194490, 77543, 115097, -187637, -158929, -96532, 143308, -159328]
12261a37581A30134l0864b77135a5938j7896B41510D8909J20669a93994B91833
12250B12257c2796k2903A09643J65790a00102a8474G4833r896J60661c0749D21752
12238e0587C91568c8555F2043K57484a14182j52642j06706D2789L62553e4717
12227D1385K19469h5020B99401E5659L03024o6573j41216K09779I4304M0058b51005
12215C31K51960a67061C55395J83553A38357J42731M2317b3821A28795J12320
12205B41115b6364B88671J11672A41115J29671c4866J0404m3543D85659A22515
12194A63272n3530d6677R068n0967K7815Q953A96545q6777m6918P6590n0893a31756
12181B76640G8587J10667l3884K16612b4334A55710J22153a52585j49131A0243
$$ y = [-137581, 130134, 99270, -277135, -15938, -33834, 241510, 48909, 169578, -193994, 291833, 212257, -32796, -55699, 109643, 275433, -100102, -18474, 74833, 64937, 225598, -30749, 421752, -50587, 391568, -38555, 62043, 319527, -114182, -266824, -373530, 42789, 405342, -54717, 41385, 260854, -85020, 299401, 55659, 358683, 292110, 150894, 360673, 94304, 134362, -251005, 331, 252291, -167061, 355395, 538948, 138357, 281088, 323405, -23821, 128795, 241115, -26364, 288671, 400343, 141115, 270786, -34866, -24462, -68005, 485659, 122515, 163272, 109742, -46677, -37609, -88576, -60761, -51808, 196545, 109768, 62850, 139440, 88547, -131756, 276640, 78587, 189254, 155370, 371982, -24334, 155710, 277863, -152585, -301716, 10243]
12170A4186L14401C1207J82475K3031j7219o0645j335O4107a22991j48062A69498
12158h9131A03003P4241a48352A26356B5738O4876f927k3268C12065h9171p8570
12147a67741A32094a6793A63137K6573g8521e355H2269R768J73186g8755B01066
12135c20043F3494r751f9944k0172j78290b2636B55504o3918A0721a69505C1151
12123I0037J44966h9076j95503d2621j06588A7382Q286b39396C00906a10389A50426
12111b01337h4026J1787p9165F6908a64184c0186l03744B25994C2825O0216a44254
12099a3546A521d4999A98558g2716J7824a9529p5649j29471I2571a4947A19J63849
12087A63968a86784G5313b76562B16213q7861l9159P2368d1270D4355a15794j82697
$$ y = [14186, 328587, 31207, 213682, 236713, 219494, 158849, 157514, 221621, -122991, -271053, 169498, -89131, 103003, 177244, -148352, 126356, 25738, 90614, -6927, -30195, 312065, -89171, -167741, 132094, -16793, 163137, 189710, -78521, -5355, 82269, 92037, 265223, -78755, 201066, -320043, 63494, 53743, -69944, -90116, -268406, -22636, 255504, 191586, 10721, -169505, 31151, 90037, 235003, -89076, -284579, -42621, -149209, 17382, 25668, -239396, 300906, -110389, 150426, -201337, -84026, -72239, -151404, 66908, -164184, -30186, -333930, 225994, 32825, 93041, -144254, -13546, 1521, -44999, 198558, -72716, -54892, -19529, -95178, -224649, 92571, -14947, 119, 163968, -186784, 75313, -276562, 216213, 128352, 89193, 161561, -41270, 44355, -115794, -298491]
12076b98491A08795d7319G0350j7035O50992P85411l59955D08803A56359n8477
12066I7882B8259a0900D4462K04902A06419a88002Q2997M8377A0064J88461b5326
12054B11055J7197P3614A23032c93796d6983D3878a3108E3692J77363i2876l4326
12043a27202B53528a76721G1480F532c34350c6451B93916B2160J82557b31522
12032A87120a0216A44218d57427a76283f8679J6711q7343A11067E5077a09086
12021f1172J5576k58118I1693a07682B5880b26133B60125a05919A42224A6702
12010F5045C1915R2559l7984M0035d0264k7468A1064b66526f458l06824C06237
11998b28046B488G4a62737a001k69326B75342G0288b73017e6471a6600E148a58088
$$ y = [-298491, 108795, -47319, 70350, 53315, 704307, 1489718, 1129763, 408803, 156359, 97882, 28259, -10900, 44462, 249364, 106419, -188002, -105005, -56628, 10064, 198525, -25326, 211055, 228252, 301866, 123032, -393796, -46983, 43878, -13108, 53692, 231055, -92876, -127202, 253528, -176721, 71480, 6532, -334350, -36451, 293916, 22160, 204717, -231522, 187120, -10216, 144218, -457427, -176283, -68679, -51968, -139311, 111067, 55077, -109086, -61172, -45596, -303714, 91693, -107682, 25880, -226133, 260125, -105919, 142224, 16702, 65045, 31915, 124474, 86490, 126525, -40264, -67732, 11064, -266526, -6458, -313282, 306237, -228046, 2488, 74, -162737, -1001, -270327, 275342, 70288, -273017, -56471, -16600, 5148, -158088]
11985f6008D6104c3040K828A19489E1269O1575K9844J40759a06019j9526r7496
11974b23041A87475C0116a2351A24363i1759a4413C3737O581h0565k30305G0460
11962b5000D8012g8610J7467j87539A4426b3860r1964C8497J41310a77044h977
11950c12122J33448A40938e3916O277l91792b6613D7556J62160C3880N9133k4173
11939F8840b6979H6775m0775Q9017a72306C54063H8158L0131M1749p9101a77607
11927F0482a67412Q739L3240A14936j6469d1322e49k62760h9864A52830b3641
11915a43597B10654b95953a42326A00396b91202H739K14273e4113l4836A11965
11904a53038b0524B5006a95867r392l6569A20577B6790a54061P278f2563B71782
$$ y = [-66008, 46104, -33040, -30212, 119489, 51269, 112844, 142688, 283447, -106019, -125545, -223041, 187475, 30116, -12351, 124363, -91759, -14413, 33737, 40318, -80565, -310870, 70460, -25000, 48012, -78610, -61143, -248682, 14426, -23860, -115824, 38497, 179807, -177044, -8977, -312122, -178674, 140938, -53916, -47639, -439431, -26613, 47556, 209716, 33880, 93013, 68840, -26979, 86775, 46000, 135017, -172306, 354063, 88158, 118289, 160038, 80937, -177607, 60482, -167412, -158673, -125433, 114936, 98467, -41322, -549, -263309, -89864, 152830, -23641, -143597, 210654, -295953, -142326, 100396, -291202, 8739, 223012, -54113, -88949, 111965, -153038, -20524, 25006, -195867, -205259, -241828, 120577, 26790, -154061, -146783, -62563, 271782]
11892a75957B6106k613b7293E2684L1429b47273H8368J17635b00699A50750b29211
11880g3276C33424b4807B58971a98569d6691j7020j17081l3237A25951a72892
11869c75312a64952a408k79463d5186A03165M2742a36887A19492a56640B42582
11858a39735b4233E3927J74549b9204A420J36479b6091m05701a39504f098A26128
11846A0676d3481F235J4818J10254b07558L9968J1158p3785j74997h1609G2011
11834A5734J8297j0739j293a78528d5894A65175a01904F3452J9205i4179A98350
11822a74089G534b01499E1580i2430C72039A35764m0671l5019h2324k08347J41488
11811a49183k45920c5925A94305b59620a13938C15361b15167A83612b30862A41097
$$ y = [-175957, 26106, 23493, -27293, 52684, 84113, -247273, 88368, 206003, -200699, 150750, -229211, -73276, 333424, -24807, 258971, -198569, -46691, -63711, -180792, -214029, 125951, -172892, -375312, -164952, -1408, -280871, -45186, 103165, 145907, -136887, 119492, -156640, 242582, -139735, -24233, 53927, 228476, -29204, 1420, 137899, -26091, -431792, -139504, -6098, 126128, 10676, -43481, 6235, 21053, 131307, -207558, -167590, -156432, -230217, -405214, -81609, 72011, 15734, 34031, 23292, 21999, -178528, -45894, 165175, -101904, 63452, 82657, -94179, 198350, -174089, 7534, -201499, 51580, -92430, 372039, 135764, 95093, 60074, -82324, -290671, -149183, -395103, -35925, 194305, -259620, -113938, 315361, -215167, 183612, -230862, 141097]
11800H978a75249J3389j02198J17615k2698I7847L56511H6304b0254q1455j42221
11789b43930i7818A20582b848B9510a96295K7727g2129A86281I1333m1009J55896
11778B06220k7171l8469A2302A638b57208f7310B22012b44425a07987l33598c4194
11766b7189j466B11781N5836a68410J3997C1436a58294A09821j325j8661l8125
11755E1710A2270a47641j03812i7129L6736C15195A02906N2507a01828b2277o0229
11744h2506o9965C7581c6319k03351B21945p6157H837N5040j9821G296a80039
11732A86329R8735a81316G3203l4085j9023a35438b3881B05178r6342J4556b42932
11720C43572C5654a4187k57123a12141k61666A55379l1522O598K4905J42718j11043
$$ y = [8978, -175249, -161860, -264058, -146443, -169141, 97847, 454358, 86304, -20254, -101709, -243930, -97818, 120582, -2848, 29510, -196295, -168568, -72129, 186281, 91333, 50324, 206220, 179049, 140580, 12302, 1638, -257208, -67310, 222012, -244425, -107987, -441585, -34194, -27189, -28655, 211781, 267617, -168410, -154413, 31436, -158294, 109821, 108496, 89835, 51710, 12270, -147641, -251453, -97129, -60393, 315195, 102906, 155413, -101828, -22277, -82506, -152471, 37581, -36319, -239670, 221945, 145788, 8837, 63877, 44056, 7296, -180039, 186329, 285064, -181316, 73203, 39118, 20095, -135438, -23881, 205178, 108836, 123392, -242932, 343572, 35654, -14187, -271310, -112141, -373807, 155379, 123857, 130455, 155360, 298078, 187035]
11709A87035a80325A24979R8227D0770g145A74560i2131A70533a37223A09603
11698d3332A6195M7904a36740k7532I2483a58881A44816b6226k08995A96799g0126
11686C60349A40181J27454b9108J1703j54788B73039a62142j6033e8872A64331
11675B07522p7525J14930A03510l5407J21608B7695F982b35674i2009A60759R4840
11664B55599A06946I163d5551j7542a302r1710A9431a33530A55932j1632K47805
11653C92105A04753L3813a05487J7539q499B02719c0292A00020K24382A42557
11642I3793a60339n1540b462A43737a51692E8015b21221B8820K2299J30375a35303
11630a44534A40899a77676M6494A49692L6764o1382J18813J20226H3873b52036
$$ y = [187035, -180325, 124979, 223206, 40770, -7145, 174560, -92131, 170533, -137223, 109603, -43332, 16195, 64099, -136740, -164272, 92483, -158881, 144816, -26226, -235221, 196799, -70126, 360349, 140181, 267635, -29108, -17405, -172193, 273039, -162142, -178175, -58872, 164331, 207522, 129997, 244927, 103510, 68103, 189711, 27695, 6982, -235674, -92009, 160759, 255599, 106946, 9163, -45551, -63093, -1302, -93012, 19431, -133530, 155932, 144300, 392105, 104753, 138566, -105487, -87948, -96447, 202719, -30292, 100020, 324402, 142557, 93793, -160339, -211879, -2462, 143737, -151692, 58015, -221221, 28820, 51119, 181494, -135303, -144534, 140899, -177676, -131182, 149692, 186456, 125074, 243887, 364113, 83873, -252036]
11619h4674F7735b173o1846A99031p3828o2111c03775D7063a29435a0886m9950
11608f0836A21259A1601f7821n0186k0530j89867J28851B45338c9957B77841j14841
11597A63000b42756f4145B61956b79529A92630l3584J17637a72988H4909g8457
11586B85a53808A21170B8454P8193m8106b37188I5704M7335K60468e6927B55379
11574a8289o9397o009A04964b54293A38391L4895f7350B24669b68447A2305K37723
11563B50028j05019G482i2108A50394b67971a04907N2164j52805A5116b15337
11552F4790f2873G5705g8951p086K9601A84873L28625b9847A54251E7216H754
11540e8073q8615n0834g9168k8429j59218A76781b55105f6272A75244p5520l1545
$$ y = [-84674, 67735, -2173, -64019, 199031, 125203, 63092, -303775, 47063, -129435, -10886, -60836, 121259, 11601, -67821, -118007, -138537, -328404, -199553, 245338, -39957, 277841, 163000, -242756, -64145, 261956, -279529, 192630, 159046, 276683, -172988, 84909, -78457, 285, -153808, 121170, 28454, 106647, 58541, -237188, 95704, 143039, 403507, -56927, 255379, -18289, -87686, -93695, 104964, -254293, 138391, 173286, -67350, 224669, -268447, 12305, 250028, 145009, 7482, -92108, 150394, -267971, -104907, -52743, -205548, 15116, -215337, 64790, -62873, 75705, -78951, -86037, -56436, 184873, 513498, -29847, 154251, 57216, 8754, -58073, -146688, -197522, -79168, -107597, -266815, 176781, -255105, -66272, 175244, 99724, 68179]
11529F8179a32946B76905r5641K3117J13216A6556d8214k74083a54857d8496A7701
11517F3820b05403A66191p4135a6469B13680a66779g9345D12538j25036j11843
11507A75659h5442B6479Q8024R7887I5413h6956G3672a18606A10267J11177A9336
11495F1971c788k31911a8556E7072E625K44661A9121J7336a50253A13679K78834
11484C92513D1075J24290C3925J33642P1441p0707L01987j47533j01317a9687
11473c7482B16613m2297p9979K42973A35005m6807O2556O0145a5196A39085J22277
11462B61362r9344p9628E480a47133r25E23691j92103h3985K5574A61082J38209
11451B99291a15592E4805b1847j6831j690o9114b5396l8189C3092K39048H0591
$$ y = [68179, -132946, 276905, 181264, 204381, 317597, 16556, -48214, -322297, -154857, -48496, 17701, 63820, -205403, 166191, 92056, -16469, 213680, -166779, -79345, 412538, 287502, 175659, -85442, 26479, 114503, 212390, 95413, -86956, 73672, -118606, 110267, 221444, 19336, 61971, -3788, -235699, -18556, 57072, 5625, 250286, 19121, 36457, -150253, 113679, 392513, 41075, 165365, 33925, 167567, 239008, 168301, 470288, 322755, 221438, -19687, -37482, 216613, 174316, 94337, 337310, 135005, 88198, 150754, 210899, -15196, 139085, 261362, 162018, 82390, 5480, -147133, -148058, 523691, 331588, -83985, -58411, 161082, 299291, -115592, 54805, -21847, -38678, -40368, -109482, -25396, -63585, 33092, 272140, 80591]
11439a05246A70249j2169l2165J31812a4904k07549B37338J4037m9962a76170
11428F0996b82248I0949a16795J0482A43547J81331d4422G8415a42060A35175
11417a1953k30726C1613M512j2749N821J28405K8362a95969A07187a78496d6403
11405I579i5403O318j9962B80982o8787K286E2957R2000m7932C4249J59845a20218
11392a1038j54477b8388j18530O5919A23835c3888j51716l8161A36590K5822c3440
11380a31695j37270B38492b10042d3012B43525A20710m6947a36340c3161A77430
11369B10077a49322k86147b07711A48293j4793c6114C9283b8553E8445d7301j33995
11358a81296B10052a8646k12215c1932m3354A06867R775a76726A31297a39929
$$ y = [-105246, 170249, 158080, 125915, 257727, -14904, -222453, 237338, 251375, 201413, -176170, 60996, -282248, 90949, -116795, -106313, 143547, 324878, -44422, 78415, -142060, 135175, -11953, -242679, 31613, 36125, 23376, 29197, 157602, 185964, -195969, 107187, -178496, -46403, 9579, -95403, -89085, -109047, 280982, 212195, 214481, 52957, 144957, 97025, 34249, 194094, -120218, -11038, -165515, -28388, -146918, -80999, 123835, -33888, -185604, -223765, 136590, 162412, -33440, -131695, -268965, 238492, -210042, -43012, 243525, 120710, 73763, -136340, -33161, 177430, 210077, -149322, -435469, -207711, 148293, 133500, -36114, 39283, -28553, 58445, -47301, -181296, 210052, -18646, -230861, -31932, -75286, 106867, 116642, -176726, 131297, -139929]
11347F7630L1755b16125c5650j6134k45176Q4890C3897J60776R530b97519B24086
11335a08976e2245j59092A91578H9680K18746f783k47676D1521O535g5546k3572
11324i9118D0682J21237e6306C06195j30206h8070d3120k9648o6478A48864n2613
11313I6251h6915B75984E8922b02687A93126q3283b76770a03292B03692I2310
11302a34546B10236d18859A76961a40390A22285g5558r045A17569a84834j30789
11292c15623J37508e2674j40229Q3216j80987L2415A64964e4564m8806k8304G239
11280H8797Q0655b0837l57566a73188G9632b13713D4871a9417j93141a00949B06782
11268a77261B20863f4222m8491d453j3231E9822b05463j074f3427A82704h7625
$$ y = [67630, 99385, -216125, -35650, -51784, -296960, -212070, 33897, 194673, 204203, -297519, 224086, -108976, -52245, -211337, 191578, 89680, 308426, -6783, -254459, 41521, 48056, -75546, -99118, 40682, 161919, -56306, 306195, 175989, -88070, -43120, -72768, -139246, 148864, 96251, -86915, 275984, 58922, -202687, 193126, 109843, -276770, -103292, 203692, 92310, -134546, 210236, -418859, 176961, -140390, 122285, -75558, -84603, 117569, -184834, -315623, -178115, -52674, -192903, -109687, -290674, -258259, 164964, -54564, -103370, -131674, 7239, 88797, 169452, -20837, -378403, -173188, 79632, -213713, 44871, -19417, -212558, -100949, 206782, -177261, 220863, -64222, -112713, -4453, -17684, 59822, -205463, -206537, -63427, 182704, -87625]
11256b78384G208g2801C8043a27813k66904a80137P0948l7319B281f3362j05510
11245a68872G4482n730a27281k9792C3008b44770B60734g4409D1143a05490l4441
11234a39931J2801j02352F5357j3818f6568m9939o6140H474A55b64330I7460c25795
11221b9964B4810K9179b6517C83107c5478A69051c66419a15165H4604G508b23362
11209a07484r3483L0008Q0320A76319c24862J58628A72933b50192f6006A88854
11198I5184a07852J6514n4860B64403L6316A1122a01089H7421c56289A9872m670
11187A5202a77159F4660a70621C23997F5182h8667D1643i5537n8282B81194a54713
11175b13125c4181k62144o8915B03059C5598P4624c9707A54004a57230B6854J78079
$$ y = [-278384, 7208, -72801, 38043, -127813, -394717, -180137, -109189, -146508, 2281, -63362, -168872, 74482, 68752, -127281, -157073, 33008, -244770, 260734, -74409, 41143, -105490, -139931, -127130, -229482, 65357, 51539, -66568, -116507, -182647, 8474, 155, -264330, 97460, -325795, -29964, 24810, 53989, -26517, 383107, -35478, 169051, -366419, -115165, 84604, 7508, -223362, -107484, -200967, -170959, -90639, 176319, -324862, -166234, 172933, -250192, -66006, 188854, 95184, -107852, -91338, -146198, 264403, 300719, 11122, -101089, 87421, -356289, 19872, 15202, -177159, 64660, -170621, 323997, 65182, -88667, 41643, -95537, -153819, 281194, -154713, -213125, -34181, -296325, -365240, 203059, 35598, 110222, -39707, 154004, -157230, 26854, 204933]
11164B04933N8301g6624H7838c7888q2305A36925b49365i5212K2821j90086D4984
11152H3222Q698f1005G8018K34890d6016k0208j36289A60455c56574i5013A44836
11140A89361a752A48747i4189J1144D3259a14575B61251G1476c05104c4815j270
11129c6085j05844J5984A71643a03942j54201F5944q353K7840b0323l00525F2599
11117C7256J85344d7678A51548C1684b56939A5905O9051N2167A455K84292f3684
11105C08469p7939p1116l130N2141P2581J00211j83960n139F2353K27319D4750
11093B79376Q1148B0964J12012J27887A7424K25727l3645b70471g2427A82099
11082g5550C95531j20165I4994p949M9854N6656L13525A22766n0049L57327A81656
$$ y = [204933, 263234, -76624, 87838, -37888, -120193, 136925, -249365, -95212, -72391, -262477, 44984, 83222, 91920, -61005, 78018, 312908, -46016, -66224, -202513, 160455, -356574, -95013, 144836, 189361, -1752, 148747, -94189, -83045, 43259, -114575, 261251, 71476, -305104, -34815, -36085, -141929, -125945, 171643, -103942, -258143, 65944, 57591, 85431, -20323, -320848, 62599, 37256, 222600, -47678, 151548, 31684, -256939, 15905, 84956, 137123, 1455, 285747, -63684, 308469, 230530, 159414, 156284, 208425, 281006, 381217, 197257, 192118, 62353, 289672, 44750, 279376, 360524, 20964, 132976, 260863, 17424, 243151, 209506, -270471, -72427, 182099, -75550, 395531, 275366, 94994, 87045, 136899, 193555, 507080, 122766, 72717, 430044, 181656]
11070C38637k1877k6699J34462k8439A74941K70894o7428O6174J45581A57548
11059A73042J12188J22299M50990k23713k27541j64906N03930J17330q6159Q3030
11049H60490l87014J58894L15097L255l19833C09420K76829L28161j73458K20521
11039I61473k60559L3102q4420K16743l23744j76740R7126M8674Q3793A80506
11028G01557k80744n0973J79464K2806o6846J25192q9690J43028j54323l3942
11018D95529j29004M61867C18912K13243K24423M9766k14844j32342L4946j05977
11008C88127M84349A90643L74251k37111K18349o0847A24415M42803J71560l15588
10998D23190J85407C03511k7254K25440j47759K11973N3877K96982D55273Q4039
$$ y = [338637, 316760, 290061, 424523, 396084, 174941, 445835, 378407, 444581, 590162, 157548, 173042, 285230, 407529, 858519, 634806, 407265, 242359, 746289, 863619, 777460, 860490, 473476, 632370, 947467, 950722, 630889, 309420, 586249, 914410, 740952, 961473, 700914, 734016, 649596, 866339, 542595, 365855, 462981, 511655, 595448, 180506, 701557, 420813, 369840, 549304, 572110, 505264, 630456, 540766, 683794, 529471, 495529, 366525, 828392, 318912, 532155, 756578, 806344, 591500, 459158, 494104, 388127, 872476, 190643, 564894, 327783, 546132, 485285, 124415, 567218, 738778, 423190, 608597, 303511, 276257, 501697, 353938, 565911, 619788, 916770, 455273, 539312]
10988E39312n151L94997m6245j58834K05154k77538J98826l00766Q25789k20043
10978A155501J57182K01357N1987L02387J22044L54156k9599K79300J91629m45938
10968B340006j04651l8997l70628k11364J35658l49868K4993n2631P3981K87937
10958A734436j15778N4499J45030k10023k7593m03779R4139j25770E01658L86858
10948H88516j76887j58366k48551K75976A59736N21208A58969p6781Q7412J92919
10938C62519A42814K2655a08248B98479A42792D6751K6250F055J9664M38978e4044
10926C3431J33575F3812a22775B12908Q254D1910g3777D13562G6534K82604G4149
10914f3187C9799b4519G1426k632R1353F5718K9990J45779g221k28562R2140f9410
$$ y = [539312, 534161, 929158, 882913, 724079, 929233, 651695, 850521, 549755, 1375544, 1155501, 1312683, 1514040, 1566027, 1868414, 1990458, 2344614, 2315015, 2594315, 2785944, 2340006, 2235355, 2196358, 1825730, 1614366, 1750024, 1400156, 1425149, 1372518, 1446499, 1734436, 1618658, 1673157, 1818187, 1608164, 1580571, 1176792, 1270931, 1145161, 501658, 888516, 711629, 553263, 304712, 580688, 159736, 680944, 158969, 82188, 169600, 362519, 142814, 165469, -108248, 298479, 142792, 46751, 73001, 6055, 25719, 464697, -54044, 33431, 167006, 63812, -122775, 212908, 221162, 41910, -73777, 413562, 76534, 359138, 74149, -63187, 39799, -24519, 71426, 68794, 160147, 65718, 95708, 241487, -7221, -235783, -143643, -69410]
10901I4378e9896K3998A24174a29194j48105h3338B64771a08800G8001A2670a70686
10889A29459a71402B51023p8070p0714a70561A92823Q0572a45920j3515A52636
10878I2246f0155K4648j16637A77991H6870b29685A30914K02551b63169i0553
10867A09200J06762a36183o0351c6120a7099q8265N1042K3779j29850l7079B987
10855B15530I7669c3263a3214A6623M04338b5797A46371n0776J02722b35240A21395
10843b59847d2860a4233p7753b5249G8088h8741j19966R3245H6746J10584G7926
10831a96837Q743h1597b591k7717j7739o9118E8637b13814j04197H7575f6947
10819c90957b8231A15510i1934i317B0103K4655L20K61511A30483c4759l9673
$$ y = [94378, -59896, -35898, 124174, -129194, -277299, -83338, 264771, -108800, 78001, 12670, -170686, 129459, -171402, 251023, 172953, 102239, -170561, 192823, 273395, -145920, -159435, 152636, 92246, -60155, -35507, -152144, 177991, 86870, -229685, 130914, 333465, -263169, -90553, 109200, 215962, -136183, -196534, -36120, -17099, -105364, -54322, -30543, -160393, -197472, 2987, 215530, 97669, -33263, -13214, 16623, 420961, -25797, 146371, 95595, 198317, -235240, 121395, -259847, -42860, -14233, -91986, -25249, 78088, -88741, -208707, -115462, 86746, 197330, 77926, -196837, -188094, -81597, -2591, -30308, -48047, -117165, 58637, -213814, -318011, 87575, -66947, -390957, -28231, 115510, -91934, -9317, 20103, 44758, 45078, 306589, 130483, -34759, -74432]
10808g4432p2967f0765p5497A28369Q4176p4048n0504A7338a7136C5376K0724
10797E6100g8338m3133G9397a87536H1707a16309a3717D8216J42060b98192a3793
10785a36495b7250A09625L5273d19364d1791a1372k18049c119j83820h2067p6472
10774a58539j76379a57765C0667a72410A15090l9611a89573d1431F8429c28587
10763G1652e834k67232f8216E1776b88765a10251j24314g9270D2385a59228N1093
10752a08135k43091a55802A41923m7545d11514J42344g1586G7138P5758l3539
10742A19357P4889b87911l06833i8516K6262A36198a54475j7036o543A21693E078
10730a3314F7304b05476A8350h4756L8916E7932a4978l09811f0553F8667a7655
$$ y = [-74432, -147399, -60765, -136262, 128369, 212545, 138497, 87993, 17338, -17136, 35376, 56100, -78338, -121471, 79397, -187536, 81707, -116309, -13717, 48216, 190276, -298192, -13793, -136495, -27250, 109625, 144898, -419364, -41791, -11372, -229421, -3119, -186939, -82067, -158539, -334918, -157765, 30667, -172410, 115090, 75479, -189573, -41431, 68429, -328587, 71652, -5834, -273066, -68216, 51776, -288765, -110251, -234565, -79270, 42385, -159228, -108135, -351226, -155802, 141923, 94378, -411514, -269170, -71586, 77138, 152896, 119357, 194246, -287911, -594744, -98516, -72254, 136198, -154475, -171511, -178054, 121693, 5078, -13314, 67304, -205476, 18350, -84756, -45840, 57932, -14978, -324789, -60553, 68667, -17655]
10718d384j81573d7458A13201c80026B8538J31085a0363F1112N6982K995Q370
10707A29459d4853H0553h7935A34698C7426a72406E6889h7204E1143a53891A98770
10695b09495a2994A688a11440d3962l29558A39324i9037K2201G9650f1031B7726
10683b40872J16789K1069M3515O910o794j90828H3268e8828A21586l3552h9084
10671C84909F4870J84712o1938g3158A85270a37193B18206I8929H177d39889A08405
10659b57230Q679b6354G4477c72745e4569H4133f2998J5576k94653g6276D7721
10647b53334B17663a77666f6455n7148A12613c20433J14625h4106j76170N6370
10637b03906Q9330e2960j49034g5801j96685A63152a44906I5785J14744a31415
$$ y = [-4384, -185957, -47458, 113201, -380026, 28538, 159623, -10363, 61112, 118094, 121089, 129459, -44853, 80553, -87935, 134698, 37426, -172406, 56889, -87204, 51143, -153891, 198770, -209495, -12994, 1688, -111440, -43962, -373520, 139324, -99037, -76836, 79650, -61031, 27726, -240872, -124083, -103014, -59499, -52589, -59383, -250211, 83268, -58828, 121586, 88034, -89084, 384909, 64870, 249582, 187644, -73158, 185270, -137193, 218206, 98929, 8177, -439889, 108405, -257230, -248551, -26354, 74477, -372745, -54569, 84133, -62998, -47422, -342075, -76276, 47721, -253334, 217663, -177666, -66455, -123603, 112613, -320433, -205808, -84106, -260276, -203906, -114576, -52960, -201994, -75801, -272486, 163152, -144906, 95785, 210529, -131415]
10626c65613B38132A06456A4340a63925A4232a76397B84539N7945g9455J7720
10616f1735k8247A16554b66409f711G537c57904E8950a36776A61914d5570A42247
10604f5810j53959A6932J37820M1002D2561b92017A32509r045b03902h4545c1120
10592D0330a42503L5668B73782a16462a2432k59631G1270j7624c79585d3258k77240
10581c20498f5824A55865F6096j0966R3768Q0564K7150a5761r8724c7450j27306
10570a64756A53179b51023j29935b7400A15191a36963a6279j00055A14370i1981
10559H6559b40900h6505n0168K8310A42516j4650a37673A11277d9073o1829A93611
10547g8028b0652A40059a18103K0530A81814J50264j04495o5606h7683C00546
$$ y = [-365613, 238132, 106456, 14340, -163925, 14232, -176397, 284539, 342484, -79455, -61735, -89982, 116554, -266409, -6711, 7537, -357904, 58950, -136776, 161914, -45570, 142247, -65810, -219769, 16932, 154752, 195754, 42561, -292017, 132509, 123464, -203902, -84545, -31120, 40330, -142503, -106835, 273782, -116462, -12432, -272063, 71270, 53646, -379585, -43258, -320498, -65824, 155865, 66096, 55130, 148898, 229462, 256612, -15761, -114485, -37450, -164756, 153179, -251023, -380958, -27400, 115191, -136963, -16279, -116334, 114370, -91981, 86559, -240900, -86505, -136673, -108363, 142516, 127866, -137673, 111277, -49073, -110902, 193611, -78028, -20652, 140059, -118103, -97573, 181814, 332078, 227583, 161977, -87683, 300546]
10536e00129E6926i7945A16753B1577f8410g655m06M019j94126E101i8l11991
10524c12089a04789m3662D20569c07486H8895C1927a97621j0812C2254a28691
10513f1459a6018B47905D1285b59022F7929P7050e7195M165o2679C30319A05782
10501a72401E2776i3344j30092B80365a24013B15944h9509j95187M2938A84168
10490a0383G5407l780K03294q1233b6830D1640H424e925D14693J22912B58022
10478D28335E6115L83872A8952a82619A27957O5410G2519k3266K02745a20476
10467A25458J69458A23320a14759A12091a33229d2584E2512b78113K6072i6653
10456a58775a0447q4996M1775r9801J7755e4429l52956A02047J3685B9504a984
$$ y = [-500129, 56926, -97945, 116753, 21577, -68410, -7655, -8061, -4042, -198168, 5101, -98, -312089, -104789, -148451, 420569, -307486, 88895, 31927, -197621, -208433, 32254, -128691, -61459, -16018, 247905, 41285, -259022, 67929, 144979, -57195, -53030, -115709, 330319, 105782, -172401, 52776, -93344, -223436, 280365, -124013, 215944, -89509, -284696, -241758, 184168, -10383, 75407, 71627, 274921, 193688, -26830, 41640, 8424, -5925, 414693, 537605, 258022, 428335, 56115, 439987, 18952, -182619, 127957, 193367, 72519, 49253, 251998, -120476, 125458, 294916, 123320, -114759, 112091, -133229, -42584, 52512, -278113, -252041, -96653, -158775, -10447, -95443, -53668, -153469, -135714, -54429, -407385, 102047, 115732, 29504, -1984]
10444F4585e8602k4026j6943D0288P1222a22364J6042C59680b95110Q7899l4269
10433b41480O6578C9479a27837G1675K30768a32996f6279B870a72156j97846B2531
10421a54652g0000m9899k54444a38176C5140N058a52556d2752Q784p5684B8381
10409C6262O0186Q9625l8266o9346a1777l16360e146m7966A70555E1567L29966
10398C81533A77604g3849K4194j77881L9624B97306a52062m6285B04887a16902
10387B15746C9375J36593j0394H903J6337a60711A11071R5948Q2865G2860a945
10375B4611L38315E1770J19850J10731j32029G0678K21665M3230P3642k04422
10365B04793K81614B1278J63181J58784J51130D8024J58450L5379M5974I3496
$$ y = [64585, -58602, -82628, -99571, 40288, 111510, -122364, -106322, 359680, -295110, -207211, -241480, -174902, 39479, -127837, 71675, 302443, -132996, -66279, 2870, -172156, -370002, 22531, -154652, -70000, -119899, -374343, -138176, 35140, 40198, -152556, -42752, -33968, -109652, 28381, 36262, 96448, 186073, 147807, 78461, -11777, -328137, -5146, -53112, 170555, 51567, 381533, 177604, -73849, -49655, -227536, -187912, 297306, -152062, -198347, 204887, -116902, 215746, 39375, 175968, 165574, 8903, 25240, -160711, 111071, 207019, 289884, 72860, -1945, 24611, 362926, 51770, 171620, 282351, 150322, 70678, 292343, 335573, 409215, 204793, 486407, 21278, 184459, 343243, 494373, 48024, 206474, 241853, 287827, 93496]
10354A56003D3815J11848K95354J76778k1409j84435O8429l2014A93976L21571
10344E15547H3419L21353p62A73395J19565j36506i5356A73653B0595r140K56105
10333B67560A07315J0284n2278a32133e5563j38541A86134E5104J94867L7764
10323B87735j41538C8855a01559J4594A70051K36159a9311B33970b10284A14271
10312a07267j12481I9144J24939H9740I706K2203J29948a15592j7568f3004B10486
10300a81257J1102G2384K4751G867N2934O5474a30676O0663o9525A92156g0722
10288b57585A9034b43102a06966k16499a53590j94869C1304J44310B4245h8687
10277C0601N9571a14725l0380D3886q879d6804C5312J67129a31707d4926k22366
$$ y = [156003, 43815, 155663, 451017, 627795, 606386, 421951, 490380, 458366, 193976, 515547, 83419, 404772, 404010, 173395, 292960, 156454, -95356, 173653, 20595, 11455, 267560, 107315, 117599, 65321, -132133, -55563, -194104, 186134, 55104, 249971, 287735, 146197, 38855, -101559, -86965, 170051, 406210, -19311, 233970, -210284, 114271, -107267, -219748, 99144, 224083, 89740, 9706, 31909, 161857, -115592, -133160, -63004, 210486, -181257, -170155, 72384, 97135, 7867, 60801, 126275, -130676, -70013, -139538, 192156, -70722, -257585, 19034, -243102, -106966, -323465, -153590, -348459, 31304, 175614, 24245, -88687, 30601, 90172, -114725, -145105, 43886, 35007, -46804, 35312, 202441, -131707, -44926, -267292]
10266b67292h1850c1874I3925K78887e1181E36343m8382i4618B02135L80848A69491
10254A3071M5118N2818f7672B6097L58442a975j78768B23619c79947J77778L5416
10243a66753J5756L1984J5747o6618B14837q6032d0711q0749c5916j9722I2480
10231E916h884j81772c2585r1526j20179b3763m5205b1510C3541a35246j11396
10220b46642J18073r6296B5901a0261G0876e847j69341r6298H4119a31430A04696
10208a32486B65036a57913J9220A06039b4192D5682b34617H6740A7618a36665
10197b41882P9993B7295g0502L484n35357B01416e7775j0906C7095J56646C7097
10185d9566j74649Q5157c8861p471l4211A52760b03294p6336Q2199a5385j75895
$$ y = [-267292, -81850, -31874, 93925, 372812, -51181, 536343, 487961, -94618, 202135, 582983, 169491, 13071, 58189, 111007, -67672, 26097, 384539, -1975, -180743, 223619, -379947, -202169, -166753, -150997, -119013, -103266, -169884, 214837, 128805, -40711, -121460, -35916, -55638, 92480, 5916, -8884, -190656, -32585, -124111, -244290, -23763, -68968, -21510, 33541, -135246, -246642, -128569, -224865, 25901, -10261, 70876, -5847, -175188, -271486, 84119, -131430, 104696, -132486, 265036, -157913, -138693, 106039, -24192, 45682, -234617, 86740, 17618, -136665, -241882, -161889, 27295, -70502, -67018, -602375, 201416, -57775, -68681, 37095, 193741, 37097, -49566, -224215, -139058, -38861, -46332, -80543, 152760, -203294, -279630, -197431, -15385, -191280]
10174a91280m1520J06852A4702N9401a64445k78987i7218j25556F7356j8039g7165
10162a09292j5711D2360l305J24152e5729e523J488j47134P0354A64839g2283
10150f1233l9296D7745J52042c77145a42166c5590a3614k23410H18d3228j14327
10139a57555r5861k6051O8680j695a3851B05620E2330b4347j56473j4124f8638
10127D887a85574A65847j6428a65007M4553j97794a12331A0667b1594k7662n4489
10116a03745C9275a10358A22318a20601j33629A20267n8913b74948f4281q2303
10106a46584e8926k43203f0438j32742i3393a8153j45496A6361a65325A48595
10095A32305i990A83515b06514l5132B79788J11378F4422L715O9924i6427E3900
$$ y = [-191280, -232800, -125948, 14702, 74103, -164445, -443432, -97218, -222774, 67356, 49317, -77165, -109292, -125003, 42360, 39055, 163207, -55729, -5523, -4035, -151169, -80815, 164839, -72283, -61233, -100529, 47745, 199787, -377145, -142166, -35590, -13614, -237024, 818, -43228, -157555, -253416, -279467, -210787, -212482, -13851, 205620, 52330, -24347, -180820, -194944, -68638, 4887, -185574, 165847, 149419, -165007, -120454, -318248, -112331, 10667, -21594, -49256, -103745, 39275, -110358, 122318, -120601, -254230, 120267, 61354, -274948, -64281, -146584, -58926, -302129, -60438, -193180, -93393, -18153, -163649, 16361, -165325, 148595, 132305, -9990, 183515, -206514, -241646, 279788, 391166, 64422, 68137, 138061, -96427, 53900]
10083a98852M1143j05800a31358A88508f1860A41651a55752k0295D8040h394k05190
10072b13584J2850M9912l9768J9593P6252j90631O4637A88066i4636k44783A92895
10060F1248f508A15247k2116d14841J17834Q9318A86783G9507a51262B00534a19750
10048B2010a94050d5193m0408j98130P8299A59876e5060b3757j22748B03534d7617
10036a27454j35859P0074E5152L8143D0795b3125k48016k0458b0471r2963G6067
10024D0602d11115h1885j0787k9077b5537n1906j42589N9326a5566o9625l25872
10013d11063H7084d890q6421A02058i7709M4357n6065A82067l1203h9944D13896
10001c7656k61626a22815j62169h6082j41260f5847b0308G940b27516j15215a27948
$$ y = [-198852, -157709, -263509, -131358, 188508, -61860, 141651, -155752, -176047, 48040, -8394, -213584, -200734, -150822, -190590, -170997, -94745, -285376, -220739, 188066, -94636, -339419, 192895, 61248, -6508, 115247, 93131, -414841, -297007, -207689, 186783, 79507, -151262, 200534, -119750, 22010, -194050, -45193, -85601, -283731, -205432, 159876, -55060, -23757, -146505, 203534, -47617, -127454, -263313, -193239, 55152, 93295, 40795, -23125, -271141, -291599, -20471, -113434, 76067, 40602, -411115, -81885, -92672, -121749, -25537, -77443, -220032, -160706, -15566, -85191, -411063, 87084, -4890, -91311, 102058, -97709, -53352, -109417, 182067, 150864, -89944, 413896, -37656, -299282, -122815, -284984, -86082, -227342, -65847, -20308, 7940, -227516, -342731, -127948]
9989a39005G3407A0457a8057q3533F54c80941G6631a20120A51634i3398l19644
9978d13042J4235J60901H339L4413J5723g0143B24509b5353l59781e6787n2286
9967a09073c5012j23792F4469O0475b07503o4558B97659I6560h6967I0414a109
9955A13423b35578D9399K9324C2607a70535g173j48182b0282n1222A87361a17944
9943e9137n9067j35653c2653m214k0617A34177a49796d4801A35522b5393j47960
9932a73353c5174j38062j52894H0095b65692h4095J0198A74455n0041b69458G5160
9920c7217o835C7495a35722C5174N0010a37339O4845A713a81055I5925m3409a99296
9907D8430c9234a4383k58810a16729D8238h0108E2911a52886a5993k23445A18616
$$ y = [-139005, 73407, 10457, -18057, -101590, 654, -380941, 76631, -120120, 151634, -93398, -413042, -398807, -237906, 8339, 42752, 58475, -70143, 224509, -25353, -385134, -56787, -109073, -35012, -158804, 64469, 124944, -207503, -272061, 297659, 96560, -86967, 90414, -1109, 113423, -235578, 49399, 78723, 32607, -170535, -7173, -155355, -20282, -71504, 187361, -117944, -59137, -118204, -253857, -32653, -36867, -57484, 134177, -149796, -44801, 135522, -25393, -173353, -35174, -173236, -326130, 80095, -265692, -84095, -73897, 174455, 124414, -269458, 75160, -37217, -44052, 37495, -135722, 35174, 85184, -137339, -72494, 1713, -181055, 95925, 52516, -199296, 48430, -39234, -14383, -273193, -116729, 48238, -80108, 52911, -152886, -15993, -239438, 118616]
9895a96448G590b60082d6675k30866J6735b8652G5454d0386j44671a9585p8635
9884i8220L167j19780A44576c31731A3491O3264b7337D116R4157c88147A34734
9872b00342k4082E7578a52326A21233A7012e9147n5496B7731a17435M9630C0869
9860e772A2278d6674o4133e3190A38803j8042e9763j40944b77r7424l4037I3374
9847a65223I9469d0112E2259J10745a28010q9653F622e0967l9357A45957b92408
9835a84213f1540l41594A20993R5547b8057H0991b53760a20957j20011a0669A14782
9823A88878q1365C0245a26461j76550A2043a64549A96994b49512R6920A94314
9812H2427a50301O861f418A53357a07620M3441j60002A17269f3916J9694G7009
$$ y = [-196448, 7590, -260082, -46675, -277541, -260806, -28652, 75454, -40386, -185057, -19585, -98220, -95053, -214833, 144576, -331731, 13491, 76755, -27337, 4116, 98273, -388147, 134734, -200342, -224424, 57578, -152326, 121233, 17012, -59147, -114643, 27731, -117435, -67805, 30869, -5772, 12278, -46674, -110807, -53190, 138803, 120761, -59763, -200707, -277, -97701, -131738, 93374, -165223, 99469, -40112, 52259, 163004, -128010, -217663, 6622, -50967, -90324, 145957, -292408, -184213, -61540, -403134, 120993, 216540, -28057, 80991, -253760, -120957, -240968, -10669, 114782, 188878, 107513, 30245, -126461, -303011, 12043, -164549, 196994, -249512, -152592, 194314, 82427, -150301, -143440, -6418, 153357, -107620, -64179, -224181, 117269, -63916, -44222, 77009]
9800B10069H8435b48269O4583P5241e680B90989e86323d8640p171j5121E9112
9788b88127A41913a11390k75696a52985e6093j63013k24486f9040B11339F7438
9777C42083A7585o406i330B69498j06183k2808b23761E7559c15843K5354J20384
9766a70105A20860d59564i2234d3381k86591b11l63695g4841j68041B55849q7924
9755A67925b84199J18748M0714e464j02752I7355b27206R6277a3882l46643J56753
9744b03772D5493N6496b06324A3630a70243c6781K244Q426I1778c66928a61935
9732a88992l5460O4370o5131j35282F3442b78536B3356K6807J07883b05232h4672
9720d1398D8085a73124A11657b1424A05492b2762p5372I7K34411c373B1960J12139
$$ y = [210069, 88435, -248269, -183686, -108445, -5680, 290989, -586323, -48640, -55811, -70932, 59112, -288127, 141913, -111390, -387086, -152985, -56093, -219106, -443592, -69040, 211339, 67438, 342083, 17585, 11179, -9330, 269498, 163315, 140507, -223761, 57559, -315843, -290489, -170105, 120860, -459564, -92234, -43381, -329972, -211, -363906, -74841, -242882, 255849, 167925, -284199, -165451, -124737, -5464, -108216, 97355, -227206, -130929, -13882, -360525, -203772, 45493, 101989, -206324, 13630, -170243, -36781, -34537, -26111, 91778, -366928, -161935, -188992, -224452, -160082, -225213, -360495, 63442, -278536, 23356, 50163, 158046, -205232, -84672, -41398, 48085, -173124, 111657, -21424, 105492, -22762, -98134, 97, 234508, -3373, 21960, 134099]
9708A34099a8681R268A36169D3573b18110Q0135A64752a31860j03542P0149d6608
9696c9013k4339H0709a08834r8127B19429a45668O0945k82820a7772A3230d7253
9684A35471b03670M5190A07023j0664H978a86721K6803D5633H340c04047A7424
9672A02034i5745A84010a12580D4946a55284j64979e9945k43102l0783f1250l3076
9661i4326A49433h0929r069j75395L392M7459O3445O1995B66690A07650a47554
9649F6490b40037g7838n6492q4243G708M3110L3091a43564J3612A49694b44862
9637a23995G5868B5892c6878j72033a01820a6652p5757B49659d26511G9255a26787
9625a70687N0535q9282A45568b73786A26801a61222o7110a7163k57444a6108D6443
$$ y = [134099, -18681, -9413, 136169, 43573, -218110, -137975, 164752, -131860, -235402, -165253, -46608, -39013, -63352, 80709, -108834, -206961, 219429, -145668, -84723, -367543, -17772, 13230, -47253, 135471, -203670, -158480, 107023, 96359, 8978, -186721, -159918, 45633, 8340, -304047, 17424, 102034, -95745, 184010, -112580, 44946, -155284, -320263, -59945, -303047, -333830, -61250, -94326, 149433, -80929, -89998, -265393, -262001, -214542, -151097, -89102, 266690, 107650, -147554, 66490, -240037, -77838, -134330, -218573, 7708, 50818, 83909, -143564, -129952, 149694, -244862, -123995, 75868, 25892, -36878, -208911, -101820, -16652, -92409, 249659, -426511, 79255, -126787, -170687, -120152, -209434, 145568, -273786, 126801, -161222, -228332, -17163, -274607, -16108, 46443]
9613B69316g4964E1250J1899a5283q4072I307O8316R1589b00899R1372k06326
9602c15853I8316A4145a0927k08714O3120P5876k32734c2412n9799a5146j05550
9591a20696b4394j26008c2988r8584K3318K0662o8504o980p1881C03473a90608
9579c11185B5876J87819G1588a25980A08252D0336J30400a253k28316G6308c97976
9567a15111E6205D186e45014E1498a04266N2035A7829L9169O9499d86695A52542
9555C42127E2583J17424a46154O7116k87763a49407B3134L0250K3218h5713j93734
9544b79447A86419p5394a68525C1723b2335l17044a7546B36343B2781e8495a8872
9532a20448f0167o6190p1844D4058M729J95023b4928A96244m4071c7410E5033
$$ y = [269316, -74964, 51250, 63149, -15283, -99355, 9307, 77623, 169212, -200899, -109527, -315853, 98316, 14145, -10927, -219641, -156521, -80645, -313379, -32412, -92211, -15146, -120696, -24394, -150402, -32988, -131572, -108254, -87592, -156096, -163076, -234957, 303473, -190608, -311185, 25876, 213695, 71588, -125980, 108252, 40336, 170736, -1253, -229569, 76308, -397976, -115111, 56205, 4186, -545014, 51498, -104266, -52231, 17829, 56998, 126497, -486695, 152542, 342127, 52583, 170007, -146154, -79038, -366801, -149407, 23134, 53384, 76602, -85713, -279447, 186419, 111025, -168525, 31723, -22335, -339379, -17546, 236343, 22781, -58495, -18872, -120448, -60167, -126357, -198201, 44058, 48787, 243810, -24928, 196244, 152173, -37410, 55033]
9520b71980c590B06725H1363f9372r245j38401I9031D6327R2682a71372C5552
9508a43379j12184B2459b63657C4024K29677j22478H911a99168I9712a9229E1504
9496a54894j08480a5595C12402e27361b06966R5586q1936g1590B9190f788F9805
9484d9174l0464A05909a34527j19986D6024d11660a52961j34725g2762d680o1569
9473f6249A48574a19235c0377C01282a27868j20184a07838k23437A35697K6905
9463A62602J662a82101a9946B820M10231D1936g6681C41934b78726C8304f7161
9451a95398c9538j17367m3438A66870e07209C1930A5576a7936j25107c7492p2584
9440a10076l01798a11390m3191c7003n8150B53021G965K69452b95313A87635o2601
$$ y = [-271980, -3590, 206725, 81363, -69372, -78617, -217018, 99031, 46327, 139009, -171372, 35552, -143379, -255563, 22459, -263657, 34024, 263701, 141223, 8911, -199168, 99712, -19229, 51504, -154894, -263374, -15595, 312402, -527361, -206966, -111380, -193316, -71590, 29190, -6788, 69805, -49174, -79638, 105909, -134527, -254513, 46024, -411660, -152961, -287686, -72762, -4680, -66249, 148574, -119235, -30377, 301282, -127868, -248052, -107838, -331275, 135697, 162602, 164264, -182101, -19946, 2820, 413051, 41936, -76681, 341934, -278726, 38304, -67161, -195398, -39538, -156905, -200343, 166870, -507209, 31930, 15576, -17936, -143043, -37492, -110076, -411874, -111390, -154581, -37003, -95153, 253021, 7965, 277417, -295313, 187635, 125034]
9429A25034a040A67290n9065l4833j5899j2844N4678O1737a17901d8339j73333
9418b21672A85871b89595a7092B72934d4544j52303F5461a34596c8500n8622A34896
9406A62100J59224a33949J814E1289f0574a63C1771b03772b2765r8508o7071A54098
9393A56856J12137I5950a26030m8256j41123A3073J579J66028r0142J52907I0209
9381D2999R0708j3914J22916g8491p010A31934a19622j32046c8829o7440c5517
9369D8549N2963J05434b44344e2288H9010a04797A83201a717A792J41643a36266
9357A0461J29721i4592A00058l5322h5682A1994b57800R8221H634c74033g0110
9345a09817j79957a24604j6045j3526D044e8691H1262j4232d349j49645j52476
$$ y = [125034, -1040, 167290, 108225, 73392, 57493, 44649, 99327, 161064, -117901, -48339, -221672, 185871, -289595, -17092, 272934, -44544, -196847, 65461, -134596, -38500, -97122, 134896, 162100, 321324, -133949, -132135, 51289, -60574, -163, 31771, -203772, -22765, -121273, -188344, 154098, 156856, 268993, 95950, -126030, -174286, -315409, 13073, 14652, 180680, 90538, 243445, 90209, 42999, 133707, 119793, 242709, -78491, -85501, 131934, -119622, -251668, -38829, -106269, -35517, 48549, 101512, 206946, -244344, -52288, 89010, -104797, 183201, -1717, 1792, 143435, -136266, 10461, 140182, -94592, 100058, 64736, -85682, 11994, -257800, -159579, 8634, -374033, -70110, -109817, -289774, -124604, -140649, -154175, 4044, -58691, 81262, 67030, -4349, -153994, -306470]
9334c06470N7878J20437N2610n93608F0238a11859J3518c4696p6068n2361A6485
9322I3456Q7982M0623a83526A42550o5226k4992b10792P9630k99748d3798j07110
9311a50908j03373R0328h0740n0149l35855d2575A89967m2787a01396J5060c36
9299I421a89015A58980a0565B5939c17979p8744c0203n5634j2894q4310h4809
9287D9504J5923a48481B55040a50239n6679c238k1125k41324F4554i017r6061
9276a05078B12190c14681A06826g7468A18372c88819a37203o3336G38h0404A55644
9264a30840G2113I692O1728a35296N006B92673A3660c25853C1075b25221a05615
9252a62055C7693J7280b70421H759a12804e3318l18321J68409G9605l7726e8449
$$ y = [-306470, -248592, -128155, -75545, -669153, 60238, -111859, -98341, -34696, -110764, -163125, 16485, 93456, 181438, 222061, -183526, 142550, 77324, 52332, -210792, -131162, -430910, -43798, -150908, -254281, -163953, -80740, -130889, -466744, -42575, 189967, 147180, -101396, -86336, -336, 9421, -189015, 158980, -10565, 25939, -317979, -396723, -30203, -85837, -98731, -183041, -84809, 49504, 65427, -148481, 255040, -150239, -206918, -3238, -24363, -265687, 64554, -9017, -105078, 212190, -314681, 106826, -77468, 118372, -388819, -137203, -200539, 738, -80404, 155644, -130840, 72113, 9692, 71420, -135296, -130290, 292673, 13660, -325853, 31075, -225221, -105615, -162055, 37693, 54973, -270421, 8759, -112804, -53318, -371639, -203230, 79605, 41879, -58449]
9240E5919d07270J63477B90621d02853J59445G4588e8595n8599k06684a32380
9229H0578b4910m9124K156B892J41165a0791j06195A81957b9722I0132l9336e0423
9216a07801L7925l0843A44961f8135A294L5154b26834l04835D4338a22290B95111
9204a47539H8021a3411A15808g3547A36058a41892p4604D9155a98841L0451g2576
9192b16234C6282g120j37992M7390K6262L4355o1940b9509l26344D0582J21605
9181A62187d0911H5024L12954H5436D1079a39598A40687e9806C1186K03715A7447
9169h1912B5817b44008F6491a34369B15231B2827b85544K091j85988b1470k6122
9158d7592A09632g1394A15257b88330O2038a4690D995J11294p160a2071C4999
$$ y = [55919, -407270, -243793, 290621, -402853, -243408, 74588, -58595, -117194, -323878, -132380, 80578, -24910, -74034, -71878, 2892, 144057, -10791, -116986, 181957, -29722, 90132, 50796, -50423, -107801, -69876, -100719, 144961, -68135, 1294, 36448, -226834, -531669, 44338, -122290, 295111, -147539, 88021, -13411, 115808, -73547, 136058, -141892, -216496, 49155, -198841, -168390, -72576, -216234, 36282, -7120, -145112, -97722, -71460, -37105, -99045, -29509, -355853, 40582, 162187, -40911, 85024, 397978, 85436, 41079, -139598, 140687, -59806, 31186, 234901, 17447, -81912, 25817, -244008, 66491, -134369, 215231, 22827, -285544, -283453, -469441, -21470, -47592, 109632, -71394, 115257, -288330, -226292, -14690, 4995, 116289, 109129, -12071, 34999]
9146I996d6124B09236g7758G9594a19954r224b4856j96271B19218l991a29200
9134b6725k96242B23457b09975A22894c00401a868r5304j68804a30176B28467
9123f4147j33974A74890b3215j63702F0263a64336f1596d739j16765A19969h2926
9111d10185A4171K81545j32674p0997J50089d06651i0171E04a21098M7375k20214
9100b93937b0277m4578K3523j30663B81306A05188b19304j07072b2640j75508
9090a98148B4470O1192c67559a43792j09775P2345b7567G3693i4691H3739b18249
9078A60333a4579k8846k4881j1401m8621k36073A83575h4291j56592g3616q2452
9067a56068O8056B9204a32988K9454A17830b54997a2923k63401A48444D9883a04531
$$ y = [9996, -46124, 209236, -77758, 79594, -119954, -129178, -24856, -221127, 219218, 215227, -129200, -26725, -322967, 223457, -209975, 122894, -300401, -1868, -97172, -265976, -130176, 228467, -64147, -198121, 174890, -23215, -186917, 60263, -164336, -61596, -4739, -121504, 119969, -82926, -410185, 14171, 295716, 163042, 92045, 242134, -406651, -90171, 504, -121098, -73723, -293937, -20277, -64855, -41332, -171995, 281306, 105188, -219304, -326376, -22640, -198148, 24470, 85662, -367559, -143792, -253567, -181222, -27567, 73693, -94691, 83739, -218249, 160333, -14579, -43425, -68306, -79707, -128328, -364401, 183575, -84291, -240883, -73616, -156068, -88012, 29204, -132988, -103534, 117830, -254997, -12923, -276324, 148444, 49883, -104531]
9055C50967A729h3941a3224D8938j9253k980e5178k44885f3620a8552B61592r449
9043B52143a05962q1164P4159D7975P686a89020B1760e0282j76333k2286e9050
9031e8583j24768A38074b38144B1253d6078B88585I1492b17307D9120g4046j31886
9020b05932n1473G2058a03743a7680j3752k41604I1861d1832k96457Q2235c9358
9008e4259j20529A28497m1298c8642I4593e0924J6519f059r2376n3288C4388h5273
8995a28775D2972b0349p0447o9363B29757D6700a04503D55788A31063M4144m567
8984A70640h6521p3139k0098g8016j17371h8831l626j64938B3410c4999E525i5054
8971d4690j29081h0342j64550J08363k37816c3031k52640J15894D5261K0882h0913
$$ y = [350967, 1729, -83941, -13224, 48938, 29685, 26705, -55178, -300063, -63620, -18552, 261592, 252143, -105962, -187126, -112967, 47975, 55661, -189020, 21760, -50282, -226615, -248901, -59050, -58583, -183351, 138074, -238144, 21253, -46078, 288585, 91492, -217307, 49120, -74046, -205932, -257405, 72058, -103743, -17680, -31432, -273036, 91861, -41832, -338289, -256054, -39358, -54259, -174788, 128497, 87199, -38642, 94593, -50924, -34405, -6059, -98435, -151723, 34388, -85273, -128775, 42972, -20349, -90796, -160159, 229757, 46700, -104503, 455788, 131063, 175207, 170640, -86521, -159660, -179758, -78016, -195387, -88831, -92457, -257395, 23410, -34999, 5525, -95054, -44690, -173771, -80342, -244892, -136529, -374345, -33031, -285671, -169777, 45261, 66143, -80913]
8959c3182k26030d4469r7614B07431j5024j4923p6358a96065C978b1933A45115
8947E6245b87369A92485d4111j09424A6062K70343b88783e6584a807A44605a57046
8935c5393j09687b5168A34604c53183A3569d43851A07429D5002f8653A50418B0499
8923G0319K97717J092234n56834C40434A15465e5146o0761j42670i7863H745a00278
8911E0605a23320e3985B39806b1387I9206e2339A12806a7491l30431i7831m6923
8900a44754G5486j2145H093J08001a38930m4257j13337f3769j9182I027b52492
8888a14285l2635k2671Q2673B78791h2470K5298A25974a37575f8375b8947q3216
8877a12163F2086a5043j81449A78481p5842N1775d31268N4390F9607O3476a57844
$$ y = [-33182, -259212, -44469, -142083, 207431, 192407, 177484, 101126, -196065, 3978, -21933, 145115, 56245, -287369, 192485, -44111, -153535, 16062, 286405, -288783, -56584, -1807, 144605, -157046, -35393, -145080, -25168, 134604, -353183, 13569, -443851, 107429, 45002, -68653, 150418, 20499, 70319, 368036, 1460270, 903436, 340434, 115465, -55146, -115907, -258577, -97863, 8745, -100278, 50605, -123320, -53985, 239806, -21387, 99206, -52339, 112806, -17491, -347922, -97831, -144754, 75486, 63341, 8093, 116094, -138930, -183187, -296524, -63769, -82951, 9027, -252492, -114285, -146920, -169591, -86918, 278791, -82470, -57172, 125974, -137575, -68375, -28947, -112163, 62086, -15043, -196492, 178481, 102639, 154414, -431268, -376878, 69607, 133083, -157844]
8865A13975C5583a5169k28160g0155C9862J7742i5548D9452b912j20789j47758
8854b71459C9371d01632a94312M379m5571b6640A4769J1131i9072j51712J07866
8843a42918n8998N561E5599K49295j39169b17322q2062o4447c9089n0578k00234
8832b89901O5707e380A09250D2974j6848J39635d8467k63142B25922i215j08878
8821a18093k18222A36761f7714B31744b43792r9643a62136j73453a3070C9813
8810H615Q3166C2305a68692E684b5912k36142f6433o519k0632C3734i8658q6246
$$ y = [113975, 35583, -15169, -243329, -70155, 39862, 57604, -95548, 49452, -2912, -123701, -271459, 39371, -401632, -194312, -189933, -235504, -26640, 14769, 25900, -99072, -250784, -142918, -201916, -196355, 55599, 304894, 165725, -217322, -299384, -363831, -39089, -89667, -289901, -224194, -5380, 109250, 42974, 26126, 165761, -48467, -311609, 225922, -9215, -118093, -336315, 136761, -67714, 231744, -243792, -343435, -162136, -335589, -13070, 39813, 8615, 91781, 32305, -168692, 5684, -25912, -262054, -66433, -72952, -93584, 33734, -98658, -184904]
$$ [...]
##END NTUPLES=NMR SPECTRUM
##END=
