##TITLE=AC1717_NARAH15003_9207285_a228OBguqK
##JCAMPDX= 6.0         $$ Bruker NMR JCAMP-DX V2.0
##DATA TYPE= NMR SPECTRUM
##DATA CLASS= NTUPLES
##ORIGIN= BRUKER
##OWNER= Administrator
$$ 1.72 TOPSPIN		Version 2.1
$$ 2015-06-01 15:10:36.811 -0700  Administrator@X
$$ Compression mode = diff/dup
##.OBSERVE FREQUENCY= 400.02188249412
##.OBSERVE NUCLEUS= ^1H
##.ACQUISITION MODE= SIMULTANEOUS (DQD)
##.ACQUISITION SCHEME= undefined
##.AVERAGES= 64
##.DIGITISER RES= 22
##SPECTROMETER/DATA SYSTEM= spect
##.PULSE SEQUENCE= noesygpps1d.comp
##.SOLVENT NAME= COFFEE_meoh
##.SHIFT REFERENCE= INTERNAL, COFFEE_meoh, 1, 14.96079
##AUDIT TRAIL= $$ (NUMBER, WHEN, WHO, WHERE, PROCESS, VERSION, WHAT)
$$ ##TITLE= Audit trail, TOPSPIN		Version 2.1
$$ ##JCAMPDX= 5.01
$$ ##ORIGIN= Bruker BioSpin GmbH
$$ ##OWNER= Administrator
$$ $$ E:\/data/COFFEE/nmr/AC1717_NARAH15003_9207285_a228OBguqK/12/pdata/1/auditp.txt
$$ ##AUDIT TRAIL=  $$ (NUMBER, WHEN, WHO, WHERE, PROCESS, VERSION, WHAT)
(   1,<2015-06-01 15:09:25.217 -0700>,<Administrator>,<X>,<go>,<TOPSPIN 2.1>,
      <created by zg
	started at 2015-06-01 14:57:55.467 -0700,
	POWCHK enabled, PULCHK disabled,
       configuration hash MD5:
       21 0F 79 D6 B3 7B B4 F6 88 20 88 DB 03 48 BD 9F
       data hash MD5: 64K
       CE 86 7A D8 B1 B0 75 20 2F 73 47 3D B2 A3 6E 5C>)
(   2,<2015-06-01 15:09:31.108 -0700>,<Administrator>,<X>,<audit>,<TOPSPIN 2.1>,
      <user comment:
       ICON-NMR User ID: COFFEE
       data hash MD5: 64K
       CE 86 7A D8 B1 B0 75 20 2F 73 47 3D B2 A3 6E 5C>)
(   3,<2015-06-01 15:10:34.170 -0700>,<Administrator>,<X>,<proc1d>,<TOPSPIN 2.1>,
      <Start of raw data processing
       efp LB = 0.3 FT_mod = 6 PKNL = 1 PHC0 = 0 PHC1 = 0 SI = 128K 
       data hash MD5: 128K
       D6 F1 AE 14 50 7F F4 D8 9F 64 8C 58 97 EB 20 B9>)
(   4,<2015-06-01 15:10:35.139 -0700>,<Administrator>,<X>,<proc1d>,<TOPSPIN 2.1>,
      <pk PHC0 = -84.75403 PHC1 = 0 
       data hash MD5: 128K
       2A C7 16 47 7A C6 15 15 B8 83 60 CD 60 36 5C 4A>)
(   5,<2015-06-01 15:10:35.764 -0700>,<Administrator>,<X>,<proc1d>,<TOPSPIN 2.1>,
      <abs ABSG = 1 
       data hash MD5: 128K
       1B 4C 25 DB E8 C4 C8 BA B2 F5 10 D7 D0 5D E9 3D>)
(   6,<2015-06-01 15:10:35.967 -0700>,<Administrator>,<X>,<proc1d>,<TOPSPIN 2.1>,
      <abs ABSG = 2 
       data hash MD5: 128K
       F1 D7 9E 9D EE 18 CA E2 29 0C 37 C0 49 A2 98 8C>)
(   7,<2015-06-01 15:10:36.061 -0700>,<Administrator>,<X>,<proc1d>,<TOPSPIN 2.1>,
      <abs ABSG = 3 
       data hash MD5: 128K
       5E 32 A9 F4 2B E9 14 FA 70 BA 59 9C 33 86 1B 08>)
(   8,<2015-06-01 15:10:36.264 -0700>,<Administrator>,<X>,<proc1d>,<TOPSPIN 2.1>,
      <abs ABSG = 4 
       data hash MD5: 128K
       80 EA 9B C5 37 C4 F8 3F 71 7F F9 01 CD B1 3D 09>)
(   9,<2015-06-01 15:10:36.358 -0700>,<Administrator>,<X>,<proc1d>,<TOPSPIN 2.1>,
      <abs ABSG = 5 
       data hash MD5: 128K
       10 23 02 0B B7 87 BE 67 BA E9 6B D6 7D 16 72 77>)
$$ ##END=
$$ 
$$ $$ hash MD5
$$ [...]
##$TP07= 0
##$TPNAME0= <>
##$TPNAME1= <>
##$TPNAME2= <>
##$TPNAME3= <>
##$TPNAME4= <>
##$TPNAME5= <>
##$TPNAME6= <>
##$TPNAME7= <>
##$TPOAL= (0..7)
0.5 0.5 0.5 0.5 0.5 0.5 0.5 0.5
##$TPOFFS= (0..7)
0 0 0 0 0 0 0 0
##$TUNHIN= 0
##$TUNHOUT= 0
##$TUNXOUT= 0
##$USERA1= <user>
##$USERA2= <user>
##$USERA3= <user>
##$USERA4= <user>
##$USERA5= <user>
##$V9= 5
##$VALIST= <valist>
##$VCLIST= <CCCCCCCCCCCCCCC>
##$VD= 0
##$VDLIST= <DDDDDDDDDDDDDDD>
##$VPLIST= <PPPPPPPPPPPPPPP>
##$VTLIST= <TTTTTTTTTTTTTTT>
##$WBST= 2048
##$WBSW= 25
##$XGAIN= (0..3)
0 0 0 0
##$XL= 0
##$YL= 0
##$YMAX_a= 5653948
##$YMIN_a= -11240816
##$ZGOPTNS= <>
##$ZL1= 120
##$ZL2= 120
##$ZL3= 120
##$ZL4= 120
##$ABSF1= 14.96079
##$ABSF2= -5.597392
##$ABSG= 5
##$ABSL= 3
##$ALPHA= 0
##$AQORDER= 0
##$ASSFAC= 0
##$ASSFACI= 0
##$ASSFACX= 0
##$ASSWID= 0
##$AUNMP= <proc_prof1d_extract.lims>
##$AXLEFT= 0
##$AXNAME= <>
##$AXNUC= <1H>
##$AXRIGHT= 0
##$AXTYPE= 0
##$AXUNIT= <>
##$AZFE= 0.1
##$AZFW= 0.1
##$BCFW= 0
##$BC_mod= 0
##$BYTORDP= 0
##$COROFFS= 0
##$CY= 15
##$DATMOD= 1
##$DC= 0
##$DFILT= <>
##$DTYPP= 0
##$F1P= 0
##$F2P= 0
##$FCOR= 0.5
##$FTSIZE= 131072
##$FT_mod= 6
##$GAMMA= 0
##$GB= 0
##$INTBC= 1
##$INTSCL= 1
##$ISEN= 128
##$LB= 0.3
##$LEV0= 0
##$LPBIN= 0
##$MAXI= 10000
##$MC2= 0
##$MEAN= 0
##$ME_mod= 0
##$MI= 0
##$NCOEF= 0
##$NC_proc= -2
##$NLEV= 6
##$NOISF1= 0
##$NOISF2= 0
##$NSP= 0
##$NTH_PI= 0
##$NZP= 0
##$OFFSET= 14.96079
##$PC= 1
##$PHC0= -84.75403
##$PHC1= 0
##$PH_mod= 1
##$PKNL= yes
##$PPARMOD= 0
##$PPDIAG= 0
##$PPIPTYP= 0
##$PPMPNUM= 2147483647
##$PPRESOL= 1
##$PSCAL= 4
##$PSIGN= 0
##$PYNMP= <proc.py>
##$REVERSE= no
##$SF= 400.020009722023
##$SI= 131072
##$SIGF1= 0
##$SIGF2= 0
##$SINO= 400
##$SIOLD= 131072
##$SPECTYP= <>
##$SREGLST= <1H.CDCl3>
##$SSB= 0
##$STSI= 131072
##$STSR= 0
##$SW_p= 8223.68421052631
##$SYMM= 0
##$S_DEV= 0
##$TDeff= 65536
##$TDoff= 0
##$TI= <>
##$TILT= no
##$TM1= 0
##$TM2= 0
##$TOPLEV= 0
##$USERP1= <user>
##$USERP2= <user>
##$USERP3= <user>
##$USERP4= <user>
##$USERP5= <user>
##$WDW= 1
##$XDIM= 131072
##$YMAX_p= 376570324
##$YMIN_p= -11876
##$CURPLOT= <Network HP LaserJet P1505>
##$CURPRIN= <$Network HP LaserJet P1505>
##$DFORMAT= <normdp>
##$LAYOUT= <+/1D_H.xwp>
##$LFORMAT= <normlp>
##$PFORMAT= <normpl>
##$SURQMSG= 1
$$ End of Bruker specific parameters
$$ ---------------------------------
##NTUPLES= NMR SPECTRUM
##VAR_NAME=  FREQUENCY,     SPECTRUM/REAL,   SPECTRUM/IMAG
##SYMBOL=    X,             R,               I
##VAR_TYPE=  INDEPENDENT,   DEPENDENT,       DEPENDENT
##VAR_FORM=  AFFN,          ASDF,            ASDF
##VAR_DIM=   131072,        131072,          131072
##UNITS=     HZ,            ARBITRARY UNITS, ARBITRARY UNITS
##FACTOR=    0.0627417313425164, 1,          1
##FIRST=     8223.62146879497, 3460,         -57550
##LAST=      0,             6274,            -56982
##MIN=       0,             -11876,          0
##MAX=       8223.62146879497, 376570324,    0
$$ Real data points
##PAGE= N=1
##DATA TABLE= (X++(R..R)), XYDATA
$$ [...]
65305 146820 145993 145201 144358 143438 142521 141875 141820 142526 144106 146698 150128 153658 156532 158728 160739 162671
65289 162671 164094 164813 165198 165547 165623 165099 164017 162595 160945 159269 157873 156659 155043 152833 150840 150024
65273 150024 150274 150600 150413 149946 149442 148678 147620 146924 147159 147828 147815 146788 145708 145704 146804 148055 148728 149078
65255 149078 149937 151787 154350 156901 158804 159800 159923 159302 158060 156326 154190 151639 148673 145579 142901
65240 142901 141013 139829 139130 138960 139390 139996 140053 139370 138564 138381 138993 140053 141064 141532 141148 140126 139121
65223 139121 138562 138295 137998 137622 137194 136636 136094 135964 136181 135955 134811 133448 132889 133123 133455 133901 135187 137326
65205 137326 139345 140702 141966 143530 144612 144319 143082 142116 141843 141673 141194 140662 140312 139982 139670 139837 140661
65188 140661 141448 141387 140781 140910 142457 144476 145450 145192 145029 145970 147416 148194 148290 148688 149737 150679 150870 150526
65170 150526 149956 148993 147652 146595 146294 146392 146601 147592 150082 153451 156276 158055 159459 160950 162169 162913
65154 162913 163791 165466 167899 170782 174226 178523 183584 189068 194922 201542 209510 219302 230988 244051
65140 244051 257672 271310 284769 297735 309711 320576 330771 340712 350353 359537 368291 376351
65128 376351 382832 386930 388739 388853 387344 383780 378266 371907 365930 360665 355521 349679 342634 334291
65114 334291 324841 314574 303771 292717 281698 270854 260140 249632 239801 231187 223788 217004
65102 217004 210289 203645 197418 191847 186939 182543 178391 174267 170378 167402 165840 165325 164839 163734 162329
65087 162329 161438 161448 162035 162638 162907 162700 161952 160833 159856 159517 159726 159827 159331 158470 157855 157760 157904 157842 157373
65068 157373 156611 155917 155773 156430 157619 158770 159612 160366 161263 162086 162414 162161 161682 161370 161366 161661 162267 163183 164226
65049 164226 164997 165058 164213 162627 160662 158604 156581 154696 153092 151847 150910 150223 149808 149629 149442 148874 147651
65032 147651 145812 143764 142049 140833 139629 137796 135421 133408 132552 132795 133562 134513 135612 136741 137738
65017 137738 138657 139554 140077 139849 139237 139201 140156 141481 142443 143209 144618 147200 150751 154648 158286 161349 163985
65000 163985 166637 169495 172236 174431 176073 177469 178766 179832 180501 180706 180502 180207 180384 181393 182961
64985 182961 184495 185807 187284 189299 191641 193631 194766 195219 195672 196492 197091 196401 194113 191063 188133
64970 188133 185201 181723 178024 175200 173668 172517 170625 167930 165192 162911 160987 159303 158098 157571
64956 157571 157414 156972 155952 154807 154272 154435 154487 153534 151570 149443 148005 147482 147551 147674 147443 146928 146676 147064
64938 147064 147719 148002 147967 148289 149155 149888 149951 149785 150207 151396 152904 154336 155516 156203 156181 155561 154638 153543
64920 153543 152375 151482 151163 151186 151055 150758 150811 151515 152556 153443 154007 154411 154968 156089 158096 160929 164181
64903 164181 167514 170864 174291 177943 182222 187647 194351 201850 209432 216632 223289 229451 235324 241110
64889 241110 246714 251810 256296 260486 264674 268709 272161 274737 276311 276751 275939 273881 270595 266007 260191
64874 260191 253634 247077 241107 236050 232100 229284 227347 225949 225005 224604 224588 224490 224006 223312 222712 222093 220869
64857 220869 218420 214524 209460 203815 198152 192786 187837 183419 179598 176157 172642 168839 165116 162158
64843 162158 160375 159679 159677 159926 160037 159800 159323 158916 158764 158808 158968 159317 159909 160529 160798 160571 160129 159959 160378
64824 160378 161398 162951 165116 168015 171460 174901 177928 180738 183882 187575 191545 195637 200156 205381
64810 205381 211091 216985 223407 231045 239827 248598 256148 262187 266963 270251 271283 269665 265906 260816
64796 260816 254787 247947 240794 234179 228592 223822 219471 215559 212375 209922 207889 206118 204769 203928
64782 203928 203387 202959 202742 202856 203138 203364 203662 204466 206193 209099 213228 218198 223219 227755 232146 237255
64766 237255 243504 250566 257898 265180 272251 279097 285997 293233 300483 306947 312279 316975 321541 325764
64752 325764 329199 331931 334313 336226 337246 337477 337546 337573 336612 333460 327807 320422 312330 303997 295330 286311
64736 286311 277440 269391 262403 256320 251203 247403 244827 242664 240278 237936 236151 234690 232982 231300
64722 231300 230650 231377 232657 233637 234468 235879 238326 241968 246927 252997 259343 264982 269453 272758 274941
64707 274941 276114 276577 276391 274936 271376 265568 258212 250264 242546 235729 230097 225230 220393 215315 210280
64692 210280 205473 200788 196435 193196 191644 191426 191677 191969 192512 193567 195065 196865 199096 202094 206011
64677 206011 210467 214693 218299 222017 227327 235020 244290 253606 262263 270576 278629 285515 290136 292260
64663 292260 292340 290582 286792 281086 274214 267068 260227 254138 249319 245999 243728 241731 239703 238018 237188
64648 237188 237325 238211 239599 241290 243086 244942 247110 249906 253356 257295 261855 267591 274964 283939 294290
64633 294290 306017 319023 332472 344972 355591 364343 371470 376616 379029 378325 374605 368049 358886
64620 358886 347806 335865 323767 311547 299119 286921 275807 266465 259026 253026 247657 242382
64608 242382 237503 233890 231860 230570 228807 226236 223549 221500 220193 219377 219027 219383 220499 222020 223519
64593 223519 225064 227314 230839 235386 240127 244682 249541 255227 261474 267662 273752 280221 287168 294098
64579 294098 300595 306655 312193 316805 320244 322726 324516 325647 326229 326450 325893 323435 318478 311926 305232
64564 305232 298718 291560 283295 274474 265720 257038 248443 240507 233651 227418 221192 215316 210758 207777
64550 207777 205670 203891 202673 202285 202374 202561 203181 204756 206978 208894 210119 211274 213037 215222 217085
64535 217085 218158 218420 217876 216386 213976 211018 208035 205423 203352 201787 200547 199456 198414 197285 195886
64520 195886 194298 193096 192950 193871 195109 195985 196638 197724 199515 201610 203554 205390 207369 209398 211170
64505 211170 212816 215040 218437 223009 228590 235452 243951 253669 263424 272298 280234 287408 293482 297924
64491 297924 300713 302095 301806 299232 294506 288881 283698 279389 275752 272746 270510 268876 267478 266284
64477 266284 265454 264691 263312 261174 258920 256978 254843 251923 248680 246148 244486 242822 240695 238820 238066
64462 238066 238405 239412 241203 244066 247533 250699 253304 255586 257116 256869 254826 252581 251599 251514 250897 249350
64446 249350 248042 248316 250453 253815 257538 260976 263966 266956 270683 275638 281965 289764 299118 309857
64432 309857 321692 334732 349678 367403 388457 412857 440247 470410 503959 542405 587281
64421 587281 639418 699421 768569 848438 939463 1040186 1147778 1258615 1368466 1473287
64411 1473287 1570686 1660269 1741997 1814399 1874663 1920012 1948519 1959130 1951911 1928484 1891593
64400 1891593 1843727 1786029 1718323 1639925 1550667 1451793 1346322 1238460 1132373 1031193
64390 1031193 936787 850092 771573 701515 640009 586736 540908 501524 467719 438919 414825
64379 414825 395280 379861 367510 356774 346655 337110 328548 321050 314275 307973 302198 296940 291781
64366 291781 286055 279376 272053 265010 259078 254258 249791 245069 240314 236206 233098 230878 229436 228925
64352 228925 229495 231063 233439 236529 240373 245027 250399 256086 261415 265737 268646 269907 269383 267206 263868
64337 263868 259864 255316 250191 244806 239857 235901 233070 231289 230518 230616 231188 231782 232247 232788 233662 234871
64321 234871 236132 237141 237810 238218 238440 238522 238627 239018 239893 241340 243381 245740 247545 247701 245856 242782
64305 242782 239490 236173 232246 227212 221132 214507 208127 202904 199302 196914 195041 193683 193389 194032 194481
64290 194481 193942 193120 193394 195077 197155 198750 200145 202132 204908 208103 211576 215629 220418 225691 231240
64275 231240 237244 243861 250741 257308 263389 269207 274831 279947 284155 287179 288790 288872 287703 285865 283818
64260 283818 281851 280436 280118 280841 281805 282296 282255 281740 280247 277080 272144 265914 258851 251331 243888 236944
64244 236944 230394 223963 217894 212710 208415 204580 201253 199094 198383 198479 198556 198389 198177 198108 198428 199448 201028
64227 201028 202425 203135 203607 204606 206134 207537 208527 209494 210684 211624 211659 210731 209315 207738 205893 203595
64211 203595 200962 198330 195925 193802 192111 191224 191461 192781 194811 197075 199036 200132 200187 199847 200251 202048
64195 202048 204886 208026 211248 214983 219701 225514 232376 240422 249872 260653 272263 284126 295995
64182 295995 307835 319252 329246 336605 340456 340404 336455 329160 319638 309005 297788 286119 274420
64169 274420 263468 253720 245023 237096 229915 223461 217503 211914 206977 203105 200467 199032 198651 198819
64155 198819 198657 197606 196139 195466 196474 199047 202339 205538 208479 211697 215883 221117 226630 231387 234862
64140 234862 237232 238968 240343 241225 241237 240171 238261 235890 233089 229614 225622 221878 219079 217243 216054
64125 216054 215546 216089 217814 220413 223453 226616 229723 232858 236513 241350 247683 255275 263630 272371 281412
64110 281412 290881 300814 310773 319915 327564 333578 337956 340434 340910 340237 340032 341438 344374 348148 352537
64095 352537 357849 364070 370339 375487 378922 380799 381392 380507 377651 372655 365971 358459 350913 343668 336443
64080 336443 328676 320295 312077 304961 299054 293631 288080 282458 277150 272539 269098 267137 266186 265206 263857
64065 263857 263043 263649 265215 266489 266961 267071 267181 267171 267084 267375 268317 269720 271399 273494 276170 279444 283356
64048 283356 287936 292932 298029 303382 309527 316778 325222 335214 347091 360219 373047 384446 394389
64035 394389 403055 410051 415059 418503 420789 421378 419437 415130 409519 403386 396948 390677 385570 382364
64021 382364 381017 381143 382424 384303 385715 385476 382889 377912 370973 362743 353872 344874 336322 328969 323321
64006 323321 319072 315325 311459 307488 303600 299799 296158 293011 290601 288762 287208 285969 285346 285588 286793
63991 286793 288948 291845 295083 298362 301662 305033 308362 311584 314967 318941 323718 329276 335658 342969
63977 342969 351000 359139 366866 374269 381969 390499 399804 409337 418606 427609 436750 446416 456772 467996
63963 467996 480572 495137 512000 530899 551314 573022 596391 622175 651107 683755 720720
63952 720720 762883 811342 867208 931588 1005763 1091223 1189445 1301665 1428729 1570894 1727672
63941 1727672 1897949 2080311 2273157 2474620 2682655 2895201 3109802 3322710 3528585
63932 3528585 3721404 3895744 4047250 4172448 4268743 4334581 4369109 4371502 4340883 4277064 4181240
63921 4181240 4056027 3905161 3733258 3545514 3347193 3143121 2937394 2733245 2533294
63912 2533294 2340132 2156580 1984990 1826271 1680137 1546486 1426085 1319627 1226582 1145467
63902 1145467 1074979 1014308 962514 918146 879625 845676 815331 787814 762555 739091 716896
63891 716896 695488 674749 654941 636332 618932 602572 587143 572807 560140 549944 542628 537802
63879 537802 534752 533350 534160 537618 543457 551098 560387 571696 585470 601812 620393 640642 662075
63866 662075 684523 707977 732294 757248 782799 808892 834920 859774 882679 903665 922874
63855 922874 939693 953013 962306 967973 970601 970224 966491 959214 948481 934389 917022 896769 874345
63842 874345 850265 824381 796253 766102 735063 704237 673681 642790 611723 581943 555035
63831 555035 531202 509246 487875 466741 446332 427253 409788 393920 379481 366215 353808
63820 353808 341974 330591 319818 310067 301794 295216 290076 285653 281152 276250 271225 266475 262116
63807 262116 258192 255047 253024 251799 250445 248332 245728 243368 241674 240552 239667 238719 237571 236215 234551
63792 234551 232317 229499 226686 224538 222836 220675 217778 215001 213139 211856 210413 208942 208216 208446 209034
63777 209034 209456 209639 209491 208805 207767 206913 206417 206015 205768 206252 207618 209017 209449 208785 207597 206325 205130
63760 205130 204255 204000 204369 205125 206103 207119 207731 207561 206890 206534 206995 208008 209056 209960 210781 211453 211916 212482
63742 212482 213654 215494 217486 219225 220939 223033 225330 227227 228639 230312 232977 236451 239830 242337
63728 242337 243866 244947 246526 249517 254151 259759 265405 270682 275692 280521 285112 289466 293465 296631
63714 296631 298535 299437 299974 300146 299195 296670 293091 289259 285343 281012 276130 270993 266156 262382 260454
63699 260454 260563 261955 263537 264797 265903 267064 268204 269329 270862 273390 277090 281471 285739 289444
63685 289444 292727 295814 298360 299603 299226 297793 296219 295030 294278 293875 293786 294069 294901 296401 298321 300199
63669 300199 301956 303999 306475 308773 310182 310762 311101 311377 311209 310320 308819 306714 303647 299384 294288
63654 294288 289119 284538 280858 277992 275423 272423 268533 263938 259378 255728 253569 252891 253193 253996 255315
63639 255315 257486 260554 264066 267528 270916 274583 278733 283093 287095 290374 293162 296159 299953 304625
63625 304625 310001 316134 323277 331355 339794 348100 356518 365932 377099 390062 404335 419610 436154
63612 436154 454470 474646 496253 518870 542477 567280 593408 620914 649657 678690 705910
63601 705910 728811 745762 756414 761158 760793 756767 751008 744937 738773 732128 724996 717812 710631 702666
63587 702666 692703 679817 663814 645245 625022 603825 581869 559318 536793 515237 495419 477844
63575 477844 463058 451548 443202 437217 432752 429489 427454 426651 427173 429300 433069 437882 442973 448178
63561 448178 453855 460083 466501 473064 480440 489321 499673 511004 523142 536497 551804 569978 591905
63548 591905 617902 647509 680309 716722 757203 800307 842046 877562 903376 918180 922384 917740
63536 917740 907169 893983 880688 868454 857657 848535 841115 834841 828633 821368 812159 800162 784432
63523 784432 764220 739474 710972 679987 647891 615964 585252 556405 529714 505338 483327
63512 483327 463393 445006 427969 412626 399258 387546 377042 367894 360551 354812 349768 344723
63500 344723 339634 334565 329415 324474 320619 318428 317447 316730 315823 314825 313797 312619 311309 310082 309148
63485 309148 308748 309188 310540 312433 314447 316621 319374 323095 327967 333839 339982 345303 349210 352049 354274
63470 354274 355624 355610 354483 352913 350867 347625 343035 338000 333478 329603 326063 322795 319932 317506 315597
63455 315597 314482 314286 314676 315183 315696 316470 317866 320280 324042 329130 335091 341483 348272 355642 363613
63440 363613 372134 381525 392620 406387 423432 443930 467983 495842 527320 560724 592666 619493
63428 619493 639160 651695 658222 660126 659104 657292 656811 659320 666021 677695 694465 715787 740994
63415 740994 769714 801630 835911 870878 904005 932343 953478 966503 972084 971657 966786 959042
63403 959042 949771 939656 928892 917917 907402 897212 885897 871699 853736 831913 806290 777304
63391 777304 746316 715119 684750 655245 626493 598871 572999 549373 528342 510026 494118
63380 494118 480055 467600 457063 448860 443030 439229 437087 436508 437745 441181 446940 454684 463832 473890
63366 473890 484569 495873 508221 522279 538448 556675 576895 599348 624231 651426 680957
63355 680957 713329 748764 786161 823364 858386 889909 916790 937837 952283 959977 961074 956160
63343 956160 946888 935762 924784 914612 905146 896238 887308 876854 863228 845831 825005 800995
63331 800995 773720 743705 712537 682050 653311 626676 602499 581394 563811 549715 538926
63320 538926 531720 528691 529550 531915 531742 525589 512759 495226 475698 456017 437140 419816 404624
63307 404624 391558 380071 369702 360435 352452 345797 340438 336407 333596 331417 328996 325852 322296
63294 322296 318942 315894 312651 308893 305078 301996 299810 297864 295511 292831 290388 288499 287084 286103
63280 286103 285744 286058 286665 287010 286764 285902 284668 283624 283518 284714 286784 288884 290467 291493 292104 292497
63264 292497 293069 294261 296116 298281 300546 303095 306060 309118 311803 314035 316159 318587 321558 325091
63250 325091 329025 333221 337827 343107 348974 355037 361314 368525 377320 387480 398301 409504 421338
63237 421338 434023 447640 462505 479064 497348 516992 537782 559693 582275 604628 626232
63226 626232 647376 668478 689365 709583 729120 748455 768043 788014 808233 828463 848637
63215 848637 869048 889934 910669 929708 945699 958333 967676 972997 972928 966811 955341 939733 920707
63202 920707 898546 873780 847384 820396 793568 767437 742521 719429 698878 681693 668654
63191 668654 660095 655541 653980 654759 658119 664625 674211 686321 700907 718591 739427 762085 784911
63178 784911 807449 830271 853501 876333 898088 918998 939642 960179 980463 1000349 1019389
63167 1019389 1036552 1050803 1061772 1069462 1073435 1072763 1066722 1055127 1037981 1015327 987626 955928
63155 955928 921390 884832 847020 809143 772504 737637 704085 671338 639895 611133 586134
63144 586134 564883 546659 530846 517089 504916 493744 483395 474308 467056 461768 458101 455546
63132 455546 453644 452071 450664 449371 448154 447073 446448 446689 447904 449885 452522 455880 459722 463391 466487
63117 466487 469389 472720 476466 480030 483028 485611 488095 490683 493512 496521 499272 501305 502750 504198
63103 504198 505859 507242 507789 507457 506579 505575 505007 505392 506564 507536 507460 506551 505733 505549 505803 506158 506605 507245
63085 507245 507941 508395 508447 508256 508252 508895 510424 512784 515714 518828 521782 524705 528417 533796 540759 548295
63069 548295 555707 563367 571929 581361 591357 602347 615313 630654 647879 666471 686517 708401
63057 708401 732497 759294 789272 822341 857782 895127 934855 977945 1024825 1074863 1126723
63046 1126723 1179177 1231762 1284739 1338341 1392119 1445272 1497434 1548740 1599236 1648714 1697182
63035 1697182 1744941 1792107 1838519 1884161 1928986 1971997 2011098 2044218 2070124 2087843 2095997
63024 2095997 2093368 2079663 2055106 2019687 1973666 1918643 1857361 1792422 1725685 1658873 1593965
63013 1593965 1532751 1476463 1426088 1382626 1346765 1318500 1297327 1282780 1274835 1273907 1280390 1294027
63001 1294027 1313838 1338810 1368418 1402225 1439256 1478240 1518376 1559411 1601103 1643072 1685073
62990 1685073 1726856 1767737 1806908 1844255 1880274 1914945 1947134 1975260 1997989 2014003 2021713
62979 2021713 2019822 2007924 1986182 1954654 1913434 1863306 1805731 1742119 1673447 1600765 1525862
62968 1525862 1451176 1379015 1310776 1246875 1187289 1131981 1080788 1033258 989014 948223 911321
62957 911321 878258 848319 820710 794938 770571 747110 724382 702780 682786 664422 647282
62946 647282 630928 615167 600150 586238 573498 561273 548765 536157 524685 515273 507537 500440
62934 500440 493457 486630 479967 473530 467876 463710 460993 458903 456741 454492 452484 450904 449697 448588
62920 448588 447112 445017 442679 440788 439522 438371 436862 435138 433659 432552 431474 429945 427764 425230
62906 425230 422969 421314 419849 417880 415394 413188 411814 410739 408958 406315 403808 402497 402436 402841 403124
62891 403124 403401 403960 404619 404926 404789 404490 404036 403096 401789 401081 401867 403890 406042 407609 408720 409649 410256
62874 410256 410289 409750 408755 407387 405897 404768 404250 404056 403700 402961 401828 400243 398238 396312 395321 395774 397221
62857 397221 398411 398273 396921 395604 395489 396566 397908 398798 399187 399224 399000 398853 399324 400395 401249 401213 400626
62840 400626 400319 400493 400558 399952 398673 397128 395860 395330 395597 396227 396811 397427 398258 399041 399457 399931 401319 403701
62822 403701 406184 408116 409863 412008 414367 416384 418067 419958 422390 425361 428912 432964 436872 439829
62808 439829 441926 444247 447680 452099 457006 462537 469333 477625 486926 496590 506319 516126 526112 536418
62794 536418 547238 558783 571296 585104 600591 618179 638417 661965 689302 720552 755772
62783 755772 795347 839773 889103 942953 1001178 1064238 1132699 1206546 1285095 1367296 1451858
62772 1451858 1537247 1621811 1703774 1780981 1850875 1911084 1959950 1996245 2018615 2025870 2017935 1996122
62760 1996122 1962242 1917671 1863366 1800432 1730409 1655141 1576527 1496279 1415766 1336209 1259045
62749 1259045 1185760 1117155 1053027 992911 936967 885863 839912 798751 761813 728661 698784
62738 698784 671483 646323 623532 603698 587084 573333 561723 551540 542339 534081 527017 521286
62726 521286 516591 512493 509045 506925 506765 508450 511287 514781 519036 524407 531030 538840 547869 558297
62712 558297 570308 584050 599723 617574 637898 661129 687777 718045 751659 788421 828916
62701 828916 874250 925039 980977 1041517 1106587 1176379 1250813 1329539 1412164 1497915 1585128
62690 1585128 1671467 1754677 1832830 1903873 1965371 2014876 2050352 2070218 2073382 2059603 2029808
62679 2029808 1985861 1929955 1864085 1789969 1709297 1624029 1536366 1448408 1361932 1278529 1199613
62668 1199613 1125995 1057554 993736 934410 879966 830636 786135 746080 710363 678854 651026
62657 651026 626139 603686 583470 565394 549296 534849 521486 508607 496033 484118 473294
62646 473294 463667 455186 447957 442114 437474 433561 429931 426407 423125 420516 419042 418711 418869 418667 417660
62631 417660 415921 413736 411425 409222 407044 404500 401401 398213 395742 394375 393810 393541 393398 393648 394710
62616 394710 396736 399367 401989 404377 406950 410265 414457 419366 424934 431157 437893 445187 453604 463745
62602 463745 475462 488050 501238 515590 531891 550718 572666 598335 627749 660180 694908
62591 694908 731804 770885 811629 853076 894227 933942 970729 1003205 1030656 1052706 1068513
62580 1068513 1076826 1077007 1069572 1055558 1035615 1010006 979341 944920 908249 870375 831821 793086
62568 793086 754941 718229 683590 651537 622498 596476 572867 551051 531156 513819 499216
62557 499216 486804 476048 466845 458995 451850 444898 438322 432542 427523 422992 419049 416020 413866 412260
62543 412260 411177 410931 411635 413026 414804 416724 418368 419344 419849 420619 422093 423922 425561 427075 429110
62528 429110 432161 436196 441086 447227 455445 466200 479069 493329 508982 526805 547354 570453
62516 570453 595953 624449 656726 692822 732252 774909 820998 870079 920801 971763 1022063
62505 1022063 1070827 1116683 1157998 1193339 1221531 1241596 1252966 1255634 1250065 1237171 1218314 1195017
62493 1195017 1168596 1140391 1112284 1086369 1063912 1045010 1029533 1018013 1011373 1010140 1014237 1023254
62481 1023254 1036630 1053755 1074140 1097254 1121942 1146129 1167265 1183107 1192295 1194768 1191692 1184286
62469 1184286 1172251 1153671 1126840 1091968 1050919 1005854 958547 910484 862752 815865 770203
62458 770203 726589 685996 648882 615276 585403 559605 537691 518983 503140 490349 480453 472453
62446 472453 465329 459082 454517 452112 451453 451792 452787 454497 456822 459293 461487 463432 465388 467328 468861
62431 468861 469582 469234 467551 464306 459616 453886 447399 440296 433061 426474 420803 415458 409838 404097 398747
62416 398747 393915 389543 385902 383203 380904 378091 374515 370771 367543 365214 363988 363627 363165 361708 359635
62401 359635 358269 358177 358594 358768 359058 360222 362268 364617 366907 369048 370861 372228 373378 374597 375885
62386 375885 377215 378790 380682 382639 384782 388014 393048 399355 405779 411979 418432 425173 431545 437338
62372 437338 443315 450229 458121 466984 477362 489621 503169 517152 531630 547441 565185 585062
62360 585062 607540 633313 662585 695157 731477 772739 819378 869991 922309 974763 1026391
62349 1026391 1075506 1119444 1155886 1183933 1203710 1215618 1220329 1218983 1212609 1201366 1184748 1162525
62337 1162525 1135197 1103584 1068472 1030852 992238 954343 918376 884726 853322 824185 797562
62326 797562 773573 751916 732015 713352 695503 678050 660789 644004 628087 612689 596664
62315 596664 579178 560670 542471 525697 510787 497791 486560 476714 467895 460095 453459 447858
62303 447858 442979 438725 435142 432030 429139 426687 425159 424540 424314 424317 424921 426158 427325 427980 428769 430618
62287 430618 433455 436358 438811 441165 443863 446874 450039 453525 457577 462026 466297 469883 472760 475350
62273 475350 478102 481123 484305 487786 492025 497340 503674 511083 520162 531638 545701 562131 581038
62260 581038 603047 628762 658417 692127 730100 772409 818787 868797 921949 977398 1033617
62249 1033617 1088439 1139363 1183889 1219997 1246750 1264471 1274166 1276629 1272033 1260174 1240925 1214482
62237 1214482 1181368 1142421 1098818 1052010 1003496 954576 906371 860035 816718 777181 741558
62226 741558 709641 681309 656582 635416 617695 603347 592183 583674 577133 572202 568924 567297
62214 567297 566969 567398 568114 568776 569208 569475 569689 569582 568536 566195 562879 559154 555184 550792 546051 541483
62198 541483 537600 534415 531581 528930 526801 525814 526295 527972 530346 533336 537394 542923 549823 557738 566470
62183 566470 575828 585250 594028 601952 609368 616451 622788 627891 631847 635142 638012 640441 642934 646920
62169 646920 654075 665268 680365 699029 721477 748274 779523 814460 851851 890484 929183 966557
62157 966557 1001035 1031059 1055135 1071986 1081171 1083656 1081342 1075670 1066770 1053997 1036934 1015665
62145 1015665 990435 961627 930067 896999 863726 831507 801674 775316 752643 732993 715739
62134 715739 701012 689358 680884 674964 670662 667212 664197 661589 659740 659173 660198 662679 666185 670424
62120 670424 675600 682249 690688 700686 711788 723691 735911 747147 755570 760050 760864 759032 755377
62107 755377 750591 745823 742403 740761 739957 738448 735151 729879 723209 716158 709787 704866 701874 701227 703253
62092 703253 707834 714227 721420 728681 735878 743434 751970 761779 772508 783463 794307 805387 817378
62079 817378 830708 845444 861613 879457 899225 920687 942965 965037 986438 1007317 1027829
62068 1027829 1047789 1067079 1086038 1105074 1124076 1142676 1161002 1179764 1199440 1219658 1239377
62057 1239377 1257361 1272397 1283501 1290266 1292939 1292051 1288032 1281101 1271219 1258000 1240907 1219654 1194294
62044 1194294 1164914 1131613 1094892 1055769 1015300 974231 933273 893297 854913 818077 782545
62033 782545 748634 717150 688602 662839 639492 618429 599627 582926 568119 555073 543515
62022 543515 532828 522436 512426 503478 496023 489684 483764 477984 472391 466770 460785 454814 449958
62009 449958 446894 445142 443918 443305 444035 446453 450360 455680 462508 470419 478414 485763 492420 498477 503697
61994 503697 507815 510830 512785 513684 513780 513464 512593 510371 506220 500460 493820 486635 478826 470390 461656
61979 461656 453288 446140 440716 436584 432707 428573 424518 420736 416645 411743 406565 402133 398756 395957
61965 395957 393343 390987 389099 387878 387544 388032 388750 389100 389173 389546 390458 391602 392626 393549 394764 396885
61949 396885 400415 405262 410825 416857 423927 432686 442993 454248 466260 479271 493445 508914 526047
61936 526047 544993 565112 585375 605123 623923 641134 656401 670297 683511 695515 704947 711306
61924 711306 715320 717641 718122 716525 712948 707282 699293 689688 680207 672066 665088 658870 654059 651787
61910 651787 652447 655787 661710 670278 681189 693833 707635 721919 735696 748026 758295 765800 769566
61897 769566 769082 764813 757443 747018 733486 717772 701548 685952 671097 656726 642757 629199
61885 629199 616068 603520 591722 580572 569860 559675 550299 541718 533511 525257 516798 508182 499605
61872 499605 491413 484002 477740 473036 470280 469520 470435 472746 476333 480778 485328 489777 495068 502446 512216
61857 512216 523825 536945 551887 569042 588522 610367 634556 660688 688121 716530 745979
61846 745979 776336 806974 837084 865942 892763 916638 936795 952696 963868 969839 970338 965443
61834 965443 955687 942316 927271 912461 898967 887203 877792 871836 870286 873384 880662 891064 903040
61821 903040 915062 926266 936252 944177 948487 947804 941673 930184 913336 891222 864681 835282 804613
61808 804613 773744 743286 713757 685768 659858 636118 614123 593500 574518 557743 543099
61797 543099 529724 517043 505517 495874 487895 480517 473153 466390 461154 457458 454272 450522 446052
61784 446052 441610 438114 436003 435130 434957 434765 433935 432354 430510 429006 427999 427278 426773 426627 426765 426802 426579
61767 426579 426465 426903 427878 429069 430290 431503 432602 433521 434472 435700 437039 438060 438721 439503 440805 442465
61751 442465 444032 445208 445793 445485 444158 442249 440478 439127 437854 436365 434886 433768 432894 431799 430287
61736 430287 428575 426882 425268 423895 423089 423015 423538 424596 426363 428825 431503 433918 436180 438739 441694
61721 441694 444759 447887 451477 455758 460209 463883 466335 468092 470133 472851 475563 477231 477586 477234 476620
61706 476620 475382 473053 469932 466617 462974 458362 452875 447612 443464 440237 437267 434331 431570 428999
61692 428999 426634 424751 423444 422156 420153 417417 414609 412208 410140 408254 406678 405549 404720 403935 403089
61677 403089 402147 400966 399335 397125 394388 391430 388769 386816 385475 384190 382524 380644 379145 378396 378183
61662 378183 378043 377878 378014 378613 379287 379585 379707 380259 381309 382157 382290 382069 382103 382397 382666 383195 384704 387416
61644 387416 390892 394746 398876 402877 405951 407809 409097 410436 411441 411209 409562 407230 404922 402680
61630 402680 400211 397479 394845 392777 391464 390584 389576 388257 387008 386196 385648 385005 384353 384022 383900 383494
61614 383494 382702 381984 381577 381019 379673 377300 373817 368977 362773 355923 349447 343764 338647 333948 329906
61599 329906 326615 323623 320361 316788 313394 310671 308703 307161 305495 303217 300279 297263 295054 294116
61585 294116 294059 294008 293409 292390 291326 290220 288667 286354 283409 280318 277658 275880 275092 274965 274994 274931 274836
61568 274836 274749 274601 274476 274655 275184 275660 275690 275355 275028 274933 275158 275843 276978 278130 278768 278860 278851 279119 279729 280664
61548 280664 281872 283050 283746 283837 283669 283654 283980 284759 286112 287936 289881 291735 293619 295651 297624 299237
61532 299237 300485 301631 302874 304164 305285 306014 306246 306000 305243 303845 301881 299898 298501 297652 296700 295193
61516 295193 293359 291657 290263 289194 288573 288475 288747 289305 290323 291765 292905 292805 291305 289203 287401 286106
61500 286106 284929 283587 282314 281625 281700 282081 282140 281823 281700 282210 283137 283943 284345 284388 284240 284232 284790 285919 286961
61481 286961 287313 287279 287683 288709 289676 290131 290578 291718 293327 294397 294296 293404 292576 292350 292821 293944 295581
61464 295581 297304 298550 299120 299333 299566 299843 300037 300212 300417 300377 299899 299465 299852 301046 302137 302469 302399 302524
61446 302524 302767 302752 302726 303372 304855 306669 308468 310504 313097 316143 319347 322619 325973 329223 331980 333989
61430 333989 335417 336795 338572 340636 342416 343505 344045 344378 344618 344856 345560 347318 350202 353644 356880
61415 356880 359328 360704 361170 361369 361972 363107 364325 365021 364724 363215 360747 358016 355596 353462 351376
61400 351376 349491 348092 346882 345126 342571 339762 337413 335948 335632 336476 337696 337869 336169 333267 330660
61385 330660 329307 329130 329573 330206 330786 331105 330986 330506 330161 330693 332510 335240 337987 340036 341221 341776 342120
61368 342120 342771 344155 346354 349142 352203 355159 357546 359153 360361 361797 363670 365725 367848 370334
61354 370334 373541 377608 382607 388608 395543 403242 411614 420454 429199 437296 444745 451756 457927 462512
61340 462512 465639 468549 472222 476402 480342 483864 487112 489721 490990 490722 489335 487313 484956 482504
61326 482504 479996 477109 473643 470118 467470 466086 465486 464961 464241 463531 463222 463645 464968 467238 470497 474729
61310 474729 479649 484866 490469 497156 505426 514860 524649 534667 545421 556830 567584 576043 581449
61297 581449 583973 583872 581143 576033 569444 562472 555670 549020 542465 536056 529536 522280 514024 505450
61283 505450 497653 491177 485882 481549 478133 475501 473442 472010 471505 472112 473874 476876 480957 485372 489452
61268 489452 493588 498672 504373 508923 511243 512553 515179 520294 527531 536273 546303 557322 568699
61255 568699 579866 590385 599639 607009 612510 616768 620216 622684 623848 623762 622783 621184 618947 615832
61241 615832 611692 606826 601887 597283 592857 588353 583922 579878 576202 572708 569566 567207 565777 565063
61227 565063 564976 565764 567695 570706 574324 577826 580682 583019 585476 588458 591853 595686 600441 606192 611917
61212 611917 616435 619770 622799 625763 628025 629329 630360 631749 633282 634487 635438 636653 638712 642300
61198 642300 648075 656048 665503 675969 687890 701857 717481 733554 749088 763761 777401 789538
61186 789538 799594 807313 812923 817022 820183 822501 823606 823236 821660 819354 816410 812563 807764 802370
61172 802370 796722 790762 784248 777160 769613 761385 751837 740577 728090 715402 703060 690747 677955
61159 677955 664708 651387 638196 625222 612876 601820 592530 585229 580138 577331 576358 576536 577644
61146 577644 579840 582714 584909 585022 582548 577724 570974 562978 554930 548008 542550 538147 534557 532108
61132 532108 531119 531392 532563 534687 538198 543392 550257 558743 568878 580462 592906 605661 618829
61119 618829 633168 649437 667846 688161 710098 733397 757612 782108 806456 830675 854921
61108 854921 878934 901899 923001 942063 959521 975671 990097 1001959 1010696 1016154 1018075 1015908
61096 1015908 1009395 999095 986018 970802 953548 934365 913730 892113 869503 845602 820541
61085 820541 795171 770512 747020 724613 703358 683739 666134 650369 636076 623217 611829
61074 611829 601514 591739 582641 574988 569226 564991 561654 558935 556857 555521 555116 555740 557085 558685
61060 558685 560662 563756 568365 573982 579824 585650 591734 598481 606320 615594 626271 638114 651245
61047 651245 666006 682120 698695 715480 733406 753395 775184 797926 821416 846067 872082
61036 872082 899259 927266 955655 984024 1012636 1042353 1073455 1105216 1137259 1170631 1206652
61025 1206652 1245240 1285157 1325354 1365230 1404282 1442795 1482639 1526434 1576134 1633127 1699001
61014 1699001 1774979 1861020 1956823 2063813 2185717 2328134 2498614 2706076 2958502 3261811
61004 3261811 3622415 4050024 4557057 5158213 5874486 6736544 7780941 9044457 10562065
60995 10562065 12352317 14369273 16445332 18297619 19638376 20325508 20431683 20181192
60987 20181192 19827315 19573907 19558036 19831119 20309304 20753669 20851277 20369897 19271260
60978 19271260 17699756 15877290 14001173 12204198 10562444 9111838 7859101 6792662
60970 6792662 5893866 5142435 4517039 3997026 3565366 3208331 2912734 2665689 2456963
60961 2456963 2279443 2127150 1994571 1877949 1775374 1685129 1605253 1534783 1473881 1422334
60951 1422334 1379095 1343399 1314792 1291636 1270913 1250235 1229159 1208203 1187654 1167928 1149932
60940 1149932 1134173 1119974 1106242 1092617 1079434 1067047 1055566 1044916 1034864 1025279 1016501 1008980
60928 1008980 1002445 995961 988980 981856 975114 968690 962210 955646 949388 943763 938595 933190 926884 919727
60914 919727 912331 904864 896700 887474 877909 868903 860330 851557 842731 834500 826793 818904 810647 802332
60900 802332 793716 784223 774226 764918 756649 748552 740029 731439 722970 714082 704648 695487 687056 678671
60886 678671 669814 661236 653814 647046 639637 631071 621756 612161 602695 593998 586451 579577 572606 565422
60872 565422 558384 551621 545182 539543 535163 531678 528278 524832 522050 520496 519921 519612 519069 518378 518111
60857 518111 518677 519558 519542 518034 515724 513558 511522 509035 506118 503438 501307 499353 497130 494457 491170
60842 491170 487104 482418 477499 472482 467163 461349 454955 447897 440359 433091 426921 421954 417669 413839
60828 413839 410858 409028 408004 407188 406358 405701 405462 405769 406595 407633 408356 408443 408218 408429 409457 410748 411273
60811 411273 410677 409750 409484 409825 409866 409283 408891 409448 410480 410849 410134 408813 407267 405337 402981 400760 399375
60794 399375 398967 399057 398942 398011 395979 393075 389947 387202 384931 382675 379887 376546 373326 371017 369695
60779 369695 368614 366978 364614 361789 358705 355485 352427 349893 347990 346630 345847 345762 346326 347371 348892
60764 348892 350957 353403 355856 358049 359874 361150 361750 362018 362738 364429 366758 368815 369981 370468 371057
60749 371057 372252 373727 374710 374998 375353 376725 379247 382157 384491 385538 384832 382245 378229 373672 369313
60734 369313 365401 361767 357960 353406 347959 342422 338082 335417 333547 331224 328139 325017 322677 321380
60720 321380 320893 320693 320068 318498 316193 314041 312824 312607 312954 313499 314056 314361 314128 313446 312822 312649 312788
60703 312788 312811 312578 312381 312550 313078 313670 314090 314404 314919 315853 317100 318367 319530 320715 321998 323254 324474
60686 324474 326029 328324 331259 334324 337240 340284 343953 348477 353672 359048 364015 368235 371826 375092
60672 375092 378038 380423 382332 384289 386572 388704 389917 389932 388985 387217 384539 381198 378090 376164 375607
60657 375607 375791 375969 375861 375610 375451 375606 376274 377402 378452 378706 377954 376693 375542 374612 373550 372030 369964
60640 369964 367353 364188 360498 356478 352587 349469 347452 346087 344523 342572 340981 340392 340447 340344 339861
60625 339861 339252 338495 337387 336228 335636 335658 335767 335779 336048 336606 336889 336613 336261 336341 336742 337193 337808 338794 340097
60606 340097 341689 343688 345808 347221 347486 347174 347010 346865 346239 345319 344810 344869 344967 344828 344873 345580 346895 348403
60588 348403 349797 351030 352184 353204 353720 353322 352239 351438 351757 353098 354764 356307 357658 358683 359198
60573 359198 359473 360319 362606 366833 372976 380490 388682 397431 407334 418722 430741 441933 451558 459778
60559 459778 466672 471731 474402 474499 471939 466668 459277 451282 444314 439113 435455 432884 431299 430986 432263
60544 432263 435116 439158 443963 449405 455600 462690 470858 480461 491820 504788 518643 532345 544841
60531 544841 555276 563155 568228 570167 568678 564222 558316 552606 547684 543114 538456 533805 529431 525469
60517 525469 521967 518808 515555 511856 508100 505227 503763 503465 503987 505403 507903 511496 516313 522776 531086
60502 531086 540859 551712 564086 579167 598067 621281 648727 680032 714775 752605 793039 835042
60490 835042 876972 917107 954072 986572 1012897 1031022 1039281 1036914 1024059 1001462 970320 932326
60478 932326 889696 844918 800213 757159 716803 679997 647300 618580 593034 569914 549092
60467 549092 530825 515069 501261 488774 477374 467165 458183 450221 442999 436332 430049 423916 417861
60454 417861 412232 407543 403883 400776 397698 394517 391353 388306 385527 383278 381649 380418 379433 378917 379054
60439 379054 379470 379511 378897 377780 376303 374559 372869 371621 370782 370006 369235 368784 368772 368913 368984 369067 369179 369061
60421 369061 368602 368138 368076 368451 369061 369826 370790 371992 373545 375648 378321 381248 384033 386438 388238 389151
60405 389151 389243 389173 389665 390710 391609 391920 392089 392971 394870 397277 399496 401294 402796 404013 404838 405464 406396
60388 406396 407878 409628 411392 413468 416282 419610 422620 424725 426082 427292 428915 431259 434251 437344
60374 437344 439860 441633 443216 445283 447858 450214 451583 451977 452309 453564 455879 458625 461333 464093 466918
60359 466918 469296 470823 471984 473753 476616 480449 485138 490730 497171 504487 513157 523593 535191 546531
60345 546531 556639 565527 573284 579259 582427 582145 578347 571473 562469 552504 542371 532406 522947 514432
60331 514432 506947 500233 494296 489476 485677 482112 478203 474220 470631 467304 463833 460271 457011 454284
60317 454284 452262 451364 451869 453367 455142 457131 460140 465056 472116 480942 491055 502438 515761 531968
60303 531968 551447 573617 597300 621180 643767 663349 678394 687904 691218 687765 677414 660971
60291 660971 640092 616820 593312 571572 552894 537510 524996 514892 506787 500098 494230 488898
60279 488898 484006 479307 474483 469510 464679 460260 456311 452758 449453 446205 442913 439653 436552 433685
60265 433685 431136 428980 427185 425691 424611 424007 423495 422501 421061 419874 419339 419023 418426 417766 417567 417940
60249 417940 418837 420553 423212 425974 427592 427794 427512 427667 428297 428973 429465 429754 429800 429641 429533 429765 430424 431379
60231 431379 432453 433743 435832 439395 444203 448814 451808 453247 454396 456021 457647 458660 459484 461123
60217 461123 463896 467139 470154 473060 476640 481571 487942 495378 503348 511267 518515 524777 530460 536472
60203 536472 543412 551122 559085 566889 574105 580211 585060 589155 592945 596097 597950 598473 598164 597191 595367
60188 595367 592955 590712 588869 586713 583461 579035 573688 567501 560728 554183 548662 544154 540023 535877
60174 535877 531837 528155 524982 522487 520773 519608 518514 517158 515496 513527 511183 508527 505869 503611
60160 503611 502037 501245 501138 501450 501931 502523 503250 503982 504563 505277 506876 509801 513432 516501 518402 519878
60144 519878 522157 525587 529399 532736 535549 538414 541804 545817 550474 555989 562634 570321 578322 585513
60130 585513 591156 595449 599109 602400 604866 606082 606251 605851 605112 604200 603592 603718 604365 604939 605348 606211 608107
60113 608107 610904 613904 616326 617629 617714 616983 615961 614724 612885 610255 607219 604242 601185 597406 592585
60098 592585 587303 582677 579426 577277 575342 573049 570630 568692 567530 567019 567057 567769 569183 570840 571956
60083 571956 572119 571862 572362 574280 576888 578724 579179 578981 578823 578022 575201 570091 563909 557840 551812 545104
60067 545104 537687 530364 523824 518059 512822 508241 504687 502119 499880 497278 494279 491431 489143 487264
60053 487264 485404 483433 481554 480092 479397 479793 481364 483909 487243 491446 496567 502291 508120 513840 519586
60038 519586 525446 531199 536322 540166 542276 542741 542074 540583 538144 534821 531294 528137 524845 520183 513600
60023 513600 505866 498258 491483 485419 479513 473288 466754 460407 454642 449286 443996 438967 434737 431317
60009 431317 428091 424679 421349 418390 415639 412971 410788 409603 409378 409675 410170 410695 411022 411114 411485 412865
59993 412865 415391 418406 421157 423559 426176 429587 433805 438266 442349 445862 448975 451737 453837 454902
59979 454902 454832 453763 451781 448905 445269 441224 437209 433545 430355 427623 425325 423482 422121 421223 420646
59964 420646 420063 419097 417796 416896 417271 418903 420757 421839 422155 422361 422896 423811 425105 426615 427765 428110
59948 428110 428081 428573 429690 430544 430570 430453 431298 433204 435126 436001 435630 434510 433159 431764 430381 429280 428928
59931 428928 429568 430915 432391 433602 434538 435526 437123 439819 443555 447705 451754 455747 459813 463615 466845
59916 466845 470005 474025 479091 484417 489216 493303 496674 499075 500205 499993 498556 496271 493836 491771
59902 491771 489825 487420 484706 482510 481220 480436 479936 480165 481417 483257 485309 487985 491838 496629 501584
59887 501584 506186 510261 513729 516849 520346 524693 529538 534359 539328 544921 550938 556607 561531 565887
59873 565887 569677 572359 573340 572462 569997 566477 562493 558275 553434 547437 540348 532927 526054 520311 515933
59858 515933 512787 510391 508243 506218 504569 503657 503824 505281 507910 511331 515433 520609 527238 535147 543798
59843 543798 552653 560932 567354 570729 570900 568871 566191 564436 564843 567653 571716 575185 576798 576372 574351
59828 574351 571269 567547 563293 558290 552479 546406 540824 535947 531466 527113 522783 518229 513316 508600
59814 508600 505026 502830 501177 499124 496527 493801 491178 488572 485913 483298 480868 478731 476957 475551
59800 475551 474452 473537 472536 471035 468764 465897 462920 460231 457999 456265 454954 453921 453233 453238 454043 455038
59784 455038 455350 454735 453706 452848 452325 451993 451596 450916 450114 449871 450703 452196 453417 454115 454908 456274 458035
59767 458035 460041 462656 466033 469486 472122 473835 475173 476507 477779 478904 479954 481057 482446 484452
59753 484452 487133 490123 493239 496957 501746 507012 511372 514160 516185 518739 522177 525779 528756 531033
59739 531033 533077 535202 537143 538308 538483 538190 538189 538671 539155 539231 539107 539349 540296 541921 543971 545945 547180
59722 547180 547395 547122 547233 547966 548777 549177 549252 549151 548614 547448 546204 545773 546377 547416 548316 549014 549576 549889
59704 549889 550043 550619 552160 554500 556877 558599 559429 559471 558997 558347 557841 557752 558295 559382 560325 560138 558458
59687 558458 555945 553552 551580 549780 548159 547164 546932 546794 545834 543813 541289 538830 536324 533235 529395
59672 529395 525212 520960 516258 510744 505077 500601 497808 495724 493159 490106 487440 485627 484350 483263
59658 483263 482504 482386 482953 483960 485093 486250 487788 490305 493927 497982 501699 505001 508149 510870 512448
59643 512448 512640 511847 510277 507624 503883 499881 496551 494011 491757 489483 487319 485480 484119 483411 483276
59628 483276 482994 481590 478755 475151 471570 468074 464261 460192 456653 454330 453046 451997 450570 448718
59614 448718 446751 445154 444499 445032 446222 447117 447400 447818 449351 452210 455804 459333 462140 463875 464757 465493
59598 465493 466500 467364 467401 466579 465459 464464 463723 463537 464311 465889 467484 468499 469032 469348 469264 468419 466880
59581 466880 465164 463707 462486 461150 459381 457192 454941 452973 451288 449688 448206 447130 446551 446099 445324
59566 445324 444246 443376 443182 443638 444316 444897 445449 446134 446784 447070 447067 447258 447839 448343 448234 447575 446855 446456 446714
59547 446714 448179 451268 455650 460431 465046 469752 475262 482172 490748 501088 513561 528975 547665
59534 547665 567833 585302 595957 598713 595765 590066 583274 576096 569519 564901 563079 563876 566429 569792
59520 569792 573344 576798 579808 581727 582003 580713 578325 574931 570070 563346 554875 545118 534727 524591
59506 524591 515487 507449 499813 492124 484672 478030 472377 467493 463136 459224 455840 453176 451312 450012
59492 450012 448966 448166 447738 447512 447219 447058 447515 448526 449390 449727 450020 450995 452919 455679 459026 462466 465482
59475 465482 468282 471839 476723 482231 487166 491130 494645 498290 502251 506485 510779 514656 517670 519819
59461 519819 521426 522698 523739 524926 526891 530033 534293 539500 545765 553353 562149 571377 580044 587702
59447 587702 594526 600464 604645 606095 604859 601875 597758 592334 585451 577565 569253 560731 552244 544455
59433 544455 537969 532740 528338 524537 521360 518869 517326 517337 519414 523421 528747 534997 542418 551694 563279
59418 563279 576813 591341 606380 622506 640402 659711 679671 700564 722969 745046 761915
59407 761915 768969 765369 753769 737576 719491 701833 686650 675373 669159 669118 674916 683115 688254
59394 688254 686221 676313 660309 640694 619892 599968 582130 566746 554060 544349 537198 531384
59382 531384 526021 521404 518331 516974 516817 517397 518680 520873 524178 528538 533424 538062 542055 545565 548851
59367 548851 552021 555451 559938 565976 573065 580174 586810 593326 600310 607977 616133 624448 632711 641019
59353 641019 649783 659441 670149 681734 693894 706389 719165 732414 746412 761095 775785 789425
59341 789425 801143 810664 818256 824379 829181 832160 832304 828829 821912 812626 801983 790057 776233
59328 776233 760325 743260 726504 711007 696859 683772 671530 660018 649220 639379 630891 623904
59316 623904 618200 613536 609772 606581 603467 600404 598165 597526 598272 599413 600342 601400 603252 606111 609798
59301 609798 614300 620024 627624 637711 650501 665241 679742 690735 695266 692174 682424 668138 651481
59288 651481 634294 618089 603824 591758 581866 574269 568963 565406 562990 561868 562700 565544 569649
59275 569649 574566 580836 589172 599417 610628 621880 632683 643055 653461 664273 674946 684150
59263 684150 691019 695779 698750 699315 696623 690928 683489 675291 666517 657193 647638 638129 628657 619235
59249 619235 610212 602207 595869 591570 589027 587327 585679 584132 583389 584096 586453 590241 594831 599510 604131
59234 604131 609221 615012 620683 625048 627724 629106 629447 628714 627180 625325 623060 619776 615400 610764 606565
59219 606565 602505 597906 592870 588328 585006 582666 580486 578038 575702 574002 572753 571211 569129 567132
59205 567132 565773 564706 563304 561748 560830 560792 560946 560523 559470 558321 557646 557661 558100 558446 558512 558648 559159 559729
59187 559729 559790 559328 558914 559066 559889 561193 562645 563948 565218 566932 569219 571622 573988 577120 581851 587834
59171 587834 594031 600113 606543 613523 620873 628865 638086 648288 658293 667307 675424 682550 687769 690366
59157 690366 690800 690094 688731 686587 683395 678787 672341 664162 655145 646234 637644 629070 620324 611421 602373
59142 602373 593311 584601 576532 569028 561888 555173 549170 544092 539900 536268 532737 529139 525825 523192
59128 523192 521111 519295 518109 518401 520380 523271 526300 529477 533187 537586 542767 549078 556871 566181
59114 566181 576866 588682 600980 612730 623235 632609 641380 649897 658257 666426 674168 681086 686946
59101 686946 691711 695267 697501 698709 699416 699633 698781 696591 693598 690509 687609 685112 683567 683329 683897
59086 683897 684276 683894 682881 681511 679604 676412 671123 663688 655114 646616 638516 630407 622287 614815 608304
59071 608304 602177 595795 589304 583293 578081 573705 570130 567073 563984 560572 557093 553950 551387 549671
59057 549671 548982 548825 548174 546615 544912 544014 544014 544461 545167 546132 547130 547935 548673 549452 549963 549916 549611 549575 549819
59038 549819 549881 549446 548612 547720 547237 547515 548490 549866 551789 554866 559360 564858 571021 578012 585859 594114
59022 594114 602663 612231 623335 635243 646743 657537 668050 678182 687034 693724 697805 699096 697906
59009 697906 695360 692769 690594 688493 686348 684686 684180 685236 688088 692699 698508 704698 710844 717020
58995 717020 723300 729417 734889 739270 742381 744460 745861 746475 745731 743400 739938 735818 731042 725699 720447
58980 720447 715812 711494 707001 702663 699390 697770 698029 700506 705350 712007 719698 728238 737731 747730
58966 747730 757480 766879 776475 786623 797280 808352 819437 829435 837291 843030 847158 849165 847683
58953 847683 842258 833919 823682 811467 796928 780545 763341 746148 729604 714321 700514 687918
58941 687918 676476 666733 659140 653313 648350 643609 638919 634310 629916 625912 622294 618891 615658 612712
58927 612712 609992 607238 604440 601909 599739 597576 595163 592762 590753 589096 587490 585912 584702 584203
58913 584203 584446 585164 586044 587092 588746 591514 595517 600522 606282 612657 619601 627336 636360 646812 657989
58898 657989 668961 679658 690781 702655 714778 726719 738852 751870 766038 781346 798080
58887 798080 816783 837727 860538 884179 907130 927862 945429 959523 969947 976418 979064 978690
58875 978690 976009 970674 961572 948238 931675 913591 895109 876577 858493 841967 827854 815777
58863 815777 804561 793537 782895 772792 762809 752551 742119 731565 720401 708225 695481 683045
58851 683045 671360 660506 650794 642564 635526 628933 622437 616271 610568 605015 599172 592767 585706 578221
58837 578221 570954 564458 558636 553021 547510 542404 537898 533996 530823 528512 526857 525590 524942 525410 526980
58822 526980 529081 531283 533590 536125 539025 542562 546858 551481 555890 560154 564652 569114 572704 575109
58808 575109 576884 578509 579725 580044 579438 578257 576837 575303 573458 570898 567578 564153 561242 558518 555163
58793 555163 551066 546824 542680 538365 534152 531058 529578 528933 528059 526800 525785 525627 526640 528846 531847
58778 531847 535056 538290 541747 545244 547986 549333 549258 547809 544741 540113 534751 529622 525008 520632 516205
58763 516205 511520 506389 500950 495932 492265 490426 490205 490918 491854 492824 494326 496909 500452 504339 508176
58748 508176 511842 515071 517708 520360 523999 528805 534070 539431 545419 552544 560532 568748 576752 584168
58734 584168 590683 596542 602448 608676 614807 620524 626030 631423 636407 640878 645068 648828 651618 653583
58720 653583 655769 658732 661829 664505 667440 671646 677163 683412 690144 697144 703576 708564 711999 713972
58706 713972 713859 710888 705252 697750 688664 677859 665680 652680 638615 622763 605326 587650 570939
58693 570939 555548 541638 529626 519664 511297 504007 497678 492272 487482 482944 478464 473847 468819
58680 468819 463314 457644 452268 447610 444092 442060 441515 442118 443507 445499 447987 450853 454115 458091 463342
58665 463342 470383 479349 489833 501085 512240 522290 530068 534707 536230 535416 533089 529830 526206
58652 526206 522666 519035 514593 508908 502248 495173 488253 482297 478086 475545 473703 471850 470228 469295
58638 469295 468974 469094 469881 471424 473215 474878 476849 479569 482480 484592 485763 486572 487155 487098 486468 486123
58622 486123 486725 488022 489345 490446 491668 493652 496998 501971 508338 515570 523149 530650 537673 543864
58608 543864 548885 552350 554080 554443 554095 553294 551897 550108 548591 547504 546074 543619 540490 537486 534809
58593 534809 532231 529869 528119 527081 526721 527441 529831 533986 539584 546563 555181 565454 576932 588975
58579 588975 600888 611983 621933 630982 639485 647377 654440 660841 667063 673569 680932 689962 701175
58566 701175 714347 729072 745602 764581 786111 809536 834103 859322 884655 909215 931796
58555 931796 950978 965373 974175 977573 976543 972383 966420 959705 952616 945018 937065 929463 922613 915818
58541 915818 907677 897016 883213 866116 846152 824281 801458 778370 755880 735223 717272 701909
58529 701909 688562 677033 667466 659837 653916 649502 646418 644562 644110 645171 647053 648527 649143 649538
58515 649538 649998 649548 647187 643391 639576 636530 634083 631871 629644 627158 624452 621987 619981 617996 615653
58500 615653 613230 611019 608685 605949 603254 600994 598718 595993 593547 592631 593585 595913 599256 603411 607836
58485 607836 612203 617211 623851 632101 641228 651110 662314 675012 688734 703088 717835 732287 745284
58472 745284 755733 762773 765844 765272 762342 758027 752102 744249 735485 727550 721311 716693 713680 712395
58458 712395 712621 714324 718283 725180 734388 744633 755357 766356 776656 785034 791219 795222 795956 792093
58444 792093 784108 773964 762913 751121 739380 729435 722234 717271 713967 712422 712494 713444 714970 717535
58430 717535 721350 726054 731670 738836 747767 757923 768864 780492 792293 803390 813485 822666 830166
58417 830166 834398 834534 831070 824730 815952 805645 795272 785630 776413 767213 758116 749154 740184 731581
58403 731581 724210 718416 713866 710421 708262 707045 705954 704838 704483 705549 707897 710962 714071 716542
58389 716542 718211 719606 720832 720827 718800 715800 713467 711776 709593 707005 705207 704256 702972 701298 700889
58374 700889 702897 706787 711790 717959 725280 733177 741442 750484 760382 770846 782134 794652 807686
58361 807686 820113 832348 845800 860318 874114 886408 898098 909300 918343 923965 926759 927744
58349 927744 927277 926088 925568 926178 927130 928360 931097 935783 941222 946675 953076 961284 970845 981451 993934
58334 993934 1008765 1025022 1041826 1059250 1076950 1093432 1107723 1120287 1131417 1140228 1146176 1150125
58322 1150125 1152991 1154719 1155367 1155671 1155881 1155647 1155732 1158006 1162912 1168771 1174468 1180948 1189210 1198777 1209157
58307 1209157 1220820 1233614 1246255 1258552 1272134 1287709 1303625 1318496 1333308 1349420 1366377
58296 1366377 1383200 1400078 1417318 1434295 1450837 1467974 1486053 1503857 1520789 1538083 1556636
58285 1556636 1575560 1594028 1612540 1631251 1649211 1666454 1684474 1703470 1721677 1738809 1757501
58274 1757501 1779887 1805530 1834300 1868148 1907959 1951594 1997297 2046187 2099152 2154260 2209744
58263 2209744 2266633 2325818 2385523 2444540 2504977 2568529 2632734 2694253 2753449 2812447 2871127
58252 2871127 2928514 2986020 3045953 3108602 3173818 3243365 3318828 3399252 3483566 3573030 3668742
58241 3668742 3769622 3875606 3989674 4113619 4245133 4382378 4527892 4684407 4850510
58232 4850510 5024428 5208461 5405475 5614737 5835596 6071599 6326540 6600347 6893387
58223 6893387 7210462 7555646 7927840 8326874 8759307 9232528 9748384 10308953 10923235
58214 10923235 11601197 12346877 13165126 14069854 15078155 16202971 17461066 18882885 20506453
58205 20506453 22370107 24524215 27046387 30037082 33607997 37882118 42989810 49049305
58197 49049305 56166311 64477502 74194373 85604914 99070192 115054793 134134479
58190 134134479 156921473 183952917 215535395 251321874 289510915 326210720 355942533
58183 355942533 373572195 376570324 365948289 345259584 318628648 289276721 259195054
58176 259195054 229571070 201265558 174993524 151273596 130347897 112194952 96625575
58169 96625575 83380198 72176396 62726171 54757168 48031675 42345033 37516500 33393253
58161 33393253 29857338 26816937 24192299 21915231 19933948 18206474 16691083 15350134
58153 15350134 14158417 13098536 12150667 11294442 10517670 9814806 9178468 8599457 8073031
58144 8073031 7597652 7168319 6777240 6420058 6095637 5800674 5529704 5279245 5046858
58135 5046858 4827389 4615363 4410337 4215401 4031383 3856796 3691968 3538389 3394828
58126 3394828 3258598 3129879 3010597 2899855 2794679 2694605 2601381 2514646 2431927 2352553
58116 2352553 2277782 2207310 2139213 2073142 2010252 1950186 1891262 1833382 1777847 1724679 1672994
58105 1672994 1623466 1577577 1534985 1494449 1456616 1422995 1392924 1364649 1338712 1316955 1298542
58094 1298542 1280208 1260353 1239909 1219426 1198378 1177333 1157761 1139418 1120565 1100919 1081819
58083 1081819 1063420 1044360 1024387 1004774 985910 966865 947590 929211 911877 894598 877457
58072 877457 861846 848252 835833 824311 814164 804770 794577 783487 773106 764336 756559 749363
58060 749363 743119 737528 731484 724711 717867 710867 702821 693797 684823 676014 666508 656513 647604 640612
58046 640612 634854 629659 625018 620449 614975 608679 602848 598169 594065 589975 585914 581694 577028 572492
58032 572492 568917 565720 561285 555076 547947 540434 532320 523895 515976 508548 500948 493506 487378 482645
58018 482645 478162 473487 469313 465827 462303 458562 455216 452251 448976 445675 443603 443030 442929 442929 443796 445568
58002 445568 446991 447487 448023 449398 451193 453115 455787 459383 462858 465388 467352 469105 469841 468340 463931
57987 463931 456444 446490 436131 427794 421914 416847 411458 406304 401828 397217 391970 387058 383368 380228
57973 380228 376594 372664 369324 366905 365334 364602 364233 363234 361425 359982 359891 360700 361450 361931 362320 362497 362426
57956 362426 362313 361814 360083 357276 354868 353700 352851 351328 349740 349213 349663 350371 351398 353140 355201 357043
57940 357043 359321 363292 369098 375666 382176 388778 396056 404464 414093 424331 433966 442200 449255 455546
57926 455546 460701 463997 465333 465167 463849 461592 458736 455459 451485 446558 440897 434841 428467 421948
57912 421948 415760 410082 404443 398461 392552 387508 383801 381594 380818 380841 380615 379653 378406 377353 376337
57897 376337 375186 374189 373480 372678 371767 371579 372650 374203 375056 375028 374704 374278 373488 372402 371523 371245 371716 372945
57879 372945 374590 375950 376620 376847 376851 376345 375197 374006 373460 373542 373929 374597 375467 375949 375579 374742 374154 373984
57861 373984 374063 374457 375215 375963 376437 377009 378054 379226 380080 380993 382597 384622 386122 386729 386903 387054 387079 386712
57843 386712 385736 383919 381258 378139 374850 371139 366715 361846 356993 352268 347861 344526 342850 342284 341702
57828 341702 340751 339905 339427 339143 339144 339776 340840 341654 342142 343147 345367 348526 351834 354720 356839 357885 357872
57811 357872 357263 356386 354786 351543 346326 339983 333930 328957 324732 320563 316425 312988 310761 309604 309039
57796 309039 308656 308247 308018 308726 310969 314271 317423 319907 322290 325000 327542 329359 330759 332324 334003
57781 334003 335387 336484 337680 339355 341900 345535 349665 353067 355318 357411 360338 363690 366342 367788
57767 367788 367958 366473 363199 359067 355232 351657 347517 342719 337994 333791 330113 327177 325133 323289
57753 323289 320788 318035 316292 315924 316139 316522 317539 319301 321112 322722 324844 327838 330827 332815 333877
57738 333877 334622 335193 335474 335657 335902 335857 335127 333827 332215 330251 328061 326435 326156 327050 328186 328798 328623
57721 328623 327616 325927 324039 322403 320914 319069 316606 313730 310795 308061 305772 304112 302936 301664
57707 301664 299564 296238 291920 287382 283453 280539 278563 277259 276363 275589 274679 273659 272904 272785 273187 273386
57691 273386 272526 270394 267729 265618 264491 263907 263313 262738 262603 263261 264982 268072 272617 278382 285326 294023
57675 294023 305272 319524 337101 358637 384781 415691 451542 493535 543629 602502 667243
57664 667243 730536 782113 812294 816029 794761 754681 703267 647035 591106 539061 492602 451949
57652 451949 416921 387389 362881 342525 325647 311971 301058 292097 284482 278144 273114 269185
57640 269185 266214 264325 263461 263053 262453 261527 260602 259987 259730 259705 259763 259821 259856 259844 259770 259735 259813 259658 258595 256400
57620 256400 253733 251437 249724 248428 247685 247703 248061 247938 247055 245832 244655 243577 242756 242547 243053 244066
57604 244066 245434 246980 248106 248165 247312 246354 245656 244793 243395 241610 239580 237153 234434 232005 230193 228624
57588 228624 226852 224993 223359 221898 220344 218649 216989 215554 214430 213426 212029 209983 207850 206448
57574 206448 205674 204596 202776 200769 199031 197193 194841 192295 189985 187682 185009 182258 180036 178434
57560 178434 177182 176357 176293 176941 177905 179043 180598 182706 185184 187807 190533 193415 196404 199145 200950
57545 200950 201267 200385 199394 199205 199757 200331 200380 199905 199305 199045 199261 199513 199163 198108 196852 195844 195149 194818
57527 194818 195043 195714 196371 196890 197709 199049 200391 201151 201429 201625 201795 201944 202598 204397 207178 209961 211870
57510 211870 212749 212941 212801 212443 211802 210949 210262 210005 209777 208842 207143 205463 204370 203553 202511 201280 200020
57493 200020 198495 196619 195083 194682 195192 195575 195208 194340 193431 192600 191777 190991 190447 190565 191754 193840 195942
57476 195942 197339 198306 199590 201194 202209 201880 200410 198594 197047 195910 195030 194227 193486 192922 192573 192321
57460 192321 192076 191846 191575 191127 190599 190384 190736 191453 192104 192358 191981 190885 189430 188271 187649 187163 186512 186093
57442 186093 186435 187392 188295 188700 188599 188103 187356 186651 186264 186243 186504 186969 187503 188048 188932 190592 192790 194626
57424 194626 195648 196362 197176 197553 196917 195881 195634 196303 196801 196312 195232 194546 194866 196113 197703 198943 199628
57407 199628 200225 201183 202210 202590 202038 200884 199569 198395 197627 197345 197354 197557 198221 199457 200792 201788 202812
57390 202812 204533 206863 209079 210928 212953 215715 219241 223274 227512 231547 234974 237640 239498 240391
57376 240391 240361 239924 239528 238952 237767 236140 234544 232913 230848 228542 226737 225713 225091 224656 224691 225381 226551
57359 226551 228109 230132 232394 234422 236121 237794 239497 240996 242470 244533 247369 250438 253229 255686
57345 255686 257752 259134 259793 260069 260056 259462 258385 257654 258051 259602 261910 264683 267645 270405 272813 275107
57329 275107 277413 279497 281213 282812 284503 286112 287481 288878 290648 292652 294330 295165 294969 293977 292821
57314 292821 292195 292407 293319 294634 296017 297104 297803 298508 299580 300698 301230 301177 301175 301603 302293 303144 304354 305892
57296 305892 307341 308422 309221 309839 310372 311220 312775 314759 316595 318399 320809 323774 326543 329084 332438
57281 332438 337154 342304 346733 350477 354256 358285 362417 366947 372426 378876 385752 392441 398432 403428
57267 403428 407747 412202 417247 422668 428436 435117 442877 450820 458059 464850 471835 478693 484523 489282
57253 489282 493933 499240 505231 511774 518894 526420 533986 541507 549220 557201 565235 573161 581033 589023
57239 589023 597465 606779 616981 627442 637540 647346 657354 667822 678783 690340 702415 714484
57227 714484 726145 737814 750302 763820 777869 791942 805824 819442 833014 847155 862247
57216 862247 877756 892791 907256 921860 937030 952494 967972 983642 999739 1016267 1033383
57205 1033383 1051603 1071320 1092319 1113944 1135576 1156965 1178322 1200119 1222604 1245558 1268730
57194 1268730 1292337 1316805 1342118 1367779 1393352 1418769 1444175 1469791 1495784 1522007 1548026
57183 1548026 1573820 1600290 1628601 1659013 1690724 1722843 1755116 1787808 1821331 1856038 1891928
57172 1891928 1928410 1964621 2000104 2035073 2070121 2105897 2142918 2181351 2220977 2261553 2303019
57161 2303019 2345161 2387340 2429013 2470290 2511546 2552657 2593111 2632728 2671732 2710107 2747420
57150 2747420 2783285 2817634 2850495 2881867 2911807 2940303 2967201 2992664 3017547 3042849 3068884
57139 3068884 3095486 3122925 3151985 3183153 3216327 3251425 3288593 3327427 3366278 3402605 3433982
57128 3433982 3459064 3478157 3492957 3505344 3516386 3526725 3537376 3549282 3562099 3574488 3586020
57117 3586020 3598246 3613737 3634870 3663885 3703100 3754100 3817051 3891552 3978122 4078586 4195564
57106 4195564 4332517 4494439 4688135 4921888 5205303 5549627 5968260 6477513 7097368
57097 7097368 7850976 8761916 9850724 11133638 12624573 14338213 16291295 18500778
57089 18500778 20979125 23727586 26728806 29940666 33293030 36688039 40003655 43099763
57081 43099763 45826023 48031947 49581889 50377230 50381115 49631928 48232064 46313826 44002255
57072 44002255 41396522 38574438 35606734 32565971 29526061 26557013 23719537 21061099
57064 21061099 18614244 16397469 14417241 12669624 11141969 9815686 8669291 7680198
57056 7680198 6825757 6084824 5439324 4874266 4376692 3935466 3542005 3190278 2875740
57047 2875740 2594607 2343886 2121102 1923595 1748580 1593908 1458088 1339396 1235666
57038 1235666 1145135 1066756 999368 941345 891532 849839 816357 790514 771817 760929 759369
57027 759369 768756 791392 830678 888104 957557 1022978 1063995 1066402 1029004 961792 878498 790343
57015 790343 704362 624472 552554 489033 433482 385073 342597 304682 270494 239971 213016
57004 213016 188885 166856 147112 130258 116156 103967 93274 84491 78082 73958 71780 71435 73116
56991 73116 77278 84408 94448 106582 120068 135178 152697 172525 193262 213026 229982 242189
56979 242189 247963 246994 240709 231263 220429 209348 198666 188585 179231 171134 165023 161096 159045
56966 159045 158832 160928 165708 173165 183306 196139 211204 227906 246510 267846 291318 313716
56954 313716 330654 339069 338308 329621 315303 297884 279311 260723 243014 227196 213944 203206
56942 203206 194684 188438 184698 183441 184609 188537 195760 206475 220530 237911 258972 283888 311534
56929 311534 338656 360420 372575 373462 364105 346868 324624 300603 277552 256364 236204 216386
56917 216386 197544 180743 166265 153828 143330 134731 127665 121757 116993 113266 109947 106440 102911
56904 102911 100085 98528 98406 99550 101401 103195 104509 105455 106291 107418 109813 114638 121996 130754 140084
56889 140084 150512 162921 177240 192737 208833 224623 238104 247020 250504 249278 244476 237044
56877 237044 228057 218742 209972 202177 195735 191050 188393 188104 190751 196630 205301 216103 229065 244932
56863 244932 264599 288957 318919 354724 394879 435848 472645 499910 513577 512777 500205 480137
56851 480137 456088 430478 405577 383468 365092 350341 339297 332692 331038 334124 341743 354484
56839 354484 373471 399666 433640 475825 526667 586232 652928 721942 785066 832964 858602
56828 858602 859452 837632 798696 749708 697043 645020 596136 551963 513380 480407 452768 430778
56816 430778 415203 406287 403514 406519 415792 432321 456771 489088 528434 573082 619955 663952
56804 663952 698026 715200 711891 689701 653864 610043 562589 514871 469781 429377 394429 364669
56792 364669 339476 318510 301980 290336 283599 281229 282790 288381 298257 312511 331369 354979
56780 354979 382009 408742 430321 442939 444656 435027 415163 388044 357611 326999 297831 270877
56768 270877 246613 225108 206101 189382 174732 161693 149983 139998 132203 126079 120382 114485
56756 114485 108787 103826 99704 96452 94180 92603 91034 89178 87431 86193 85330 84545 83841 83368 83075
56741 83075 82749 82264 81743 81556 82017 82901 83511 83486 83221 83126 82926 82253 81506 81411 82022 82926 84212 86326 89084
56722 89084 91705 93861 95886 97896 99514 100631 101653 102829 103962 104961 105999 106997 107621 107939 108470 109419
56706 109419 110479 111497 112664 113897 114709 114915 114867 114811 114665 114589 115103 116311 117571 118213 118157 117709 117252 117252 117970
56687 117970 118969 119441 119128 118436 117675 116863 116314 116586 117647 118759 119466 120003 120539 120761 120509 120199 120243 120590
56669 120590 121102 121768 122311 122216 121470 120722 120481 120689 121284 122468 124208 126111 128065 130313 132661 134376 135255
56652 135255 136048 137385 138904 139898 140200 140005 139449 138838 138772 139572 140974 142652 144547 146464 148017 149190
56636 149190 150257 150896 150222 148130 145741 144004 142675 141239 139995 139439 139259 138762 137792 136459 134511 131825
56620 131825 129127 127415 126874 126951 127156 127187 126659 125463 124171 123457 123267 123134 123036 123327 124010 124662 125045 125334
56602 125334 125806 126597 127635 128563 128965 128879 128787 128873 128762 128318 128152 128837 130018 130815 130832 130353 129868 129855 130645 132001
56582 132001 133096 133362 133148 133152 133534 133991 134447 135173 136383 138052 140004 141972 143797 145725 148194 151262
56566 151262 154614 158220 162410 167244 172451 178195 185205 193872 203914 215019 226850 238009 246156
56553 246156 249969 250327 248946 246716 244083 241931 240887 240368 239422 238053 236700 234942 231934 227823 223641
56538 223641 219929 216534 213586 211564 210282 208769 206436 203674 201172 199198 197603 196048 194271 192517
56524 192517 191558 191775 192473 192596 191804 190294 187946 184498 180381 176543 173444 170955 169149 168414 168681 169186
56508 169186 169205 168634 167787 167035 166573 166174 165242 163476 161393 159812 159036 158830 158935 159151 159176 158897 158668 158876
56490 158876 159397 159829 159972 159778 159212 158565 158485 159214 160220 161024 161808 162693 163055 162372 161220 160620 160789 161261
56472 161261 161833 162572 163268 163758 164438 165688 167140 168303 169433 170806 171673 171144 169824 169257 169837 170465 170399
56455 170399 170240 170812 172042 173274 173916 173543 172160 170577 169893 170372 171326 172084 172511 172700 172873 173529 174895
56438 174895 176297 176839 176651 176686 177325 178052 178508 178917 179338 179452 179305 179455 180085 180711 180991 181086 181036 180492 179395
56419 179395 178289 177641 177425 177537 178088 179034 180052 180942 181718 182220 182169 181736 181556 182092 183356 185168 187152
56402 187152 188576 188837 188187 187497 187380 188027 189633 192255 195342 198144 200561 202889 204886 205887 205851 205474
56386 205474 205236 205076 204996 205220 205732 206393 207441 209092 210712 211356 211172 211285 212187 213177 213612 213725 213918 214135
56368 214135 214333 214799 215642 216679 218114 220552 223845 226621 227497 226452 224731 223726 224091 225531 227289
56353 227289 228992 230885 233016 234727 235606 236356 237742 239070 238980 237559 236333 236070 235951 235299 234812 235476
56337 235476 237295 239758 242759 246395 250521 255027 259984 265115 269697 273350 276432 279417 282464 285688
56323 285688 289087 291954 293171 292439 290663 288902 287545 286531 285569 284013 281481 278863 277774 278593 279881
56308 279881 280196 279681 279453 280227 282094 285009 288823 293215 297980 302972 307691 311442 314140 316391 318659
56293 318659 321000 323718 327420 332118 336944 341124 344699 348140 351848 356182 361311 366879 372389 377979
56279 377979 384150 390770 397135 403072 409129 415653 422554 430030 438572 448147 458312 469213 481462
56266 481462 494936 508850 523282 539443 558077 578685 600790 624944 651920 681774 714308
56255 714308 749820 789087 833215 883638 941420 1006366 1077485 1154414 1237544 1326927 1422094
56244 1422094 1522850 1628954 1738903 1850277 1961327 2070852 2176410 2274128 2360594 2433531
56234 2433531 2490494 2528784 2547426 2547778 2531486 2499139 2451496 2390544 2318556 2237369 2149259 2057123
56222 2057123 1962991 1867547 1771689 1677234 1585501 1496791 1411981 1332999 1260676 1193639 1130434
56211 1130434 1071352 1017102 967152 920748 878264 840137 805487 773202 743536 717358 694562
56200 694562 674270 655915 639131 623402 608737 595957 585538 576976 569919 564760 561324 558171
56188 558171 554250 550186 547009 544680 542803 541630 541253 540806 539534 537776 536026 534109 532118 530985 531094
56173 531094 531485 531422 531573 532688 534311 535871 537831 540627 543709 546775 550737 556288 562674 569026 575691
56158 575691 583126 590747 598144 606175 615708 626457 638250 652015 668268 686059 704785 725654
56146 725654 750045 778027 810021 848294 894880 949361 1010582 1079317 1157327 1244780 1340158
56135 1340158 1441273 1544285 1642915 1731088 1806294 1869379 1922428 1968445 2011430 2054002 2095054
56124 2095054 2131168 2159545 2178370 2186034 2182479 2170600 2154309 2135498 2113849 2087951 2054687 2009052
56112 2009052 1947305 1870117 1781314 1684804 1584481 1485517 1392890 1308994 1234419 1170088 1116594
56101 1116594 1072474 1035368 1004330 979292 959284 943120 930776 922183 915760 910135 906038 904476
56089 904476 904336 904019 904074 905857 908998 912659 917813 925498 934143 941518 948201 956134 964920 972729 979896
56074 979896 988364 998181 1007809 1017431 1028775 1041947 1055437 1068995 1083579 1098712 1112786 1125909
56062 1125909 1139811 1155036 1170704 1186710 1203688 1221142 1238044 1254884 1272800 1291239 1308736
56051 1308736 1325201 1341220 1356218 1369769 1383537 1399175 1415550 1430787 1445643 1461931 1479144
56040 1479144 1495924 1513285 1532886 1553515 1573066 1592701 1615343 1641427 1669930 1702113 1739927
56029 1739927 1781923 1825035 1869241 1916183 1964486 2011163 2056613 2103482 2151599 2198927 2246486
56018 2246486 2297107 2350122 2402580 2455151 2511459 2572123 2634798 2699654 2769240 2843228 2918929
56007 2918929 2996844 3080217 3169197 3260961 3355350 3454857 3559478 3667396 3780289 3902015
55997 3902015 4032486 4168874 4312152 4466015 4630156 4801500 4981370 5174315 5380641
55988 5380641 5597690 5827820 6077103 6346734 6634022 6941256 7274854 7636308 8023282
55979 8023282 8439411 8893514 9389574 9927432 10512891 11156721 11864582 12639451 13493409
55970 13493409 14445231 15507859 16692309 18023882 19541153 21281760 23287978 25629314
55962 25629314 28405550 31728831 35717940 40502979 46210596 52947840 60831507 70042442
55954 70042442 80840576 93552742 108597198 126515944 147922826 173382554 203270463
55947 203270463 237444551 274515192 311066958 341813859 361257133 366018830 356178752
55940 356178752 334742750 305945251 273730040 241075921 209949079 181469575 156129915
55933 156129915 134025916 115026832 98860300 85175967 73620249 63878688 55669240
55926 55669240 48734795 42858629 37868975 33619021 29976495 26835730 24120756 21767697
55918 21767697 19715462 17915991 16337729 14952249 13728129 12641044 11677299 10822621
55910 10822621 10057666 9367921 8747563 8189675 7682141 7216556 6791962 6406085 6051094
55901 6051094 5721135 5416096 5134861 4872385 4626242 4398780 4190043 3995351 3812299
55892 3812299 3643289 3488668 3344008 3206732 3079087 2962009 2852180 2747750 2651212 2564018
55882 2564018 2483685 2408468 2339398 2275249 2210737 2142397 2071890 2001543 1931254 1861557 1794776
55871 1794776 1730937 1666982 1602136 1539770 1482133 1427623 1375165 1326896 1284350 1246040 1210809
55860 1210809 1179691 1152586 1127020 1102057 1079629 1060155 1040691 1019316 997598 976725 954960
55849 954960 931053 906674 883259 859679 835095 811007 788428 766028 743018 721043 701382
55838 701382 683150 665924 651205 639457 628644 617541 607721 600386 594035 587221 580956 576345 572272
55825 572272 567400 562234 557341 551639 544204 535807 527202 517876 507834 498497 490505 482801 475004 468436
55811 468436 463655 459442 455443 453166 452955 452707 451322 450782 452952 456779 460689 465470 472473 480860 488755
55796 488755 495533 501127 504647 505513 504580 502569 498850 493121 486644 480387 473667 466083 459004 453406 447809
55781 447809 440000 429492 416971 402923 388304 374999 363999 354397 345450 338135 333340 330172 327540
55768 327540 325858 325610 325800 325463 325325 326254 327367 327336 326472 325879 325581 325003 324322 323845 323015 321359 319578 318278
55750 318278 316430 312244 304886 294508 281611 267429 253956 242580 233392 226217 221007 216707 211531
55737 211531 205344 200147 197118 194858 191777 188497 186347 185047 183553 181945 180883 180281 179886 180051 180527
55722 180527 179706 176596 172461 169077 166432 163548 160388 157445 154498 151374 149013 148222 148289 148274 148742 150651
55706 150651 153355 155347 156323 157059 157840 158384 158688 158720 157914 156192 154719 154433 154604 154064 153008 152264 151709
55689 151709 150863 150281 150834 152186 153438 154712 156775 159548 162279 164669 166770 168469 170153 173019 177416
55674 177416 181717 184241 185441 186705 187834 187553 185892 184148 182784 181242 179826 179986 182416 186234 190350
55659 190350 194506 198759 202930 206844 210388 213249 215179 216413 217251 217444 216604 214871 212644 210085 207379
55644 207379 204850 202140 198071 192143 185476 179442 174081 168775 163639 159120 154888 150364 145885 142267
55630 142267 139615 137476 135638 133873 131601 128785 126567 125920 126305 126650 126930 127580 128088 127533 126031 124409
55614 124409 122909 121338 119918 118814 117403 115271 113304 112484 112248 111467 110442 110232 110474 109673 107556 105476
55598 105476 104434 104153 104164 104364 104352 103568 102328 101570 101437 101131 100241 99166 98190 97206 96414 96280 96762 97485
55580 97485 98585 100429 102613 104293 105455 106839 108694 110640 112682 115255 118279 121190 123918 126868
55566 126868 129997 132835 135277 137363 138409 137520 134930 131805 128758 125610 122540 120251 118906 117964 117196
55551 117196 116921 117140 117427 117675 118060 118271 117782 116868 116339 116292 116138 115803 115822 116200 116335 116187 116455 117430 118651
55532 118651 119822 121052 122124 122538 122377 122101 121421 119536 116583 113725 111500 109286 106701 104414 103016
55517 103016 102059 100787 99054 97066 94895 92647 90490 88315 85976 83991 83224 83744 84735 85660 86602 87360
55501 87360 87216 86022 84660 83942 83709 83351 82647 81783 81065 80869 81350 82070 82399 82304 82261 82470 82786 83279 84079
55482 84079 84766 84755 84269 84071 84298 84422 84327 84474 84984 85556 86307 87662 89242 89935 89238 87619 85482 82874
55464 82874 80379 79038 78961 79092 78778 78516 78694 78618 77516 75650 73855 72684 72486 73562 75571 77407 78215
55447 78215 78111 77622 77046 76688 76988 77931 78824 79062 78698 78083 77489 77197 77316 77396 76867 75930 75316 75143 74913
55428 74913 74691 75286 76944 78810 80018 80489 80411 79888 79362 79428 79919 80092 79926 80152 80715 80551 79392 78457
55410 78457 78602 79044 78872 78618 79179 80064 80010 78722 76893 75029 73351 72373 72444 72928 72805 71952 71076 70650
55392 70650 70729 71548 73361 75678 77437 78110 78142 78259 78762 79488 80076 80238 79981 79544 79057 78480 77964 77890 78365
55373 78365 79028 79559 79986 80339 80466 80432 80637 81233 81831 82054 81995 81828 81413 80569 79418 78228 77242 76765 76973
55354 76973 77591 78185 78825 79847 80988 81507 81255 80800 80315 79328 77859 76867 76977 77604 77917 77930 78041 78174
55336 78174 77986 77355 76198 74457 72740 72188 73086 74331 74910 75130 75691 76347 76446 76156 76102 76165 75680 74595
55318 74595 73588 73131 73194 73745 74868 76378 77876 79120 80017 80441 80398 80130 79748 79124 78436 78309 78994 79876
55300 79876 80296 80367 80490 80563 80280 79787 79451 79394 79737 80819 82515 83768 83529 81983 80307 79448 79608 80530
55282 80530 81759 82899 83948 85072 85860 85500 84104 83015 83118 83695 83755 83703 84532 85954 86610 85937 84685
55265 84685 83683 83083 82819 82879 83034 83010 82961 83177 83496 83640 83884 84568 85176 84821 83566 82349 81638 81096 80655
55246 80655 80874 81920 83096 83762 84019 84055 83538 82197 80555 79476 79225 79459 79972 80942 82360 83561 83677
55229 83677 82647 81548 81600 82862 84219 84717 84436 83954 83443 82697 81650 80436 79258 78503 78611 79407 79990
55212 79990 79768 79303 79554 80609 81740 82466 82913 83230 83265 82887 82256 81710 81575 81929 82399 82480 82229 82247 82741
55193 82741 83141 83035 82872 83185 83646 83590 83088 82810 83100 83798 84672 85437 85635 85118 84384 83896 83475 82903 82604
55174 82604 82958 83451 83390 83101 83430 84339 85021 85273 85774 86965 88510 89891 90717 90528 89162 87345 86102
55157 86102 85523 84867 83917 83336 83597 84428 85534 87072 89103 91289 93368 95336 96938 97589 97109 95999
55141 95999 94787 93564 92346 91401 91000 91161 91703 92232 92224 91614 91150 91599 92667 93352 93215 92573 91540 89868
55123 89868 87899 86763 87138 88465 89768 90696 91428 92027 92300 92024 91085 89664 88374 87859 88180 88845 89395
55106 89395 89644 89548 89357 89707 90850 91946 91889 90857 90195 90649 91554 92012 92035 92156 92622 93454 94704 96137
55088 96137 97118 97319 97236 97586 98444 99299 99751 99787 99500 98852 97783 96539 95775 96017 96906 97313 96608 95464 95003
55069 95003 95464 96233 96870 97441 98069 98816 99795 100769 100958 100028 98953 98925 99655 99801 98938 97931 97337 96730 95833
55050 95833 95097 94732 94298 93751 93849 94880 95917 96031 95469 94990 94732 94415 94047 93767 93440 92969 92577 92427 92403
55031 92403 92600 93408 94781 96047 96766 97138 97284 96888 95978 95168 94651 93860 92698 92161 92914 94087 94456 94136
55013 94136 94103 94542 94754 94409 93931 93759 93979 94588 95419 95967 95891 95547 95525 95899 96384 96894 97386 97584 97442 97554
54993 97554 98444 99848 101282 102887 104909 106773 107606 107460 107084 106663 105762 104482 103645 103640 103964 104181 104559 105372
54975 105372 106238 106676 106852 107280 107995 108442 108135 107229 106441 106415 107154 108113 108903 109657 110579 111455 111932 112070 112230
54956 112230 112601 113200 114107 115231 116008 115913 115269 114992 115334 115358 113983 111313 108666 107382 107763 109104 110515
54939 110515 111546 112099 112111 111625 111020 110746 110826 110984 111230 111923 113206 114863 116845 119324 122122 124733 127247
54922 127247 130570 135287 140843 146339 151554 156584 161124 164843 168029 171009 173177 173406 171306 167419
54908 167419 162426 156916 151723 147531 144040 140255 135747 131040 126777 123198 120496 118925 118254 117766 117088
54893 117088 116585 116656 117149 117725 118345 119068 119702 120052 120340 121122 122848 125562 128842 132083 135071 138276 142321
54876 142321 147162 152119 156621 160616 164242 167543 170508 172920 174077 173207 170392 166647 162838 158871
54862 158871 154250 149014 143686 138575 133623 128866 124613 121137 118473 116570 115409 114848 114529 114039 113117
54847 113117 111737 110090 108590 107707 107594 107873 107918 107425 106553 105533 104371 103128 102266 102357 103462 105058 106567
54830 106567 107702 108336 108400 108047 107589 107207 106895 106709 106694 106528 105666 104066 102395 101363 101157 101663 102725 103938
54812 103938 104647 104584 104148 103721 103162 102413 102143 103091 104958 106601 107283 107263 107205 107482 108051 108635 108978 109199 109836
54793 109836 111305 113443 115720 117660 118811 118787 117813 116892 116840 117365 117617 117348 116885 116270 115296 114303 114073 114784
54775 114784 115883 117210 119412 122861 126832 130314 133240 136440 140669 146103 152467 159251 165858 171920
54761 171920 177391 182168 185769 187578 187299 185029 181089 175987 170409 164956 159808 154716 149411 144073
54747 144073 139425 136230 134538 133523 132290 130765 129605 129253 129417 129512 129322 129003 128621 127958 126839 125579
54731 125579 124978 125745 127824 130380 132506 133933 135148 136996 140153 144643 149790 154836 159710 164863 170280
54716 170280 175095 178394 179939 179811 177808 173735 168039 161665 155503 150248 146362 143627 141113 138221
54702 138221 135515 133838 132931 131793 130208 128971 128462 127959 126706 124895 123170 121778 120672 119953 119667
54687 119667 119465 118909 118053 117382 117248 117495 117584 117061 116093 115463 115809 116890 117836 118055 117573 116701 115835 115467 115824
54668 115824 116414 116501 116072 115792 115947 116088 115860 115508 115255 114832 114056 113333 113118 113248 113266 113048 112685 112095 111231
54649 111231 110442 110131 110185 110171 109979 109958 110512 111855 113972 116448 118392 118954 118034 116363 114936 114457 115130 116618
54631 116618 118166 119030 118960 118282 117499 116805 115992 114822 113474 112482 112160 112232 112266 112251 112465 112921 113347 113645 113913
54612 113913 113989 113472 112325 111036 110033 109402 109301 110126 111872 113731 114804 115049 115200 115891 117171 118669
54596 118669 119919 120576 120556 120024 119180 118155 117099 116113 115053 113696 112219 111205 111030 111528 112395 113558
54580 113558 114869 115825 115987 115500 114822 114099 113183 112169 111503 111517 112097 112861 113493 113922 114366 115183 116446 117646
54562 117646 117976 117094 115563 114459 114495 115561 117050 118500 119740 120622 121055 121382 122208 123488 124213 123603 122306
54545 122306 121716 122242 123055 123593 124404 126098 128237 129903 130903 131740 132639 133234 133182 132532 131452 130031 128530
54528 128530 127517 127423 128000 128427 128069 127100 126159 125441 124472 122970 121548 121075 121580 122321 122768 122973 123014 122802
54510 122802 122551 122777 123617 124657 125608 126550 127296 127173 125896 124076 122495 121366 120690 120714 121433 122140 122173 121811
54492 121811 121849 122519 123421 124288 125162 125926 126317 126432 126699 127254 127725 127741 127352 126871 126562 126508 126632 126834 127241 128178
54472 128178 129775 131710 133490 134836 135712 136205 136525 136884 137297 137738 138469 139743 141056 141393 140516 139407
54456 139407 138989 139007 138776 138395 138389 138536 138042 136801 135646 135270 135542 135968 136228 136144 135648 134925 134246 133631 132948
54437 132948 132218 131460 130434 129111 128259 128872 130944 133319 134873 135417 135509 135922 137265 139479 141608 142616
54421 142616 142564 142457 142915 143656 144377 145273 146315 146753 146016 144604 143478 142862 142234 141280 140338 139965 140491 141894
54403 141894 143688 144983 145154 144510 144046 144434 145429 146259 146369 145770 144917 144386 144510 145171 145960 146561 146996 147474
54385 147474 148068 148543 148457 147447 145514 143154 141219 140450 140931 142001 142838 143150 143211 143280 143310 143330 143740 144883
54367 144883 146467 147744 148267 148229 148099 148189 148630 149469 150599 151711 152539 153224 154357 156530 159722 163189 166105
54350 166105 168303 170178 171914 173123 173420 173036 172567 172246 171709 170422 168206 165458 162972 161343 160421 159526
54334 159526 158329 157270 156905 157116 157215 156659 155411 153859 152613 152143 152295 152362 151859 150978 149986 148635 146646
54317 146646 144488 143050 142625 142715 142740 142495 142074 141820 142224 143269 144016 143548 142274 141560 141996 142776 143051 143073
54299 143073 143527 144370 145009 145268 145517 145907 146010 145349 144007 142591 141681 141328 141084 140594 140045 139891 140182 140492
54281 140492 140570 140730 141369 142301 142865 142643 141955 141568 141969 142980 144152 145406 146991 148765 150021 150278 149953
54264 149953 149788 149936 150090 150278 150901 152051 153321 154314 154843 154691 153755 152511 151787 151922 152560 153287 153931 154249
54246 154249 154034 153721 154201 155677 157202 157678 156886 155329 153629 152337 151712 151273 150135 148273 146883 146917
54230 146917 147752 148022 147370 146663 146677 147368 148429 149739 151100 152091 152487 152520 152523 152517 152310 151849 151397 151450 152325 153712
54210 153712 154714 154584 153408 151938 150848 150305 150051 149702 149080 148441 148216 148375 148323 147730 147118 147181 147788 148240
54192 148240 148395 148829 149790 150641 150694 150058 149258 148447 147512 146719 146576 147024 147321 146950 146269 145977 146237 146686 147126
54173 147126 147695 148361 148758 148727 148639 148829 149016 148702 148000 147565 147677 147822 147312 146052 144592 143651 143657 144462 145365
54154 145365 145655 145267 144725 144427 144263 144034 143862 143945 144182 144323 144344 144416 144620 144861 144978 144780 144160 143342 142892 143255
54134 143255 144345 145702 146962 148014 148832 149357 149543 149434 149252 149403 150178 151403 152547 153303 153877 154612 155562
54117 155562 156604 157715 158884 159927 160620 160957 161073 161020 160824 160646 160693 160968 161251 161333 161217 161189 161666 162789
54099 162789 164093 164868 164961 164966 165371 165810 165552 164558 163590 163246 163271 162978 162102 161047 160459 160745 161990 164091 166777
54080 166777 169559 171890 173563 174890 176322 177974 179686 181469 183590 186242 189457 193395 198426 204702
54066 204702 211752 218548 223871 226758 227029 225439 222978 219898 215799 210706 205524 201161 197676 194709
54052 194709 192333 190925 190463 190552 191064 192234 194083 196202 198169 199923 201708 203937 207124 211564 216946
54037 216946 222515 227799 233079 239010 245839 252999 259461 264503 268207 271289 274505 278221 282290 286090
54023 286090 288862 290476 291863 294167 297297 299785 300299 298900 296517 293761 290773 287781 285015 282090
54009 282090 278151 272842 266811 261188 256744 253456 250626 247412 243552 239572 236190 233696 232047 231240
53995 231240 231191 231537 232054 233080 235022 237536 239716 241040 241615 241535 240610 238863 236685 234236 231154 227180
53979 227180 222712 218358 214236 210062 205835 202071 199290 197401 195715 193611 191227 189385 188714 189026 189723
53964 189723 190621 191928 193515 194730 195138 195060 195156 195710 196560 197528 198648 200086 201994 204430 207317 210461
53948 210461 213641 216608 219093 221025 222774 225007 228193 232277 236835 241430 245859 250213 254691 259317
53934 259317 263910 268450 273246 278538 284024 289124 293711 298291 303497 309748 317391 326730 337682 349728
53920 349728 362594 376834 393296 411690 429750 444158 452678 455551 454768 452119 448275 443630 439194
53907 439194 436012 434010 432115 429475 426066 422121 417666 412859 408316 404630 401704 398789 395153 390602
53893 390602 385454 380022 374132 367334 359613 351595 343813 336092 328122 320283 313256 306990 300833 294681
53879 294681 289175 284520 279959 274913 269949 265982 262941 259927 256435 252788 249362 246035 242583 239247
53865 239247 236607 234858 233338 230992 227537 223989 221651 220580 219545 217586 215052 212784 210955 209290
53851 209290 207985 207588 208032 208432 207968 206604 204915 203595 203141 203558 204272 204613 204487 204309 204330 204375 204295 204224 204217
53832 204217 204011 203502 203232 203968 205734 207559 208314 207712 206411 205212 204349 203592 202871 202508 202815 203700 204913
53815 204913 206521 208816 211729 214555 216546 217703 218869 220923 223949 227280 230366 233449 237290 242317
53801 242317 248270 254590 260919 267112 273047 278608 283712 288194 291775 294331 296151 297740 299423 301190
53787 301190 302855 304197 305020 305235 304906 304082 302596 300158 296676 292392 287682 282804 277928 273275 269081
53772 269081 265324 261655 257789 253949 250702 248221 245964 243280 240136 236948 233846 230573 227077 223749
53758 223749 220927 218576 216652 215351 214670 214048 212849 211041 209033 207029 204938 202849 201217 200502 200786
53743 200786 201735 202823 203656 204341 205332 206755 208048 208629 208704 208979 209654 210213 210256 210029 209962 210131 210419 210875 211617
53724 211617 212605 213793 215290 217163 219241 221303 223259 224970 226138 226627 226688 226594 226354 226114 226570 228379
53708 228379 231239 234129 236493 238668 241006 243212 244890 246254 247756 249380 250871 252511 255018 258592
53694 258592 262563 266139 269151 271862 274422 276755 278705 280002 280254 279367 277911 276763 276255 275896 275044
53679 275044 273741 272730 272698 273611 274859 275860 276374 276327 275708 274817 274307 274610 275384 275819 275472 274533 273350 272099
53661 272099 271000 270435 270586 271173 271718 271845 271280 269972 268479 267807 268409 269552 270088 269685 268913 268285 267818
53644 267818 267539 267858 269078 270847 272434 273473 274246 275226 276501 277702 278483 278965 279597 280643 282001 283491
53628 283491 285086 286790 288611 290725 293337 296201 298672 300558 302534 305311 308716 312048 315090 318169
53614 318169 321434 324675 327861 331268 335019 338960 343023 347284 351661 356037 360677 366016 371909 377656
53600 377656 382858 387784 392779 397814 402700 407150 410505 412045 411869 410860 409449 407042 403153 398480
53586 398480 394211 390632 387109 383229 379316 375918 373286 371384 370004 368834 367634 366329 364816 362901
53572 362901 360680 358645 357101 355720 354022 352041 350136 348392 346760 345610 345543 346576 348012 349192 350055
53557 350055 350860 351766 352802 353951 355088 356012 356646 357102 357515 357975 358599 359500 360692 362140 363905 366097
53541 366097 368753 371904 375632 379848 384123 388000 391519 395237 399723 405166 411450 418465 426318 435260
53527 435260 445287 455768 465814 475233 484884 495727 507729 520090 532373 544868 557912 571494
53515 571494 585772 601442 619104 638457 658536 678706 699148 720382 742598 765519 788716
53504 788716 811888 834900 857735 880431 902912 924824 945747 965760 985651 1006244 1027525
53493 1027525 1048721 1069245 1089196 1108867 1128225 1147180 1165921 1184554 1202634 1219636 1235782
53482 1235782 1251899 1268418 1284997 1301290 1317570 1334211 1350820 1366295 1379688 1390755 1399655
53471 1399655 1406471 1411115 1413436 1413168 1409964 1403847 1395614 1386365 1376445 1365217 1352185 1338042 1324070
53458 1324070 1310657 1296993 1282252 1266446 1249886 1232368 1213482 1193529 1173616 1154754 1137001
53447 1137001 1119551 1101549 1082893 1064240 1046277 1029148 1012821 997721 984494 973213 963393
53436 963393 954843 947915 942724 938712 935326 932639 931001 930592 931619 934408 938808 943999 949381 955240
53422 955240 962051 969678 977913 987405 999194 1013516 1029717 1047225 1066004 1086170 1107810 1131078
53410 1131078 1155925 1181861 1208543 1236431 1266225 1297855 1330687 1364641 1400320 1438129 1478071
53399 1478071 1520400 1565548 1613149 1661936 1711046 1760798 1811866 1864219 1917250 1970455 2023624
53388 2023624 2076776 2130195 2184092 2237855 2289942 2338974 2384787 2428231 2470120 2510517 2548754
53377 2548754 2583905 2615342 2642961 2666861 2686951 2703082 2715290 2723476 2727011 2725137 2717584 2704189
53365 2704189 2684123 2656418 2621398 2580846 2536555 2489452 2440323 2390385 2340501 2290446 2239648
53354 2239648 2188297 2137268 2087371 2039221 1993455 1950459 1909918 1870922 1832363 1793157 1752606
53343 1752606 1710962 1669330 1628704 1589421 1551659 1515817 1482028 1449873 1419165 1390445 1364187
53332 1364187 1340051 1317689 1297740 1281038 1267024 1253888 1240318 1226303 1212190 1197828 1182982
53321 1182982 1167891 1152951 1138274 1123974 1110582 1098777 1088776 1080259 1072900 1066784 1062253 1059351
53309 1059351 1057574 1056383 1055955 1057092 1060205 1064730 1069874 1075674 1082902 1092070 1103017 1115456 1129490
53296 1129490 1145437 1163395 1183136 1204316 1226790 1250726 1276288 1303130 1330421 1357496 1384100
53285 1384100 1409736 1433296 1453992 1472477 1490325 1508283 1525536 1540713 1553054 1562400 1568637 1571623
53273 1571623 1571464 1568530 1563274 1556081 1547035 1535678 1521322 1503833 1483931 1462527 1439951 1416109
53261 1416109 1391101 1365239 1338522 1310602 1281460 1251782 1222396 1193571 1165210 1137617 1111617
53250 1111617 1087715 1065415 1043587 1021372 998608 975544 952442 929356 906074 882236 857736
53239 857736 832992 808738 785631 764163 744681 727139 711013 695894 682097 670200 660027
53228 660027 650595 641141 631690 622538 613728 605232 597050 588749 579389 568311 555669 541947 527421
53215 527421 512465 497858 484195 471290 458691 446494 435137 424650 414726 405367 396881 389308
53203 389308 382372 375986 370291 365160 360058 354480 348272 341589 334782 328218 321892 315418 308713 302451
53189 302451 297319 293040 288737 284220 280281 277620 276007 274698 273214 271524 269803 268270 267078 266202
53175 266202 265502 264830 263995 262764 261156 259510 258018 256472 254832 253701 253656 254317 254714 254487 254043 253592 252757
53158 252757 251277 249408 247407 245213 242888 240871 239566 239079 239461 240634 241910 242239 241280 239743 238378
53143 238378 237209 236076 235337 235469 236340 237354 238067 238310 238102 237809 238029 238921 239996 240953 242239 244227 246300
53126 246300 247545 248126 249157 251173 253434 254922 255448 255555 255764 256173 256549 256560 256052 255191 254244 253263 252091
53109 252091 250651 249006 247244 245508 244093 243214 242684 242048 241026 239690 238315 237309 237090 237653 238324 238334
53093 238334 237706 237180 237198 237400 237243 236714 236140 235614 234953 234022 232812 231349 229868 228923 228966 229776 230694 231447
53075 231447 232447 234085 236042 237548 238215 238318 238325 238475 238826 239360 239801 239580 238350 236540 235061 234355 233948
53058 233948 233080 231599 230109 229324 229492 230368 231551 232724 233701 234352 234598 234498 234308 234355 234801 235600 236643
53041 236643 237797 238731 238938 238164 236750 235325 234176 233162 232225 231666 231683 231900 231688 230934 230154 229864 230099
53024 230099 230651 231435 232355 233102 233456 233691 234261 235094 235613 235603 235661 236516 238144 239833 240979 241507 241609 241419
53006 241419 241004 240480 240031 239862 240058 240432 240633 240542 240406 240463 240578 240479 240136 239708 239264 238920 239042 239863 240925
52987 240925 241411 241101 240594 240432 240494 240478 240532 241008 241884 242937 244295 246322 248964 251651 254049 256504 259485
52970 259485 262793 265696 267747 269140 270184 270784 270770 270539 270913 272201 273682 274251 273443 271668 269584 267483
52954 267483 265227 262572 259559 256659 254388 252666 250808 248428 246119 244796 244446 243985 242480 240131 237916
52939 237916 236538 235895 235384 234525 233437 232772 233050 234010 234789 234782 234183 233680 233770 234342 234687 234017 232274 230431
52921 230431 229622 229949 230554 230831 231045 231607 232384 233088 233871 234960 236028 236501 236317 235915 235543 235068 234419 233770
52903 233770 233270 232946 232928 233358 233976 234230 233965 233690 233889 234356 234457 233953 233213 232691 232517 232691 233418 234958 237190
52884 237190 239530 241297 242108 241941 241027 239775 238621 237796 237303 237188 237640 238645 239784 240656 241423 242547
52868 242547 244045 245418 246401 247415 249000 251075 253008 254292 254965 255408 255873 256240 256204 255698 254969 254152 253004
52851 253004 251329 249466 247903 246533 244814 242636 240368 237959 234763 230685 226870 224589 223850 223659 223350
52836 223350 222994 222655 222040 220998 219804 218800 218157 218124 219060 220876 222718 223591 223334 222741 222702 223294 223804 223577
52818 223577 222650 221483 220356 219360 218833 219286 220702 222343 223520 224248 224931 225740 226636 227676 228879 229958
52802 229958 230485 230233 229148 227247 224823 222454 220431 218480 216411 214679 213753 213276 212597 211921 212049 212910
52786 212910 213297 212433 211139 210904 212211 214191 215644 216009 215563 215147 215597 217133 219242 221239 222809 223990
52770 223990 224904 225736 226759 228066 229320 229965 229685 228586 227038 225451 224118 223120 222373 221830 221560 221596 221833
52753 221833 222153 222562 223144 223956 224983 226055 226779 226779 226141 225518 225617 226638 228239 229989 231668 233221 234631
52736 234631 235897 237092 238295 239512 240724 242003 243473 245076 246563 247884 249410 251389 253228 253754
52722 253754 252425 249958 247524 245634 244108 242752 241577 240477 239231 237853 236589 235576 234813 234362 234221
52707 234221 234064 233518 232690 232011 231625 231405 231509 232285 233411 233855 233132 232124 232164 233567 235523 237155 238212
52690 238212 238871 239317 239597 239578 239106 238356 237911 238137 238610 238560 237873 237248 237233 237490 237275 236371 235232 234334 233698
52671 233698 233092 232433 231870 231591 231671 232040 232537 233072 233798 234990 236592 238012 238613 238403 238045 238219 239242 241235
52653 241235 244181 247591 250524 252263 252748 252178 250589 248230 245913 244390 243503 242569 241500 240940 241270 242087
52637 242087 242844 243444 243949 244251 244376 244699 245481 246440 247193 247967 249536 252495 256710 261311 265031 266764 266143
52620 266143 263660 260244 256788 253953 252019 250762 249734 248767 248008 247427 246726 245886 245373 245436 245516 244832 243391
52603 243391 242030 241487 241734 242233 242579 242805 243220 244026 245093 246189 247355 248836 250616 252310 253641 254765
52587 254765 255896 256886 257399 257356 257004 256692 256761 257464 258784 260434 262137 263738 264952 265296 264518 262833 260667
52570 260667 258452 256847 256637 257898 259516 260069 259101 257222 255155 253185 251477 250321 249889 250000 250241 250177
52554 250177 249565 248593 247847 247714 247863 247568 246509 245053 243835 243308 243521 244011 244072 243481 242840 242851 243389 243793
52536 243793 243918 244274 245096 245912 246269 246430 247016 248304 250074 251892 253301 253985 253987 253637 253218 252880 252839 253254
52518 253254 253851 254115 254076 254515 256112 258672 261463 264028 266409 268891 271828 275470 279586 283395 286138
52503 286138 287537 287484 285663 282038 277520 273551 270917 269333 268173 267152 266173 265021 263566 262034 260793
52488 260793 259965 259431 259042 258655 258110 257432 256992 257173 257900 258738 259556 260748 262587 264544 265697 265822 265717
52471 265717 266232 267335 268460 269470 270728 272277 273643 274687 276156 278838 282435 285742 287886 288910
52457 288910 289202 288825 287586 285456 282705 279775 277102 274810 272540 269802 266653 263768 261681 260227 258942
52442 258942 257743 256883 256434 256177 255948 255700 255262 254402 253200 252038 251137 250413 249846 249691 250098 250874 251795 252932
52424 252932 254393 256009 257549 259039 260563 261912 262833 263508 264403 265637 266910 268088 269465 271367 273853
52409 273853 277086 281679 288305 296989 306990 317448 328041 338884 349638 358764 364067 364361 360496
52396 360496 354443 347492 339761 331264 322678 314796 307859 301869 297161 294107 292502 291714 291363 291504 292234
52381 292234 293493 295144 296939 298466 299451 300112 300993 302491 304687 307497 310756 314294 318191 322743 327890
52366 327890 332842 336698 339304 341074 342111 342029 340706 338717 336870 335611 334986 334798 334700 334442 334196 334382
52350 334382 335127 336161 337302 338642 340201 341818 343581 345930 349074 352680 356404 360426 365088 370255
52336 370255 375425 380316 385033 389773 394719 400217 406723 414552 423777 434385 446406 459973 475327
52323 475327 492586 511347 530677 549716 568228 586437 604481 622282 639816 657210 674544
52312 674544 691742 708724 725566 742506 759770 777325 794786 811764 828335 844914 861501
52301 861501 877354 891673 904460 916396 928029 939277 949577 958141 964174 967234 967444 965214 960921
52288 960921 955077 948553 942066 935483 928189 920234 912598 906127 900656 895570 890836 887135 885184 885289
52274 885289 887352 890879 895121 899590 904523 910609 918292 927509 937981 949411 961356 973323 985176
52261 985176 997277 1010029 1023394 1036978 1050540 1064264 1078522 1093403 1108532 1123377 1137686
52250 1137686 1151460 1164425 1175727 1184383 1189981 1192728 1192894 1190516 1185769 1179318 1172122 1164924 1157973
52237 1157973 1151021 1143526 1135071 1125796 1116347 1107266 1098570 1090011 1081579 1073509 1065994 1059134 1053069 1047832
52223 1047832 1043097 1038414 1033802 1029871 1027220 1025808 1025028 1024277 1023461 1023085 1023944 1026578 1030934 1036556 1043043
52208 1043043 1050183 1057779 1065585 1073470 1081310 1088670 1094894 1099700 1103522 1107164 1111303 1116421 1122779 1130115
52194 1130115 1137571 1144360 1150465 1156455 1162690 1168967 1174812 1179738 1183219 1184855 1184743 1183373 1180999 1177345
52180 1177345 1172106 1165505 1158053 1149918 1140840 1130715 1119983 1109350 1099366 1090465 1083222 1078167 1075166
52167 1075166 1073260 1071402 1069345 1067677 1067095 1067868 1069877 1072766 1075953 1078861 1081321 1083502 1085280 1086100 1085718
52152 1085718 1084716 1083851 1083136 1082083 1080698 1079640 1079371 1079639 1079933 1080030 1079922 1079617 1079241 1079012 1078860 1078264 1076727
52135 1076727 1074323 1071644 1069466 1068580 1069681 1073068 1078506 1085618 1094483 1105762 1120190 1137935 1158316
52122 1158316 1180137 1202439 1225063 1248511 1273334 1299651 1327089 1354866 1381968 1407568 1431434
52111 1431434 1453818 1475001 1495095 1514085 1531675 1547163 1560085 1571130 1581883 1593272 1604647
52100 1604647 1614669 1622753 1629208 1634315 1637835 1639344 1638605 1635592 1630441 1623274 1613814 1601363 1585586
52087 1585586 1567246 1547795 1528288 1509129 1490764 1474087 1459933 1448551 1439700 1432957 1427807 1423826
52075 1423826 1421134 1420431 1422355 1426868 1433394 1441348 1450394 1460484 1471884 1484908 1499306 1514075 1528273
52062 1528273 1541957 1555948 1570587 1585140 1598583 1610669 1621933 1632871 1643420 1653149 1661532 1667948
52050 1667948 1671744 1672563 1670528 1665973 1659100 1649973 1638654 1625124 1609296 1591449 1572584 1553933 1535997
52037 1535997 1518358 1500519 1482593 1465004 1447882 1431173 1415079 1399953 1385731 1371882 1358015
52026 1358015 1344265 1330963 1318145 1305590 1293171 1280976 1269102 1257511 1246157 1235164 1224801
52015 1224801 1215278 1206593 1198540 1190807 1183010 1174716 1165543 1155275 1143850 1131323 1117916 1103937 1089391
52002 1089391 1073683 1055997 1036103 1014664 992683 970920 949866 929946 911420 894296 878595
51991 878595 864490 851850 839754 826913 812728 797732 782902 768723 754955 741107 726985
51980 726985 712805 698813 684853 670434 655338 640042 625387 611954 599991 589790 581736 575908
51968 575908 571961 569608 568990 570415 573850 578879 585028 591912 599068 605882 611770 616307 619117 619741 617819
51953 617819 613380 606875 598951 590363 582099 575166 569979 566149 563253 561662 562210 565134 569924 576257
51939 576257 584463 594732 606436 618660 630979 643184 654653 664593 672664 678717 682097 681918 678033
51926 678033 671119 661792 650275 636975 622676 607980 593199 579022 566580 556412 547934 540492
51914 540492 534519 531063 530506 532280 535631 540108 545416 551294 557500 563559 568562 571641 572695 572407 571623
51899 571623 570876 570228 569093 566323 560983 553093 543261 531723 518323 503487 488626 475215 463773
51886 463773 453946 445282 437758 431925 428691 428587 430951 434256 437664 441937 448368 457098 466988 476896
51872 476896 486348 495007 502310 507930 511983 514371 514379 511479 506258 500032 493703 487419 481241 475558 470853
51857 470853 467503 465943 466538 469033 472448 475750 478488 480636 482103 482580 481732 479399 475733 471204 466246
51842 466246 460874 454940 448750 442948 437640 432252 426674 422028 419636 419577 420843 422646 424829 427139 429007
51827 429007 430202 430980 431348 430832 429273 427266 425418 423699 421871 420048 418350 416502 414361 412567 412026
51812 412026 412888 414529 416428 418487 420516 421935 422182 421096 418875 415944 412951 410542 408972 408065 407576
51797 407576 407401 407403 407275 406640 405220 402944 400096 397275 394976 393220 391791 390727 390237 390181 390084 389781 389702 390255
51779 390255 391172 391769 391715 391273 390884 390777 391051 391903 393640 396466 400410 405532 412103 420380 430080 440263
51763 440263 449939 458732 466745 473764 478829 480724 478857 473707 466553 458816 451441 444728 438598 432914
51749 432914 427541 422320 417255 412664 408881 405831 403128 400651 398754 397835 398007 399358 402327 407403 414492
51734 414492 422755 431155 439040 446158 452222 456669 458961 459227 458492 458145 459064 461236 463992 466338 467135
51719 467135 465486 461343 455690 449899 444950 441315 439242 438652 438714 438030 435647 431867 427892 424734 422674
51704 422674 421685 422055 424258 428184 432657 435932 436828 435466 432970 430523 428708 427635 427404 428192 429908
51689 429908 432017 433849 434974 435117 433856 430769 425985 420368 414935 410173 406037 402503 399892 398664
51675 398664 398988 400575 402839 405214 407414 409495 411750 414639 418740 424564 432246 441424 451380 461086
51661 461086 469199 474457 476423 475640 472794 468022 461520 454583 449330 447199 448193 451808 458088 467210 478263
51646 478263 488958 496661 499591 497259 490263 479859 467536 454696 442416 431266 421222 411972
51634 411972 403446 395977 389860 384996 381142 378310 376667 376187 376700 378179 380588 383412 385671 386589 386158
51619 386158 384971 383618 382306 380948 379487 378094 377010 376221 375476 374704 374174 374024 373878 373290 372450 372003
51603 372003 372191 372679 373322 374582 376916 380173 384058 388950 395747 404903 415855 427256 437466 444942
51589 444942 448681 448621 445518 440383 434046 427154 420354 414463 410470 409187 410668 414132 418839 424969 433321
51574 433321 444171 456864 470542 484825 499669 515185 531894 550562 571056 591621 610051
51563 610051 625748 640287 656055 674925 698220 727033 761751 801354 843559 885613 924747
51552 924747 958220 983645 999628 1005932 1002966 991338 971943 946149 915449 880894 843138 803155
51540 803155 762694 723649 686999 652650 620502 591365 566401 545769 528281 512562 498168
51529 498168 485368 474261 464634 456472 449973 444911 440437 435817 431134 427060 424088 422168 420939 420067
51515 420067 419464 419368 420157 421892 424112 426298 428377 430460 432085 432138 429829 425565 420603 415972 411966 408536
51499 408536 405725 403592 402040 400981 400499 400588 400865 400821 400374 399841 399331 398442 396781 394579 392528 391027 389763
51482 389763 388011 385304 381892 378597 376094 374219 372130 369288 366067 363131 360454 357379 353644 349769
51468 349769 346335 343332 340490 337860 335683 333975 332588 331539 330914 330643 330788 331836 334165 337258 340013
51453 340013 341947 343596 345552 347725 349928 352725 357079 363300 370875 379355 389014 400544 414306 429813
51439 429813 445581 459465 469555 475080 476576 475278 472551 469641 467327 465388 462570 457466 449611
51426 449611 439772 429280 419168 409856 401443 394119 388100 383235 379005 375152 372112 370526 370482 371585
51412 371585 373617 376576 380095 383449 386381 389345 392590 395565 397740 399530 401731 404284 406384 407794
51398 407794 409305 411661 414600 417327 419628 422207 426031 431511 438211 445394 452971 461807 472901 486473
51384 486473 502258 520553 542394 568728 599993 636528 678584 725640 776458 830270 887117
51373 887117 946094 1003609 1054390 1094398 1122351 1138647 1143643 1137291 1119807 1092194 1056163 1013713
51361 1013713 966641 916370 864269 812028 761389 713528 668923 627829 590617 557689 529373
51350 529373 505901 487149 472331 460257 450052 441421 434137 427602 421098 414293 407384 400809 394876
51337 394876 389547 384615 380124 376458 373769 371476 368746 365433 362184 359659 358037 357204 356825 356158 354502
51322 354502 352146 350293 349620 349437 348731 347520 346539 346033 345715 345787 347100 350092 354148 358287 361966 365025
51306 365025 367354 369043 370584 372476 374654 376530 377524 377411 376228 374077 371063 367348 363226 359083 355222
51291 355222 351751 348716 346331 344859 344260 344104 343949 343777 344038 345309 347901 351701 356325 361365 366417
51276 366417 370926 374301 376374 377585 378446 378967 378911 378482 378366 379006 380227 381717 383533 385885 388577 390918
51260 390918 392183 392117 391066 389638 388105 386151 383334 379788 376134 372742 369451 366134 363121 360763 358951
51245 358951 357482 356624 356797 357766 358662 358848 358374 357483 356205 354642 353273 352490 352008 351107 349493 347579 345845
51228 345845 344265 342583 340912 339705 339179 339122 339378 340194 341787 343786 345465 346478 347071 347577 348081 348725
51212 348725 349991 352393 355957 360112 363987 366833 368498 369704 371605 374825 379014 383436 387621 391270
51198 391270 393929 395256 395424 394813 393514 391567 389482 387847 386421 384338 381364 378333 376037 374286 372514
51183 372514 370842 369968 370189 371067 371947 372429 372404 372007 371576 371415 371589 372071 372920 374127 375459 376740 378053
51166 378053 379396 380391 380789 381093 382107 383883 385681 387020 388236 389723 391150 391854 391674 391018 390305 389719
51150 389719 389398 389458 389798 390147 390353 390446 390411 390099 389408 388358 386896 384827 382106 379145 376597 374730 373165
51133 373165 371398 369521 368121 367417 366860 365889 364854 364733 365952 367996 370239 372664 375406 378029 379830
51118 379830 380786 381723 383396 385710 388029 390053 392195 395106 398975 403288 407217 410170 412019 413005 413624
51103 413624 414546 416248 418519 420497 421480 421644 421782 422374 423129 423452 423041 421945 420296 418279 416294 414885
51087 414885 414373 414656 415388 416253 416950 417117 416554 415559 414766 414527 414602 414601 414465 414351 414321 414532 415508 417708 420852
51068 420852 424222 427685 431897 437320 443608 450330 457876 467205 479023 493608 510966 530356 549710
51055 549710 566264 578278 586095 591720 597685 606252 618887 635714 655250 674871 691947 705054
51043 705054 714348 720664 724122 723804 718921 709971 698578 686515 675160 665303 656614 647435 635885
51030 635885 621376 604688 586784 568290 550184 534047 521121 511552 504828 500457 497968 496844
51018 496844 496957 498624 501833 505846 510034 514676 520398 527185 534566 542439 551066 560319 569596 578469
51004 578469 586975 595313 603729 612643 622327 632461 642477 652347 662491 672881 682868 692079 700902
50991 700902 709697 718027 725129 730869 735736 740063 743692 746469 748767 751420 755240 760669 767808 776728
50977 776728 787573 800198 813771 827131 839853 852917 868167 887174 910662 938754 971395
50966 971395 1008479 1049802 1095050 1143834 1195780 1250688 1308604 1369569 1433154 1498211 1563103
50955 1563103 1626141 1685808 1740866 1790578 1834949 1874456 1909387 1939550 1964867 1986011 2004054
50944 2004054 2019562 2032575 2043592 2054076 2065400 2077427 2088384 2096063 2099030 2097098 2091179 2082619
50932 2082619 2072190 2059519 2043628 2023879 2000060 1971775 1938371 1899628 1856075 1808348 1756592
50921 1756592 1700765 1641251 1578982 1515241 1451614 1389811 1331117 1276030 1224653 1177241 1134151
50910 1134151 1095431 1060822 1030038 1002688 978035 955306 934318 915434 898766 883777 869883
50899 869883 857109 845789 835845 826736 818148 810366 803835 798597 794291 790503 786941 783452 780154 777552
50885 777552 776285 776619 778240 780569 783223 786214 789842 794428 799993 806149 812462 818968 826226 834779
50871 834779 844744 855994 868484 882171 896813 912167 928429 946292 966534 989689 1016034 1045681
50859 1045681 1078620 1114865 1154641 1198429 1246914 1301022 1361872 1430346 1506642 1590405 1681378
50848 1681378 1779740 1885747 1999276 2119846 2246877 2379753 2517643 2659396 2803500 2947929
50838 2947929 3089959 3226209 3352987 3466802 3564827 3645277 3707664 3752827 3782521 3798621
50828 3798621 3802588 3795835 3780672 3760641 3739737 3721405 3708298 3702484 3705282 3716670 3734992 3757204
50816 3757204 3779263 3796613 3804836 3800197 3779776 3741495 3684455 3609065 3516414 3407623 3284178
50805 3284178 3148677 3004562 2855030 2702810 2551063 2403682 2264120 2134329 2015198
50796 2015198 1907492 1811780 1727805 1654728 1592005 1539532 1496843 1462656 1435415 1414052 1398053
50785 1398053 1386933 1379811 1375486 1372868 1371227 1369949 1368165 1364892 1359603 1352467 1343978 1334545 1324424
50772 1324424 1313698 1302177 1289560 1275780 1260775 1243893 1224155 1201537 1177530 1153885 1131101
50761 1131101 1108583 1086004 1063918 1043249 1024749 1008891 995714 984730 975441 967977 962903 960508
50749 960508 960674 963329 968464 975789 984993 996430 1010976 1029068 1050491 1075357 1104695 1139627 1180328
50736 1180328 1226199 1276745 1331834 1391226 1454344 1520579 1589606 1661272 1735224 1810646 1886376
50725 1886376 1961289 2034494 2105215 2172779 2236917 2297646 2354242 2404455 2445369 2475103 2493239
50714 2493239 2499746 2494410 2477807 2452238 2421219 2388316 2356683 2329021 2307242 2292137 2283706 2281651
50702 2281651 2285373 2293892 2306084 2320641 2335438 2347319 2353000 2349927 2335919 2308616 2266334 2209586
50690 2209586 2141143 2064459 1982436 1897537 1812303 1729340 1651093 1579690 1516543 1461910 1415198
50679 1415198 1375975 1344529 1321398 1306671 1299903 1300464 1307839 1321700 1341693 1366975 1396048 1427369
50667 1427369 1459988 1493158 1525396 1554671 1579800 1601165 1619746 1635867 1649301 1660218 1669449
50656 1669449 1677908 1686099 1694106 1701723 1708599 1714513 1719565 1724085 1728572 1733850 1741051 1751164 1764761
50643 1764761 1782293 1804347 1831289 1862885 1898620 1938184 1981198 2026563 2072578 2117750 2161224
50632 2161224 2202581 2241726 2279050 2315292 2351152 2387271 2424272 2461709 2496272 2521406 2529637
50621 2529637 2516129 2480926 2428825 2367511 2304884 2246716 2195859 2153203 2119027 2093403 2075887
50610 2075887 2065537 2061225 2061661 2065236 2070256 2075255 2078669 2078190 2070944 2054551 2027925 1991208 1945400
50597 1945400 1892127 1833264 1770497 1705384 1639820 1575893 1514982 1457333 1402877 1352170 1306127
50586 1306127 1265088 1228614 1196170 1167509 1142320 1119834 1099030 1079105 1059744 1041124 1023825
50575 1023825 1008619 996182 986874 980680 977324 976504 978034 981680 986986 993543 1001475 1011255 1022929
50562 1022929 1035912 1049912 1065637 1084157 1105831 1130352 1157543 1187411 1219516 1253036 1287531
50551 1287531 1323018 1359102 1394678 1428707 1460711 1490390 1517525 1542701 1567368 1592564 1618111
50540 1618111 1643779 1670706 1700799 1735098 1773630 1816651 1864902 1918473 1976478 2038366 2104924
50529 2104924 2177513 2256861 2343020 2435959 2535513 2640858 2750486 2862583 2975209 3086338
50519 3086338 3194071 3296705 3392338 3478638 3553215 3614029 3659223 3686970 3695988 3686093 3657902
50508 3657902 3612190 3549971 3473011 3383803 3285231 3180819 3075090 2972746 2877249 2790782 2715685
50497 2715685 2654966 2610809 2583294 2571407 2574782 2593429 2625885 2668607 2717239 2767527 2814655
50486 2814655 2852668 2875497 2878500 2858926 2815741 2749982 2665029 2565527 2455728 2339153 2219537
50475 2219537 2101047 1987027 1879029 1777491 1682953 1596218 1517680 1447081 1383832 1327192
50465 1327192 1276306 1230536 1189800 1154199 1123414 1096888 1074622 1057249 1045071 1037351 1032787 1030394
50453 1030394 1029760 1030671 1032829 1035780 1038928 1041750 1044253 1047066 1050871 1055928 1062424 1070982 1082168 1095319
50439 1095319 1108407 1119440 1127892 1134566 1140407 1145828 1151002 1156224 1161749 1167634 1174065 1181704 1191379
50426 1191379 1203442 1217589 1233334 1250376 1268453 1287120 1306032 1325478 1346404 1369707 1395579
50415 1395579 1423628 1453710 1486567 1523545 1565631 1612752 1663943 1718030 1774055 1831159 1888325
50404 1888325 1944358 1998068 2048484 2094997 2137255 2174759 2206527 2231303 2247971 2255477 2252473 2237717
50392 2237717 2211127 2173959 2127516 2072265 2008912 1940026 1869613 1800993 1735846 1675369 1621319
50381 1621319 1575396 1538388 1510667 1492909 1485464 1487320 1496513 1511476 1531201 1554105 1577532 1598564
50369 1598564 1614727 1623739 1623396 1612335 1590654 1559460 1520142 1474401 1424498 1372736 1320640 1268991
50357 1268991 1218573 1170384 1125053 1082490 1042355 1004598 969352 936528 905940 877865 853189
50346 853189 832784 816802 804683 795743 789565 785934 784756 786234 790810 798654 809327 822237 837191
50333 837191 853965 871284 886736 897985 903914 904557 900540 893063 884068 875686 869211 864785 862009
50320 862009 860609 860564 861975 864940 869329 874592 879984 885053 889754 894115 898129 902040 906323 911087 915777
50305 915777 919849 923610 927916 933033 938312 943195 948132 954120 961507 969763 978392 987595 997821 1009082
50291 1009082 1021096 1033968 1048277 1064495 1082828 1103923 1129270 1159977 1194391 1226914 1249847
50280 1249847 1257432 1248976 1228590 1202142 1174371 1148200 1125490 1107396 1094026 1084528 1077884 1073455
50268 1073455 1070706 1068891 1067372 1066017 1064919 1063901 1062582 1060834 1058875 1056966 1055286 1054099 1053763 1054519
50254 1054519 1056424 1059548 1064049 1070073 1077715 1087183 1098978 1113920 1132991 1156914 1185705 1218700
50242 1218700 1255091 1294232 1335236 1376654 1417022 1455666 1492518 1527263 1559250 1588357 1615264
50231 1615264 1640416 1663021 1681483 1694549 1701543 1701562 1693046 1674464 1645403 1606995 1561459 1511274
50219 1511274 1458690 1405798 1354793 1307815 1266357 1230899 1201033 1175665 1152993 1130732 1106908
50208 1106908 1080597 1051874 1021337 989968 959223 930631 905042 882455 862551 845079 829641
50197 829641 815596 802580 790855 780762 771922 763448 755017 747294 741049 736101 731464 726391 720979
50184 720979 715768 711081 706883 702973 699106 695068 690869 686796 683164 680081 677524 675497 673889 672367
50170 672367 670684 669031 667805 667102 666737 666739 667378 668700 670480 672803 676218 681013 686726 692757 699144 706317
50154 706317 714360 723052 732480 742973 754378 765859 776583 786209 794612 801627 807315 812151 816595
50141 816595 820706 824542 828822 834842 843664 855609 870615 888968 911586 939546 973374 1012833
50129 1012833 1057472 1107282 1162611 1223450 1289059 1358351 1430308 1503733 1576786 1647280 1713712
50118 1713712 1775982 1835096 1892278 1948321 2003415 2057059 2107729 2152562 2187654 2209163 2214591
50107 2214591 2203287 2175965 2133988 2079128 2013675 1940334 1861819 1780627 1699094 1619380 1543092
50096 1543092 1471021 1403544 1341317 1285389 1236492 1194357 1157914 1126061 1098064 1073379 1051531
50085 1051531 1032419 1016451 1004035 994942 988390 983724 980789 979616 979987 981465 983721 986623 989971
50072 989971 993253 995800 997161 997296 996383 994573 992036 989093 985983 982398 977513 970687 962127 952764 943646
50057 943646 935465 928407 922155 916145 910073 904114 898580 893574 889224 886016 884445 884369 885177 886689 889512
50042 889512 894320 901069 909121 917976 927674 938564 950798 964030 977626 991260 1005184 1019722
50030 1019722 1034576 1048902 1061992 1073556 1083429 1091474 1097871 1103091 1107420 1110815 1113323 1115185 1116395
50017 1116395 1116711 1116408 1116522 1117821 1119963 1122319 1125419 1131009 1140715 1155137 1174161 1197559 1225106 1256441
50003 1256441 1290933 1327479 1364527 1400757 1435840 1470276 1504505 1538455 1571865 1604450 1635486
49992 1635486 1663514 1686632 1702859 1710150 1706438 1690011 1659958 1616507 1561361 1497754 1429608 1360217
49980 1360217 1291769 1225996 1164610 1108712 1058240 1012580 971620 935771 905104 878930 856285
49969 856285 836394 818668 802649 788159 775237 763776 753495 744374 736858 731298 727379 724409
49957 724409 722141 721011 721522 723692 727320 732578 739983 749634 760672 771621 781285 789222 795491 800127
49943 800127 803035 804232 804019 802853 801121 799024 796465 792884 787321 778885 767303 752962 736488 718505
49929 718505 699818 681556 664777 649995 637279 626714 618438 612215 607308 603014 599198 596224 594506
49916 594506 594216 595227 597116 599284 601264 603018 604958 607745 611951 617716 624715 632623 641607 652045
49902 652045 663784 676153 688847 702320 716866 731684 745313 756743 765609 771608 774460 774507 772635
49889 772635 769331 764199 756603 746457 734191 720395 705766 691090 676914 663316 650176 637475
49877 637475 625239 613482 602453 592782 585092 579536 575747 573016 570417 567222 563632 560941 560474 562314
49863 562314 565359 568612 572086 576491 582482 590447 600626 612964 626838 641270 655535 669414 682745
49850 682745 694917 705084 712872 718671 723173 726812 729633 731385 731509 729242 724087 716210 706213 694642
49836 694642 681977 668964 656625 645843 637073 630298 625022 620470 616282 613036 611684 612400 614401
49823 614401 616985 620281 624851 630969 638627 647862 658704 670932 684047 697289 709632 720196 728904
49810 728904 736425 743275 749345 754510 759135 763499 767072 768857 768222 765024 759283 751336 742137 732767
49796 732767 723624 714425 704824 694647 683786 672468 661548 651914 643662 636288 629567 623637 618411
49783 618411 613697 609923 607877 607470 607478 606887 605834 604874 604053 603363 603542 605625 609802 615300 621374 627935
49767 627935 635229 643215 651353 658798 664886 669623 673559 677086 680043 682211 683784 684938 685101 683119
49753 683119 678171 670307 660174 648624 636561 624857 614237 605210 597968 592200 587258 582836 579400
49740 579400 577620 577423 577930 578252 578037 577345 576455 575926 576433 578263 581163 584774 588957 593534 598013 601954
49724 601954 605547 609610 615059 622493 632154 643940 657357 671688 686348 700965 714949 727045
49712 727045 735583 739346 738299 733502 726384 718076 709212 700025 690525 680773 671171 662532 655759 651387
49698 651387 649294 648635 648032 646021 641713 635193 627435 619816 613599 609544 607739 607761 609115 611624 615450
49683 615450 620812 627669 635631 644221 653366 663582 675586 689793 706428 725906 748357 772323
49671 772323 794314 810386 818514 819499 815905 810386 804748 799822 795865 793168 792412 794287 798679 804284
49657 804284 808914 810048 805434 793941 776369 755220 733326 712479 693274 675899 660702 648019
49645 648019 637735 629271 622097 616237 612192 610321 610412 611966 614662 618241 621989 624735 625566 624396 621763
49630 621763 618269 614218 609549 603944 597238 589839 582618 576245 570821 566167 562134 558505 555030 551884
49616 551884 549742 548955 548893 548612 547987 547676 548034 548692 549319 550187 551657 553484 555075 556181 557018 557793 558447
49599 558447 558841 558989 559144 559748 561171 563304 565466 566874 567216 566770 566082 565659 565794 566488 567581 569008 570800
49582 570800 572748 574296 575039 575229 575501 576202 577272 578712 580769 583546 586773 590182 593929 598466 604119
49567 604119 610947 618927 628090 638396 649519 660740 671089 679727 686189 690297 691978 691390 689075
49554 689075 685644 681276 675848 669659 663674 658792 655164 652499 650826 650504 651565 653407 655290 656866
49540 656866 658117 658951 659082 658380 657325 657013 658512 662134 667458 674149 682490 692876 704973 717819
49526 717819 730770 744068 758473 774611 792681 812346 832480 851173 866339 876696 882370 884749
49514 884749 885717 886793 888769 892011 896978 904261 914050 925541 936840 945512 949477 947745 940394 927985
49500 927985 911212 891249 870009 849470 830674 813661 798301 784765 773155 763198 754530 746949
49488 746949 740201 733871 727831 722528 718598 716301 715519 715980 717254 718791 720303 721914 723652 725028 725515
49473 725515 725284 725090 725520 726707 728626 731223 734277 737559 741197 745461 750104 754342 757661 760296 762628
49458 762628 764450 765180 764651 763314 761553 759107 755361 750146 744089 738102 732657 727658 722918 718414 714068
49443 714068 709627 705053 700800 697449 695219 694105 694277 695975 699094 703303 708522 714983 722858 732260
49429 732260 743584 757305 773342 791094 810322 831506 855097 880916 908684 938480 969570
49418 969570 998584 1019778 1028132 1022783 1007635 988723 970885 956421 946032 940125 938953 942062
49406 942062 948336 956676 966324 976640 987079 997522 1008160 1018887 1029229 1039089 1049039 1059504
49394 1059504 1070057 1079964 1089122 1097866 1106025 1112714 1117012 1118416 1116715 1111961 1104635 1095331 1084133
49381 1084133 1070797 1055770 1040588 1026858 1015027 1004475 994640 985765 978584 973591 970721 969567
49369 969567 969823 971489 974660 979083 983954 988199 991011 992222 992182 991215 989132 985367 979699 972669 965052
49354 965052 956996 948017 937945 927583 918250 910847 905459 901666 898976 897001 895460 894095 892609 890710
49340 890710 888291 885444 882249 878581 874234 869131 863416 857470 851980 847739 845051 843319 841587 839637
49326 839637 838328 838672 840723 843606 846565 849684 853611 858823 865292 872654 880490 888526 896730 905177
49312 905177 913742 922046 929941 938017 947379 958784 972038 986327 1001033 1016188 1032174 1049071
49300 1049071 1066250 1082470 1096278 1106311 1111463 1111258 1106370 1098530 1089427 1079581 1068497 1055913 1042603
49287 1042603 1029885 1018676 1009135 1000894 993374 986064 978817 971803 965148 958830 953051 948387 945320
49274 945320 943954 944481 947520 953451 961530 970216 978347 985584 991820 996813 1000542 1003314 1005189 1005785 1005077
49259 1005077 1004084 1004289 1006604 1011377 1019218 1031093 1047290 1066773 1087946 1109747 1131360 1150836 1164858
49246 1164858 1170547 1167376 1156806 1140296 1118556 1092785 1065567 1039634 1016191 995188 976789 961626
49234 961626 949808 940850 934800 932394 933605 936924 940763 944987 950326 956859 963955 971405 979604 988581
49220 988581 997699 1006609 1015777 1025690 1036033 1046050 1055408 1064253 1072558 1079867 1085796 1090593 1095136 1100378
49206 1100378 1106837 1114565 1123524 1133827 1145557 1158523 1172404 1187063 1202467 1218301 1233926 1248808
49194 1248808 1262811 1276019 1288435 1300012 1310785 1320798 1329933 1337978 1344941 1351257 1357694 1365038
49182 1365038 1373783 1384013 1395617 1408735 1424049 1442589 1465179 1492097 1523362 1559339 1600985
49171 1600985 1649367 1704752 1765672 1828202 1885909 1931327 1958928 1967781 1961693 1946784 1928670 1911130
49159 1911130 1896147 1884336 1875552 1869612 1866534 1865915 1866428 1866445 1865184 1862930 1860271 1857651 1855732 1855604 1858171
49144 1858171 1863487 1870963 1880058 1890544 1902220 1914752 1927863 1941528 1955920 1971219 1987425 2004220
49132 2004220 2020996 2037256 2053146 2069464 2086904 2105284 2123726 2141681 2159547 2178147 2197832
49121 2197832 2218367 2239476 2261078 2283082 2305519 2329015 2354698 2383443 2415621 2451823 2493390
49110 2493390 2541923 2598842 2666085 2746682 2843086 2953702 3070889 3183420 3282990 3370452 3455728
49099 3455728 3548784 3647253 3732295 3779104 3774486 3725890 3654149 3577773 3502792 3424380 3335428
49088 3335428 3233798 3123960 3013988 2911340 2820487 2743084 2679095 2627360 2585773 2551985
49078 2551985 2524299 2501812 2483798 2469234 2456852 2445364 2433737 2421646 2409721 2399032 2390203
49067 2390203 2383069 2377081 2371730 2366538 2361003 2354849 2348248 2341644 2335304 2329090 2322699 2316154 2309951 2304551
49053 2304551 2299795 2295067 2290129 2285485 2281684 2278581 2275585 2272465 2269547 2267340 2266393 2267473 2271359 2278320
49039 2278320 2288065 2300184 2314068 2328286 2340654 2349511 2354883 2358112 2360498 2362525 2364137 2365241 2365824
49026 2365824 2365905 2365500 2364472 2362388 2358804 2353842 2348328 2343221 2339039 2335898 2333891 2333118 2333433 2334467 2335960
49011 2335960 2337916 2340365 2343214 2346451 2350332 2355145 2360874 2367189 2373654 2379873 2385619 2391037 2396574 2402440
48997 2402440 2408169 2412957 2416351 2418348 2418969 2418166 2416196 2413600 2410604 2406879 2402189 2396972 2392026 2387827
48983 2387827 2384368 2381398 2378529 2375365 2371916 2368730 2366306 2364467 2362661 2360718 2358850 2357011 2354742 2351778
48969 2351778 2348397 2345028 2341881 2339146 2337215 2336375 2336440 2337004 2338115 2340521 2345143 2352236 2361014 2370173 2378892
48954 2378892 2387338 2396219 2406018 2416793 2428546 2441491 2455999 2472386 2490627 2510037 2529456 2548121
48942 2548121 2566299 2584772 2603918 2623824 2645203 2669450 2697532 2729326 2764307 2802296 2843123
48931 2843123 2886088 2930399 2975961 3023236 3072457 3123401 3175836 3229709 3284969 3341573 3399694
48920 3399694 3459567 3521158 3584222 3648507 3713438 3777714 3839783 3898903 3955368 4009690 4062023
48909 4062023 4112460 4161232 4208280 4253089 4295390 4335593 4374024 4410104 4442991 4472860 4500800
48898 4500800 4527336 4551813 4573567 4593106 4611538 4629088 4644736 4657268 4666259 4671990 4674768 4674499
48886 4674499 4670786 4663428 4652901 4640142 4625633 4608860 4589117 4566705 4542732 4517617 4490436 4460061
48874 4460061 4426302 4389406 4349015 4304517 4256233 4205316 4152344 4096906 4038957 3979882 3921639
48863 3921639 3865232 3810564 3757524 3706556 3658144 3612189 3568112 3525504 3484624 3446236 3410788
48852 3410788 3377778 3346243 3315936 3287648 3262212 3239748 3220186 3203870 3190910 3180421 3171339
48841 3171339 3163884 3159315 3158154 3159585 3162737 3167661 3174581 3183139 3193101 3205145 3220021 3237264 3255622
48828 3255622 3274561 3294522 3315710 3337478 3359138 3380712 3402510 3424527 3446581 3468711 3491022
48817 3491022 3513398 3535683 3557958 3580376 3602888 3625365 3647838 3670355 3692729 3714735 3736524
48806 3736524 3758671 3781823 3806383 3832398 3859529 3887190 3914953 3942903 3971465 4000866 4030718
48795 4030718 4060059 4087658 4112487 4134146 4152937 4169449 4184113 4197183 4209012 4220088 4230698
48784 4230698 4240527 4248496 4252979 4252390 4245944 4233950 4217335 4196871 4172872 4145456 4114825 4081256
48772 4081256 4044978 4006160 3965031 3922047 3877905 3833166 3787765 3741081 3692736 3643196 3593386
48761 3593386 3543912 3494940 3446674 3399559 3354093 3310810 3270380 3233275 3199259 3167680 3138358
48750 3138358 3111752 3088047 3066516 3046105 3026436 3007957 2991406 2977338 2965963 2957200 2951066 2948083
48738 2948083 2948837 2952945 2958834 2964855 2970185 2974352 2976584 2976462 2974838 2973208 2972202 2971485 2971090 2971876 2974378
48723 2974378 2978003 2981839 2985634 2989422 2992732 2994842 2995614 2995471 2994642 2992902 2990112 2986603 2982964 2979681 2976983
48708 2976983 2974819 2972983 2971452 2970603 2970922 2972496 2974907 2977598 2980206 2982665 2985157 2987962 2991220 2994888
48694 2994888 2999013 3003889 3009655 3015778 3021203 3025131 3027493 3028656 3028888 3028204 3026626 3024428 3022078 3019980
48680 3019980 3018258 3016874 3015862 3015242 3014534 3012599 3008360 3001710 2993453 2984325 2974381 2963387 2951355 2938366
48666 2938366 2924202 2908599 2891752 2874124 2855796 2836448 2816015 2794767 2772464 2747875 2719568
48655 2719568 2686976 2650411 2610442 2567917 2524542 2482713 2444410 2410419 2380573 2354284 2330717
48644 2330717 2308981 2288510 2268995 2249764 2229689 2208141 2185748 2163725 2142608 2122042 2101662
48633 2101662 2081645 2062287 2043470 2024750 2005733 1986279 1966426 1946278 1925964 1905791 1886390
48622 1886390 1868430 1851998 1836571 1821822 1808199 1796357 1786364 1777984 1771517 1767681 1766675 1767892
48610 1767892 1770660 1774677 1779495 1784063 1787150 1788058 1786813 1783995 1780518 1777277 1774831 1773505 1773696 1775671
48596 1775671 1779047 1782864 1786170 1788216 1788216 1785540 1780280 1773005 1763839 1752491 1739389 1725916 1712986 1700126
48582 1700126 1686670 1673254 1661205 1650834 1641289 1631947 1623027 1614805 1607136 1600142 1594671 1591610 1591100
48569 1591100 1592753 1596321 1601755 1608813 1616940 1625481 1633732 1640796 1645634 1647442 1645925 1641106 1632980 1621611
48555 1621611 1607680 1592701 1578308 1565390 1554198 1545073 1538408 1533626 1528845 1522081 1512566 1500587
48543 1500587 1486482 1470484 1453383 1436624 1421420 1407995 1395829 1384418 1373754 1364205 1356041 1349115
48531 1349115 1343138 1338256 1335132 1334263 1335442 1338163 1342466 1349228 1359684 1374522 1392827 1411424 1425647
48518 1425647 1431513 1427583 1415045 1396564 1375330 1354456 1336204 1321428 1310015 1301881 1297314 1296494
48506 1296494 1299182 1304911 1313262 1323953 1336831 1351623 1367589 1383782 1399946 1416525 1433010 1446502
48494 1446502 1452915 1450016 1438961 1422852 1404272 1384278 1363063 1340975 1318850 1297528 1277183 1257390
48482 1257390 1238015 1219721 1203304 1188879 1176260 1165768 1157852 1151957 1146613 1140914 1135330 1130820
48470 1130820 1127704 1125636 1124176 1122976 1121821 1120889 1120785 1122011 1124567 1128228 1132986 1138970 1146090 1153910
48456 1153910 1161767 1168938 1174729 1178504 1179726 1178188 1174349 1169186 1163456 1157280 1150723 1144385 1138894 1134041
48442 1134041 1128978 1123138 1116352 1108207 1098099 1086168 1073550 1061426 1050207 1039873 1030590 1022683
48430 1022683 1016274 1011211 1007186 1003863 1001100 999032 997632 996320 994352 991563 988300 984690 980494 975636
48416 975636 970357 964763 958693 952089 945122 937950 930828 924331 918904 914249 909673 904988 900426 895817
48402 895817 890719 885455 881169 878556 877148 876096 874994 873648 871619 868384 863680 857672 851210 845632
48388 845632 841572 838076 833726 828594 824074 820814 818031 815109 812543 810716 808920 806394 803510 801095
48374 801095 799227 797336 795006 792162 789002 786167 784366 783500 782772 781908 781394 781278 780853 779998 779684 780413
48358 780413 781279 781442 781566 782748 784801 786619 787654 788180 788652 789624 791760 795197 799436 804419 810939 819326
48342 819326 828660 838143 848427 860689 875155 891446 909394 928308 945981 959701 968184 972080
48330 972080 973288 974296 977189 982344 988736 996095 1005770 1018893 1034975 1053179 1073594 1096207 1120062
48317 1120062 1144701 1171145 1200242 1231492 1264810 1301864 1344184 1391680 1444716 1505931 1578208
48306 1578208 1662837 1761885 1880724 2026186 2204145 2420957 2684630 3001820 3376355 3814140
48296 3814140 4327514 4932948 5649579 6504623 7535587 8781968 10279128 12057339 14112527
48287 14112527 16328739 18415989 19967808 20644520 20345742 19230922 17594136 15720000
48279 15720000 13816332 12014495 10386640 8960356 7735705 6700729 5837094 5120854
48271 5120854 4527043 4035004 3627959 3290281 3008457 2773003 2576547 2411214 2269963
48262 2269963 2148914 2046024 1958360 1882417 1815963 1757849 1706739 1661370 1621123 1585178 1552067
48251 1552067 1521143 1493360 1469507 1448744 1429910 1413004 1398170 1384468 1371081 1358770 1348710
48240 1348710 1340699 1333831 1328217 1324659 1323227 1323511 1325833 1330822 1337765 1344340 1347921 1346603 1339500 1327007
48226 1327007 1310693 1292196 1272331 1251501 1230378 1209519 1188801 1167901 1146918 1125994 1104894
48215 1104894 1083597 1062790 1043013 1023761 1004142 984028 963870 943801 923706 903843 884629
48204 884629 866030 847834 830292 813796 798177 783034 768595 755560 744170 734017 724723 716199
48192 716199 708240 700480 692892 685939 680096 675434 671642 668223 664738 661082 657481 654118 650876 647620
48178 647620 644517 641963 640360 639948 640508 641152 640912 639786 638789 638731 639317 639690 639373 638374 636823 634981 633261
48161 633261 631852 630520 629028 627470 626021 624801 624182 624641 625972 627217 627783 628066 628505 628676 628047 627060
48145 627060 626661 627059 627751 628467 629318 630200 630878 631628 633037 635125 637352 639505 641845 644289 646175 647200
48129 647200 648012 649475 651707 654200 656614 659107 661978 665228 668481 671265 673455 675438 677778 680717
48115 680717 684155 688069 692733 698472 705309 712928 720867 728682 736062 743001 750012 758069 767993 779679
48101 779679 792132 804533 817149 830817 845734 861171 876398 891291 905986 920466 934767
48090 934767 949151 963774 978481 993085 1007446 1021136 1033557 1044757 1055642 1066954 1078344
48079 1078344 1088845 1098004 1106160 1113880 1121465 1128835 1135646 1141650 1147088 1152460 1157835 1162837 1167485 1172475
48065 1172475 1178363 1184976 1191980 1199391 1207012 1213905 1219117 1222558 1224658 1225539 1225197 1224033 1222367 1219572
48051 1219572 1214498 1206726 1196820 1185432 1172818 1159270 1145369 1131639 1118313 1105417 1092672 1079312
48039 1079312 1064482 1047947 1030245 1012222 994663 978081 962377 946756 930405 913277 895969
48028 895969 879001 862499 846394 830530 814699 798856 783223 768037 753438 739760 727468
48017 727468 716520 706313 696555 687636 679696 672093 664419 657293 651294 645802 639973 634329 630117 627399
48003 627399 625080 622699 620969 620441 620811 621728 623197 624940 626343 627313 628353 629638 630872 632071 633397
47988 633397 634187 633401 631348 629698 629332 629411 629083 628795 629075 629251 628459 627050 625940 625274 624669 624093 623505 622272
47970 622272 619971 617279 615086 613209 610989 608668 607017 605918 604547 602846 601649 601295 601202 601001 601117
47955 601117 601919 603139 604517 606371 609139 612808 617110 621885 626987 632177 637297 642340 647381 652683
47941 652683 658798 666110 674209 682173 689595 696997 705159 714272 723777 732767 740550 747083 752795 757769
47927 757769 761342 762938 763091 763061 763363 763160 761261 757319 752010 746334 740861 735371 729214 722170 714801
47912 714801 707661 700437 692490 684122 676568 670555 665468 660262 654749 649645 645650 642815 640707 639024
47898 639024 638050 638446 640402 643178 645869 648449 651660 655947 661097 666812 672931 679010 684542 689935 696511
47883 696511 704974 714421 723403 731438 738893 745913 752285 758141 763972 769913 775561 780473 784322 786616
47869 786616 786907 785368 782656 779121 774608 769082 762822 755873 747923 739101 730323 722304 714585 706066
47855 706066 696309 685815 675232 664909 655175 646445 638813 631986 625812 620547 616444 613477 611692
47842 611692 611356 612402 614075 615634 617166 619205 621763 624371 627012 630211 634030 637681 640566 643134
47828 643134 646176 649738 653367 657053 661200 665727 669980 673670 677335 681681 686938 693074 700108 707887
47814 707887 715950 724208 733559 745390 760316 777658 796196 815328 835464 857332 880880 904875
47802 904875 927627 948032 965803 980807 992645 1000999 1005936 1007555 1005615 999956 991199 980634 969363
47789 969363 957831 946183 934773 924144 914694 906431 899014 892041 885370 879081 873051 866723 859600
47776 859600 851915 844538 838156 832773 827984 823396 818729 813890 809150 804937 801155 797029 791964 786422
47762 786422 781501 777691 774419 770802 766501 761747 756947 752463 748508 745021 741739 738487 735304 732258
47748 732258 729483 727484 727019 728340 730821 733690 736965 741221 746679 753059 760296 768786 778720 789711
47734 789711 801387 813899 827428 841572 855731 869901 884508 899467 913937 927127 938876
47723 938876 949295 958264 965561 971160 975020 976778 976063 973056 968367 962311 954625 945042 933856 921723
47709 921723 909041 895739 881619 866787 851766 837244 823685 811126 799509 789243 781130 775506
47697 775506 771705 768827 766914 766827 768894 772261 775889 779713 784381 790272 797328 805518 814777 824570 834223
47682 834223 843816 854160 865749 878315 891489 905166 918922 931825 943443 954377 965017 974235
47670 974235 980321 983099 984148 984763 984589 982619 978718 973482 967074 959004 948974 937410 925036 912286
47656 912286 899214 885780 872119 858602 845591 833120 820944 809078 798181 789143 782345 777508
47644 777508 774261 772609 772769 774706 777981 782028 786555 791728 797973 805517 814144 823429 833219 843746
47630 843746 855350 868288 882888 899646 918939 940748 964845 991175 1019715 1049917 1080593
47619 1080593 1110501 1138821 1164891 1187814 1206678 1220990 1230434 1234304 1231702 1222480 1207497 1187738
47607 1187738 1163594 1135264 1103426 1068970 1032419 994234 955591 918146 882883 849695 818247
47596 818247 788808 761993 738137 717231 699051 682958 667907 653253 639488 627718 618376 610841
47584 610841 604385 599018 595077 592200 589188 585011 579805 574701 570643 567494 564389 560864 557365 554617
47570 554617 552744 551265 549746 548153 546623 545199 543805 542268 540280 537647 534648 531841 529310 526390
47556 526390 522486 518043 514270 511798 509931 507434 503926 500266 497632 496447 496278 496505 496779 496859 496431 495460
47540 495460 494628 494936 496641 498825 500265 500610 500486 500529 500736 500790 500742 501099 502357 504549 507174 509461 510893
47523 510893 511621 512310 513395 514579 515227 515156 514811 514652 514614 514290 513492 512486 511729 511433 511370 511070 510301 509423 509177
47504 509177 510003 511552 512961 513624 513669 513709 514247 515335 516672 517804 518214 517530 515890 513991 512467 511207
47488 511207 509617 507702 506534 507282 509920 513236 516102 518410 520750 523538 526720 530138 533836 537872
47474 537872 541958 545508 548210 550437 552855 555603 558198 560382 562659 565611 568966 571846 573778 574879
47460 574879 575199 574614 573492 572764 572912 573419 573666 573897 574791 576438 578418 580761 584236 589605 596923 605631
47444 605631 615031 624699 634777 645964 659044 674393 691954 711453 732398 754174 776538 799849
47432 799849 824313 849056 872483 893617 912629 929913 945106 957290 965844 970815 972658 971886
47420 971886 968855 963689 956452 947408 936925 925047 911455 896107 879763 863618 848442 834202
47408 834202 820444 806840 793382 780287 767861 756360 745765 735680 725681 715955 707453 701021
47396 701021 696351 692128 687418 682598 678746 676512 675939 676971 679551 683397 688289 694535 702506 711692
47382 711692 720906 729634 738551 748388 758853 769164 779094 788836 798124 806194 812657 817780 821747 824078
47368 824078 824089 821734 817663 812471 806037 797717 787200 775054 762334 749673 736912 723625 709807
47355 709807 695954 682595 669875 657525 645185 632827 620860 609735 599547 590153 581591 574063
47343 574063 567508 561567 556062 551126 546708 542345 537782 533539 530519 529148 529163 530079 531602 533630 536143
47328 536143 539105 542351 545616 548785 551934 555058 557960 560568 563116 565815 568564 571184 573677 575940
47314 575940 577548 578211 578288 578354 578327 577451 575198 571875 568335 565383 563380 562083 560836 559252 557708 556944
47298 556944 557215 558199 559628 561555 563968 566691 569830 573765 578475 583319 587896 592735 598648 605714 613362
47283 613362 621333 629949 639396 649250 658901 668097 676861 685199 693233 701412 710205 719515 728619 736760
47269 736760 743579 749005 753019 755805 757952 760137 762570 764995 767309 769897 773132 776801 780358 783754
47255 783754 787706 792925 799097 804638 807430 805943 799868 789954 777376 763299 748859 735210 723304
47242 723304 713675 706452 701434 698026 695361 692890 690847 689895 690279 691623 693618 696589 701142 707449 715159
47227 715159 723886 733462 743685 754154 764593 775163 786180 797531 808615 818922 828470 837547
47215 837547 846231 854294 861352 866876 870227 871058 869597 866234 860987 853868 845701 837807 830562 822861
47201 822861 813487 802636 791622 781459 772398 764608 758504 754226 751354 749428 748449 748677 750195 752857
47187 752857 756515 761185 767071 774391 783033 792496 802436 813243 825783 840556 857346 875667 895190
47174 895190 915690 936860 958333 979672 1000325 1019819 1038054 1055168 1071013 1084972 1096304
47163 1096304 1104512 1109472 1111493 1111270 1109433 1106047 1100793 1093586 1084733 1074570 1063398 1051767 1040263
47150 1040263 1028842 1016838 1003888 990525 977670 965940 955613 946780 939231 932594 926902 922703
47138 922703 920313 919419 919704 921338 924363 928116 931925 936087 941422 948052 955297 962696 970342 978064 984952
47123 984952 989998 992802 993515 992404 989640 985158 978622 969889 959522 948446 937021 924924 912090
47110 912090 899200 886960 875346 863966 852748 841855 831222 820733 810644 801308 792524 783662
47098 783662 774496 765490 757133 749406 742035 734926 728131 721679 715784 711033 707989 706625 706384 706822 707936
47083 707936 709886 712709 716410 721027 726356 731805 736818 741351 745669 749750 753221 755890 757987 759776
47069 759776 761222 762211 762766 762875 762369 761263 759981 758901 757844 756416 754790 753709 753611 754101 754506 754711
47053 754711 755275 756869 759782 763893 768941 774769 781330 788525 796138 803962 811901 819898 827847 835687
47039 835687 843415 850891 857835 864235 870528 877046 883536 889694 896018 903422 911959 920636 928798 936964
47025 936964 945805 954869 963088 970142 976470 982081 986322 989036 991049 993006 994289 993718 991017 987023
47011 987023 982639 978128 973409 968467 963334 958056 952858 948077 943718 939333 934556 929694 925561 922772
46997 922772 921320 920774 920760 921315 922839 925705 929775 934358 938748 942759 946661 950690 954886 959408 964720
46982 964720 971195 978655 986631 995134 1004911 1016682 1030200 1044282 1057818 1070551 1082795 1094699
46970 1094699 1106105 1117036 1127879 1138921 1149952 1160507 1170291 1179097 1186510 1192094 1195896 1198465
46958 1198465 1200220 1201063 1200740 1199412 1197648 1195942 1194448 1193197 1192436 1192653 1194244 1197159 1200876 1204750 1208450
46943 1208450 1212116 1216191 1221062 1226763 1232981 1239462 1246454 1254490 1263600 1273013 1281929 1290433 1299198 1308466
46929 1308466 1317804 1326937 1336176 1345730 1355060 1363359 1370291 1375797 1379385 1380248 1378133 1373603 1367284 1359229
46915 1359229 1349194 1337291 1324101 1310268 1296238 1282358 1268979 1256325 1244272 1232462 1220752
46904 1220752 1209508 1199381 1190961 1184816 1181670 1182037 1185583 1191417 1199254 1209872 1223996 1241106 1259908
46891 1259908 1279725 1300814 1323366 1346887 1370627 1394075 1416816 1438396 1458651 1477741 1495583
46880 1495583 1511614 1525407 1537202 1547468 1556208 1563169 1568591 1573216 1577528 1581382 1584556 1587270 1589910
46867 1589910 1592526 1595052 1598059 1602905 1610771 1621625 1634335 1647827 1661885 1676816 1692734 1709381
46855 1709381 1726370 1743214 1759275 1774084 1787629 1799970 1810667 1819020 1824881 1828729 1830907 1831317
46843 1831317 1829995 1827384 1823694 1818530 1811619 1803561 1795291 1787051 1778496 1769688 1761406 1754462 1749197 1745781
46829 1745781 1744555 1745808 1749422 1754932 1761878 1770158 1780119 1792252 1806557 1822289 1838537 1854871 1871108
46816 1871108 1886631 1900542 1912599 1923424 1933495 1942328 1948989 1953077 1954796 1954349 1951784 1947411 1941888
46803 1941888 1935710 1928844 1920967 1911911 1901865 1891345 1881075 1871662 1863187 1855140 1846896 1838327 1829888
46790 1829888 1822239 1815823 1810802 1807157 1804711 1803168 1802306 1802275 1803505 1806197 1809905 1813783 1817247 1820246 1822921
46775 1822921 1825248 1827196 1828994 1831010 1833419 1836312 1840122 1845530 1852678 1860742 1868665 1876304 1884502 1893958
46761 1893958 1904397 1915131 1926178 1938403 1952549 1968489 1985530 2003136 2021187 2039755 2058875
46750 2058875 2078398 2097774 2116086 2132563 2147122 2160242 2172313 2183328 2193149 2201765 2209160 2215153
46738 2215153 2219615 2222689 2224655 2225708 2226016 2225896 2225717 2225659 2225775 2226256 2227437 2229537 2232609 2236747 2242061 2248298
46722 2248298 2254765 2260939 2267091 2274011 2282034 2290469 2298028 2303648 2306896 2307838 2306716 2303686 2298683 2291464
46708 2291464 2281832 2269808 2255582 2239393 2221394 2201521 2179475 2155067 2128730 2101465 2074003
46697 2074003 2046164 2017389 1987794 1958224 1929221 1900497 1871762 1843692 1817516 1793717 1771594
46686 1771594 1750149 1729080 1708774 1689641 1671712 1654839 1639062 1624654 1611748 1599899 1588226
46675 1588226 1576236 1564492 1554218 1546100 1539656 1533856 1528160 1522820 1518403 1515367 1513978 1514283 1516024
46662 1516024 1518898 1523075 1529230 1537760 1548072 1558942 1569543 1579847 1590021 1599853 1608987 1617378 1625013
46649 1625013 1631323 1635407 1636996 1636859 1636057 1635039 1633618 1631579 1629046 1626451 1624455 1623779 1624880 1627860 1632920
46634 1632920 1640788 1652310 1667554 1685568 1705111 1725496 1746670 1768706 1791375 1814104 1836196
46623 1836196 1857006 1875944 1892427 1905995 1916466 1923736 1927370 1926719 1921655 1912887 1901176 1886566
46611 1886566 1868901 1848885 1827872 1806568 1784671 1762005 1739229 1717035 1695352 1674035 1653845
46600 1653845 1635883 1620229 1605884 1592072 1578950 1566981 1556253 1546646 1538106 1530458 1523318 1516451
46588 1516451 1509931 1503764 1497669 1491429 1485081 1478507 1471217 1462941 1454155 1445556 1437198 1428614 1419767 1411426
46574 1411426 1404464 1399100 1394951 1391579 1388800 1386612 1384989 1383806 1382963 1382645 1383279 1385074 1387595 1390027 1391898
46559 1391898 1393413 1395128 1397549 1400973 1405331 1410004 1414153 1417599 1421231 1426190 1432665 1439802 1446801 1453825
46545 1453825 1461648 1470695 1480655 1490986 1501585 1512926 1525612 1539852 1555288 1571310 1587533 1604043
46533 1604043 1621266 1639664 1659469 1680608 1702883 1726329 1751360 1778424 1807500 1838076 1869622
46522 1869622 1901860 1934585 1967483 2000371 2033251 2065785 2096950 2125725 2152077 2176662 2199489
46511 2199489 2219502 2235886 2249200 2260576 2270117 2276867 2280303 2281080 2280103 2277598 2273628 2268930 2264449
46498 2264449 2260167 2255117 2248671 2241251 2233510 2225338 2216205 2206230 2196311 2186990 2177577 2166652 2153298
46485 2153298 2137542 2119704 2099737 2077384 2052720 2026179 1998062 1968305 1936776 1903592 1869087
46474 1869087 1833687 1797969 1762638 1728230 1694953 1662978 1632789 1605025 1580076 1558021 1538893
46463 1538893 1522720 1509343 1498546 1490491 1485796 1484970 1487880 1493923 1502591 1513799 1527688 1544182 1562602
46450 1562602 1581729 1600450 1618462 1636129 1653573 1670124 1684876 1697505 1708224 1717093 1723791 1728112
46438 1728112 1730303 1730785 1729736 1727056 1722592 1716366 1708765 1700557 1692512 1684954 1677828 1671239 1665639 1661425
$$ [...]
##END NTUPLES=NMR SPECTRUM
##END=
