##TITLE=AC1718_CCAAH15004_9207194_GgYotDxTai
##JCAMPDX= 6.0         $$ Bruker NMR JCAMP-DX V2.0
##DATA TYPE= NMR SPECTRUM
##DATA CLASS= NTUPLES
##ORIGIN= BRUKER
##OWNER= Administrator
$$ 1.72 TOPSPIN		Version 2.1
$$ 2015-06-01 16:45:35.014 -0700  Administrator@X
$$ Compression mode = diff/dup
##.OBSERVE FREQUENCY= 400.02188249412
##.OBSERVE NUCLEUS= ^1H
##.ACQUISITION MODE= SIMULTANEOUS (DQD)
##.ACQUISITION SCHEME= undefined
##.AVERAGES= 8
##.DIGITISER RES= 22
##SPECTROMETER/DATA SYSTEM= spect
##.PULSE SEQUENCE= zg30
##.SOLVENT NAME= COFFEE_meoh
##.SHIFT REFERENCE= INTERNAL, COFFEE_meoh, 1, 14.98509
##AUDIT TRAIL= $$ (NUMBER, WHEN, WHO, WHERE, PROCESS, VERSION, WHAT)
$$ ##TITLE= Audit trail, TOPSPIN		Version 2.1
$$ ##JCAMPDX= 5.01
$$ ##ORIGIN= Bruker BioSpin GmbH
$$ ##OWNER= Administrator
$$ $$ E:\/data/COFFEE/nmr/AC1718_CCAAH15004_9207194_GgYotDxTai/10/pdata/1/auditp.txt
$$ ##AUDIT TRAIL=  $$ (NUMBER, WHEN, WHO, WHERE, PROCESS, VERSION, WHAT)
(   1,<2015-06-01 16:45:27.670 -0700>,<Administrator>,<X>,<go>,<TOPSPIN 2.1>,
      <created by zg
	started at 2015-06-01 16:44:21.795 -0700,
	POWCHK enabled, PULCHK disabled,
       configuration hash MD5:
       21 0F 79 D6 B3 7B B4 F6 88 20 88 DB 03 48 BD 9F
       data hash MD5: 64K
       A9 DE D3 77 A4 C8 6A 97 4D AA CD B4 D2 09 70 95>)
(   2,<2015-06-01 16:45:30.998 -0700>,<Administrator>,<X>,<proc1d>,<TOPSPIN 2.1>,
      <Start of raw data processing
       efp LB = 0 FT_mod = 6 PKNL = 1 PHC0 = 0 PHC1 = 0 SI = 32K 
       data hash MD5: 32K
       46 92 04 9E 94 08 BE 89 AF 87 57 E0 9E FB 1C 5D>)
(   3,<2015-06-01 16:45:31.280 -0700>,<Administrator>,<X>,<proc1d>,<TOPSPIN 2.1>,
      <pk PHC0 = 92.4939 PHC1 = 0 
       data hash MD5: 32K
       A4 DF EF B1 54 6E 5C 69 CC 94 C0 29 6B 56 7B CA>)
(   4,<2015-06-01 16:45:31.405 -0700>,<Administrator>,<X>,<proc1d>,<TOPSPIN 2.1>,
      <abs ABSG = 1 
       data hash MD5: 32K
       22 C2 B4 C3 09 6A 3A 62 CC C8 A2 7A 53 79 A0 4C>)
(   5,<2015-06-01 16:45:31.467 -0700>,<Administrator>,<X>,<proc1d>,<TOPSPIN 2.1>,
      <abs ABSG = 2 
       data hash MD5: 32K
       BE 32 73 40 B7 97 DF 5A 64 E3 2F 11 5C CD 59 C3>)
(   6,<2015-06-01 16:45:31.514 -0700>,<Administrator>,<X>,<proc1d>,<TOPSPIN 2.1>,
      <abs ABSG = 3 
       data hash MD5: 32K
       18 4F EB FD 19 F8 40 18 67 F8 DE 9A 54 5F CC A1>)
(   7,<2015-06-01 16:45:31.576 -0700>,<Administrator>,<X>,<proc1d>,<TOPSPIN 2.1>,
      <abs ABSG = 4 
       data hash MD5: 32K
       C9 08 D9 E0 7A 71 6E 23 F0 4B FC 49 8E 1D 1A 53>)
(   8,<2015-06-01 16:45:31.639 -0700>,<Administrator>,<X>,<proc1d>,<TOPSPIN 2.1>,
      <abs ABSG = 5 
       data hash MD5: 32K
       B9 8D B9 90 7F 0B 95 B9 61 57 AF FF 83 B8 9A F0>)
$$ ##END=
$$ 
$$ $$ hash MD5
$$ $$ 13 9D 96 25 5F 77 01 22 3F 7B 8A 39 18 76 E6 9F
##$RELAX= 
##$RELAX= 
##$RELAX= 
##$RELAX= 
##$RELAX= 
##$RELAX= 
##$RELAX= 
$$ Bruker specific parameters
$$ --------------------------
##$DU= <E:\>
##$EXPNO= 10
##$NAME= <AC1718_CCAAH15004_9207194_GgYotDxTai>
$$ [...]
150 150 150 150 150 150 150 150
##$TP07= 0
##$TPNAME0= <>
##$TPNAME1= <>
##$TPNAME2= <>
##$TPNAME3= <>
##$TPNAME4= <>
##$TPNAME5= <>
##$TPNAME6= <>
##$TPNAME7= <>
##$TPOAL= (0..7)
0.5 0.5 0.5 0.5 0.5 0.5 0.5 0.5
##$TPOFFS= (0..7)
0 0 0 0 0 0 0 0
##$TUNHIN= 0
##$TUNHOUT= 0
##$TUNXOUT= 0
##$USERA1= <user>
##$USERA2= <user>
##$USERA3= <user>
##$USERA4= <user>
##$USERA5= <user>
##$V9= 5
##$VALIST= <valist>
##$VCLIST= <CCCCCCCCCCCCCCC>
##$VD= 0
##$VDLIST= <DDDDDDDDDDDDDDD>
##$VPLIST= <PPPPPPPPPPPPPPP>
##$VTLIST= <TTTTTTTTTTTTTTT>
##$WBST= 2048
##$WBSW= 25
##$XGAIN= (0..3)
0 0 0 0
##$XL= 0
##$YL= 0
##$YMAX_a= 598694
##$YMIN_a= -509519
##$ZGOPTNS= <>
##$ZL1= 120
##$ZL2= 120
##$ZL3= 120
##$ZL4= 120
##$ABSF1= 14.98509
##$ABSF2= -5.573092
##$ABSG= 5
##$ABSL= 3
##$ALPHA= 0
##$AQORDER= 0
##$ASSFAC= 0
##$ASSFACI= 0
##$ASSFACX= 0
##$ASSWID= 0
##$AUNMP= <proc_prof1d_extract_pilot.lims>
##$AXLEFT= 0
##$AXNAME= <>
##$AXNUC= <1H>
##$AXRIGHT= 0
##$AXTYPE= 0
##$AXUNIT= <>
##$AZFE= 0.1
##$AZFW= 0.1
##$BCFW= 0
##$BC_mod= 0
##$BYTORDP= 0
##$COROFFS= 0
##$CY= 15
##$DATMOD= 1
##$DC= 0
##$DFILT= <>
##$DTYPP= 0
##$F1P= 0
##$F2P= 0
##$FCOR= 0.5
##$FTSIZE= 32768
##$FT_mod= 6
##$GAMMA= 0
##$GB= 0
##$INTBC= 1
##$INTSCL= 1
##$ISEN= 128
##$LB= 0
##$LEV0= 0
##$LPBIN= 0
##$MAXI= 10000
##$MC2= 0
##$MEAN= 0
##$ME_mod= 0
##$MI= 0
##$NCOEF= 0
##$NC_proc= -8
##$NLEV= 6
##$NOISF1= 0
##$NOISF2= 0
##$NSP= 0
##$NTH_PI= 0
##$NZP= 0
##$OFFSET= 14.98509
##$PC= 1
##$PHC0= 92.4939
##$PHC1= 0
##$PH_mod= 1
##$PKNL= yes
##$PPARMOD= 0
##$PPDIAG= 0
##$PPIPTYP= 0
##$PPMPNUM= 2147483647
##$PPRESOL= 1
##$PSCAL= 4
##$PSIGN= 0
##$PYNMP= <proc.py>
##$REVERSE= no
##$SF= 400.02
##$SI= 32768
##$SIGF1= 0
##$SIGF2= 0
##$SINO= 400
##$SIOLD= 32768
##$SPECTYP= <>
##$SREGLST= <1H.CDCl3>
##$SSB= 0
##$STSI= 32768
##$STSR= 0
##$SW_p= 8223.68421052631
##$SYMM= 0
##$S_DEV= 0
##$TDeff= 65536
##$TDoff= 0
##$TI= <>
##$TILT= no
##$TM1= 0
##$TM2= 0
##$TOPLEV= 0
##$USERP1= <user>
##$USERP2= <user>
##$USERP3= <user>
##$USERP4= <user>
##$USERP5= <user>
##$WDW= 1
##$XDIM= 32768
##$YMAX_p= 433783344
##$YMIN_p= -695170
##$CURPLOT= <Network HP LaserJet P1505>
##$CURPRIN= <$Network HP LaserJet P1505>
##$DFORMAT= <normdp>
##$LAYOUT= <+/1D_H.xwp>
##$LFORMAT= <normlp>
##$PFORMAT= <normpl>
##$SURQMSG= 1
$$ End of Bruker specific parameters
$$ ---------------------------------
##NTUPLES= NMR SPECTRUM
##VAR_NAME=  FREQUENCY,     SPECTRUM/REAL,   SPECTRUM/IMAG
##SYMBOL=    X,             R,               I
##VAR_TYPE=  INDEPENDENT,   DEPENDENT,       DEPENDENT
##VAR_FORM=  AFFN,          ASDF,            ASDF
##VAR_DIM=   32768,         32768,           32768
##UNITS=     HZ,            ARBITRARY UNITS, ARBITRARY UNITS
##FACTOR=    0.250966925370066, 1,           1
##FIRST=     8223.43324360094, 5839,         -107405
##LAST=      0,             -53186,          -146568
##MIN=       0,             -695170,         0
##MAX=       8223.43324360094, 433783344,    0
$$ Real data points
##PAGE= N=1
##DATA TABLE= (X++(R..R)), XYDATA
$$ [...]
19572E4593L791a03814c108j03735G8476b61200C8297O3234J98314d2960E6437
19560d921l16549h6902A10750e0767C40749D4646M8981B5042a09101G5513f525
19548a04509n2521k25210a18230k3843K9625A4994b91817A76357a06976j60215
19538b67191p6939B0175c2163j54387A6130c14284A31899E480a14971l27093h2274
19526c40028a39728O8197m5437j34480A29429i4453D67428a49581d4681G9377
19515C6869K55955G0077a47162q7421a0551n7261A50501N0752c6930n3417C22685
19503B1150J92869d568B56226e6309j73412d0556o9640m4334B85980b17114g5273
19491a20061N947A03176b22732G5953K5553g2476k01558b266k42199j5549j03402
$$ plain form
19572 54593 58384 -103814 -3108 -106843 78476 -261200 38297 101531 299845 -42960 56437
19560 -4921 -321470 -86902 110750 -50767 340749 44646 93627 25042 -109101 75513 -6525
19548 -104509 -157030 -382240 -118230 -142073 -112448 14994 -291817 176357 -106976 -267191
19538 -267191 -344130 20175 -32163 -186550 16130 -314284 131899 5480 -114971 -442064 -82274
19526 -340028 -139728 -71531 -116968 -251448 129429 -94453 467428 -149581 -44681 79377
19515 36869 292824 70077 -147162 -234583 -10551 -67812 150501 201253 -36930 -90347 322685
19503 21150 214019 -4568 256226 -56309 -229721 -40556 -110196 -154530 285980 -217114 -75273
19491 -120061 -114114 103176 -222732 75953 101506 -72476 -274034 -2266 -244465 -260014 -363416
19480c63416A70779k6598i0991k44764A16041b29573K1144c2700C1356h5854q6494
19469a72348A6891J85319F330J02024a15782o1426Q5694A47115a67017J9479B11562
19457A05706c13305J08539L0362h5541B7184J26766b9343C585b50018L9130G3582
19445g3970n5360e0116l07673i394M235k87791g2122m5731m4813O9686l4106B23035
19432g198A9653b25095g4672K5317j70301A63047J29481a43479D2751b15418K4079
19421a91339B33732h0213j68589c3762D7185A0084K20522d8151j18937A31902
19410a69548H4047b54815Q6682I4511b46662f9089q373A67647i2577n860j28750
19399b27187F2011M7203f9116B8939b17213O6568j85995B537P8098l2497b25864
$$ plain form
19480 -363416 170779 144181 -90991 -335755 116041 -229573 -208429 -32700 31356 -85854 -172348
19469 -172348 16891 202210 6330 108354 -115782 -177208 -91514 147115 -167017 -147538 211562
19457 105706 -313305 -204766 -174404 -85541 27184 153950 -29343 3585 -250018 -210888 73582
19445 -73970 -129330 -50116 -357789 -9394 -5159 -292950 -72122 -117853 -162666 -92980 -127086 223035
19432 -7198 19653 -225095 -74672 -49355 -219656 163047 292528 -143479 42751 -215418 -191339
19421 -191339 233732 -80213 -248802 -33762 47185 10084 230606 -48151 -167088 131902
19410 -169548 84047 -254815 -168133 94511 -246662 -69089 -77462 167647 -92577 -98437 -227187
19399 -227187 62011 109214 -69116 28939 -217213 -150645 -336640 2537 80635 48138 -225864
19387a13630A01634a52203H0297J53187G3606b3876B697g4788p4196O9220A59961
19375a85l82814b4430C07637h7449F2581J78368a4895j28153l4804Q6545K3371
19364f7936C6916c03567h9023d1084k09331c7076j01024b5454A30620i7524A52352
19352b98896c5862j17308b2687p1342k5362D6634O9932D7825b33236d2217C7905
19340i7147M541B2101b11913j52815J30655g3366A01254F941Q8614E561J07855
19329A13416N4606E6502R173l2033J80965B2016Q2572b16529A02125R310a21969
19317b90105A35926a76484a4248r9576c196j18406A08467c47801G4476c43550
19306F0561e9629D091J4635b63006A05898g6718q3596e127C75238D6348e51919
$$ plain form
19387 -113630 101634 -152203 80297 233484 73606 -23876 2697 -74788 -148984 -79764 159961
19375 -185 -382999 -24430 307637 -87449 62581 240949 -14895 -143048 -177852 -91307 -67936
19364 -67936 36916 -303567 -89023 -41084 -250415 -37076 -138100 -25454 130620 -97524 152352
19352 -298896 -35862 -153170 -22687 -94029 -119391 46634 116566 47825 -233236 -42217 37905
19340 -97147 -92606 22101 -211913 -364728 -234073 -73366 101254 6941 95555 5561 113416
19329 113416 168022 56502 65675 33642 214607 22016 104588 -216529 102125 111435 -121969
19317 -290105 135926 -176484 -14248 -113824 -3196 -121602 108467 -347801 74476 -343550
19306 60561 -59629 4091 18726 -263006 105898 -76718 -160314 -5127 375238 46348 -551919
19294c5473J3083j45508j09904G4688K70958a4575l21984g6891j18168A7639e51
19282c14428J05977m5151c6335A22573l7609b48010A98022B1969B704a74617e706
19270a72612A32571a3800j50877f9780p4987q0374a04765m0767A90778a34374
19259a39015E1378f8630A0047J47165a53324G9872a34747A61912n7524a31342
19248a91813L3043A08309a02733j86896J30283f976E4738K18846a35601N3958
19238h1643l27313b207o8254p327j53159a11218A15161a95839A8814J94213D2258
19226b05673j6835G8205a01137l2217F6503A4456a60421C3746K8329K6524D3227
19214a09054k47181a518l6608A69481a78474A18954D0956R0924a70588B3040f9398
$$ plain form
19294 -35473 -22390 -167898 -277802 74688 345646 -14575 -336559 -76891 -195059 17639 -551
19282 -314428 -208451 -253602 -36335 122573 84964 -248010 198022 21969 2704 -174617 -5706
19270 -172612 132571 -13800 -164677 -69780 -144767 -225141 -104765 -145532 190778 -134374
19259 -139015 51378 -68630 10047 157212 -153324 79872 -134747 161912 104388 -131342
19248 -191813 -158770 108309 -102733 -289629 -159346 -6976 54738 273584 -135601 -81643
19238 -81643 -408956 -2207 -70461 -77788 -230947 -111218 115161 -195839 18814 213027 42258
19226 -205673 -222508 78205 -101137 -133354 66503 14456 -160421 33746 62075 88599 43227
19214 -109054 -356235 -1518 -38126 169481 -178474 118954 40956 131880 -170588 23040 -69398
19202g1320J4718E1670b82705J18159C68625a95000d8257r512k05690i7635R932
19191h7703F226N075h3312n6969B83238a73499A00913b44929f9826K8227C8312
19179a87227D363a71141B1931a54399d7950k2336l643A52054b84557B42588a36914
19167a42265c3747E4593K7024b33358c9051A105d18014e8929I8031c64392B31651
19155b17771r1353a04339H2238A2761a54531J2248a4656B22300b17726g624D4663
19143c5129l31207B30896b53394a11030b8442l9505H1379B3880a63370Q1335j43532
19132b25567i9767q7056E6062a76588c8797j82463B20871b17989f493k97450c1166
19120B17844J84246a06388j24385I1252b4392A79406d2236N571H7259a53344o527
$$ plain form
19202 -71320 -56602 51670 -282705 -164546 368625 -195000 -48257 -57769 -263459 -97635 -87703
19191 -87703 6226 11301 -83312 -140281 283238 -173499 100913 -244929 -69826 -41599 38312
19179 -187227 4363 -171141 21931 -154399 -47950 -70286 -73929 152054 -284557 242588 -136914
19167 -142265 -33747 54593 81617 -233358 -39051 1105 -418014 -58929 98031 -364392 231651
19155 -217771 -309124 -104339 82238 12761 -154531 -142283 -14656 222300 -217726 -7624 44663
19143 -35129 -366336 230896 -253394 -111030 -28442 -67947 81379 23880 -163370 -82035 -225567
19132 -225567 -99767 -186823 56062 -176588 -38797 -221260 220871 -217989 -6493 -303943 -31166
19120 217844 402090 -106388 -230773 91252 -24392 179406 -42236 -36665 87259 -153344 -159871
19109a59871k27746B0765c3152F343g6169J380A35034A520a63936b9471F8165
19097a39923H5647K71652A23151a21859n0260A62087a04849p177e2843B78402
19086c12876E0630a4647m07497C8075d55282C2042J09006F0016b7253j8716q2805
19075a28774A54329J69562b9141j5829j6958j80050D6545K24309c35616J00348
19065b35268L5384c1930O429m8849C6806b14533h4803A61049B5534a06781J6514
19054i0267j80988E6772a23250j0762e8510B8365b87900A02969g9234f36A33547
19042a46342K1102e7465j59672A85646a23079n9803H2486b43038e423C5101K1834
19031E6935e515F0963k60J00368K07882j28969a23877O1150A75452b19824A4083
$$ plain form
19109 -159871 -387617 20765 -33152 6343 -76169 -74789 135034 1520 -163936 -29471 68165
19097 -139923 85647 357299 123151 -121859 -172119 162087 -104849 -112026 -52843 278402
19086 -312876 50630 -14647 -422144 38075 -455282 32042 141048 60016 -27253 -45969 -128774
19075 -128774 154329 323891 -29141 -44970 -61928 -241978 46545 270854 -335616 -235268
19065 -235268 -199884 -31930 -25501 -74350 36806 -214533 -84803 161049 25534 -106781 -90267
19054 -90267 -271255 56772 -123250 -134012 -58510 28365 -287900 102969 -79234 -636 133547
19042 -146342 -125240 -57465 -217137 185646 -123079 -182882 82486 -243038 -5423 35101 56935
19031 56935 -5515 60963 60703 161071 368953 239984 -123877 -62727 175452 -219824 14083
19019d2469A67464a3363I3937K8475b79347J30534j60697a7518k47358B18678
19008B01154J0196B8817J38126a79199j63544F371a5901l09919C3408b2345k72514
18997b94859j13105a57121H1382P1828a5941A63448B7993J13a11051j42379A41912
18985d00992K3069d7566k10389A37039F7946a59175B12185e3715A54787f4121
18974f0086J7474A55931m2130a34949A50659a19223b1585C590h3151m1091j11646
18963b35888I205O5550a74621P682C6055b0777B01655b64498J25480k509B65463
18951E8480a04969I0763B7664b61755e2082b5237j60296C6566a37645a1049n7362
18940f8411A8635a43488C3214a7281l45595f9451C6007b38975O2008M3726K8396
$$ plain form
19019 -42469 167464 -13363 93937 122412 -279347 -148813 -309510 -17518 -264876 218678
19008 201154 211350 28817 166943 -179199 -342743 6371 -15901 -325820 33408 -22345 -294859
18997 -294859 -407964 -157121 81382 153210 -15941 163448 27993 28106 -111051 -253430 141912
18985 -400992 -377923 -47566 -257955 137039 67946 -159175 212185 -53715 154787 -64121
18974 -60086 -42612 155931 113801 -134949 150659 -119223 -21585 3590 -83151 -124242 -235888
18963 -235888 9205 74755 -174621 -166939 36055 -20777 201655 -264498 -139018 -141527 265463
18951 58480 -104969 90763 27664 -261755 -52082 -25237 -185533 36566 -137645 -11049 -68411
18940 -68411 18635 -143488 33214 -17281 -362876 -69451 36007 -238975 -176967 -133241 -104845
18929a04845a3867k3429A01798a41037e5455j41978B27154B4055J92760a23992
18918B24728b35274a03231r0162h7655p1899F3764c3696r7298p486A55292b66043
18906i8845k32409f5792A23024a1207r3653A79602a187B21956a32198k4720B12003
18894b50356J20975n8879N2433k59917I7243c59951a63328A5914h8392D8889R5885
18883A44774g7467e9k40108d5563m6041j77068E3598J60047b26664e2532D8217
18871B1813h0813j44608a02621m01056a07537H3956e10194A44510F568d6782H4195
18859c20787d0652Q703j02928G1897A4632c18332J12424B11388c91074a05278
18848B02743O1099J83111h1603B80772A07680a80169g6818D580J62762C1003d94316
$$ plain form
18929 -104845 -13867 -37296 101798 -141037 -55455 -197433 227154 24055 216815 -123992
18918 224728 -235274 -103231 -193393 -87655 -159554 63764 -33696 -130994 -138480 155292 -266043
18906 -98845 -331254 -65792 123024 -11207 -104860 179602 -1187 221956 -132198 -156918 212003
18894 -250356 -129381 -188260 -135827 -395744 97243 -359951 -163328 15914 -88392 48889 144774
18883 144774 -77467 -59 -240167 -45563 -91604 -268672 53598 213645 -226664 -52532 48217
18871 21813 -80813 -225421 -102621 -503677 -107537 83956 -510194 144510 6568 -46782 84195
18859 -320787 -40652 -31949 -134877 71897 14632 -318332 -205908 211388 -391074 -105278
18848 202743 263842 446953 -81603 280772 107680 -180169 -76818 4580 167342 31003 -494316
18836b2243k14932R3543B4805h2298c9509k83239a2994A62095K1070c53618B77153
18824a51087c3482A14226c54690J34323C11086a07644j38194J20342A07688a1019
18813B6647b6510A81628a12420C01864b661j50896B46950a2310A69960b4997A20173
18801b93171D174b5087E4239a21057c3216j20263A03063J90431B8888c07109a6782
18789a21127A88769j7590p9921P6691b51716q0562i6635I8883b9842k2989j55098
18778b07929A06542l1117c8513l09791i8729J4966j29302B2259a73856k11906
18768c85762F4408c5100D7328e1785B2909c02109b900l225H393J27420A2581a97676
18755b60452a9471k88942G3406a93043N1404o4216C6399b63498R9328a922j12302
$$ plain form
18836 -22243 -237175 -143632 24805 -82298 -39509 -322748 -12994 162095 183165 -353618 277153
18824 -151087 -33482 114226 -354690 -220367 311086 -107644 -245838 -125496 107688 -11019
18813 26647 -26510 181628 -112420 301864 -2661 -153557 246950 -12310 169960 -24997 120173
18801 -293171 4174 -25087 54239 -121057 -33216 -153479 103063 293494 28888 -307109 -16782
18789 -121127 188769 171179 91258 167949 -251716 -332278 -96635 98883 -29842 -52831 -207929
18778 -207929 106542 75425 -38513 -348304 -98729 -83763 -213065 22259 -173856 -385762
18768 -385762 64408 -35100 47328 -51785 22909 -302109 -2900 -6125 8393 135813 12581 -197676
18755 -260452 -19471 -308413 73406 -193043 -141639 -205855 36399 -263498 -164170 -1922 -114224
18744a14224d0885g666H2952E739J337a38509k25498h5909o589P324K1956A36608
18731b2918A52263D2622b51203a02117j36127i0660B03293a31281O1942B20981
18720b27827A5316i0335I5395C8438d41934a38627c1745k74067g6367R346k2386
18709h9407r0535I0779b90487m695A13388R038B4158b10937a245m0853B3876n251
18697A8625J09555H332e7414p0146A79881a21822A0180P8867J71345a44659O5312
18686g9347K3627A11337l5154h6748k52980a5817j08093C752b10967A48824C2431
18674b74212M9868b6220k26617a17496B9838o56g654A83866o0184h4285j75832
18663b60117B05115r6143h339l12990R9669J05168A81804i9287L1448Q722j1687
$$ plain form
18744 -114224 -40885 -7666 82952 5739 7076 -138509 -364007 -85909 -92498 -85174 -63218 136608
18731 -22918 152263 42622 -251203 -102117 -238244 -90660 203293 -131281 -69339 220981
18720 -227827 15316 -90335 95395 38438 -441934 -138627 -31745 -305812 -76367 -67021 -89407
18709 -89407 -179942 90779 -290487 -295182 113388 122426 24158 -210937 -1245 -42098 23876 18625
18697 18625 128180 8332 -57414 -127560 179881 -121822 10180 89047 260392 -144659 -79347
18686 -79347 -55720 111337 76183 -86748 -339728 -15817 -123910 3752 -210967 148824 32431
18674 -274212 -224344 -26220 -252837 -117496 29838 29182 -7654 183866 123682 -84285 -260117
18663 -260117 205115 108972 -8339 -321329 -221660 -116492 181804 -99287 -67839 -59117 -70804
18652g0804C4725a39098d4112a8175j35403N1060k10004A7173a60230c4270H0591
18640g5847l7969I8796i0122j91537B81882b812k93725l6001A98168c1610k56041
18629b87651A03738j3653b25548R2638b4405A57743N5087a74353A78466b67260
18618e41884A54357k8571I036b38102A76210a47390A24425c05392G8579a37648
18607a96562J62H5234b12709e7803k07792B74814c05334B60089d9256m3870L1105
18596f2021A39267h8293I886L6324A3483b7708j85374A82336a345C5883n607J91080
18584B21356a0946m83323A57155a69262k8690N9135D8906a93175a7329l0962f701
18572h7266K018j89222B45324H437f7724j06090A74776E0190a00522C2050K10103
$$ plain form
18652 -70804 34725 -139098 -44112 -18175 -153578 -102518 -312522 17173 -160230 -34270 80591
18640 -75847 -113816 98796 -90122 -281659 281882 -2812 -296537 -332538 198168 -31610 -287651
18629 -287651 103738 90085 -225548 -132910 -24405 157743 212830 -174353 178466 -267260
18618 -541884 154357 125786 9036 -238102 176210 -147390 124425 -305392 78579 -137648
18607 -196562 -196400 85234 -212709 -57803 -265595 274814 -305334 260089 -49256 -93126 -62021
18596 -62021 139267 -88293 9886 46210 13483 -27708 -213082 182336 -1345 35883 30276 221356
18584 221356 -10946 -494269 157155 -169262 -197952 -138817 48906 -193175 -17329 -48291 -6701
18572 -87266 -85248 -274470 245324 8437 -67724 -173814 174776 50190 -100522 32050 242153
18561B42153c6872A36970D9536g9732c6574l68631a44981M6983j46758A78656
18550I9137f6553B19375I719e0013j00785l4363R0897r7746p5822B36352P9848
18539C16200g6956B57745i8400c144B04195F2103a48894I8500d07297A6089Q994
18528B5083J8211J8030d0059k15680e4818A16429a17636b7895j70419a2365C14198
18516a21263A48660g9554c9551A1137a64961B37667P490B8915M16135C1779K128
18505C3907d4911J1244m0229B5687a32902d02m47657c1677B04082b44287G4337
18493b83634K5687A62348b6001D4388M0636a45686l04952a99530C642L2041J16975
18482A52658C1745K04951a21939o784a9989E4171b7262a024j55962C33793b14098
$$ plain form
18561 242153 -36872 136970 49536 -79732 -36574 -405205 -144981 -97998 -244756 178656
18550 99137 -66553 219375 9719 -50013 -150798 -185161 -94264 -192010 -267832 236352 316200
18539 316200 -76956 257745 -98400 -3144 204195 62103 -148894 98500 -407297 16089 25083
18528 25083 43294 61324 -40059 -255739 -54818 116429 -117636 -27895 -198314 -12365 314198
18516 -121263 148660 -79554 -39551 11137 -164961 237667 245157 28915 445050 31779 33907
18505 33907 -44911 -33667 -73896 25687 -132902 -402 -448059 -31677 204082 -244287 74337
18493 -283634 -257947 162348 -26001 44388 85024 -145686 -450638 -199530 3642 35683 152658
18482 152658 31745 236696 -121939 -128723 -19989 54171 -27262 -1024 -156986 333793 -214098
18470A26586h5293j91414i4024D3967a06407M3680A31415h0710q9384r5222f391
18458B14769c4163q9632E9090J73423G6316M683k8293j2145j4319Q3706b48878
18446a78784A1764a33821A0996J30906J97789f8218o8365k31275h9348r6495I8384
18434A04418e0567q2102r1688C96609c54276A11132B0362e8878F3645J65022j09907
18423A18760h0079k71221a41828l8352A26425E1837b2025l23974A96096E5737
18412B26248m0090I237a87487h6347p2359E5435Q3253D0024J25593B7963a23431
18400a11568E9927d3548A2038d97208k0568K1213g7196D6602a17890n2582j2280
18389a82752j71396N2469R9236H4324K19374K9833i8050J4900k4431M9704n9087
$$ plain form
18470 126586 -85293 -276707 -94024 43967 -106407 -62727 131415 -80710 -170094 -265316 -6391
18458 214769 -34163 -123795 59090 232513 76316 80999 52706 40561 26242 109948 -248878
18446 -178784 11764 -133821 10996 141902 339691 -68218 -136583 -367858 -89348 -185843 98384
18434 104418 -50567 -132669 -224357 396609 -354276 111132 20362 -58878 63645 228667 118760
18423 118760 -80079 -351300 -141828 -180180 126425 51837 -22025 -345999 196096 55737
18412 226248 186158 9237 -187487 -86347 -158706 55435 138688 40024 165617 27963 -123431
18400 -111568 59927 -43548 12038 -497208 -517776 -496563 -77196 46602 -117890 -170472 -182752
18389 -182752 -354148 -301679 -202443 84324 303698 333531 -98050 -83150 -107581 -57877 -116964
18378a16964o1687O021C43804r0435H0722J60380a68079P6298E9096L4171b13400
18366D72269a06425I3634J57h1768m8928C38989A3368a59223A49039C7564f1240
18354E7338a76625Q4516k1195j2675F9915l3401i5798q5840C0573c69992A50797
18342A03256a21653n8230H9347C172N8318d914k74534C35659B1464a46151A26176
18330c16963A55684a11054l4230j58640J24729A43959a89967m9191B98378d604
18319d9925G5034b18147i5307j39063a08385K0112A10729D3270g1440D14770A70120
18307f2749K6863B19185d846I4184a34709A19091f3446B32429g8723K7512A67066
18295g173j08741A45581a59309N827C52554C2017K2061J11475h2015A24831J17587
$$ plain form
18378 -116964 -178651 -172630 343804 253369 80722 241102 -168079 -91781 59096 93267 -213400
18366 472269 -106425 93634 93791 -81768 -130696 338989 13368 -159223 149039 37564 -61240
18354 57338 -176625 -92109 -113304 -125979 69915 36514 -95798 -181638 30573 -369992 150797
18342 103256 -121653 -179883 89347 3172 61490 -4914 -279448 335659 21464 -146151 126176
18330 -316963 155684 -111054 -145284 -303924 -179195 143959 -189967 -239158 298378 -4604
18319 -49925 75034 -218147 -95307 -234370 -108385 -88273 110729 43270 -71440 414770 170120
18307 -62749 -35886 219185 -4846 94184 -134709 119091 -63446 232429 -78723 -51211 167066
18295 -7173 -115914 145581 -159309 -153482 352554 32017 54078 165553 -82015 124831 242418
18284B42418k6432e1795B17883a23672J6502L1777G2506c32781c2366A62364a14579
18272C9112a02768A34781a46169L0324N5950F0668L094M10007a90175K3686c7407
18260a67583a7113F1439O7283b10781A56435c1160r516o7289H3882a0877p0713
18249h1590r4424A18514b29327J06212r3995a07933r8529M3351n4845K1910K9506
18238a66540C3196K6999J6519M6117a45434A30984g6931j38940R6005R71j1090
18227a29985j24573c1959r0726A54745a51973A16735a69935C07812A8965M1321
18217F0286A3348b27717p9978F7168f4499n8952k8642B02781a85837g8178A59110
18205B2062g528k53467B23706i6456A09828k8188b60818i2993k39549a37993n9479
$$ plain form
18284 242418 215986 -51795 217883 -123672 -107170 -75393 72506 -332781 -32366 162364 -114579
18272 39112 -102768 134781 -146169 -115845 -59895 60668 63762 473769 -190175 -166489 -37407
18260 -167583 -17113 61439 128722 -210781 156435 -31160 -40676 -107965 83882 -10877 -81590
18249 -81590 -176014 118514 -229327 -123115 -217110 -107933 -206462 -163111 -217956 -196046 -166540
18238 -166540 33196 60195 76714 122831 -145434 130984 -76931 -215871 -119866 -118895 -129985
18227 -129985 -254558 -31959 -122685 154745 -151973 116735 -169935 307812 18965 60286
18217 60286 13348 -227717 -307695 67168 -64499 -123451 -152093 202781 -185837 -78178 159110
18205 22062 -7528 -260995 223706 -96456 109828 81640 -260818 -92993 -332542 -137993 -197472
18194a97472L7929B3225d31733G8650K1852b41116i7038G7279J2443B2572O6967
18183H9539m0905i5224C53050c41159B9201R3384a86624A87449b64993J30783
18173a34210D35355e1108j29956A44743M363a14242A08723a06815r3173B223J12084
18162A14307D3899a22872j04675D2405a75792A23274g0450k36878K0297q036G2221
18150B99378j30329i1805n0137j27798R6049L7844A64751a65266B7500K2756I30
18138B119J51164n6450d03509A68275D412K62986k9457g7149j64470a04967r7235
18127b02202h3152q6138K3067A22411e9993F2890a57653M7139k52919A43641d7816
18115b5634A03887b65111a20675A10327a26832f1162B51070d291C188a25322D4507
$$ plain form
18194 -197472 -159543 23225 -431733 78650 100502 -241116 -97038 77279 89722 22572 89539
18183 89539 48634 -95224 353050 -341159 29201 122585 -186624 187449 -264993 -134210
18173 -134210 435355 -51108 -181064 144743 149106 -114242 108723 -106815 -199988 2223 114307
18162 114307 43899 -122872 -227547 42405 -175792 123274 -70450 -307328 -287031 -295067 72221
18150 299378 169049 -91805 -141942 -269740 -173691 -135847 164751 -165266 27500 50256 930
18138 2119 153283 96833 -403509 168275 4412 267398 237941 -77149 -241619 -104967 -202202
18127 -202202 -83152 -169290 -146223 122411 -59993 62890 -157653 -110514 -363433 143641 -47816
18115 -25634 103887 -265111 -120675 110327 -126832 -61162 251070 -4291 3188 -125322 44507
18103b90845c945F1240d7716B1837a19384d1391F7474M0220C8728K07579i6526
18091a70732A18456E8469b21418A9166h303d76j36821C18042b3514q240D7735
18079a23632A24320J16715a71627H9999M8323b54947d0386k48012G1570a45270
18068c36131B96898B3289b3836A33702l725a95576B5553c44663a26620m6027P6091
18057i6556G7180a94022A3314a40619o5378d7615j42674H0785D349J62916f5885
18045c42738B27595a273j73966j20073G9728p208a85070g884A08041R420a06772
18033a31307A4967b8075k41940E4245Q5157m3356b48079C7253b55574A65326G3044
18021a34956e0075p8920m3406A1554K37976m5343i9737o2270o346m3688R4552
$$ plain form
18103 -290845 -3945 61240 -47716 21837 -119384 -41391 67474 107694 38728 246307 -96526
18091 -170732 118456 58469 -221418 19166 -8303 -476 -137297 318042 -23514 -31754 47735
18079 -123632 124320 241035 -171627 89999 138322 -254947 -40386 -288398 71570 -145270
18068 -336131 296898 23289 -23836 133702 129977 -195576 25553 -344663 -126620 -172647 -96556
18057 -96556 77180 -194022 13314 -140619 -205997 -47615 -190289 80785 4349 167265 -65885
18045 -342738 227595 -1273 -175239 -295312 79728 72520 -185070 -7884 108041 117461 -106772
18033 -131307 14967 -28075 -270015 54245 139402 96046 -248079 37253 -255574 165326 73044
18021 -134956 -50075 -128995 -172401 11554 249530 204187 -99737 -162007 -168353 -212041 -117489
18010a17489k1588k37885J70360j29981J38674A3262L5853j7139L8548a03642
17999a49395A20065b36251R3949b4584C8813b42408e3853k6760A11681g258l8026
17988d5284k9785O14G096a78302d8569k04911A53319n6538K19823b99617a40079
17976b9455k5147C48033F8621J05432a56339n708B30793b40702H1688J1171a28038
17964C45014A32322a13130B16544a60780a7598B1640J1161a07858A29153e9404
17953G7972e8702K2110I906b83429A85494b40195d4874m51k56966a0891B29159
17941e5157A68060c59198E8645a2336l18932A14904a06667k48757a70724C9389
17930b49684a16199q7604A17806a38241A1452M11837a18716K0523A39491j2926
$$ plain form
18010 -117489 -139077 -376962 -206602 -336583 -197909 13262 49115 31976 70524 -103642
17999 -149395 120065 -236251 -142302 -24584 38813 -242408 -53853 -80613 111681 -7258 -45284
17988 -45284 -75069 -74455 7096 -178302 -48569 -253480 153319 96781 316604 -299617 -140079
17976 -29455 -54602 348033 68621 174053 -156339 -162047 230793 -240702 81688 92859 -128038
17964 345014 132322 -113130 216544 -160780 -17598 21640 32801 -107858 129153 -59404
17953 77972 -58702 -36592 9906 -283429 185494 -240195 -44874 -45325 -302291 -10891 229159
17941 -55157 168060 -359198 58645 -12336 -331268 114904 -106667 -355424 -170724 39389
17930 -249684 -116199 -203803 117806 -138241 11452 423289 -118716 -98193 139491 126565
17920A26565a71871L4625A44945a23184L8347C2785b36123H5073a52746c9439
17909A07524R7853q3748a17234r4904B75926d2536D6454H894K42351a80397l08601
17898d88998a45855r4528R3098b29G6722e5062A14208a43958A09126a17277j21804
17887b39081h806I5359L4233m4811M2691a12868A47300f8939C07733c50543A46831
17875a28301A05438g92j0716j5012l35969A4550i5641C6014Q5871R9249k9737
17864A91397J42294o2493a94632B8147J84972e7487H567a31290K2220A94317a44056
17852B54412b2797j77334d498r044A80771p7579R9667k2388J85417a55142p0194
17841b25336k01906D1738b6157o7988h044A68567C8628A2271J15018a44157b2553
$$ plain form
17920 126565 -171871 -137246 144945 -123184 -84837 32785 -236123 85073 -152746 -39439
17909 107524 205377 121629 -117234 -212138 275926 -42536 46454 8894 251245 -180397 -488998
17898 -488998 -145855 -240383 -147285 -229 76722 -55062 114208 -143958 109126 -117277 -239081
17887 -239081 -8806 95359 129592 84781 127472 -112868 147300 -68939 307733 -350543 146831
17875 -128301 105438 -792 -11508 -26520 -362489 14550 -95641 36014 121885 221134 191397
17864 191397 333691 271198 -194632 28147 213119 -57487 8567 -131290 -109070 194317 -144056
17852 254412 -22797 -200131 -4498 -13542 180771 103192 202859 180471 365888 -155142 -225336
17841 -225336 -427242 41738 -26157 -94145 -8044 168567 38628 12271 127289 -144157 -22553
17829g0710j41292A00689m6252k120O0869I166N7940c50623A20862m491l7646
17818G8725J67390H1209B5345J36652h5021C1714c3151a2361p6583A05870a70772
17806C43736B9663b60570A64701d5870A82316b89953c1503m7800c1850p79a2393
17794a06035j11408G5722R6576a77414B88509o6347j06836g6743L2604k73854
17784c17993B01301J02006F9705a02824l8553I3245h0243L2667C4706P582J26309
17773A68597J03903e1023A6150i110A08696M7609E9384b2900B61291Q5088a94051
17761A51535B737L21260b56747A88593Q1728A25443e6011j36474j432A97208D7217
17749E5112K140q109h5930K2417I5191N1812g1818j073q2966A00450c6732D8083
$$ plain form
17829 -70710 -212002 100689 54437 52317 113186 9166 67106 -350623 120862 116371 78725
17818 78725 246115 81209 25345 161997 -85021 31714 -33151 -12361 -88944 105870 -170772
17806 343736 29663 -260570 164701 -45870 182316 -289953 -31503 -79303 -31850 -32629 -12393
17794 -106035 -217443 75722 172298 -177414 288509 222162 115326 -76743 -44139 -317993
17784 -317993 201301 303307 69705 -102824 -141377 93245 -80243 -47576 34706 42288 168597
17773 168597 272500 -51023 16150 -9110 108696 156305 59384 -22900 261291 346379 -194051
17761 151535 2737 323997 -256747 188593 270321 125443 -56011 -192485 -193917 197208 47217
17749 55112 57252 49143 -85930 -63513 95191 147003 -71818 -72891 -155857 100450 -36732 48083
17736A6089b78897A12229a81253b8096A94220e3207a2705k89721B00517n9435
17726A41082K1064M1369J54924b18355I2296b10468f8368a8402J115j2509A17360
17714B19653j01969G166O3056a60360A03595h6137A94003b04010A3689i6860j10553
17703b07413R8103A02495R4144F8357j7499Q7293c21177A56478B5540R6653B8031
17691a63027l5231k5290D2466A9120c5594A53954m0058Q291h1220Q092B94037
17679D5571N6070b25390i0418L7943k64842B58320J91076A75952K04840j53014
17669B27778j5852a4473G5721d6545B8225c7524F4998F979Q5698K4967L8938b2100
17656E1818k2727J76753b26170a8195A34546a64328C952P161O2169d902F6115
$$ plain form
17736 16089 -278897 112229 -181253 -28096 194220 -53207 -12705 -302426 200517 141082
17726 141082 162146 203515 358439 -218355 92296 -210468 -68368 -18402 -17287 -29796 117360
17714 219653 117684 7166 70222 -160360 103595 -86137 194003 -204010 13689 -96860 -207413
17703 -207413 -109310 102495 196639 68357 50858 138151 -321177 156478 25540 122193 28031
17691 -163027 -198258 -223548 42466 19120 -35594 153954 113896 122187 -81220 -73128 294037
17679 45571 101641 -225390 -90418 -52475 -317317 258320 449396 175952 380792 227778
17669 227778 211926 -14473 75721 -46545 28225 -37524 64998 6979 92677 117644 156582 -22100
17656 51818 29091 205844 -226170 -18195 134546 -164328 3952 11113 73282 -4902 66115
17644b63593e5349a0610j25046D7486a4334B47328c5982C8986h6879p1546A7996
17632A57107J57770j27075b041F5352d4256A03725a24740A75217J25694a47557
17621B03649m8084j5064f7439A55814K40591A25280a45169B4156a6945A47376
17610a48958l5409O7489m794D1126h4041j58910A50413b01596a5326l1156D0257
17598A51998p3557A232M6031h0476j36148e77D0073a04629C05533A03046f6824
17586I8914D0543b40882E0848j7732J06333h8659B53423g4454b3888l7148A66625
17574e5386C21164H9095b29335B21593c4469H9023c7562B9153K1441R8216B4471
17562A06193a54802g3232A81968e2818j3328A8460K54825d9652A93558P9024G2909
$$ plain form
17644 -263593 -55349 -10610 -135656 47486 -14334 247328 -35982 38986 -86879 -158425 17996
17632 157107 314877 187802 -2041 65352 -44256 103725 -124740 175217 300911 -147557
17621 203649 155565 140501 -67439 155814 396405 125280 -145169 24156 -16945 147376
17610 -148958 -184367 -116878 -121672 41126 -84041 -242951 150413 -201596 -15326 -46482 40257
17598 151998 78441 1232 47263 -80476 -216624 -577 40073 -104629 305533 103046 -66824
17586 98914 40543 -240882 50848 33116 139449 -88659 253423 -74454 -23888 -61036 166625
17574 -55386 321164 89095 -229335 221593 -34469 89023 -37562 29153 50594 148810 24471
17562 106193 -154802 -73232 181968 -52818 -66146 18460 273285 -49652 193558 272582 72909
17550A1433f1613I0711a44862G700a2958D3667K36306K7573f330I8126e6388A94426
17537B01869a67309B16994m6422E4148a4937j04549J7865J4899a0194B44375j12390
17526A31985c01371A1561K98940D8290M3195h4968C98091A38112K1204j4872L3301
17515A77745a21888A27115d0568H2898a21549k22536a11091c2218k5027r3333
17505a50578q6985B32524b08549D0346a19227A52442B7292J24912k9761b7256
17494I8115b1738p9178e260l0229A04726a51241C6372R3441J18277G5838g0899
17482A99747b99539A03073N4212F9382J61927b49443B41921r294p0345n6123Q40
17471A06999a66480B32639L76383k85989k8640k0739b8569C69677A50023C0198
$$ plain form
17550 11433 -61613 90711 -144862 7700 -12958 43667 279973 307546 -6330 98126 -56388 194426
17537 201869 -167309 216994 170572 54148 -14937 -119486 -101621 -86722 -10194 244375 131985
17526 131985 -301371 11561 310501 48290 91485 -84968 398091 138112 159316 144444 177745
17515 177745 -121888 127115 -40568 82898 -121549 -344085 -111091 -32218 -57245 -150578
17505 -150578 -237563 232524 -208549 40346 -119227 152442 27292 152204 122443 -27256
17494 98115 -21738 -100916 -5260 -35489 104726 -151241 36372 129813 248090 75838 -70899
17482 199747 -299539 103073 157285 69382 231309 -249443 241921 232627 162282 106159 106999
17471 106999 -166480 232639 609022 323033 294393 273654 -28569 369677 150023 30198
17460b1193a366D5768b08755B63164H434K56292a53536B82487o1905m834K93441
17449E09189A40093M34320L788k73628C6099K02929G0949J16578O3296H114K49832
17438B57946L6980g5570I6146K10045m2517j30701J47525j20212j982d039C5592
17426F2447K46523r5952L2707J23903A17646J53873a31917B70031J1746R744I1806
17414D52323A43084J47795q8039m2016J74277n8367F9716f2277A243a45754A27030
17402A20821a17779E3775Q7385K0653F9965a26378B70295A26314d5532A46817
17391A74401R5806g7977i632j26854B77091J29793j27661m4760A00114i307A47024
17379a07130A98863K15676R9194A18616J40514F2615J97761p4996J5627H2082
$$ plain form
17460 -21193 -1366 45768 -208755 263164 8434 264726 -153536 282487 220582 215748 509189
17449 509189 140093 574413 578201 304573 36099 239028 70949 187527 250823 8114 257946
17438 257946 294926 -75570 96146 306191 263674 132973 280498 160286 158304 -4039 35592
17426 62447 308970 213018 245725 369628 117646 271519 -131917 270031 281777 291521 91806
17414 452323 143084 290879 202840 160824 335101 276734 69716 -62277 1243 -145754 127030
17402 120821 -117779 53775 141160 161813 69965 -126378 270295 126314 -45532 146817
17391 174401 270207 -77977 -9632 -136486 277091 406884 279223 234463 100114 -9307 147024
17379 -107130 198863 414539 513733 118616 259130 62615 260376 185380 201007 82082
17368A66422o4869J92222j30645J29318j31570M1791k9149H6b35268B14922H1375
17356g7882A4637a37783E2309M9232J28149a0715B96485a1100D3940F566J04322
17345A10888a29053M076A20069c27883b6102B90535j09777C9459J79644c4161
17334a27491C20674a40753c2386B09421j4127L67432A27465J61915j7684C9904
17323B42328n569d8551B48683A3891K2821J2163J74013K46598A18285a72537B97990
17311C03877r44I8583J45686o0279o5674L5742a340j42725C27428h9799E9879
17299A98021M9832a21492A01718c7728C34371A14247O0840A3301J34035N3304
17289B00640H6383M7658C7003J88841n4227k2770A159P6240K20512J23783B3632
$$ plain form
17368 166422 101553 293775 163130 292448 160878 202669 173520 86 -235268 214922 81375
17356 -77882 14637 -137783 52309 101541 229690 -10715 296485 -11100 43940 6566 110888
17345 110888 -129053 -124977 120069 -327883 -26102 290535 180758 39459 219103 -34161
17334 -127491 320674 -140753 -32386 209421 195294 562726 127465 289380 271696 39904
17323 242328 236759 -48551 248683 13891 36712 48875 222888 469486 118285 -172537 297990
17311 303877 302933 98583 244269 183990 118316 154058 -1340 -144065 327428 -89799 59879
17299 198021 247853 -121492 101718 -37728 334371 114247 175087 13301 147336 200640
17289 200640 86383 134041 37003 225844 171617 148847 1159 77399 297911 421694 23632
17277A29450d5927B21525m4497c3186A50700J50196b49046M3715A15309J16134
17267B31443f6215A26948K18171E238e660A17806K2056o5947M8867j2253O6062
17256A76591J22617Q6048m4955q0935O5714E5224j96b1299B71410A03085J9561
17245A22646j0994M5174N4441J41489I1228J60735P1824J34098A78740L47327
17235E26067i276A12742J25136r9055K1203o2567Q3374a22018B07307J01007D939
17223F6192L08858B0238a16895D94497j93455A38407J354L32628M93a10938B05855
17211b34238A52476D5247P3100o118L56553B28970Q7113J9572J92962l2132k01782
17200B94703l9222a63069B15541J7433i8319B64715G2345L43998d0102B98827
$$ plain form
17277 129450 -45927 221525 177028 -33186 150700 300896 -249046 -205331 115309 231443
17267 231443 -66215 126948 345119 5238 -5660 117806 139862 73915 122782 110529 176591
17256 176591 299208 385256 340301 259366 325080 55224 55028 -21299 271410 103085 122646
17245 122646 111652 156826 211267 352756 91228 251963 323787 457885 178740 526067
17235 526067 -9276 112742 237878 138823 160026 97459 180833 -122018 207307 308314 4939
17223 66192 375050 20238 -116895 494497 301042 138407 139761 472389 472882 -110938 205855
17211 -234238 152476 45247 118347 112229 468782 228970 316083 335655 528617 496485 294703
17200 294703 255481 -163069 215541 232974 -98319 264715 72345 416343 -40102 298827
17189B00612K2056p7584j6583M73048k79574C1947a5413d618H2220J22941j07
17178B05054B2492J84008n7685J43580L3528k844O5469I0445L74149j72542C6347
17166I6395L62393A87814K99514k36709d3712C98360j03260o347O90r8768J07513
17155B98188K1718j02858K45236j97611K5692J46382A14195l4632M68429l3399
17145E14593j95387K32683j85439j16560q4370J38907O3330A78703L48398E443
17134C39068A29561K10097D1274K68410K37454B36037A16873L33511A10879J71481
17124B82360J70640m3888k03037N7962J95307K3570j18962j16948N53581l79857
17114D20728j61692A15365J21334J90060j91188l1696r4340M32794A53066J35867
$$ plain form
17189 200612 222668 145084 128501 601549 321975 31947 -15413 -4618 82220 205161 205054
17178 205054 22492 206500 148815 292395 325923 323079 388548 90445 464594 292052 36347
17166 96395 458788 187814 487328 250619 -43712 398360 295100 288753 289443 190675 298188
17155 298188 319906 217048 462284 264673 290365 436747 114195 79563 547992 514593
17145 514593 319206 551889 366450 249890 165520 304427 367757 178703 527101 5443
17134 339068 129561 339658 41274 309684 547138 236037 116873 450384 110879 282360
17124 282360 453000 409112 206075 264037 459344 482914 363952 247004 800585 420728
17114 420728 259036 115365 236699 426759 235571 203875 109535 542329 153066 288933
17104B88933m1498L8127f3663A51226J98817J88360J09178k31001j35757A26586
17093A60428P8874J49942m2734K00415B43979J13374m7995J11076j0910r9602
17083C09922J02139J92307A47301K86830j15670G8858K08505M5318m4414L60845
17073F49112K8352k51292M4078J26667k43072K59659j20918J34808j42962k7900
17063D56532b655C59796K57944k01747J42580j68587J64745B43624K13529p553
17053D49600J67082o1230M293J49521J1615k39216J2922M1202Q2765p7687j39622
17042D01245L94130l72430j31550M8031J61011R2835M7859k41997n3903K51249
17032E96480j00400N9064J23504L1343j14085N0557J0022j58681K58609r2916
$$ plain form
17104 288933 247435 285562 -63663 151226 350043 538403 647581 416580 280823 126586
17093 160428 239302 389244 346510 546925 243979 357353 309358 420434 409524 309922
17083 309922 412061 604368 147301 434131 318461 78858 287363 332681 288267 649112
17073 649112 677464 426172 470250 596917 353845 613504 492586 627394 484432 456532
17063 456532 -2655 359796 617740 415993 558573 389986 554731 243624 457153 449600
17053 449600 616682 555452 559745 709266 720881 481665 494587 535789 618554 540867 401245
17042 401245 795375 422945 291395 339426 500437 593272 641131 399134 345231 596480
17032 596480 496080 555144 678648 709991 595906 646463 656485 497804 756413 663497
17022F63497L4626l22233P6965M68784l28670K4508K63440q027k33175K98761
17012I38476D63234L48252J0672j88977l5501L80371j82088K22974l16183K37125
17002I39879m39856J90975K11270p2690l9611k45792J51058K45822l78040L46425
16992I09440P3241C46635K89708l1048j79447J04849J16088L5798p0310J49704
16982G61977k7230M3844L888O2390l79321N69155n00292M17481J19620k67249
16972H04263J07402L8625N4985J22661n8583o3990n8758J22680n2275j99986J60168
16961I77192k36631J06788J69680j46150n8471J85271l2837J00588n9018N9855
16951A066267J96043j68488K86002n61047L27246j78716l21390N11947J35452
$$ plain form
17022 663497 698123 375890 452855 921639 592969 617477 880917 872890 639715 938476
17012 938476 463234 811486 822158 633181 597680 978051 795963 1018937 702754 939879
17002 939879 500023 690998 902268 829578 789967 544175 695233 941055 563015 909440
16992 909440 982681 346635 636343 605295 425848 530697 646785 682583 612273 761977
16982 761977 734747 778591 782479 844869 465548 1034703 534411 951892 1071512 804263
16972 804263 911665 950290 1005275 1127936 1069353 1005363 946605 1069285 1017010 817024 977192
16961 977192 740561 847349 1017029 870879 812408 997679 964842 1065430 1006412 1066267
16951 1066267 1262310 1093822 1379824 818777 1146023 967307 645917 1157864 1293316
16942A293316j34755J28685l04869r8510M33818j97074l4573k91717J66088M18147
16932A378556m99541M61762k52062j68456J69784J21399J48373j00712J29958
16923A389061l26168M20826j07532o5674J6889k02485K81980l7401j84922L38439
16913A523013Q7515k28923L06277n0731j44262J56996j63624J7266k75122L09121
16903A537526L9400j66824Q9073J71084K09373j84502o77l31818L24136n3421
16893A633350N6906M8362K50408j8408l7892j01433R3623j35865K34405l9631
16883A983825J44348K94908l11769n1978j28209K79362J80805n8524J0622J5468
16873B358858j24370R2935R5324J41942j06602J81198J7638K1401j88364m7223
$$ plain form
16942 1293316 1158561 1287246 982377 883867 1317685 1120611 1086038 794321 960409 1378556
16932 1378556 879015 1340777 1088715 920259 1090043 1211442 1359815 1259103 1389061
16923 1389061 1062893 1483719 1376187 1310513 1327402 1124917 1406897 1369496 1184574 1523013
16913 1523013 1610528 1381605 1687882 1637151 1492889 1649885 1486261 1503527 1228405 1537526
16903 1537526 1576926 1410102 1499175 1670259 1879632 1695130 1694453 1362635 1686771 1633350
16893 1633350 1690256 1738618 1989026 1970618 1932726 1831293 1924916 1789051 2023456 1983825
16883 1983825 2128173 2423081 2111312 2059334 1931125 2210487 2391292 2332768 2343390 2358858
16873 2358858 2234488 2327423 2422747 2564689 2458087 2639285 2656923 2678324 2489960 2442737
16863B442737K84310j37935N29225j88458j02914K10214l00398p1994L12570l53905
16853B623452N91100l12527L05464n3595m4769J98876O7215Q3786j94754L16494
16843C580742k37507K95974K72964l40207L2512K7335J35107O7010M08447l40548
16833C901829L56080m1309o159j55126L42220K7106M87254k07200k15914N24103
16823E012884L445K41426J06604m49094P53447m04479L66179O6113N4185K71785
16813F022495r2468N55650p5795L31296l17244M16739J2409j27881M36726N9490
16803G221417J39875m5235M68593L52137n2812p3744J2711M84658J92997M42555
16793I143152Q7732J94071K09161N26164q6456K13661M56265N71702M15629L8078
$$ plain form
16863 2442737 2727047 2589112 3118337 2929879 2826965 3037179 2736781 2664787 2977357 2623452
16853 2623452 3214552 2902025 3207489 3153894 3109125 3308001 3375216 3459002 3264248 3580742
16843 3580742 3343235 3639209 3912173 3571966 3604478 3631813 3766920 3833930 4242377 3901829
16833 3901829 4257909 4216600 4210441 4055315 4397535 4424641 4911895 4704695 4488781 5012884
16823 5012884 5016329 5257755 5364359 4915265 5668712 5264233 5630412 5696525 5750710 6022495
16813 6022495 5930027 6485677 6409882 6741178 6423934 6840673 6853082 6725201 7161927 7221417
16803 7221417 7361292 7316057 7784650 8136787 8083975 8010231 8022942 8507600 8700597 9143152
16793 9143152 9230884 9424955 9634116 10160280 10073824 10287485 10743750 11315452 11731081 11769159
16783A1769159J06422O23309L77582L07127O50936M14497L86678K04475P20483
16774A5560668J63492R07443N58470N10926L13453R03237L02600R61065P32300
16765B0913654M79634J051241Q39027Q94080J376055J029252N80038J310985J310872
16756B9784838J446380J050452J498680J514247J668311J809997J969817J917128
16748D2659850J960943J916777K415540K505311K773017K676432L067330L462886
16740F3438086L186864L702672L888058M047290M710656M297261N553162N095562
16732I7919611N270507N191168O235707O190968O171434O099914N807773O273086
16724A45160168N565544N423185N054557L931558L503115K470654J729770M35169
$$ plain form
16783 11769159 11875581 12498890 12876472 13183599 13834535 14249032 14635710 14840185 15560668
16774 15560668 15724160 16631603 17190073 17700999 18014452 18917689 19220289 20181354 20913654
16765 20913654 21393288 22444529 23283556 24177636 25553691 26582943 27162981 28473966 29784838
16756 29784838 31231218 32281670 33780350 35294597 36962908 38772905 40742722 42659850
16748 42659850 44620793 46537570 48953110 51458421 54231438 56907870 59975200 63438086
16740 63438086 66624950 70327622 74215680 78262970 82973626 87270887 92824049 97919611
16732 97919611 103190118 108381286 114616993 120807961 126979395 133079309 138887082 145160168
16724 145160168 150725712 156148897 161203454 165135012 168638127 171108781 172838551 173273720
16716A73273720m31843j767567k742226l404992m247438n217220n630917n928290
16708A43903227o236561o620477o202728o623598n902255o076345n905780n540455
16700I4795028n535652m752244m649082m641437m247087l606974m122189l295009
16692E9945354l152880k758719l089479k203728k571831k405077k132074k136979
16684C9494587j634609k114716j375930j572367j453629j542762j376836j091169
16676B7332569j190820r55061j137967j112768q90472q18944o25030o93780j103305
16667A8804422j01542q69489p99188j28093r18556o55326n94572l91307k42049
16658A4104300l16109p20214n850q11840p5566k35096n36831k94169m52677l21635
$$ plain form
16716 173273720 172841877 171074310 168332084 164927092 160679654 155462434 149831517 143903227
16708 143903227 137666666 131046189 124843461 118219863 112317608 106241263 100335483 94795028
16700 94795028 89259376 84507132 79858050 75216613 70969526 67362552 63240363 59945354
16692 59945354 56792474 54033755 50944276 48740548 46168717 43763640 41631566 39494587
16684 39494587 37859978 35745262 34369332 32796965 31343336 29800574 28423738 27332569
16676 27332569 26141749 25186688 24048721 22935953 22045481 21226537 20601507 19907727 18804422
16667 18804422 18702880 17833391 17034203 16906110 15987554 15332228 14737656 14346349 14104300
16658 14104300 13788191 13067977 13062127 12250287 12174721 11939625 11402794 11108625 10655948 10334313
16648A0334313n1223n41307J89587m92474k86449j70125l71088p6192l50718J16466
16638H300790n64031K87275q30378L16026o08898K00185m92769j59287N9540l03504
16628F204949q9571n94848L08543j94878j21292k1505o7692J5545m27191n4882
16618D957178J80228k03631R9420o62439M38254m51020k30990K07466j69885J41863
16608D306444q4162J015k13736k52420K9285J51185k86682O8236k70701O4247
16598C512711Q8254j0571r5848j81191j37217r8028J71121j35809n59255N08585
16588C062752J18372k40961k58290r5357L64412l49386j5412m9150L049k81570
16578B258459K76723k49897K57995k51260k90610j66284M64879J35103N2139m98100
$$ plain form
16648 10334313 10283090 9741783 9931370 9438896 9152447 8982322 8611234 8535042 8184324 8300790
16638 8300790 7736759 8024034 7193656 7509682 6900784 7100969 6608200 6448913 6508453 6204949
16628 6204949 6115378 5520530 5829073 5634195 5512903 5491398 5423706 5439251 5012060 4957178
16618 4957178 5137406 4933775 5033195 4370756 4809010 4357990 4127000 4334466 4164581 4306444
16608 4306444 4222282 4223297 4009561 3757141 3786426 3937611 3650929 3719165 3448464 3512711
16598 3512711 3600965 3590394 3494546 3313355 3176138 3078110 3249231 3113422 2554167 3062752
16588 3062752 3181124 2940163 2681873 2586516 2950928 2601542 2586130 2536980 2540029 2258459
16578 2258459 2535182 2285285 2543280 2292020 2001410 1835126 2300005 2435108 2487247 1989147
16568A989147M47824n82228J39843K24449k38189m7500q9270J25822J78566l53580
16558A794884M19414o42394K48950M3387l37932K41580O8017j31474j87842j01888
16548A414702j5242J28077N1008r2463Q2196k36772o3164K39105j35171o5271
16538A307005K38414k23420j89405K06459N5427P3522k14600O5353k25184p7204
16528A016367L80533l40540M89988m75525L51144q9843j86861j31956J69623j66610
16518A016320J55900p894J7338J00547o8783n04732M14543j08908j41131j8448
16508H54752L00541l50260L35929j8287j40437N9507j15222r5895L49677n83981
16498E96324M75314m75642M5721L58209L3377P4619j1936k14659M0318l3397j35193
$$ plain form
16568 1989147 2436971 1854743 1994586 2219035 1980846 1933346 1844076 1969898 2148464 1794884
16558 1794884 2214298 1571904 1820854 1864241 1526309 1767889 1835906 1704432 1516590 1414702
16548 1414702 1399460 1527537 1578545 1486082 1568278 1331506 1268342 1507447 1372276 1307005
16538 1307005 1545419 1321999 1132594 1339053 1394480 1468002 1253402 1318755 1093571 1016367
16528 1016367 1396900 1056360 1546348 1070823 1421967 1332124 1145263 1013307 1182930 1016320
16518 1016320 1172220 1164326 1181664 1282211 1213428 708696 1123239 1014331 873200 854752
16508 854752 1155293 805033 1140962 1122675 982238 1041745 926523 830628 1180305 596324
16498 596324 1071638 595996 641717 999926 1033303 1107922 1095986 881327 921645 888248 753055
16487G53055K91153k65663M385Q1599l54480j9865K53232k5477j31992N16213
16477A102160m60595K14217K448J24006l09234j38055m2231J45267K40689k34258
16467F44414j2451J82667J1857k41191K5675L0864K11693k06888l05570L57772
16457F98842J26164k833l15755J43035j14718M2200J46745m4716j43227Q687K69748
16446H14172k16965p8452J42203B24857L83573m3231J55636l32658l2093L93785
16436G49869j20360k9382k2410M5852j24989P2434o4549L5581k61576J16682J77538
16425E74690k39942K53491q6837J2378j35904k3314J07233A87690K85694r7063
16415C76321j26279j2872m0733I1536R5600K68836J17724k47696O707J45614B29434
$$ plain form
16487 753055 1044208 778545 782930 864529 510049 490184 743416 717939 585947 1102160
16477 1102160 641565 855782 858230 982236 673002 534947 492716 637983 878672 644414
16467 644414 631963 814630 826487 585296 610971 641835 853528 646640 341070 698842
16457 698842 825006 822173 506418 649453 534735 576935 723680 678964 535737 544424 814172
16446 814172 597207 518755 660958 224857 608430 565199 720835 388177 356084 749869
16436 749869 629509 600127 577717 623569 498580 571014 506465 542046 280470 397152 574690
16425 574690 334748 588239 501402 513780 377876 354562 461795 187690 473384 376321
16415 376321 250042 237170 196437 91536 187136 455972 573696 326000 332707 478321 229434
16403B88498K03318H8035M01822l6189r9358q5836L33096K6428j15904j56650
16393C55444j38932K32888G639L66912p7484p4797J08200M5331o3515q3826L3942
16382B62402r1667O5965K4936j02938K08689j41345P0101R8001j76886o0798L6523
16371A92983P1651J02511K13697A81923n4651N0335K23532A91457J76114k5937
16361C41634j1158n4822J6861A29333J94970K34447q9129j08122d6952J9177D85095
16349B22209L33265A86439J9964A0687K81971b505B14822M9057A15538L07327
16339D22865j09364N4823J41503B53583p801p5624N7518J9418j6897A8234K22848
16328B41082K89148A23268E8828K54847B7540J91671G3377A1429L3025J04343
$$ plain form
16403 288498 491816 88035 489857 453668 354310 268474 601570 627998 512094 355444
16393 355444 216512 449400 7639 374551 297067 222270 330470 375801 312286 228460 262402
16382 262402 170735 236700 261636 158698 367387 226042 296143 394144 217258 156460 192983
16371 192983 264634 367145 580842 181923 127272 177607 401139 191457 367571 341634
16361 341634 330476 275654 292515 129333 324303 558750 469621 361499 -46952 -27775 485095
16349 222209 555474 186439 206403 10687 292658 -2505 214822 263879 115538 422865
16339 422865 313501 368324 509827 253583 245782 170158 227676 247094 230197 18234 241082
16328 241082 530230 123268 58828 313675 27540 219211 73377 11429 44454 148797
16318A48797J81213A09020A7679Q1153N7761n5176N5524D6544J69922F6543R3961
16307A60504n6536J70956f3930B71635F4513b4746A92076j9225J16552A11421
16296I3633M1752i4210H2713L67180j42012K9188E0422Q0411k8256i3055L5225
16285e7830A47168k0851K13868a94517C60889A44200k9881a14261C56284j8003
16275C38281C5515L420J62562r3587J52957f5574k05649G90J56489J35557Q3798
16264C76634a9395F8474c7912A19117J70080F79K22961a18982A54923a472l67881
16253c69353E3528J18731D8119J13450o3810n289c16185A6905R3337E0279K07500
16242B57779h6436D05658b5855A96414C3064a85317A37929n8601a95398C0491
$$ plain form
16318 148797 330010 109020 17679 98832 156593 101417 156941 46544 216466 66543 160504
16307 160504 103968 274924 -63930 271635 64513 -24746 192076 172851 289403 111421
16296 93633 135385 -94210 82713 449893 307881 337069 50422 130833 102577 -93055 -57830
16285 -57830 147168 126317 340185 -194517 360889 144200 114319 -114261 356284 338281
16275 338281 35515 38935 201497 107910 260867 -65574 -271223 790 157279 292836 376634
16264 376634 -19395 68474 -37912 119117 289197 679 223640 -118982 154923 -1472 -369353
16253 -369353 53528 172259 48119 161569 97759 92470 -316185 16905 110242 50279 257779
16242 257779 -86436 405658 -25855 196414 33064 -185317 137929 79328 -195398 30491
16231B62900A01421b35193E1574n481a0736B08792k1052q1061O5683J76443k8189
16220C20616A6948R643a10029n655A49025a7733k30096D51629n0927d8649D6488
16208a39834d1534A4488a15995d1171I8204a0561H6003C7546a45988b4465I8705
16196b24873F4532h2508l3815A00542P4149n6274A5773J21554m3716N7320J38980
16185B89911J2487A9877c2529j89379G6790b57058g9974A26691N0313C1935L67454
16174C99389F6292a95777H214h6527B7576R3307J04451C4308j2250b255D4245
16162A40572I561c1099J1664A12799J383C60a59015j27432B38970M9506R9149
16151C87625a6499C1943M13561A06308Q9606h3847C35519b14112C0789a91414
$$ plain form
16231 262900 101421 -235193 51574 46093 -10736 208792 187740 106679 172362 348805 320616
16220 320616 16948 26591 -110029 -115684 149025 -17733 -247829 451629 400702 -48649 46488
16208 -139834 -41534 14488 -115995 -41171 98204 -10561 86003 37546 -145988 -24465 98705
16196 -224873 64532 -82508 -116323 100542 174691 118417 15773 137327 93611 150931 289911
16185 289911 302398 19877 -32529 -221908 76790 -257058 -79974 126691 177004 31935 399389
16174 399389 66292 -195777 8214 -86527 27576 120883 225334 34308 22058 -2255 44245
16162 140572 9561 -31099 -19435 112799 114182 360 -159015 -286447 238970 288476 387625
16151 387625 -16499 31943 445504 106308 195914 -83847 335519 -214112 30789 -191414
16140a1226J244l18272A36919F2333K860a22269A91042F5345J19356f437B06307
16128e096B6753J10411J2298c8764n9265M986A87433H7006d1587j2312r8262A9464
16115A2156L0377J02786a71075G8791a45094J7519B29501A5571K9384a01606A00647
16103g769j46878A42739i9767C76570a56865G9495k1723L06499c799B77442B287
16091A5138a65420A87524H6504d0388H685a19026F3536Q7977b3493k35901J01776
16080a57618A35602A1918J7276c3405j4274K620C8740a68155d5982q674e597F0212
16067b69532j95435c047A3161k079f9933A18106g8453B4431J871R4759b52029
16055H441e312B15687k7965h559C52491j48131c06179F8002a61017L4227F7748
$$ plain form
16140 -11226 -9982 -328254 136919 62333 65193 -122269 191042 65345 184701 -6437 206307
16128 -5096 26753 137164 149462 -38764 -98029 -93043 187433 87006 -41587 -53899 -152161 19464
16115 12156 42533 145319 -171075 78791 -145094 -127575 229501 15571 44955 -101606 100647
16103 -7769 -154647 142739 -99767 376570 -156865 79495 57772 364271 -3799 277442 2287
16091 15138 -165420 187524 86504 -40388 8685 -119026 63536 151513 -23493 -259394 -157618
16080 -157618 135602 11918 29194 -33405 -47679 -45059 38740 -168155 -45982 -54656 -5597 60212
16067 -269532 -464967 -3047 13161 11082 -69933 118106 -78453 24431 26302 121061 -252029
16055 8441 -5312 215687 187722 -8559 352491 204360 -306179 68002 -161017 -126790 67748
16043f5021B0596J12023g0909m57370F8611l201k597a18518j39213A50468d2198
16031a84182B57600b08917A01292c91327A08430a29895B33793a29162r8932a6782
16020A96319r1314B7220a38152F916i5946A08715l5076q664K65862c25047J15378
16009b09669G1161a82736j8309A892a88295j32879P8994p865h3178D6286A8346
15997a04604q4779n765e3556B25165o7249a94978H9452J56642a03735A35703A8286
15985A90263H7237b12625B25151K973L6079n1149F314P524a3769k08557C799A473
15972C17642C4610b49578B91262c6224j58619A23691D4841d5942A2026b79185
15961A18610c5021B13161B7838J2420h5420j10621P7335j09366C46737j40943
$$ plain form
16043 -65021 20596 132619 -70909 -528279 68611 65410 62813 -118518 -257731 150468 -42198
16031 -184182 257600 -208917 101292 -391327 108430 -129895 233793 -129162 -228094 -16782
16020 196319 105005 27220 -138152 6916 -95946 108715 73639 64975 330837 -325047 -209669
16009 -209669 71161 -182736 -201045 1892 -188295 -321174 -242180 -250045 -83178 46286 18346
15997 -104604 -189383 -195148 -53556 225165 157916 -194978 89452 246094 -103735 135703 18286
15985 190263 87237 -212625 225151 228124 264203 213054 6314 13838 -13769 -222326 3799 1473
15972 317642 34610 -249578 291262 -36224 -194843 123691 44841 -45942 12026 -279185
15961 118610 -35021 213161 27838 40258 -85420 -196041 -118706 -228072 346737 205794
15951B05794b82604J7224B37365f3794B07410A02309l4578K01977c32509C7168
15940A36996e5579a1259j77824A37648J19094b3489n0309j88520a15454j8182
15930a33636C4379c37278C0391a92023k29889A7388m062K44842a06353b6518j20833
15919a47351I5031B9795d7242B5098f0388A4685K92961r8596a53138A33143f5008
15907d27733A43550f5071A01123L3281h6907j93318A42194n5198b27626e4161
15896a70783p8125P8771G2417p315a07435j31588H2624Q9524h4018l3993A37668
15884C12608p2887b23303A47015b5370p9748l8593C7731M4262R2967c3121I875
15872E4672e5438K7535A25992O1784a76642A6767a03439A56347C4278d1739h207
$$ plain form
15951 205794 -282604 -265380 237365 -63794 207410 102309 67731 269708 -332509 37168
15940 136996 -55579 -11259 -189083 137648 256742 -23489 -73798 -262318 -115454 -133636
15930 -133636 34379 -337278 30391 -192023 -421912 17388 13326 258168 -106353 -26518 -147351
15919 -147351 95031 29795 -47242 25098 -60388 14685 307646 209050 -153138 133143 -65008
15907 -427733 143550 -65071 101123 134404 -86907 -280225 142194 86996 -227626 -54161
15896 -170783 -248908 -170137 72417 65102 -107435 -239023 82624 172148 -84018 -118011 137668
15884 312608 239721 -223303 147015 -25370 -105118 -143711 37731 81993 174960 -33121 9875
15872 54672 -55438 -27903 125992 187776 -176642 16767 -103439 156347 34278 -41739 -8207
15860c1390l6899A4388g1764C09847p1835o9349b42491b3253B7306M3235J38267
15849B08808d3150A91333c6118A92469f3184J3258k43118J5276C899e9068A00110
15837a40629k387A2310a49037h875l43688f2373a3238G0121c5276j6750B1782
15825B40217j03143D8538a69831B8943a3741C6275A8092g9892J5654r7821A99122
15813a42811F1583b5064H6676a84786b5767j53670C72599C6171b75890M8032L1289
15802a96569B23693m4451g1514k18813I6190J32958b92274J42605K440C3964O3320
15791I7284J52238a33283n8049D7552b50385C4295R5215b64474J046f8112k47638
15780c15750L8848a15008F765a82248O3062e6566I3958a22499G8743a43255N967
$$ plain form
15860 -31390 -68289 14388 -71764 309847 238012 168663 -242491 -23253 27306 70541 208808
15849 208808 -43150 191333 -36118 192469 -63184 -49926 -293044 -277768 3899 -59068 100110
15837 -140629 -143016 12310 -149037 -8875 -352563 -62373 -13238 70121 -35276 -52026 21782
15825 240217 137074 48538 -169831 28943 -13741 36275 18092 -79892 -64238 -162059 199122
15813 -142811 61583 -25064 86676 -184786 -25767 -179437 372599 36171 -275890 -227858 -196569
15802 -196569 223693 179242 -71514 -290327 96190 229148 -292274 -149669 -147229 33964 97284
15791 97284 249522 -133283 -191332 47552 -250385 34295 129510 -264474 -263428 -68112 -315750
15780 -315750 -276902 -115008 6765 -182248 -119186 -56566 93958 -122499 78743 -143255 -137288
15769a37288c9104k43435c2784B16364B9293a324j27735C40731b14176E8140a00986
15757d3418N014C912a54359d9210A83570e5559C49507g3828G0048K4450L36594
15746D31092a78071b2397A4175c712C3690N0868c73816a28357K218G3619k096
15735G1523a01569m9173L128j5974m3805A43817b5896j37680p4259O8603I2449
15723b18972C06316i9521k44762L4205H2151a7476n29608I2577l3455c42p2903
15712g3245j43517M3416E1772a37205e0017k0198A94763r2461b4238K196B69592
15700a55164A74968p1494l2637L3731a03378j04651C21382a43836k46963A31581
15689B36683f252A91499b39501R040c5519m50219A63393c99736e1516q7128A63248
$$ plain form
15769 -137288 -39104 -282539 -32784 216364 29293 -1324 -129059 340731 -214176 58140 -100986
15757 -43418 -38404 3912 -154359 -49210 183570 -55559 349507 -73828 70048 94498 431092
15746 431092 -178071 -22397 14175 -3712 33690 84558 -373816 -128357 -126139 73619 71523
15735 71523 -101569 -150742 -147614 -163588 -207393 143817 -25896 -163576 -237835 -169232 92449
15723 -218972 306316 -99521 -344283 -310078 82151 -17476 -547084 92577 59122 -342 -73245
15712 -73245 -216762 -173346 51772 -137205 -50017 -70215 194763 102302 -24238 -22042 269592
15700 -155164 174968 103474 70837 104568 -103378 -208029 321382 -143836 -390799 131581
15689 236683 -6252 191499 -239501 -230461 -35519 -485738 163393 -399736 -51516 -138644 163248
15677A24500C5525J15658j0995a6917C79906a92749B13314a99677B311a11484
15666B3233e6135A49919B0821J65215c81492g1890l66658B95169A0731J77170
15656A87901b02539G3869a70814A3366a41373a4782A34036a53501I4671a39636
15645B7616f5875l3475B04372a66390B31289d02835A07202a5557l8951k19252
15635b73760E1150c39619A12614a74347A7791M4794J13170b0791E3835c273m9415
15624e2688F4103a27166M4403p5248A55057a84268B53187g7426B27254J9015b57155
15612f5205E3811C26J91363H8694f8125o3661G3557a49191B79936b69638A77561
15600h185I8275k3056e9572j76563L9668H7685b05908k433e7144C0085c7512G2492
$$ plain form
15677 124500 35525 151183 140188 -16917 379906 -192749 213314 -199677 2311 -111484
15666 23233 -56135 149919 20821 186036 -381492 -71890 -438548 295169 10731 187901
15656 187901 -202539 73869 -170814 13366 -141373 -14782 134036 -153501 94671 -139636
15645 27616 -65875 -99350 204372 -166390 231289 -402835 107202 -15557 -54508 -273760
15635 -273760 51150 -339619 112614 -174347 17791 62585 175755 -20791 53835 -3273 -52688
15624 -52688 64103 -127166 -82763 -158011 155057 -184268 253187 -77426 227254 246269 -257155
15612 -65205 53811 326 191689 88694 -68125 -131786 73557 -149191 279936 -269638 177561
15600 -8185 98275 75219 -59572 -236135 -196467 87685 -205908 -208341 -57144 30085 -37512 72492
15587A14593b6440j07916B15665C1441O4810b06603A29285o4177j2574a8765j59888
15576a78653A1799a61487j45833B11177D3774g7914l23183A10919b00980A20266
15565b7327C9843a67553J1308A86856a63193A4941J12995j7400o319g4825l0159
15554a04984L6923I3346C2160o813J30342D8690b01201q120k3197d6972n5096
15543a02068C95899a31454B60551F2652J56937g7297D3555g0942j06748c1236
15532A35004a99931K7606n3101r6102a43629B40715a91808a1131B59672a3178
15521d64182d2697G4914J0133l885a70937D2359a16446F4530N4782a49446A15409
15509b6124F281a33597l13977A81572m2903C823a95575M0981B71854b42799I6967
$$ plain form
15587 114593 -26440 -134356 215665 31441 96251 -206603 129285 65108 52534 -18765 -178653
15576 -178653 11799 -161487 -307320 211177 43774 -77914 -401097 110919 -200980 120266
15565 -27327 39843 -167553 -156245 186856 -163193 14941 127936 110536 104217 -74825 -104984
15554 -104984 -68061 93346 32160 25347 155689 48690 -201201 -209321 -232518 -46972 -102068
15543 -102068 395899 -131454 260551 62652 219589 -77297 43555 -70942 -177690 -31236
15532 135004 -199931 -172325 -225426 -321528 -143629 240715 -191808 -11131 259672 -13178
15521 -464182 -42697 74914 85047 81162 -170937 42359 -116446 64530 119312 -149446 115409
15509 -26124 6281 -133597 -447574 181572 138669 3823 -195575 -154594 271854 -242799 96967
15497I583K15693q737D968K4028D361M88755E0213a03630A56541g4295B93872
15485A17610Q8928a88943A82132A439a26569b1631G1131g030j45200C28124A42317
15473g6954B39971i5904k08543Q6658F3787a03241C1980e3497j88600M760R9689
15462a37648f1556B20190b00054H5162J6146c2683E7357J51558a01426d3822J8714
15451b5108k63069C8317J19288b65882A65841D1880b33983A0758g3934B06612
15440B28259q4258b9032K166A05306J10514J03011a11904E8857a56800d9547n2537
15429a02084F7590e8467r7197O4763j17835A11623c2641j29916F6858P5567J12523
15418B54948j18590a95056a3876G7188K2757g123j11983j0849C6431K7486C1489
$$ plain form
15497 9583 225276 216539 4968 28996 4361 493116 50213 -103630 156541 -74295 293872
15485 117610 206538 -188943 182132 1439 -126569 -21631 71131 -7030 -152230 328124 142317
15473 -76954 239971 -95904 -304447 -217789 63787 -103241 31980 -53497 -242097 -237337 -137648
15462 -137648 -61556 220190 -200054 85162 101308 -32683 57357 208915 -101426 -43822 -25108
15451 -25108 -288177 38317 157605 -265882 165841 41880 -233983 10758 -73934 206612
15440 228259 144001 -29032 -26866 105306 215820 318831 -111904 58857 -156800 -49547 -102084
15429 -102084 67590 -58467 -155664 -90901 -208736 111623 -32641 -162557 66858 142425 254948
15418 254948 136358 -195056 -13876 77188 99945 -7123 -119106 -129955 36431 63917 31489
15406B13351c6649q3342E4078b26982L6597h1140A16885J18039p6896p5982Q654
15395I0700k7192b58470a5616m7744D0691L1376K26554d492H7927e5237r6328
15384a51565F3113a47319D848a37775q5537e0097B5796a3031j63484B72264c1469
15372a26046H6985i723D4612k1948c08081F2468j5108L8536C6687J04134J19954
15361B60775G391g5922C7018d1453D1452J2414P6178k3440k4998a26081A0549
15349e2106q1319k2702j5592A08563b6269G2660J6825A7968J03020a23901B0755
15337A3762f5003C1831a27837J4245d4000k14743G5008b94732B11490A6996K16482
15326B33478K6160D6917N2821K2111n0J46313A20276J23021a75212D5184e5499
$$ plain form
15406 213351 -36649 -119991 54078 -226982 -190385 -81140 116885 234924 158028 82046 90700
15395 90700 63508 -258470 -15616 -63360 40691 72067 298621 -4492 87927 -55237 -151565
15384 -151565 63113 -147319 4848 -137775 -223312 -50097 25796 -13031 -176515 272264 -31469
15372 -126046 86985 -9723 44612 22664 -308081 62468 47360 85896 36687 140821 260775
15361 260775 7391 -75922 37018 -41453 41452 53866 130044 106604 81606 -126081 10549
15349 -52106 -133425 -156127 -171719 108563 -26269 72660 89485 17968 120988 -123901 20755
15337 13762 -65003 31831 -127837 -113592 -44000 -258743 75008 -294732 211490 16996 233478
15326 233478 259638 46917 99738 121849 121799 268112 120276 243297 -175212 45184 -55499
15314H3269l6019b61776c8565B43435h1549L7075B86168a84418c9020C79048E4543
15302a54446D7098g2456B65147b07838C40162a29902C31167c878l6616j68093
15292b08587I4716J61721j03843m9956M4673b12592O0055A07742q936j2780D813
15280h0167l37981A09033c1339q5469G7836B2476K974J21548b75773O2693A05797
15268D55868B00L81583a27115a2623A19744i5969j4122k35179B40940j16803K04737
15257C28874K02716H8616h2512b2844C7471J65113o8712J98995K47024P90331
15247A370222r7409m11072K86719E61170B31509N3183a5569B86126n7965d6439
15236A94785G3338j2877i236C9066a90782I4053k7398f6922A35826a8894A70b74341
$$ plain form
15314 83269 47250 -261776 -38565 243435 -81549 -44474 286168 -184418 -39020 379048 54543
15302 -154446 47098 -72456 265147 -207838 340162 -129902 331167 -3878 -40494 -208587
15292 -208587 94716 256437 152594 102638 147311 -212592 -152537 107742 98806 86026 4813
15280 -80167 -418148 109033 -31339 -116808 77836 22476 25450 146998 -275773 -213080 105797
15268 455868 200 381783 -127115 -12623 119744 -95969 -110091 -345270 240940 124137 328874
15257 328874 531590 88616 -82512 -22844 37471 202584 133872 332867 579891 1370222
15247 1370222 1272813 861741 1148460 561170 231509 284692 -15569 286126 228161 -46439
15236 194785 73338 60461 -9236 39066 -190782 94053 66655 -66922 135826 -18894 170 -274341
15223A3308J04181J25930I3470j455a3931A97403Q4621a14902H4018c5755j24833
15212a60588A35250K48410B5047a1676E9578k0689Q5693b2768k28879C54530A14277
15200B03938F8522J5830J01647M0314j827J0521a12604G1424J7260M6187P1730
15189B06601M0498J24214A05580R6609d7544H2973h0455B15804k2783a593r2275
15178i3868E8509b0211q9278g882k98992a11021A17943i7270A01744L18287b2889
15166B02434n9871e5015G4165c38423a43605A8892J29276K196M513b05422Q2308
15155a23114e3177A94136a2627p0829L1208E3353J53248N14f5517J1779b453A46909
15142A58989l8850j9564a59989B89643J32760E3555R6677J0970a85661A60706
$$ plain form
15223 13308 117489 243419 93470 92015 -13931 197403 282024 -114902 84018 -35755 -160588
15212 -160588 135250 383660 25047 -11676 59578 38889 124582 -22768 -251647 354530 114277
15200 203938 68522 84352 185999 226313 224486 235007 -112604 71424 88684 134871 206601
15189 206601 247099 371313 105580 202189 -47544 82973 -80455 215804 193021 -1593 -93868
15178 -93868 58509 -20211 -109489 -7882 -306874 -111021 117943 -97270 101744 420031 -22889
15166 202434 142563 -55015 74165 -338423 -143605 18892 148168 150364 154877 -205422 -123114
15155 -123114 -53177 194136 -12627 -83456 -52248 53353 206601 207115 -65517 -53738 -2453 146909
15142 158989 120139 100575 -159989 289643 422403 53555 150232 161202 -185661 160706
15131c2686B55502p435N7341a62066B06952G4590a63580f7911B50333F2546J24189
15120A86735l6467B0552H162L02705r8978a06483A82017B8944P0147D9293J17945
15109A67238g2201N958A01579k6774c304B15677k7546d7885j08912a8689B74911
15097B48335d7639A88839Q0892F715L77756j46970K5947D395M37519F3263B0274
15085A7276M03165j9628h2234B66880I2393J39463j83g5305B27192m6990O3989
15074B44191B5855L69949A09225Q5988a33174d96B8657K82120L43326B87634p0225
15063B17409M4981A17454L66510A21985m7074c3982r8698b7480B9309J21372K14264
15052C64945E5360B77h4192B84737j38602k3770k0863J66450H3064a90923A60592
$$ plain form
15131 -32686 255502 248067 305408 -162066 206952 74590 -163580 -67911 250333 62546 186735
15120 186735 150268 20552 8162 310867 211889 -106483 182017 28944 99091 49293 167238
15109 167238 -72201 -66243 101579 74805 -3304 215677 188131 -47885 -156797 -18689 274911
15097 248335 -47639 188839 269731 6715 384471 237501 263448 4395 441914 63263 20274
15085 17276 420441 400813 -82234 266880 92393 231856 231673 -75305 227192 180202 244191
15074 244191 25855 395804 109225 195213 -133174 -496 28657 310777 654103 287634 217409
15063 217409 262390 117454 483964 121985 74911 -33982 -132680 -27480 29309 150681 364945
15052 364945 55360 277 -84192 284737 146135 122365 101502 267952 83064 -190923 160592
15040B75597A10297b10843B0140K98368E289a54143D144K76212j39988J15495
15030B55863K2638b13877C01921q4197e3209B63662N7324L564o6351K4197L24153
15019F06549H2448K71042J2762A40866j0788K54497A71460J16330C564L96314
15009C99878i703B01829B2294M41166A52535G2810J40621K87392B26072b3576
14998C49761n3675A27643K6672K18522p9718A9403K06911H0071J10357o2858C349
14986A11288D4953M51982a18928A64358m6509J61826A37591m4786J29169P024
14976B28998n1457Q727a47357A22911J97057O7241m6356j6094A35360K83255j18186
14965C00429h559B01430L55779A95873J30101J04567k08685M7001q2065L78471
$$ plain form
15040 275597 110297 -210843 20140 318508 5289 -154143 4144 280356 140368 255863
15030 255863 278501 -213877 301921 217724 -53209 263662 320986 324550 258199 282396 606549
15019 606549 82448 353490 366252 140866 130078 384575 171460 287790 3564 399878
15009 399878 -9703 201829 22294 463460 152535 72810 213431 500823 226072 -23576
14998 349761 296086 127643 154315 372837 293119 19403 226314 80071 190428 127570 3349
14986 111288 44953 496935 -118928 164358 117849 279675 137591 92805 221974 228998
14976 228998 177541 186268 -147357 122911 319968 387209 340853 324759 135360 418615 300429
14965 300429 -8559 201430 557209 195873 325974 430541 221856 268857 186792 565263
14955E65263B34768b54517C89168r2579L8369A6283K51627Q0026j32225H3190
14944C39372f582D57126k18462P0801l2727r7360d127A30108L36996l1568j36751
14933B98785k4868J13820l7027A57987P971P4862J44615j61074M0819d7564C8426
14921B57839q8925M9129J53808l7336A21194K23409A21325j6841N43276B76342
14910C91949A352K01705M7802j536K25576A19217J59606A31681d5367E997K43384
14899B49381K00765A33647K98854P3138B42325F6671L09513R1205E7984M91063
14889E49047e434B69823J0658K26357m3367K313j71820j45603K20196m620M2449
14878D06386J29792r2464A33255J00815A00725J97119j16385J50995L7504A71577
$$ plain form
14955 565263 234768 -254517 389168 296589 334958 16283 267910 347936 215711 83190
14944 339372 -6582 457126 238664 309465 276738 179378 -4127 130108 467104 435536 298785
14933 298785 273917 387737 350710 157987 165958 240820 385435 224361 265180 -47564 38426
14921 257839 168914 218043 371851 334515 121194 344603 121325 104484 647760 276342
14910 391949 1352 203057 250859 249323 474899 119217 278823 131681 -45367 5997 249381
14899 249381 450146 133647 432501 505639 242325 66671 376184 467389 57984 549047
14889 549047 -5434 269823 280481 506838 463471 465784 293964 148361 368557 363937 406386
14878 406386 536178 443714 133255 234070 100725 297844 181459 332454 369958 171577
14867E25200k6558g5929B27701N8602P3924M4433K12464k97901A55145K56288
14857D11433j22855p4629R6881J3583K33622K07293A46526K04335G5627N61031
14847F36658k93754j39367O8717m2876K04224A63648J58557L27789l6019k84523
14837C29452J58085K767l047j43153K56813p5837k36117J5148N942O6075n7663
14826C18465O3424A65149M83485A96977J65783j12645L04342j42615p0960O0187
14816D01069R351L1741O2896j27231K3326K8482j42365K06534J01925j79329J57858
14805E74257j08604J19949k52175L62769j59199j73242M05059C12986J36100q3489
14795C65597J42288N6670j19429M06m3771O203J5473J2702N2300L99217C72201
$$ plain form
14867 525200 498642 -75929 227701 286303 360227 404660 617124 319223 155145 411433
14857 411433 288578 213949 310830 324413 558035 765328 146526 350861 75627 636658
14847 636658 342904 203537 272254 229378 433602 163648 322205 649994 613975 329452
14837 329452 487537 490304 487257 344104 600917 525080 288963 304111 310053 376128 318465
14826 318465 381889 165149 648634 196977 362760 250115 554457 411842 340882 401069
14816 401069 410420 442161 505057 377826 401152 429634 287269 493803 595728 416399 574257
14805 574257 465653 585602 333427 696196 536997 363755 768814 312986 449086 365597
14795 365597 507885 564555 445126 445532 401761 407964 423437 436139 488439 887656 372201
14783E50000j88634J21327K3171j27238o8288L75046P8641l11295J96442j88862
14773D60310K17126J50890A37842L55504j36713K12100j05407M7524P7564J45208
14763G33622j33091J91471j43648O3098k68730K5168R0774j70184M88128k4965
14753H51643k56913r5515N54577E22911P3309l5512o8057K38570k09334J80019
14743G01906L28864m45260K66796j88794J10096j48479K83438k51189p061K2345
14733F72662j19480R3182p8089L91307k87177M12690D79365K93280C44281L66991
14723G11272q2133L48679k35472r5016j12045J82901J69989k00968J49814k53503
14713E83518M2965o6776L49421j35229K9332J59552K4082m65043J10378L49274
$$ plain form
14783 550000 361366 482693 505864 378626 310338 685384 764025 452730 649172 460310
14773 460310 677436 828326 137842 493346 356633 568733 463326 510850 588414 733622
14763 733622 600531 792002 648354 711452 442722 467890 558664 388480 876608 851643
14753 851643 594730 499215 1053792 522911 596220 560708 492651 731221 521887 701906
14743 701906 1030770 585510 852306 663512 773608 625129 908567 657378 650317 672662
14733 672662 553182 646364 568275 959582 672405 1085095 479365 772645 344281 711272
14723 711272 629139 977818 742346 647330 535285 718186 888175 687207 837021 583518
14713 583518 626483 559707 909128 773899 803231 962783 986865 521822 632200 981474
14703I81474m76190J79444J25983p6123k79263N88275p0379m81012M94577l3687
14693I53099j11700M3295L7124n2374N1009k69136K35603j03817K09514P0537
14683A063154n0817L5370j49189J56510j00112L4192j79971R267K70204K1082
14673A109690j08499j05546M50994m24747o2074l1119K17643j99117K28842j54509
14663I21558p7009K68442o3873K8187r5985j91867Q7273J08164J6955L23794j15429
14652A210210k94798K14840j88539R3275N8897K08039n5384k4545r2950k84669
14642H44376J47246J41047Q4873q2847j10790O466O07200n31537O2289j2029J39011
14631A295305k94183M83445l72803n7815K97215l35934M74157j65219j71849J41619
$$ plain form
14703 981474 505284 684728 810711 734588 455325 1043600 973221 492209 986786 953099
14693 953099 841399 884694 921818 869444 920453 651317 886920 783103 992617 1063154
14683 1063154 1012337 1047707 898518 1055028 954916 989108 809137 818404 1088608 1109690
14673 1109690 1001191 895645 1346639 921892 859818 828699 1046342 847225 1076067 921558
14663 921558 844549 1112991 1049118 1077305 981320 789453 876726 984890 1001845 1325639 1210210
14652 1210210 915412 1130252 941713 1034988 1093885 1301924 1246540 1221995 1129045 844376
14642 844376 991622 1132669 1217542 1134695 1023905 1030371 1637571 1106034 1168323 1156294 1295305
14631 1295305 1001122 1484567 1111764 1053949 1351164 1015230 1489387 1324168 1152319 1293938
14621A293938O644J30497k79739P566L34119j28838K0905M5203q440l37711N95046
14610A679190j44597o5748k10730N9055R1935p8683K99680k47533J20358n9061
14600A443866J45428j86917p7203Q7486L11454l11008L47694p6577m55695L75554
14590A604082J89972J19918m0976j93653p9815J64264Q3577j75446L28725j79183
14580A821465r8674J10993J15191k02322L31502l17216M42261K8224q6325j54144
14570A990955R9674J4066J0821K69951l04095L13774l47242L22319m6992J78949
14560B502180O5303K80090q7163K93319N9419K33627M6523n3788N68014P17021
14550D624545J030771K027963M353794Q692072K0017897r55401A7811043F801852
$$ plain form
14621 1293938 1300582 1431079 1151340 1158906 1493025 1364187 1385092 1430295 1421855 1084144 1679190
14610 1679190 1534593 1468845 1258115 1317170 1409105 1330422 1630102 1382569 1502927 1443866
14600 1443866 1589294 1402377 1325174 1412660 1724114 1413106 1760800 1684223 1228528 1604082
14590 1604082 1794054 1913972 1872996 1679343 1599528 1763792 1847369 1671923 2000648 1821465
14580 1821465 1722791 1833784 1948975 1746653 2078155 1760939 2203200 2231424 2145099 1990955
14570 1990955 2090629 2104695 2115516 2385467 2081372 2395146 2047904 2370223 2323231 2502180
14560 2502180 2567483 2847573 2760410 3053729 3113148 3346775 3393298 3339510 3907524 4624545
14550 4624545 5655316 7683279 12037073 20729145 40747042 39791641 17811043 6801852
14541C384247q71583m52812j99665r0754R9106j26322n2878Q710J69054R8734
14531A965837L8399j01756L67053l99713K25341L41345k87292j95151J15395j11008
14521A958450O15891j14168K23653m63699K40797J3901j02903J09535K03746j43216
14511B541987k5985K46783n3704j84210L29478j68750K83697O118o4657P6028
14501B986785q3616L6783N1840P3540J7751m03968L22233J15867Q3046J06608
14491C306869l0021n8939L7311O81J11067J04630N0804J53774j00213M7553j0872
14480C612644j40835M44791K940K7947j65110L05952r2556k95818N25920j38052
14470D087823n3696k33543J42645J52684K45126k04809J99356j48989K84755n8198
$$ plain form
14541 3384247 2512664 2059852 1860187 1769433 1868539 1742217 1689339 1698049 1867103 1965837
14531 1965837 2004236 1902480 2269533 1869820 2095161 2436506 2149214 1954063 2069458 1958450
14521 1958450 2574341 2460173 2683826 2220127 2460924 2474825 2371922 2481457 2685203 2541987
14511 2541987 2516002 2762785 2709081 2524871 2854349 2685599 2969296 2975414 2910757 2986785
14501 2986785 2903169 2939952 2991792 3065332 3083083 2679115 3001348 3117215 3200261 3306869
14491 3306869 3276848 3217909 3255220 3255901 3366968 3471598 3522402 3676176 3575963 3623516 3612644
14480 3612644 3471809 3916600 3919540 3947487 3782377 4088329 3995773 3699955 4225875 4087823
14470 4087823 4034127 3800584 3943229 4095913 4341039 4136230 4335586 4186597 4471352 4413154
14460D413154J79553J56043J48249j03518l4900J95935L28853o14952N53433k39347
14450D982503J15064R3031L00499k78791Q7253K87956K9774M58199m40182j40201
14440E495105L34631k66181L09795p0108J57721N54322j26793k69698L04701m5780
14430F377715J39793j2962K21432K11334O0532k47090K18124R4928J73638L23337
14420G560781K06313k37345J17777J5749Q4242L38710l1665o630j635L38258J17078
14409H501633K45075q9430K92609l9563K95482p067R0539N70284o4750n9035N20697
14398A0256474J96323j17024L49308p1209K47277J33427J12808L20000P2480j4039
14388A1485825M35600J93837J71587L18174M26273J8704L08409K98118O08602
$$ plain form
14460 4413154 4592707 4748750 4896999 4793481 4758581 4954516 5283369 4668417 5221850 4982503
14450 4982503 5097567 5190598 5491097 5212306 5299559 5587515 5617289 6075488 5635306 5495105
14440 5495105 5829736 5563555 5873350 5803242 5960963 6515285 6388492 6118794 6423495 6377715
14430 6377715 6517508 6504546 6725978 6937312 6997844 6750754 6968878 7063806 7237444 7560781
14420 7560781 7767094 7529749 7647526 7663275 7747517 8086227 8054562 8047932 8046297 8384555 8501633
14409 8501633 8746708 8657278 8949887 8910324 9205806 9198739 9289278 9859562 9794812 9735777 10256474
14398 10256474 10452797 10335773 10685081 10613872 10861149 10994576 11107384 11427384 11499864 11485825
14388 11485825 11921425 12115262 12286849 12605023 13031296 13050000 13358409 13656527 14265129
14379A4265129k95171M56408N10458j08469M99202j04064O43982N55882K6370
14370A6449727M18725K63003O98128l0662N06033L01918L94218M95822J53914
14361A9650826N53279M42137N24930N16848M53202M96150N03189O37855L14896
14352B4093312P03083L34747Q63173Q92944M98128P80656N36116Q00718N47371
14343C0050248P86069Q68942Q97209J038971P98082Q25087J144490J101791J148453
14334C8659342J114482J042602J435228J050226J587866J543308J565734J185052
14326D9183840J469774K067162J642685J681609J943539K318708K157263J947261
14318F4411841K881383K119081K711021K832830L055728L135917L164785L108996
$$ plain form
14379 14265129 13969958 14426366 14936824 14828355 15327557 15223493 15867475 16423357 16449727
14370 16449727 16868452 17131455 17829583 17798921 18304954 18606872 19001090 19496912 19650826
14361 19650826 20204105 20646242 21171172 21688020 22141222 22637372 23140561 23778416 24093312
14352 24093312 24796395 25131142 25994315 26887259 27385387 28166043 28702159 29502877 30050248
14343 30050248 30836317 31705259 32602468 33641439 34439521 35264608 36409098 37510889 38659342
14334 38659342 39773824 40816426 42251654 43301880 44889746 46433054 47998788 49183840
14326 49183840 50653614 52720776 54363461 56045070 57988609 60307317 62464580 64411841
14318 64411841 67293224 69412305 72123326 74956156 78011884 81147801 84312586 87421582
14310H7421582M290097L459796M170054M456593M275221N039675M774235N630278
14302A23517531N559321N972598O246493O735932O943672P268232P463394Q474329
14294A78181502Q581021R328442R732771J0493409J0363272J1377009J1809552
14287B49866978J2092467J2756364J2983901J3566683J3558993J3858829J3420694
14280C42104909J3451256J3819575J2845833J2505497J1312416J0153506Q245359
14273D24438351M380072J797519J414232J753170j315363k367274l777263o014955
14265D20308489q648193j0866460j2264520j2885909j3889696j4595075j4869576
14258C32289060j4677155j4829190j4466718j3451894j2871149j3404826j2303019
$$ plain form
14310 87421582 91711679 95171475 99341529 103798122 108073343 113113018 117887253 123517531
14302 123517531 129076852 135049450 141295943 148031875 154975547 162243779 169707173 178181502
14294 178181502 186762523 196090965 205823736 216317145 226680417 238057426 249866978
14287 249866978 261959445 274715809 287699710 301266393 314825386 328684215 342104909
14280 342104909 355556165 369375740 382221573 394727070 406039486 416192992 424438351
14273 424438351 428818423 430615942 432030174 433783344 432467981 430100707 426323444 420308489
14265 420308489 411660296 400793836 388529316 375643407 361753711 347158636 332289060
14258 332289060 317611905 302782715 288315997 274864103 261992954 248588128 236285109
14251B36285109j1784252j1325270j0612205j0075169r781407q568898q490595
14244A65647313p664423p695342o921262o743921o156618n741721n769222m775209
14236A14179595n213981m638226m404521m161094l706712l306367l750321l485262
14228H1513111l515279k509087l059192k452673k293042k401669k464465k066911
14220F0750793k119905j920837k202096j612169j687610j515042j256730j589092
14212D6847312j425664j525293j074381j456470j188817l36844j415208j201540
14204C7223095j241075q43048q97160q68907n78653j011973j121020o59543q92607
14195B9109109o16542o03624k59855j282288o50648o09893m40431q31158l30180
$$ plain form
14251 236285109 224500857 213175587 202563382 192488213 182706806 174137908 165647313
14244 165647313 157982890 150287548 143366286 136622365 130465747 124724026 118954804 114179595
14236 114179595 108965614 104327388 99922867 95761773 92055061 88748694 84998373 81513111
14228 81513111 77997832 75488745 72429553 69976880 67683838 65282169 62817704 60750793
14220 60750793 58630888 56710051 54507955 52895786 51208176 49693134 48436404 46847312
14212 46847312 45421648 43896355 42821974 41365504 40176687 39839843 38424635 37223095
14204 37223095 35982020 35138972 34241812 33372905 32794252 31782279 30661259 30001716 29109109
14195 29109109 28492567 27888943 27629088 26346800 25696152 25086259 24645828 23814670 23484490
14186B3484490n95329l96019m98242q54065j34111n20311m16125m66482k54947
14177A9348859m28461k54647o36428n28907j69792k04250n45745l26536k19654
14168A6034439r3119n51471j3277p17909J49956m69518n18437L02623o59774q0399
14158A3383114j08238m98044j87642k37833k12785k24647o8587J6149j14717o93988
14148A1052782J43942m2884l56103q0664k21689j55520j79967k46807j51986j32630
14138I628474M9858j86821k06598n1875m90248J7139J26855m59970m1796j24166
14128H260852m57684K77492n0329m75877M3494P2172m06933M29731l57403k59419
14118G076096N8346k3589l41803L53272o11732M16923k15969k13098K6344j63023
$$ plain form
14186 23484490 22889161 22493142 21994900 21140835 21006724 20486413 20070288 19603806 19348859
14177 19348859 18920398 18665751 18029323 17500416 17330624 17126374 16580629 16254093 16034439
14168 16034439 15941320 15389849 15376572 14658663 14808619 14339101 13820664 14123287 13463513 13383114
14158 13383114 13274876 12776832 12589190 12351357 12138572 11913925 11845338 11861487 11746770 11052782
14148 11052782 11196724 11153840 10797737 10717073 10495384 10339864 10159897 9913090 9761104 9628474
14138 9628474 9678332 9491511 9284913 9233038 8742790 8759929 8886784 8426814 8385018 8260852
14128 8260852 7803168 8080660 8030331 7554454 7597948 7670120 7263187 7692918 7335515 7076096
14118 7076096 7134442 7110853 6769050 7122322 6510590 6927513 6711544 6498446 6524790 6361767
14108F361767j63686K52359m53143K11563j95336n4610m23050K94183k84427K22224
14098E767844m34512L07338j30397l59763J22201j40512M62319n40647q7445J183
14088D967609o2807j66484L21854m27708N84049n43852j70753o7143K70057k16371
14078D488451k6453n5023j86036J96990l2163k07922r6782J68083m1473j15323
14068D092349j70054J90264r4599l68736K61455j13839k0966J52008R0550j30113
14058C888319n1648M4549Q340l99592J61293l77316K75006j33286K68370m09848
14048C274187M7941j75337r553j51280r5930J03115j45278k505j51484L45451
14038C039327l0163o517j4890l9751J36410k10366J10896J20151l99836k26655
$$ plain form
14108 6361767 6198081 6450440 5997297 6208860 6013524 5958914 5535864 5830047 5545620 5767844
14098 5767844 5333332 5640670 5510273 5150510 5272711 5132199 5594518 5053871 4966426 4967609
14088 4967609 4904802 4738318 5060172 4632464 5216513 4672661 4501908 4434765 4704822 4488451
14078 4488451 4461998 4406975 4220939 4417929 4385766 4177844 4081062 4249145 4207672 4092349
14068 4092349 3922295 4112559 4017960 3649224 3910679 3796840 3775874 3927882 4018432 3888319
14058 3888319 3836671 3881220 3889560 3489968 3651261 3273945 3548951 3415665 3684035 3274187
14048 3274187 3322128 3146791 3137238 2985958 2890028 2993143 2847865 2845360 2693876 3039327
14038 3039327 3009164 3002647 2987757 2948006 3084416 2874050 2984946 3105097 2705261 2478606
14028B478606K61925K777j25469L60632p27588K26925M4390J4735J33980k92791
14018B378122K97448o6424m74577M7072O1862O1320M046N3659k32411L20247j8642
14007B431722N820k46229m8015k06238J63054j80744K79531J06662p4326j31021
13997B100216l3606j00495J83340R4208J23006k16187N44236N7144J481271K802420
13987G035553O821580K0319382R473908B1576578j0652731m026190j594220q19440
13979D483997p93388m51112m84374J5119p3904l3525J46673k39165R177n86741
13969A992757M61147k27527j00881K12312J25469k60404j91406J36842n30077
13960A618232M88923k78752J08541r2767J31386J12020l23241j21309K45937j03708
$$ plain form
14028 2478606 2740531 2743308 2617839 2978471 2250883 2477808 2522198 2536933 2670913 2378122
14018 2378122 2675570 2609146 2134569 2181641 2243503 2304823 2308869 2362528 2130117 2450364 2431722
14007 2431722 2437542 2191313 2143298 1937060 2100114 1919370 2198901 2305563 2231237 2100216
13997 2100216 2066610 1966115 2149455 2243663 2366669 2150482 2694718 2751862 4233133 7035553
13987 7035553 13857133 34176515 43650423 21576578 10923847 6897657 5303437 4483997
13979 4483997 3690609 3239497 2755123 2770242 2696338 2662813 2809486 2570321 2579498 1992757
13969 1992757 2453904 2226377 2125496 2337808 2463277 2202873 2011467 2148309 1618232
13960 1618232 2107155 1828403 1936944 1844177 1975563 2087583 1764342 1643033 1888970 1785262
13950A785262J4660j35648M1778o342K98618k28260l3583k94383L66336m37509
13940A370929M93904k52647K62412l42018q7644K00724m62272O68795l690m25287
13930A423206n2866K26320m3112n9389j51756j38580J61606L08375k4973j14493
13920A534338K8065j37245J7353K72892m22555L16090k39791J40166p386l25438
13910A176489J42924j2705O3918p0318K16799j80995k30372L00673J1832k06222
13900A212023L4204J36467p1429N8137j37722k56728L21075q6733r6698J51258
13890A263854J09096k54347K4510j06941K09569j17852k35743L6764K50761J67012
13880A346683k91066L35026k24502K18361L2161o40861L78590K855k57586K68064
$$ plain form
13950 1785262 1799922 1664274 1706052 1699710 1998328 1770068 1736485 1442102 1808438 1370929
13940 1370929 1864833 1612186 1874598 1532580 1444936 1645660 1183388 1852183 1848493 1423206
13930 1423206 1370340 1596660 1553548 1494159 1342403 1203823 1365429 1673804 1648831 1534338
13920 1534338 1562403 1425158 1442511 1715403 1292848 1608938 1369147 1509313 1501927 1176489
13910 1176489 1319413 1306708 1370626 1300308 1517107 1336112 1105740 1406413 1418245 1212023
13900 1212023 1246227 1382694 1311265 1369402 1231680 974952 1296027 1209294 1112596 1263854
13890 1263854 1372950 1118603 1143113 1036172 1245741 1127889 892146 928910 1179671 1346683
13880 1346683 1055617 1390643 1166141 1384502 1416663 775802 1154392 1157247 899661 1167725
13870A167725K5443J60223l82987K1969p9295M02031m54645L08301k3748J01993
13860A247010l84024j55183R911M59646k12618n5791k2035j38452K88647j9935
13850A017176J09084D94585J91467L18608r3038k31110P5615j39855J14849J00219
13840H31340j95076L43547j21558J84215j16882K8743j01410k18181K29865O8938
13830I33541l06130L41526J26968m47271J75801j34007J56908N0619m2778p9399
13820G75778q5278J83880J77378j35134r9586P6080j05146Q4976J0031j83751
13810F99228L87976l66579k47198L35631O1819l03748L06894l67090J13625J87138
13800H07696j61722o5122K90326m8825j26307L76627E27300L09085j56769J00488
$$ plain form
13870 1167725 1193168 1353391 970404 992373 913078 1315109 860464 1168765 1145017 1247010
13860 1247010 862986 707803 717714 1177360 964742 908951 886916 748464 1037111 1017176
13850 1017176 1126260 494585 686052 1004660 911622 680512 756127 616272 731121 831340
13840 831340 636264 979811 858253 1042468 925586 954329 852919 634738 864603 933541
13830 933541 627411 968937 1095905 648634 824435 690428 847336 897955 855177 775778
13820 775778 690500 874380 1051758 916624 817038 893118 787972 872948 882979 699228
13810 699228 1087204 720625 473427 809058 870877 567129 874023 506933 620558 807696
13800 807696 645974 580852 871178 822353 696046 1072673 527300 836385 679616 780104
13790G80104J354O2897j05062q169K3990R8331k00446n9996J84250j52964j00437
13779E23852N13977m77448N2031K17477q8852j30701J47274q5112l1331j20902
13769E20265J93885R5495l33169k3794L28358j73686B78822N22172O5977j24220
13759G42751K07724j1774m16823n3882L32935j49244J20718p6124o631K19609
13749I09259l75095Q4756J98391k96651J89030J12223l75197J14155m9489k6204
13739D85178R8707p3063j18948l3006L21382j01990j10063p6909L78706J26124
13729H96118k45200J7230n8646N10J28774q1423k0012j12744o5990J5061B30770
13717G68841j51072j12299j14215K35638m5088M2034j50463J25283K6225J24321
$$ plain form
13790 780104 781458 844355 739293 731124 755114 853445 652999 593003 777253 624289 523852
13779 523852 1037829 560381 612412 829889 741037 610336 757610 672498 641167 520265
13769 520265 714150 809645 476476 452682 781040 607354 278822 800994 866971 742751
13759 742751 950475 938701 521878 467996 800931 651687 772405 696281 689650 909259
13749 909259 534164 618920 817311 520660 709690 821913 446716 560871 511382 485178
13739 485178 583885 510822 391874 358868 680250 578260 468197 391288 769994 896118
13729 896118 650918 668148 609502 610012 738786 657363 637351 524607 458617 473678 230770
13717 768841 617769 505470 391255 626893 581805 623839 473376 598659 624884 749205
13707G49205j11846l8960k09458o4764J33093O0782L6376j2267l1012B07937L38250
13696E46187k06797r533J9443K77082k88412K89774J37345A29361M03725B41383
13685C36474K18593o9174j4518J68726j82996J61411B69442M29570B80021j0880
13675B69141J65144R9329j52311P3196B12795J67995j66424M27085B62768K66945
13665E29713j75400r5256J10471J39502A49414J77585L8271J17408q0834J60350
13655E62194B55810L7307R1851J84676k69432G2646K18561K32862l5556j51404
13645C37109o362q1642K17916M3884I4890J24281G9148N73407A91537L42089j22782
13634D10844K19220M8302k11080j05569J53071H1917J77050K41302j51284j51363
$$ plain form
13707 749205 637359 598399 388941 324177 457270 518052 554428 542161 511149 207937 546187
13696 546187 339390 329857 349300 626382 337970 627744 765089 129361 533086 241383
13685 336474 555067 485893 471375 640101 457105 618516 269442 699012 280021 269141
13675 269141 434285 533614 381303 454499 212795 380790 214366 641451 262768 529713
13665 529713 354313 259057 369528 509030 149414 326999 365270 482678 401844 562194
13655 562194 255810 293117 384968 569644 300212 72646 291207 524069 488513 337109
13645 337109 330747 249105 467021 510905 94890 219171 79148 652555 191537 533626 410844
13634 410844 630064 678366 467286 361717 514788 81917 258967 500269 348985 197622
13624A97622Q8216P8035O4619k7471p4453J78458j81624A24603O65903j97288
13614E93218q4589k17580p03L41150B68943A07059L79590A00131L59959j30113
13604C29977P7247K3197I0627L64253q1672A23216P6929m2542L00440j30502R5084
13593D22625L9422A42766L28667B32150l8836J15675L326R501p7533J90891j42820
13582B92354K5362G7080N8477K8219K1616J0239L97493B3931J75791J5308J4375
13571B29405J23435K2794G4913J6771J25245j8095L04367a12966B24748j2876
13561B11872l4081M73654B68489p9201J00449M25770C53815c7927D83371B19098
13550B83715L47467A66347Q0179r1196J61711I9536J40372J42661j82427L39158
$$ plain form
13624 197622 285838 363873 428492 401021 326568 505026 323402 124603 790506 593218
13614 593218 508629 291049 290346 631496 268943 107059 486649 100131 460090 329977
13604 329977 407224 430421 90627 454880 373208 123216 200145 157603 458043 327541 422625
13593 422625 462047 142766 471433 232150 193314 308989 312315 321816 244283 435174 292354
13582 292354 317716 77080 135557 163776 185392 195631 593124 23931 199722 215030 229405
13571 229405 352840 375634 74913 91684 216929 198834 503201 -112966 224748 211872
13561 211872 177791 651445 268489 189288 289737 715507 353815 -37927 483371 219098
13550 283715 631182 166347 246526 155330 317041 99536 239908 382569 200142 539300
13540E39300k52858H8910M34726l1110p0745C2446K26405a01949E6297K03949
13530B60246C8537M13116j27180f1820A95766J30974A59029n1608K51798J99051
13520E58270q8037j01350H1869j3191K37279KA25120D4191K30844Q4154k8416
13509C30773K98424j47167D5018L52672p0491q5386R0903n0729A25883J43225
13499B69108P8753j44337l3375L35794A44642q674J08479b4495C24287A58798
13488D57770A18111M0690J00430C2174Q4200J3536Q0120n8949a3893A92011D4114
13476h1106h420E7910J62062O1783N93j06751J34372j1568a18263C03612o3059
13465B40553Q8790j38959K99305F9527J10286n0102L22947d0830E8959M97491
$$ plain form
13540 539300 286442 88910 523636 492526 421781 32446 258851 -101949 56297 260246
13530 260246 38537 451653 324473 -61820 195766 326740 159029 107421 359219 558270
13520 558270 470233 368883 81869 68678 305957 305959 125120 44191 275035 359189 330773
13509 330773 629197 482030 45018 397690 327199 241813 332716 281987 125883 269108
13499 269108 347861 203524 170149 505943 144642 135968 244447 -24495 324287 158798
13488 457770 118111 158801 259231 32174 116374 129910 210030 151081 -13893 192011 44114
13476 -81106 -8420 57910 219972 281755 282348 175597 309969 298401 -118263 303612 240553
13465 240553 329343 190384 489689 69527 179813 129711 452658 -40830 58959 556450
13455E56450B72352J40119D4382K13756J51703j54023N1008I7549J06297j4120
13445A89726J36869O9720l5279L3758A48270J3014J46562A08228K01337P4252
13435C83817n1369a30378C6491R20b577B02351j1118q2651K15742r7686P2282
13424B98920r3241K13648A78149D8510K93216Q1161j79422O9934K0112E5573K12961
13413B68534D164L81503H7813L65306g3183C52847a58283q435D3700O0360m6384
13402E7676J79985B5519a13523A25777J21452r7090j4526j6981M0136L2945K96318
13391D88031j40176I7651J67000O3733G7937J72435J90097b94428B9026M5707
13381G4733K45451q7203r4402q697C1366K37110r1325C9516a63974H0775L16524
$$ plain form
13455 556450 272352 412471 44382 258138 409841 255818 306826 97549 203846 189726
13445 189726 326595 396315 361036 394794 148270 161284 307846 108228 309565 383817
13435 383817 332448 -130378 36491 37411 -2577 202351 191233 108582 324324 226638 298920
13424 298920 205679 419327 178149 48510 341726 422887 243465 313399 333511 55573 268534
13413 268534 4164 385667 87813 453119 -73183 352847 -158283 -166718 43700 104060 57676
13402 57676 237661 25519 -113523 125777 247229 150139 135613 118632 158768 191713 488031
13391 488031 347855 97651 264651 328384 77937 250372 440469 -294428 29026 74733
13381 74733 320184 232981 138579 129882 31366 268476 177151 39516 -163974 80775 397299
13370C97299n3579A25476E1313K91080K4099r2898l2058G9741a02260B60624j21510
13359A39114K64696a50855D15730G3560M5493K36949A21266i5221C04766e7732
13348B53570j00211P7791D9640L91115A81957n2137Q5685N0784J16900P375k2292
13337C68272A0721K22821L82694B69252A30871J33361J70263k0688j83982I8535
13326A17608J19048C4804b9866D86935A69795J5414C7747J40519o6027R0467p5125
13315A27581J02875K00425j08079J54825J14400A14585K23427M1972j80183N6607
13305B56408B2818b076A82912G6603K42614J01414C3463K10653L9215a71379C01359
13293A706K93669I9046M4806K26892I8234R8898a82646d7039A59209K30113j03826
$$ plain form
13370 397299 343720 125476 51313 342393 366492 273594 241536 79741 -102260 260624 139114
13359 139114 403810 -150855 415730 73560 119053 356002 121266 -95221 304766 -57732
13348 253570 153359 231150 49640 440755 181957 129820 215505 266289 383189 390564 368272
13337 368272 10721 233542 616236 269252 130871 264232 434495 413807 229825 98535
13326 117608 236656 34804 -29866 486935 169795 185209 37747 178266 112239 202706 127581
13315 127581 230456 430881 322802 477627 592027 114585 338012 379984 199801 256408
13305 256408 22818 -2076 182912 76603 319217 420631 33463 244116 283331 -171379 301359
13293 1706 295375 99046 143852 370744 98234 197132 -182646 -47039 159209 389322 285496
13282B85496A23750b30107M9149H2565j975J5351k6523K72916A33664n1866J16230
13271A98028D9914b505o448C71533D6996a4855k95703D6343J93702a50074D8751
13259D2768J07418G868L22466a06827L7750E0694J04761a60358b3343A79619J60354
13248C39973B5005a16742j49149B56338j01615L7887E6423L85222j95341J31327
13238C77631a11688D28793j39824A22897K95953a1008A21382J35909c14857A32879
13227G0666J0122K80182g9704k2513a7628B86705k0750J09028A32466J74617D2591
13215A22717d1355l25246A26309B5492a49038H6805c71405D63534B10290q9205
13205A21085j2731a71872h1051c5752B57671d4945B80109p3097a57685o7044C62615
$$ plain form
13282 285496 123750 -230107 -180958 82565 80590 95941 69418 342334 133664 81798 198028
13271 198028 49914 -2505 -8953 371533 46996 -14855 -310558 46343 240045 -150074 48751
13259 42768 150186 7868 330334 -106827 -69077 50694 155455 -160358 -23343 179619 339973
13248 339973 25005 -116742 -265891 256338 154723 192610 56423 441645 246304 377631
13238 377631 -111688 428793 288969 122897 418850 -11008 121382 257291 -314857 132879
13227 70666 80788 360970 -79704 -102217 -17628 286705 265955 374983 132466 307083 42591
13215 122717 -41355 -366601 126309 25492 -149038 86805 -371405 463534 210290 121085
13205 121085 108354 -171872 -81051 -35752 257671 -44945 280109 207012 -157685 -224729 362615
13193a15754D49487E222c7686n633A0346J06686c67217i5585C63138b7938B51381
13181C07960D9226J18077C4065L0900J80663b87305A27504M2308A9117a04986
13170B4004h9259A17879P0589F2974J6720J91551j03380L45545H7741J18460m7394
13159A58807J39549e3490E2612k0253b28455E6521K72019j56560p7653f3354B51339
13147d0958j22761D1180Q494L9249R7521J287N8977h9917B09872l100b55633i0248
13134c2953B16916F3740b66k9040B61703d3142B80529E3742a70268D4009J27808
13123A71817b9225G3813i3206A59488m3421K2128P5562d5632B44158E2018K52283
13112C04301F2048J65601F7428N4943K83136E9323a34241A73932c3582c108E4894
$$ plain form
13193 -115754 449487 5222 -37686 -43319 10346 117032 -367217 -95585 363138 -27938 251381
13181 307960 49226 167303 34065 64965 245628 -287305 127504 169812 19117 -104986
13170 24004 -89259 117879 188468 62974 79694 271245 167865 513410 87741 206201 158807
13159 158807 298356 -53490 52612 32359 -228455 56521 328540 171980 94327 -63354 251339
13147 -40958 -163719 41180 49674 88923 186444 187731 246708 -89917 209872 206772 -255633 -90248
13134 -32953 216916 63740 -266 -29306 261703 -43142 280529 53742 -170268 44009 171817
13123 171817 -29225 73813 -93206 159488 116067 138195 213757 -45632 244158 52018 304301
13112 304301 62048 227649 67428 122371 405507 59323 -134241 173932 -33582 -3108 54894
13100h1558A45183b2270A95426a18206c1496A82030q3753J26503e8090j1355A30924
13088A21903J48572c6163D13604A3616e7133k1644K4156A33153n6348C2035i7437
13076D9266i8613F7593a66997n8945A57181b89077C76001A05606a53506r528B98565
13064C79771f6405F0092J76595r2085J23604H6457J01161c0516A48613Q4048Q4439
13053C17100c2183l11185b1066B35654O4929A05443a09633d8091D13536a39312
13042A37587b3192A31309c5438m4472A32019p486k1100h9578l29237B82570p4340
13031B08230r6315r879R8489b82469R6260A4115L5994Q6389D0278K91421H787
13019i8602E0668P9353N657a2305B52712q3631m3855O6409J3413q3712J48707
$$ plain form
13100 -81558 145183 -22270 195426 -118206 -31496 182030 98277 224780 -58090 -69445 130924
13088 121903 270475 -36163 413604 13616 -57133 -78777 -54621 133153 76805 32035 -97437
13076 49266 -98613 67593 -166997 -225942 157181 -289077 376001 105606 -153506 -163034 298565
13064 379771 -66405 60092 236687 144602 268206 86457 187618 -30516 148613 232661 317100
13053 317100 -32183 -343368 -21066 235654 300583 105443 -109633 -48091 413536 -139312
13042 137587 -23192 131309 -35438 -79910 132019 124533 103433 -89578 -418815 282570 208230
13031 208230 111915 102036 200525 -282469 -186209 14115 50109 136498 40278 331699 8787
13019 -98602 50668 130021 135678 -12305 252712 169081 125226 191635 205048 121336 270043
13008B70043r0196a35225b7779B70481f7239c1583F3939K3918a84388d0362j8578
12997e8940A10408i9803D47601a26921O2804j20632A68906a32040A86624a08226
12986g023k5766B14672l5570G011K01389k7108b0634B54812j7085j09409a06166
12974a650k10191C79082j22481p8051q6258R602a62385c5901j35511A73282R5450
12963B68732b05090K1912A26360J86842j45115J07138m9712I5406R2594l1017
12953A56983i4157F0343c66651i1935l437j6817d7197C08774A12282p090a3215
12941C10131a22865A94725b37408A60297E2534L07994j59921b88693A13206J21147
12931B34353a32305J2719d1006B29451g9783D06h7354A05347a11625B8341J40775
$$ plain form
13008 270043 179847 -135225 -27779 270481 -67239 -31583 63939 87857 -184388 -40362 -58940
12997 -58940 110408 -99803 447601 -126921 -64117 -184749 168906 -132040 186624 -108226
12986 -7023 -32789 214672 179102 7011 208400 181292 -20634 254812 237727 128318 -106166
12974 -1650 -211841 379082 256601 178550 92292 101894 -162385 -35901 -171412 173282 268732
12963 268732 -205090 -183178 126360 313202 168087 275225 225513 95406 188000 156983
12953 156983 -94157 60343 -366651 -91935 -95372 -112189 -47197 308774 112282 105192 -13215
12941 310131 -122865 194725 -237408 160297 52534 360528 200607 -288693 113206 234353
12931 234353 -132305 -119586 -41006 229451 -79783 406 -87354 105347 -111625 28341 169116
12920A69116e6587J4658A99607g9971c7236D1930Q8111l2604e2806B7562Q1215
12909A08777J75657A6869J8505J10145J20281d2686b0759B13462O8741A09162
12898b91168A4981Q288a76471C345L3010K9288h2241r4017F2509c3865H6377a44393
12885A44509i3357A17346c6944q4336B7746O5039l6840b17314I0145g5033A12760
12873b57785a19129a3600m0277I081a36286J9922B5735a57656f4886B73181n3426
12862B19755G6770a66619L7122E8691a03211C8342E221b23730f5489o9434j7369
12851a52292B50251f8125k24754E09958j26513j39100j09856L751J47457A39542
12840a07606A51900B3278K08189b03576B20686F7006a61337B23658H8963b9475
$$ plain form
12920 169116 -56587 -41929 199607 -79971 -37236 41930 130041 97437 -52806 27562 108777
12909 108777 284434 16869 35374 145519 265800 -42686 -20759 213462 282203 109162
12898 -291168 14981 23269 -176471 3345 36355 65643 -82241 -176258 62509 -33865 86377 -144393
12885 144509 -93357 117346 -36944 -121280 27746 92785 55945 -217314 90145 -75033 112760
12873 -257785 -119129 -13600 -53877 9081 -136286 -116364 25735 -157656 -64886 273181 219755
12862 219755 76770 -166619 -129497 58691 -103211 38342 5221 -223730 -65489 -134923 -152292
12851 -152292 250251 -68125 -292879 509958 383445 244345 134489 138240 285697 139542
12840 -107606 151900 23278 231467 -203576 220686 67006 -161337 223658 88963 -29475
12829C23849A37299P4470b31830k47434F1814c3010H3105M161i3178A77628C1377
12817H49b26810I6508C7853J7714J66442a39389l2260c7830m7998H9293j0626
12806G8667E955M4144R988a22851j1823e0431j39741d1417M990k8398j74398D4442
12793A33874a08788L3305j14614d73k83994J33707A43299J28449a05174A13454
12782C04332a66229B6157a07543r3713f6003k6667j26385B78597a36123A05014
12771I2398N6930B7999K42321i5244F0931J716Q4930J37771c3502H7369N3022
12760A40391a1485E3939L6992R2221a16863H7031O0336a00059B04071c0846m04965
12749d35811H5996i0764A54481J04853G079J88576b4884A6951J12362N7396J51592
$$ plain form
12829 323849 137299 211769 -231830 -479264 61814 -33010 83105 87266 -93178 177628 31377
12817 849 -226810 96508 37853 55567 222009 -139389 -171649 -37830 -85828 89293 78667
12806 78667 5955 50099 60087 -122851 -134674 -50431 -190172 -41417 -36427 -64825 -239223 44442
12793 133874 -108788 -75483 -190097 -473 -284467 -150760 143299 271748 -105174 113454
12782 304332 -166229 26157 -107543 -201256 -66003 -92670 -219055 278597 -136123 105014
12771 92398 149328 27999 270320 -95244 60931 62647 147577 285348 -33502 87369 140391
12760 140391 -11485 53939 90931 183152 -116863 87031 147367 -100059 204071 -30846 -435811
12749 -435811 85996 -90764 154481 259334 7079 195655 -24884 16951 129313 186709 338301
12738C38301a00767b0258A21530n3605J50026b47590r5020e7159B45005c7229
12727i8623I169P5479I308N1154i8617j77541A10333Q9052O2070a85315F5382
12715f8936G0258j9295J36190R4664L50408A94474O11514h6770A70762K0048p6842
12704A13968E6975R6384a8435I1952A0108b13450F4394a80770A24164M2141c61622
12692B65156a07725o8269H1648a09297C58893f0121F6306c3479f905C49521A03342
12680C40593L0885G0559J38695M4743R0389e6738B85961a47223o9835Q9578j22907
12669b50387I8991K04755i6772j08683H0398J54924a1389k14993A2295c20398
12658A20139l8022b238D48289A27928n4674J18059J82062e934o5705C06910h6871
$$ plain form
12738 338301 -100767 -20258 121530 67925 217951 -247590 -342610 -57159 245005 -37229
12727 -98623 9169 84648 9308 60462 -98617 -276158 110333 199385 261455 -185315 65382
12715 -68936 70258 50963 187153 281817 632225 194474 805988 -86770 170762 190810 113968
12704 113968 56975 153359 -18435 91952 10108 -213450 64394 -180770 124164 166305 -361622
12692 265156 -107725 -175994 81648 -109297 358893 -60121 66306 -33479 -6905 349521 103342
12680 340593 371478 70559 209254 253997 344386 -56738 285961 -147223 -217058 -127480 -250387
12669 -250387 98991 303746 -96772 -205455 80398 235322 -11389 -226382 12295 -320398
12658 120139 82117 -2238 448289 127928 73254 191313 373375 -5934 -71639 306910 -86871
12646A45579c4510D0187g8228A69203a47179H1237a13810e414B70279i8066E5763
12634B96707F0420m234N1403C3343K00952P7671M4462r2340p8m662D2409K24140
12622B66549H8427J29336P1056R0258H5729l6968J04955B3405K12124E1315K333
12611E3648J26287c373A90306E2694a55139A04902D8540J19570K91752A54795
12600b40280D3446i701I1148K64681j31182b10609L3320A41440c26074j8816J71578
12589a73312B59309F8892b6452j1985A91979H3782b1590A0841a21130A51009d9258
12577E1104d3027j70364B06466A02490L29818B01314J943E7148J83972A17437
12566H508a87417A4384a74859I5272l776N2907a33571C82619j52323B7191d1243
$$ plain form
12646 145579 -34510 40187 -78228 169203 -147179 81237 -113810 -5414 270279 -98066 55763
12634 296707 60420 56186 107589 33343 234295 311966 356428 264088 264010 259348 42409 266549
12622 266549 88427 217763 288819 379077 85729 48761 153716 23405 235529 51315 53648
12611 53648 179935 -3373 190306 52694 -155139 104902 48540 168110 459862 154795
12600 -240280 43446 -9701 91148 355829 224647 -210609 -177289 141440 -326074 -344890 -173312
12589 -173312 259309 68892 -26452 -38437 191979 83782 -21590 10841 -121130 151009 -49258
12577 51104 -43027 -213391 206466 102490 432308 201314 203257 57148 241120 117437
12566 8508 -187417 14384 -174859 95272 91496 144403 -133571 382619 230296 27191 -41243
12554B15702k9331F9536i0427c9011A94951f3339F164M1754K20552A31449d8342
12542B1088P1187a10601B3253C943J73511p2899d4132B68715c88041e1156A64607
12530B78006b93259b1244A45570a37791H4376J86556k2522a1649C66689A03423
12519A71361c90823J77368A23852a21352B82266A21951J1140a76497A86491e6814
12508a0031C93153G6761L0938m1876a96183C20770F3442Q8031N449N279a32302
12496b29695g2562I6255b20929A51173g0794D15681C8238a83314A17334e6771
12485i8649C9122b61045B37210B3881a48467j04712A20015J46649a19289A77085
12474A38423C8462A397c9002j37487C0196R0271A1729N2714L4799J0855a20666
$$ plain form
12554 215702 186371 69536 -90427 -39011 194951 -63339 6164 47918 268470 131449 -48342
12542 21088 92275 -110601 23253 3943 177454 104555 -44132 268715 -388041 -51156 164607
12530 278006 -293259 -21244 145570 -137791 84376 270932 248410 -11649 366689 103423
12519 171361 -390823 -213455 123852 -121352 282266 121951 133091 -176497 186491 -56814
12508 -10031 393153 76761 107699 65823 -196183 320770 63442 151473 156922 162201 -132302
12496 -229695 -72562 96255 -220929 151173 -70794 415681 38238 -183314 117334 -56771
12485 -98649 39122 -261045 237210 23881 -148467 -253179 120015 266664 -119289 177085
12474 138423 38462 1397 -39002 -176489 30196 120467 11729 64443 99242 110097 -120666
12462B31671F6538J36245G294J00660H754J7337R9542a82176B10081G7273e55472
12450F7012a3755C7113c47049A09621d1649j03716l8348e1646G9747b61886A16345
12438b66416h2044j18012c9511J2449A79635a48609c020A80380a64880A27980
12427D0387b14892g0015L039j48472j5327R7760B15666B2695J69320d5830B18538
12415A82157q6213J37356J952E3571h846k87450b3330j93943L4733A53324d2735
12403A14347K2619o5995K43420a45717a4129A188a03540c8915m42394A58168p2404
12392H5764l8108J98964I1019l2284f2912A6564N443M9859k5283B47Q499M8c67103
12378c9302p6285C23171C9134a7075A38000g5472A75932a07477j09301b6373D5851
$$ plain form
12462 231671 66538 202783 7294 107954 8754 26091 125633 -182176 210081 77273 -555472
12450 67012 -13755 37113 -347049 109621 -41649 -145365 -183713 -51646 79747 -261886 116345
12438 -266416 -82044 -200056 -39511 -27062 179635 -148609 -3020 180380 -164880 127980
12427 40387 -214892 -70015 -66976 -215448 -230775 -133015 215666 22695 192015 -45830 218538
12415 182157 95944 233300 235252 53571 -8846 -296296 -23330 -217273 -182540 153324 -42735
12403 114347 136966 70971 314391 -145717 -14129 1188 -103540 -38915 -481309 158168 85764
12392 85764 47656 246620 91019 58735 -62912 16564 22007 71866 46583 247 8746 8794 -367103
12378 -39302 -115587 323171 39134 -17075 138000 -75472 175932 -107477 -216778 -26373 45851
12366A22583a2908H1997a83355b6842l6249D4389g2162A11707Q4202g2013c1709
12354i899k33274A2415a8310Q003M578B67684h5973A56140c63296a46471g251
12342A55888a20719A46094F0064I915a4448A56113f8190m12632A52455b11571
12331B02734D6617d7883A29365J114n9670k3816O6256m976a81486A01072a01637
12319a24725b2014o3816b0699r9694p0661B30711A4180Q7663k4563L5402b4847
12307A20738b4487a546A76838F0825a66318f6242b4565j74836A20748J24512e5774
12295A8377c26444A24469c3124B3760J12003O361D7917K89837e5054h721G5186
12283f5999C62115G1689a50057H37d9346a1080B13341B6085O5382m4032b35314
$$ plain form
12366 122583 -12908 81997 -183355 -26842 -63091 44389 -72162 111707 195909 -72013 -31709
12354 -9899 -243173 12415 -18310 -10307 -5729 267684 -85973 156140 -363296 -146471 -7251
12342 155888 -120719 146094 60064 9915 -14448 156113 -68190 -480822 152455 -211571
12331 202734 46617 -47883 129365 130479 70809 46993 113249 108273 -181486 101072 -101637
12319 -124725 -22014 -85830 -20699 -120393 -191054 230711 14180 101843 77280 112682 -24847
12307 120738 -24487 -1546 176838 60825 -166318 -66242 -24565 -199401 120748 245260 -55774
12295 18377 -326444 124469 -33124 23760 135763 142124 47917 337754 -55054 -8721 75186
12283 -65999 362115 71689 -150057 837 -49346 -11080 213341 26085 91467 47435 -235314
12271B48683J32743a3146B38779G9342B3157J10387a85284e4928j36349B446c1325
12259B51452G1021K58925A32830J68679j6020j07651J56353D2153J61573q3282
12249A20444l755K69625b6533A77936n1601c4731l02845H2558K29472A15265B3043
12237A02402L0221a31356B65662B1032Q3137J8169n5571R6502L55951a50504C39027
12225A91895p1748D9116N2266J92760E6154J4105b5353A90370K19337G3194L77272
12214D50466c9977a8323B34869i7136A66358J4273H9861K65791h1430A45435L15370
12203D60805f5186j13947C32990j54194K2854q5007L64007D6050b7780B75850
12192B1082J87098K24888A62512a84638f6390a5007f534k4338C13221o4241L6553
$$ plain form
12271 248683 381426 -13146 238779 79342 23157 133544 -185284 -54928 -191277 2446 -31325
12259 251452 71021 329946 132830 301509 285489 177838 334191 42153 203726 120444
12249 120444 116689 386314 -26533 177936 126335 -34731 -337576 82558 312030 115265 23043
12237 102402 132623 -131356 265662 21032 104169 122338 66767 163269 519220 -150504 339027
12225 191895 120147 49116 101382 294142 56154 70259 -25353 190370 409707 73194 450466
12214 450466 -39977 -18323 234869 -97136 166358 180631 89861 355652 -81430 145435 460805
12203 460805 -65186 -179133 332990 178796 201650 116643 480650 46050 -27780 275850
12192 21082 208180 433068 162512 -184638 -66390 -15007 -6534 -30872 313221 248980 285533
12181B85533a89547C4539i2112H5044J70802a31222A77574O6539n4099G0529c4540
12169B24456d1093j72707g0090n5789D9952L6956J13281J32200g5118A87466b00338
12157A46149D6120e0200D4103c12377a35720A36377a40604A11628a91446R2979
12147i8467A05177j8193C8335J17384r734j3965m6538B0668J24463B4537b5994
12135A88133h9489p7416N4060k01701C2080j3740m069b35470D8644b02398R7769
12124a04629q1522P3259A24139b01267C56498i4439A39663b2361l25918A52403
12113e937l65076H027K2677a84969M0441N1221A00436O1623p5293h3266b1030
12101e6184q3242j24825A26115C6998a71405j15976a03511p4895A331a67043A92159
$$ plain form
12181 285533 -189547 34539 -92112 85044 255846 -131222 177574 244113 190014 70529 -34540
12169 224456 -41093 -213800 -70090 -125879 49952 86908 200189 332389 -75118 187466 -200338
12157 146149 46120 -50200 44103 -312377 -135720 136377 -140604 111628 -191446 -98467
12147 -98467 105177 86984 38335 155719 145985 132020 85482 20668 145131 24537 -25994
12135 188133 -89489 -166905 -112845 -314546 32080 18340 14271 -235470 48644 -202398 -104629
12124 -104629 -186151 -112892 124139 -201267 356498 -94439 139663 -22361 -348279 152403
12113 -5937 -371013 8027 30704 -184969 -144528 -93307 100436 162059 86766 -83266 -21030
12101 -56184 -139426 -264251 126115 36998 -171405 -287381 -103511 -178406 1331 -167043 192159
12089e9116B1389e7022B02389e5527k47247J25793A29988J93720d1115l031A75420
12077A71458B9168K76542J081527N50065E17432F0004a94360N1687D25078A12084
12066A63812g360E69047d6802p1844A7263J2636h9931A41630L5631H4870g1482
12054A45559a99577i7010M1845j39364E00288A08843a02556C69270b08222g0014
12043i1693j6579m4161c7743H4400j6136R9944b50596f3256K709K8291r3532B07851
12030B9880J32073b062C9135f4531D4594R8492K46577A3485K22810b39530G288
12018A47872J05356b79660m5212j15906f4173p5048O1952B86273g7829b1475A34691
12006a46812j49741a44038k11932h6339G3261a46905A20363r149K14835a18792
$$ plain form
12089 -59116 21389 -57022 202389 -55527 -302774 -176981 129988 323708 -41115 -44146 175420
12077 171458 29168 305710 1387237 1937302 517432 60004 -194360 -142673 425078 112084
12066 163812 -7360 569047 -46802 -118646 17263 29899 -89931 141630 177261 84870 -71482
12054 145559 -199577 -97010 -55165 -194529 500288 108843 -102556 369270 -208222 -70014
12043 -91693 -108272 -152433 -37743 84400 68264 168208 -250596 -63256 -60547 -32256 -125788 207851
12030 29880 161953 -2062 39135 -64531 44594 143086 389663 13485 236295 -239530 7288
12018 147872 253228 -279660 -324872 -440778 -64173 -139221 -77269 286273 -77829 -21475 134691
12006 -146812 -296553 -144038 -355970 -86339 73261 -146905 120363 111214 326049 -118792
11995D5848a87694p4271B6234c53283f9961A75697b17657c6864k09903H5428b5953
11983A43085a26121j30294A00700b14273B91364g1834J0144A14359L44423a75305
11972A32485a38316J1454n8130M6457j27842A08958b26521A0742h7042A22023
11961C43593i3800p2012A17140d1871B9371c3702k57914J02873D10301A8727e8925
11949b52985B2967a37375K781A35672c6915I8919g4264C5531d0525J9895e703
11937i032A5057a58373e6160C3305b81829h3867b9099H1409K17973j09045b2056
11925a95069B03990j8274k4131a49421A74395A052d7267o3906j41495C33335C1794
11913B03533f845A89164o9115b18661J3244H0610C0614a5158r6019F7720c11666
$$ plain form
11995 45848 -187694 -261965 26234 -353283 -69961 175697 -217657 -36864 -246767 85428 -25953
11983 143085 -126121 -256415 100700 -214273 291364 -71834 -61690 114359 458782 -175305
11972 132485 -138316 -126862 -184992 -138535 -266377 108958 -226521 10742 -87042 122023
11961 343593 -93800 -165812 117140 -41871 29371 -33702 -291616 -188743 410301 18727 -58925
11949 -252985 22967 -137375 -134594 135672 -36915 98919 -74264 35531 -40525 -20630 -5703
11937 -9032 15057 -158373 -56160 33305 -281829 -83867 -29099 81409 299382 190337 -22056
11925 -195069 203990 185716 161585 -149421 174395 1052 -47267 -111173 -252668 333335 31794
11913 203533 -6845 189164 120049 -218661 -205417 80610 30614 -15158 -111177 67720 -311666
11901a70461B3330a85046B11644j02718l3136b5219A60918b07726l1902h4217
11890b05064F8225R6914i5394I6972a04871G0162L35125h0155A56501h4606C5519
11878a77444A23605i1193k14696B34653g739n1146G4769e0823A07956a33740p7927
11867b11667c7616B56434A7681J95368b79710J1946H5963a02546c9577C01649
11856H1193K7834a74289A19354d8252j4844A40460n3479L0535M3506r878b52016
11844A00803J93680h7179p775l8745b3363B51268b01973Q4239B7571M4225L6870
11833A08666b5094k2918j36682j74415J63700A34384g642k98371l9223c1718I9163
11821c19305O5457j3658H1752a58851k12741a1859o4502A33089d6900l7275n2406
$$ plain form
11901 -170461 23330 -185046 211644 108926 75790 -25219 160918 -207726 -239628 -84217
11890 -205064 68225 165139 -95394 96972 -104871 70162 405287 -80155 156501 -84606 35519
11878 -177444 123605 -91193 -305889 234653 -7739 -58885 74769 -50823 107956 -133740 -211667
11867 -211667 -37616 256434 17681 213049 -279710 -267764 85963 -102546 -39577 301649
11856 81193 109027 -174289 119354 -48252 -63096 140460 86981 117516 161022 151144 -252016
11844 100803 294483 -87179 -94954 -133699 -23363 251268 -201973 -117734 27571 71796 108666
11833 108666 -25094 -48012 -184694 -359109 -195409 134384 -7642 -306013 -345236 -31718 99163
11821 -319305 -253848 -267506 81752 -158851 -371592 -11859 -76361 133089 -46900 -84175 -136581
11810a36581b6316j72099Q5743A31584n5052a43177A81702c67441H9191M2170
11800A31361a49944l2062B7749J00856c2312o3225I6979c41197B6602a20062G6021
11788I8597b02195O1485B3805e4551A81491a04504A72859a5302k8584q4779r0116
11777b18781A16256D9799A0654O4226O7481c96795a17128J2735C3652i4377B18131
11765A69648C5626b699k65399A00057J22618J3426d5926H8540J4363d0455B75429
11753a00061D3395a22663b4920C18107F1033a75361E8089i5946A84949c60880
11742e4881k30226p9911J82094B2471a08526G2105r178k3592d6587A32216a08321
11730a47891j09580G8733C2706P2956m861i8648J208a849j00911A37214a09033
$$ plain form
11810 -136581 -26316 -198415 -112672 131584 76532 -143177 181702 -367441 89191 131361
11800 131361 -149944 -182006 27749 128605 -32312 -95537 96979 -341197 26602 -120062 76021
11788 98597 -202195 -140710 23805 -54551 181491 -104504 172859 -15302 -43886 -128665 -218781
11777 -218781 116256 49799 10654 74880 142361 -396795 -117128 -104393 33652 -94377 218131
11765 169648 35626 -2699 -268098 100057 222675 236101 -45926 88540 102903 -40455 275429
11753 -100061 43395 -122663 -24920 318107 61033 -175361 58089 -95946 184949 -360880
11742 -54881 -285107 -365018 -182924 22471 -108526 72105 62927 39335 -46587 132216 -108321
11730 -147891 -257471 78733 32706 105662 100801 -98648 -97440 -1849 -102760 137214 -109033
11718c48748D064b4589B04816b92057a04308F2435a26508M9936K8122h126n6063
11707f4189j35000P5009H0100L4864J03031i5739j8611I0083d7430k58672D3549
11695g3100E0350J00773a22846C22853a33371F3972K48249a16488o2930F5411
11684b27804O2755B28043e4915a6278G3800J323K07525A14682d6914j62181Q6828
11673a22267H0298b63273J3998A20279j4971B9033Q4694K07251A4170O2704f6178
11661H975J44299c66300B46591j13093E4607a38423O226d4483J6227j3293I0380
11649a4466j92830B38922b56192M9492q5549A892J95842d2686B7068L6097Q9002
11638A52167j8503K016J2772G065K2515a10543o611r1409R7228K4138B59542L35221
$$ plain form
11718 -348748 4064 -24589 204816 -292057 -104308 62435 -126508 -76572 -48450 -8126 -64189
11707 -64189 -199189 -124180 80100 114964 217995 -95739 -114350 90083 -47430 -306102 43549
11695 -73100 50350 151123 -122846 322853 -133371 63972 312221 -116488 -179418 65411
11684 -227804 -165049 228043 -54915 -16278 73800 75123 282648 114682 -46914 -209095 -122267
11673 -122267 80298 -263273 -249275 120279 105308 29033 113727 320978 14170 76874 -66178
11661 8975 153274 -366300 246591 133498 54607 -138423 -132197 -44483 -28256 -41549 90380
11649 -14466 -207296 238922 -256192 -206700 -292249 1892 197734 -42686 27068 63165 152167
11638 152167 133664 135680 148452 7065 29580 -110543 -117154 -208563 -111335 -87197 259542 594763
11626E94763g7361C03872N95R2162E0030A6023a59114C3131c8054k37102C1179
11614A4054J68267J5992k5669L04815i5944q6740f9987J3149G0357J02182N2396
11603B24935m4025F8959J93531m5333J9709G9118L36887A71482a89066C5551e217
11591B12849M956b37285B42103J18789g6749J1964A84998j8750M272a41667B42973
11579A30447a68087j91178C3135g5555A91585D8576H27d2545j23439A09078a48813
11567A13489a04298D65535g6466p5476j03821C63288j24505B4394j2130M2600
11557E4864Q6661J1890b73327H5321c22627B49467a1214G0904g4948A73530J21490
11546B95020A46528a85553C0580L1361g5525a7065K794r580C45628c2664J2615
$$ plain form
11626 594763 -77361 303872 304467 396629 50030 16023 -159114 33131 -38054 -275156 31179
11614 14054 182321 198313 172644 477459 -95944 -182684 -69987 -56838 70357 172539 224935
11603 224935 180910 68959 262490 217157 236866 79118 416005 171482 -189066 35551 -5217
11591 212849 217805 -237285 242103 360892 -76749 -64785 184998 166248 170520 -141667 242973
11579 130447 -168087 -359265 33135 -75555 191585 48576 827 -42545 -165984 109078 -148813
11567 113489 -104298 465535 -76466 -151942 -255763 363288 238783 24394 12264 54864
11557 54864 141525 153415 -273327 85321 -322627 249467 -11214 70904 -74948 173530 295020
11546 295020 146528 -185553 30580 61941 -75525 -17065 -14271 -23851 345628 -32664 -20049
11535b0049j5189j3379m6037A72384J15841n156H0308J80602I5595Q5642o7487
11524A13750j0375J53100h3910L9232D56113H4454m1456B938K0916K99823A01570
11512C09960k8531D6019J32634H1831R2169G6253M5997e0323G9628i2501A46566
11500A20455N3031H1057a59929A13807J16645D4416L32717A0976b6163A16842
11489B49818J6684A06820a80129O0952D4632J43684J01280j03047l4562D2347
11478C03959j146A39878J65546j34698l01K8219J43133F8562M6411J23247j09060
11467A29160e2329A14102L83J29958J63162a82837M9728B4075J18080J8435a18933
11455C0000R7741L4503d0856H8330a02056D9990J45474r6503O890a34470e1607
$$ plain form
11535 -20049 -35238 -48617 -94654 172384 288225 283069 80308 260910 95595 181237 113750
11524 113750 103375 256475 -83910 -44678 456113 84454 42998 2938 23854 323677 101570
11512 309960 281429 46019 178653 81831 174000 76253 122250 -50323 79628 -92501 146566
11500 120455 173486 81057 -159929 113807 230452 44416 377133 10976 -26163 116842
11489 249818 266502 106820 -180129 -119177 44632 188316 289596 186549 151987 42347
11478 303959 302813 139878 305424 170726 170425 198644 341777 68562 114973 238220 129160
11467 129160 -52329 114102 114485 244443 407605 -182837 -133109 24075 142155 160590 -118933
11455 30000 127741 162244 -40856 88330 -102056 49990 195464 98961 105851 -134470 -51607
11443A64779B6273J07045p132b5398I9836c3759j40647b3211E5876J66349D0513
11431c22744a17769C03973c8075j04106j68774A37088a19972j46733a1462B0754
11420B19377J15647a1172a438l8101A34407B8572b13998f098B67826c7785n5980
11409i3765C7896g3269k4985D57123j77529A5059a43817A80250l3989J59077k1973
11398B83365a24879I6110K54575H3430J99566A04542j8919K09854q5456c40073
11387B27219o1653o9198J69927a63028A6239J88398J8702K34594a91788M3351
11377a48437K3613I6563c18123f0033C03182c0165p1885l85I1296b23979h8188
11365H1267j7637b6883j588j62773f7277m4937q5907G8990a43097E4545A5993
$$ plain form
11443 164779 26273 133318 126186 -25398 99836 -33759 -174406 -23211 55876 222225 40513
11431 -322744 -117769 303973 -38075 -142181 -310955 137088 -119972 -266705 -11462 20754
11420 219377 335024 -11172 -1438 -39539 134407 28572 -213998 -6098 267826 -37785 -93765
11409 -93765 37896 -73269 -98254 457123 279594 15059 -143817 180250 146261 305338 283365
11398 283365 -124879 96110 350685 83430 282996 104542 85623 295477 210021 -340073
11387 227219 165566 96368 266295 -163028 16239 204637 223339 457933 -191788 -148437
11377 -148437 -124824 96563 -318123 -60033 303182 -30165 -102050 -102435 91296 -223979 -88188
11365 81267 63630 -26883 -28471 -191244 -67277 -112214 -198121 78990 -143097 54545 15993
11353g0062b6107k24445l4658L4223C1421n496L8423J46035E5789b28195R2231
11342a35964D3434a13084j02220e9392j14720A95081C177g055C4329K08881F286
11330b29311J10379L2851Q100c4722j61497M87c6613o0610G4826A8172b87833
11318A0192b63481J16286O7459E6895c69768f7278j31817B54222F6191b165j96370
11307a98535f4267q1407A37455E384c3625b689k40832A4464L0272b14875g0380
11295E7537g235m9350F2100c19169c8285f446r5880A49564a43412H0038e8716
11283B50022b58092A65185r619A8619e7860k9899I583K37325F4975a21872C04109
11271A22991E2903b90151A06052l3420g4274B7132a45915B99099e2200D518a16082
$$ plain form
11353 -70062 -26107 -250552 -285210 -250987 31421 25925 64348 210383 55789 -228195 -135964
11342 -135964 43434 -113084 -215304 -59392 -174112 195081 3177 -7055 34329 243210 6286
11330 -229311 -118932 -86081 -77981 -34722 -196219 -195732 -36613 -97223 74826 18172 -287833
11318 10192 -263481 -147195 -79736 56895 -369768 -67278 -199095 254222 66191 -2165 -198535
11307 -198535 -64267 -145674 137455 5384 -33625 -2689 -243521 14464 44736 -214875 -70380
11295 57537 -7235 -56585 62100 -319169 -38285 -6446 -102326 149564 -143412 80038 -58716
11283 250022 -258092 165185 155566 18619 -57860 -87759 9583 246908 64975 -121872 304109
11271 122991 52903 -290151 106052 72632 -74274 27132 -145915 299099 -52200 4518 -116082
11259F4912Q1247h2818A55380a16527j79894a21954A27893b11048B5409J77234
11249B02643E357b47976I2615J0280a38290G6931d18291a63555e8645L499b6379
11237a74137c3799j39225F9782B9720J00305b92339G4558J07752J5059J12333
11227C09702b5899C60493F257c05093J00512A52772g8884A99015p671a5595j08928
11216a24523O1550A63839D3423j2078P9282i7459k21750a59002k22851B373P2270
11205G4643c14026K0940J00041I4330b96061P4836L8190g1065j22638H1197c9103
11193I970N1204P5218m0624l3416p031f0926C09140a69728A53754b28469q9073
11182c17542a40631C004b95015K262E0202c01484a45299D10101A68469H1777a53949
$$ plain form
11259 64912 146159 -82818 155380 -116527 -296421 -121954 127893 -211048 25409 202643
11249 202643 5357 -247976 92615 102895 -138290 76931 -418291 -163555 -58645 -55146 -26379
11237 -174137 -33799 -173024 69782 29720 130025 -292339 74558 182310 197369 309702
11227 309702 -25899 360493 6257 -305093 -204581 152772 -78884 199015 191344 -15595 -124523
11216 -124523 -62973 163839 43423 31345 110627 -97459 -319209 -159002 -381853 2373 74643
11205 74643 -314026 -293086 -193045 94330 -296061 -221225 -183035 -71065 -193703 81197 -39103
11193 9970 61174 136392 95768 62352 55321 -60926 309140 -169728 153754 -228469 -317542
11182 -317542 -140631 3004 -295015 -292753 50202 -301484 -145299 410101 168469 81777 -153949
11170c3768G7523O972a63122M9738r2972a1971G4585h3124A75340g007n9312I0195
11157A1954f8691C0760b69809m8315C95842i3708A76649A0180Q37J72545c14470
11145a28073k72332a2842p2826H2089a2116A00119Q79a10283j13286c1773H3304
11133A93878F0827d367B36862D0816j8648M1293F139M73845I4008b29817a4325
11121A2202a61865K6991B25600e5566p7018d8291A69679a59316C4953G891R5665
11110A03556A707g3430A08985a16210A96835H6429L09723D144J43909M5568K27513
11099D21134h846B27702J06409j7088J70219a15395B61135A9763L53530M4297
11089D17590A75357N7461j00054B9147L29542a7456B92723G4133l3202K53255
$$ plain form
11170 -33768 77523 84495 -163122 -113384 -206356 -11971 74585 -83124 175340 -7007 -66319 90195
11157 11954 -68691 30760 -269809 -318124 395842 -93708 176649 10180 11017 183562 -314470
11145 -128073 -400405 -12842 -85668 82089 -12116 100119 100998 -110283 -223569 -31773 83304
11133 193878 60827 -4367 236862 40816 22168 63461 6139 479984 94008 -229817 -14325
11121 12202 -161865 -134874 225600 -55566 -132584 -48291 169679 -159316 34953 7891 103556
11110 103556 1707 -73430 108985 -116210 196835 86429 396152 4144 148053 193621 421134
11099 421134 -8846 227702 334111 317023 487242 -115395 261135 19763 373293 417590
11089 417590 175357 232818 132764 29147 358689 -17456 292723 74133 40931 294186
11079B94186k7114E7262B6185M54457B27179n6918M3428M9326j2230j21368M32341
11068E61758B43524K46719k4958q9356o2640K45384J89275o7822n0333k07932
11058D21861L79428l60957J99346J01968k08440l9805K32111l9177p7476K73570
11048H82429j50837m1256J09417J11888N1407D25199J43153M55794n08990M42066
11038I57222m69882M14303k98138J9160L8079j55519M16084p2942k22454J16350
11028G42263p7025n8387r7485L02834k80925N267L29133j11374r3363N4834k11681
11017E04091M9198J26298l12931L55484j53105L73431m53958J29022K76986C57104
11006F32767j44585K192K19244k20547J25048j66495R4395K78751k63515K34547
$$ plain form
11079 294186 267072 57262 26185 480642 227179 170261 213689 263015 250785 129417 561758
11068 561758 243524 490243 465285 375929 313289 558673 747948 680126 629793 421861
11058 421861 801289 440332 639678 741646 533206 493401 725512 686335 608859 882429
11048 882429 731592 690336 799753 911641 963048 425199 568352 1024146 515156 957222
11038 957222 487340 901643 603505 622665 660744 505225 921309 848367 625913 742263
11028 742263 665238 606851 509366 812200 531275 536542 865675 754301 660938 715772 504091
11017 504091 553289 679587 366656 722140 569035 942466 488508 617530 894516 357104
11006 632767 488182 490374 709618 489071 614119 447624 542019 820770 557255 791802
10996G91802k17288j41542K39790K35984j58377J58023l14013J66615J50725j54280
10986G57439N35J48806L1524M6316J35128M2272n8649K36105P8988K33104J68748
10975A820316L35906M2699M23088J02393L4142L9886J01060j64743m92308J42846
10965B385285m69999k2969k37152k10602L76652j67594m14573Q84340m35091K10851
10955A899148k56989j12670K04593l21830r9181m04541j41179j99177j05079k18566
10945B44529J41457j07383N0060K36895F2693K03716J79915k16980J474M5051
10935B75869i7195N681c146j02775C4653O4743c4493C01104b57287R4929c0322
10923A07623C3326G600K78981b97755a38803A55195a21805k03551g8829K9941
$$ plain form
10996 791802 574514 432972 672762 908746 750369 908392 594379 760994 911719 757439
10986 757439 757974 906780 938304 984620 1119748 1162020 1103371 1339476 1418464 1651568 1820316
10975 1820316 2156222 2198921 2622009 2724402 2758544 2798430 2899490 2734747 2242439 2385285
10965 2385285 1915286 1892317 1655165 1444563 1821215 1653621 1239048 2123388 1688297 1899148
10955 1899148 1642159 1529489 1734082 1412252 1313071 908530 767351 568174 463095 244529
10945 244529 385986 278603 328663 565558 62693 266409 446324 229344 230818 275869
10935 275869 -97195 -91514 -3146 -105921 34653 99396 -34493 301104 -257287 -162358 -30322
10923 107623 33326 7600 286581 -297755 -138803 155195 -121805 -325356 -78829 -48888
10913d8888B9451J85811h855A27531n1746c9486k05030b3206O226A19316m3734
10902G5582a08556B05930L31449b13345F0312Q3448J58803a70845A10574a51771
10891a8647j33457N1064n1116A44716D7633a69463j8717e1487B49610a64617D5259
10879A92879k6286P6363I0057b0414C2164Q576K4394a64715l0509h2278M218J4911
10867f3149q5519A97294K7602b79558H4228a3779B0610J59438H4940a65353A35320
10855c62527e4635E5510R5982k6188l5823K79470d43947c4444A60946a85522B03326
10843a78879B33281H4786B1493b30548R7554L8908A25880b27921L7803B28887
10832A15327e5944A15965b19419B2254a84263A4241N0863a48309G5481I193b9498
$$ plain form
10913 -48888 29451 215262 -8855 127531 75785 -39486 -244516 -23206 -16980 119316 75582
10902 75582 -108556 205930 537379 -213345 60312 143760 302563 -170845 110574 -151771
10891 -18647 -152104 -101040 -152156 144716 47633 -169463 -188180 -51487 249610 -164617 45259
10879 192879 166593 242956 90057 -20414 32164 40740 65134 -164715 -195224 -82278 -78060 -63149
10867 -63149 -148668 197294 224896 -279558 84228 -13779 20610 180048 84940 -165353 135320
10855 -362527 -54635 55510 151492 125304 89481 368951 -443947 -34444 160946 -185522 203326
10843 -178879 233281 84786 21493 -230548 -132994 -94086 125880 -227921 -190118 228887
10832 115327 -55944 115965 -219419 22254 -184263 14241 65104 -148309 75481 9193 -29498
10820A28347j8212j9718c9171r2355r339d601m5539F410b4547n5419K5267n5757
10808a10456a6002k44374A0606b42547N5269O6858f365D5793a05303A95122a19672
10796A51888B7905g1596a9779B1086d32920B22214c172B1262c07323A46006B7498
10784B06876a06830j24274C3003c64131b6969C1495b20820i9242D1105b42685
10773h7947J0940D36661b5085B31755H3233h8167K1490a4775B48589b9981m058
10762c4039r1138L167j78040A88214J51533E1527b31680K426E8126L08679h9550
10750C76071d03093B4972Q6932c663A0539b89085J43294B08282j9394P4668j8669
10739B44887a49890A6860f5331B07121b2756j49273c4346k24924P0071A0514a8880
$$ plain form
10820 128347 110135 90417 -39171 -131526 -140865 -4601 -50140 6410 -24547 -79966 -54699 -110456
10808 -110456 -16002 -260376 10606 -242547 -187278 -120420 -6365 45793 -105303 195122 -119672
10796 151888 27905 -71596 -19779 21086 -432920 222214 -3172 21262 -307323 146006 27498
10784 206876 -106830 -231104 33003 -364131 -26969 31495 -220820 -99242 41105 -242685
10773 -87947 -77007 436661 -25085 231755 83233 -88167 -66677 -14775 248589 -29981 -34039
10762 -34039 -125177 -122010 -300050 188214 339747 51527 -231680 -229254 58126 366805 -89550
10750 376071 -403093 24972 111904 -3663 10539 -289085 -145791 208282 188888 263556 244887
10739 244887 -149890 16860 -65331 207121 -22756 -172029 -34346 -259270 -189199 10514 -18880
10727G5139l1435b85280A60108C0646b52705e1731G5507a80831C92146b185k01569
10716b03754b650j80565j2792j31584a06701k78826a08468a2382k03581C15121
10705b44845J0999Q7085H49a62476b1282j06751e4541j50990L6174G6700e3339
10693d8221a8707B3096b04459L2032g8881l2804B18826P9143a01657m0840A85047
10681B057c1373G3138b9303j62085B01784F4438K98282H3569a43004e8139j16455
10670a74594l01872A24192j3073f8073G5184K04038b10604e1121p6280F1620A0040
10658E9376Q7807K64925b65080E4859P5740a56109j37357J7419A66097h119l34869
10647c42988A42653A1907a54760e8138A59179a69140M2274g012A13663e0187k75145
$$ plain form
10727 75139 43704 -285280 160108 30646 -252705 -51731 75507 -180831 392146 -2185 -203754
10716 -203754 -2650 -183215 -196007 -327591 -106701 -385527 -108468 -12382 -215963 315121
10705 -244845 -233846 -146761 849 -162476 -21282 -128033 -54541 -205531 -169357 76700 -53339
10693 -48221 -18707 23096 -204459 -172427 -78881 -111685 218826 297969 -101657 -142497 185047
10681 2057 -31373 73138 -29303 -191388 201784 64438 362720 83569 -143004 -58139 -174594
10670 -174594 -476466 124192 111119 -68073 75184 279222 -210604 -51121 -127401 61620 10040
10658 59376 147183 412108 -265080 54859 130599 -156109 -293466 -276047 166097 -8119 -342988
10647 -342988 142653 11907 -154760 -58138 159179 -169140 -126866 -7012 113663 -50187 -325332
10636c25332d3943q6774C3159O7320b6437q6570A31077e9009G5850b50675D2748
10624A51693R817F201b08888A2427K56166a87477I0905a01488C85845j79062j00581
10613A06202i0473B51675a28313d6940B5512b37123B42814p6574a2593B55689
10602a41887C48605f0663A58098b2539j04290C0275c6580A2191a41953r6974A45575
10590a01744L0051j91044A0580O6229h1775j1113G7046J27104p7309b11838C8528
10578E7626I563K7324b67051m7106R9037B65437j24135l3726a65972p6732A33049
10566G3755b25657c76k03335O2120K4591d5765k25615f5140A15038i6217j05879
10555b02096A55541c15852A93076b93503A35304M4702D7265a20470a2175A10598
$$ plain form
10636 -325332 -43943 -130717 33159 100479 -26437 -113007 131077 -59009 75850 -250675 42748
10624 151693 161510 6201 -208888 12427 268593 -187477 90905 -101488 385845 206783 106202
10613 106202 -90473 251675 -128313 -46940 25512 -237123 242814 166240 -12593 255689
10602 -141887 348605 -60663 158098 -22539 -126829 30275 -36580 12191 -141953 -238927 145575
10590 -101744 -71693 -262737 10580 76809 -81775 -92888 77046 204150 126841 -211838 38528
10578 57626 9563 36887 -267051 -314157 -215120 265437 141302 107576 -165972 -242704 133049
10566 73755 -225657 -376 -203711 -141591 -117000 -45765 -271380 -65140 115038 -96217 -202096
10555 -202096 155541 -315852 193076 -293503 135304 180006 47265 -120470 -12175 110598
10544F4376a40267B84100j20666a80629O1130e8403b4738C8369b73580A42632
10533e5672b1632p8553G8421a47386D45881B3511M1289d5069Q359j7327A36520
10521B27428f2281l53250A53953c19212c5681E5120i4053G2635B0826a68219F4665
10509b12187h4957p5372G018A427a9292C29732k3235a47768H0118d3979O617k83574
10497c20936a05314G3437A6891M9733a12533A64771C422a60197n1424a01896j5146
10486a17042j68379e0429C0531k268N82499j36199J72486k74894D126K18858b5687
10474f9011A87233l7798A7913J76188a2741j47146m05738K41979G3441F410c36356
10462g710B91708A30138i4014C2274A5748K894b1650l1286D1468c21239a2146
$$ plain form
10544 64376 -140267 284100 163434 -180629 -119499 -58403 -24738 38369 -273580 142632
10533 -55672 -21632 -100185 78421 -147386 445881 23511 64800 -45069 -36710 -54037 136520
10521 227428 -62281 -415531 153953 -319212 -35681 55120 -94053 72635 20826 -168219 64665
10509 -212187 -84957 -160329 7018 1427 -19292 329732 306497 -147768 80118 -43979 -37362 -320936
10497 -320936 -105314 73437 16891 66624 -112533 164771 3422 -160197 -211621 -101896 -117042
10486 -117042 -285421 -50429 30531 28263 610762 474563 647049 372155 4126 222984 -25687
10474 -69011 187233 149435 17913 194101 -12741 -159887 -565625 -323646 73441 6410 -336356
10462 -7710 291708 130138 -94014 32274 15748 18642 -21650 -52936 41468 -321239 -12146
10450A22151N9289a17198j04265i9850A62781b13403R8305B20936b69941C45753
10439f3715A59643c09702E9056j232J2744P2578C6644b75608C22280f8279B70008
10427b8530A3792g5941k4933q5380c3548A41439N707d5779l8816A60567a57878
10415a72552O5804I8165a28806J2960C37927a3323A42608n8218B3395d6058E6074
10403A64579C3985j4299Q8744a03184A22893m0099K61136D4979a21264B41420
10392A21827K7133J47047j13158D6814J64361b36338B46819k2130L5399C5610
10381c1496E3388K95525C6848b8948I5393O7233a00745E4106b6583C28026n2413
10370B75613d9497C31013j50348K53017N1809k00710K41381B25732J88090A36274
$$ plain form
10450 122151 181440 -117198 -221463 -99850 162781 -213403 -115098 220936 -269941 345753
10439 -63715 159643 -309702 59056 57824 70568 143146 36644 -275608 322280 -68279 270008
10427 -28530 13792 -75941 -100874 -186254 -33548 141439 147146 -45779 -84595 160567 -157878
10415 -172552 -106748 98165 -128806 -115846 337927 -13323 142608 84390 23395 -46058 56074
10403 164579 33985 19686 108430 -103184 122893 82794 343930 44979 -121264 241420
10392 121827 148960 296007 182849 46814 211175 -236338 246819 224689 260088 35610
10381 -31496 53388 348913 36848 -28948 95393 162626 -100745 54106 -26583 328026 275613
10370 275613 -49497 331013 180665 433682 485491 284781 526162 225732 413822 136274
10359D04424c5511B04443k844F7514M67362j71684I4274N70952j63209Q1015B91117
10347B28768j7884n6797K16618j83882L81523j92223A812a01526C52206J23048
10337D75254g8568A85878j6087G5777J94178a0643D6633a55162j92447a3904A5841
10325B03744a15843j0898H6797M7305O292b1741I0142J01179N9415p038G8652
10313C82219j75414D2346A6801J47599b82489F6804a03703E0693K03903a33080
10302a42791B3005K4628N0458D7223g168j45198F6652J17385b12098A24000a61621
10290D3141h7713A14014a7640k63346C3901a29782C12208B680J71202e487j32760
10279a38247K4371B48405a98963N2913A9664a52213J4814b3967F0074a65975A38659
$$ plain form
10359 404424 -35511 204443 201599 67514 534876 363192 94274 665226 502017 583032 291117
10347 228768 210884 154087 370705 186823 568346 376123 1812 -101526 352206 475254
10337 475254 -78568 185878 169791 75777 269955 -10643 46633 -155162 -347609 -13904 15841
10325 203744 -115843 -126741 86797 134102 140394 -21741 90142 191321 250736 243698 78652
10313 382219 206805 42346 16801 164400 -282489 66804 -103703 50693 254596 -133080
10302 -142791 23005 47633 98091 47223 -7168 -152366 66652 184037 -212098 124000 -161621
10290 43141 -87713 114014 -17640 -280986 33901 -129782 312208 2680 173882 -5487 -138247
10279 -138247 -113876 248405 -198963 -146050 19664 -152213 -137399 -23967 60074 -165975 138659
10267A94364a90762B22195F8553k9253Q6220g059E968b416A93200O9189r3877
10256A68512J07525j25145J54237A3408L58028b86632g4590L3742j47158G3959
10245g7928B04155a14852N4633B63819b70587a01001I6901k8731d54833a73996
10234C7915N8934b22715E8596a63916c6753l9587l7237K7076l2940j39754a83
10222g0202B0657J49502b23782D9876O2707d3976A0501a84196A30473a42831l6000
10211a78831A00733a41513C2768J07232A1740M2034b27968Q7339A69376b56996
10200B23304a11699k790A95899c63553a63721d7127q3294k980L8033K4303D1579
10188A55271b15618L0007A1988J36492F9608c1987a1439k42861d2145E6774K1948
$$ plain form
10267 194364 -190762 222195 68553 39300 125520 -7059 5968 -2416 193200 262389 168512
10256 168512 276037 150892 305129 13408 371436 -286632 -74590 -40848 -188006 73959
10245 -77928 204155 -114852 -60219 263819 -270587 -101001 96901 68170 -454833 -173996
10234 37915 96849 -222715 58596 -163916 -36753 -76340 -113577 -86501 -119441 -259195 -183
10222 -70202 20657 170159 -223782 49876 112583 -43976 10501 -184196 130473 -142831 -178831
10211 -178831 100733 -141513 32768 140000 11740 53774 -227968 -140629 169376 -256996
10200 223304 -111699 -114489 195899 -363553 -163721 -47127 -130421 -133401 -95368 -71065 41579
10188 155271 -215618 -185611 11988 148480 69608 -31987 -11439 -254300 -42145 56774 78722
10177G8722B1095b56633J07535p1364j81786A99091c70333a01383A06308b61644
10166c68281p6020a06199j33598k87066C41079h0913q8480n9376A89060a38601
10155c3041C73694a67550G8382b03302r4793h5235k99517c8519G8625P2665D267
10143a27804o3798R4356q4926b950C53715L018a17344j05818A46803a1183D57298
10131g2653k35977J12835A87996a92284N1702L311E8409b59606F6789d0631l85474
10120d26105H1295d00817h3207n5821B51023j9289H1819a57264A14590l6427C2139
10108D9188B0561J88359B2531a8857L714F5516L0641K806A6518O378b78569F492
10095H4735f2720G977g5957G6199b8483B65964a58147f6120q1714F0360J3639
$$ plain form
10177 78722 21095 -256633 -149098 -220462 -402248 199091 -370333 -101383 106308 -261644
10166 -368281 -444301 -106199 -239797 -526863 341079 -80913 -169393 -228769 189060 -138601
10155 -33041 373694 -167550 78382 -203302 -298095 -85235 -384752 -38519 78625 151290 4267
10143 -127804 -191602 -97246 -182172 -2950 353715 356733 -117344 -223162 146803 -11183 457298
10131 -72653 -308630 -195795 187996 -192284 -140582 -137271 58409 -259606 66789 -40631 -426105
10120 -426105 81295 -400817 -83207 -139028 251023 231734 81819 -157264 114590 78163 32139
10108 49188 20561 208920 22531 -18857 -15143 65516 96157 98963 16518 22896 -278569 6492
10095 84735 -62720 7977 -75957 76199 -28483 265964 -158147 -66120 -147834 60360 73999
10084G3999c09509B09545a22031k08894a43946Q622j3927j05094a19198Q618m189
10073a14769f174k55834O9357i2595l74394A45454f1844E901g2270m7616A3618
10061b4045F1299b14395m1155M3648A37403a07690A08335P013a44594C4949K4016
10050E8965d087j32610A18966j2391e9017k7104J0091r7032J3608A06873a54237
10038b60202h3143K483C8784b1625A94567d6342j12687k35666a30876B34410a39725
10026b1853A18101a60195B90303a58279l9722B39260d44956A38267a08584C5630
10015A95107K3932r5893e8249n4802A02505L7245b19903h4144I661b11867k5442
10004b37309K9890K8569A31351b34490i2221k1914C4668c227q2597a6750B5888
$$ plain form
10084 73999 -309509 209545 -122031 -330925 -143946 -135324 -149251 -254345 -119198 -110580 -114769
10073 -114769 -6174 -262008 -192651 -92595 -466989 145454 -61844 5901 -72270 -119886 13618
10061 -24045 61299 -214395 -255550 -211902 137403 -107690 108335 115348 -144594 34949 58965
10050 58965 -4087 -136697 118966 106575 -59017 -86121 -76030 -173062 -159454 106873 -154237
10038 -260202 -83143 -80660 38784 -21625 194567 -46342 -159029 -394695 -130876 234410 -139725
10026 -21853 118101 -160195 290303 -158279 -198001 239260 -444956 138267 -108584 35630
10015 195107 219039 123146 -58249 -113051 102505 139750 -219903 -84144 9661 -211867 -237309
10004 -237309 -207419 -178850 131351 -234490 -92221 -114135 34668 -3227 -85824 -16750 25888
9992D433c04585N6365j45402B69990a72172M4445k7899c7936j06598h506D0707
9980A39263K9395b4395k3892j03130a1409G2294O5379Q6863a77912K4492B93357
9968a14881j00449N7769A44647J65601b5796C5711M5816a1823k39785g6847m05
9957g7252j54215A25867A662K36997a24507A7948a2397j54437l2639E0302b78237
9945b56349P7500A38123a64703O586f8910k4350n6979k02408O3449O0672B5659
9933c29520a05521f213r203H5732d2360m5934k28902G1401a34145a1922j0061
9922b1983A13026m0096e91484d2456H2340f1457A24333b33123l2743R3353q5545
9911b58058e0197A66661c59228a00973k31334F4962I422K47081b27746M9539j27669
$$ plain form
9992 4433 -304585 -248220 -393622 269990 -172172 -127727 -155626 -37936 -144534 -8506 40707
9980 139263 168658 -24395 -48287 -151417 -11409 72294 137673 224536 -177912 -153420 293357
9968 -114881 -215330 -157561 144647 310248 -25796 35711 81527 -11823 -251608 -76847 -77252
9957 -77252 -231467 125867 1662 238659 -124507 17948 -12397 -166834 -199473 50302 -278237
9945 -256349 -178849 138123 -164703 -158117 -68910 -93260 -150239 -352647 -289198 -228526 25659
9933 -329520 -105521 -6213 -15416 85732 -42360 -88294 -317196 71401 -134145 -11922 -21983
9922 -21983 113026 72930 -591484 -42456 82340 -61457 124333 -233123 -265866 -172513 -258058
9911 -258058 -50197 166661 -359228 -100973 -332307 64962 9422 256503 -227746 -178207 -305876
9900c05876k00624H8102C7281H728K67216e6582j34986O446h2340A7765J58189
9889A75954o8593a76034O9j35421c0920n0464c2038A6921h0608o3484d3992o0207
9877a04199A54198c54740a02680I7281b23637h8937A12584A1575a02252k06591
9867c08843H5315m0187a48932J6707C9860J94819b16840A01140h6165A68479a49802
9855A59296G4825P9765a54875A2578Q206h7113c7055l72647B8744c45260A57002
9843A48637b9636j39335a2370k47577g5106a7364H7419b43325N2463C81457a63953
9831B66051a76532Q6994c165A8708R7398j5202a69188J027a6402j93447O5300
9820a44549I5775c54956G6486e9883q2649L3087j62604j10336a33563O0924o1837
$$ plain form
9900 -305876 -506500 88102 37281 8728 275944 -56582 -191568 -185122 -82340 17765 175954
9889 175954 107361 -176034 -175965 -311386 -30920 -81384 -32038 16921 -80608 -144092 -43992 -104199
9877 -104199 154198 -354740 -102680 97281 -223637 -88937 112584 11575 -102252 -308843
9867 -308843 85315 45128 -148932 -132225 39860 234679 -216840 101140 -86165 168479 -149802
9855 159296 74825 154590 -154875 12578 20784 -87113 -37055 -409702 28744 -345260 157002
9843 148637 -29636 -168971 -12370 -259947 -75106 -17364 87419 -243325 -190862 381457 -163953
9831 266051 -176532 -89538 -3165 18708 116106 100904 -169188 -168161 -16402 -209849 -144549
9820 -144549 95775 -354956 76486 -59883 -142532 -109445 -272049 -382385 -133563 -72639 -134476
9809a34476e341j05455d1049k3696a027A34409i0575j89050P3376f8827K6915
9798d1912k12569G8913B2473a49192C17487b71277d8119B4124a6945F1211b59829
9786C92928G5539K06683a89666j53544d3976d247j47243M9400B33131i3503j77938
9775b71441B925i0096k9121F1272A5461c27811I3442a10659m1824C960c010j0972
9763a3982q5866A59039a76886A712a11728D3028a01612j46725g9211k90135H5984
9751b36173C8550K95086b82450B36255d3234j74360d0788n4202K3761k7768j44511
9740b43508b7832k3231c960n6199A06539b02407e2915o8977j34049i7636J968
9729i5668B4162d4350a7832B79595d3044q3604B70431a8362A06704g0900j81690
$$ plain form
9809 -134476 -5341 -110796 -41049 -64745 -1027 134409 -90575 -279625 -206249 -68827 -41912
9798 -41912 -254481 78913 22473 -149192 317487 -271277 -48119 24124 -16945 61211 -259829
9786 392928 75539 282222 -189666 -343210 -43976 -4247 -151490 -102090 233131 -93503 -271441
9775 -271441 2925 -90096 -119217 61272 15461 -327811 93442 -110659 -152483 3960 -3010 -13982
9763 -13982 -99848 159039 -176886 1712 -111728 43028 -101612 -248337 -79211 -369346 85984
9751 -236173 38550 333636 -282450 236255 -43234 -217594 -40788 -94990 -71229 -98997 -243508
9740 -243508 -27832 -51063 -3960 -60159 106539 -202407 -52915 -121892 -255941 -97636 -95668
9729 -95668 24162 -44350 -17832 279595 -43044 -126648 270431 -18362 106704 -70900 -252590
9718b52590B32879f7333j37931A68349F9553a85055A52293N2201I9322e07368
9707d1603q42G0004a22994d6327j55295n5096P5730A8132c6579J6771j74034M3755
9695a50087K4868n9097A96721e5548r7263l2319G9929k9657b49840l1894A74230
9683d1364a5222j18769N6422b8613j16077K623d0353m5461i723A48845d3015m0490
9671h3505l0895F4393a57442m9775j75173B89159F0446d6288E1740i237A9158
9659b24270M667I3388e5295B46045a63090M1694B65843b07558e2598B16179a75546
9647e2432C29458a67305N8248j46659A31085E2583a39808G9259a03630j84837
9637b88467A19163i4860j69091f5532l3450j43096A69105c35873i2141a0516H3522
$$ plain form
9718 -252590 232879 -67333 -205264 168349 69553 -185055 152293 204494 99322 -507368
9707 -41603 -42445 70004 -122994 -46327 -201622 -256718 -180988 18132 -36579 -19808 -193842 -150087
9695 -150087 -125219 -184316 196721 -55548 -152811 -185130 79929 50272 -249840 -281734 174230
9683 -41364 -15222 -133991 -77569 -28613 -144690 -142067 -40353 -85814 -9723 148845 -43015 -83505
9671 -83505 -114400 64393 -157442 -207217 -382390 289159 60446 -46288 51740 -9237 19158
9659 -224270 -219603 93388 -55295 246045 -163090 -121396 265843 -207558 -52598 216179 -175546
9647 -52432 329458 -167305 -109057 -255716 131085 52583 -139808 79259 -103630 -288467
9637 -288467 119163 -94860 -263951 -65532 -98982 -242078 169105 -335873 -92141 -10516 83522
9625C9738b23474C88951A2146J5665a98405A07198a20095L2557B0875L04686b37697
9613I2945a98538e5776j95279A0352b03536F6074J7945P6248b42901I3036b872
9601f6655q0988D7895h5106c4828j22682A01973b80013J7825a11635p3237A0326
9589f2820j44355B17512d1355j40573M6886L4045I3745i0553a5421n1342K8354
9578c8409R128k78331a51364H1140b6765j35776o7262c0863E7950a79933A67094
9566c13982c031k3615q8189q6029G3536a5342E6638J22113j8885a96760k82643
9555d79403J10652D2115b89237J37171a021j3244k17362G7589g9295l4614j04754
9544b18663j7369R1269p7787B3690g041j61113O0670K5889k53125Q3141B10538
$$ plain form
9625 39738 -223474 388951 12146 27811 -198405 107198 -120095 -87538 20875 325561 -237697
9613 92945 -198538 -55776 -251055 10352 -203536 66074 84019 160267 -242901 93036 -2872
9601 -66655 -147643 47895 -85106 -34828 -157510 101973 -280013 -262188 -111635 -184872 10326
9589 -62820 -207175 217512 -41355 -181928 -135042 -100997 93745 -90553 -15421 -66763 -38409
9578 -38409 -29281 -307612 -151364 81140 -26765 -162541 -229803 -30863 57950 -179933 167094
9566 -313982 -3031 -26646 -114835 -200864 73536 -15342 56638 178751 159866 -196760 -479403
9555 -479403 -368751 42115 -289237 -152066 -1021 -14265 -231627 77589 -79295 -113909 -218663
9544 -218663 -236032 -144763 -222550 23690 -7041 -168154 -107484 -81595 -334720 -251579 210538
9532b1597A31040b47267L4623b2529k05024B03480b03520p4025I8357a7414k2185
9521c9599A27615g2411m77426a01101B5985g3113j8126j04278f3439k299A0168
9509A98243b60637g7910K377B54925A9361J40720a38301j98311A86303A9854J70472
9498A90326n3430n6369e3684m3332j50845A32714a27007B97828J4298G8947d9843
9486A0654i8414A18157l7842i104j01730q0035h5624l7678A7498C440c0813D7690
9473D9175c25233i0135F235J21571B0321a738F6300K0024d6345r2332j04328e1054
9460B37463I7416d2413k57928C3176a46006k4013a3903k03124i0907c1405p2589
9449a03994j33695Q3619k35402g1134m93959a16046C92617b24395f4149A80709
$$ plain form
9532 -21597 131040 -247267 -212644 -22529 -227553 203480 -203520 -277545 98357 -17414 -39599
9521 -39599 127615 -72411 -549837 -101101 25985 -73113 -91239 -195517 -63439 -65738 10168
9509 198243 -260637 -77910 -75533 254925 19361 160081 -138301 -336612 186303 19854 190326
9498 190326 136896 80527 -53684 -97016 -247861 132714 -127007 297828 312126 78947 -49843
9486 10654 -98414 118157 80315 -9104 -110834 -190869 -85624 -123302 17498 3440 -30813 47690
9473 49175 -325233 -90135 6235 127806 20321 -1738 66300 86324 -46345 -138677 -243005 -51054
9460 237463 97416 -42413 -300341 33176 -146006 -170019 -13903 -217027 -90907 -31405 -103994
9449 -103994 -237689 -154070 -389472 -71134 -565093 -116046 392617 -224395 -64149 180709
9438B66455b28218A92545a4645l41826a54677J2832E6508k2274a17703n1177I9231
9426a01567D026J78203I0933h3370r5849c8018I5482c03482E1998h3442j09230
9415a92672e4556r9834P2913r9826D4913P5709b99123B7438d7396j43689A61411
9403a57641K5335e1321B15638n7408c06812A3577o96a51943G0357a02985c5619
9391i0820E6020a24261j49831A06053A0186a3319j03700o0591D5685B2357f3321
9379c10113j54605A74818D1701b98209B02528d2006j39984l6551j5732b9637C63348
9367A16321b9630H2940d0512j31974m6490h8828A15436i6246K0316L2707A44673
9355i7145o3627D5498o67L2160a00735c3998j17342A2830L7887j1285a27666k88557
$$ plain form
9438 266455 -228218 192545 -14645 -356471 -154677 -141845 56508 34234 -117703 -168880 99231
9426 -101567 4026 182229 90933 -83370 -179219 -38018 95482 -303482 51998 -83442 -192672
9415 -192672 -54556 -154390 -81477 -181303 44913 120622 -299123 27438 -47396 -191085 161411
9403 -157641 -132306 -51321 215638 158230 -306812 13577 12881 -151943 70357 -102985 -35619
9391 -90820 56020 -124261 -274092 106053 10186 -13319 -117019 -177610 45685 22357 -63321
9379 -310113 -464718 174818 41701 -298209 202528 -42006 -181990 -218541 -234273 -29637 363348
9367 116321 -29630 82940 -40512 -172486 -218976 -88828 115436 -96246 -75930 -43223 144673
9355 -97145 -160772 45498 44831 76991 -100735 -33998 -151340 12830 50717 39432 -127666 -416223
9343d16223f2476j35051A21532a69416p5611D8402K34791E883J41319a27109k35322
9332c62431C9587h6013J8308E654b10930A45787C1938j53J8623J49116D6282a48583
9319a98759c4609A42277d61721f9804a6204o3935l44946B15462b84151D0821a95090
9307b35752C0958a35388r0792A44685a06782E4630a92899C15021E1751a14606
9296A24738A0206K05861f4572C68403g3517a03B33936B1261a12439n0113O8791
9285i3761r0529E2313c8407I6073l5644a2446F6880d24623i2025J2713q267E015
9272B05372a21109p8896q9193a17064F4749a98703F8134f7270q7241k5583j18230
9261b98324J10799M6807j70132f187l49730e7489j44199K3612j5866C07850a84406
$$ plain form
9343 -416223 -62476 -197527 121532 -169416 -245027 48402 283193 5883 147202 -127109 -362431
9332 -362431 39587 -86013 -67705 5654 -210930 145787 31938 31785 50408 199524 46282 -148583
9319 -198759 -34609 142277 -461721 -69804 -16204 -80139 -425085 215462 -284151 40821 -195090
9307 -235752 30958 -135388 -226180 144685 -106782 54630 -192899 315021 51751 -114606
9296 124738 10206 216067 -64572 368403 -73517 -103 233936 21261 -112439 -162552 -93761
9285 -93761 -184290 52313 -38407 96073 60429 -12446 66880 -424623 -92025 -79312 -87579 5015
9272 205372 -121109 -200005 -289198 -117064 64749 -198703 68134 -67270 -154511 -180094 -298324
9261 -298324 -187525 -140718 -310850 -6187 -355917 -57489 -201688 -178076 -193942 307850 -184406
9249f8738a1167B2588a85451k9328G2494J40109a77171J1938C2269d0317J0172
9238c0145A56450E531K5660a9343j3683p3868L0148C8428f298j71896P0381B12637
9225A76995b84803A70299e7062k09107A00925b683A09654c9072A34835N8250a37453
9213B89987d3162B48275h3495B65866b84905H3879a74D4120h2041B41511K9961
9202B71472a6937G2890a94378e5916j91779J0356O5914d5960A20689L2385m1712
9191A11362j7963B0085K7805a35481C7338a17576A65566b60942M6675b768m22446
9180d25214C8077J34578d5810k77714a34068b5516o213m6402J2414k61839C2823
9168c35537e3665A1996J44612i7127q8434e4920a7578l43315C7661J6208b44750
$$ plain form
9249 -68738 -11167 22588 -185451 -214779 72494 212603 -177171 -165233 32269 -40317 -30145
9238 -30145 156450 5531 31191 -19343 -33026 -106894 -76746 38428 -6298 -178194 -107813 212637
9225 176995 -284803 170299 -57062 -266169 100925 -2683 109654 -39072 134835 193085 -137453
9213 289987 -43162 248275 -83495 265866 -284905 83879 -174 44120 -82041 241511 271472
9202 271472 -16937 72890 -194378 -55916 -247695 -237339 -171425 -45960 120689 153074 111362
9191 111362 93399 20085 47890 -135481 37338 -117576 165566 -260942 -214267 -2768 -425214
9180 -425214 38077 172655 -45810 -323524 -134068 -25516 -31729 -78131 -65717 -327556 32823
9168 -335537 -53665 11996 156608 -97127 -185561 -54920 -17578 -360893 37661 53869 -244750
9156b358j791q2727j97366D4374i7241o8262B96532a4289D102a28699j45566l3314
9144c07579e3700H9476d8806C73306G0773A6702R5146a72356d6107k6534A01828
9132b69982a14849C13978j40006b68254j782E239c23355l22069a05429j02799
9122b08228O0967j89679C11439a27232L3614j74204M8457c0503j89377M1192m3631
9111b22319R2404N2176j66762A32789C361c0151j44672q9965D2594c57412P283
9100c50129d1480E1232h1842j21621F9932b0725o74445h4320I8384a4020l08066
9089c22086E1719b22701a1417I6214b19258B5631b34082a13516b4516A86375a09170
9077A59403c68822B2217K32063a39842O2750a9421H7798J21684a162A92775D0146
$$ plain form
9156 -2358 -4149 -86876 -284242 44374 -97241 -165503 296532 -14289 4102 -128699 -274265 -307579
9144 -307579 -53700 89476 -48806 373306 70773 16702 111848 -172356 -46107 -72641 101828
9132 -269982 -114849 313978 173972 -268254 -270036 5239 -323355 -645424 -105429 -208228
9122 -208228 -147261 -336940 311439 -127232 -93618 -267822 -219365 -30503 -219880 -178688 -222319
9111 -222319 -129915 -77739 -244501 132789 3361 -30151 -174823 -264788 42594 -357412 -350129
9100 -350129 -41480 51232 -81842 -203463 69932 -20725 -695170 -84320 98384 -14020 -322086
9089 -322086 51719 -222701 -11417 96214 -219258 25631 -234082 -113516 -24516 186375 -109170
9077 159403 -368822 22217 254280 -139842 -77092 -19421 87798 209482 -1162 192775 40146
9065B5943K0891a40468q3333A42873a0850A1562J89425F057Q0455i7859D55702
9053B42908c86319a6272H7134d04091B65443b19661Q2258H6024a14193k68928
9043c83121a72556C1754b55964F4954a68920P7774A55702b92309J29860M9542
9033a12907k36539B6023b98589a05474k09571i1339j5235A59708h8277C2894b58815
9021a42331d4033k02921D4885b91030d6455k36705f7606A15192b36520L4610r5486
9010b97396a24233N0756j3008j55229C38446a59476a1498H4334k9955Q1307j6304
8999A19382a98707B3307a06394p8950i2176C7215P2632a5059k09693N4339j75041
8988c45454A04032b26080G9833Q0549m8992f7089k14815A34682b1982l39744B34866
$$ plain form
9065 25943 46834 -140468 -223801 142873 -10850 11562 200987 6057 86512 -97859 455702
9053 242908 -386319 -16272 87134 -404091 265443 -219661 -137403 86024 -114193 -383121
9043 -383121 -172556 31754 -255964 64954 -168920 -91146 155702 -292309 -162449 -112907
9033 -112907 -349446 26023 -298589 -105474 -315045 -91339 -106574 159708 -88277 32894 -258815
9021 -142331 -44033 -246954 44885 -291030 -46455 -283160 -67606 115192 -236520 -201910 -297396
9010 -297396 -124233 -73477 -86485 -241714 338446 -159476 -11498 84334 54379 135686 119382
8999 119382 -198707 23307 -106394 -185344 -92176 37215 109847 -15059 -224752 -170413 -345454
8988 -345454 104032 -226080 79833 160382 111390 -67089 -281904 134682 -21982 -361726 234866
8976a67564m5664d0376B36772b22665f5045m3629B5314b14654c2251C18751a9015
8964C50600c1796j53811C00853j40441i7814p6618q3328b7201A00441B8462R5599
8953A24061B9744J99836C3381g0218j8529B81708a77395M3785G5211a08389D5791
8941B9262J1868b03415R1699C81444a54482A54094J21100e0560B13389f8904j71132
8930b40036A13697a06327B67609a97820q4341A93887m44J37373J046940O03420
8920A981176D95784b26471A43139j8218k3950c1527C38696a41661c65j52640B1148
8908g5524p4991i351l36569C30206a56714B46181D3109K23411a37176A4673d7804
8896I8724A1004c29629M2192b1556B8175h336l9899j6217l34894N6213G5107O3176
$$ plain form
8976 -167564 -213228 -40376 236772 -222665 -65045 -108674 25314 -214654 -32251 318751 -19015
8964 350600 -31796 -185607 300853 160412 -97814 -174432 -257760 -27201 100441 28462 124061
8953 124061 29744 229580 33381 -70218 -88747 281708 -177395 -133610 75211 -108389 45791
8941 29262 41130 -203415 -111716 381444 -154482 154094 275194 -50560 213389 -68904 -240036
8930 -240036 113697 -106327 267609 -197820 -282161 193887 193443 330816 1377756 1981176
8920 1981176 495784 -226471 143139 124921 100971 -31527 338696 -141661 -365 -153005 21148
8908 -75524 -150515 -9351 -345920 330206 -156714 246181 43109 266520 -137176 14673 -47804
8896 98724 11004 -329629 -287437 -21556 28175 -8336 -48235 -64452 -399346 -343133 75107 138283
8884A38283P7860j01833c61850B8579e70159d8695m38088a53526l7649N2645f0597
8872A15523B8172b31512O4837c6564F959J63473A7655a50422c939A09681b28138
8860c3055G808f3453n1027l1564B93067i8965k29955a21752A96193a44962h188
8848c9999j35013g2838j53086P8202E1674J55850a43215l9136A10734f8965A47506
$$ plain form
8884 138283 216143 114310 -361850 28579 -570159 -48695 -486783 -153526 -191175 -138530 -60597
8872 115523 28172 -231512 -166675 -36564 6959 170432 17655 -150422 -3939 109681 -228138
8860 -33055 7808 -63453 -114480 -146044 293067 -98965 -328920 -121752 196193 -144962 -8188
8848 -39999 -175012 -72838 -225924 -147722 51674 207524 -143215 -182351 110734 -68965 147506
$$ [...]
##END NTUPLES=NMR SPECTRUM
##END=
