##TITLE=AC1718_CCAAH15004_9207194_GgYotDxTai
##JCAMPDX= 6.0         $$ Bruker NMR JCAMP-DX V2.0
##DATA TYPE= NMR SPECTRUM
##DATA CLASS= NTUPLES
##ORIGIN= BRUKER
##OWNER= Administrator
$$ 1.72 TOPSPIN		Version 2.1
$$ 2015-06-01 16:58:40.358 -0700  Administrator@X
$$ Compression mode = diff/dup
##.OBSERVE FREQUENCY= 400.02188249412
##.OBSERVE NUCLEUS= ^1H
##.ACQUISITION MODE= SIMULTANEOUS (DQD)
##.ACQUISITION SCHEME= undefined
##.AVERAGES= 64
##.DIGITISER RES= 22
##SPECTROMETER/DATA SYSTEM= spect
##.PULSE SEQUENCE= noesygpps1d.comp
##.SOLVENT NAME= COFFEE_meoh
##.SHIFT REFERENCE= INTERNAL, COFFEE_meoh, 1, 14.96088
##AUDIT TRAIL= $$ (NUMBER, WHEN, WHO, WHERE, PROCESS, VERSION, WHAT)
$$ ##TITLE= Audit trail, TOPSPIN		Version 2.1
$$ ##JCAMPDX= 5.01
$$ ##ORIGIN= Bruker BioSpin GmbH
$$ ##OWNER= Administrator
$$ $$ E:\/data/COFFEE/nmr/AC1718_CCAAH15004_9207194_GgYotDxTai/12/pdata/1/auditp.txt
$$ ##AUDIT TRAIL=  $$ (NUMBER, WHEN, WHO, WHERE, PROCESS, VERSION, WHAT)
(   1,<2015-06-01 16:58:34.951 -0700>,<Administrator>,<X>,<go>,<TOPSPIN 2.1>,
      <created by zg
	started at 2015-06-01 16:47:04.811 -0700,
	POWCHK enabled, PULCHK disabled,
       configuration hash MD5:
       21 0F 79 D6 B3 7B B4 F6 88 20 88 DB 03 48 BD 9F
       data hash MD5: 64K
       F1 11 38 5F B0 D6 2D 04 7F 70 DD 2B 6E 84 E6 B7>)
(   2,<2015-06-01 16:58:38.311 -0700>,<Administrator>,<X>,<proc1d>,<TOPSPIN 2.1>,
      <Start of raw data processing
       efp LB = 0.3 FT_mod = 6 PKNL = 1 PHC0 = 0 PHC1 = 0 SI = 128K 
       data hash MD5: 128K
       35 05 AB 15 E1 63 F6 E1 6E 22 67 38 7E AD FF 25>)
(   3,<2015-06-01 16:58:39.186 -0700>,<Administrator>,<X>,<proc1d>,<TOPSPIN 2.1>,
      <pk PHC0 = -85.48462 PHC1 = 0 
       data hash MD5: 128K
       38 51 CF 92 5A BC 9A C2 83 20 07 9F 33 39 2A B6>)
(   4,<2015-06-01 16:58:39.561 -0700>,<Administrator>,<X>,<proc1d>,<TOPSPIN 2.1>,
      <abs ABSG = 1 
       data hash MD5: 128K
       2F 5E 3E 7B 77 50 75 DB 14 93 77 D4 49 83 69 EE>)
(   5,<2015-06-01 16:58:39.655 -0700>,<Administrator>,<X>,<proc1d>,<TOPSPIN 2.1>,
      <abs ABSG = 2 
       data hash MD5: 128K
       40 64 69 11 DD A1 E1 55 65 57 18 0B E3 55 43 E8>)
(   6,<2015-06-01 16:58:39.733 -0700>,<Administrator>,<X>,<proc1d>,<TOPSPIN 2.1>,
      <abs ABSG = 3 
       data hash MD5: 128K
       64 A4 38 A1 E2 0D F8 2A 79 7A 3E 89 87 1B 14 AA>)
(   7,<2015-06-01 16:58:39.826 -0700>,<Administrator>,<X>,<proc1d>,<TOPSPIN 2.1>,
      <abs ABSG = 4 
       data hash MD5: 128K
       F2 1D 36 AF 31 BB 19 F3 33 2D F4 E7 92 6D C3 88>)
(   8,<2015-06-01 16:58:39.920 -0700>,<Administrator>,<X>,<proc1d>,<TOPSPIN 2.1>,
      <abs ABSG = 5 
       data hash MD5: 128K
       FA 2F 06 44 50 1F 04 8A 2F 10 E8 02 F1 CE 77 C0>)
$$ ##END=
$$ 
$$ $$ hash MD5
$$ $$ 5F AB 7F F5 6C 61 28 69 E9 8D 43 B7 23 1C 4C F2
##$RELAX= 
##$RELAX= 
##$RELAX= 
##$RELAX= 
##$RELAX= 
##$RELAX= 
##$RELAX= 
##$RELAX= 
$$ Bruker specific parameters
$$ --------------------------
##$DU= <E:\>
##$EXPNO= 12
$$ [...]
##$TP07= 0
##$TPNAME0= <>
##$TPNAME1= <>
##$TPNAME2= <>
##$TPNAME3= <>
##$TPNAME4= <>
##$TPNAME5= <>
##$TPNAME6= <>
##$TPNAME7= <>
##$TPOAL= (0..7)
0.5 0.5 0.5 0.5 0.5 0.5 0.5 0.5
##$TPOFFS= (0..7)
0 0 0 0 0 0 0 0
##$TUNHIN= 0
##$TUNHOUT= 0
##$TUNXOUT= 0
##$USERA1= <user>
##$USERA2= <user>
##$USERA3= <user>
##$USERA4= <user>
##$USERA5= <user>
##$V9= 5
##$VALIST= <valist>
##$VCLIST= <CCCCCCCCCCCCCCC>
##$VD= 0
##$VDLIST= <DDDDDDDDDDDDDDD>
##$VPLIST= <PPPPPPPPPPPPPPP>
##$VTLIST= <TTTTTTTTTTTTTTT>
##$WBST= 2048
##$WBSW= 25
##$XGAIN= (0..3)
0 0 0 0
##$XL= 0
##$YL= 0
##$YMAX_a= 6233340
##$YMIN_a= -12050185
##$ZGOPTNS= <>
##$ZL1= 120
##$ZL2= 120
##$ZL3= 120
##$ZL4= 120
##$ABSF1= 14.96088
##$ABSF2= -5.597301
##$ABSG= 5
##$ABSL= 3
##$ALPHA= 0
##$AQORDER= 0
##$ASSFAC= 0
##$ASSFACI= 0
##$ASSFACX= 0
##$ASSWID= 0
##$AUNMP= <proc_prof1d_extract.lims>
##$AXLEFT= 0
##$AXNAME= <>
##$AXNUC= <1H>
##$AXRIGHT= 0
##$AXTYPE= 0
##$AXUNIT= <>
##$AZFE= 0.1
##$AZFW= 0.1
##$BCFW= 0
##$BC_mod= 0
##$BYTORDP= 0
##$COROFFS= 0
##$CY= 15
##$DATMOD= 1
##$DC= 0
##$DFILT= <>
##$DTYPP= 0
##$F1P= 0
##$F2P= 0
##$FCOR= 0.5
##$FTSIZE= 131072
##$FT_mod= 6
##$GAMMA= 0
##$GB= 0
##$INTBC= 1
##$INTSCL= 1
##$ISEN= 128
##$LB= 0.3
##$LEV0= 0
##$LPBIN= 0
##$MAXI= 10000
##$MC2= 0
##$MEAN= 0
##$ME_mod= 0
##$MI= 0
##$NCOEF= 0
##$NC_proc= -2
##$NLEV= 6
##$NOISF1= 0
##$NOISF2= 0
##$NSP= 0
##$NTH_PI= 0
##$NZP= 0
##$OFFSET= 14.96088
##$PC= 1
##$PHC0= -85.48462
##$PHC1= 0
##$PH_mod= 1
##$PKNL= yes
##$PPARMOD= 0
##$PPDIAG= 0
##$PPIPTYP= 0
##$PPMPNUM= 2147483647
##$PPRESOL= 1
##$PSCAL= 4
##$PSIGN= 0
##$PYNMP= <proc.py>
##$REVERSE= no
##$SF= 400.020009685261
##$SI= 131072
##$SIGF1= 0
##$SIGF2= 0
##$SINO= 400
##$SIOLD= 131072
##$SPECTYP= <>
##$SREGLST= <1H.CDCl3>
##$SSB= 0
##$STSI= 131072
##$STSR= 0
##$SW_p= 8223.68421052631
##$SYMM= 0
##$S_DEV= 0
##$TDeff= 65536
##$TDoff= 0
##$TI= <>
##$TILT= no
##$TM1= 0
##$TM2= 0
##$TOPLEV= 0
##$USERP1= <user>
##$USERP2= <user>
##$USERP3= <user>
##$USERP4= <user>
##$USERP5= <user>
##$WDW= 1
##$XDIM= 131072
##$YMAX_p= 417903254
##$YMIN_p= -13407
##$CURPLOT= <Network HP LaserJet P1505>
##$CURPRIN= <$Network HP LaserJet P1505>
##$DFORMAT= <normdp>
##$LAYOUT= <+/1D_H.xwp>
##$LFORMAT= <normlp>
##$PFORMAT= <normpl>
##$SURQMSG= 1
$$ End of Bruker specific parameters
$$ ---------------------------------
##NTUPLES= NMR SPECTRUM
##VAR_NAME=  FREQUENCY,     SPECTRUM/REAL,   SPECTRUM/IMAG
##SYMBOL=    X,             R,               I
##VAR_TYPE=  INDEPENDENT,   DEPENDENT,       DEPENDENT
##VAR_FORM=  AFFN,          ASDF,            ASDF
##VAR_DIM=   131072,        131072,          131072
##UNITS=     HZ,            ARBITRARY UNITS, ARBITRARY UNITS
##FACTOR=    0.0627417313425164, 1,          1
##FIRST=     8223.62146879497, -320,         -60249
##LAST=      0,             3001,            -60949
##MIN=       0,             -13407,          0
##MAX=       8223.62146879497, 417903254,    0
$$ Real data points
##PAGE= N=1
##DATA TABLE= (X++(R..R)), XYDATA
$$ [...]
63915C329289k46595k40964k31683k19289k04960j89355j72520j54897j37633
$$ 3329289 3082694 2841730 2610047 2390758 2185798 1996443 1823923 1669026 1531393
63906A531393j21699j07320r4407q2863p2353o2428n3204m5360l9158l4053k9602
$$ 1531393 1409694 1302374 1207967 1125104 1052751 990323 937119 891759 852601 818548 788946
63895G88946k6127k3989k2678k1257j9437j7664j6313j5320j4450j3498j2255
$$ 788946 762819 738830 716152 694895 675458 657794 641481 626161 611711 598213 585958
63884E85958j0701r116p733o366m704k797q95J013L134N469P897J0554J3584J6577
$$ 585958 575257 566141 558408 552042 547338 544541 543646 544659 547793 553262 561159 571713 585297 601874
63870F01874J8781J9985K0754K1545K2113K2070K1737K1901K2748K3429K2901
$$ 601874 620655 640640 661394 682939 705052 727122 748859 770760 793508 816937 839838
63859H39838K1014J8567J6296J4055J1234P735M094O82k670o037r009j1373j3704
$$ 839838 860852 879419 895715 909770 921004 928739 932833 933515 930845 924808 915799 904426 890722
63846H90722j6628j9749k2129k3641k5078k6790k8070k8254k7753k7453k7586
$$ 890722 874094 854345 832216 808575 783497 756707 728637 700383 672630 645177 617591
63835F17591k7712k7499k6858k5605k3584k1160j9056j7606j6537j5533j4608
$$ 617591 589879 562380 535522 509917 486333 465173 446117 428511 411974 396441 381833
63824C81833j3812j2927j1726j0316q995p957p272p005p002o769n898m624l672
$$ 381833 368021 355094 343368 333052 324057 316100 308828 301823 294821 288052 282154 277530 273858
63811B73858l428l613l760l680l279k410j274n92q47j522j727j390j168j264j167
$$ 273858 270430 266817 263057 259377 256098 253688 252414 251822 250975 249453 247726 246336 245168 243904 242737
63796B42737p77q10j625k422k345j736j503j711j687j210p05l90j77k92j001j759
$$ 242737 241960 241150 239525 237103 234758 233022 231519 229808 228121 226911 226206 225816 225639 225347 224346 222587
63780B22587j611o64r9m45q37m84J16J69p5Q4M87M34l3j95J15K17l11j072j511
$$ 222587 220976 220312 220213 219768 218931 218447 218563 218732 218657 218741 219228 219662 219629 219434 219549 219766 219455 218383 216872
63761B16872j518j165m67L32P15N03J50R2J18k39q52j036m12N57J118J089R47
$$ 216872 215354 214189 213722 214054 214769 215272 215422 215514 215632 215393 214541 213505 213093 213650 214768 215857 216804
63744B16804J146J588J901J994K081K277K472K558K476K043J133J35j72N20J657
$$ 216804 217950 219538 221439 223433 225514 227791 230263 232821 235297 237340 238473 238608 238436 238956 240613
63729B40613K519L017L420L703L679L578L938M894O014O863P271P093O181M799
$$ 240613 243132 246149 249569 253272 256951 260529 264467 269361 275375 282238 289509 296602 302783 307582
63715C07582L602K915K292J074p83k683m037m728m986n015m743l945k623j312
$$ 307582 311184 314099 316391 317465 316682 313999 309962 305234 300248 295233 290490 286545 283922 282610
63701B82610p03r05j260j062k88O08J382K120K782L096L022K924L045L118K837
$$ 282610 281907 281002 279742 278680 278392 279000 280382 282502 285284 288380 291402 294326 297371 300489 303326
63686C03326K404K264K385K256J627Q29K93R9J20K51L31J82j9J86Q24J290J176
$$ 303326 305730 307994 310379 312635 314262 315091 315384 315483 315603 315854 316185 316367 316348 316534 317358 318648 319824
63669C19824R60J336K149K604K375J902J557J167M45n62j619k508l099l552m357
$$ 319824 320784 322120 324269 326873 329248 331150 332707 333874 334319 333757 332138 329630 326531 322979 318622
63654C18622n714o931p024n975m693l715k730j654j184j698k354k045q46K90R28
$$ 318622 312908 305977 298953 292978 288285 284570 281840 280186 279002 277304 274950 272905 272059 272349 273277
63639B73277J532K476L438L919L903L830M092M673N148N137M783M612M869N328
$$ 273277 274809 277285 280723 284642 288545 292375 296467 301140 306288 311425 316208 320820 325689 331017
63625C31017N824O550P576Q551R236R888J0783J1741J2623J3790J5490J7230J8434
$$ 331017 336841 343391 350967 359518 368754 378642 389425 401166 413789 427579 443069 460299 478733
63612D78733J9447K1108K3507K5935K8026L0069L2068L3207L2648L0364K6797
$$ 478733 498180 519288 542795 568730 596756 626825 658893 692100 724748 755112 781909
63601G81909K2110J6177R228K160l855q052j0400j1299j1120j0238r373r362j0420
$$ 781909 804019 820196 829424 831584 827729 819677 809277 797978 786858 776620 767247 757885 747465
63588G47465j2075j4034j6513j9401k1724k2676k2681k2706k2819k2222k0488
$$ 747465 735390 721356 704843 685442 663718 641042 618361 595655 572836 550614 530126
63577E30126j8041j5448j2994j0850q945o777m048j394K89J181K345M104N623
$$ 530126 512085 496637 483643 472793 463848 457071 453023 451629 451918 453099 455444 459548 465171
63564D65171O267O565P356Q687R920J0412R876Q640P809Q491J0612J3085J5346
$$ 465171 471438 478003 485359 494046 503966 514378 524254 532894 540703 549194 559806 572891 588237
63551E88237J8033K1793K6262L0732L5132L9594M3557M5822M5280M1161L3218
$$ 588237 606270 628063 654325 685057 720189 759783 803340 849162 894442 935603 968821
63540I68821K2273J0321n64r256j5361j8596j8951j7109j4084j0683p716o281
$$ 968821 991094 1001415 1000851 991595 976234 957638 938687 921578 907494 896811 889095 882814
63528H82814p093r690j2956j6357k0072k4086k7783l0543l2235l2958l2729l1564
$$ 882814 875721 866031 853075 836718 816646 792560 764777 734234 701999 669041 636312 604748
63516F04748k9651k7299k4799k2333j9911j7499j5284j3570j2335j1219j0093
$$ 604748 575097 547798 522999 500666 480755 463256 447972 434402 422067 410848 400755
63505D00755r207q532p441n604l817l204l746m277l984l236k795k702k417j728
$$ 400755 391548 383016 375575 369971 366154 362950 359204 354927 350943 347707 344912 342210 339793 338065
63491C38065j061q45q94o10K06J003J157Q24Q09J573K766L798M473M871N047N123
$$ 338065 337004 336159 335265 334655 334861 335864 337021 337845 338654 340227 342993 346791 351264 356135 361182 366305
63475C66305N301N463N126M130K968K065J074n51k596m309n346n887n970n428
$$ 366305 371606 377069 382195 386325 389293 391358 392432 391881 389285 384976 379630 373743 367773 362345
63461C62345m492l771l454l075k331j590j289j201p83k9N21O35Q32J791L444M962
$$ 362345 357853 354082 350628 347553 345222 343632 342343 341142 340359 340330 340851 341486 342318 344109 347553 352515
63445C52515N744O134O970Q491J0135J1381J2443J3936J6177J9106K2559K6224
$$ 352515 358259 364393 371363 379854 389989 401370 413813 427749 443926 463032 485591 511815
63433E11815K9418L1249L1048K8624K4289J8791J3084Q010M220K273K389M086
$$ 511815 541233 572482 603530 632154 656443 675234 688318 696328 700548 702821 705210 709296
63421G09296O601R853J4461K0523K6926L2334L6297L8901L9805L8397L4470K8177
$$ 709296 715897 725750 740211 760734 787660 819994 856291 895192 934997 973394 1007864 1036041
63409A036041J9679R707J71o885j1025j3349j4773j5222j4661j3903j3875j4804
$$ 1036041 1055720 1065427 1065598 1058713 1047688 1034339 1019566 1004344 989683 975780 961905 947101
63397I47101j6583j9332k3044k7070l0526l2988l4383l4511l3175l0741k8104
$$ 947101 930518 911186 888142 861072 830546 797558 763175 728664 695489 664748 636644
63386F36644k5935k4070k1840j8995j6174j4146j2661j0585p446m271k192q48
$$ 636644 610709 586639 564799 545804 529630 515484 502823 492238 484792 480521 478329 477481
63374D77481R53L222M736N065N361O682Q603J0311J2046J4493J7335J9555K0936
$$ 477481 478434 481656 486392 491457 496818 503500 512103 522414 534460 548953 566288 585843 606779
63361F06779K2252K4101K6393K8966L1839L4741L7110L8678L9477L9128L6853
$$ 606779 629031 653132 679525 708491 740330 775071 812181 850859 890336 929464 966317
63350I66317L2370K6140J8593R864P39p007j2011j4644j6153j6885j6306j4659
$$ 966317 998687 1024827 1043420 1053284 1054023 1047016 1035005 1020361 1004208 987323 971017 956358
63338I56358j3496j4115j6305j9132k2285k5836k9143l1036l1172l0393k9471
$$ 956358 942862 928747 912442 893310 871025 845189 816046 785010 753838 723445 693974
63327F93974k8148k5816k2584j9095j5598j1837p763l930j112R3o90l504p814
$$ 693974 665826 640010 617426 598331 582733 570896 563133 559203 558091 558184 557494 553990 546176
63314E46176j2573j6728j9592k0790k0217j8241j5677j3321j1435r785q144o610
$$ 546176 533603 516875 497283 476493 456276 438035 422358 409037 397602 387817 379673 373063
63302C73063n477m834m405l862l215k740k538k395k153j997k172k581k897k947
$$ 373063 367586 362752 358347 354485 351270 348530 345992 343597 341444 339447 337275 334694 331797 328850
63288C28850k808k608k404k221k052j862j743j852k122k175j736r47j53M38O75
$$ 328850 326042 323434 321030 318809 316757 314895 313152 311300 309178 307003 305267 304320 304167 304605 305280
63273C05280M15j01j97M75J332J577J288J210J606J951J872J667J717J984K278
$$ 305280 305695 305594 305397 305872 307204 308781 310069 311279 312885 314836 316708 318375 320092 322076 324354
63258C24354K580K884L121L432M057M782N017M677M434M798N443N900O442P666
$$ 324354 326934 329818 332939 336371 340428 345210 350227 354904 359338 364136 369579 375479 381921 389587
63244C89587R398J0713J1076J1035J1641J3420J5961J8336J9909K0834K1722K2912
$$ 389587 398985 409698 420774 431809 443450 456870 472831 491167 511076 531910 553632 576544
63232E76544K4183K5263K6265K7412K8540K9112K8733K7481K5877K4572K3940
$$ 576544 600727 625990 652255 679667 708207 737319 766052 793533 819410 843982 867922
63221H67922K3891K4100K4382K4633K4617K4161K3565K3283K3086K2035J9472
$$ 867922 891813 915913 940295 964928 989545 1013706 1037271 1060554 1083640 1105675 1125147
63210A125147J5619J0909N318j308q591j5806k2419k8095l2496l5527l7512l8682
$$ 1125147 1140766 1151675 1156993 1155685 1147094 1131288 1108869 1080774 1048278 1012751 975239 936557
63198I36557l8708l7208l4504l1410k8301k4973k1254j7330j3405r486n587j841
$$ 936557 897849 860641 826137 794727 766426 741453 720199 702869 689464 679978 674391 672550
63186F72550J660M901P840J0445J2736J4633J5996J7010J8115J9277J9747J9061
$$ 672550 674210 679111 686951 697396 710132 724765 740761 757771 775886 795163 814910 833971
63174H33971J7908J7258J7033J6426J5289J4248J3475J2440J0967R409P467M002
$$ 833971 851879 869137 886170 902596 917885 932133 945608 958048 969015 978424 985891 989893
63162I89893j268o940j1614j5590j9852k4165k7416k9444l1087l2504l2779l1522
$$ 989893 988625 981685 970071 954481 934629 910464 883048 853604 822517 790013 757234 725712
63150G25712k9642k8063k6583k4643k2414k0378j8411j6118j3714j1785j0323
$$ 725712 696070 668007 641424 616781 594367 573989 555578 539460 525746 513961 503638
63139E03638q775p011n580m844m414l702k692j880j651j840j861j207N3J286J949
$$ 503638 494863 487852 482272 477428 473014 469312 466620 464740 463089 461249 459388 458181 458234 459520 461469
63124D61469K151K391K863L289L406L303L267L510M030M528M521L858L091K919
$$ 461469 463620 466011 468874 472163 475569 478872 482139 485649 489679 494207 498728 502586 505677 508596
63110E08596L293L509L209K763K536K325J838J223P33L41N1J81Q24J386J239N56
$$ 508596 511889 515398 518607 521370 523906 526231 528069 529292 530025 530366 530417 530598 531422 532808 534047 534603
63094E34603p6n85j268j823j411J15J707K210J557N62l6j02J36M60R02J661K758
$$ 534603 534527 533942 532674 530851 529440 529555 531262 533472 535029 535591 535555 535453 535589 536049 536951 538612 541370
63077E41370L839M538M968N496O144O604O944P741R308J1146J2525J3379J4294
$$ 541370 545209 549747 554715 560211 566355 572959 579903 587644 596952 608098 620623 634002 648296
63064F48296J5722J7512J9187K0552K1926K3803K6354K9366L2692L6446M0582
$$ 648296 664018 681530 700717 721269 743195 766998 793352 822718 855410 891856 932438
63053I32438M4599M8132N1517N5243N9026O2021O4028O5689O7330O8247O7614
$$ 932438 977037 1025169 1076686 1131929 1190955 1252976 1317004 1382693 1450023 1518270 1585884
63042A585884O5627O3312O1450O0055N8751N7322N5975N5135N4917N4807N4152
$$ 1585884 1651511 1714823 1776273 1836328 1895079 1952401 2008376 2063511 2118428 2173235 2227387
63031B227387N2732N0411M6411L9679L0153J8834O450p135k1784l6347m9708o1814
$$ 2227387 2280119 2330530 2376941 2416620 2446773 2465607 2472057 2464922 2443138 2406791 2357083 2295269
63019B295269p2741q1421q6457q7972q7428q5645q2041p6058o8467o0661n3268
$$ 2295269 2222528 2141107 2054650 1966678 1879250 1793605 1711564 1635506 1567039 1506378 1453110
63008A453110m5925l8075k9626k1013j2902n705P03O744J2603J8026K2594K5945
$$ 1453110 1407185 1369110 1339484 1318471 1305569 1299864 1300567 1307311 1319914 1337940 1360534 1386479
62996A386479K7927K8829K9365L0042L0590L0413K9569K8830K8695K8768K8229
$$ 1386479 1414406 1443235 1472600 1502642 1533232 1563645 1593214 1622044 1650739 1679507 1707736
62985A707736K6587K3792J9950J5208R693L394l782j1765k0221k8745l6987m4579
$$ 1707736 1734323 1758115 1778065 1793273 1802966 1806360 1802578 1790813 1770592 1741847 1704860 1660281
62973A660281n1164n6534o0580o3112o3960o3260o1379n8519n4689n0139m5502
$$ 1660281 1609117 1552583 1492003 1428891 1364931 1301671 1240292 1181773 1127084 1076945 1031443
62962A031443m1321l7683l4452l1670k9454k7674k6013k4329k2755k1414k0216
$$ 1031443 990122 952439 917987 886317 856863 829189 803176 778847 756092 734678 714462
62951G14462j8986j7757j6762j6114j5626j5014j4306j3791j3562j3258j2474
$$ 714462 695476 677719 660957 644843 629217 614203 599897 586106 572544 559286 546812
62940E46812j1277j0148r411q860q036o785n526m870m907n037m642l867l364l335
$$ 546812 535535 525387 515976 507116 499080 492295 486769 481899 476992 471955 467313 463446 460082 456747
62926D56747l243k645j801j218r50p49o57r22j465j843j784j492j391j723k353
$$ 456747 453504 450859 449058 447840 446890 446141 445484 444562 443097 441254 439470 437978 436587 434864 432511
62911D32511k785k554j753j062j039j586k237k660k687k166j205l54q6k74m59
$$ 432511 429726 427172 425419 424357 423318 421732 419495 416835 414148 411982 410777 410423 410337 410063 409604
62896D09604m25j93K59Q57J223J053N35jn55j115j206m73N23Q31L88%Q2J96l0
$$ 409604 409179 408986 409245 410102 411325 412378 412913 412912 412357 411242 410036 409563 410086 410917 411305 411305 411387 411583 411553
62877D11553l06k63PL41Q19J312J263L45r31j687j598j128j020j618k515k803
$$ 411553 411247 410984 410991 411332 412151 413463 414726 415071 414140 412453 410855 409727 408707 407089 404574 401771
62861D01771j987o00L65N87O06R12J407J805K025K018J689J208R90J131J273J102
$$ 401771 399784 399184 399549 400136 400742 401654 403061 404866 406891 408909 410598 411806 412796 413927 415200 416302
62845D16302O82J83k80m52j46L26L86L4j59OQ4j43k41J10N69P84R48J237J321
$$ 416302 416984 417167 416887 416435 416289 416615 417001 417035 416876 416882 416966 416823 416582 416692 417261 418045 418993 420230 421551
62826D21551R77O56Q98J577K226K714L064L091K768K572K891L440L782M082M689
$$ 421551 422528 423184 424082 425659 427885 430599 433663 436754 439522 442094 444985 448425 452207 456289 460978
62811D60978N387N699N637N525N384N197N406O438P873Q843R166R392R864J0505
$$ 460978 466365 472064 477701 483226 488610 493807 499213 505651 513524 522367 531533 540925 550789 561294
62797E61294J1379J2683J4156J5283J6207J7688J9973K2493K4842K7438L0800
$$ 561294 572673 585356 599512 614795 631002 648690 668663 691156 715998 743436 774236
62786G74236L4834L9191M3914M9316N5527O2402O9593P6548Q2824Q8624R4574
$$ 774236 809070 848261 892175 941491 997018 1059420 1129013 1205561 1288385 1377009 1471583
62775A471583J00665J05837J08945J09759J08587J05202R8754Q8718P5488N9907
$$ 1471583 1572248 1678085 1787030 1896789 2005376 2110578 2209332 2298050 2373538 2433445
62765B433445M2607K4071N073j3441l1059m8055o4372p8728q9460r6313j00670
$$ 2433445 2476052 2500123 2505196 2491755 2460696 2412641 2348269 2269541 2180081 2083768 1983098
62754A983098j03654j04801j03323r9884r6007r2008q6845q0153p3247o7487o2604
$$ 1983098 1879444 1774643 1671320 1571436 1475429 1383421 1296576 1216423 1143176 1075689 1013085
62743A013085n7426n1566m5704m0529l6189l2575k9488k6495k3201j9760j6762
$$ 1013085 955659 904093 858389 817860 781671 749096 719608 693113 669912 650152 633390
62732F33390j4600j3154j2037j0913r587q079o666n629m961m342l436k149o94
$$ 633390 618790 605636 593599 582686 573099 565020 558354 552725 547764 543422 539986 537837 537143
62719E37143O16J679K738M118N818P555R122J0522J1756J2844J4056J5792J8152
$$ 537143 537759 539438 542176 546294 552112 559667 568789 579311 591067 603911 617967 633759 651911
62706F51911K0917K4017K7616L1613L5561L9272M3105M7294N1531N5498N9420
$$ 651911 672828 696845 724461 756074 791635 830907 874012 921306 972837 1028335 1087755
62695A087755O3525O7380P0298P2148P3086P2699P0120O4986N7680M8587L7711
$$ 1087755 1151280 1218660 1288958 1361106 1434192 1506891 1577011 1641997 1699677 1748264 1785975
62684A785975K5207J1731j937j5311k8087l9997n0854o0373o7831p2466p4374
$$ 1785975 1811182 1822913 1820976 1805665 1777578 1737581 1686727 1626354 1558523 1486057 1411683
62673A411683p4576p3948p2481o9863o6220o1917n7058n1770m6628m2221l8445
$$ 1411683 1337107 1263159 1190678 1120815 1054595 992678 935620 883850 837222 795001 756556
62662G56556l4768l1099k7848k5146k2620k0062j7785j6072j4715j3372j2069
$$ 756556 721788 690689 662841 637695 615075 595013 577228 561156 546441 533069 521000
62651E21000j1024j0241r557q944q489q122p642o924n994m910l808k894k284j818
$$ 521000 509976 499735 490178 481234 472745 464623 456981 450057 444063 439153 435345 432451 430167 428349
62637D28349j289p42l61r0L39Q68R24Qj584k873l139k565j859j345p09L57J487
$$ 428349 427060 426318 425957 425867 426206 427074 427998 428006 426422 423549 420410 417845 415986 414641 413932 414289 415776
62620D15776J953J555J002J258K579M237N214N135M608M586N393O479P257P875
$$ 415776 417729 419284 420286 421544 424123 428360 433574 438709 443317 447903 453296 459775 467032 474907
62606D74907Q861J0204J1329J2118J3323J5591J8508K1128K3234K5581K8839L2836
$$ 474907 483768 493972 505301 517419 530742 546333 564841 585969 609203 634784 663623 696459
62594F96459L6920M0723M4343M7884N1032N3129N3694N2836N0940M7860M2733
$$ 696459 733379 774102 818445 866329 917361 970490 1024184 1077020 1127960 1175820 1218553
62583A218553L4950K5091J4592M559m799j3709k2298l0452l7722m3336m6774m8412
$$ 1218553 1253503 1278594 1293186 1297745 1292946 1279237 1256939 1226487 1188765 1145429 1098655 1050243
62571A050243m9200m9544m8989m7112m4324m1441l8834l6309l3552l0351k6629
$$ 1050243 1001043 951499 902510 855398 811074 769633 730799 694490 660938 630587 603958
62560F03958k2636j9008j6329j4615j3379j2072j0451q735p488p078p081o602
$$ 603958 581322 562314 545985 531370 517991 505919 495468 486733 479245 472167 465086 458484
62548D58484n324l922l116k789k412j971j808j783j309k41P65J028N36k05p09
$$ 458484 453160 449238 446122 443333 440921 438950 437142 435359 434050 433809 434574 435602 436138 435933 435224
62533D35224o89q1R21J934K647L011L242L747M918O724Q637J0227J1777J3900
$$ 435224 434535 434454 435375 437309 439956 442967 446209 449956 454874 461598 470235 480462 492239 506139
62519E06139J6686J9593K2243K4780K7323K9580L1376L3171L5562L8466M1196
$$ 506139 522825 542418 564661 589441 616764 646344 677720 710891 746453 784919 826115
62508H26115M3167M4168M4016M2468L9559L5648L0958K5312J8608J1285M059k661
$$ 826115 869282 913450 957466 999934 1039493 1075141 1106099 1131411 1150019 1161304 1165363 1162702
62496A162702q820j4223j8304k0528k0846j9613j7185j3719r353m434M52M764
$$ 1162702 1153882 1139659 1121355 1100827 1079981 1060368 1043183 1029464 1020111 1015677 1016129 1020893
62484A020893Q469J2197J6679K1807K6484K9547L0694L0206K8081K3947J7892
$$ 1020893 1029362 1041559 1058238 1080045 1106529 1136076 1166770 1196976 1225057 1249004 1266896
62473A266896J0807L667l243j0226j7518k4971l2196l8771m4418m8990n2226n3606
$$ 1266896 1277703 1281370 1278127 1267901 1250383 1225412 1193216 1154445 1110027 1061037 1008811 955205
62461I55205n2875n0705m8356m6401m4208m0907l6505l1644k6755k2003j7783
$$ 955205 902330 851625 803269 756868 712660 671753 635248 603604 576849 554846 537063
62450E37063j4569j2265j0256q202o394n186m489l915l116j944m61R84K001K484
$$ 537063 522494 510229 499973 491771 485377 480191 475702 471787 468671 466727 466266 467250 469251 471735
62436D71735K621K552K227J614P98j20j050j859k521l307m502n877o764o752o128
$$ 471735 474356 476908 479135 480749 481547 481427 480377 478518 475997 472690 468188 462311 455547 448795 442667
62421D42667n488n140m961m668m134l505l102l093l296l389l273l091k949k753
$$ 442667 437179 432039 427078 422410 418276 414771 411669 408576 405280 401891 398618 395527 392578 389825
62407C89825k407j968j661j703k019k030j127M36J452J084K0l22M33J340J679
$$ 389825 387418 385450 383789 382086 380067 378037 376910 377346 378798 379882 379902 379580 380013 381353 383032
62392C83032J886K561L338L443K938K625K902L399L731L989M319M575M653M842
$$ 383032 384918 387479 390817 394260 397198 399823 402725 406124 409855 413844 418163 422738 427391 432233
62378D32233N481O459P350P909Q233Q483Q741R128R798J0720J1638J2410J3239
$$ 432233 437714 444173 451523 459432 467665 476148 484889 494017 503815 514535 526173 538583 551822
62365E51822J4470J6251J8495K1117K4065K7271L0786L4908L9861M5249N0159
$$ 551822 566292 582543 601038 622155 646220 673491 704277 739185 779046 824295 874454
62354H74454N3947N6656N8490N9084N7559N3266M6306L7460K7788J8190R141P92
$$ 874454 928401 985057 1043547 1102631 1160190 1213456 1259762 1297222 1325010 1343200 1352341 1353133
62342A353133o770j3467j9440k4938k9987l4384l8105m1269m3560m4212m2942
$$ 1353133 1346363 1332896 1313456 1288518 1258531 1224147 1186042 1144773 1101213 1057001 1014059
62331A014059m0529l8016l5670l3121l0202k7091k3857k0585j7838j6430j6595
$$ 1014059 973530 935514 899844 866723 836521 809430 785573 764988 747150 730720 714125
62320G14125j7722j8930j9555j9273j8210j6986j6148j5642j5116j4553j4098
$$ 714125 696403 677473 657918 638645 620435 603449 587301 571659 556543 541990 527892
62309E27892j3433j2078j0197q475p106n644m009k827k461k410k076j584j364
$$ 527892 514459 502381 492184 483709 476603 470959 466950 464123 461662 459252 457176 455592 454228
62296D54228j352j105m38M65J329J912K103K158K547L350M029M063L596L231L401
$$ 454228 452876 451771 451333 451798 453127 455039 457142 459300 461847 465197 469226 473289 476885 480116 483517
62281D83517M049M671M618L735K801K884M133N606O501O995P673Q683R885J1322
$$ 483517 487566 492237 496855 500590 503391 506275 510408 516014 522515 529510 537183 545866 555751 567073
62267E67073J3007J4648J6091J7800K0371K3847K7889L2337L7152M2059M6777
$$ 567073 580080 594728 610819 628619 648990 672837 700726 733063 770215 812274 859051
62256H59051N1424N6257O1099O5387O8596P0183O9298O5150N7682M7597L5809
$$ 859051 910475 966732 1027831 1093218 1161814 1231997 1301295 1366445 1424127 1471724 1507533
62245A507533K3201J0732p18j0739j9358k6758l3296l9615m6172n2603n7869o1179
$$ 1507533 1530734 1541466 1540748 1530009 1510651 1483893 1450597 1410982 1364810 1312207 1254338 1193159
62233A193159o2490o2138o0293n6986n2486m7441m2608l8374l4584l0885k7219
$$ 1193159 1130669 1068531 1008238 951252 898766 851325 808717 770343 735759 704874 677655
62222F77655k3803k0694j7693j4765j2243j0408r184q326p671p024o218n417m952
$$ 677655 653852 633158 615465 600700 588457 578049 568865 560539 552868 545844 539626 534209 529257
62209E29257m663m018l077k737l424m123l498j590L42J411J838K214K842L791
$$ 529257 524594 520576 517499 514762 511338 507215 503717 502127 502469 503880 505718 507932 510774 514565
62195E14565M998O176P110Q039R284J0549J1198J1164J1051J1243J1545J1773
$$ 514565 519563 525739 532849 540888 550172 560721 571919 583083 594134 605377 616922 628695
62183F28695J2106J2614J2921J2567J1386R470P121M967L650L183L045L042L690
$$ 628695 640801 653415 666336 678903 690289 699759 706880 711847 715497 718680 721725 724767 728457
62170G28457N585Q752J2909J7874K3401K8862L3531L7220M0317M3144M5299M5625
$$ 728457 734042 742794 755703 773577 796978 825840 859371 896591 936908 980052 1025351 1070976
62158A070976M3007L7310K9553K1116J2898N347j194o627j1363j5883k0148k3877
$$ 1070976 1113983 1151293 1180846 1201962 1214860 1220207 1219013 1212386 1201023 1185140 1164992 1141115
62146A141115k7252l0691l3932l6037l6509l5751l4234l1780k8125k3662j9175
$$ 1141115 1113863 1083172 1049240 1013203 976694 940943 906709 874929 846804 823142 803967
62135H03967j5194j1913r440p681o200m635l074j741n56O34J587J974K087K818
$$ 803967 788773 776860 767420 759739 753539 748904 745830 744089 743533 744167 745754 747728 749815 752633
62121G52633M677P163R270J0516J1245J1942J2453J2027J0044O528K058k484o002
$$ 752633 757310 764473 773743 784259 795504 807446 819899 831926 841970 848498 850556 848072 842070
62108H42070p536p047n677m850n114o122p480r081j0606j1387j1024r747p923
$$ 842070 834534 827487 821810 816960 811846 805724 798244 789163 778557 767170 756146 746399 738476
62095G38476n613k825J8K301L768M697N514O337O903O943O672O714P377Q279Q915
$$ 738476 732863 730038 730056 732357 736125 740822 746336 752673 759576 766519 773191 779905 787282 795561 804476
62080H04476R424J0334J1791J3461J5136J6859J8502J9787K0737K1556K2015K1644
$$ 804476 813900 824234 836025 849486 864622 881481 899983 919770 940507 962063 984078 1005722
62068A005722K0639J9914K0057K0771K1657K2797K4274K5669K6505K6591K5585
$$ 1005722 1026361 1046275 1066332 1087103 1108760 1131557 1155831 1181500 1208005 1234596 1260181
62057A260181K2837J8262J2797P467K401k571p001j0355j3109j6392k0597k5123
$$ 1260181 1283018 1301280 1314077 1321544 1323945 1321374 1314373 1304018 1290909 1274517 1253920 1228797
62045A228797k9412l3410l6976l9599m1046m1654m1732m1132l9671l7545l5096
$$ 1228797 1199385 1165975 1128999 1089400 1048354 1006700 964968 923836 884165 846620 811524
62034H11524l2485k9847k7420k5292k3236k1053j8878j6953j5307j3792j2347
$$ 811524 779039 749192 721772 696480 673244 652191 633313 616360 601053 587261 574914
62023E74914j1033r952r204q835q725q590q282p943p819p888p791p111n775m174
$$ 574914 563881 553929 544725 535890 527165 518575 510293 502350 494531 486643 478852 471741 465966 461792
62009D61792k882k197j865j205L86K849N311O788P293P923R447J1017J0979Q930
$$ 461792 458910 456713 454848 453643 454029 456878 462189 468977 476270 484193 493640 504657 515636 524566
61995E24566O205M087K424M81j588l023l744m384n288o254p233q400r477r866
$$ 524566 530771 534858 537282 537763 536175 533152 529408 525024 519736 513482 506249 497849 488372 478506
61981D78506r574r219q904p976o306m918m689n049m845m001l407l356l080k043
$$ 478506 468932 459713 450809 442833 436527 431609 426920 421871 417026 413025 409618 406262 403182 401139
61967D01139r04o88j412k022j604l17Q90J305J069Q04P96Q24P75J032J953L158
$$ 401139 400235 399547 398135 396113 394509 394192 395082 396387 397456 398260 399056 399880 400655 401687 403640 406798
61951D06798L874L933L958M482N340O201P289R082J1449J3598J4997J6019J7463
$$ 406798 410672 414605 418563 423045 428385 434586 441875 450957 462406 476004 491001 507020 524483
61938E24483J9558K1625K2712K2520K1618K0754K0065J9178J8017J7045J6491
$$ 524483 544041 565666 588378 610898 632516 653270 673335 692513 710530 727575 744066
61927G44066J5709J3832J0883P652M493J006k910o308q113q419q358q770r418
$$ 744066 759775 773607 784490 792142 796635 797641 794731 788423 780310 771891 763533 754763 745345
61914G45345r345p680m207M34N159R247J2664J5423J7149J7659J7579J7583J7253
$$ 745345 736000 728320 724113 724547 729706 738953 751617 767040 784189 801848 819427 837010 854263
61901H54263J5492J2083P964L873m34n220r842j3395j5778j7539j9043k0252k1050
$$ 854263 869755 881838 889802 893675 893241 888021 878179 864784 849006 831467 812424 792172 771122
61888G71122k1266k0665j9293j7670j6243j4918j3520j2413j2172j2758j3494
$$ 771122 749856 729191 709898 692228 675985 661067 647547 635134 622962 610204 596710
61877E96710j3729j3235j2095j0593r126p878o656n276l926k888k102j337n15
$$ 596710 582981 569746 557651 547058 537932 530054 523398 518122 514196 511308 509206 507869 507354
61864E07354M28J766L683N941Q132J0082J1749J3170J4807J7384K0794K3770K5434
$$ 507354 507782 509548 513231 519172 527304 537386 549135 562305 577112 594496 615290 639060 664494
61851F64494K6675K8956L2095L4473L5375L5774L6453L6611L5022L1637K7256
$$ 664494 691169 720125 752220 786693 822068 857842 894295 930906 965928 997565 1024821
61840A024821K2294J6702J0652M546j502p478j2852j6584j7876j6796j4369j1906
$$ 1024821 1047115 1063817 1074469 1079015 1077513 1070035 1057183 1040599 1022723 1005927 991558 979652
61828I79652r819p046k276M076R849J3408J5136J6105J6135J4166R988M518j504
$$ 979652 969833 962787 960511 964587 974436 987844 1002980 1019085 1035220 1049386 1059374 1063892 1062388
61815A062388q039j4940k1464k6873l0938l3752l5492l6424l6650l5869l3871
$$ 1062388 1054349 1039409 1017945 991072 960134 926382 890890 854466 817816 781947 748076
61804G48076l1177k8625k6393k4078k1661j9565j7758j5677j3325j1580j0864
$$ 748076 716899 688274 661881 637803 616142 596577 578819 563142 549817 538237 527373
61793E27373j0336r000p092n588m833m363l857l516l491l568l478l161k716k343
$$ 527373 517037 508037 500945 495357 490524 486161 482304 478788 475297 471729 468251 465090 462374 460031
61779D60031k252k328k093j376p66r35j654k046j739j242j155j468j786j789j353
$$ 460031 457779 455451 453358 451982 451216 450281 448627 446581 444842 443600 442445 440977 439191 437402 436049
61764D36049n59K44O94Q28J011J433J945K347K490K136J220K38j31O6Q0m91j212
$$ 436049 435490 435734 436428 437256 438267 439700 441645 443992 446482 448618 449838 450076 449945 450011 450091 449600 448388
61747D48388j573j615j518j195p25o21j043j335r07j89Pl48o82q58j150j355q72
$$ 448388 446815 445200 443682 442487 441762 441141 440098 438763 437856 437667 437674 437326 436644 435786 434636 433281 432409
61730D32409K94J399J962K175K270K253K352K931L689L819L268K998L591M384
$$ 432409 432703 434102 436064 438239 440509 442762 445114 448045 451734 455553 458821 461819 465410 469794
61716D69794M608M527M681M681L766K145P75n2r57k305l676m641n346o095o874
$$ 469794 474402 478929 483610 488291 492057 494202 494977 494925 493968 491663 487987 483346 478000 471905 465031
61701D65031p478p729p418o460n217m252l681l202k798k881l569m310m518m197
$$ 465031 457553 449824 442406 435946 430729 426477 422796 419594 416796 413915 410346 406036 401518 397321
61687C97321l677l121k571k183k077k126k143k108k001j703j248r40r84j186j290
$$ 397321 393644 390523 387952 385769 383692 381566 379423 377315 375314 373611 372363 371423 370439 369253 367963
61672C67963j308j322j169o91j27J45Q0j06l51o77p84k10J033K323L100L299L100
$$ 367963 366655 365333 364164 363473 363346 363491 363571 363465 363114 362437 361653 361443 362476 364799 367899 371198 374298
61655C74298K566J806J168R68J090J175J141J262J690K180K346K132J891K015
$$ 374298 376864 378670 379838 380806 381896 383071 384212 385474 387164 389344 391690 393822 395713 397728
61641C97728K573L266L730L767L357K516J336J33o83j026j307k018l107l961m064
$$ 397728 400301 403567 407297 411064 414421 416937 418273 418406 417723 416697 415390 413372 410265 406304 402240
61626D02240l539k977k808k915k853k389j716j207r32n64J97J165J792J693R79
$$ 402240 398701 395724 392916 390001 387148 384759 383043 381836 380904 380340 380537 381702 383494 385187 386166
61611C86166L8q17j449j887k341l100m216n387o235o609o482n822m773l861l575
$$ 386166 386204 385387 383938 382051 379710 376610 372394 367007 360772 354163 347681 341859 337086 333225 329650
61596C29650l747l700l099k387k205k587k942k703j864r15l78l92p12j125j726
$$ 329650 325903 322203 319104 316717 314512 311925 308983 306280 304416 303501 303123 302731 302019 300894 299168
61581B99168k539l107k825j814r17o29m52K71J211J396O03l29o38n19n21n90l29
$$ 299168 296629 293522 290697 288883 287966 287337 286885 287156 288367 289763 290366 290037 289399 288880 288359 287769 287440
61564B87440Q8j7p10j083l68R88J877J955J897K218K514K204J492J068J101J126
$$ 287440 287528 287511 286801 285718 285350 286338 288215 290170 292067 294285 296799 299003 300495 301563 302664 303790
61548C03790Q08L80J74K32M88R47J479J759J633J380J427J910K608L112L108K684
$$ 303790 304598 304978 305152 305384 305872 306819 308298 310057 311690 313070 314497 316407 319015 322127 325235 327919
61532C27919K350K438K501J770L03r15j206j008j038j250j200j064j483k445l124
$$ 327919 330269 332707 335208 336978 337281 336366 335160 334152 333114 331864 330664 329600 328117 325672 322548
61517C22548k952k287j758j418r19k50J37n9n81q65n99P1Q01J359J615J390O22
$$ 322548 319596 317309 315551 314133 313214 312964 313101 313042 312461 311596 310997 311068 311869 313228 314843 316233 316855
61500C16855l61j015j167j196j451j715j441n04N47R52M42m75r18m67M15R64R87
$$ 316855 316494 315479 314312 313116 311665 309950 308509 308005 308552 309504 309946 309471 308553 308086 308501 309465 310452
61483C10452Q72P79M27k43p27o26j60L13Q57J595K212K327K012J524Q37j5n24
$$ 310452 311324 312103 312530 312287 311560 310934 310774 311087 311944 313539 315751 318078 320090 321614 322451 322436 321912
61466C21912k97K59M49K94K78L48M5m76m73J57O05L82Q4M04J124J595J744J927
$$ 321912 321615 321874 322323 322617 322895 323243 323288 322812 322339 322496 323101 323483 323567 323971 325095 326690 328434 330361
61448C30361K152K018J417P71N55Q90J580K305K739K683K253J864J928K511L238
$$ 330361 332513 334531 335948 336719 337274 338164 339744 342049 344788 347471 349724 351588 353516 356027 359265
61433C59265L675L731L575L234K577J756J192R29M89k92p94n12M3J05j11K47J237
$$ 359265 362940 366671 370246 373480 376057 377813 379005 379934 380423 380131 379337 378825 378868 378973 378862 379109 380346
61416C80346K000K045J772J531J068K21o41j254j927k904l826m214m055l523k704
$$ 380346 382346 384391 386163 387694 388762 388983 388342 387088 385161 382257 378431 374217 370162 366639 363935
61401C63935j841j421j547j678j382r35q05r77j120j063p79k71K73N66P10J072
$$ 363935 362094 360673 359126 357448 356066 355131 354326 353349 352229 351166 350387 350116 350389 350955 351665 352737
61385C52737J484J283M56n6K99P91O13K49O44J545J820J184N11M54P56J054J452
$$ 352737 354221 355504 355960 355904 356203 356994 357607 357856 358500 360045 361865 363049 363560 364014 364770 365824 367276
61368C67276J965K188J867J328J011J043J446K320L440M145M046L576L569M329
$$ 367276 369241 371429 373296 374624 375635 376678 378124 380444 383884 388029 392075 395651 399220 403549
61354D03549N435O331O904P515Q526R854J0929J1145J0340Q846P205N853M984
$$ 403549 408984 415315 422219 429734 438260 448114 459043 470188 480528 489374 496579 502432 507416
61341E07416M531M344M349M434M234L380K054R02K01m93j586k783l562l931m151
$$ 507416 511947 516291 520640 525074 529308 532688 534742 535644 535845 535352 533766 530983 527421 523490 519339
61326E19339m124l626l021k937l343l537l157k497j793q56L04J141J268J114J405
$$ 519339 515215 511589 508568 505631 502288 498751 495594 493097 491304 490448 490752 491893 493161 494275 495680
61311D95680K236L101L685M213N114O569Q360R952J0700J0206Q511N994L157N59
$$ 495680 497916 501017 504702 508915 514029 520598 528958 538910 549610 559816 568327 574321 577478 578037
61297E78037j322k439l270m297n401o036o017n759n600n256m412l554l623m664
$$ 578037 576715 574276 571006 566709 561308 555272 549255 543496 537896 532640 528228 524674 521051 516387
61283E16387n523n192l940k637j440R0J828L020L413L654M256M871N020M899M932
$$ 516387 510864 505672 501732 499095 497655 497745 499573 502593 506006 509660 513916 518787 523807 528706 533638
61268E33638N008M793M462M548N157N799O019N852N767O331P699R206R771Q983
$$ 533638 538646 543439 547901 552449 557606 563405 569424 575276 581043 587374 595073 604279 614050 623033
61254F23033P571O472N761M840L402J689R8j080j621j617j679k495m145o047p457
$$ 623033 630604 637076 642837 647677 651079 652768 652866 651786 650165 648548 646869 644374 640229 634182 626725
61239F26725p887p315o273n515n293n184m781m123l305k171q98k02l36m63K68
$$ 626725 618838 611523 605250 599735 594442 589258 584477 580354 577049 574878 573980 573778 573442 572979 573247
61224E73247J433K005J896J872K139K169J909K069K924L811M158M236M472M638
$$ 573247 574680 576685 578581 580453 582592 584761 586670 588739 591663 595474 599632 603868 608340 612978
61210F12978M228L167J795N66j00o3K58L20L12J080K960N358P673J0060J2788
$$ 612978 617206 620373 622168 622734 622634 622571 622829 623149 623461 624541 627501 632859 640532 650592 663380
61195F63380J5409J7164J7959J8342J8597J8273J6710J3926J0809Q409O960N808
$$ 663380 678789 695953 713912 732254 750851 769124 785834 799760 810569 818978 825938 831746
61183H31746M415L118K509K394J937P04j028k882m666o062o786p115p598q125
$$ 831746 836161 839279 841788 844182 846119 846823 845795 842913 838247 832185 825399 818284 810686 802561
61169H02561q043p354o990p635q959j0381j1789j3100j3840j3745j3272j2899
$$ 802561 794518 787164 780174 772539 763580 753199 741410 728310 714470 700725 687453 674554
61157F74554j2463j1663j0763j0102r290p573m857j887M66J762K049J678R09n01
$$ 674554 662091 650428 639665 629563 620273 612700 607843 605956 606422 608184 610233 611911 612820 612319
61143F12319k959o060q490r276q781q015p376o545n222l501j663j09P59J043J497
$$ 612319 609360 603300 594810 585534 576753 568738 561362 554817 549595 546094 544431 544322 545081 546124 547621
61128E47621K803M863P104R172J0951J2261J3087J3885J5196J7048J9112K1133
$$ 547621 550424 555287 562391 571563 582514 594775 607862 621747 636943 653991 673103 694236
61116F94236K2829K3724K3660K3322K3656K4752K5728K5685K4493K2712K1083
$$ 694236 717065 740789 764449 787771 811427 836179 861907 887592 912085 934797 955880
61105I55880J9959J8940J7226J4445J0972P264L331q82n031q761j2134j5227j7730
$$ 955880 975839 994779 1012005 1026450 1037422 1044686 1048017 1047135 1042104 1033343 1021209 1005982 988252
61092I88252j9440k0738k2043k3107k3473k3240k2742k1841k0334j8695j7526
$$ 988252 968812 948074 926031 902924 879451 856211 833469 811628 791294 772599 755073
61081G55073j6550j5058j3222j1920j1277j0420q904p358o378n597m450l115k074
$$ 755073 738523 723465 710243 698323 687046 676626 667722 660364 653986 648389 643939 640824 638750
61068F38750j196J15J978L756M678M578M094M173N230O805Q157R087R937J0983
$$ 638750 637554 637669 639647 643403 648081 652659 656753 660926 666156 672961 681118 690205 700142 711125
61054G11125J2153J3251J4123J4765J5581J7186J9497K1459K2277K2613K3681
$$ 711125 723278 736529 750652 765417 780998 798184 817681 839140 861417 884030 907711
61043I07711K5569K7421K9038L1017L3307L4905L5394L5536L5967L6428L6860
$$ 907711 933280 960701 989739 1020756 1054063 1088968 1124362 1159898 1195865 1232293 1269153
61032A269153L8016M0134M2096M3002M3754M5816M8939N1351N1984N1492N1169
$$ 1269153 1307169 1347303 1389399 1432401 1476155 1521971 1570910 1622261 1674245 1725737 1776906
61021A776906N1903N4204N8450O4792P3144Q3283R4654J06409J18109J30253J44066
$$ 1776906 1828809 1883013 1941463 2006255 2079399 2162682 2257336 2363745 2481854 2612107 2756173
61010B756173J61276J84388K16034K57154L06729L64346M32338N14433O14110
$$ 2756173 2917449 3101837 3317871 3575025 3881754 4246100 4678438 5192871 5806981
61001E806981P37014Q94241J098829J354759J645943J929476K132804K162083
$$ 5806981 6543995 7438236 8537065 9891824 11537767 13467243 15600047 17762130
60993A7762130J936649J445838P87835J44496l04561m67046l62368q7037K29036
$$ 17762130 19698779 21144617 21932452 22076948 21772387 21305341 20942973 20855936 21084972
60984B1084972M45661M35368J31703m21076j071956j636809j989763k104644k030711
$$ 21084972 21530633 21966001 22097704 21676628 20604672 18967863 16978100 14873456 12842745
60975A2842745j842061j603137j358720j134719r41121p77547o40259n26047m32057
$$ 12842745 11000684 9397547 8038827 6904108 5962987 5185440 4545181 4019134 3587077
60966C587077l55179k92730k42875k03954j74070j51419j34334j20953j09466
$$ 3587077 3231898 2939168 2696293 2492339 2318269 2166850 2032516 1911563 1802097
60957A802097r8822q8749p9147o9913o1169n3145m5922l9670l4919l2065l0810
$$ 1802097 1703275 1614526 1535379 1465466 1404297 1351152 1305230 1265560 1230641 1198576 1167766
60946A167766l0598l1199l2258l2741l1839l0144k8901k8210k7117k5452k4218
$$ 1167766 1137168 1105969 1073711 1040970 1009131 978987 950086 921876 894759 869307 845089
60935H45089k3868k3472k2293k1009k0505k0302j9298j7471j5763j4543j3201
$$ 845089 821221 797749 775456 754447 733942 713640 694342 676871 661108 646565 633364
60924F33364j1221q922p072o227o400o932o880n987n051m869n046m510k997j355
$$ 633364 622143 613221 606149 599922 593522 586590 579710 573723 568672 563803 558757 554247 551250 549895
60910E49895l66L5L14P13J253J901K533L017L428L871M050L478K183Q07j41p91
$$ 549895 549529 549564 549878 550591 551844 553745 556278 559295 562723 566594 570644 574122 576305 577112 576971 576180
60894E76180j479k233k924l631m510n408n882n740n354n329n821o349o442o319
$$ 576180 574701 572468 569544 565913 561403 555995 550113 544373 539019 533690 527869 521520 515078 508759
60880E08759o648p569q452q708q380p720o733n569m807m718m668l975l012k683
$$ 508759 502111 494542 486090 477382 469002 461282 454549 448980 444173 439455 434787 430812 427800 425117
60866D25117k981k945j995m64J143K639L778M266M257M134L698K473R43M11J185
$$ 425117 422136 419191 417196 416732 417875 420514 424292 428558 432815 436949 440647 443120 444063 444474 445659
60851D45659K024J984J756K263K917K524J331P30J100J281M34p87j365j383j691
$$ 445659 447683 449667 451423 453686 456603 459127 460458 461188 462288 463569 464003 463216 461851 460468 458777
60836D58777k653l807m538m569l980l114k416k097j957j743j520j532j747j848
$$ 458777 456124 452317 447779 443210 439230 436116 433700 431603 429646 427903 426383 424851 423104 421256
60822D21256j754j792k167k502k306j778j633k067k446k264j913k015k457k720
$$ 421256 419502 417710 415543 413041 410735 408957 407324 405257 402811 400547 398634 396619 394162 391442
60808C91442k782k987l246l160k855k819k934k599j925j791k388k757k328j862
$$ 391442 388660 385673 382427 379267 376412 373593 370659 368060 366135 364344 361956 359199 356871 355009
60794C55009k182k763k632j927j522j508j163k85M49N32K42O5J25L09M78N34O12
$$ 355009 352827 350064 347432 345505 343983 342475 341312 341027 341476 342008 342250 342315 342440 342749 343227 343761 344373
60777C44373J139K213L158L182K334J311N41N9O1Q15K033L040L599L935M068L776
$$ 344373 345512 347725 350883 354065 356399 357710 358251 358310 358371 359186 361219 364259 367858 371793 375861 379637
60761C79637L271L059L029K486J283J26n33j124k034k831k944k574k220j880j306
$$ 379637 382908 385967 388996 391482 392765 392891 392358 391234 389200 386369 383425 380851 378631 376751 375445
60746C75445p24n11m11J44R40R73l03k217l699m430m880n469o036o097n379m058
$$ 375445 374721 374210 373799 373943 374883 375856 375553 373336 369637 365207 360327 354858 348822 342725 337346 333288
60730C33288k711j986k091k555k669k260j837j763j649r71m1L25N8L4P04J323
$$ 333288 330577 328591 326500 323945 321276 319016 317179 315416 313767 312796 312755 313080 313138 313172 313876 315199
60714C15199J109M72L27O14M84j44k96N64J662K036J835J886K350K590K265J877
$$ 315199 316308 316780 317107 317721 318205 318061 317765 318329 319991 322027 323862 325748 328098 330688 332953 334830
60698C34830K028K570K849K614K277K196K119J646J010Q90J456K069K118J698
$$ 334830 336858 339428 342277 344891 347168 349364 351483 353129 354139 355029 356485 358554 360672 362370
60684C62370J266J036J075J559K455L242L400K963K243J269K7j044j351r14l50
$$ 362370 363636 364672 365747 367306 369761 373003 376403 379366 381609 382878 382905 381861 380510 379596 379246
60669C79246j42l81j034j964k755l078l172l462l798l649k991k370j999j472n29
$$ 379246 379104 378723 377689 375725 372970 369892 366720 363258 359460 355811 352820 350450 348451 346979 346450
60654C46450M28Q42P07N36Q57J715K551K666K029J407J313J244N16n74j231j488
$$ 346450 346878 347720 348427 348963 349820 351535 354086 356752 358781 360188 361501 362745 363261 362687 361456 359968
60638C59968k071l080l736l569k895k004q45K19M19k82r04q02m41l57k13M03J065
$$ 359968 357897 354817 351081 347512 344617 342613 341768 341987 342406 342124 341220 340418 339977 339620 339407 339810 340875
60621C40875J162Q85P45O61K82j30K4P00J249J329J177J031Q18M77J86J99N68
$$ 340875 342037 342922 343667 344328 344610 344480 344504 345204 346453 347782 348959 349990 350808 351285 351471 351670 352238
60604C52238J001J018M71j36k17J06L00M42J092K058K303J527Q78J377K465K907
$$ 352238 353239 354257 354728 354592 354375 354481 354781 355223 356315 358373 360676 362203 363081 364458 366923 369830
60588C69830K479J799J094J57q21j366j506j592j546j063l68P2L88J038J819K072
$$ 369830 372309 374108 375202 375359 374538 373172 371666 370074 368528 367465 367097 367169 367557 368595 370414 372486
60572C72486J835J923K845M370O172Q048R485R958R843J0138J1029J1513J0772
$$ 372486 374321 376244 379089 383459 389631 397679 407164 417122 426965 437103 448132 459645 470417
60559D70417R064O866M045N38k821m977n839o105o203n988n310m231k740p81J350
$$ 470417 479481 486347 490392 490930 488109 483132 477293 471188 464985 458997 453687 449456 446716 445935 447285
60544D47285L037L956M427N013N958P096Q157R086J0007J1027J2089J3024J3673
$$ 447285 450322 454278 458705 463718 469676 476772 484929 494015 504022 515049 527138 540162 553835
60531E53835J3867J3352J1837R211N709J915j461l986n725o935p528p143n888
$$ 553835 567702 581054 592891 602102 607811 609726 608265 604279 598554 591619 584091 576948 571060
60518E71060m634m166m262m042l120j982j240r26o93k87L07J009J670K161K610
$$ 571060 566426 562260 557998 553956 550836 548854 547614 546688 545995 545708 546015 547024 548694 550855 553465
60503E53465L550N616Q999J3140J7030K0055K2578K5539K9329L3330L6672L9091
$$ 553465 557015 562631 571630 584770 601800 621855 644433 669972 699301 732631 769303 808394
60491H08394M0710M1242M0037L6863L2144K6331J9447J1479K865n668j3589k0725
$$ 808394 849104 890346 930383 967246 999390 1025721 1045168 1056647 1059512 1053844 1040255 1019530
60479A019530k7037l2466l6953m0400m2574m3127m1921l9339l6186l3088l0063
$$ 1019530 992493 960027 923074 882674 840100 796973 755052 715713 679527 646439 616376
60468F16376k6902k3811k1271j9272j7167j4570j1997j0227r278q428p146n630
$$ 616376 589474 565663 544392 525120 507953 493383 481386 471159 461881 453453 446307 440677
60456D40677m516m243m702n233n196m547l732k969k109j342j326k156k794k260
$$ 440677 436161 431918 427216 421983 416787 412240 408508 405539 403430 402088 400762 398606 395812 393552
60442C93552r87k18k95n22n23p13j216j387q64l91q60k008k679k180q79L48R44
$$ 393552 392565 392347 392052 391530 391007 390294 389078 387691 386827 386436 385576 383568 380889 378709 377830 378178 379122
60425C79122R01N59K45P2L9K07O04J051J368J660K090K443K327J812J426J390
$$ 379122 380023 380582 380827 380899 380938 381145 381749 382800 384168 385828 387918 390361 392688 394500 395926 397316
60409C97316J359J079P92P41P08M66K56M21Q39J124J262J519J905K123K042J833
$$ 397316 398675 399754 400546 401287 401995 402461 402717 403138 403977 405101 406363 407882 409787 411910 413952 415785
60393D15785J615J327J048J087J591K238K528K277J766J424J435J663J855J965
$$ 415785 417400 418727 419775 420862 422453 424691 427219 429496 431262 432686 434121 435784 437639 439604
60379D39604K157K525K890L002K864K658K409J997J534J492K136L032L395K930
$$ 439604 441761 444286 447176 450178 453042 455700 458109 460106 461640 463132 465268 468300 471695 474625
60365D74625K062J384J129J252J710K395L092L629M000M233M411M930O253Q141
$$ 474625 476687 478071 479200 480452 482162 484557 487649 491278 495278 499511 503922 508852 515105 523246
60351E23246R569R951R990J0591J1261J0542P984M690J730r85l789o186p451p708
$$ 523246 532815 542766 552756 563347 574608 585150 593134 597824 599554 598569 594780 588594 581143 573435
60337E73435p702p885q308q948r447q935o950m398k834k779l377l639l444l206
$$ 573435 565733 557848 549540 540592 531145 522210 515260 510862 508028 505249 501872 498233 494789 491583
60323D91583l126l034k635j781o50L35R50J431K066K785L426M245N754Q067J0691
$$ 491583 488457 485423 482788 481007 480357 480692 481642 483073 485139 487924 491350 495595 501349 509416 520107
60308E20107J3019J4837J6377J7917J9263J9696J8819J7261J5856J4185J0840
$$ 520107 533126 547963 564340 582257 601520 621216 640035 657296 673152 687337 698177
60297F98177N470m15n268r184j2992j6541j8962j9981j9801j8278j5425j2375
$$ 698177 703647 703232 697964 688780 675788 659247 640285 620304 600503 582225 566800 554425
60285E54425j0432r368p919n907m485m242m431m341m199m262m259m161m446n054
$$ 554425 543993 534625 526706 520799 516314 512072 507641 503300 499101 494839 490580 486419 481973 476919
60271D76919n096m212l252l023l185l039k601k198j707r92m94o76j283j727j816
$$ 476919 471823 467611 464359 461336 458151 455112 452511 450313 448606 447614 447120 446444 445161 443434 441618
60256D41618j602j023k40J53j20m70j87O58J464J911K042J923J724J794K162K283
$$ 441618 440016 438993 438753 438906 438786 438316 438129 438787 440251 442162 444204 446127 447851 449645 451807 454090
60240D54090J706P11m8l05k35j28k23m85l70O88K303L298L177K781L008L516L350
$$ 454090 455796 456507 456459 456154 455919 455791 455568 455083 454713 455401 457704 461002 464179 466960 469968 473484 476834
60223D76834K333J194P07J175K396L662M217M130M264N036N845O183O547P508
$$ 476834 479167 480361 481068 482243 484639 488301 492518 496648 500912 505948 511793 517976 524523 532031
60209E32031Q610R012Q708Q223P597O653N837N718N916N587M742M153L956L467
$$ 532031 540641 549653 558361 566584 574181 580834 586671 592389 598305 603892 608634 612787 616743 620210
60195F20210K447J568J293J102K37j315k905l925m250m274m532n079n376n062
$$ 620210 622657 624225 625518 626620 626857 625542 622637 618712 614462 610188 605656 600577 595201 590139
60181E90139m592m615n053n328n271n124m928m534m096l830l427k500j446j000
$$ 590139 585547 580932 575879 570551 565280 560156 555228 550694 546598 542768 539341 536841 535395 534395
60167E34395j072q88k90O4p6j37J57K81p1l05J33Q45J177J238J521J913J855J273
$$ 534395 533323 532435 532145 532209 532133 531996 532153 532434 532363 532058 532191 533036 534213 535451 536972 538885 540740 542013
60149E42013O95M79M28K51P7M21J662L605N467O500O645O411O184N976N825O004
$$ 542013 542708 543187 543615 543866 543943 544364 546026 549631 555098 561598 568243 574654 580838 586814 592639 598643
60133E98643O577P077O934O036M749L569K821K486K144J354K11o39o59L2Q21J176
$$ 598643 605220 612297 619231 625267 630016 633585 636406 638892 641036 642390 642601 641962 641303 641335 642156 643332
60117F43332J044Q12Q99J223J232O71L6j25j36q13k151l166l216k873l081l967
$$ 643332 644376 645188 646087 647310 648542 649213 649249 649124 648988 648175 646024 642858 639642 636769 633688 629721
60101F29721m913n436n535n377n060m570l781k618j413p30o19l86N20J681K230
$$ 629721 624808 619372 613837 608460 603400 598830 595049 592431 591018 590288 589669 589283 589803 591484 593714
60086E93714K003J727K046K787L247K951K018R58K31j62n70j196j841k331k984
$$ 593714 595717 597444 599490 602277 605524 608475 610493 611451 611682 611520 610950 609754 607913 605582 602598
60071F02598m278o091p572p961p312o298n547n259n321n537n744n848n746n240
$$ 602598 598320 592229 584657 576696 569384 563086 557539 552280 546959 541422 535678 529830 524084 518844
60057E18844m159k715j609j403j794j782p30R52K342L022L270L485L790M191M710
$$ 518844 514685 511970 510361 508958 507164 505382 504652 505604 507946 510968 514238 517723 521513 525704 530414
60042E30414N229N523N560N558N622N536N040M121K908J575L57n81j437k571l930
$$ 530414 535643 541166 546726 552284 557906 563442 568482 572603 575511 577086 577443 576862 575425 572854 568924
60027E68924m960n378n605o152o909p439p686p960q387q805r111r298r202q578
$$ 568924 563964 558586 552981 546829 539920 532481 524795 516835 508448 499643 490532 481234 472032 463454
60013D63454p469o258n308m679m136l323k131j004o12r64j279j020o63q82j313
$$ 463454 455985 449727 444419 439740 435604 432281 430150 429146 428534 427570 426291 425271 424608 423726 422413
59998D22413r40L60J476J523J033J221K461L894M507M237L863L967M257M070L379
$$ 422413 421473 421833 423309 424832 425865 427086 429547 433441 437948 442185 446048 450015 454272 458342 461721
59983D61721K821K707K536J840R33L19k56j398k914l836l706l189l142l558l726
$$ 461721 464542 467249 469785 471625 472558 472877 472621 471223 468309 464473 460767 457578 454436 450878 447152
59968D47152l092j778m13L58L73P1N9N51J309J937K153J891J393R97P34L54q1
$$ 447152 444060 442282 441869 442227 442600 442671 442730 443281 444590 446527 448680 450571 451964 452961 453695 454049 453968
59951D53968j36K21L28j89o76l76L74P01N00L09J11n92j604k082j903j943k619
$$ 453968 453832 454053 454381 454192 453516 453140 453514 454215 454715 455024 455135 454543 452939 450857 448954 447011 444392
59934D44392l190k935k167j518r69k07O74J460K321L456M580N231N348N164M869
$$ 444392 441202 438267 436100 434582 433613 433406 434080 435540 437861 441317 445897 451128 456476 461640 466509
59919D66509M578M270L535J959J4j072q01q3P6p2L35J312K071K249K228K337K479
$$ 466509 471087 475357 478892 480851 480865 479793 478992 478909 478985 478913 479248 480560 482631 484880 487108 489445 491924
59902D91924K550K623K677K612K548K649K691K239J375P92J033J994L191M332
$$ 491924 494474 497097 499774 502386 504934 507583 510274 512513 513888 514680 515713 517707 520898 525230
59888E25230N464O675P691P829O648M736L450L517M267M612M378M130L970L417
$$ 525230 530694 537369 545060 552889 559537 564273 567723 571240 575507 580119 584497 588627 592597 596014
59874E96014K369J410Q63J88j255l270n019n883n825n209m543m245m240l975l114
$$ 596014 598383 599793 600656 600844 599589 596319 591300 585417 579592 574383 569840 565595 561355 557380 554266
59859E54266k097j640j714j486l99J051J947K078K164L016M816P116R209J0459
$$ 554266 552169 550529 548815 547329 546930 547981 549928 552006 554170 557186 562002 569118 578327 588786
59845E88786J0570R690Q115N929L242O75q49j081o84k78K47J024J353L92j593
$$ 588786 599356 609046 617161 623090 626332 627007 626158 625077 624393 624115 624362 625386 626739 627131 625538
59830F25538l477m730n817p017p723p396o505n983o014n990n496m855m611m842
$$ 625538 622061 617331 611514 604497 596774 589378 582873 576890 570876 564886 559390 554535 549924 545082
59816E45082n137n160n025n044n152m905m079l030k249j852j731j865k076j795
$$ 545082 539945 534785 529760 524716 519564 514659 510580 507550 505301 503449 501718 499853 497777 495982
59802D95982p39L94O17l5n53l53O7N1l34o12n97m84n54r73j556j718j119k89p0
$$ 495982 495243 495637 496254 496219 495666 495313 495380 495431 495097 494485 493888 493404 492850 491877 490321 488603 487484 487195 487125
59783D87125n08r29j005r50o85J17R42N83j054k376k073p71P7K28N14J345K346
$$ 487125 486617 485688 484683 483733 483048 483165 484107 484690 483636 481260 479187 478416 478493 478721 479235 480580 482926
59766D82926L218L886M066L506K686K459L051L917M481M494L985L454L814N435
$$ 482926 486144 490030 494096 497602 500288 502747 505798 509715 514196 518690 522675 526129 529943 535378
59752E35378P368Q251P771O654N538M586M065M248M743M781M322M082M325M425
$$ 535378 542746 550997 558768 565422 570960 575546 579611 583859 588602 593383 597705 601787 606112 610537
59738F10537L881K991K171J270J25p67p60r2J88o09j970k633j890m09L97j90j585
$$ 610537 614418 617409 619580 620850 620975 620208 619448 619356 619544 618935 616965 614332 612442 612033 612430 612240 610655
59721F10655k786l427l584l178k203j244r58j090q01J1M94J40n28q34q67j016
$$ 610655 607869 604442 600858 597680 595477 594233 593275 592185 591384 591395 591889 592029 591501 590667 589800 588784
59705E88784j177r98n74l42l66k31L49J071J316Q24R0n1O04J282J110K68k77r9
$$ 588784 587607 586609 586035 585693 585327 585096 585445 586516 587832 588656 588746 588695 589299 590581 591691 591959 591682 591583
59687E91583J95n0o38j006j044j033j075j159j535k473l677m438m521m447m771
$$ 591583 591778 591728 591090 590084 589040 588007 586932 585773 584238 581765 578088 573650 569129 564682 559911
59672E59911n379n753n707n472n179m646l829l108k783k525j793p26q4j62l19
$$ 559911 554532 548779 543072 537600 532421 527775 523946 520838 518055 515530 513737 513011 512927 512765 512446
59657E12446J06Q83J401J670K138K792L128L033K950L047K865K108J122K67p07
$$ 512446 512552 513435 514836 516506 518644 521436 524564 527597 530547 533594 536459 538567 539689 539956 539249
59642E39249k103l517m245m216m021l979l743k932j776r25q76j582k438k653j918
$$ 539249 537146 533629 529384 525168 521147 517168 513425 510493 508717 507792 506916 505334 502896 500243 498325
59627D98325q92o35j397k234k150j387j068j737k769l323l282k964k477j833j292
$$ 498325 497433 496798 495401 493167 491017 489630 488562 486825 484056 480733 477451 474487 472010 470177 468885
59612D68885j007n35N99J957K554K229J881K116K448K238J723J432J185M53n22
$$ 468885 467878 467343 467942 469899 472453 474682 476563 478679 481127 483365 485088 486520 487705 488158 487636
59597D87636r45o55l34l43j59O78J656J935J511J213J498J848J466K91r45j563
$$ 487636 486691 486036 485702 485359 485200 485878 487534 489469 490980 492193 493691 495539 497005 497296 496351 494788
59581D94788j554j356j288j411j727k214k724l054l209l326l305k782j693n29
$$ 494788 493234 491878 490590 489179 487452 485238 482514 479460 476251 472925 469620 466838 465145 464616
59567D64616J69M07N07M61j12j256k273k331j387k66L11M97Q75J445J567R89L43
$$ 464616 464785 465192 465699 466160 466048 464792 462519 460188 458801 458535 458846 459343 460218 461663 463230 464219 464562
59550D64562K91O93J081J574K524L661M337M650N454P189R413J1639J3903J6246
$$ 464562 464853 465546 466627 468201 470725 474386 478723 483373 488827 496016 505429 517068 530971 547217
59536E47217J8345J9760J9896J7615J1983L941l644q342r972r660q057n350k321
$$ 547217 565562 585322 605218 622833 634816 638757 635113 626771 616799 607139 599082 593732 591411
59523E91411l5J274K158K813K857K148J118R0j145k931n214p459q954r345r064
$$ 591411 591376 592650 594808 597621 600478 602626 603744 603834 602689 599758 594544 587085 578131 568786 559722
59508E59722q955r260r288q398o855n439m583m304m480m723m432l469k427j779
$$ 559722 550767 541507 532219 523821 516966 511527 506944 502640 498160 493437 489005 485536 483109 481330
59494D81330j324p89m27l58q9O25J080O53j04k63Q8K94M35J070K046K732L200
$$ 481330 480006 479217 478790 478432 478343 478968 480048 480701 480597 480334 480422 480716 481151 482221 484267 486999 490199
59477D90199L994M934N335N322N695O405O362M999L037J499Q41J123K088K924
$$ 490199 494193 499127 504462 509784 515479 521884 528246 533245 536282 537781 538622 539745 541833 544757
59463E44757K889K344K236K593K609K294K744M350O004O650O590O633O856O951
$$ 544757 547646 549990 552226 554819 557428 559722 562466 566816 572820 579470 586060 592693 599549 606500
59449F06500O959O948O555N523M135K608N92k114m880o886q044q770r180r018
$$ 606500 613459 620407 626962 632485 636620 639228 639820 637706 632826 625940 617896 609126 599946 590928
59435E90928q204o995n739m628l593k372r56J86O73R19J689L163M956O938R219
$$ 590928 582724 575729 569990 565362 561769 559397 558441 558627 559300 560219 561908 565071 570027 576965 586184
59420E86184J1478J3175J4478J6009J7692J8814J9326K0061K1449K2958K3834
$$ 586184 597662 610837 625315 641324 659016 677830 697156 717217 738666 761624 785458
59409G85458K3143J9157J0521j211j1703j7580j9008j7804j4565r019k079M215
$$ 785458 808601 827758 838279 837068 825365 807785 788777 770973 756408 747389 745310 749525
59397G49525Q365R660P383J345o857j4456j9589k2035k2173k0317j7115j3561
$$ 749525 757890 767550 774933 776278 769421 754965 735376 713341 691168 670851 653736 640175
59385F40175j0302p510n380m092l278k243r06J53N80O99R31J302J653J964K216
$$ 640175 629873 622363 616983 612891 609613 607370 606464 606617 607197 607896 608827 610129 611782 613746 615962
59370F15962K218J788J010K85O0M14R46J290J624K331L228L762L954M397N254
$$ 615962 618180 619968 620978 621263 621323 621737 622683 623973 625597 627928 631156 634918 638872 643269 648523
59355F48523O036O659P790R624J1279J2103J2714J3877J5073J5294J4748J4560
$$ 648523 654559 661218 669008 678632 689911 702014 714728 728605 743678 758972 773720 788280
59343G88280J5016J5173J4262J2480J0314P872N143K290n80l494o354q887j0937
$$ 788280 803296 818469 832731 845211 855525 863397 868540 870830 870250 866756 860402 851515 840578
59330H40578j2531j3709j4539j5204j5718j5803j5257j4287j3194j2070j1039
$$ 840578 828047 814338 799799 784595 768877 753074 737817 723530 710336 698266 687227
59319F87227j0428j0216r780q663p318o529o357o230n813n226m557l747k850j975
$$ 687227 676799 666583 656803 648140 640822 634293 627936 621706 615893 610667 606110 602363 599513 597538
59305E97538j045M5J248K672M798P863J1258J3959J5220J4555J1464N945r08p390
$$ 597538 596493 596538 597786 600458 605256 613119 624377 638336 653556 668111 679575 685520 684612 677222
59291F77222j2240j4990j5722j5004j3716j2296j0393p685m737k413q37M35J534
$$ 677222 664982 649992 634270 619266 605550 593254 582861 575176 570439 568026 567189 567624 569158
59278E69158K383L325M850O737Q291R441J0806J2604J4153J4715J4217J3040J1559
$$ 569158 571541 574866 579716 586453 594744 604185 614991 627595 641748 656463 670680 683720 695279
59265F95279J0073Q803P679O378M599K243n36l278n389o681p501q201q661q644
$$ 695279 705352 714155 721834 728212 732811 735054 734518 731240 725851 719170 711669 703468 694807 686163
59251F86163q234p621o801n791m769l712k327p05N90J442K528M206N777O575P060
$$ 686163 677929 670308 663507 657716 652947 649235 646908 646203 646793 648235 650763 654969 660746 667321 674381
59236F74381P906Q683Q511P599O925O638N885M188J941l89k655m627o159p713
$$ 674381 682287 690970 699481 707080 714005 720643 726528 730716 732657 732268 729613 724986 718827 711114
59222G11114r816j1961j2997j2699j2007j1595j1084r988q579p414o639o119n779
$$ 711114 701298 689337 676340 663641 651634 640039 628955 618967 610388 602974 596335 590216 584437
59209E84437n482m982m200l306k419j583r17m71j21J16n7o27r10l86N94J464K306
$$ 584437 578955 573973 569773 566467 564048 562465 561548 561077 560956 561072 561015 560388 559478 559092 559686 561150 563456
59192E63456L291L853L424K609K477L005L403L619M251N064N129M475M183M564
$$ 563456 566747 570600 574024 576633 579110 582115 585518 589137 593388 598452 603581 608056 612239 616803
59178F16803M662L995L379L462L672L390L023L104L286L144L178M115N667O775
$$ 616803 621465 625460 628839 632301 635973 639363 642386 645490 648776 651920 655098 659213 664880 671655
59164F71655O753N659L967K322J191L42r46k894m914o479p656q562r008r137r587
$$ 671655 678408 684067 688034 690356 691547 691889 690943 688049 683135 676656 669000 660438 651430 642293 632706
59149F32706j0473j0941j0298r097q412q489q643q225p195n967n028m556m222
$$ 632706 622233 611292 600994 591897 583485 574996 566353 558128 550933 544966 539938 535382 531160
59136E31160l663l099k950k972k460j452p50n30Q8J574L029L437L085L039L749
$$ 531160 527497 524398 521448 518476 516016 514564 513814 513284 513372 514946 517975 521412 524497 527536 531285
59121E31285M909O219P517Q563R315J0126J1179J2075J2437J2482J2536J2425
$$ 531285 536194 542413 549930 558493 567808 577934 589113 601188 613625 626107 638643 651068
59109F51068J1901J1142J0385R557Q756Q478Q699Q386O812M804L667L213K080
$$ 651068 662969 674111 684496 694053 702809 711287 719986 728372 735184 739988 743655 746868 748948
59096G48948j50k260l062k767k287k016j802j614j613j768j860j843j917k287
$$ 748948 748798 746538 743476 740709 738422 736406 734604 732990 731377 729609 727749 725906 723989 721702
59082G21702l000m063n500p200q750r669r921r976j0150j0077r209p758o642o423
$$ 721702 718702 714639 709139 701939 693189 683520 673599 663623 653473 643396 634187 626429 619787 613364
59068F13364o683o646o039n189m515m177m026l836l629l675l939l735k463o52
$$ 613364 606681 600035 593996 588807 584292 580115 576089 572253 568624 564949 561010 557275 554812 554160
59054E54160L63o5j239k103k346k242j972j513r58n08l03l77o20p55n67k06J7
$$ 554160 554523 554458 553219 551116 548770 546528 544556 543043 542085 541577 541274 540897 540277 539522 538955 538749 538766
59037E38766K8o9k23j88O45K450M212M693M171M223N640P537Q876R848J1114J2567
$$ 538766 538794 538725 538502 538314 538959 541409 545621 550314 554485 558708 564348 571885 580761 590609 601723 614290
59021F14290J3648J4291J4730J4793J4090J2627J0642Q087M865J382j582l525
$$ 614290 627938 642229 656959 671752 685842 698469 709111 717198 722063 723445 721863 718338
59009G18338m431m523m118l534k889k072r74M12K088L883N278N851N849N722N271
$$ 718338 713907 709384 705266 701732 698843 696771 695797 696209 698297 702180 707458 713309 719158 724880 730151
58994G30151M010K285J068M59n13k234l753m263m389n140o391p262p400o987n998
$$ 730151 734161 736446 737514 737973 737460 735226 731473 727210 722821 717681 711290 704028 696628 689641 683643
58979F83643m348k502j123k52N63J551K647L864N206O465P518Q518R450R926R820
$$ 683643 679295 676793 675670 675418 675981 677532 680179 684043 689249 695714 703232 711750 721200 731126 740946
58964G40946R635R728R666Q917P731O711N870M720K990O96k160n398q472j0919
$$ 740946 750581 760309 769975 778892 786623 793334 799204 803924 806914 807610 805450 800052 791580 780661
58950G80661j2775j4153j4807j4582j3858j3056j2177j1227j0570j0272r629q055
$$ 780661 767886 753733 738926 724344 710486 697430 685253 674026 663456 653184 643555 635500
58938F35500n981m242l005k006j320j119j086q92q76j435k072j996j382j138j543
$$ 635500 629519 625277 622272 620266 618946 617827 616741 615849 614973 613538 611466 609470 608088 606950 605407
58923F05407k081k436k729k804k288j524j422k134k684k297j415q33m39N26K210
$$ 605407 603326 600890 598161 595357 593069 591545 590123 587989 585305 583008 581593 580760 580321 580847 583057
58908E83057L807M574M783N348O653Q167R321J0332J1733J3291J4164J4085J3646
$$ 583057 586864 591438 596221 601569 608222 616389 625710 636042 647775 661066 675230 689315 702961
58895G02961J3289J2751J1945J1544J2171J3551J5034J6372J7501J8126J8174
$$ 702961 716250 729001 740946 752490 764661 778212 793246 809618 827119 845245 863419
58884H63419J8141J8227J7563J5126J1150O884L184K8k807n339p663r997j2324
$$ 863419 881560 899787 917350 932476 943626 950510 953694 953722 950915 945576 937913 927916 915592
58871I15592j4345j5767j6301j5627j3760j1326r153p682o945o783o870o906p041
$$ 915592 901247 885480 869179 853552 839792 828466 819313 811631 804686 797903 791033 784127 777086
58858G77086p760r081j0350j1059j1306j1243j0702r794r101q836q453p627o834
$$ 777086 769326 760245 749895 738836 727530 716287 705585 695791 686690 677854 669401 661774 654940
58845F54940o446o073n473n286n987o881p101o897p001p325p282o873o380n548
$$ 654940 648494 642421 636948 631662 625675 618794 611693 604796 597795 590470 583188 576315 569935 564387
58831E64387m129k786k294k258j781j025q33j060o61N57J603J887J968K412K914
$$ 564387 560258 557472 555178 552920 551139 550114 549281 548221 547560 548117 549720 551607 553575 555987 558901
58816E58901K963K662K446K517K747K830K501J926J705K092K453K023R20j17p16
$$ 558901 561864 564526 566972 569489 572236 575066 577567 579493 581198 583290 585743 587766 588686 588569 587853
58801E87853j021j236j579k342l435m218m345m279m435m464m093l826l934l532
$$ 587853 586832 585596 584017 581675 578240 574022 569677 565398 560963 556499 552406 548580 544646 541114
58787E41114j841K71J326J337J571K551L675M476M978M949M117L122K888L110
$$ 541114 539273 539544 540870 542207 543778 546329 550004 554480 559458 564407 568524 571646 574534 577644
58773E77644K563R07j013k582l883m714m589l866l649m267m891m879m402l680
$$ 577644 580207 581114 580101 577519 573636 568922 564333 560467 556818 552551 547660 542781 538379 534699
58759E34699k639j548q80m09N53J848K580K606K753L336L676L374K927K765K711
$$ 534699 532060 530512 529632 529223 529776 531624 534204 536810 539563 542899 546575 549949 552876 555641 558352
58744E58352K800L456M500N053M932N086O095P217P491P038O663O753P125P424
$$ 558352 561152 564608 569108 574161 579093 584179 590274 597491 604982 612020 618683 625436 632561 639985
58730F39985P359O912O508O480O487O022N291M861M633M189L956M805O505P797
$$ 639985 647344 654256 660764 667244 673731 679753 685044 689905 694538 698727 702683 707488 713993 721790
58716G21790Q165Q346Q827R099Q798Q385Q085P147M793J264k568n966q544j0396
$$ 721790 729955 738301 747128 756227 765025 773410 781495 788642 793435 794699 792131 786165 777621 767225
58702G67225j2228j4608j7004j8371j8674j8862j9267j9155j8050j6407j4677
$$ 767225 754997 740389 723385 705014 686340 667478 648211 629056 611006 594599 579922
58691E79922j2796j0883r439q511p570o509n812n557n256m876m883n099m662l465
$$ 579922 567126 556243 546804 538293 530723 524214 518402 512845 507589 502713 497830 492731 488069 484604
58677D84604k463k140j844j045j41M48R56J635K379L351M938O806Q068Q685R498
$$ 484604 482141 480001 478157 477112 476971 477419 478375 480010 482389 485740 490678 497484 505552 514237 523735
58662E23735J0581J0840R663P656N379K692j37k132l142m243n935p217p257o679
$$ 523735 534316 545156 554819 562475 567854 570546 570409 568277 565135 560892 554957 547740 540483 533804
58648E33804o289n812m842l919l565l328k716k167k057j706m44J149K073K305
$$ 533804 527515 521703 516861 512942 509377 506049 503333 501166 499109 497403 496959 498108 500181 502486
58634E02486K467K753L029L310L405K727J212k79j112j627k096j866m23J436K454
$$ 502486 504953 507706 510735 514045 517450 520177 521389 521110 519998 518371 516275 514409 513986 515422 517876
58619E17876K439K171K266K791L555M313M970N754O694O998N919M185L298L346
$$ 517876 520315 522486 524752 527543 531098 535411 540381 546135 552829 559827 565746 569931 573229 576575
58605E76575K883J377J10Q1N11K88m94j362k462l743m383m009l389k965j934J73
$$ 576575 579458 580835 580945 581026 581537 581825 581331 579969 577507 573764 569381 565372 561983 559018 557084 557257
58589E57257K318L496M288N663P291Q368R064R877J0447J0298R961J0046R976
$$ 557257 559575 563071 567359 573022 580313 588681 597745 607622 618069 628367 638328 648374 658350
58576F58350Q891P202O069N865O255P127Q480R903J1218J3078J6057J9665K3049
$$ 658350 667241 674443 680512 686377 692632 699759 708239 718142 729360 742438 758495 778160 801209
58563H01209K5965K8405K9983L0497L0273K9287K6838K2754J7936J3017P616J719
$$ 801209 827174 855579 885562 916059 946332 975619 1002457 1025211 1043147 1056164 1063780 1065499
58551A065499l434o829q869j0166j0410r514q600q629r187r789j1149j3847j6936
$$ 1065499 1062065 1055236 1046367 1036201 1025791 1016277 1007677 999048 989861 980072 968923 955076 938140
58538I38140j9279k1136k3068k4399k4238k3012k1462j9258j6078j2996j1095
$$ 938140 918861 897725 874657 850258 826020 803008 781546 762288 746210 733214 722119
58527G22119r704p651n331l868l134k371j863k122k288j303l2j67j562k582k673
$$ 722119 712415 704764 699433 695565 692431 690060 688197 686075 683787 682484 682452 682285 680723 678141 675468
58512F75468k636k616j942q79o79j634k664l025l047l104l037k747k350j745r09
$$ 675468 672832 670216 668274 667395 666716 665082 662418 659393 656346 653242 650205 647458 645108 643363 642454
58497F42454l53m46o99n34k64k48J19J525L425M830N716O549P175P405P995R652
$$ 642454 642101 641655 640956 640422 640158 639910 640029 641554 644979 649809 655525 662074 669249 676654 684649 694301
58481F94301J1743J3325J4720J6657J8588J9294J8616J7142J4763J0991O276J666
$$ 694301 706044 719369 734089 750746 769334 788628 807244 824386 839149 850140 856416 858082
58469H58082k417n938q467r777j0454j0812j0131q112n933m419k499Q98M684P237
$$ 858082 855665 849727 841260 831483 821029 810217 800086 791974 786041 781622 779123 780021 784705 791942
58455G91942R027J1467J4084J5069J3994J1854R037N297J311j831m315p000r533
$$ 791942 800969 812436 826520 841589 855583 867437 876474 881771 883082 881251 876936 869936 860403
58442H60403j0811j0906j0676j0065q532o602n219m119k557q90K81J657M011O324
$$ 860403 849592 838686 828010 817945 809413 802811 797592 793473 790916 790026 790307 791964 795975 802299
58428H02299P278P646Q987J0853J1703J1741J2253J2783J1617Q718N548K399j518
$$ 802299 809577 817223 826210 837063 848766 860507 872760 885543 897160 905878 911426 913825 912307
58415I12307n611q244r424j0644j2036j2221j1030r885r319q432o967n740m833
$$ 912307 906696 898452 889028 878384 866348 854127 843097 833212 823893 815461 808494 802754 797921
58402G97921l450j661l16O88K134L668M273M265M796N669N721N042M578M026K366
$$ 797921 794471 792810 792494 793182 795316 798984 803257 807522 812318 817987 823708 828750 833328 837354 839720
58387H39720N6j476k111k613k600j322K62O75M15P39R23k87j531m78K078L314
$$ 839720 839776 838300 836189 833576 830976 829654 829916 830591 831006 831745 832668 832381 830850 830372 832450 835764
58371H35764L029L580N456O715O932P962J0329J2401J3562J4881J6243J6190J5070
$$ 835764 838793 842373 847829 854544 861476 869438 879767 892168 905730 920611 936854 953044 968114
58358I68114J4954J5915J5705J3640J1460R885P676M730K721K021J277N63J546
$$ 968114 983068 998983 1014688 1028328 1039788 1049673 1057349 1062079 1064800 1066821 1068098 1068661 1070207
58345A070207L877M945M083L586M836O714Q568J1245J4328J5858J5764J6232J7847
$$ 1070207 1074084 1079029 1083112 1086698 1091534 1098248 1106816 1118061 1132389 1148247 1164011 1180243 1198090
58332A198090J8766J8372J8194J8428J7280J4675J2826J2113J0224O524L402K075
$$ 1198090 1216856 1235228 1253422 1271850 1289130 1303805 1316631 1328744 1338968 1345492 1348894 1350969
58320A350969R09p25q43J294L419M015M454N894P463Q850J1230J4368J6190J6440
$$ 1350969 1351878 1351153 1350310 1351604 1355023 1359038 1363492 1369386 1376849 1385699 1396929 1411297 1427487 1443927
58306A443927J7257J9199K0396K0510K1496K3421K3757K2013K0688K0520J9321
$$ 1443927 1461184 1480383 1500779 1521289 1542785 1566206 1589963 1611976 1632664 1653184 1672505
58295A672505J6802J5768J6957J7540J6521J6669J9115K0999K0834K1270K4001
$$ 1672505 1689307 1705075 1722032 1739572 1756093 1772762 1791877 1812876 1833710 1854980 1878981
58284A878981K6634K7259K7565K8804K9197K8004K7775K9958L2602L4812L9001
$$ 1878981 1905615 1932874 1960439 1989243 2018440 2046444 2074219 2104177 2136779 2171591 2210592
58273B210592M6146N3206N7808O1164O4197O5367O4590O4567O6061O6700O6300
$$ 2210592 2256738 2309944 2367752 2428916 2493113 2558480 2623070 2687637 2753698 2820398 2886698
58262B886698O7990P1997P4096P2557P0885P1323P1680P1002P2043P5384P7576
$$ 2886698 2954688 3026685 3100781 3173338 3244223 3315546 3387226 3458228 3530271 3605655 3683231
58251C683231P7868Q0178Q5732R0695R3925R9535J08718J16819J21987J28605
$$ 3683231 3761099 3841277 3927009 4017704 4111629 4211164 4319882 4436701 4558688 4687293
58241D687293J38469J47009J52337J59347J70425J80926J88548J98022K11687
$$ 4687293 4825762 4972771 5125108 5284455 5454880 5635806 5824354 6022376 6234063
58232F234063K24893K35825K50006K69566K88426L03955L22619L47918L73922
$$ 6234063 6458956 6694781 6944787 7214353 7502779 7806734 8129353 8477271 8851193
58223H851193L97481M24995M60064M96756N32674N75627O29262O85976P42824
$$ 8851193 9248674 9673669 10133733 10630489 11163163 11738790 12368052 13054028 13796852
58214A3796852Q09777Q92723R84135J081168J196248J338301J501422J685118
$$ 13796852 14606629 15499352 16483487 17564655 18760903 20099204 21600626 23285744
58206B3285744J906955K181408K506909K889367L356762L934138M628491N455845
$$ 23285744 25192699 27374107 29881016 32770383 36127145 40061283 44689774 50145619
58198E0145619O455640P660575R088998J0794180J2886045J5481735J8679805
$$ 50145619 56601259 64261834 73350832 84145012 97031057 112512792 131192597
58191A31192597K2580928K7184069L2108803L6462268L9128396L9205174L6100717
$$ 131192597 153773525 180957594 213066397 249528665 288657061 327862235 363962952
58184C63962952K9378834J8940532N620936q570643k1168461l0415787l5832732
$$ 363962952 393341786 412282318 417903254 409332611 388164150 357748363 321915631
58177C21915631l7877292l7319140l4923403l1410898k7413562k3393415j9639581
$$ 321915631 284038339 246719199 211795796 180384898 152971336 129577921 109938340
58170A09938340j6321390j3507206j1170424r241284p663044o389690n361429
$$ 109938340 93616950 80109744 68939320 59698036 52034992 45645302 40283873
58163D0283873m518326l826159l264991k805807k419521k095634j831282j612559
$$ 40283873 35765547 31939388 28674397 25868590 23449069 21353435 19522153 17909594
58155A7909594j423746j263372j134004j026170r27689q39036p64765o98986o33431
$$ 17909594 16485848 15222476 14088472 13062302 12134613 11295577 10530812 9831826 9198395
58146I198395n71314n19630m75289m31368l89753l55609l26244k96913k71180
$$ 9198395 8627081 8107451 7632162 7200794 6811041 6455432 6129188 5832275 5561095
58137E561095k54502k43441k31475k19642k11609k04029j91792j77560j66714
$$ 5561095 5306593 5063152 4831677 4612035 4400426 4196397 4004605 3827045 3660331
58128C660331j57615j45877j33486j24866j18259j09549j00545r5300r2064q6627
$$ 3660331 3502716 3356839 3223353 3098487 2980228 2870679 2770134 2674834 2582770 2496143
58118B496143q0029p5602p2099o6869o2115o1016o1200n8836n5626n5062n5422
$$ 2496143 2416114 2340512 2268413 2201544 2139429 2078413 2017213 1958377 1902751 1847689 1792267
58107A792267n3156m9760m8426m7340m3078l7582l4915l3844l0330k4806k0611
$$ 1792267 1739111 1689351 1640925 1593585 1550507 1512925 1478010 1444166 1413836 1389030 1368419
58096A368419j7553j3490j0100j0781j4509j7627j9910k3343k6780k7586k6838
$$ 1368419 1350866 1337376 1327276 1316495 1301986 1284359 1264449 1241106 1214326 1186740 1159902
58085A159902k7446k8495k6950k3534k1713k1945k1870k1109k1103k1363k0353
$$ 1159902 1132456 1103961 1077011 1053477 1031764 1009819 987949 966840 945737 924374 904021
58074I04021j9074j9508k0681k0264j8751j8111j7825j6255j4306j3703j3195
$$ 904021 884947 865439 844758 824494 805743 787632 769807 753552 739246 725543 712348
58063G12348j0604p123n505n520n165m757n810p404p821q194j0399j2850j2675
$$ 712348 701744 694621 689116 683596 678431 673674 667864 660460 652639 644445 634046 621196 608521
58050F08521j0642r662r673q393o028m889n133m987m449m830n527n070m494n752
$$ 608521 597879 588217 578544 570151 564123 559234 554101 549114 544665 539835 534308 529238 524744 518992
58036E18992p715p696o076n500o221o268n611o140p814q669q383q345q499p564
$$ 518992 511277 503581 497505 492005 485784 479516 473905 467765 459951 451282 442899 434554 426055 418491
58022D18491n970n293n244m463l602m290n668n461l852k879k643j652k96k84j101
$$ 418491 412521 407228 401984 397521 393919 389629 383961 378500 374648 371769 369126 367474 367178 366894 365793
58007C65793p06O20P93m4K52J760K433K014K300L406L376J852O87M27m87k681
$$ 365793 365087 365707 366500 366456 366708 368468 370901 372915 375215 378621 381997 383849 384536 384963 384476 381795
57991C81795m995o992r327j1381j1528r983q484p170m821k099j202k071k307j219
$$ 381795 376800 369808 360481 349100 337572 327589 319105 311935 307114 305015 303813 301742 299435 298216
57977B98216o66j405j907j467j280j702j439l38N2n85o67J88M07k99M4K172L885
$$ 298216 297550 296145 294238 292771 291491 289789 288350 288012 288064 287479 286812 287000 287407 287108 287152 289324 293209
57960B93209L328J540L30k29q56j435j663j752j606p62K65K13r43j865j982j935
$$ 293209 296537 298077 298407 298178 297322 295887 294224 292472 290866 290104 290369 290582 289639 287774 285792 283857
57944B83857j695l92J663K884K847K900L832M894N534O157O808P003P108P898
$$ 283857 282162 281770 283433 286317 289164 292064 295896 300790 306324 312481 319289 326292 333400 341298
57930C41298Q597P580N165L362K504P36k570n467o455o506p004p770q223q576
$$ 341298 349895 357475 362640 366002 368506 369242 366672 361205 354750 348244 341240 333470 325247 316671
57916C16671q804q102o334m611l600k736j597n89J78J126J968J930J387J545K322
$$ 316671 307867 299765 293431 288820 285220 282484 280887 280298 280476 281602 283570 285500 286887 288432 290754
57901B90754K424J749J593K244K496J951J604J689J275N07Q77K548L760L652L448
$$ 290754 293178 294927 296520 298764 301260 303211 304815 306504 307779 308286 309163 311711 315471 319123 322571
57886C22571L897L876K587J015L7r30k306l323l648m166n193n731n405n192n361
$$ 322571 326468 330344 332931 333946 333983 333053 330747 327424 323776 319610 314417 308686 303281 298089 292728
57871B92728m782l230k227k409k274q16O59Q39N33R15J514J637K092L718N615
$$ 292728 287946 284716 282489 280080 277806 276990 277649 278488 279021 279936 281450 283087 285179 288897 294512
57856B94512O465O486O594O762O559O244O127N833N187M626M037K597M82q72j109
$$ 294512 300977 307463 314057 320819 327378 333622 339749 345582 350769 355395 359432 362029 362511 361639 360530
57841C60530j693l360m772m925m847n381n367l853k300k438l431l376k400k029
$$ 360530 358837 355477 350705 345780 340933 335552 330185 326332 324032 321594 318163 314787 312387 310358
57827C10358k398k263j316m97k83k38q9N1K65O33P80M60N4j69n71j362k258l367
$$ 310358 307960 305697 304381 303884 303601 303363 303274 303325 303590 304223 305003 305463 305517 305348 304777 303415 301157 297790
57809B97790n228p353q239p598p013p389p512o357n058m895n035m087k546j761
$$ 297790 292562 285209 276970 269372 262359 254970 247458 241101 236043 231148 226113 222026 219480 217719
57795B17719j576r97k03L3O9O95J425J312P74Q70J420J682K129L684N678O592
$$ 217719 216143 215146 214943 214976 215045 215740 217165 218477 219251 220121 221541 223223 225352 229036 234714 241306
57779B41306O502O863Q019Q801Q630Q268Q267Q161P465O262M653K715R63j39j031
$$ 241306 247808 254671 262690 271491 280121 288389 296656 304817 312282 318544 323197 325912 326875 326736 325705
57764C25705k406l921m665m663m858n632o438o811o758o286n411m519l945l371
$$ 325705 323299 319378 314713 310050 305192 299560 293122 286311 279553 273267 267856 263337 259392 256021
57750B56021k428j514j215j319j289j198j276j020J12J500J983J435P10L09J46
$$ 256021 253593 252079 250864 249545 248256 247058 245782 244762 244874 246374 248357 249792 250502 250811 250957
57735B50957L15R99J730J732R94K70J44P04J793K902L281K860K493K646K544J567
$$ 250957 251272 252271 254001 255733 256727 256997 257141 257845 259638 262540 265821 268681 271174 273820 276364 277931
57719B77931O02P71J476J200j55j208j217q70r65j494k208l033l781m234m569
$$ 277931 278533 279304 280780 281980 281825 280617 279400 278530 277565 276071 273863 270830 267049 262815 258246
57704B58246n024n275m894m204l895l985l923l486k905k314j809j682j954k018
$$ 258246 253222 247947 243053 238849 234954 230969 227046 223560 220655 218341 216532 214850 212896 210878
57690B10878j481q71p97r75q83p80j042j171n25N24J283K171M067O667Q810J0311
$$ 210878 209397 208526 207729 206754 205871 205091 204049 202878 202353 202877 204160 206331 210398 217065 225875 236186
57674B36186J2168J5039J8657K2888K8257L5189M3437N2110N9523O3161O0696
$$ 236186 248354 263393 282050 304938 333195 368384 411821 463931 523454 586615 647311
57663F47311N1094L4624J2647j1689l3566m8957n6995n9147n6748n0652m2595
$$ 647311 698405 733029 745676 733987 700421 651464 594469 535322 478574 427922 385327
57652C85327l4910k8673k3404j8713j4974j2329j0327q741p674o722n159l134
$$ 385327 350417 321744 298340 279627 264653 252324 241997 233256 225582 218860 213701 210567
57640B10567j601r50o78m65n48q39p77k45K32M33P07J144J269Q40K07k80n98p94
$$ 210567 208966 208016 207338 206873 206325 205486 204709 204464 204696 205129 205836 206980 208249 209089 209296 209016 208418 207624
57622B07624r31j252j771j964j505r35q87j082r82r33j543k367k462j945j688
$$ 207624 206693 205441 203670 201706 200201 199266 198379 197297 196315 195382 193839 191472 189010 187065 185377
57607A85377j682j103L3P12N18J25j5k20o38r57j193j674k073j676p79n35j187
$$ 185377 183695 182592 182625 183337 183855 183980 183965 183745 183107 182150 180957 179283 177210 175534 174755 174220 173033
57590A73033j674j352r06j048j447j495j216q92n26j24J25K38L45J87n23j305
$$ 173033 171359 170007 169101 168053 166606 165111 163895 163003 162477 162353 162478 162716 163061 163248 162725 161420
57574A61420j374r54j032j800k417k435k291k170j638o88m4J5O2M32P38Q36J110
$$ 161420 160046 159092 158060 156260 153843 151408 149117 146947 145309 144621 144577 144592 144654 145086 145824 146660 147770
57557A47770J505J400Q69R18J929L019L484L736M151M125L159J869J015L92m82
$$ 147770 149275 150675 151544 152462 154391 157410 160894 164630 168781 172906 176065 177934 178949 179341 178859
57542A78859j232j196n75j93l66o84o84l22M6o1o71j014l29R92J793J699J401
$$ 178859 177627 176431 175856 175663 175297 174613 173929 173607 173653 173592 172921 171907 171578 172570 174363 176062 177463
57525A77463J337J097M36j10q7L16R40J988L248L894L608L131L133L320L111K477
$$ 177463 178800 179897 180333 180223 180136 180452 181392 183380 186628 190522 194130 197261 200394 203714 206825 209302
57509B09302J652P82K28M01R32R07K80Q0O96J101M28o97j241j248j353j586j538
$$ 209302 210954 211736 211964 212365 213297 214204 214484 214564 215260 216361 216789 216092 214851 213603 212250 210664 209126
57492B09126j131m41O34J782K063J059k94q10m54K3K53L41L34L77Q43J679K153
$$ 209126 207995 207554 208188 209970 212033 213092 212798 211988 211534 211557 211810 212151 212485 212862 213705 215384 217537
57475B17537J856J336J140R07K64k20J49R49J304J250J412J749J698J332J278
$$ 217537 219393 220729 221869 222776 223040 222820 222969 223918 225222 226472 227884 229633 231331 232663 233941
57460B33941J562J522R05K52O5K88O83J156J634K066K511K945L075K787K521K760
$$ 233941 235503 237025 237930 238182 238247 238535 239218 240374 242008 244074 246585 249530 252605 255392 257913 260673
57444B60673L307L545L245K702K267K113K322K713K812K400J948K075K691L026
$$ 260673 263980 267525 270770 273472 275739 277852 280174 282887 285699 288099 290047 292122 294813 297839
57430B97839K506J376M65N01J488K638L085K751K296K241K526K856L007K772K179
$$ 297839 300345 301721 302186 302687 304175 306813 309898 312649 314945 317186 319712 322568 325575 328347 330526
57415C30526J850K503L909M975N006M376L747L411L534M287N321N818N420M528
$$ 330526 332376 334879 338788 343763 348769 353145 356892 360303 363837 368124 373445 379263 384683 389211
57401C89211L506K353J372J233J936K641K955L458M494N390N559N425N539N741
$$ 389211 392717 395070 396442 397675 399611 402252 405207 408665 413159 418549 424108 429533 435072 440813
57387D40813N930O684Q176R341R221Q402Q040Q096P697O710N841N473N423N576
$$ 440813 446743 453427 461603 470944 480165 488567 496607 504703 512400 519110 524951 530424 535847 541423
57373E41423N811N701N086M581M719N081N136N317O180P065O894N914N356N518
$$ 541423 547234 552935 558021 562602 567321 572402 577538 582855 589035 596100 602994 608908 614264 619782
57359F19782N575N224N150N697O289O456O422O383O170N916O179P002P593P394
$$ 619782 625357 630581 635731 641428 647717 654173 660595 666978 673148 679064 685243 692245 699838 707232
57345G07232O819O564O753P127P565Q019Q296Q224P837P299O789O487O507O827
$$ 707232 714051 720615 727368 734495 742060 750079 758375 766599 774436 781735 788524 795011 801518 808345
57331H08345P441Q319R021Q817P630O530O633P783Q880R300R344R423R596R889
$$ 808345 815786 824105 833126 841943 849573 856103 862736 870519 879399 888699 898043 907466 917062 926951
57317I26951J0393J0866J0856J0380J0111J0625J1678J2418J2245J1480J1093
$$ 926951 937344 948210 959066 969446 979557 990182 1001860 1014278 1026523 1038003 1049096
57306A049096J1657J2597J2898J2507J2387J3080J4014J4619J5273J6518J7926
$$ 1049096 1060753 1073350 1086248 1098755 1111142 1124222 1138236 1152855 1168128 1184646 1202572
57295A202572J8585J8295J7564J6851J6483J6849J7969J9197J9956K0373K0663
$$ 1202572 1221157 1239452 1257016 1273867 1290350 1307199 1325168 1344365 1364321 1384694 1405357
57284A405357K0517J9871J9611K0529K2056K3061K3409K3711K3990K3807K3441
$$ 1405357 1425874 1445745 1465356 1485885 1507941 1531002 1554411 1578122 1602112 1625919 1649360
57273A649360K3600K4095K4018K3361K3191K3967K4802K4785K4201K3963K4552
$$ 1649360 1672960 1697055 1721073 1744434 1767625 1791592 1816394 1841179 1865380 1889343 1913895
57262A913895K5822K7363K8698K9538K9985L0272L0425L0488L0763L1322L1693
$$ 1913895 1939717 1967080 1995778 2025316 2055301 2085573 2115998 2146486 2177249 2208571 2240264
57251B240264L1621L1688L2410L3203L3200L2730L2876L3876L5012L5834L6363
$$ 2240264 2271885 2303573 2335983 2369186 2402386 2435116 2467992 2501868 2536880 2572714 2609077
57240B609077L6355L5635L5130L6098L8258M0019M0829M1859M3971M6337M7833
$$ 2609077 2645432 2681067 2716197 2752295 2790553 2830572 2871401 2913260 2957231 3003568 3051401
57229C051401M8588M9377N0351N1228N2098N3239N4552N5700N6521N6964N7010
$$ 3051401 3099989 3149366 3199717 3250945 3303043 3356282 3410834 3466534 3523055 3580019 3637029
57218C637029N6817N6503N5762N4327N2871N2684N4250N6860N9762O2874O6077
$$ 3637029 3693846 3750349 3806111 3860438 3913309 3965993 4020243 4077103 4136865 4199739 4265816
57207D265816O8646O9876O9744O8676O7171O5729O4473O2791O0002N6423N3013
$$ 4265816 4334462 4404338 4474082 4542758 4609929 4675658 4740131 4802922 4862924 4919347 4972360
57196D972360N0043M7075M4257M2385M1520M0711L9442L8187L7185L5886L4119
$$ 4972360 5022403 5069478 5113735 5156120 5197640 5238351 5277793 5315980 5353165 5389051 5423170
57185E423170L2468L0885K8282K4418K0819J8802J7691J6293J4999J4932J5799
$$ 5423170 5455638 5486523 5514805 5539223 5560042 5578844 5596535 5612828 5627827 5642759 5658558
57174E658558J6260J6038J6089J6769J7250J6893J6043J5253J4668J4388J4589
$$ 5658558 5674818 5690856 5706945 5723714 5740964 5757857 5773900 5789153 5803821 5818209 5832798
57163E832798J5053J5249J5014J4572J3785J2035R034N214J193k698o306r599
$$ 5832798 5847851 5863100 5878114 5892686 5906471 5918506 5927540 5932754 5933947 5931249 5924943 5915344
57151E915344j2803j6168j9485k2332k4754k7166k9454l0777l0548k9230k7825
$$ 5915344 5902541 5886373 5866888 5844556 5819802 5792636 5763182 5732405 5701857 5672627 5644802
57140E644802k6898k6300k5484k3765k0593j6107j1406p762n579m552m975q198
$$ 5644802 5617904 5591604 5566120 5542355 5521762 5505655 5494249 5486487 5480908 5476356 5471381 5463183
57128E463183j5002k3716l0854l4144l4525l4758l6377l8523l9387l8042l4753
$$ 5463183 5448181 5424465 5393611 5359467 5324942 5290184 5253807 5215284 5175897 5137855 5103102
57117E103102l0265k5322k0674j7089j5087j4517j4281j2676q264o01R976K3170
$$ 5103102 5072837 5047515 5026841 5009752 4994665 4980148 4965867 4953191 4944927 4944326 4954302 4977472
57105D977472L9262N8962Q3072J12488J48605J93775K51263L24593M17016N31556
$$ 4977472 5016734 5075696 5158768 5271256 5419861 5613636 5864899 6189492 6606508 7138064
57095G138064O71010Q37232J030548J250350J495504J762755K044519K328927
$$ 7138064 7809074 8646306 9676854 10927204 12422708 14185463 16229982 18558909
57087A8558909K601412K844733L038443L161640L196839L127824K933359K590445
$$ 18558909 21160321 24005054 27043497 30205137 33401976 36529800 39463159 42053604
57079D2053604K093141J470501P82256R4033n45063j107605j582237j968626k273705
$$ 42053604 44146745 45617246 46399502 46493535 45948472 44840867 43258630 41290004 39016299
57070C9016299k505631k668473k762450k787698k746682k644983k492346k302687
$$ 39016299 36510668 33842195 31079745 28292047 25545365 22900382 20408036 18105349
57062A8105349k091240j871191j652919j444616j251964j077810r23431p89614
$$ 18105349 16014109 14142918 12489999 11045383 9793419 8715609 7792178 7002564
57054G002564o75846n79696m98489m30920l76049l31599k94644k63331k36656
$$ 7002564 6326718 5747022 5248533 4817613 4441564 4109965 3815321 3551990 3315334
57045C315334k13318j92141j73077j56441j41590j27612j14703j03526r3664q4110
$$ 3315334 3102016 2909875 2736798 2580357 2438767 2311155 2196452 2092926 1999262 1915152
57035A915152p4845o6452n8578n0146m0920l1291k0693p788P611K3891L8497M7766
$$ 1915152 1840307 1773855 1715277 1665131 1624211 1592920 1572227 1564439 1572050 1595941 1634438 1682204
57023A682204M6311K9375k233m0374p4018r5684j04082j02267r4471q4057p2952
$$ 1682204 1728515 1757890 1755657 1715283 1641265 1545581 1441499 1339232 1244761 1160704 1087752
57012A087752o2150n2423m4338l7853l2466k7860k4030k0911j8360j6308j4446
$$ 1087752 1025602 973179 928841 890988 858522 830662 806632 785721 767361 751053 736607
57001G36607j2021q712n459l515k666j341J349M618P240Q943J0105J0913J1412
$$ 736607 724586 715874 710415 706900 704234 702893 704242 708860 716100 725043 735148 746061 757473
56988G57473J1850J2377J2702J2495J1805J0639Q394M275j705q448j4591j9449
$$ 757473 769323 781700 794402 806897 818702 829341 837735 842010 840305 831857 817266 797817
56976G97817k3106k5703k6925k6397k4460k2097j9985j7952j5550j2833j0203
$$ 797817 774711 749008 722083 695686 671226 649129 629144 611192 595642 582809 572606
56965E72606p813n424k699O54M689Q903J2429J4840J6425J7244J6381J2647N929
$$ 572606 564793 559369 556670 557324 562013 570916 583345 598185 614610 631854 648235 660882 666811
56952F66811k610j1297j8562k3151k4584k3459k0962j8063j5281j2823j0545q056
$$ 666811 664201 652904 634342 611191 586607 563148 542186 524123 508842 496019 485474 477418
56940D77418n311k763o11J784N216R676J4431J8795K2319K4590K5208K3682J9176
$$ 477418 472107 469344 468733 470517 475733 485409 499840 518635 540954 565544 590752 614434 633610
56927F33610J1016Jj1347k0470k6358k9212k9441k7742k5366k3205k1003j8241
$$ 633610 644626 644627 633280 612810 586452 557240 527799 500057 474691 451486 430483 412242
56915D12242j5351j3093j1326r446p611o407n655m655l435k620k267j860j365
$$ 412242 396891 383798 372472 363026 355415 349008 343353 338698 335263 332643 330376 328516 327151
56902C27151j132r73l74M16O86O20J169K546L967N013O067P314Q530R930J1993
$$ 327151 326019 325046 324672 325088 325774 326394 327563 330109 334076 339089 345156 352470 361000 370930 382923
56887C82923J4166J5043J4232J2700J0841P612K428l319p695j0268j1717j2225
$$ 382923 397089 412132 426364 439064 449905 457517 459945 456626 448931 438663 426946 414721
56875D14721j1452r636p566n534l159k28K996O251R577J3056J6658K0371K4260
$$ 414721 403269 393633 386067 380533 377374 377146 380142 386393 395970 409026 425684 446055 470315
56862D70315K8295L2231L5515L7222L6247L1711K3338J1709j510j3901k3336k8930
$$ 470315 498610 530841 566356 603578 639825 671536 694874 706583 705073 691172 667836 638906
56850F38906l0919k9958k6869k2668j8086j3095p435j450M196R454J4898K0899
$$ 638906 607987 578029 551160 528492 510406 497311 489876 488426 492622 502076 516974 537873
56838E37873K7482L4849M3161N1661N8604O2196O1029N3840L9968K0412k011k3826
$$ 537873 565355 600204 643365 695026 753630 815826 876855 930695 970663 991075 989064 965238
56826I65238m1936n4096n9528n9345n5633m9866m2634l4653k6892j9697j2756
$$ 965238 923302 869206 809678 750333 694700 644834 602200 567547 540655 520958 508202
56815E08202o058O0N971J2710K0568K8620L5984M2382M7039M8097M3918L4312
$$ 508202 502144 502204 508175 520885 541453 570073 606057 648439 695478 743575 787493 821805
56803H21805K0083K405j6596l3599m5539n1274n1531m7863m2095l5916l0137k4541
$$ 821805 841888 844293 827697 794098 748559 697285 645754 597891 555796 519880 489743 465202
56791D65202j8896j3657r292n520j739K310O729J1706J6955K1466K4330K5328
$$ 465202 446306 432649 423357 417837 416098 418408 425137 436843 453798 475264 499594 524922
56779E24922K4214K0085J2296J700r624j9608k6899l0833l1573l0074k7434k4293
$$ 524922 549136 569221 581517 583217 573593 553985 527086 496253 464680 434606 407172 382879
56767C82879k1042j8130j5761j3678j1703j0121r194q625p979p241o566n811m810
$$ 382879 361837 343707 327946 314268 302565 292444 283250 274625 266646 259405 252839 247028 242218
56754B42218l801l180k995k984k847k282j139K11J017R58M66L2l79r79j628k029
$$ 242218 238417 235237 232242 229258 226411 224129 222990 223201 224218 225176 225642 225674 225295 224316 222688 220659
56738B20659k064j749j202p77p69q84o03p2L9k53j16O68J134O27j13o3N35P14
$$ 220659 218595 216846 215644 214867 214098 213214 212611 212539 212578 212325 212209 212877 214011 214638 214525 214462 214997 215711
56720B15711L52K24P47J512J995K082J935J778J770J724J227L03l53j78N28J030
$$ 215711 216063 216287 217034 218546 220541 222623 224558 226336 228106 229830 231057 231360 231007 230829 231357 232387
56704B32387J016O25J6o22r68q41m35PM33O98M53k60q02o65j20K60L20K33J12
$$ 232387 233403 234028 234044 233422 232454 231613 231178 231185 231618 232316 232769 232509 231707 231042 230922 231182 231502 231735 231847
56685B31847J32O04J516K250K185J393M63n4Q9P22J199R05K6n66l88K16P73J113
$$ 231847 231979 232583 234099 236349 238534 239927 240390 240336 240425 241147 242346 243251 243277 242711 242323 242539 243312 244425
56667B44425R99J66r06j144k90N82M94j91n30l11N2L59O35P93Q64J146J624J744
$$ 244425 245424 245590 244684 243540 243250 243832 244326 244135 243605 243294 243346 243705 244340 245133 245997 247143 248767 250511
56649B50511J256O82M63K19n67j632k376k620k437j807j019p75j198j368n43O89
$$ 250511 251767 252449 252912 253131 252564 250932 248556 245936 243499 241692 240673 239898 238700 237332 236789 237478
56633B37478J233R10L22j49m92n44k38K9j14m46o08p51j129j511j538j257q17
$$ 237478 238711 239621 239943 239794 239302 238758 238520 238549 238435 237989 237381 236630 235501 233990 232452 231195 230378
56616B30378j51N35O17q2q75j238j513j947j899r08K30M68k3l00j03J24J65J09
$$ 230378 230227 230762 231379 231297 230422 229184 227671 225724 223825 222917 223147 223615 223592 223292 223189 223313 223478 223587
56598B23587o7k63m9N87R27O21L68O57Q04K90L1R71K230K215R88l2l01m55o82
$$ 223587 223520 223257 223208 223795 224722 225343 225711 226368 227172 227462 227493 228464 230694 232909 233897 233865 233564 233109 232427
56579B32427m53J62L93J52J83P63J419K006K800L448L124J947J099J315K267L525
$$ 232427 231974 232136 232529 232681 232864 233627 235046 237052 239852 243300 246424 248371 249470 250785 253052 256577
56563B56577N123O854Q145Q941R880J1220J2316J2279J0672P560L681M01j301
$$ 256577 261700 268554 276699 285640 295520 306740 319056 331335 342007 349567 353248 353649 352348
56550C52348j831k233k725k781k384k103k052j882j767k290l204l495k812j899
$$ 352348 350517 348284 345559 342778 340394 338291 336239 334357 332590 330300 327096 323601 320789 318890
56536C18890j434j366j566k151k891l171k864k520k514k659k757k812k745k444
$$ 318890 317456 316090 314524 312373 309482 306311 303447 300927 298413 295754 292997 290185 287440 284996
56522B84996k140k088k019j569j049r92j277j485j781k466l021k669j699j079
$$ 284996 282856 280768 278749 277180 276131 275139 273862 272377 270596 268130 265109 262440 260741 259662
56508B59662j002r10p46r62j412j497j333j534j929j744j007n04l71l8M14K78
$$ 259662 258660 257750 257004 256042 254630 253133 251800 250266 248337 246593 245586 245082 244711 244673 245087 245365
56492B45365l98p76o73o20n16K82J390J637J045Q73J389J391M69r3M80J111P26
$$ 245365 244967 244191 243518 242898 242382 242664 244054 245691 246736 247609 248998 250389 250858 250765 251245 252356 253082
56475B53082kL4N86P97P02Q64J291J706K226K874L060K369J244L32k74o34o00
$$ 253082 253080 253114 253700 254497 255199 256063 257354 259060 261286 264160 267220 269589 270833 271165 270891 270257 269657
56458B69657l02k47m42k68L80O73Q3q43j419j607j443o94L97J033J074J310J955
$$ 269657 269355 269108 268666 268398 268778 269451 269534 268691 267272 265665 264222 263528 263925 264958 266032 267342 269297
56441B69297K000Q54m56p07j82L1l31o96p84p53o72n53n27n44k52M26J088J483
$$ 269297 271297 272151 271695 270988 270806 270837 270506 269810 269026 268273 267601 267048 266521 265977 265725 266151 267239 268722
56423B68722J681J469M76p95j076J6J332J731J384J088J104J259J374J141L24
$$ 268722 270403 271872 272348 271553 270477 270493 271825 273556 274940 276028 277132 278391 279765 280906 281230
56408B81230n29n53J6K9o55p81K03J083Q09J19J60P24J022J168J610J904J429
$$ 281230 280701 280148 280164 280193 279538 278757 278960 280043 280852 280971 281131 281855 282877 284045 285655 287559 288988
56391B88988O80O09J155J505J390J115P44K15j09J17N05M25q8n51p14m86L38J590
$$ 288988 289668 290277 291432 292937 294327 295442 296186 296401 296292 296409 296914 297339 297251 296700 295986 295500 295838 297428
56373B97428K493K464J785J023L07l45o47n17k86m6N00J140R99r3r68o16M58J153
$$ 297428 299921 302385 304170 305193 305500 305155 304508 303991 303705 303659 304159 305299 306298 306205 305237 304621 305079 306232
56355C06232J276J363J608J782J811J772J631J387J101O07j77o21J1J241J768
$$ 306232 307508 308871 310479 312261 314072 315844 317475 318862 319963 320570 320393 319772 319783 321024 322792
56340C22792J319R28J110J253J152J590K674L240K794K519L245L969L607K790
$$ 322792 324111 325039 326149 327402 328554 330144 332818 336058 338852 341371 344616 348585 352192 354982
56326C54982K570K632K244J878K288K867K477J179j71j325k325k581j633k55M73
$$ 354982 357552 360184 362428 364306 366594 369461 371938 373117 372946 371621 369296 366715 365082 364827 365300
56311C65300O22Q39J022P63M58P47J380J741J940K378K864L110L460M106M402
$$ 365300 365922 366761 367783 368546 369004 369751 371131 372872 374812 377190 380054 383164 386624 390730 395132
56296C95132L882L169K878K593J955J756K681L956M530M702N180N532N005M159
$$ 395132 399014 402183 405061 407654 409609 411365 414046 418002 422532 427234 432414 437946 442951 447110
56282D47110M111M824N486N948O443O573O054N718O459P744Q555R062R960J0929
$$ 447110 451221 456045 461531 467479 473922 480495 486549 492267 498726 506470 515025 524087 534047 544976
56268E44976J1252J1353J2138J3307J3850J3796J4134J5374J7387K0130K3349
$$ 544976 556228 567581 579719 593026 606876 620672 634806 650180 667567 687697 711046
56257G11046K6252K8668L1767L6443M1841M6828N1876N7892O4232O9744P4906
$$ 711046 737298 765966 797733 834176 876017 922845 974721 1032613 1096845 1166589 1241495
56246A241495Q1006Q7708R3315R7058R9397J00409R9554R6683R1708Q3750P2204
$$ 1241495 1322501 1410209 1503524 1600582 1699979 1800388 1899942 1996625 2088333 2172083 2244287
56235B244287N8081M2879K6740R329q245k4165l8040n0445o1016o8813p4197p8401
$$ 2244287 2302368 2345247 2371987 2381316 2373071 2348906 2310866 2260421 2199405 2130592 2056395 1977994
56223A977994q1636q3274q3454q2749q0804p7150p2794o9065o5432o0521n4793
$$ 1977994 1896358 1813084 1729630 1646881 1566077 1488927 1416133 1347068 1281636 1221115 1166322
56212A166322n0050m6633m3299l9708l6787l4664l2358k9622k7188k5160k2892
$$ 1166322 1116272 1069639 1026340 986632 949845 915181 882823 853201 826013 800853 777961
56201G77961k0451j8477j6725j4486j2214j0966j0454r474p992o909o096m696
$$ 777961 757510 739033 722308 707822 695608 684642 674188 664714 656722 649813 643717 639021
56189F39021l111k637l172l281k461j465n59O05J536J355N40L62Q00R12Q96J645
$$ 639021 635910 633273 630101 626820 624359 622894 622335 622940 624476 625831 626371 626733 627533 628445 629341 630986
56173F30986K632K516J679J872L340M561M792M775M979N267O118P996R763R938
$$ 630986 633618 636134 637813 639685 643025 647586 652378 657153 662132 667399 673517 681513 691276 701214
56159G01214R280R739J1201J1907J1826J2687J4700J6169J6730J8079K0929K3982
$$ 701214 710494 720233 731434 743341 755167 767854 782554 798723 815453 833532 854461 878443
56147H78443K6594L0023L5217M1630M8855N7389O7253P7722Q8577R9587J08693
$$ 878443 905037 935060 970277 1011907 1060762 1118151 1185404 1263126 1351703 1451290 1559983
56136A559983J12949J11360J04894R4191P9921O4964N3176M5638M0680L7329L5611
$$ 1559983 1672932 1784292 1889186 1983377 2063298 2128262 2181438 2227076 2267756 2305085 2340696
56125B340696L3548K7542J6737M254o618j4871k0351k3163k5318l0100l8930n0901
$$ 2340696 2374244 2401786 2418523 2422777 2416159 2401288 2380937 2357774 2332456 2302356 2263426 2212525
56113B212525o5271q1448r6496j06265j09582j08344j03327r3533q0098o6870
$$ 2212525 2147254 2065806 1969310 1863045 1753463 1645119 1541792 1448259 1368161 1301291
56103A301291n5982m6215l6791k9105k3591j8437j2957q983p391o371m552k820
$$ 1301291 1245309 1199094 1162303 1133198 1109607 1091170 1078213 1069230 1061839 1055468 1050916 1048096
56091A048096j737j57K222L863M188M643N933O950P336Q197R498R837R360R728
$$ 1048096 1046359 1046202 1048424 1052287 1056475 1061118 1067051 1074001 1081337 1089534 1099032 1108869 1118229 1127957
56077A127957J0745J0556R579J0257J2412J3134J2078J2268J4566J6055J5405
$$ 1127957 1138702 1149258 1158837 1169094 1181506 1194640 1206718 1218986 1233552 1249607 1265012
56066A265012J5135J6744J8187J8184J8548K0081K0626J9335J8623J9601J9895
$$ 1265012 1280147 1296891 1315078 1333262 1351810 1371891 1392517 1411852 1430475 1450076 1469971
56055A469971J8179J6614J6573J6313J5093J5087J6924J7835J6726J6471J8673
$$ 1469971 1488150 1504764 1521337 1537650 1552743 1567830 1584754 1602589 1619315 1635786 1654459
56044A654459K0792K1022K1284K2793K3586K3093K4129K7573L0325L1514L5123
$$ 1654459 1675251 1696273 1717557 1740350 1763936 1787029 1811158 1838731 1869056 1900570 1935693
56033A935693M3038N1009N5300N7896O1204O3070O1468N9042N8466N8001N5867
$$ 1935693 1978731 2029740 2085040 2142936 2204140 2267210 2328678 2387720 2446186 2504187 2560054
56022B560054N4237N4807N5242N4168N4643N8615O3055O5611O8682P3923P8442
$$ 2560054 2614291 2669098 2724340 2778508 2833151 2891766 2954821 3020432 3089114 3163037 3241479
56011C241479Q0738Q4386R1279R7473J00364J03628J10058J16243J19572J23647
$$ 3241479 3322217 3406603 3497882 3595355 3695719 3799347 3909405 4025648 4145220 4268867
56001D268867J31197J38639J43429J49541J59588J69104J75053J82270J94575
$$ 4268867 4400064 4538703 4682132 4831673 4991261 5160365 5335418 5517688 5712263
55992E712263K07541K17318K28406K44926K62558K77329K93895L16649L41217
$$ 5712263 5919804 6137122 6365528 6610454 6873012 7150341 7444236 7760885 8102102
55983H102102L63543L88388M19867M53130M84881N21955N69433O21120O72495
$$ 8102102 8465645 8854033 9273900 9727030 10211911 10733866 11303299 11924419 12596914
55974A2596914P31436Q04710Q86467R72671J073509J197924J340606J499594J691318
$$ 12596914 13328350 14133060 15019527 15992198 17065707 18263631 19604237 21103831 22795149
55965B2795149J931708K219560K557417K971041L487513M113686M858351N753296
$$ 22795149 24726857 26946417 29503834 32474875 35962388 40076074 44934425 50687721
55957E0687721O828652Q097629R599961J1433233J3710077J6523459J9976229
$$ 50687721 57516373 65614002 75213963 86647196 100357273 116880732 136856961
55950A36856961K4125282K8729911L3051205L6032966L6721684L4443892K8682512
$$ 136856961 160982243 189712154 222763359 258796325 295518009 329961901 358644413
55943C58644413J9172723O461971p671414k0673653l0356473l5771802l7226467
$$ 358644413 377817136 384279107 376607693 355934040 325577567 289805765 252579298
55936B52579298l5725201l2426353k8334533k4155453k0272364j6842761j3919756
$$ 252579298 216854097 184427744 156093211 131937758 111665394 94822633 80902877
55929H0902877j1497970r516493p893424o568868n499909m635121l923639l337910
$$ 80902877 69404907 59888414 51994990 45426122 39926213 35291092 31367453 28029543
55921B8029543k863284k475131k146475j867557j637614j445730j277139j129701
$$ 28029543 25166259 22691128 20544653 18677096 17039482 15593752 14316613 13186912
55913A3186912j007088r03048q07642p21775o50874n90876n34111m82568m42117
$$ 13186912 12179824 11276776 10469134 9747359 9096485 8505609 7971498 7488930 7046813
55904G046813m09414l76953l45680l20646k99455k76428k53425k35630k21039
$$ 7046813 6637399 6260446 5914766 5594120 5294665 5018237 4764812 4529182 4308143
55895D308143k04451j87611j75371j65844j54022j41288j32161j25156j15787
$$ 4308143 4103692 3916081 3740710 3574866 3420844 3279556 3147395 3022239 2906452
55886B906452j05129r6965q9897q0584p1396o6825o5499o3580o2563o5725p0145
$$ 2906452 2801323 2704358 2614461 2533877 2462481 2395656 2330157 2266577 2204014 2138289 2068144
55875B068144p0421o7538o6219o6170o3825o0286n9527o0518n8739n4129n0415
$$ 2068144 1997723 1930185 1863966 1797796 1733971 1673685 1614158 1553640 1494901 1440772 1390357
55864A390357m7958m4114l9370l6428l4236k9392k2512j7205j3724r568n452m790
$$ 1390357 1342399 1298285 1258915 1222487 1188251 1158859 1136347 1119142 1105418 1095850 1090398 1085608
55852A085608p847j1799j5859k1203k6629k9440l0005l0678l1119k9279k6047
$$ 1085608 1077761 1065962 1050103 1028900 1002271 972831 942826 912148 881029 851750 825703
55841H25703k4099k3126k0760j7369j5452j5108j4496j3726j4050j4315j2600
$$ 825703 801604 778478 757718 740349 724897 709789 695293 681567 667517 653202 640602
55830F40602j0248r941j0908j0368q524p691p648o492n001n610p796q930q884
$$ 640602 630354 620413 609505 599137 590613 582922 575274 568782 563781 558171 550375 541445 532561
55817E32561r461j0204r266p519p267p703o278l747l086l938l103k92J533J662
$$ 532561 523100 512896 503630 496111 488844 481141 474863 471116 468030 464092 460989 460697 462230 463892
55803D63892K662N438P775Q499Q953R616R058O959M711K597l08l300m592m798
$$ 463892 466554 471992 479767 488266 497219 506835 515893 522852 527563 530160 529852 526552 521960 517162
55789E17162o282q936j0194r430q572q262p270o124p317j1019j4250j5298j5543
$$ 517162 510880 501944 491750 482320 473748 465486 458216 452092 444775 433756 419506 404208 388665
55776C88665j5945j5199j2603r668p560n557l179j358n24J59R34J039O60R94J918
$$ 388665 372720 357521 344918 335250 327690 322133 318954 317596 317072 317231 318165 319204 319864 320858 322776
55761C22776K001J092N44N37k16j818k901l366m783p519j0023j1528j2910j4363
$$ 322776 324777 325869 326413 326950 326734 324916 322015 318649 313866 306347 296324 284796 271886 257523
55747B57523j4670j3454j1802j0091p531m381k316j937k048j823j648j489p16
$$ 257523 242853 229399 217597 207506 199975 195594 193278 191341 189293 187470 185822 184333 183617
55734A83617J72o6j026j024l4J48q98j506q75k76n73r90j035j386k121k130j140
$$ 183617 183789 183723 182697 181673 181639 181787 180889 179383 178508 178232 177659 176669 175634 174248 172127 169997 168857
55717A68857l27l60o33q01j146j231k45J075J137K26J86J234J621Q41M05R24J054
$$ 168857 168530 168170 167537 166736 165590 164359 164114 165189 166326 166552 166738 167972 169593 170434 170839 171763 172817
55700A72817J34p63j165k080l597m191l452l066l958m701l931k210m89J181K460
$$ 172817 172951 172188 171023 168943 165346 161155 157703 154637 150679 145978 142047 139837 139348 140529 142989
55685A42989K414J415J200K148K678K227K316L601M412L671K748K853K851J534
$$ 142989 145403 146818 148018 150166 152844 155071 157387 160988 165400 169071 171819 174672 177523 179057
55671A79057m2m07j45n08j120q89LO85J071J386J400J297K020L568M310L239J563
$$ 179057 179015 178608 178463 177955 176835 175946 175949 176634 177705 179091 180491 181788 183808 187376 191686 194925 196488
55654A96488Q83J140J582K294L363L877L204K184J694J121m71k664m420n534o243
$$ 196488 197371 198511 200093 202387 205750 209627 212831 215015 216709 217830 217359 214695 210275 204741 198498
55639A98498o396o026n859o214o379n898n413n373n035l730k008p09J21N55L03
$$ 198498 192102 186076 180217 174003 167624 161726 156313 150940 145905 142175 140167 139458 139579 140134 140437
55624A40437l65m41K49N38k38j195j548j800k386k627k127j718j912j870j094
$$ 140437 140072 139631 139880 140418 140180 138985 137437 135637 133251 130624 128497 126779 124867 122997 121903
55609A21903o16j199j781j223l39n15j425j746j241o73l43j02j68o38q48l27K91
$$ 121903 121287 120088 118307 117084 116745 116230 114805 113059 111818 111145 110802 110700 110532 109894 109046 108719 109010
55592A09010K75p0k46o20j536k219j765n26N05J033J294J302J136J205J493J326
$$ 109010 109285 109215 108969 108349 106813 104594 102829 102303 102808 103841 105135 106437 107573 108778 110271 111597
55576A11597O36L85J074J897K159K307K756K991K805L022L881M157L073J703J079
$$ 111597 112233 112618 113692 115589 117748 120055 122811 125802 128607 131629 135510 139667 142740 144443 145522
55561A45522L95j356l281l910l491l186k914j924p18n34j339k042k233k236j961
$$ 145522 145917 144561 141280 137370 133879 130693 127779 125855 125137 124603 123264 121222 118989 116753 114792
55546A14792j161m38m98q60o16L1K84K45M94P53M67J89Q32J897J986Q86l24r79
$$ 114792 113631 113193 112695 111835 111219 111250 111534 111779 112273 113026 113493 113682 114514 116411 118397 119283 118959 117980
55528A17980j318j428j050m49k75o02j060j669k537l118k835k140j885j973j701
$$ 117980 116662 115234 114184 113735 113460 112858 111798 110129 107592 104474 101639 99499 97614 95641 93940
55513I3940j065o28m35j98j30n29r26p61m53o57j020r24q34j446k013j237M40
$$ 93940 92875 92247 91812 91614 91484 90955 90029 89268 88815 88158 87138 86214 85380 83934 81921 80684 81124
55496H1124J229O78J82N94R64K65r77j533r71K21J289J604J002R0l41k94l87p62
$$ 81124 82353 83031 83213 83807 84771 85036 84059 82526 81555 81776 83065 84669 85671 85761 85420 85126 84739 83977
55478H3977r09n73j47J9R1L91R96J720K171J943J104K58j88m58q36j145j190j094
$$ 83977 83068 82495 82348 82367 82458 82849 83845 85565 87736 89679 90783 91041 90853 90395 89559 88414 87224 86130
55460H6130p91P0J224J610Q26p1n1M63N14J74P4J61N6k8J47kr63j978k011j279
$$ 86130 85339 85409 86633 88243 89069 88998 88947 89410 89924 90098 90172 90333 90389 90361 90508 90506 89543 87565 85554 84275
55440H4275o52j90M03N90k04j135q74L83J329J609J805J767P62p31j226m11M66
$$ 84275 83623 83433 83836 84426 84222 83087 82213 82596 83925 85534 87339 89106 89868 89137 87911 87500 87966
55423H7966O09N59P43O13j74r49r81l59M04Q74P35Q6k87J35O34K38o43p79q8L67
$$ 87966 88575 89134 89877 90490 90316 89367 88386 88027 88431 89305 90040 90126 89839 89974 90608 90846 90203 89424 89336 89703
55403H9703J79o4j99o28j001m38O40O24p78j793j069N54J511J480R62J57p40j071
$$ 89703 89882 89818 89619 88991 87990 87552 88192 88816 88038 86245 85176 85730 87241 88721 89683 89840 89100 88029
55385H8029n65L8M6j82k7K94K35mK23R52J540J523J092P48P87R87P76q1j084j599
$$ 88029 87464 87502 87548 87366 87339 87633 87868 87864 88087 89039 90579 92102 93194 93942 94729 95716 96492 96411 95327 93728
55365I3728j664j647j384m27Q99J558J032j58j214j681j412o26n1k17o68n27J86
$$ 93728 92064 90417 89033 88606 89505 91063 92095 91937 90723 89042 87630 87004 86953 86736 86068 85541 85727
55348H5727O65N99M53M90M41K31J47K29K37K79O41J071J011M77j13o70j115p67
$$ 85727 86392 86991 87444 87934 88375 88606 88753 88982 89219 89498 90139 91210 92221 92698 92585 91915 90800 90033
55330I0033O85J964J457l94j530j136m09l05l05Q0K70j04l64k4L98N24Q44J502
$$ 90033 90718 92682 94139 93745 92215 91079 90670 90365 90060 90140 90410 90306 89942 89918 90316 90840 91684 93186
55312I3186J604O27n87j105j165j325j388j050o94o54n45j56n9n19p42q5Q46J221
$$ 93186 94790 95417 94830 93725 92560 91235 89847 88797 88103 87449 86904 86748 86689 86170 85428 85343 86189 87410
55294H7410J209J249J003J14p30p10j62O9J5K17N18M19J87M83J094J159N42j3
$$ 87410 88619 89868 90871 90985 90255 89545 89383 89452 89467 89684 90202 90621 90808 91291 92385 93544 94086 94073
55276I4073n6R8J09Q3K20M78O56M89j32p80p17J26Q60P13n2p63j240j543j401
$$ 94073 94017 94115 94224 94307 94527 95005 95661 96150 96018 95238 94521 94647 95507 96220 96168 95405 94165 92622 91221
55257I1221p04k0J39J62O70J343J302M55l58n43l29j89k67m14l76L3N74N94j97
$$ 91221 90517 90497 90636 90798 91468 92811 94113 94568 94210 93667 93338 93149 92882 92468 92092 92125 92699 93293 93096
55238I3096j179j467r31j61L69N91N50L19J46K76O01P66N56K2n96r60q47m30q6
$$ 93096 91917 90450 89519 89358 89727 90318 90868 91187 91333 91609 92210 92976 93532 93554 92958 91998 91151 90721 90635
55219I0635J22M28P69P70M16J75K30K05o9j39L29J008J438J574J430Q36Rl21R8
$$ 90635 90757 91185 91954 92724 93140 93315 93545 93750 93681 93542 93871 94879 96317 97891 99321 100157 100166 99845 99943
55200I9943N09J87n31q39o20l30j75j4J46J44p9m93r64j044l81N09O45L7j71N13
$$ 99943 100452 100639 100108 99269 98649 98319 98144 98130 98276 98420 98341 97848 96884 95840 95459 95968 96613 96650 96479 96992
55180I6992J048O18O0N12J414J316P5j068j356j115o86J4P83J136J135J238J310
$$ 96992 98040 98658 98718 99230 100644 101960 102035 100967 99611 98496 97810 97824 98607 99743 100878 102116 103426
55163A03426P54k14n09L06J261J298N82K7L5K27J87n7j92r5k8l24q57j105q52
$$ 103426 104180 103966 103457 103763 105024 106322 106904 106931 106966 107193 107380 107323 107131 107036 107008 106684 105827 104722 103870
55144A03870n28m92m95j80K19L17K97N82J003J025O71M59M74K22m53r55o81K16
$$ 103870 103342 102850 102355 102175 102394 102711 103008 103590 104593 105618 106289 106748 107222 107444 106991 106036 105355 105571
55126A05571J027J115L91n74r37m80J8l18j252j696j091o9M29J69l92p50p32m26
$$ 105571 106598 107713 108104 107530 106593 106113 106131 105813 104561 102865 101774 101705 102134 102303 101911 101161 100429 100003
55108A00003p7N1k40r10j528j345MJ842K863K502J516R46R57J067J039R51O91
$$ 100003 99926 99977 99737 98827 97299 95954 95958 97800 100663 103165 104681 105627 106584 107651 108690 109641 110332
55091A10332M1p46j075p18n5M32N62M25K21J04j1l35q09j063r49p35n80k32M05
$$ 110332 110373 109627 108552 107834 107779 108211 108773 109198 109419 109523 109512 109177 108368 107305 106356 105621 105041 104809 105214
55072A05214Q36O42J37j18j61l59n90l33M28J006Q09l7r08j300j238j171j373
$$ 105214 106050 106692 106829 106711 106550 106191 105601 105268 105696 106702 107511 107474 106566 105266 104028 102857 101484
55055A01484j445p51N92J668J894J590J229P52P5l63k38K2j15m92o55n79l93R9
$$ 101484 100039 99288 99880 101548 103442 105032 106261 107013 107088 106725 106487 106509 106394 105902 105247 104668 104275 104374
55037A04374R08J328Q10o5l07J20N21P21J079J465J236L64l08j69M71R33R24O37
$$ 104374 105282 106610 107420 107355 107048 107168 107689 108410 109489 110954 112190 112554 112246 112077 112548 113481 114405 115042
55019A15042N01Q24J346J305L39r25j571j424r36n10m00q08j415j326k42Q30Q48
$$ 115042 115543 116367 117713 119018 119357 118432 116861 115437 114501 113991 113591 112783 111368 110042 109800 110630 111478
55002A11478K42J70P47J086Q53N66N09M27K83K96K79p9l81l6N50L97m34q59m69
$$ 111478 111720 111890 112637 113723 114576 115142 115651 116078 116361 116657 116936 116857 116476 116440 116990 117387 116953 116094 115625
54983A15625qk4k31l85o09n94K96J733K433J880R26K91l28j107j304m77N49Q01
$$ 115625 115617 115593 115362 114977 114368 113774 114070 115803 118236 120116 121042 121333 121005 119898 118594 118117 118666 119467
54965A19467M83M09P88J262J537J407P70R1J08O51O49k14q69n84j84o66j567j842
$$ 119467 119950 120359 121147 122409 123946 125353 126123 126214 126322 126973 127622 127408 126539 125955 125771 125105 123538 121696
54947A21696j536j339j228p69k82l31m63K13J348J659Q83J22Q3K55J36J30O08
$$ 121696 120160 118821 117593 116824 116542 116211 115748 115961 117309 118968 119851 119973 120056 120311 120447 120577 121185
54930A21185J119J219J332K002K846L063K657K399K700L233L668M202N058N987
$$ 121185 122304 123523 124855 126857 129703 132766 135423 137822 140522 143755 147423 151625 156683 162670
54916A62670O510O400N611M044J801n07k163l103l854m639n112n110n085n317
$$ 162670 169180 175580 181191 185235 187036 186529 184366 181263 177409 172770 167658 162548 157463 152146
54902A52146n311m572l521k906k621j981r46j52J97N20Q13N23k80o38r2N25L93
$$ 152146 146835 142263 138742 135836 133215 131234 130288 130136 130333 130853 131666 132189 131909 131271 131179 131704 132097
54885A32097jL40J440K495L088L428L629L507L095K767K829L316M051M591M322
$$ 132097 132096 132436 133876 136371 139459 142887 146516 150023 153118 155885 158714 162030 166081 170672 174994
54870A74994L118J630N21m05j799l632n068n503n179m742m524m408m090l408k547
$$ 174994 178112 179742 180263 179858 178059 174427 169359 163856 158677 153935 149411 145003 140913 137505 134958
54855A34958j966j895j983j684r38k07J17N8k56q12j508j973j894j482j264j358
$$ 134958 132992 131097 129114 127430 126492 126285 126402 126460 126204 125392 123884 121911 120017 118535 117271 115913
54839A15913j246m86M91P72J28o64q42m95p0L89R81J301Q77N9k96m4Q0l28p42
$$ 115913 114667 114181 114672 115444 115572 114908 114066 113571 113501 113890 114871 116172 117049 117108 116812 116768 116848 116520 115778
54820A15778n62J26Q87J471J662J240N09L58J211K248K226R07p02j438j046k21
$$ 115778 115216 115342 116229 117700 119362 120602 121111 121469 122680 124928 127154 128061 127359 125921 124875 124654
54804A24654J32j63m18pO98P60M0n06j12P98J228P55k64j224j615j256n03QP0
$$ 124654 124786 124623 124205 124198 124896 125656 125696 125190 125078 125876 127104 127859 127595 126371 124756 123500 122997 123005 123075
54785A23075O3K61M65N04N70P48P41M44K97O39J139J329J296J450J920K666L766
$$ 123075 123138 123399 123864 124368 124938 125686 126427 126871 127168 127807 128946 130275 131571 133021 134941 137607 141373
54768A41373N118O219O667O635O428N968N167M365L878L407K432R38p84k698m779
$$ 141373 146491 152710 159377 166012 172440 178408 183575 187940 191818 195225 197657 198595 197811 195113 190334
54753A90334o379o594n343l656k755k994l653l700k796j680j276j552j755j683
$$ 190334 183955 177361 172018 168362 165607 162613 158960 155260 152464 150784 149508 147956 146201 144518
54739A44518j886k371k198r22M39Q08N72P45J231J214Q33J104K153K896K685K194
$$ 144518 142632 140261 138063 137141 137580 138388 138960 139705 140936 142150 142983 144087 146240 149136 151821 154015
54723A54015K209K590K888L252L997M844N222M982M263K948P98j859m115n300
$$ 154015 156224 158814 161702 164954 168951 173795 179017 183999 188262 191210 192008 190149 186034 180734
54709A80734n590n654n793n704n103m272l667l193k362j164k26L6r6k69n38r00
$$ 180734 175144 169490 163697 157993 152890 148618 144951 141758 139396 138232 138006 138042 137946 137677 137139 136239
54693A36239r78o66n22q98j223q65k14p4l58l03J89M51J76j96l77o43j146j514
$$ 136239 135261 134595 134073 133175 131952 131087 130873 130799 130441 130138 130327 130778 130954 130758 130381 129738 128592 127078
54675A27078j431j026n10Q2O20Q15N84J15m65j064j340r89k88J69L01N09Q63J032
$$ 127078 125647 124621 124111 124193 124813 125628 126212 126327 125862 124798 123458 122469 122181 122350 122651 123160 124023 125055
54657A25055J002J086J099M39p00j106r5J372J891J317N75J57k89r49j268p25
$$ 125055 126057 127143 128242 128681 127981 126875 126780 128152 130043 131360 131935 132092 131803 130854 129586 128861
54641A28861L46J125J273J156J133J000L77n00q42k60O98J148P90k2p82j113q24
$$ 128861 129207 130332 131605 132761 133894 134894 135271 134771 133929 133669 134367 135515 136305 136283 135501 134388 133564
54624A33564j49K78J11k23j88L4j06n63p82o70o69q34o35J39R16J094O80Oo75
$$ 133564 133415 133693 133804 133581 133393 133427 133321 132758 131976 131306 130637 129803 129168 129307 130223 131317 131997 132003 131328
54605A31328j026p03J03O62N95L19K87L25L8m77q53r54p76j35R82K025K304J756
$$ 131328 130302 129599 129702 130364 130959 131278 131565 131890 131928 131451 130598 129644 128868 128733 129715 131740 134044 135800
54587A35800R51M11J92M8j95m66m73rO86J037P25J1o08r27j046j072r34m91J96
$$ 135800 136751 137162 137354 137402 137207 136741 136268 136259 136945 137982 138707 138718 138110 137183 136137 135065 134131 133640 133836
54568A33836P15N76j43o95n28j2J81J97P53J762K136J239k21j178j408j202n64
$$ 133836 134551 135127 134984 134289 133761 133749 133930 134127 134880 136642 138778 140017 139796 138618 137210 136008 135444
54551A35444N09J436J612J334J400J848J924J279M65N0p6k12k01K50R79J514J656
$$ 135444 135953 137389 139001 140335 141735 143583 145507 146786 147251 147301 147225 147013 146812 147062 148041 149555 151211
54534A51211J571J365R06R0r48j930k537k430j430J11J286J354M47o25j317j731
$$ 151211 152782 154147 155053 155143 154195 152265 149728 147298 145868 145979 147265 148619 149066 148441 147124 145393
54518A45393j961j633m63R49J542R92L1m88m87m63p66j270j543j249n02J21J96
$$ 145393 143432 141799 141336 142285 143827 144819 144850 144362 143875 143412 142646 141376 139833 138584 138082 138203 138399
54501A38399J4K14Q30J167Q03K50K87R28J474J459J079P25M25j7n09n82%P82R93
$$ 138399 138413 138627 139457 140624 141427 141677 141964 142892 144366 145825 146904 147629 148054 148037 147528 146946 146946 147728 148721
54482A48721N13P0L11R96J397J251Q03K05m98r19n72L76J191J494J518J350P25
$$ 148721 149234 149304 149615 150611 152008 153259 154062 154267 153769 152850 152278 152654 153845 155339 156857 158207 158932
54465A58932j98o41k23M66Q29J130J767K271J926R61L00K75L22ln05q62j069j209
$$ 158932 158734 158093 157870 158336 159165 160295 162062 164333 166259 167220 167520 167795 168117 168114 167609 166747 165678 164469
54447A64469j298j414j583j507r28k73l38j141j668j093J86J097J119O11J31j01
$$ 164469 163171 161757 160174 158667 157739 157466 157128 155987 154319 153226 153412 154509 155628 156239 156370 156269
54431A56269j68k14l02l45j72K63P70J091J159J090J002Q85O15J32l91n68j95
$$ 156269 156101 155887 155585 155240 155068 155331 156101 157192 158351 159441 160443 161328 161943 162075 161684 161116 160921
54414A60921M31P20L94k70p69p56j71P25J297J026K14j15N83J573J713R56L62
$$ 160921 161352 162072 162466 162196 161427 160671 160500 161225 162522 163548 163762 163647 164230 165803 167516 168472 168834
54397A68834O37J287J457R85K81l82q62p81J37J405J968J266k41j636k289k113
$$ 168834 169471 170758 172215 173200 173481 173099 172237 171456 171593 172998 174966 176232 175991 174355 172066 169953
54381A69953j510j165j438j880j675p57P0K72L07Q04J479J514P92J32K48R54J500
$$ 169953 168443 167278 165840 163960 162285 161528 161598 161870 162177 162981 164460 165974 166766 166898 167146 168100 169600
54364A69600J469J135J092J538K044K117J960K193K802K896J828P7j431k414l081
$$ 169600 171069 172204 173296 174834 176878 178995 180955 183148 185950 188846 190674 190751 189320 186906 183825
54349A83825l355l001k331j993k047j909j350q28p15q32r24j054j236j193p99
$$ 183825 180470 177469 175138 173145 171098 169189 167839 167011 166296 165464 164540 163486 162250 161057 160258
54334A60258l72j65O2O62J465J894J567O31l88j033j218j202j148r16m46p4j09
$$ 160258 159886 159721 159783 160445 161910 163804 165371 166002 165614 164581 163363 162161 161013 160097 159651 159577 159468
54317A59468k46K8N59O29L0n82n80j45J05j19o22j054j172r74o43k38M19J255
$$ 159468 159222 159250 159809 160438 160468 159886 159306 159161 159266 159147 158525 157471 156299 155325 154682 154444 154863 156118
54299A56118J620J049R7k43O2J29l62o52k03M22M84J24j36k97n65o52j65O59J267
$$ 156118 157738 158787 158884 158641 158703 158832 158470 157818 157615 158037 158521 158645 158509 158212 157647 156995 156830 157489 158756
54280A58756J588J803J583M06j360k455k081q06J67L44K26L88O49M23k13l47O00
$$ 158756 160344 162147 163730 164136 162776 160321 158240 157434 157601 157945 158171 158559 159208 159631 159418 159071 159671
54263A59671J890K280J632R63R16R93O11O4j04Nj0m9K57P76R98O86J4p14j165
$$ 159671 161561 163841 165473 166436 167352 168345 168956 169020 168916 168921 168911 168862 169119 169895 170893 171579 171593 170879 169714
54244A69714j061n89m00p67j114q46k37M2m9n8N4j62p98j341j308o98J55Q60J050
$$ 169714 168653 168064 167664 166897 165783 164937 164700 164742 164693 164635 164689 164527 163729 162388 161080 160382 160537 161397 162447
54225A62447O65J10r0J98P77J381J677J270J92q33j086o62k38j67k62k81k27j99
$$ 162447 163112 163222 163132 163330 164107 165488 167165 168435 168627 167794 166708 166046 165808 165641 165379 165098 164871 164672
54207A64672l42p33j083q19J17Q89O87j92q31r34r57j111j023m98M9K28K43N64
$$ 164672 164330 163597 162514 161695 161812 162701 163388 163196 162365 161431 160474 159363 158340 157842 157891 158119 158362 158926
54189A58926J229J716J484N78k56l78p6k13q90j186n63J88J23l68k33N85J155
$$ 158926 160155 161871 163355 163933 163677 163299 163223 163010 162120 160934 160371 160559 160682 160314 160081 160666 161821
54172A61821J076Q10O13K29k20j64K93K43n84j207p87J12M06l1m91n81n33n26
$$ 161821 162897 163707 164320 164549 164329 164165 164458 164701 164117 162910 162123 162235 162641 162610 162119 161538 161005 160479
54154A60479m09p9K82M37L50K07L26Q43J427J478P56l52j220j424q96M5P66Q43
$$ 160479 160070 159991 160273 160710 161060 161267 161593 162436 163863 165341 166097 165745 164525 163101 162205 162250 163016 163859
54136A63859N47M89P43Q45O56O20R04R37K51o97j117r52p72p49m08N30J593K075
$$ 163859 164406 164895 165638 166483 167139 167759 168663 169600 169851 169154 168037 167085 166313 165564 165156 165686 167279 169354
54118A69354J881J531J396J234O41j27k60N34J442J447O79K83R21J929K198J459
$$ 169354 171235 172766 174162 175396 176037 175910 175650 176184 177626 179073 179752 180035 180956 182885 185083 186542
54102A86542L64l97p07q01q59q03m72J50Q92J642K512L596M687N450N779N736
$$ 186542 186906 186509 185802 185001 184142 183339 182867 183017 183909 185551 188063 191659 196346 201796 207575 213311
54086B13311N202L986K192K17j703l544n122n974n756m564k867j343o48q92j348
$$ 213311 218513 222499 224691 224908 223205 219661 214539 208565 202809 198245 195378 194035 193387 192495 191147
54071A91147j148l20L07K82Q7K91O78O46Q9n55r53j097r49l41O59J567J945J991
$$ 191147 189999 189679 189986 190268 190355 190646 191324 191970 192059 191504 190551 189454 188505 188164 188823 190390 192335 194326
54053A94326K420L574M809N105M336L574L811M745N132M219K420P60j9J32O29
$$ 194326 196746 200320 205129 210234 214570 218144 221955 226700 231832 236051 238471 239231 239212 239344 239973
54038B39973Q39Q26J322K675M164M903N034N325N818N759M858L740K967K446J985
$$ 239973 240812 241638 242960 245635 249799 254702 259736 265061 270879 276638 281496 285236 288203 290649 292634
54023B92634J730J672J452R65N96M67R3q25j825k427k842l416l843l632l020k792
$$ 292634 294364 296036 297488 298453 299049 299516 299609 298784 296959 294532 291690 288274 284431 280799 277779 274987
54007B74987l311m231n041n421n189m376l412k845k768k762k437j851j376j279
$$ 274987 271676 267445 262404 256983 251794 247418 244006 241161 238393 235631 233194 231343 229967 228688
53993B28688j447j575j545j538j690j847j875j909j969j596m61Q11J168M25n54
$$ 228688 227241 225666 224121 222583 220893 219046 217171 215262 213293 211697 211236 212047 213215 213640 213086
53978B13086j067j234j276r70j77O92J184J270J073N81J3j29K51O08N65M66P44
$$ 213086 212019 210785 209509 208539 208362 209054 210238 211508 212581 213162 213175 213046 213297 213905 214470 214936 215680
53961B15680J226J533J703K019K585L386M357N156N475N805P168R643J2005J3352
$$ 215680 216906 218439 220142 222161 224746 228132 232489 237645 243120 248925 256093 265736 277741 291093
53947B91093J4122J4679J3889J0327M464j589o188q984r966r107p060n058l696
$$ 291093 305215 319894 333783 344110 348574 346985 340797 331813 321847 312740 305680 300622 296926
53934B96926k548j204O3Q83J299J463J380J177J146J337J557J835K420L235L959
$$ 296926 294378 293174 293237 294120 295419 296882 298262 299439 300585 301922 303479 305314 307734 310969 314928
53919C14928M591N373O105O261N980O164P188Q229Q286P379O181M983L640K257
$$ 314928 319519 324892 330997 337258 343238 349402 356590 364819 373105 380484 386665 391648 395288 397545
53905C97545J218N86o1j021k064k718k746k341k000k228l138m280m934m790m270
$$ 397545 398763 399349 399288 398267 396203 393485 390739 388398 386398 384170 381032 376752 371818 367028 362758
53890C62758m125m636n426o068o623p300p807p587o674n762n233m651l647k721
$$ 362758 358633 353997 348571 342503 335880 328580 320773 313186 306512 300750 295517 290866 287219 284498
53876B84498k654l361l979l937l452k957k593k335k213k271k464k705k814k587
$$ 284498 281844 278483 274504 270567 267115 264158 261565 259230 257017 254746 252282 249577 246763 244176
53862B44176k044j563j514j882k378k753k808k405j725j252j174j058m61L53P49
$$ 244176 242132 240569 239055 237173 234795 232042 229234 226829 225104 223852 222678 221620 221159 221512 222261
53847B22261N45R8k04j86J76O37O99J88l66m12j56k13p02j204j385j131l11Q75
$$ 222261 222806 222904 222700 222514 222690 223327 224026 224214 223848 223436 223280 223067 222365 221161 219776 218645 218334 219209
53829B19209J608J225J72n25n71m43k60L43J179J388O93p6j10L82P16O14K33j67
$$ 219209 220817 222042 222214 221689 221118 220675 220415 220758 221937 223325 224018 223942 223832 224214 224930 225544 225777 225610
53811B25610j65O18J874K706K718K521K791L339L616L639L866M425N028N440N669
$$ 225610 225445 226063 227937 230643 233361 235882 238673 242012 245628 249267 253133 257558 262586 268026 273695
53796B73695N785N804N622M999L829K534J761J593J463J004N20L44K79k1n88j346
$$ 273695 279480 285284 290906 295905 299734 302268 304029 305622 307085 308089 308609 308953 309232 309211 308623 307277
53780C07277k339l367l841l538l046l090l653m203m415m285l845l274k959l031
$$ 307277 304938 301571 297730 294192 291146 288056 284403 280200 275785 271500 267655 264381 261422 258391
53766B58391l082k776k396k304k215j585n65O9j83j089k037k427j983j144q64
$$ 258391 255309 252533 250137 247833 245618 244033 243468 243537 243354 242265 240228 237801 235818 234674 233810
53751B33810j565k503k691k178j722j518j082l32J68J79J58L99N43L57K61N93
$$ 233810 232245 229742 227051 224873 223151 221633 220551 220219 220387 220566 220724 221123 221666 222023 222284 222877
53735B22877R47Q35N37O38J041J124P30L26K33K46J50O3J31K91N05Q95J440J858
$$ 222877 223824 224659 225196 225834 226875 227999 228729 229055 229288 229534 229684 229747 229878 230169 230674 231569 233009 234867
53717B34867J962J909J812J504R18N20Q10J566K024J883J663J885K295K273J732
$$ 234867 236829 238738 240550 242054 242972 243492 244302 245868 247892 249775 251438 253323 255618 257891 259623
53702B59623J321J669K703L707L991L526L002L103L789M377M327L670K681J544
$$ 259623 260944 262613 265316 269023 273014 276540 279542 282645 286434 290811 295138 298808 301489 303033
53688C03033N35K1n4k84r41j418j033j17M32M35M99P93O71k01j145j348r20n81
$$ 303033 303568 303589 303535 303251 302310 300892 299859 299742 300174 300609 301108 301901 302572 302371 301226 299878 298958 298377
53670B98377o15p18n77j94K46N00L59j06n31p13q71j199j407j066l00L22N30N89
$$ 298377 297762 297044 296467 296273 296519 297019 297378 297272 296741 296028 295157 293958 292551 291485 291185 291507 292037 292626
53652B92626P41P89M94J34K66R13J324Q95R7K6R71J942J968J329R63J088J127
$$ 292626 293367 294156 294650 294784 295050 295963 297287 298182 298279 298305 299276 301218 303186 304515 305478 306566 307693
53635C07693Q68P52R35R69O68N80J103J800K071K030K190K681L338M106M846N123
$$ 307693 308561 309313 310248 311217 311885 312465 313568 315368 317439 319469 321659 324340 327678 331784 336630 341753
53619C41753M789M449M659N018M742L974L644M023M267L677K645J975J790J642
$$ 341753 346542 350991 355650 360668 365410 369384 373028 377051 381318 384995 387640 389615 391405 393047
53605C93047J370J303J667K237K644K784K695K301J521O56L42Q15J432J348N73
$$ 393047 394417 395720 397387 399624 402268 405052 407747 410048 411569 412225 412567 413382 414814 416162 416735
53590D16735m1L0L14J28m80r27r71q59q40r42j197j663k216k620k744k634k400
$$ 416735 416694 416724 417038 417166 416686 415759 414788 413929 413089 412147 410950 409287 407071 404451 401707 399073 396673
53573C96673k243k371k639k551j821p71M8M05L39pk06L65J640K501J986O69j6
$$ 396673 394430 392059 389420 386869 385048 384277 384325 384730 385069 385062 384856 385221 386861 389362 391348 392017 392001
53556C92001L77R42R19N73M01L61L61P13J492K001J652R13P00J091J383J287J318
$$ 392001 392378 393320 394239 394812 395213 395574 395935 396648 398140 400141 401793 402706 403406 404497 405880 407167 408485
53539D08485J834K452K705K847L445M497N464O061O551P124P537P638P918Q991
$$ 408485 410319 412771 415476 418323 421768 426265 431729 437790 444341 451465 459002 466640 474558 483549
53525D83549J0678J2071J2630J2708J2877J3126J3093J2762J2598J3114J4471
$$ 483549 494227 506298 518928 531636 544513 557639 570732 583494 596092 609206 623677
53514F23677J6354J8101J9255K0165K1568K3399K4581K4513K4118K4675K5962
$$ 623677 640031 658132 677387 697552 719120 742519 767100 791613 815731 840406 866368
53503H66368K6553K5820K4641K3970K3683K3213K2473K1648K0682J9625J9010
$$ 866368 892921 918741 943382 967352 991035 1014248 1036721 1058369 1079051 1098676 1117686
53492A117686J9302K0089K0407J9766J8605J7807J7917J8651J9059J8480J7355
$$ 1117686 1136988 1157077 1177484 1197250 1215855 1233662 1251579 1270230 1289289 1307769 1325124
53481A325124J6781J7130J7669J7699J7446J7331J7002J5777J3679J1320Q963
$$ 1325124 1341905 1359035 1376704 1394403 1411849 1429180 1446182 1461959 1475638 1486958 1495921
53470A495921O411L707J225j006l425o282r238j1741j3426j4114j3930j3480j3482
$$ 1495921 1502332 1506039 1507264 1506258 1502833 1496551 1487313 1475572 1462146 1448032 1434102 1420622 1407140
53457A407140j4064j4838j5667j6875j8530k0144k1281k1986k2303k1968k0976
$$ 1407140 1393076 1378238 1362571 1345696 1327166 1307022 1285741 1263755 1241452 1219484 1198508
53446A198508k0001j9681j9802j9716j9241j8521j7227j4763j1287p900n540m199
$$ 1198508 1178507 1158826 1139024 1119308 1100067 1081546 1064319 1049556 1038269 1030369 1024829 1020630
53434A020630l367k672j913r98j61K11L12J040K926N347P269Q482R553J0836J2169
$$ 1020630 1017263 1014591 1012678 1011680 1011519 1011730 1012042 1013082 1016008 1021355 1028624 1037106 1046659 1057495 1069664
53419A069664J3435J4774J6198J7490J8608J9739K0881K1860K2741K3802K5060
$$ 1069664 1083099 1097873 1114071 1131561 1150169 1169908 1190789 1212649 1235390 1259192 1284252
53408A284252K6360K7895K9978L2218L3733L4492L5596L7811M0522M2826M4966
$$ 1284252 1310612 1338507 1368485 1400703 1434436 1468928 1504524 1542335 1582857 1625683 1670649
53397A670649M7747N0942N3331N4240N4237N4252N4730N5676N6850N7715N7809
$$ 1670649 1718396 1769338 1822669 1876909 1931146 1985398 2040128 2095804 2152654 2210369 2268178
53386B268178N7263N6512N5435N3390N0247M6766M3704M1057L8377L5429L2255
$$ 2268178 2325441 2381953 2437388 2490778 2541025 2587791 2631495 2672552 2710929 2746358 2778613
53375B778613K9001K5911K3095K0132J6348J1643O529J153n133j2792k1192k9170
$$ 2778613 2807614 2833525 2856620 2876752 2893100 2904743 2911272 2912425 2907292 2894500 2873308 2844138
53363B844138l6127m2081m7054n0900n3610n5265n5850n5542n4998n4858n5005
$$ 2844138 2808011 2765930 2718876 2667976 2614366 2559101 2503251 2447709 2392711 2337853 2282848
53352B282848n4686n3316n0875m7689m4308m1501l9893l9499l9860m0585m1416
$$ 2282848 2228162 2174846 2123971 2076282 2031974 1990473 1950580 1911081 1871221 1830636 1789220
53341A789220m1923m1592m0326l8458l6220l3553l0534k7562k4955k2585k0109
$$ 1789220 1747297 1705705 1665379 1626921 1590701 1557148 1526614 1499052 1474097 1451512 1431403
53330A431403j7357j4482j1866j0012r310r749j0952j2506j4126j5506j6297j6289
$$ 1431403 1414046 1399564 1387698 1377686 1368376 1358627 1347675 1335169 1321043 1305537 1289240 1272951
53318A272951j5514j4116j2338j0629r436q767q129p073n640m115k570r40O11
$$ 1272951 1257437 1243321 1230983 1220354 1210918 1202151 1194022 1186949 1181309 1177194 1174624 1173684 1174295
53305A174295J741K418L122M342O049P858R618J1510J3495J5099J6039J6874J8498
$$ 1174295 1176036 1178454 1181576 1185918 1191967 1199825 1209443 1220953 1234448 1249547 1265586 1282460 1300958
53292A300958K1035K3620K5411K6376K6923K7219K7139K6575K5445K3720K1676
$$ 1300958 1321993 1345613 1371024 1397400 1424323 1451542 1478681 1505256 1530701 1554421 1576097
53281A576097J9796J8117J6160J3785J1640J0111Q414N509J623k114n273q370
$$ 1576097 1595893 1614010 1630170 1643955 1655595 1665706 1674120 1679629 1681252 1679138 1673865 1665495
53269A665495j1520j4118j6080j8257k1078k3762k5534k6790k8212k9569l0222
$$ 1665495 1653975 1639857 1623777 1605520 1584442 1560680 1535146 1508356 1480144 1450575 1420353
53258A420353l0336l0565l0955l1065l0914l0856l0662k9682k7956k6307k5242
$$ 1420353 1390017 1359452 1328497 1297432 1266518 1235662 1205000 1175318 1147362 1121055 1095813
53247A095813k4470k3614k2771k2239k2246k2967k4185k4970k4436k2894k1558
$$ 1095813 1071343 1047729 1024958 1002719 980473 957506 933321 908351 883915 861021 839463
53236H39463k0971k0518j9615j8427j7081j5114j2368r686p996p228o830o788
$$ 839463 818492 797974 778359 759932 742851 727737 715369 705683 697687 690459 683629 676841
53224F76841p389q355r089r591j0364j1488j2493j3149j3714j4357j4844j4966
$$ 676841 669452 661097 652008 642417 632053 620565 608072 594923 581209 566852 552008 537042
53212E37042j4759j4215j3166j1649j0099r012q532q346p924o996n960n612o243
$$ 537042 522283 508068 494902 483253 473154 464142 455610 447264 439340 432344 426384 420772 414529
53199D14529p242p894q236q700r212r217q479p379o368n611n099m715m264l740
$$ 414529 407287 399393 391157 382457 373245 364028 355549 348170 341802 336191 331092 326377 322113 318373
53185C18373l457l548l596l280l002l204l385k714j545j153j872k567k352j742
$$ 318373 314916 311368 307772 304492 301490 298286 294901 292187 290642 289489 287617 285050 282698 280956
53171B80956j515j433r66n35r18j887k351j843r86n22m97n05k58K24O65P56M52
$$ 280956 279441 278008 277042 276507 275589 273702 271351 269508 268522 268000 267503 266998 266740 266964 267629 268385 268837
53154B68837k8o34j515k433k654j914j013q06j011p78j49N2l30m57N4L90j98j138
$$ 268837 268809 268175 266660 264227 261573 259659 258646 257840 256829 256051 255902 255954 255624 255167 255221 255611 255413 254275
53136B54275j288n21K18K87L9R6N16R53J234J426J527J484J465J739K183K210
$$ 254275 252987 252466 252684 252971 253010 253106 253622 254575 255809 257235 258762 260246 261711 263450 265633 267843
53120B67843J472M01k10q2M41J043J621J892J364J22r24r93l98j22o08j445k017
$$ 267843 269315 269716 269506 269424 269865 270908 272529 274421 275785 275907 274983 273990 273592 273470 272862 271417 269400
53103B69400k050j576q70m28n57r35r40m44J1jk42k38N2K57J75kn5j13m59r99
$$ 269400 267350 265774 264904 264476 263919 262984 262044 261600 261611 261610 261368 261130 261182 261439 261614 261612 261557 261444 260985 259986
53083B59986j176o39J83M89O4n35p92p89p99p57m93j89j90n60j104j627j943j859
$$ 259986 258810 258171 258354 258843 258907 258372 257580 256791 255992 255235 254742 254553 254363 253803 252699 251072 249129 247270
53065B47270j437j005o88k51L03N09J90o9K10N38K47l15k65L66O80L92K50P07
$$ 247270 245833 244828 244140 243889 244192 244701 244891 244822 245032 245570 245817 245502 245237 245603 246283 246675 246925 247632
53047B47632J172R95L98n0k94n50o58k68N05J123J178P13N3m23n26l70j99p7J03
$$ 247632 248804 249799 250197 250147 249853 249303 248645 248377 248882 250005 251183 251896 251949 251526 251000 250630 250431 250354 250457
53028B50457L12L60J36k92p47r31n55K05P13O81O30R90J209O09k66k92M24O06
$$ 250457 250769 251129 251265 250973 250226 249295 248740 248945 249658 250339 250969 251959 253168 253777 253511 253219 253643 254249
53010B54249j08n29J68J189J473J223J143J076M75l89p57n31j52K72P93R14J06
$$ 254249 254141 253612 253780 254969 256442 257665 258808 259884 260359 259970 259213 258682 258530 258802 259595 260509 260615
52993B60615j059j305k39J180J842J523P07k3l04k17k19m71m46L64J531K169K156
$$ 260615 259556 258251 258012 259192 261034 262557 263264 263241 262937 262720 262501 262030 261584 261948 263479 265648 267804
52976B67804K125K376K540K407K245K131J698Q23nl60l56k04J27M80L14n47j382
$$ 267804 269929 272305 274845 277252 279497 281628 283326 284149 284144 283784 283428 283224 283351 283831 284145 283598 282216
52959B82216j332n12J76J34m37j062j544j875j909j490q05m10o93j390j823j708
$$ 282216 280884 280372 280548 280682 280245 279183 277639 275764 273855 272365 271560 271150 270457 269067 267244 265536
52943B65536j446j451j514j159m47Q8J74M8r6l69p38q68o01k53j30n8K50N79M27
$$ 265536 264090 262639 261125 259966 259519 259607 259781 259829 259733 259364 258626 257758 257157 256904 256774 256716 256966 257545 257972
52924B57972k79r79j047m12M00P18K69n62j014o34K94J093J375J290J161J019
$$ 257972 257693 256714 255667 255255 255655 256373 256642 256080 255066 254432 254726 255819 257194 258484 259645 260664
52908B60664O40p1q68j345j278p91k91k42q32j726k208j746m96P81J363J095M66
$$ 260664 261304 261233 260365 259020 257742 256951 256660 256418 255586 253860 251652 249906 249410 250191 251554 252649 253115
52891B53115K49Q94K059K839K726K154J822J603P25r26k321k455j576p60o07p73
$$ 253115 253364 254258 256317 259156 261882 264036 265858 267461 268186 267260 264939 262484 260908 260148 259541 258768
52875B58768o37l9O70J047J012R84J456K357L082L194K780K064J096J36k48J32
$$ 258768 258131 258092 258762 259809 260821 261805 263261 265618 268700 271894 274674 276738 277834 277970 277722 277854
52859B77854O70P20L89J12k26j067k312l311l678l598l413l311l381l476l180
$$ 277854 278524 279244 279633 279745 279519 278452 276140 272829 269151 265553 262140 258829 255448 251972 248792
52844B48792k378j674j627j788j271j33N92K97m83r67r95p42k94J42J79j68l17
$$ 248792 246414 244740 243113 241325 240054 239921 240513 240810 240327 239360 238365 237623 237329 237471 237650 237482 237165
52827B37165J10P34R87Q30N62K51j84o19p94o46l41o0R4J47K91O87J203J547J617
$$ 237165 237275 238009 238996 239826 240388 240639 240455 239836 239042 238396 238055 237995 238089 238236 238527 239214 240417 241964 243581
52808B43581J438Q97jo72m69L19O21n8j080j699j871j785j339o56l90q45j340
$$ 243581 245019 245916 245915 245243 244774 245093 245714 245656 244576 242877 241006 239221 237882 237226 236836 235991 234651
52791B34651j182p16o20o86k07P17J311J364J385J463J033L7o21k95M82Q31O58
$$ 234651 233469 232753 232133 231447 231240 231957 233268 234632 236017 237480 238513 238550 237929 237634 238116 238947 239605
52774B39605M58L58R8l70q10j112j293j124l58O05Q52Mj154j542r98l02j4J95
$$ 239605 240063 240421 240519 240149 239339 238227 236934 235810 235452 236057 236909 236913 235759 234217 233219 232917 232903 233098
52756B33098Q40J675J870J086l5n21K6J151J991J959J249P46J133K018K283J455
$$ 233098 233938 235613 237483 238569 238534 238013 238039 239190 241181 243140 244389 245135 246268 248286 250569 252024
52740B52024L18p2L95J013J263J180R01M69J31K96R91J696J913J663J261Q66M28
$$ 252024 252342 252270 252665 253678 254941 256121 257022 257491 257622 257918 258909 260605 262518 264181 265442 266308 266736
52723B66736j28q35j625k197k157j472o67l33n34q61r98r91r65q76o33l41j45
$$ 266736 266608 265773 264148 261951 259794 258322 257655 257322 256788 255927 254929 253938 252973 252097 251464 251123 250978
52706B50978OK65N62N91K52j00n0L76P61Q09O19M00K27Q5N4K70O83R92Q36K04
$$ 250978 250984 251249 251811 252402 252654 252554 252504 252880 253641 254450 255069 255469 255696 255781 255835 256105 256788 257780 258616 258820
52686B58820l78k88M18Q93M88l61p27n44o64j481k189j890q23J42P66J463K202
$$ 258820 258442 258154 258572 259465 259953 259592 258865 258321 257657 256176 253987 252097 251274 251416 252182 253645 255847
52669B55847K287J388J11p09q87p69o40n92n81l86L26J499K498K743K382K067
$$ 255847 258134 259522 259633 258924 258037 257268 256628 256036 255455 255069 255395 256894 259392 262135 264517 266584
52653B66584K149K436K616K560K159J241j32j474k188k080j505j066j100j395
$$ 266584 268733 271169 273785 276345 278504 279745 279613 278139 275951 273871 272366 271300 270200 268805
52639B68805j392q40j61L5l03o10n30k98j63J56J021K126K746K677K323J873R44
$$ 268805 267413 266573 266412 266447 266144 265534 265004 264706 264543 264699 265720 267846 270592 273269 275592 277465 278409
52622B78409o12k122k819k838k836k898k393j076L25R01O31K28J55K23J19l7J08
$$ 278409 277797 275675 272856 270018 267182 264284 261891 260815 261140 262041 262672 262900 263055 263278 263397 263360 263468
52605B63468O25J195J475J369J005N99M08O03R96J068M78m71j116j081n21J76
$$ 263468 264093 265288 266763 268132 269137 269736 270144 270747 271743 272811 273289 272818 271702 270621 270100 270276
52589B70276O43O53L55L29R95J910K109J312K96j16N2L27N34P19P53N07J59j11
$$ 270276 270919 271572 271927 272256 273251 275161 277270 278582 278878 278762 278814 279141 279675 280394 281147 281654 281813 281702
52571B81702m19p87q73n67l82o96j008o90r8j8l43k80K05K70l56q72o95l30m93
$$ 281702 281283 280496 279623 279056 278674 277978 276970 276280 276182 276164 275821 275541 275746 276016 275660 274788 274093 273763 273270
52552B73270j120j666j827j499o60L00O86L13k40m81n75p19o70k76J24K94N07
$$ 273270 272150 270484 268657 267158 266498 266798 267484 267797 267557 267076 266501 265782 265112 264836 264960 265254 265761
52535B65761R20J176J072R95J162J133P26O20J259J853J436M36R3O93J432J755
$$ 265761 266681 267857 268929 269924 271086 272219 272945 273565 274824 276677 278113 278549 278642 279335 280767 282522
52519B82522J771J496P79K4o0M58Q15Q38J159J949K460K246J925K136K491K208
$$ 282522 284293 285789 286568 286592 286532 286990 287805 288643 289802 291751 294211 296457 298382 300518 303009 305217
52503C05217J259K21o55j616k816m071n064n480n016l676k026q74n64p22p04k63
$$ 305217 306476 306697 306042 304426 301610 297539 292475 286995 281979 278303 276277 275403 274839 274117 273413 273150
52487B73150K84N68P18J126J651J610P67p9p3N00O79K23j90q6L05P46J367K076
$$ 273150 273434 274002 274720 275846 277497 279107 279874 279795 279722 280222 280901 281124 280934 280848 281153 281899 283266 285342
52469B85342K265J583N56K9L51J248K230K840K903K698K593K446J777O23l64q63
$$ 285342 287607 289190 289746 289775 290126 291374 293604 296444 299347 302045 304638 307084 308861 309484 309120 308257
52453C08257j292k028k780l159l258l272l050k543k183k251k311j885j291j098
$$ 308257 306965 304937 302157 298998 295740 292468 289418 286875 284692 282441 280130 278245 276954 275856
52439B75856j047m01P15J227N38n66q76j52P69J005M88j28k36J31M71N11M94O90
$$ 275856 274809 274408 275123 276350 276888 276322 275446 275294 276063 277068 277556 277428 277192 277323 277794 278305 278799 279489
52421B79489R14P77K89j66k68Q0Q65J915K820L315L668M365N412O397P254Q543
$$ 279489 280403 281180 281469 281303 281035 281115 281980 283895 286715 290030 293698 298063 303475 309872 317126 325669
52405C25669J0644J2996J4416J4106J2095Q782M387q59o126j0012j1564j1194
$$ 325669 336313 349309 363725 377831 389926 398708 403095 402236 396110 386098 374534 363340
52393C63340j0232r542q873p632n807l855k145r37n64j055j728j764j096k47O06
$$ 363340 353108 343566 334693 327061 321254 317399 315254 314317 313753 312698 310970 309206 308110 307863 308469
52378C08469J688K712K767J583L65O78K709N106O469O556O093N712N347M463K855
$$ 308469 310157 312869 315636 317219 317584 318262 320971 326077 332546 339102 345195 350907 356254 360717 363572
52363C63572J057q9k85N6M34O80O96K72m49p91k80N97J022R93J205J824K151J736
$$ 363572 364629 364540 364255 364311 364745 365425 366121 366393 365944 365153 364873 365470 366492 367485 368690 370514 372665 374401
52345C74401J083Q81J070J275J629K500L644M390M604M842N456O182O780P540
$$ 374401 375484 376365 377435 378710 380339 382839 386483 390873 395477 400319 405775 411957 418737 426277
52331D26277Q770J0232J1440J2290J3039J3875J4815J5906J7205J8572J9682K0231
$$ 426277 435047 445279 456719 469009 482048 495923 510738 526644 543849 562421 582103 602334
52319F02334K0129J9637J9296J9483J9886J9776J8997J8285J8324J8829J9104
$$ 602334 622463 642100 661396 680879 700765 720541 739538 757823 776147 794976 814080
52308H14080J9146J9565K0433K0966K0529J9449J8508J7936J7331J6336J5086
$$ 814080 833226 852791 873224 894190 914719 934168 952676 970612 987943 1004279 1019365
52297A019365J3955J3015J1799R675O547L131L18j769l778o188q629j0322j0959
$$ 1019365 1033320 1046335 1058134 1067809 1074356 1077487 1077805 1076036 1072258 1066070 1057441 1047119 1036160
52284A036160j0863j0426r687q524p072n772m960m480l757k290r4K327M376N775
$$ 1036160 1025297 1014871 1005184 996660 989588 983816 978856 974376 970619 968329 968235 970562 974938 980713
52270I80713O769P941R549J1091J1762J1532J1341J2001J3187J3967J4070J4073
$$ 980713 987482 995423 1004972 1016063 1027825 1039357 1050698 1062699 1075886 1089853 1103923 1117996
52258A117996J4512J5303J6087J6590J6650J6271J5753J5263J4304J2161Q989
$$ 1117996 1132508 1147811 1163898 1180488 1197138 1213409 1229162 1244425 1258729 1270890 1279879
52247A279879N843L367J035j932n363q362j0361j1532j2353j3179j4102j4904
$$ 1279879 1285722 1289089 1290124 1288192 1282829 1274467 1264106 1252574 1240221 1227042 1212940 1198036
52235A198036j5319j5519j5959j6591j6599j5472j3880j2897j2604j2133j1011
$$ 1198036 1182717 1167198 1151239 1134648 1118049 1102577 1088697 1075800 1063196 1051063 1040052
52224A040052r738q897q370p672o636n460m363l468k744j947q33M49J444K025
$$ 1040052 1030314 1021417 1013047 1005375 998739 993279 988916 985448 982704 980757 979924 980373 981817 983842
52210I83842K612L538M482M835M468L825L367L186L162L225L472M102N146O184
$$ 983842 986454 989992 994474 999309 1003777 1007602 1010969 1014155 1017317 1020542 1024014 1028116 1033262 1039446
52196A039446O528N996N341N458O204O482N639M299L468L230K830J783L19j257
$$ 1039446 1045974 1051970 1057311 1062769 1068973 1075455 1081094 1085393 1088861 1092091 1094921 1096704 1097023 1095766
52182A095766k959m763o309p352q101q871r598r993r915r371q389p161n952m707
$$ 1095766 1092807 1088044 1081735 1074383 1066282 1057411 1047813 1037820 1027905 1018534 1010145 1002984 997032 992325
52168I92325l055j116K44N11N20J482L210M280M033L478L751M482M406L133J579
$$ 992325 989270 988154 988398 988909 989429 990911 994121 998401 1002434 1005912 1009663 1014145 1018551 1021684 1023263
52153A023263P52P81J130J343J393J442J551J631J692J933K390K622K172J232
$$ 1023263 1024015 1024796 1025926 1027269 1028662 1030104 1031655 1033286 1034978 1036911 1039301 1041923 1044095 1045327
52139A045327M76J34j90p13r24k91J045K643M465O664Q972J0899J2532J4552J7365
$$ 1045327 1045803 1045937 1045747 1045034 1044110 1043819 1044864 1047507 1051972 1058636 1067608 1078507 1091039 1105591 1122956
52124A122956K0532K3223K5045K6309K7573K8948K9913K9947K9330K8940K9157
$$ 1122956 1143488 1166711 1191756 1218065 1245638 1274586 1304499 1334446 1363776 1392716 1421873
52113A421873K9338K8637K7019K5097K3203K1146J8719J6030J3279J0650Q424
$$ 1421873 1451211 1479848 1506867 1531964 1555167 1576313 1595032 1611062 1624341 1634991 1643415
52102A643415O960O342O234O078N415M106K350L40k144n551r757j3803j6794j8821
$$ 1643415 1650375 1656717 1662951 1669029 1674444 1678550 1680900 1681240 1679096 1673545 1663788 1649985 1633191 1614370
52088A614370k0610k2351k3403k3183k1847k0023j8107j6114j3969j1753r660
$$ 1614370 1593760 1571409 1548006 1524823 1502976 1482953 1464846 1448732 1434763 1423010 1413350
52077A413350p731n706l299o62J648L359M903O918R482J2095J4224J5632J6337
$$ 1413350 1405619 1399913 1396614 1395952 1397600 1400959 1405862 1412780 1422262 1434357 1448581 1464213 1480550
$$ [...]
##END NTUPLES=NMR SPECTRUM
##END=
