##TITLE=AC1719_BRAAN15005_9207238_U6kIEr0Urk
##JCAMPDX= 6.0         $$ Bruker NMR JCAMP-DX V2.0
##DATA TYPE= NMR SPECTRUM
##DATA CLASS= NTUPLES
##ORIGIN= BRUKER
##OWNER= Administrator
$$ 1.72 TOPSPIN		Version 2.1
$$ 2015-06-01 21:39:49.561 -0700  Administrator@X
$$ Compression mode = diff/dup
##.OBSERVE FREQUENCY= 400.02188249412
##.OBSERVE NUCLEUS= ^1H
##.ACQUISITION MODE= SIMULTANEOUS (DQD)
##.ACQUISITION SCHEME= undefined
##.AVERAGES= 8
##.DIGITISER RES= 22
##SPECTROMETER/DATA SYSTEM= spect
##.PULSE SEQUENCE= zg30
##.SOLVENT NAME= COFFEE_meoh
##.SHIFT REFERENCE= INTERNAL, COFFEE_meoh, 1, 14.98509
##AUDIT TRAIL= $$ (NUMBER, WHEN, WHO, WHERE, PROCESS, VERSION, WHAT)
$$ ##TITLE= Audit trail, TOPSPIN		Version 2.1
$$ ##JCAMPDX= 5.01
$$ ##ORIGIN= Bruker BioSpin GmbH
$$ ##OWNER= Administrator
$$ $$ E:\/data/COFFEE/nmr/AC1719_BRAAN15005_9207238_U6kIEr0Urk/10/pdata/1/auditp.txt
$$ ##AUDIT TRAIL=  $$ (NUMBER, WHEN, WHO, WHERE, PROCESS, VERSION, WHAT)
(   1,<2015-06-01 21:39:42.451 -0700>,<Administrator>,<X>,<go>,<TOPSPIN 2.1>,
      <created by zg
	started at 2015-06-01 21:38:35.233 -0700,
	POWCHK enabled, PULCHK disabled,
       configuration hash MD5:
       21 0F 79 D6 B3 7B B4 F6 88 20 88 DB 03 48 BD 9F
       data hash MD5: 64K
       C1 01 56 87 EC 64 F0 95 A4 F6 9E 05 26 47 54 E2>)
(   2,<2015-06-01 21:39:45.514 -0700>,<Administrator>,<X>,<proc1d>,<TOPSPIN 2.1>,
      <Start of raw data processing
       efp LB = 0 FT_mod = 6 PKNL = 1 PHC0 = 0 PHC1 = 0 SI = 32K 
       data hash MD5: 32K
       95 97 A1 71 E3 C9 66 85 FC 81 67 9A BD 6E D5 BF>)
(   3,<2015-06-01 21:39:45.795 -0700>,<Administrator>,<X>,<proc1d>,<TOPSPIN 2.1>,
      <pk PHC0 = 89.76929 PHC1 = 0 
       data hash MD5: 32K
       3A B2 59 8E 31 37 3E BF EC 94 5A 16 EE FC 66 22>)
(   4,<2015-06-01 21:39:45.905 -0700>,<Administrator>,<X>,<proc1d>,<TOPSPIN 2.1>,
      <abs ABSG = 1 
       data hash MD5: 32K
       20 3B 06 32 00 88 B7 EA 3B C0 95 41 77 A5 2F 1C>)
(   5,<2015-06-01 21:39:45.967 -0700>,<Administrator>,<X>,<proc1d>,<TOPSPIN 2.1>,
      <abs ABSG = 2 
       data hash MD5: 32K
       7B 78 BB DE 53 EC 36 D6 93 48 24 F9 FC 2B FB 25>)
(   6,<2015-06-01 21:39:46.030 -0700>,<Administrator>,<X>,<proc1d>,<TOPSPIN 2.1>,
      <abs ABSG = 3 
       data hash MD5: 32K
       7F F4 F8 E3 3C F2 1F B8 C1 A1 C9 94 6A C5 46 9F>)
(   7,<2015-06-01 21:39:46.092 -0700>,<Administrator>,<X>,<proc1d>,<TOPSPIN 2.1>,
      <abs ABSG = 4 
       data hash MD5: 32K
       B7 99 98 AB 50 9E 36 1B DE 33 74 D3 6E 36 0B 16>)
(   8,<2015-06-01 21:39:46.155 -0700>,<Administrator>,<X>,<proc1d>,<TOPSPIN 2.1>,
      <abs ABSG = 5 
       data hash MD5: 32K
       C2 D7 73 9F C0 B8 20 FD D0 11 A7 7B 08 EF CE F2>)
$$ ##END=
$$ 
$$ $$ hash MD5
$$ $$ C0 D4 7E A6 3B D9 B5 95 50 FF F0 25 88 AF 1C D1
##$RELAX= 
##$RELAX= 
##$RELAX= 
##$RELAX= 
##$RELAX= 
##$RELAX= 
##$RELAX= 
$$ Bruker specific parameters
$$ --------------------------
##$DU= <E:\>
##$EXPNO= 10
##$NAME= <AC1719_BRAAN15005_9207238_U6kIEr0Urk>
$$ [...]
##$TP= (0..7)
150 150 150 150 150 150 150 150
##$TP07= 0
##$TPNAME0= <>
##$TPNAME1= <>
##$TPNAME2= <>
##$TPNAME3= <>
##$TPNAME4= <>
##$TPNAME5= <>
##$TPNAME6= <>
##$TPNAME7= <>
##$TPOAL= (0..7)
0.5 0.5 0.5 0.5 0.5 0.5 0.5 0.5
##$TPOFFS= (0..7)
0 0 0 0 0 0 0 0
##$TUNHIN= 0
##$TUNHOUT= 0
##$TUNXOUT= 0
##$USERA1= <user>
##$USERA2= <user>
##$USERA3= <user>
##$USERA4= <user>
##$USERA5= <user>
##$V9= 5
##$VALIST= <valist>
##$VCLIST= <CCCCCCCCCCCCCCC>
##$VD= 0
##$VDLIST= <DDDDDDDDDDDDDDD>
##$VPLIST= <PPPPPPPPPPPPPPP>
##$VTLIST= <TTTTTTTTTTTTTTT>
##$WBST= 2048
##$WBSW= 25
##$XGAIN= (0..3)
0 0 0 0
##$XL= 0
##$YL= 0
##$YMAX_a= 589321
##$YMIN_a= -507920
##$ZGOPTNS= <>
##$ZL1= 120
##$ZL2= 120
##$ZL3= 120
##$ZL4= 120
##$ABSF1= 14.98509
##$ABSF2= -5.573092
##$ABSG= 5
##$ABSL= 3
##$ALPHA= 0
##$AQORDER= 0
##$ASSFAC= 0
##$ASSFACI= 0
##$ASSFACX= 0
##$ASSWID= 0
##$AUNMP= <proc_prof1d_extract_pilot.lims>
##$AXLEFT= 0
##$AXNAME= <>
##$AXNUC= <1H>
##$AXRIGHT= 0
##$AXTYPE= 0
##$AXUNIT= <>
##$AZFE= 0.1
##$AZFW= 0.1
##$BCFW= 0
##$BC_mod= 0
##$BYTORDP= 0
##$COROFFS= 0
##$CY= 15
##$DATMOD= 1
##$DC= 0
##$DFILT= <>
##$DTYPP= 0
##$F1P= 0
##$F2P= 0
##$FCOR= 0.5
##$FTSIZE= 32768
##$FT_mod= 6
##$GAMMA= 0
##$GB= 0
##$INTBC= 1
##$INTSCL= 1
##$ISEN= 128
##$LB= 0
##$LEV0= 0
##$LPBIN= 0
##$MAXI= 10000
##$MC2= 0
##$MEAN= 0
##$ME_mod= 0
##$MI= 0
##$NCOEF= 0
##$NC_proc= -8
##$NLEV= 6
##$NOISF1= 0
##$NOISF2= 0
##$NSP= 0
##$NTH_PI= 0
##$NZP= 0
##$OFFSET= 14.98509
##$PC= 1
##$PHC0= 89.76929
##$PHC1= 0
##$PH_mod= 1
##$PKNL= yes
##$PPARMOD= 0
##$PPDIAG= 0
##$PPIPTYP= 0
##$PPMPNUM= 2147483647
##$PPRESOL= 1
##$PSCAL= 4
##$PSIGN= 0
##$PYNMP= <proc.py>
##$REVERSE= no
##$SF= 400.02
##$SI= 32768
##$SIGF1= 0
##$SIGF2= 0
##$SINO= 400
##$SIOLD= 32768
##$SPECTYP= <>
##$SREGLST= <1H.CDCl3>
##$SSB= 0
##$STSI= 32768
##$STSR= 0
##$SW_p= 8223.68421052631
##$SYMM= 0
##$S_DEV= 0
##$TDeff= 65536
##$TDoff= 0
##$TI= <>
##$TILT= no
##$TM1= 0
##$TM2= 0
##$TOPLEV= 0
##$USERP1= <user>
##$USERP2= <user>
##$USERP3= <user>
##$USERP4= <user>
##$USERP5= <user>
##$WDW= 1
##$XDIM= 32768
##$YMAX_p= 435333061
##$YMIN_p= -740558
##$CURPLOT= <Network HP LaserJet P1505>
##$CURPRIN= <$Network HP LaserJet P1505>
##$DFORMAT= <normdp>
##$LAYOUT= <+/1D_H.xwp>
##$LFORMAT= <normlp>
##$PFORMAT= <normpl>
##$SURQMSG= 1
$$ End of Bruker specific parameters
$$ ---------------------------------
##NTUPLES= NMR SPECTRUM
##VAR_NAME=  FREQUENCY,     SPECTRUM/REAL,   SPECTRUM/IMAG
##SYMBOL=    X,             R,               I
##VAR_TYPE=  INDEPENDENT,   DEPENDENT,       DEPENDENT
##VAR_FORM=  AFFN,          ASDF,            ASDF
##VAR_DIM=   32768,         32768,           32768
##UNITS=     HZ,            ARBITRARY UNITS, ARBITRARY UNITS
##FACTOR=    0.250966925370066, 1,           1
##FIRST=     8223.43324360094, -159264,      -18034
##LAST=      0,             -94841,          34274
##MIN=       0,             -740558,         0
##MAX=       8223.43324360094, 435333061,    0
$$ Real data points
##PAGE= N=1
##DATA TABLE= (X++(R..R)), XYDATA
$$ [...]
19555H5783J07046a45107k01799J72549H1650a02541b9076A9506b87925a28076
$$ 85783 192829 -145107 -346906 -174357 81650 -102541 -29076 19506 -287925 -128076
19544a58275C1716K62568a90422M5559M5306l2907c938j61494g6531A53040b20118
$$ -158275 31716 294284 -190422 -144863 -99557 -132464 -3938 -165432 -76531 153040 -220118
19532b06968g448D495N273J63061d8422B66241c1569j98887a2613A1793L9444
$$ -206968 -7448 4495 9768 172829 -48422 266241 -31569 -230456 -12613 11793 51237
19521E1237a42799g46k01838A04606e1514A7462a04179A04930M5P1997A9325J59585
$$ 51237 -142799 -746 -202584 104606 -51514 17462 -104179 104930 104975 176972 19325 178910
19509A78910D4961b21180I457J00721l1723Q1336a07204j5675H8268a52059k76116
$$ 178910 44961 -221180 9457 110178 78455 159791 -107204 -122879 88268 -152059 -428175
19498d28175P7226a25288G666a91607N9434q7492A34628a62322d3365l1923j90984
$$ -428175 -350949 -125288 7666 -191607 -132173 -219665 134628 -162322 -43365 -75288 -266272
19487b66272Q8067m2083A62915l8373o0930b10483e7806J0100k33703A07178J24177
$$ -266272 -178205 -220288 162915 124542 63612 -210483 -57806 -47706 -281409 107178 231355
19476B31355b39205R9528A20558P2626J07999g6142k81512a53434B6330a66580
$$ 231355 -239205 -139677 120558 193184 301183 -76142 -357654 -153434 26330 -166580
19465a21849D2661a05608j0623K6545A3508M5096c6299B3910Q8560h7824C1095
$$ -121849 42661 -105608 -116231 -89686 13508 58604 -36299 23910 112470 -87824 31095
19453e1154j5779j27873R4645F8292r813j4238K84615c40856J69898H202a44889
$$ -51154 -66933 -194806 -100161 68292 58479 44241 328856 -340856 -170958 8202 -144889
19441C06881a69699B7097e7006A77697a11993m03417B69725D4168b68885D6854
$$ 306881 -169699 27097 -57006 177697 -111993 -515410 269725 44168 -268885 46854
19430A98512L6018B7966b9441B00212b7358B65912o4550a29620f2643j637G9920
$$ 198512 234530 27966 -29441 200212 -27358 265912 201362 -129620 -62643 -64280 79920
19418b83905H0414e9167B25824c0770j38256H015a55101o8060J3455P4816G0947
$$ -283905 80414 -59167 225824 -30770 -169026 8015 -155101 -223161 -209706 -134890 70947
19406I0152h8341b002j40902I267c82641g047m99981B86020a94567j8464f916
$$ 90152 -88341 -2002 -142904 9267 -382641 -7047 -507028 286020 -194567 -213031 -6916
19394I5538B0784b45745C8322a35754L7449P08K4068j07759g8461E2565J4396
$$ 95538 20784 -245745 38322 -135754 -98305 -97597 -73529 -181288 -78461 52565 66961
19383F6961a70795r5439K0032A30268L9630K9653b44312f2756C03769E9334i4725
$$ 66961 -170795 -266234 -246202 130268 169898 199551 -244312 -62756 303769 59334 -94725
19371a0380j05733a4629G7346e1102j72534B90125j16574a76667A65119m7868
$$ -10380 -116113 -14629 77346 -51102 -223636 290125 173551 -176667 165119 117251
19361A17251b40476R9801B6743b19809n52A90902a87059k04165a75194A84403
$$ 117251 -240476 -140675 26743 -219809 -220361 190902 -187059 -391224 -175194 184403
19350f9300A42657A3519K5261b47786K4557D4831j4241P8373A1127R7439a49215
$$ -69300 142657 13519 38780 -247786 -223229 44831 30590 108963 11127 108566 -149215
19338f6839j45965A73357h6250o7789A39699F3944a46745a6354A57759d17245
$$ -66839 -212804 173357 -86250 -154039 139699 63944 -146745 -16354 157759 -417245
19327f9648K8651q3142j42814m8571g2345l30966d8114A41039n6458l7118a15056
$$ -69648 -40997 -124139 -266953 -315524 -72345 -403311 -48114 141039 84581 47463 -115056
19315f6329D1924J97433b17762j14154a53420A88038E7358R2810a36725f466D3344
$$ -66329 41924 239357 -217762 -331916 -153420 188038 57358 150168 -136725 -6466 43344
19303b52223R2483j9840c9892E9828b55436a19774n3538G304c09359i1652a7341
$$ -252223 -159740 -179580 -39892 59828 -255436 -119774 -173312 7304 -309359 -91652 -17341
19291A04058M5718a99941e0804k95887J37548R3677C3235R0008b8216l45962J41690
$$ 104058 149776 -199941 -50804 -346691 -209143 -115466 33235 123243 -28216 -374178 -232488
19280b32488L1691j79629d4693j9417c0020j01248l2043b0570p1974k26633A23704
$$ -232488 -200797 -380426 -44693 -64110 -30020 -131268 -163311 -20570 -92544 -319177 123704
19268G0134M9718a78602M5342l7756n2843C90443H2368i1956J503k8305o548j25314
$$ 70134 119852 -178602 -133260 -171016 -223859 390443 82368 -91956 -90453 -118758 -125306 -250620
19256b50620d7781j1610k86821a241n10514A33359a90576E342M1129O5919a03944
$$ -250620 -47781 -59391 -346212 -1241 -511755 133359 -190576 5342 46471 112390 -103944
19244a19503R43A46861J4819a44945A3562c8965B26162g7780j20038n9131a14981
$$ -119503 -118560 146861 161680 -144945 13562 -38965 226162 -77780 -197818 -256949 -114981
19232E2367a86513b5489j19017k06411I3839b14878R0911q0367Q4303j27477a0970
$$ 52367 -186513 -25489 -144506 -350917 93839 -214878 -123967 -204334 -120031 -247508 -10970
19220A52647K18798c9042I9855a79977i704j88524D6855O9431a24365M1232B10736
$$ 152647 371445 -39042 99855 -179977 -9704 -198228 46855 116286 -124365 -83133 210736
19208F1527J38079C8527K81131A47731n9931j4547a31698j40531I0366J6974a81325
$$ 61527 199606 38527 319658 147731 87800 73253 -131698 -272229 90366 107340 -181325
19196B44076a14571d9672A63084a27263B50009B0782h4487l2075j24062A22746
$$ 244076 -114571 -49672 163084 -127263 250009 20782 -84487 -116562 -240624 122746
19185b31220l6473A20490b52081i408j68057A76351e9070p94A68092o2567i3974
$$ -231220 -267693 120490 -252081 -9408 -177465 176351 -59070 -59864 168092 105525 -93974
19173a96915P1455A87557a88863k83491b13928O3740o5143A78178L0965D5408
$$ -196915 -125460 187557 -188863 -472354 -213928 -150188 -215331 178178 209143 45408
19162a32705A34639b26713A01424J39220B9192O9958k1341a91646d2315k35824
$$ -132705 134639 -226713 101424 240644 29192 99150 77809 -191646 -42315 -278139
19152b78139j06271a05450G2305b31308P3946K3644a6828I1238N8552d8021A5218
$$ -278139 -384410 -105450 72305 -231308 -157362 -133718 -16828 91238 149790 -48021 15218
19140d8332A64327G4308M2420b1311e952A34105L4028c5691e612j34203p3226
$$ -48332 164327 74308 116728 -21311 -5952 134105 168133 -35691 -5612 -139815 -213041
19129b13041j16334J9173A20607a12527A13867a26171j29629A38726E2698R1238
$$ -213041 -329375 -310202 120607 -112527 113867 -126171 -255800 138726 52698 143936
19119A43936a82845H2686Q7544P6814e26455A06455a06483l5036B6626j2562O2755
$$ 143936 -182845 82686 170230 247044 -526455 106455 -106483 -141519 26626 14064 76819
19108G6819k9673c4844k16396F6268c3144C51619b72101a7546k80970f6190j14824
$$ 76819 47146 -34844 -251240 66268 -33144 351619 -272101 -17546 -298516 -66190 -181014
19097a81014A15565f3943j84807R8869o9514a5076j72782d6810C90491b82102
$$ -181014 115565 -63943 -248750 -149881 -219395 -15076 -187858 -46810 390491 -282102
19086a0567j13302F9853L4173m0922B8876a56203J6224N2085O467E2403a6215
$$ -10567 -123869 69853 104026 63104 28876 -156203 -139979 -87894 -81427 52403 -16215
19074a9041A06134D8657A1636e1367j13888e7536K3650a5943k52100J05654A49984
$$ -19041 106134 48657 11636 -51367 -165255 -57536 -33886 -15943 -268043 -162389 149984
19062a03551j47592P9859b3666j37482M4863B28289a94132A95930b94079a04469
$$ -103551 -251143 -171284 -23666 -161148 -116285 228289 -194132 195930 -294079 -104469
19051e743C03120H0797b13883B2441e5506c455I3413a21754j6931H5310a19592
$$ -5743 303120 80797 -213883 22441 -55506 -3455 93413 -121754 -138685 85310 -119592
19039I4107a36517B33025J25266D2831K70279H4997c2291E3996K75J9564K91756
$$ 94107 -136517 233025 358291 42831 313110 84997 -32291 53996 54271 73835 365591
19028C65591b20671A38313a55301L9756A78013d8856A60263i9034j47104M4978
$$ 365591 -220671 138313 -155301 -115545 178013 -48856 160263 -99034 -246138 -201160
19018b01160C1130N0606K1662O6740b6996k00379c3761B8343J86139a00692j89187
$$ -201160 31130 81736 103398 170138 -26996 -227375 -33761 28343 214482 -100692 -289879
19007b89879l406A05752c20404A63742a37301O2519G2568g1482A03264N1118J10524
$$ -289879 -293285 105752 -320404 163742 -137301 -74782 72568 -71482 103264 154382 264906
18996B64906a57599O9992B60910b24798B2065N6653b07556o9413J30391C28318
$$ 264906 -157599 -87607 260910 -224798 22065 78718 -207556 -276969 -146578 328318
18985b51273C6663L7986a3583D7436b4647m1493A19640b25736c8765H8797a58960
$$ -251273 36663 74649 -13583 47436 -24647 -66140 119640 -225736 -38765 88797 -158960
18973B25080M9291h6782D1802d980q3328F6165a53867l3754A028f3824a6528o4724
$$ 225080 274371 -86782 41802 -4980 -88308 66165 -153867 -187621 1028 -63824 -16528 -81252
18961h1252p568B84921a33870N748l3935f5629o1104A96926d6044n8124d3647
$$ -81252 -88820 284921 -133870 -128122 -162057 -65629 -126733 196926 -46044 -104168 -43647
18949B58556C0180b08882j70495a50107A70906a16646d7993A9603a74496P7921
$$ 258556 30180 -208882 -379377 -150107 170906 -116646 -47993 19603 -174496 -96575
18939i6575d8145n6889L0867j26579R8119G618a39020B7182c42253A3984K49b43377
$$ -96575 -48145 -105034 -74167 -200746 -102627 7618 -139020 27182 -342253 13984 14233 -243377
18926a76210H4757b5814j55247Q1412B01058D0859h0947p9635A1732a58654j9014
$$ -176210 84757 -25814 -181061 -99649 201058 40859 -80947 -160582 11732 -158654 -177668
18915a77668B03620c87291E8374J5058e1370D13172h1537b2957A87656a24554
$$ -177668 203620 -387291 58374 73432 -51370 413172 -81537 -22957 187656 -124554
18904h9512j37993N8408L2999N0628k9374D0080b72271g0261B47093a35460r1703
$$ -89512 -227505 -169097 -136098 -85470 -114844 40080 -272271 -70261 247093 -135460 -227163
18893b27163B5680f3587I6935d8916C7536g0935E5098b38954R9457j59826B67461
$$ -227163 25680 -63587 96935 -48916 37536 -70935 55098 -238954 -139497 -299323 267461
18881a57788j09893J08501c8857B27055F4029J4265K1974m808a8913F8173a00897
$$ -157788 -267681 -159180 -38857 227055 64029 78294 100268 95460 -18913 68173 -100897
18869A21443b43122C2048h0065k13776a35746A1645c00480G1676N9642A9118d294
$$ 121443 -243122 32048 -80065 -293841 -135746 11645 -300480 71676 131318 19118 -4294
18857A4956R5875b56826J23676I0582a70436H2120K29309a97317C4242a54186
$$ 14956 110831 -256826 -133150 90582 -170436 82120 311429 -197317 34242 -154186
18846A01776c87230e0510k2549B4560a14000e250j90186B13644E4522c70029O9323
$$ 101776 -387230 -50510 -73059 24560 -114000 -5250 -195436 213644 54522 -370029 -300706
18835c00706O2790O0021D5884j3638b43772p054f0830G8657f7567j6686E54L929
$$ -300706 -237916 -177895 45884 32246 -243772 -250826 -60830 78657 -67567 -84253 554 4483
18823D483b26706e466j94966B72739a50642f2435C82489G450a8942m0213B46527
$$ 4483 -226706 -5466 -200432 272739 -150642 -62435 382489 7450 -18942 -59155 246527
18811f6359C78197N5325d084B07216b7449l09G781c8828L683k88630A13093A4401
$$ -66359 378197 433522 -4084 207216 -27449 -27758 7781 -38828 -35145 -323775 113093 14401
18798g1030A34952a32132j05134A6541c0699q0564b6080r1449B18030b33608P2185
$$ -71030 134952 -132132 -237266 16541 -30699 -111263 -26080 -117529 218030 -233608 -161423
18787a61423k130a0247j82419G8527E147c30634A26787a59074B49467c55772a62049
$$ -161423 -163553 -10247 -192666 78527 5147 -330634 126787 -159074 249467 -355772 -162049
18775C12248d3155J7498A46439f3850k21663c7858j43174K0111j92676a52491
$$ 312248 -43155 -25657 146439 -63850 -285513 -37858 -181032 -160921 -353597 -152491
18764C6150a26495A85198a79986q6935J18940k67986A05902c30084R3202k348
$$ 36150 -126495 185198 -179986 -266921 -147981 -415967 105902 -330084 -236882 -239230
18754b39230A0373c5279A17219A9972b56412m9917a14977M9299B50557h4370D12906
$$ -239230 10373 -35279 117219 19972 -256412 -306329 -114977 -65678 250557 -84370 412906
18742A23J96774D7040f6526n2749N6814n935J54I9937l9459L04548b49589R7655
$$ 123 196897 47040 -66526 -119275 -62461 -68396 -68242 99937 60478 365026 -249589 -151934
18730a51934j22810C4759i8308B263b56469b7331l75056I2171c6309a0926j41932
$$ -151934 -274744 34759 -98308 2263 -256469 -27331 -402387 92171 -36309 -10926 -152858
18719a52858K5522J1079k00485C1295a98982C1105O4336j2171M6434a87904B05856
$$ -152858 -127336 -116257 -316742 31295 -198982 31105 95441 83270 129704 -187904 205856
18707a33021r5230A34506d625l15000i962k30883Q8312N8776c9026a3657j9489
$$ -133021 -228251 134506 -4625 -319625 -9962 -240845 -152533 -93757 -39026 -13657 -33146
18696c3146g885j02756l4608N313A06169l8586J04475a66046b7587j28192k3031
$$ -33146 -7885 -110641 -145249 -139936 106169 67583 172058 -166046 -27587 -155779 -178810
18685a78810f7192q0273A60673j7349A9521b92359h9716A74729K5037c07249B994
$$ -178810 -67192 -147465 160673 143324 19521 -292359 -89716 174729 199766 -307249 2994
18673h9544C81637h7569j76037C03625A14745b62895J14447d5669G7297c6038
$$ -89544 381637 -87569 -263606 303625 114745 -262895 -148448 -45669 77297 -36038
18662a8427D4676c14111a31287j75158a22656A1842a7726j4069j70801P6685k08990
$$ -18427 44676 -314111 -131287 -306445 -122656 11842 -17726 -31795 -202596 -125911 -334901
18651c34901A20516c6671m0522j70748h3732C5196n687R1625f0380A55436J7059
$$ -334901 120516 -36671 -77193 -247941 -83732 35196 29509 121134 -60380 155436 172495
18640A72495n011r744d2700r0494P193J5152C7963b76893N1054d1391n467A85167
$$ 172495 167484 157740 -42700 -133194 -126001 -110849 37963 -276893 -225839 -41391 -46858 185167
18627a01874b1387Q283l06282L4000d5602p1750A10904a91311B19919B5339b93236
$$ -101874 -21387 -13104 -319386 -285386 -45602 -117352 110904 -191311 219919 25339 -293236
18615a58712B4627J0896L86049H191b30180K4347a7608k21254O0590C086b47101
$$ -158712 24627 35523 421572 8191 -230180 -205833 -17608 -238862 -178272 3086 -247101
18603b6424Q527j65236n6888b1461H0089O601b7968j96188a12067r7451R2610
$$ -26424 -17897 -183133 -240021 -21461 80089 86690 -27968 -224156 -112067 -209518 -116908
18592a16908k09735f9390A0677f8571j20149D6195d4401j71018A08277b38485
$$ -116908 -326643 -69390 10677 -68571 -188720 46195 -44401 -215419 108277 -238485
18581b86003J00611B56372A21099m0021a10766A19374E8722b03892N5490B5303
$$ -286003 -185392 256372 121099 81078 -110766 119374 58722 -203892 -148402 25303
18570F2528a1366A5966J36573J62210h563m04901d3699Q962d675p8492A2627K7704
$$ 62528 -11366 15966 152539 314749 -8563 -413464 -43699 -34737 -4675 -83167 12627 40331
18558D0331b14161D12017j70943I89a88358H9014a20679k6467a4268j9373j01135
$$ 40331 -214161 412017 241074 989 -188358 89014 -120679 -147146 -14268 -33641 -134776
18547a34776k32334d0300G7913b05686A06655c08451a43979m7236M8625k05844
$$ -134776 -367110 -40300 77913 -205686 106655 -308451 -143979 -191215 -142590 -348434
18537c48434B49011E0335f1336B24224b94206A07838i7596k7103j73022d9754
$$ -348434 249011 50335 -61336 224224 -294206 107838 -97596 -124699 -297721 -49754
18526f8338H8408A8597K4591h1587L8158p4363A2003c29025A333a16737I1508
$$ -68338 88408 18597 43188 -81587 -43429 -117792 12003 -329025 1333 -116737 91508
18514d3396p0242A33022l653l7546M5511a5382H6191c03689g2926B33780e06741
$$ -43396 -113638 133022 129369 91823 137334 -15382 86191 -303689 -72926 233780 -506741
18502A67906a41338e7844j4952B43585b30032d4826B31922a32919j521C28976
$$ 167906 -141338 -57844 -72796 243585 -230032 -44826 231922 -132919 -134440 328976
18491a26049j0562n4328R2598r3992e9216q4330n1051A63143C3461g40558I5014
$$ -126049 -136611 -190939 -98341 -192333 -59216 -143546 -194597 163143 33461 -740558 95014
18479A29015f6051K2869H7665B7453P1167L10269a52800A10643c8544A48443a38258
$$ 129015 -66051 -43182 87665 27453 98620 408889 -152800 110643 -38544 148443 -138258
18467B40009a75692I0365N1406c8639m05870B1719c69529a55546d7864e941C2981
$$ 240009 -175692 90365 141771 -38639 -444509 21719 -369529 -155546 -47864 -5941 32981
18455b57799e8866j66227B6445e3398o4590b0868E9517L7816q460a87389f1244
$$ -257799 -58866 -225093 26445 -53398 -117988 -20868 59517 97333 88873 -187389 -61244
18443e6158m6373c9607k63014A33453n521l4446g2030B58205b33201i3352M0412
$$ -56158 -102531 -39607 -302621 133453 127932 93486 -72030 258205 -233201 -93352 -52940
18432e2940p6964A30537G750f4758j19884B1102b48383A6055c22p5850k6371a3722
$$ -52940 -129904 130537 7750 -64758 -184642 21102 -248383 16055 -322 -76172 -102543 -13722
18419e8852k7562p0030M266l16292A58613d7153p2490a8061l16464h9971B1293
$$ -58852 -86414 -156444 -152178 -468470 158613 -47153 -119643 -18061 -334525 -89971 21293
18407C64164e2522A61517A0940O6152a69622F8729j4241K3089a37225q100F8567
$$ 364164 -52522 161517 10940 77092 -169622 68729 54488 77577 -137225 -145325 68567
18395c793j0996A14965a55704N3003c5689l9466b5479R592j62293A45810a19047
$$ -3793 -14789 114965 -155704 -102701 -35689 -75155 -25479 -15887 -178180 145810 -119047
18383a60989d6695j7562j63403e4583F4944g3713C43346a64850C7731J49668a98766
$$ -160989 -46695 -64257 -227660 -54583 64944 -73713 343346 -164850 37731 187399 -198766
18371d3624F7714k7458J33577C6027L90311a2720q4350B79361a31838A78821a48599
$$ -43624 67714 40256 173833 36027 426338 -12720 -97070 279361 -131838 178821 -148599
18359B98952A6942a84565A11091L7115O2925d4845A18565b3031j35187L0885N8922
$$ 298952 16942 -184565 111091 148206 211131 -44845 118565 -23031 -158218 -127333 -68411
18348f8411B18936D782a66084H3507a42140B83792a15580C214a34276l6022C8645
$$ -68411 218936 4782 -166084 83507 -142140 283792 -115580 3214 -134276 -170298 38645
18336A83866b035B47405I2336d0493G697J2838i4593p5869a262A51847b370H4225
$$ 183866 -2035 247405 92336 -40493 7697 20535 -94593 -170462 -1262 151847 -2370 84225
18323A49978a34215B08120c2601C54211a4570e193k88782F055b79582a14625i59
$$ 149978 -134215 208120 -32601 354211 -14570 -5193 -293975 6055 -279582 -114625 -959
18311f26912a70638B48070b96862B29305H0867L6581J0291c2029K306A49918b52463
$$ -626912 -170638 248070 -296862 229305 80867 117448 127739 -32029 -29723 149918 -252463
18299A49479c85128N6463o4919a60160n4262N5735B48333F1554K23019a17565
$$ 149479 -385128 -328665 -393584 -160160 -214422 -158687 248333 61554 284573 -117565
18288g4626k15096J1045c8248k50216C40620r3761F3756c43190G7807a54516j54811
$$ -74626 -289722 -278677 -38248 -288464 340620 246859 63756 -343190 77807 -154516 -309327
18277c09327A35215a73993B9436J00348e1410C5546M9996J98867D551L8490a04840
$$ -309327 135215 -173993 29436 129784 -51410 35546 85542 284409 4551 43041 -104840
18265a7853j32377o8002A4488M8790b08475C08792j24292d71533d9872r0634p6500
$$ -17853 -150230 -218232 14488 63278 -208475 308792 184500 -471533 -49872 -140506 -217006
18254b17006H6839n402b07104b0972k1529A0116O0587b42960h5414H977R4742
$$ -217006 86839 81437 -207104 -20972 -42501 10116 70703 -242960 -85414 8977 103719
18243A03719c0340j84046J03415B7228K02618j8051o3344a08159B25314q8792
$$ 103719 -30340 -214386 -110971 27228 229846 211795 148451 -108159 225314 136522
18233A36522D6548c04297a15032A57913a8737A65237n4729A5847J13898F1273
$$ 136522 46548 -304297 -115032 157913 -18737 165237 110508 15847 129745 61273
18222c78515C6148C174b94060d2064K353E2314a3424D5856d5051J3272m22558
$$ -378515 36148 3174 -294060 -42064 -39711 52314 -13424 45856 -45051 -31779 -454337
18211d54337a94838A00122h5713B31746e8540I8427O9317b17570A1751a84944
$$ -454337 -194838 100122 -85713 231746 -58540 98427 167744 -217570 11751 -184944
18200f2030q9071d4218G3960b27869C8274J46829a800E131J49954d77602a6882
$$ -62030 -151101 -44218 73960 -227869 38274 185103 -1800 5131 155085 -477602 -16882
18188c01704C05423a69534J5138D8077a59552k1696j20832a39716C9336C680M539
$$ -301704 305423 -169534 -154396 48077 -159552 -181248 -302080 -139716 39336 3680 8219
18177H219a96733C2339N3535g4761E7385J86389a55481D5374a95964e2692j54431
$$ 8219 -196733 32339 85874 -74761 57385 243774 -155481 45374 -195964 -52692 -207123
18166b07123Q7465G910a505j25644A56686a599m0246E4862d6993k69906A19108
$$ -207123 -119658 7910 -1505 -127149 156686 -1599 -41845 54862 -46993 -316899 119108
18154b56504a24976b0148B2183e0713A99560a39556r9463M1494F2550J96944d6171
$$ -256504 -124976 -20148 22183 -50713 199560 -139556 -239019 -197525 62550 259494 -46171
18142a10900j26946A33625J1399J53018A1823i0712j03498A8458f8422H4120g7742
$$ -110900 -237846 133625 145024 298042 11823 -90712 -194210 18458 -68422 84120 -77742
18130D6299L2891a51084C01738a1984B5013K62296c54698q6973C2489N3054p935
$$ 46299 79190 -151084 301738 -11984 25013 287309 -354698 -441671 32489 85543 77608
18119G7608a194j20483A39351d765k5691m5090n914A72544q741a66413n4033A57739
$$ 77608 -1194 -121677 139351 -4765 -30456 -75546 -81460 172544 163803 -166413 -220446 157739
18106g8451q0906L9381O731B07663c90265i7329j08906f7318j30036C43174c433
$$ -78451 -159357 -119976 -113245 207663 -390265 -97329 -206235 -67318 -197354 343174 -3433
18094a15487k2213N64f853F408K2472a56197f089j7606m5792j827D40894f5500
$$ -115487 -137700 -137136 -6853 6408 28880 -156197 -6089 -23695 -69487 -71314 440894 -65500
18081A15644K34564j02132M9716e01728B44187a50210C849h9728k3931j1637A82179
$$ 115644 350208 248076 297792 -501728 244187 -150210 3849 -89728 -113659 -125296 182179
18069G934a14886K7916h443I4826C0111n204K34702F0194a04979G5377c43024
$$ 7934 -114886 -86970 -8443 94826 30111 24907 259609 60194 -104979 75377 -343024
18057B09949D757K1019P4954D2657c14963A81124a16185j9225l64690a64417h1004
$$ 209949 4757 25776 100730 42657 -314963 181124 -116185 -135410 -500100 -164417 -81004
18045E0671d10855e8910k0334A9709l144J59630H6801j4043G735a757E907J74045
$$ 50671 -410855 -58910 -79244 19709 16565 176195 86801 72758 7735 -1757 5907 179952
18033A79952a94647A2988a60676A24623a6128k17962j5795J03668I489Q7407d6660
$$ 179952 -194647 12988 -160676 124623 -16128 -234090 -249885 -146217 9489 96896 -46660
18021B4394J08430D7723M7590O4365c37016A9919e650j2281r1596E6476o894c5218
$$ 24394 132824 47723 95313 159678 -337016 19919 -5650 -17931 -109527 56476 49582 -35218
18008A5390R771a43756f4235A53061D3569a74208q4879B33838e7793A86269B0234
$$ 15390 25161 -143756 -64235 153061 43569 -174208 -259087 233838 -57793 186269 20234
17996a37671B19387r7345b93309M7938H9335B9719f0385E7992J43385a12107r6360
$$ -137671 219387 122042 -293309 -245371 89335 29719 -60385 57992 201377 -112107 -208467
17985b08467J02201I3574B9047J4960R3221g148A09043f9313A74059e7473A28653
$$ -208467 -106266 93574 29047 44007 137228 -7148 109043 -69313 174059 -57473 128653
17973b90492A86212D668a69455D2214b76361a29959B8848a36523F2803N508d3222
$$ -290492 186212 4668 -169455 42214 -276361 -129959 28848 -136523 62803 68311 -43222
17961I689b339E6787L0224J42893a98597A00363A4249a20042F722J97008G0526
$$ 9689 -2339 56787 87011 229904 -198597 100363 14249 -120042 6722 203730 70526
17949E4122J38350m2397L5531a47971A82841i0809F246R510A253P517J45072F7922
$$ 54122 192472 150075 185606 -147971 182841 -90809 6246 15756 1253 8770 153842 67922
17936E2010c5110I1599b22573F723b1489j14100p7276f808m1171A64943a3180
$$ 52010 -35110 91599 -222573 6723 -21489 -135589 -212865 -6808 -47979 164943 -13180
17924G587a64215a8260H3710K1678b4795m1132C63638e5617N514G6289M145h1455
$$ 7587 -164215 -18260 83710 105388 -24795 -65927 363638 -55617 -50103 76289 80434 -81455
17911B6241a14513B03772L5451h9025L3794j78145d0311j84562k9289i43A08355
$$ 26241 -114513 203772 239223 -89025 -55231 -233376 -40311 -224873 -254162 -943 108355
17899I1024f3826k05118c1543G542a42869N0955m1372j28707C0434L32749A10104
$$ 91024 -63826 -268944 -31543 7542 -142869 -91914 -133286 -261993 30434 363183 110104
17887a55127K6037C2470g3997H337L52559d6518k03313i0795A17807a21770D0374
$$ -155127 -129090 32470 -73997 8337 360896 -46518 -249831 -90795 117807 -121770 40374
17875A93248a74752A14948c9673n4264A93878a50289O9713c11o0112j47871g9578
$$ 193248 -174752 114948 -39673 -93937 193878 -150289 -80576 -311 -60423 -208294 -79578
17863d8503A40697e5760A93353b7839q3040n0375j07894J02896A11621D483a72774
$$ -48503 140697 -55760 193353 -27839 -110879 -161254 -269148 -166252 111621 4483 -172774
17851b00728j48063B38047c42885a20618j01621m2267e0574j116J8607A3217K9714
$$ -200728 -348791 238047 -342885 -120618 -222239 -264506 -50574 -51690 -33083 13217 42931
17840D2931a43398b0611A94671C4544M3913A6729L1195Q9774F5124f0129A33924
$$ 42931 -143398 -20611 194671 34544 78457 16729 47924 137698 65124 -60129 133924
17828A73625c28436a0010D7692J23911b60505a23042a75G0800a53343o9145g1699
$$ 173625 -328436 -10010 47692 171603 -260505 -123042 -175 70800 -153343 -222488 -71699
17816A63642c7536C13800r8500b59807b7942A35565a70469A1694i2588o5520A60912
$$ 163642 -37536 313800 215300 -259807 -27942 135565 -170469 11694 -92588 -158108 160912
17804a92012P5076e7723k18592E2059i3718A85904c81000A65794J60643c977l34737
$$ -192012 -116936 -57723 -276315 52059 -93718 185904 -381000 165794 326437 -3977 -338714
17793c38714F6171k3653O4771A2493c04148a30612k2603e6824A32029n7133l7352
$$ -338714 66171 42518 107289 12493 -304148 -130612 -153215 -56824 132029 74896 37544
17782C7544j7517a12681j28335f013B52852d3496A81485A2138b13747B00951a96629
$$ 37544 20027 -112681 -241016 -6013 252852 -43496 181485 12138 -213747 200951 -196629
17770a9464D6874a62933C69055G0327a40497i972k82364J27052G8538a01867j11954
$$ -19464 46874 -162933 369055 70327 -140497 -9972 -292336 -165284 78538 -101867 -213821
17759b13821K7226C4421K18896b29404Q8850K9577A62517a38375K5531A17851
$$ -213821 -186595 34421 253317 -229404 -140554 -110977 162517 -138375 -112844 117851
17748a57542j49475R3820A25863m3476d61527g1793H3138R7015b51280J0843J1414
$$ -157542 -307017 -213197 125863 82387 -461527 -71793 83138 180153 -251280 -240437 -229023
17737b29023C32143a68265B85262E244M02941A92764D5802J07732P9131F4652
$$ -229023 332143 -168265 285262 5244 408185 192764 45802 153534 232665 64652
17726A18521A518N3902J22107H1098c2865l14445J46575C9229b06567D317P345
$$ 118521 1518 55420 177527 81098 -32865 -347310 -200735 39229 -206567 4317 11662
17715A1662J66716o5128P4362G3698K11144a74058C3996a50084B45785a66152
$$ 11662 178378 113250 187612 73698 284842 -174058 33996 -150084 245785 -166152
17704F3729b46005F0834d8335j65403M8182m9890J974g6540B8123k823R8465J11104
$$ 63729 -246005 60834 -48335 -213738 -165556 -215446 -213472 -76540 28123 25300 123765 234869
17692B34869n0049c35892a06588j3900B3838K0463c1596C51181a6780l8854K1380
$$ 234869 184820 -335892 -106588 -120488 23838 44301 -31596 351181 -16780 -55634 -34254
17681c4254B03146p7068L322m2377i3245a1434q152g378j90374A58897p6866f428
$$ -34254 203146 126078 129400 87023 -93245 -11434 -19586 -7378 -197752 158897 82031 -6428
17668d46115C04351c1802A50412C4218a08209e0760m54405b08142D06447A03560
$$ -446115 304351 -31802 150412 34218 -108209 -50760 -505165 -208142 406447 103560
17657A96776p5786n9437B0603D566b2362B84290a27745H9482N0756a9045H8281
$$ 196776 120990 61553 20603 4566 -22362 284290 -127745 89482 140238 -19045 88281
17645i3096a200A90974c0138j10806O8394m4379B13909P3573b23443B34031a54170
$$ -93096 -1200 190974 -30138 -140944 -72550 -116929 213909 287482 -223443 234031 -154170
17633a05540B45645k8062A4287P471J33112A1590f6732A8382a80549C3180a17366
$$ -105540 245645 217583 14287 21758 154870 11590 -66732 18382 -180549 33180 -117366
17621F426e9510B11217m0745c21743a12316E436a55829A62411D1187a9081k45505
$$ 6426 -59510 211217 170472 -321743 -112316 5436 -155829 162411 41187 -19081 -264586
17610b64586a10734A53490B5665J91272p8903o752b1762a0483j6738C24857D4641
$$ -264586 -110734 153490 25665 216937 138034 131282 -21762 -10483 -27221 324857 44641
17598G8796b4775j11257j21234A31924j3901J7836F5369K38004b01471B43002
$$ 78796 -24775 -136032 -257266 131924 118023 135859 65369 303373 -201471 243002
17587A60801l5287B8241b6276l1481A83234a60936M1145B19217r551A9646L74477
$$ 160801 125514 28241 -26276 -57757 183234 -160936 -119791 219217 209666 19646 394123
17576C94123B6634P9406b05219B50964a42064I3550f3502D38566a03088r4408
$$ 394123 26634 106040 -205219 250964 -142064 93550 -63502 438566 -103088 -197496
17566a97496b843A68249d7896C89655b23565C1557a67285A01953J242O2171F4366
$$ -197496 -2843 168249 -47896 389655 -223565 31557 -167285 101953 103195 165366 64366
17554d2274j32774M69f9130k6351B9073i1714F3725f5893o4956o7820k0114J7067
$$ -42274 -175048 -174579 -69130 -95481 29073 -91714 63725 -65893 -130849 -198669 -218783 -201716
17542b01716D6862d4837q8734A25998E3195j2046j521J30248p2338J45098F5821
$$ -201716 46862 -44837 -133571 125998 53195 41149 39628 169876 97538 242636 65821
17530I537a08680c444A22901E0777f3988B49417I1559J19609A04882D8676L4203
$$ 9537 -108680 -3444 122901 50777 -63988 249417 91559 211168 104882 48676 82879
17519H2879K07308j39941B971K10216b2018j42164O2626A51632k3901A7290L6933
$$ 82879 290187 150246 2971 213187 -22018 -164182 -101556 151632 127731 17290 54223
17508E4223l132b88046a43773A68376a31767A60185a19798m2739A6462J45865
$$ 54223 51091 -288046 -143773 168376 -131767 160185 -119798 -162537 16462 162327
17498A62327l0491J18777A3225K91754q4944r5375K37898F3732A1931J19463b52009
$$ 162327 131836 250613 13225 304979 220035 124660 362558 63732 11931 131394 -252009
17486A86282c4881A62135j4430m0949P0483P9870b33566D8896K35278J3575d2672
$$ 186282 -34881 162135 147705 106756 177239 257109 -233566 48896 284174 297749 -42672
17474a62396f3896G9534J30130M01019A51682B8526J34954l2548a02571b153B23021
$$ -162396 -63896 79534 209664 610683 151682 28526 163480 130932 -102571 -2153 223021
17462a08143A87165F8128A4784L85716B4746P6756P2173p5839K93928E1993N8322
$$ -108143 187165 68128 14784 400500 24746 101502 173675 97836 391764 51993 110315
17451A10315j4752Q2468O7128D4168K81793j24962J5090d4006D37599j13696g7056
$$ 110315 95563 178031 245159 44168 325961 200999 216089 -44006 437599 323903 -77056
17439C06458a4263B92917F8300J97714K24115e5060M841A64800L25165A70845
$$ 306458 -14263 292917 68300 266014 490129 -55060 -50219 164800 489965 170845
17428B67258G0643J46778J39285e7880C93121j38893L0393a06960C730N09501
$$ 267258 70643 217421 356706 -57880 393121 254228 284621 -106960 3730 513231
17418E13231j0798H8252Q835L96151A74069K25350c8420C46088L8776N1977m2811
$$ 513231 502433 88252 97087 493238 174069 399419 -38420 346088 384864 436841 394030
17407C94030j24140b41455B72623A28627a26561B17082j06082L0382M02316k63234
$$ 394030 269890 -241455 272623 128627 -126561 217082 111000 141382 543698 280464
17397B80464b7194A80907a87692C6907j7788M25433A8129J97981K5836K0849a37500
$$ 280464 -27194 180907 -187692 36907 19119 444552 18129 216110 241946 262795 -137500
17385c6453A57813d4425A43137d6676A89713n3754M6104K06974B6726L00622K4971
$$ -36453 157813 -44425 143137 -46676 189713 135959 182063 389037 26726 327348 352319
17374C52319A69946B6982j961M5602L5506M9748O9747L6141c6291D1865e1936
$$ 352319 169946 26982 25021 70623 106129 155877 225624 261765 -36291 41865 -51936
17362D0233J3250J09021C9550K89260A17082d5783B33412I5543C3253g8937C01096
$$ 40233 53483 162504 39550 328810 117082 -45783 233412 95543 33253 -78937 301096
17350a63600B87107p0181l0452J12698c28723A08419A0703K10543J49212b3806
$$ -163600 287107 216926 186474 299172 -328723 108419 10703 221246 370458 -23806
17339C6168P5924J23013J73H9526f3971B2405a0024p0188a3741C0143a76099e6652
$$ 36168 112092 235105 235278 89526 -63971 22405 -10024 -80212 -13741 30143 -176099 -56652
17326a47182B64040B301K36747c1447A51196b20571B85242j23365B4938c10391
$$ -147182 264040 2301 239048 -31447 151196 -220571 285242 161877 24938 -310391
17315C79500A83410c48141C75058d280A3935K29995J58166g7795C76286A31590
$$ 379500 183410 -348141 375058 -4280 13935 243930 402096 -77795 376286 131590
17304A59231L10356A56220M3870K36451A32506K22371j68158H0607O2952C9655
$$ 159231 469587 156220 200090 436541 132506 354877 186719 80607 143559 39655
17293B54004E0615K21008m0840L1439A03259J00551D6122R1808R0721J31327G3250
$$ 254004 50615 271623 230783 262222 103259 203810 46122 137930 228651 359978 73250
17281A93805r1452K55339j44087q4041M15343B55213a21900A9082M7445M53722
$$ 193805 102353 357692 213605 129564 544907 255213 -121900 19082 66527 520249
17271E20249E7655J4561L7104D890K76054A01275K78091a88645A03917J4339K6504
$$ 520249 57655 72216 109320 4890 280944 101275 379366 -188645 103917 118256 144760
17260A44760K95904j00017B6213J55839L2319O105F9843O7390a849I8214f6943
$$ 144760 440664 340647 26213 182052 214371 220476 69843 137233 -1849 98214 -66943
17248a11604B46609g8087A31735K13002l396J21345h7746B70760o7793K59554
$$ -111604 246609 -78087 131735 344737 341341 462686 -87746 270760 202967 462521
17238D62521k17085m0460J73182r1673k6701b01762g2312B5526J69964R6286O854
$$ 462521 245436 204976 378158 286485 259784 -201762 -72312 25526 195490 291776 298630
17227B98630F7092c9953B54281A02219L5719J3585E904L82946A01733f3132B29156
$$ 298630 67092 -39953 254281 102219 137938 151523 5904 388850 101733 -63132 229156
17215B72849J00175A02535K37692A2026K70930J90265A66215J34477p2879J48341
$$ 272849 373024 102535 340227 12026 282956 473221 166215 300692 227813 376154
17205C76154B4200M8641K36977L0443A51028R8273N9432P249r2888C0145M31300
$$ 376154 24200 72841 309818 340261 151028 249301 308733 315982 223094 30145 461445
17194D61445A03074J29277N5084K4115A046L87188j33977J48028E0029N48661
$$ 461445 103074 232351 287435 311550 1046 388234 254257 402285 50029 598690
17184E98690D5583L03257j21905g6922C63300M9573j6007O937A94150J04516j0385
$$ 598690 45583 348840 226935 -76922 363300 412873 396866 403803 194150 298666 288281
17173B88281J50408F4396L04392o0679J76980j90839q0977K2038K80786b3737
$$ 288281 438689 64396 368788 308109 485089 294250 213273 235311 516097 -23737
17162E10942A52354b03978A49357J60654n1410K2840l4659p3398J86619A59758
$$ 510942 152354 -203978 149357 310011 258601 281441 246782 173384 360003 159758
17151A35959J90678J07099q0014A47513K14731k5423J77440j32372I1274J10650
$$ 135959 326637 433736 353722 147513 362244 336821 514261 381889 91274 201924
17141B01924R0428J88741j60249O2206A27077a88535A58755D9973L06859J24935
$$ 201924 292352 481093 320844 383050 127077 -188535 158755 49973 356832 481767
17131D81767a07518f135C95924J37982A87113K3986R1761O5380k8328j9673K35261
$$ 481767 -107518 -6135 395924 533906 187113 211099 302860 368240 339912 320239 555500
17120E55500l1950A11485J77120J05052p6144A29353L73862B32324J9404J62219
$$ 555500 523550 111485 288605 393657 317513 129353 503215 232324 251728 413947
17110D13947A14542O3487N2716r8872K87234j58506K52288j14854q6856j6543
$$ 413947 114542 178029 230745 131873 419107 260601 512889 398035 311179 294636
17100B94636K71783J23192I9820L30382O9159j99417M2482J58069E6584K66777
$$ 294636 566419 689611 99820 430202 499361 299944 342426 500495 56584 323361
17090C23361A08954J17205K92840p6581M6561j3054k01910j03388L08865m4718
$$ 323361 108954 226159 518999 442418 488979 475925 274015 170627 479492 434774
17080D34774J86021k24264J2569B02324J66506K18837j70359J83639j61499O6517
$$ 434774 620795 396531 409100 202324 368830 587667 417308 600947 439448 505965
17070E05965l1367k20436J36838J35510Q607J89896l00245o2914K30164j70344
$$ 505965 474598 254162 391000 526510 535117 725013 424768 361854 592018 421674
17060D21674K31425j15595j38666m3030l5294L15275r3758k56596K95746k15481
$$ 421674 653099 537504 398838 355808 320514 635789 542031 285435 581181 365700
17050C65700J63763R7861k20204J47888E8726K87275J98321P1221j69379M17841
$$ 365700 529463 627324 407120 555008 58726 346001 544322 615543 446164 864005
17040H64005l21676r9361K33114R6063m6265C61872o7743L37870k24635K4894
$$ 864005 542329 442968 676082 772145 725880 361872 294129 631999 407364 432258
17030D32258L16234k48983q2595o8821L40716B55187J62725J14156J30632j19975
$$ 432258 748492 499509 416914 348093 688809 255187 417912 532068 662700 542725
17020E42725j36031L57916k10326j01352J98281N3271j81205L41706B44015K41970
$$ 542725 406694 764610 554284 452932 651213 704484 523279 864985 244015 485985
17010D85985J96849l0797M7441L38591n04708L62585j11622k79311N06492k43804
$$ 485985 682834 652037 699478 1038069 533361 895946 784324 505013 1011505 767701
17000G67701k79900L00878k6493P6338k63469Q6466J6424K46650j17615l11119
$$ 767701 487801 788679 762186 838524 575055 661521 677945 924595 806980 495861
16990D95861L59929l02737p082J60061K90085k86766J26231R7158k64624k83265
$$ 495861 855790 553053 545971 706032 996117 709351 835582 932740 668116 384851
16980C84851M3396M31586j63724J95114k0283R0334N0724N4393j83253j90800
$$ 384851 428247 859833 696109 891223 870940 961274 1011998 1066391 883138 692338
16970F92338L20139l9544k79526K41927k02391J24959K19839k18501K45858m53450
$$ 692338 1012477 972933 693407 935334 732943 857902 1077741 859240 1105098 651648
16960F51648L88031o9213k00754K51837j24468k81541J49574M03581R7932l58802
$$ 651648 1039679 970466 769712 1021549 897081 615540 765114 1168695 1266627 907825
16950I07825J455j77830N07724N8987j14410n9155J4204l98125K82378k9121Q3446
$$ 907825 909280 731450 1239174 1298161 1183751 1124596 1138800 740675 1023053 993932 1077378
16939A077378J01298k09176K58246j86338K14003l80352L80325Q5976k43466K83417
$$ 1077378 1178676 969500 1227746 1041408 1255411 875059 1255384 1341360 1097894 1381311
16929A381311p4548J991J42821j82319j98814K94753M5495j20980J5034K7584
$$ 1381311 1306763 1308754 1451575 1269256 1070442 1365195 1410690 1289710 1304744 1332328
16919A332328J03731K3806l45080L16464r9449m3449L83522n2294j47479O0385
$$ 1332328 1436059 1459865 1114785 1431249 1331800 1288351 1671873 1619579 1472100 1532485
16909A532485J91261m50728P7823K34331K08150k1800j17574M6391j44077J92898
$$ 1532485 1723746 1273018 1350841 1585172 1793322 1771522 1653948 1700339 1556262 1749160
16899A749160o1863l88363L84559K23603p8582J76394m1882O4780N598j67286
$$ 1749160 1687297 1298934 1683493 1907096 1828514 2004908 1963026 2027806 2033404 1866118
16889A866118J2756o9123n4941L32522j28863L2758J36967l2901l7729K94538
$$ 1866118 1878874 1809751 1754810 2087332 1958469 1991227 2128194 2095293 2057564 2352102
16879B352102j44188O8947M21307n68009M54082k7423k52104K14752j60514j13837
$$ 2352102 2207914 2276861 2698168 2130159 2584241 2556818 2304714 2519466 2358952 2245115
16869B245115K96643N1651j14260j11946L34396N8413K83939n3656k07732N28095
$$ 2245115 2541758 2593409 2479149 2367203 2701599 2760012 3043951 2990295 2782563 3310658
16859C310658j72837j00966J19902K10875n04595K84323J8052j3300P8671j95743
$$ 3310658 3137821 3036855 3156757 3367632 2863037 3147360 3165412 3152112 3230783 3035040
16849C035040J66073L33564k25129j1215K98783q6765M3359L60948N9205J07569
$$ 3035040 3201113 3534677 3309548 3298333 3597116 3510351 3553710 3914658 3973863 4081432
16839D081432p0145j87312J83657j04776J67291L06181J20581r9532J60834O4933
$$ 4081432 4011287 3823975 4007632 3902856 4070147 4376328 4496909 4397377 4558211 4623144
16829D623144O1252j20360L85334m6688j67583K87245M6526J16595M53421o6663
$$ 4623144 4684396 4564036 4949370 4902682 4735099 5022344 5068870 5185465 5638886 5572223
16819E572223j50776K62543L4293N5466K89329J36902J7824O03720l49559L61166
$$ 5572223 5421447 5683990 5718283 5773749 6063078 6199980 6217804 6821524 6471965 6833131
16809F833131j41803J18263M14315k50045L47503M29204m7660R767L93482K4090
$$ 6833131 6691328 6809591 7223906 6973861 7321364 7750568 7702908 7712675 8106157 8130247
16799H130247L91177J21451N24021J02682P44114m65383N86337k13808N98887
$$ 8130247 8521424 8642875 9166896 9269578 10013692 9548309 10134646 9920838 10519725
16790A0519725K9178M17602J35827N32259N06546K16575K13410M98980O3269N24349
$$ 10519725 10548903 10966505 11102332 11634591 12141137 12357712 12571122 13070102 13133371 13657720
16780A3657720M78627P13205M05333M20713O18888K40169N68377P45342M28886
$$ 13657720 14136347 14849552 15254885 15675598 16294486 16534655 17103032 17848374 18277260
16771A8277260M39164N85156J014695P42432L91942O79230J118622Q53883O86856
$$ 18277260 18716424 19301580 20316275 21058707 21450649 22129879 23248501 24102384 24789240
16762B4789240J340446J005052J227481J186696J000592J586640J123937J493669
$$ 24789240 26129686 27134738 28362219 29548915 30549507 32136147 33260084 34753753
16754C4753753J604881J818337J207610K336746J990266J809672K557134K206718
$$ 34753753 36358634 38176971 39384581 41721327 43711593 45521265 48078399 50285117
16746E0285117K006599L129569K884447K851483L400220L110870L868545M014911
$$ 50285117 52291716 55421285 58305732 61157215 64557435 67668305 71536850 75551761
16738G5551761M172506M337142M730796N056520N089078N208013N669991O055034
$$ 75551761 79724267 84061409 88792205 93848725 98937803 104145816 109815807 115870841
16730A15870841N903752O033827O307291N725880O018629O020178N234169M336601
$$ 115870841 121774593 127808420 134115711 139841591 145860220 151880398 157114567 161451168
16722A61451168M469189K992485K135197J307856N97q39659k196527k751979l778763
$$ 161451168 165920357 168912842 171048039 172355895 172356492 171516833 169320306 166568327 162789564
16713A62789564n129151n385169n879770o424037o284075o461468o746708o192956
$$ 162789564 157660413 152275244 146395474 139971437 133687362 127225894 120479186 114286230
16705A14286230o718703n804188n907543n344659n099335m867477m928118l943911
$$ 114286230 107567527 101763339 95855796 90511137 85411802 80544325 75616207 71672296
16697G1672296m222310l672167l370502l685453k980356k746599k785782k284154
$$ 71672296 67449986 63777819 60407317 56721864 53741508 50994909 48209127 45924973
16689D5924973k253180k219799k367527j676027j705880j635295j346084j700636
$$ 45924973 43671793 41451994 39084467 37408440 35702560 34067265 32721181 31020545
16681C1020545j469241j224535j190893q07368j383470q86455j081102p23374
$$ 31020545 29551304 28326769 27135876 26328508 24945038 24058583 22977481 22254107
16673B2254107r91134j040795p92391k30894q94950o71852o21918o44495l81853
$$ 22254107 21262973 20222178 19429787 19198893 18303943 17632091 17010173 16365678 15983825
16664A5983825o96707m62435o85282j91528m08875l49304n45503j87770o97128
$$ 15983825 15287118 14824683 14139401 13947873 13538998 13189694 12644191 12456421 11759293
16655A1759293j62653k96733o63130k09408l7810m74894p2955l48662l14638k35705
$$ 11759293 11596640 11299907 10636777 10427369 10389559 9914665 9841710 9493048 9178410 8942705
16645H942705l23888K15599o61509j38974k48783j84332l32304m335Q4174n92486
$$ 8942705 8618817 8834416 8172907 8033933 7785150 7600818 7268514 7264179 7348353 6755867
16635F755867j12912P4112m03138k52420k0016M4085k24978l13235M32628j21695
$$ 6755867 6642955 6717067 6313929 6061509 6041493 6085578 5860600 5547365 5979993 5858298
16625E858298o35150R1933R3027k42495Q3416n47620p9064M01641m23167N5166
$$ 5858298 5223148 5315081 5408108 5165613 5249029 4701409 4622345 5023986 4600819 4655985
16615D655985l55705j80050k54279K16104j19835L4312J80189n77016M30498m98764
$$ 4655985 4300280 4120230 3865951 4082055 3962220 3996532 4176721 3599705 4030203 3531439
16605C531439K95356k84068J31561j68241o1418j21538k67146K55133L2265k30120
$$ 3531439 3826795 3542727 3674288 3506047 3444629 3323091 3055945 3311078 3343343 3113223
16595C113223o1186L33089l99320J77718l54366K742l0728q8472J73498k65301
$$ 3113223 3052037 3385126 2985806 3163524 2809158 2811900 2781172 2692700 2866198 2600897
16585B600897k6531J77408k35549K30449l75241J15233l7818n633m03493J66199
$$ 2600897 2574366 2751774 2516225 2746674 2371433 2486666 2448848 2443215 2039722 2205921
16575B205921K02632J81216l17028L4627j12934J30115j21284n2892j42780K68749
$$ 2205921 2408553 2589769 2272741 2307368 2194434 2324549 2203265 2150373 2007593 2276342
16565B276342l80358k5551k5976O1122k05457K24387j6945Q1431k84196r0812
$$ 2276342 1895984 1870433 1844457 1905579 1700122 1924509 1907564 1988995 1704799 1613987
16555A613987L10116l76853J13195k56991M25425k69557M00229o08268L66374
$$ 1613987 1924103 1547250 1660445 1403454 1828879 1559322 1959551 1351283 1717657
16546A717657j92403K16368J9791j36273J16225n41193K94502p5513K3164J01029
$$ 1717657 1525254 1741622 1761413 1625140 1741365 1200172 1494674 1419161 1442325 1543354
16536A543354j90547K32698n8007l77339K49M09577n41251J89634j41681M1482
$$ 1543354 1352807 1585505 1527498 1150159 1150408 1559985 1018734 1208368 1066687 1108169
16526A108169K8961l9461M90784j08721k62690K8843k65392K56814m8003l27553
$$ 1108169 1137130 1097669 1588453 1479732 1217042 1245885 980493 1237307 1189304 861751
16516H61751J75208N57020n15959J766L97137l99900J58041l49752j4628J37777
$$ 861751 1036959 1593979 1078020 1079786 1476923 1077023 1235064 885312 870684 1008461
16506A008461j54452M60107j36027j25305o7256K99659m09691l6135k51964K41561
$$ 1008461 854009 1314116 1178089 1052784 985528 1285187 875496 839361 587397 828958
16496H28958N2698l5665J29941j916q1679Q3887q9301J68230q0914j83426K2811
$$ 828958 881656 845991 975932 974016 892337 976224 886923 1055153 974239 790813 813624
16485H13624J21812l03797N9462M47500l83930j95340K1070J25813K34121j21585
$$ 813624 935436 631639 691101 1138601 754671 559331 580401 706214 940335 818750
16475H18750j36147K36193J4334j4660P3541j47632p3209J74617j15661M4404
$$ 818750 682603 918796 933130 918470 992011 844379 771170 945787 830126 874530
16465H74530j61855k32814K59956O7553o6601j10049R5231r9735j13830j7588
$$ 874530 712675 479861 739817 807370 740769 630720 725951 626216 512386 494798
16455D94798K19406R7448k84088K17744j42272K63356l67789J59780n6521J45407
$$ 494798 714204 811652 527564 745308 603036 866392 498603 658383 601862 747269
16445G47269j68336j5167j82903J6757J67963K57371k26695j71411L07470k69681
$$ 747269 578933 563766 380863 397620 565583 822954 596259 424848 732318 462637
16435D62637j89416K31078J95669j02112R849k6541k51455K51969k19336J32417
$$ 462637 273221 504299 699968 597856 607705 581164 329709 581678 362342 494759
16425D94759J03891J17269k40950J51309B65150N3400L75500C0181L93921J85291
$$ 494759 598650 715919 474969 626278 265150 318550 694050 30181 424102 609393
16415F09393k73751p8278L03370n9482K05268B54455J00007J02604j39696J09600
$$ 609393 335642 257364 560734 501252 706520 254455 354462 457066 317370 426970
16405D26970j92502R6053L80928k77044K06488B96124L5435K12854j37259J79297
$$ 426970 234468 330521 711449 434405 640893 296124 331559 544413 407154 586451
16395E86451A24729L93640R0612K5715B66669L11301L82476k53956l36412p4183
$$ 586451 124729 518369 608981 634696 266669 577970 960446 706490 370078 295895
16385B95895J38006j70979L7553A49677n5529K17047j48698K4529K04852L11103
$$ 295895 433901 262922 300475 149677 94148 311195 162497 187026 391878 702981
16375G02981k87134j22424E9253M47047m3652l500j73194m8480J48227q6405j29627
$$ 702981 415847 293423 59253 506300 462648 459148 285954 237474 385701 299296 169669
16364A69669J44718M66746C00578J43098A89310O0665M0519J14383D861K02740
$$ 169669 314387 781133 300578 443676 189310 249975 290494 404877 4861 207601
16354B07601L58839A83159M28014B55048j18621E3694M42000A06733K82223O9477
$$ 207601 566440 183159 611173 255048 136427 53694 495694 106733 388956 458433
16344D58433j15852D2387b0053B19370r7R2397L32281B69959G003L00766A53045
$$ 458433 342581 42387 -20053 219370 219273 311670 643951 269959 7003 307769 153045
16332A48889K04811D94b21496F67117k56814l0029c33289C5665K03241M8305e5190
$$ 148889 353700 494 -221496 667117 410303 380274 -333289 35665 238906 287211 -55190
16320C57638A30719J9402K37576q3776A40851O0539o1805M37893A84692R615o9265
$$ 357638 130719 150121 387697 303921 140851 201390 139585 577478 184692 194307 125042
16309A25042K12664a5449B14917O3267O6153A27770a7083C4862J48716J88460
$$ 125042 337706 -15449 214917 278184 344337 127770 -17083 34862 183578 372038
16299C72038A45714A0070Q4162K2249a59576B79389J15004j10947k6992B8824
$$ 372038 145714 10070 94232 116481 -159576 279389 394393 283446 256454 28824
16288c2583D08836j32532R9621j19231N9144j51037p7769J89226o0251A03289
$$ -32583 408836 276304 375925 256694 315838 164801 87032 276258 216007 103289
16277C02463R4269K9427j12443A4504J84084l8597n8574l6252K58616a5095B08560
$$ 302463 396732 426159 313716 14504 198588 159991 101417 65165 323781 -15095 208560
16265B42265E4183j1644K54578A44554K93386l3534i6559A72957D1222M44511
$$ 242265 54183 42539 297117 144554 437940 404406 -96559 172957 41222 485733
16255D85733B35111p1362D4272J31699p5212P973l9870M2362J80814R385A9404
$$ 485733 235111 163749 44272 175971 100759 108732 68862 111224 292038 301423 19404
16243A53739j815K4621q1179k915K50883b7117r0770D32366L3957A34167J14926
$$ 153739 151924 176545 95366 92451 343334 -27117 -117887 432366 466323 134167 249093
16232B49093c9950B02500i9015B55540A24777L524K08890b4441C62439a122A46138
$$ 249093 -39950 202500 -99015 255540 124777 128301 337191 -24441 362439 -1122 146138
16220A91888p9951J62448H9012a6476G0522J48437n2060J29268B7493N3427J40214
$$ 191888 111937 274385 89012 -16476 70522 218959 166899 296167 27493 80920 221134
16209B21134D3482i8967a4992B63396a82388G6902e0767n5330n0483A28352E6715
$$ 221134 43482 -98967 -14992 263396 -182388 76902 -50767 -106097 -156580 128352 56715
16197E86740A36213K15756A22929n0665a8246n6690G0488a5325K903j19184k48036
$$ 586740 136213 351969 122929 72264 -18246 -74936 70488 -15325 -12422 -131606 -379642
16186c79642g8512G5263a71912G7154P0169d6593o9723B69585N5960A4668K76258
$$ -379642 -78512 75263 -171912 77154 147323 -46593 -116316 269585 325545 14668 290926
16175B90926O5157J19662b22349K2519f0976j37378e9706F2198j0792R6813F2863
$$ 290926 356083 475745 -222349 -199830 -60976 -198354 -59706 62198 51406 148219 62863
16163A93909o9568K4868d3072A88111m6302J44614g3279D78760H9577b28758G1048
$$ 193909 124341 149209 -43072 188111 141809 286423 -73279 478760 89577 -228758 71048
16151G8483Q1970C3637K1712J73522e1551b3981A8710J07335O6274b78986c8975
$$ 78483 160453 33637 55349 228871 -51551 -23981 18710 126045 192319 -278986 -38975
16139E568K24631q8868m4588a38796B44202f0492D2880j0184b29128A70466D4198
$$ 5568 230199 141331 96743 -138796 244202 -60492 42880 32696 -229128 170466 44198
16127B64117d2537a0217D52070j02527a26570C96492f5889B5352N2805K78417
$$ 264117 -42537 -10217 452070 349543 -126570 396492 -65889 25352 78157 356574
16117C56574C1689M8708O6989N7740O9170a24752A9713c18800B26879q7086j0622
$$ 356574 31689 80397 147386 205126 274296 -124752 19713 -318800 226879 139793 129171
16106A29171E1322f506B65157c4824a1070E981L65045I7128a42486A27197J55145
$$ 129171 51322 -6506 265157 -34824 -11070 5981 371026 97128 -142486 127197 282342
16095B82342I0067J36586b28035M1560H8579C2066i5997A39049m4193a67849A98723
$$ 282342 90067 226653 -228035 -186475 88579 32066 -95997 139049 94856 -167849 198723
16083C61189j38769D0927J03620l494j9865o282a13845D7403n878B0137L1272
$$ 361189 222420 40927 144547 141053 121188 114906 -113845 47403 41525 20137 51409
16072E1409L39933n6536I7137a09381A75384f2700A2938c11448B48182A03548
$$ 51409 391342 334806 97137 -109381 175384 -62700 12938 -311448 248182 103548
16061h0277f321k97682K454G9075P7314f568F7649J28252e9686B2537c2843j00305
$$ -80277 -6321 -304003 -301549 79075 156389 -6568 67649 195901 -59686 22537 -32843 -133148
16049a33148a1080b822k2207C0424N4968n046l327M7542b2843B55379e0688K3973
$$ -133148 -11080 -2822 -25029 30424 85392 80346 77019 124561 -22843 255379 -50688 -26715
16037b6715A66785a52820K5464I3854b26628L9627O5988b4815B83089b40631d5367
$$ -26715 166785 -152820 -127356 93854 -226628 -187001 -121013 -24815 283089 -240631 -45367
16025C28120j32948A8162g0462C4236K30221G6303e1208D28594b02744O4618H4526
$$ 328120 195172 18162 -70462 34236 264457 76303 -51208 428594 -202744 -138126 84526
16013G9061b15404a05990A51111F442P6104K54222b1476n9512b050E1447b22221
$$ 79061 -215404 -105990 151111 6442 82546 336768 -21476 -80988 -2050 51447 -222221
16001G2073j2246b72461J17804f8425j11383I1793i1362q1507a1290E5902f1613
$$ 72073 59827 -272461 -154657 -68425 -179808 91793 -91362 -172869 -11290 55902 -61613
15989b44066B41469b58743a6707A58074p6948J34126K57056K4308j41819N6902
$$ -244066 241469 -258743 -16707 158074 81126 215252 472308 496616 354797 411699
15979D11699j18813I7620b50203a12822A05026L7664k9564L85787B47129b88223
$$ 411699 292886 97620 -250203 -112822 105026 142690 113126 498913 247129 -288223
15968a6471p3932j99934A53161b40480B79295A0493J49851a44227M2592K9458
$$ -16471 -90403 -290337 153161 -240480 279295 10493 160344 -144227 -101635 -72177
15958g2177C2911a45777c0939q1057a5533P006j48021A38392b38101A60406J9356
$$ -72177 32911 -145777 -30939 -111996 -15533 -8527 -156548 138392 -238101 160406 179762
15947A79762j9850E4921h1938C8107A0961f7932a098B1447d556A4949b63261J23767
$$ 179762 159912 54921 -81938 38107 10961 -67932 -1098 21447 -4556 14949 -263261 -139494
15935a39494A12001O3843a83007h8030q1302a1839l4213L50A08797p069b91627
$$ -139494 112001 175844 -183007 -88030 -169332 -11839 -46052 -45702 108797 101728 -291627
15923c91774a33424p5119K7021N1765B9039L41852f6061J4475J1200B00264o7942
$$ -391774 -133424 -208543 -181522 -129757 29039 370891 -66061 -51586 -40386 200264 132322
15912A32322b59000h6761A60392d13669C60464A37471c32107A85304b25354D69286
$$ 132322 -259000 -86761 160392 -413669 360464 137471 -332107 185304 -225354 469286
15901c6991k64561G777c70466B7100J29458b1623j8524m9900P668j06681A1355
$$ -36991 -301552 7777 -370466 27100 156558 -21623 -40147 -90047 -82379 -189060 11355
15889c51255a7477H4281a54384j33782a9387q171E2956J27299B9164h0810B10026
$$ -351255 -17477 84281 -154384 -288166 -19387 -27558 52956 180255 29164 -80810 210026
15877a35214R63A1965c5505G1593b6715k9481n297l10406j1040B64802a73158
$$ -135214 -134251 11965 -35505 71593 -26715 -56196 -61493 -371899 -382939 264802 -173158
15865D1529a74134m22321K85347b9498k2100A82109f6579A11775e3204k11636
$$ 41529 -174134 -596455 -311108 -29498 -51598 182109 -66579 111775 -53204 -264840
15855b64840C8776j4528e0566D15493D469K23864r1386c15947A35950d4339B6625
$$ -264840 38776 24248 -50566 415493 4469 228333 136947 -315947 135950 -44339 26625
15843d015A11243a2741j25680B42944I6300i7996c0527j19500e8254k64914G8858
$$ -4015 111243 -12741 -138421 242944 96300 -97996 -30527 -150027 -58254 -323168 78858
15831a0568j73762A42106f4978j46257i6014A59783o3446c27241k6755A93665
$$ -10568 -184330 142106 -64978 -211235 -96014 159783 96337 -327241 -353996 193665
15820c13718J25748B18309a9021B8724h4356E3105d2787G7506a80696G3556a18662
$$ -313718 -187970 218309 -19021 28724 -84356 53105 -42787 77506 -180696 73556 -118662
15808F0755a63954F3710c3675A27013a91215A25479b9993G3650J70628J2768a68456
$$ 60755 -163954 63710 -33675 127013 -191215 125479 -29993 73650 244278 257046 -168456
15796C27019A28327L7173b16997C6542J94245a6380j23833D61583a3324A87573
$$ 327019 128327 165500 -216997 36542 230787 -16380 -140213 461583 -13324 187573
15785A06224C2793a29818j23284N0370j48782A7026L73828A16938J12527A11198
$$ 106224 32793 -129818 -253102 -202732 -351514 17026 390854 116938 229465 111198
15774c2466B9145R8767b05795B3605J93848l7702a72212g9186I2871c1470A1948
$$ -32466 29145 127912 -205795 23605 217453 179751 -172212 -79186 92871 -31470 11948
15762B5876N0534N052K01803e316B5517N1823M3832O0597F2336a07747J8015G5967
$$ 25876 76410 81462 283265 -5316 25517 77340 121172 181769 62336 -107747 -89732 75967
15749a39448D8083a3070o7311l598A38329l9569a08173A73251B6587a74307D1217
$$ -139448 48083 -13070 -80381 -83979 138329 98760 -108173 173251 26587 -174307 41217
15737A52832b35290j39466g3607j15666o260I9660b68523d473l1472C92535b9346
$$ 152832 -235290 -374756 -73607 -189273 -195533 99660 -268523 -4473 -35945 392535 -29346
15725a89901F5893Q4132h8927L685j27864c9014j9361F4444f3756m3482A72748
$$ -189901 65893 150025 -88927 -85242 -213106 -39014 -58375 64444 -63756 -107238 172748
15713e3438J7559A16153P7505b22259A75697B3238b16193C9590K5002N9976a76815
$$ -53438 -35879 116153 193658 -222259 175697 23238 -216193 39590 64592 124568 -176815
15701e5881b6469D9896a2762n8439k11979A54551a06654G2662R5683e5880c649
$$ -55881 -26469 49896 -12762 -71201 -283180 154551 -106654 72662 168345 -55880 -3649
15689B42226a47105e8091m7668H69c3460J5258n1847k2479p863c190F5802a28060
$$ 242226 -147105 -58091 -105759 869 -33460 -18202 -70049 -92528 -100391 -3190 65802 -128060
15676A32870c02127h7822c106j53962C8576a41525A82990o7754d1393j29436A3547
$$ 132870 -302127 -87822 -3106 -157068 38576 -141525 182990 115236 -41393 -170829 13547
15664a1193B57261C1485a7979n625A00480a95156I7812N6188b88168E0652L8669
$$ -11193 257261 31485 -17979 -23604 100480 -195156 97812 154000 -288168 50652 89321
15653H9321e8977E4851a31931j51686a06911o2269j8383G253d8134m4197j22524
$$ 89321 -58977 54851 -131931 -283617 -106911 -169180 -187563 7253 -48134 -92331 -214855
15642b14855N1533K3007m283B06752a92769L4442D9762b71038a06472B53053c20702
$$ -214855 -163322 -140315 -144598 206752 -192769 -158327 49762 -271038 -106472 253053 -320702
15630A6729a59793C4838K9274a94452m525P4225A29740g8783A53109c5321B25470
$$ 16729 -159793 34838 64112 -194452 -198977 -124752 129740 -78783 153109 -35321 225470
15618a00326A89636n855p3272J45092E6404K6103b67729B17789M7385b91257J16263
$$ -100326 189636 183781 110509 255601 56404 82507 -267729 217789 265174 -291257 -174994
15607a74994e0482G4226i3813j21030B06792K1666n8285b31657J06797k33320
$$ -174994 -50482 74226 -93813 -214843 206792 228458 170173 -231657 -124860 -358180
15597c58180A51766a25923I7789K75943A4437a73972b622H1323d91866D240b31397
$$ -358180 151766 -125923 97789 373732 14437 -173972 -2622 81323 -491866 4240 -231397
15585B568e8884A2462b19712i5570G7408a12309D2260b98321f6637j29399r8049
$$ 2568 -58884 12462 -219712 -95570 77408 -112309 42260 -298321 -66637 -196036 -294085
15574b94085D0086f3861o817j74933a2818m5135r6300B43950m766d4854A52562
$$ -294085 40086 -63861 -70678 -245611 -12818 -57953 -154253 243950 239184 -44854 152562
15562a9044E9856J98795o3165c654H1398a18152d6254d543A24959N1256A887g5463
$$ -19044 59856 258651 195486 -3654 81398 -118152 -46254 -4543 124959 176215 1887 -75463
15549f2719l24175h081k59660b5494C09937A24003a06380A32852J10498B1298
$$ -62719 -386894 -8081 -267741 -25494 309937 124003 -106380 132852 243350 21298
15538C5978b31246A44505c35152a33182A40592c46998E8537j7520O5546c3657
$$ 35978 -231246 144505 -335152 -133182 140592 -346998 58537 41017 106563 -33657
15527e461k8047D5549e4999k20995j6216B4216a21798J8001G0721a64449Q731
$$ -5461 -33508 45549 -54999 -275994 -292210 24216 -121798 -103797 70721 -164449 -155718
15516a55718A03957J5802J3287l6803a18572o4216a0932r161B51105I821i1248
$$ -155718 103957 119759 133046 96243 -118572 -182788 -10932 -20093 251105 9821 -91248
15504C430a71422D1104a53823K1439A10572L6119g3889k22042c1380r7248d3924
$$ 3430 -171422 41104 -153823 -132384 110572 146691 -73889 -295931 -31380 -128628 -43924
15492F7477h8110l8399A4659i9171r0022d7789j70887A15277K60033a47327N0467
$$ 67477 -88110 -126509 14659 -99171 -189193 -47789 -218676 115277 375310 -147327 -96860
15481i6860r804k825R228D9894b24452k637F23P7012a70186h3698j45829B7652
$$ -96860 -106664 -109489 -100261 49894 -224452 -227089 623 77635 -170186 -83698 -229527 27652
15468f57688a63078r3310d3789k28215H1929a32130H278K8607a2304q2916A78427
$$ -657688 -163078 -256388 -43789 -272004 81929 -132130 8278 36885 -12304 -95220 178427
15456B64048N4488a24986B83084a25147B415N5158G916L86391a06821m7653O1770
$$ 264048 318536 -124986 283084 -125147 2415 57573 7916 394307 -106821 -154474 -92704
15445i2704m0597d222p8929j09700O430C31337j08066a41212o7350E3160M3827
$$ -92704 -133301 -4222 -83151 -192851 -186421 331337 223271 -141212 -208562 53160 96987
15434I6987B4456n79b5502n3958C98064I430i25I5268m3646L7778d0637q061j91571
$$ 96987 24456 23877 -25502 -79460 398064 9430 -925 95268 51622 89400 -40637 -48698 -240269
15421b40269A12308Q9360g2311j15525g5822a5633k71119i5624A47352A0647P8211
$$ -240269 112308 201668 -72311 -187836 -75822 -15633 -286752 -95624 147352 10647 88858
15410H8858f8950D70751A39600L48872a74261r552C2283K39630o3633n947O5195
$$ 88858 -68950 470751 139600 488472 -174261 -183813 32283 271913 208280 202333 267528
15399B67528a7493l03702H761J76125D2113d3489k40464n3030A8296d3369G1448
$$ 267528 -17493 -321195 8761 184886 42113 -43489 -283953 -336983 18296 -43369 71448
15387A62272o9495h6280j45679d8627l5635j75842A37358a68232j08180J27405
$$ 162272 92777 -86280 -231959 -48627 -84262 -260104 137358 -168232 -276412 -149007
15377a49007j77169B75579A27900K17555o5143b4486k16811c7146p565A02947
$$ -149007 -326176 275579 127900 345455 280312 -24486 -241297 -37146 -44711 102947
15366a56463K9754j8182M5959j7490c6254i400A1798k147a7923F2913a14375p9249
$$ -156463 -126709 -144891 -98932 -116422 -36254 -9400 11798 9651 -17923 62913 -114375 -193624
15354a93624e4391F3599D677g2572j02501A05306b32183a15501D1920L6832d7588
$$ -193624 -54391 63599 4677 -72572 -175073 105306 -232183 -115501 41920 78752 -47588
15342A03793k696M9676h015B06693c1999A04444b9483E0381J67535a5469G2987
$$ 103793 101097 150773 -8015 206693 -31999 104444 -29483 50381 217916 -15469 72987
15330G6632g8960A01098K9474a03580A01914a25177J4707j7669k00759B04222
$$ 76632 -78960 101098 130572 -103580 101914 -125177 -110470 -128139 -328898 204222
15319A80046d8512K675E4106a9215B24464M379a58523A03909j6189N6783L9896
$$ 180046 -48512 -45837 54106 -19215 224464 228843 -158523 103909 87720 144503 184399
15308A84399g5356m0287I2707J15054j02844D3240g5979B39601b72846C43916
$$ 184399 -75356 -115643 92707 207761 104917 43240 -75979 239601 -272846 343916
15297C5603J7254P2107a98763A14972K14389o9742E8509J37275D9448a31590E4356
$$ 35603 52857 124964 -198763 114972 329361 259619 58509 195784 49448 -131590 54356
15285B30520F3884j6098J15252a49863A32469e2639A34878J7131D9806L75686
$$ 230520 63884 47786 163038 -149863 132469 -52639 134878 152009 49806 425492
15275D25492A26152b8536E5180g2041I0331K6330k5711K30486a25017E9117J08797
$$ 425492 126152 -28536 55180 -72041 90331 116661 90950 321436 -125017 59117 167914
15264A67914P2769c37420C98226a67992A53117p0123K11152j24729o3109O2589
$$ 167914 240683 -337420 398226 -167992 153117 82994 294146 169417 106308 168897
15254A68897J13002H6382L5464j7448M35270j15894M67740O55039m43655L53002
$$ 168897 281899 86382 121846 104398 539668 423774 891514 1546553 1102898 1455900
15244A455900l68242D69997E959i6683A99853D4189M9370B8295J03060L1997J61393
$$ 1455900 1087658 469997 5959 -96683 199853 44189 93559 28295 131355 163352 324745
15233C24745K4566E3896j0600K4295a57197P3055D20740a30062A86851D2918P9864
$$ 324745 349311 53896 43296 67591 -157197 -84142 420740 -130062 186851 42918 122782
15222A22782b2470B4689M127a52902F7766R2943m9390a77353M6390m1775K5573
$$ 122782 -22470 24689 28816 -152902 67766 160709 111319 -177353 -130963 -172738 -147165
15211a47165N1607L9242d654H6190j1190J1932M8786b48981i9484B78650a74335
$$ -147165 -95558 -56316 -4654 86190 75000 86932 135718 -248981 -99484 278650 -174335
15199c3964E7793e7840B6863K91802G0001B5689K32068q6440K4182d3847j60753
$$ -33964 57793 -57840 26863 318665 70001 25689 257757 171317 195499 -43847 -204600
15188b04600o4480C5383K42398j32466e0044B17417i2228j91262a23346j29679
$$ -204600 -269080 35383 277781 145315 -50044 217417 -92228 -283490 -123346 -253025
15178b53025e3639C7930b23520A55354g5329m1010I6184b88644G4316h2875B90999
$$ -253025 -53639 37930 -223520 155354 -75329 -116339 96184 -288644 74316 -82875 290999
15166a0856k8587A84030D5220P2338e6294j17856A28369E7795J59343M3348A22470
$$ -10856 -39443 184030 45220 117558 -56294 -174150 128369 57795 217138 260486 122470
15154C13643q8862a94881B9213a61652j7821d3612j1323C01015I894c9268k75037
$$ 313643 224781 -194881 29213 -161652 -179473 -43612 -54935 301015 9894 -39268 -314305
15143c14305J50824m4277B2610K95517E6285A0079N7039J75081B2281J72919H6102
$$ -314305 -163481 -207758 22610 318127 56285 10079 67118 242199 22281 195200 86102
15131B33416f9697F4169K10406q3673N1077b59331C66666j80783C2439K34039
$$ 233416 -69697 64169 274575 190902 241979 -259331 366666 185883 32439 266478
15121B66478a25291A17712j6042a59887D3077J11836B4168O0294M186J33754b7704
$$ 266478 -125291 117712 101670 -159887 43077 154913 24168 84462 88648 222402 -27704
15109B40215a80312d6810j01515d2131I6728K72863a50524A59960C4185g1434
$$ 240215 -180312 -46810 -148325 -42131 96728 369591 -150524 159960 34185 -71434
15098f92C06891A9051i4854J6111K3987H6735J66502m5499E2776d5478B64801
$$ -692 306891 19051 -94854 -78743 -54756 86735 253237 207738 52776 -45478 264801
15086F8344K46157h25C04043K74407A95402O8337a10617k87533C64570p9097I902
$$ 68344 314501 -825 304043 578450 195402 263739 -110617 -398150 364570 285473 9902
15074a698A04953K14518I0822N6627e5917D17211H7758c36564F5635L39465A94845
$$ -1698 104953 319471 90822 147449 -55917 417211 87758 -336564 65635 405100 194845
15062e4350r18A82337K09138i1379C20832a72305A27764L7280a11140e4234I5584
$$ -54350 -55268 182337 391475 -91379 320832 -172305 127764 165044 -111140 -54234 95584
15050I784f633I2459a47564A16919A7184J80191K43755A744L16241r158k0321
$$ 9784 -6633 92459 -147564 116919 17184 197375 441130 1744 317985 308827 288506
15039B88506F8348K14591j34861M75360A82121D6149J26549q2607l1628K22414
$$ 288506 68348 282939 148078 623438 182121 46149 172698 90091 58463 280877
15029B80877o5250g9004A96518J23679j02791p4037K46695o5607J06515F7316
$$ 280877 215627 -79004 196518 320197 217406 143369 390064 324457 430972 67316
15018A12835j0417J00796j3775o054a50898B74106q2595K08648p7397J27807A31883
$$ 112835 102418 203214 189439 183385 -150898 274106 191511 400159 322762 450569 131883
15006E33884A56673N151p2057J33170K6476q6721k9122L2948c3946D74072b1542
$$ 533884 156673 161824 89767 222937 249413 162692 133570 166518 -33946 474072 -21542
14994B79120m1092J9444L8805a7611B87554p9116A3932O3207M52251k36257l6678
$$ 279120 238028 257472 296277 -17611 287554 208438 13932 77139 529390 293133 256455
14983B56455o3595p7245K56332C4561K58530j40896D287J52278l752E2450K23030
$$ 256455 192860 115615 371947 34561 293091 152195 4287 156565 152813 52450 275480
14972B75480J68261l6593C8822b18616A10821k1407A7937J44188l9198J89547
$$ 275480 443741 407148 38822 -218616 110821 89414 17937 162125 122927 312474
14962C12474r3813M3609J99480a28866C23989k7295L22928F1025J07792p0357
$$ 312474 218661 262270 461750 -128866 323989 296694 619622 61025 168817 98460
14952I8460K26644J05951A128L75935j55493M06838r1535B44840K31652p4855
$$ 98460 325104 431055 1128 377063 221570 628408 536873 244840 476492 401637
14942D01637p8166J44913K28346k20173j48886j27854L57030B06914j8477E0235
$$ 401637 323471 468384 696730 476557 327671 199817 556847 206914 188437 50235
14931B85221p7596K65757B3753J17507d3235B83805L78282a0484B22308P1677
$$ 285221 207625 473382 23753 141260 -43235 283805 662087 -10484 222308 293985
14921B93985I9594L46951j39390n989I008O6879k7287a2599D74954A86040K46779
$$ 293985 99594 446545 307155 301166 9008 75887 48600 -12599 474954 186040 432819
14910D32819B11590L28918k43909A48187N663M60321k48076M0261j00898J05463
$$ 432819 211590 540508 296599 148187 153850 614171 366095 406356 305458 410921
14900D10921o4721A00071J21200K19486j50467j2888K7899A27090o3129I786J69421
$$ 410921 346200 100071 221271 440757 290290 277402 305301 127090 63961 9786 179207
14889A79207p5226P8760J89670A81541k7872C3031N78235k39963A31457L40571
$$ 179207 103981 182741 372411 181541 153669 33031 611266 371303 131457 472028
14879D72028M4122k08538J49410p7115o2383j22256J17599j035L21218B74390
$$ 472028 516150 307612 457022 379907 317524 195268 312867 311832 633050 274390
14868B50912e3174C79585A85880K79217n1226m0611j82077J90217j62512K119
$$ 250912 -53174 379585 185880 465097 413871 373260 191183 381400 218888 221007
14858B21007k7109L69996A32944K236R7937K24715Q2474o9045K46150l10638K969
$$ 221007 193898 563894 132944 135180 233117 457832 540306 471261 717411 406773 409742
14847D09742p1613A19781K66066P6726k13075J90908A87157J25499J8950r4804
$$ 409742 338129 119781 385847 462573 249498 440406 187157 312656 331606 236802
14837B36802J14292M63640l74542l6908L27618C31203J26458A55722B8361O24054
$$ 236802 351094 814734 440192 403284 730902 331203 457661 155722 28361 652415
14827F52415k82740O6648A72302B3380K96354C1942N35884j74700K68190k95253
$$ 652415 369675 436323 172302 23380 319734 31942 567826 393126 661316 366063
14817C66063j52476K21935J94527B61698K06240Q0246K4937k01952A76689K92102
$$ 366063 213587 435522 630049 261698 467938 548184 573121 371169 176689 468791
14807D68791K01236j89542j53839j33874K66567A22995K55982L0020j24746L18422
$$ 468791 670027 480485 326646 192772 459339 122995 378977 408997 284251 602673
14797F02673q4708p2100j7702j48237E023K72119N50671k25129Q3867B29054K08889
$$ 602673 517965 445865 428163 279926 5023 277142 827813 602684 686551 229054 437943
14786D37943P0976j1669K88687r2309o8356Q6936B77697J23035J12897j53630
$$ 437943 508919 497250 785937 693628 625272 712208 277697 400732 513629 359999
14776C59999A75830J20881L20945C01661r1052K54917j52742L49236k69169L51217
$$ 359999 175830 296711 617656 301661 210609 465526 312784 662020 392851 744068
14766G44068j15624J7681m1243j30659L28139C63654J48370B49521K31916M7814
$$ 744068 628444 646125 604882 474223 802362 363654 512024 249521 481437 529251
14756E29251K38930L3758l94754L36372q2040k15440K54379k27083J22210J2618
$$ 529251 768181 801939 407185 743557 661517 446077 700456 473373 595583 608201
14746F08201P9004P1638p256r7112K61652l30578j95018K59885J95921j57323
$$ 608201 687205 758843 751587 654475 916127 585549 390531 650416 846337 689014
14736F89014o3767K85132j91145L25990k12650k34398k16304L92548j32150J29375
$$ 689014 625247 910379 719234 1045224 832574 598176 381872 774420 642270 771645
14726G71645k43133J07530j75774K52892l19458J30053J11102K01948Q9878l14053
$$ 771645 528512 636042 460268 713160 393702 523755 634857 836805 926683 612630
14716F12630J97943j78498J86406O4588n9450J07513k50512R1282L23226m52916
$$ 612630 810573 632075 818481 883069 823619 931132 680620 771902 1095128 642212
14706F42212K68610p5919J49983m08499O857K10307j40443j60848K37278L3505
$$ 642212 910822 834903 984886 576387 583244 793551 653108 492260 729538 763043
14696G63043l8136L15554j83908l02418L29996j26564j66232M65171r8854J15174
$$ 763043 724907 1040461 856553 554135 884131 757567 591335 1056506 957652 1072826
14686A072826l31000L00420l81507k85172L48894L17171k57108K14668k1061k28593
$$ 1072826 741826 1042246 660739 375567 724461 1041632 784524 999192 978131 749538
14676G49538J18897k24031K25493J02754J0271m2675N6529J70369j86701k96060
$$ 749538 868435 644404 869897 972651 982922 940247 996776 1167145 980444 684384
14666F84384M66395j86205k16584L22488R4632J53543l04627q373Q0218J78345
$$ 684384 1150779 964574 747990 1070478 1165110 1318653 1014026 1005653 1085871 1264216
14656A264216k71817R9433l47430M41784l49378J07515O9615Q0523J339L8330
$$ 1264216 992399 1091832 744402 1186186 836808 944323 1013938 1094461 1095800 1134130
14646A134130K40028l79853L44803k4641k4480k6482l4805k37027J19514K89258
$$ 1134130 1374158 994305 1339108 1314467 1289987 1263505 1228700 991673 1111187 1400445
14636A400445j27754l91334K43897K66972j33770r0647N5303R400J9670J25153
$$ 1400445 1272691 881357 1125254 1392226 1258456 1167809 1223112 1232512 1252182 1377335
14626A377335o3254r7489K96659k23004k58791M17328K93438n37235J4512L00578
$$ 1377335 1314081 1216592 1513251 1290247 1031456 1448784 1742222 1204987 1219499 1520077
14616A520077k28604m0655K46652j54613J64323J3930l5062K47005k56280j9338
$$ 1520077 1291473 1250818 1497470 1342857 1507180 1521110 1486048 1733053 1476773 1457435
14606A457435J60782j23747l5247J95437k12489N6036K13915j49787Q2327L02044
$$ 1457435 1618217 1494470 1459223 1654660 1442171 1498207 1712122 1562335 1644662 1946706
14596A946706m25651L07657k50289J37354k09296M55717n16005K46132J43084
$$ 1946706 1521055 1828712 1578423 1715777 1506481 1962198 1446193 1692325 1835409
14587A835409o5111K4896J00001r999j51548M59893k74997J10006K18185o11129
$$ 1835409 1770298 1795194 1895195 1885196 1733648 2193541 1918544 2028550 2246735 1635606
14577A635606M43548j93563k8467o7952L43582j84191L11999K58662O2173m04034
$$ 1635606 2079154 1885591 1857124 1789172 2132754 1948563 2260562 2519224 2581397 2177363
14567B177363J25239j04120M90483n67315L82776J92767j7458M9974J23115J52834
$$ 2177363 2302602 2198482 2688965 2121650 2504426 2697193 2679735 2729709 2852824 3005658
14557C005658R7127J93745M2088K37652M13579M30544N89301N18238K393470L935025
$$ 3005658 3102785 3296530 3338618 3576270 3989849 4420393 5009694 5527932 7921402 11856427
14547A1856427R299631J7815707k798710A7658863q812959C963074j752264p0814
$$ 11856427 21156058 38971765 36173055 17658863 8845904 3963074 2210810 2139996
14539B139996j29257l40279l8801L40883j56971K99420k67696J38168m8335K14250
$$ 2139996 2010739 1670460 1631659 1972542 1815571 2114991 1847295 1985463 1937128 2151378
14529B151378k13307M4387J27812K01943j01135L45755k26701q3797N7899L69375
$$ 2151378 1938071 1982458 2110270 2312213 2211078 2556833 2330132 2246335 2304234 2673609
14519B673609O3452k59206j2218J03340o0303K35132k32525J09664L49837m08019
$$ 2673609 2737061 2477855 2465637 2568977 2508674 2743806 2511281 2620945 2970782 2562763
14509B562763K11400r1307O6217p639l16944L72934L16693k56785Q2206J98026
$$ 2562763 2774163 2682856 2749073 2741434 2424490 2797424 3114117 2857332 2939538 3137564
14499C137564l9069J45559l86419L58772Q6299p0569M62018l12248n0963J95591
$$ 3137564 3098495 3244054 2857635 3216407 3302706 3232137 3694155 3381907 3330944 3526535
14489C526535L9737j58618K90951o9971j67307o126K86409m47106O05132N0439
$$ 3526535 3566272 3407654 3698605 3628634 3461327 3455201 3741610 3294504 3899636 3950075
14479C950075n47216j26498L92239K30710J54699j55171J78452L59484k80623
$$ 3950075 3402859 3276361 3668600 3899310 4054009 3898838 4077290 4436774 4156151
14470D156151k335j47608J07642J69696n1128M10443l35014Q3742K44041R6507
$$ 4156151 4153816 4006208 4113850 4283546 4232418 4642861 4307847 4391589 4635630 4732137
14460D732137m47864M87737k50009K44657K06726J10840k8237k7656J99119p0997
$$ 4732137 4284273 4772010 4522001 4766658 4973384 5084224 5055987 5028331 5227450 5156453
14450E156453K81912K01464j48813l5532m7109J63099K20656n49428O88792k58013
$$ 5156453 5438365 5639829 5491016 5455484 5408375 5571474 5792130 5242702 5931494 5673481
14440E673481J34374o4142K96176K26617R008J67668k20284L50508K56182q8350
$$ 5673481 5807855 5743713 6039889 6266506 6275514 6443182 6222898 6573406 6829588 6741238
14430F741238j06342K06905k59947P41392p13k54391L52674L46900J5316j55569
$$ 6741238 6634896 6841801 6581854 7323246 7322533 7068142 7420816 7767716 7783032 7627463
14420G627463K28331n4144K00408L92115m1658J4072O8624P4191J19303M34321
$$ 7627463 7855794 7801650 8002058 8394173 8352515 8366587 8435211 8509402 8628705 9063026
14410I063026l52500M95303K51960j73307K73971n2329J76720J89034J02851J85095
$$ 9063026 8710526 9205829 9457789 9284482 9558453 9506124 9682844 9871878 9974729 10159824
14400A0159824L11037J67675K18552L2168L46465L53434j87426K84798J03677
$$ 10159824 10470861 10638536 10857088 10889256 11235721 11589155 11401729 11686527 11790204
14391A1790204K55139L08768M43994k09325K54287J40105M37498L63630K82240
$$ 11790204 12045343 12354111 12798105 12588780 12843067 12983172 13420670 13784300 14066540
14382A4066540K16535L231L89476L26726L22160J80054M54784J39947K58997L09666
$$ 14066540 14283075 14286306 14675782 15002508 15324668 15504722 15959506 16099453 16358450 16668116
14372A6668116M57216K49135N4221P49063K35727R0892J018368J73659M12705
$$ 16668116 17125332 17374467 17428688 18177751 18413478 18504370 19522738 19696397 20109102
14363B0109102M78875P02396K48076M16706N55896O21276L11455L42038O59467
$$ 20109102 20587977 21290373 21538449 21955155 22511051 23132327 23443782 23785820 24445287
14354B4445287K86425P81632Q50073L57830O70053N73957R05063Q07438O22245
$$ 24445287 24731712 25513344 26363417 26721247 27391300 27965257 28870320 29677758 30300003
14345C0300003O14441R83424P88334Q92469O75564R76749J248251J181978Q88275
$$ 30300003 30914444 31897868 32686202 33578671 34254235 35230984 36479235 37661213 38549488
14336C8549488J041798Q09332J630308J275970J180374J326108J443087J185301
$$ 38549488 39591286 40400618 42030926 43306896 44487270 45813378 47256465 48441766
14328D8441766J967193J234306J763418J910116K248763J857387J976540K225573
$$ 48441766 50408959 51643265 53406683 55316799 57565562 59422949 61399489 63625062
14320F3625062J869496K411212K617964K483005L231235K714167L179241L320240
$$ 63625062 65494558 67905770 70523734 73006739 76237974 78952141 82131382 85451622
14312H5451622L352255L205396L855924L731813M198938M233510M159498M732482
$$ 85451622 88803877 92009273 95865197 99597010 103795948 108029458 112188956 116921438
14304A16921438N069249N324598N803436N932759O291682O505254P403472P372192
$$ 116921438 121990687 127315285 133118721 139051480 145343162 151848416 159251888 166624080
14296A66624080P851557Q436318Q672025R445391R813084J0092498J0586176J0386109
$$ 166624080 174475637 182911955 191583980 201029371 210842455 220934953 231521129 241907238
14288B41907238J1566421J2168127J2804896J2674114J3249103J3472956J3691189
$$ 241907238 253473659 265641786 278446682 291120796 304369899 317842855 331534044
14281C31534044J3722560J3372483J3338208J2993491J1900969J1477531R941238
$$ 331534044 345256604 358629087 371967295 384960786 396861755 408339286 418280524
14274D18280524Q359536N990185K675426K7390n32691r43930m090538l832866
$$ 418280524 426640060 432630245 435305671 435333061 434800370 433856440 429765902 425933036
14266D25933036o472433j0242295j2709965j3924264j4580522j5369238j5490506
$$ 425933036 419460603 409218308 396508343 382584079 368003557 352634319 337143813
14259C37143813j5528008j5397513j4963504j4713439j4194778j2201605j2772404
$$ 337143813 321615805 306218292 291254788 276541349 262346571 250144966 237372562
14252B37372562j2294676j1406296j1110871j0248689r899850r072189q457783
$$ 237372562 225077886 213671590 202560719 192312030 182412180 173339991 164882208
14245A64882208q364159o927595p111367p046140o266460n980459n858582m696588
$$ 164882208 156518049 149590454 142479087 135432947 129166487 123186028 117327446 112630858
14237A12630858m922934m512542m568586l851034m323517l136595l410527l319076
$$ 112630858 107707924 103195382 98626796 94775762 90452245 87315650 83905123 80586047
14229H0586047l216474l283869k675885k709335k928208j900977k502037j980644
$$ 80586047 77369573 74085704 71409819 68700484 65772276 63871299 61369262 59388618
14221E9388618j864853k042404j554170k130528j487412j732251j475187r69284
$$ 59388618 57523765 55481361 53927191 51796663 50309251 48577000 47101813 46132529
14213D6132529j286218j788580j219812j532296j321419p30790n69815j257025
$$ 46132529 44846311 43057731 41837919 40305623 38984204 38253414 37683599 36426574
14205C6426574j303957j064130o89928r85515o26781q58012q34719j004127n57241
$$ 36426574 35122617 34058487 33368559 32383044 31756263 30898251 30063532 29059405 28502164
14196B8502164j024074m99028n07223o91402o81085m27970p75562q31615l31711
$$ 28502164 27478090 26979062 26471839 25780437 25099352 24671382 23895820 23064205 22732494
14187B2732494n03152m69782n66138l44088m62375l51417m36616k35954p41841
$$ 22732494 22229342 21759560 21193422 20849334 20386959 20035542 19598926 19362972 18621131
14178A8621131m11647l50633k23481r7129o92258p38654J28227q5001m03393l88458
$$ 18621131 18209484 17858851 17635370 17538241 16845983 16107329 16235556 16150555 15747162 15358704
14168A5358704n04174k19545L9277n17013q2269n32947j08893m96729j38233L93558
$$ 15358704 14854530 14634985 14674262 14157249 14074980 13542033 13433140 12936411 12798178 13191736
14158A3191736l29935n93374l21630k21357M4446j01506j85007m08967r9162j56172
$$ 13191736 12861801 12268427 11946797 11725440 11769886 11668380 11483373 11074406 10975244 10819072
14148A0819072l75948j761m50459K67581l39295j92897k86221j4485j49996k20043
$$ 10819072 10443124 10441363 9990904 10258485 9919190 9726293 9440072 9425587 9275591 9055548
14138I055548K88005n06509j88179K81101o47974N1626K64473m52690p9733j10687
$$ 9055548 9343553 8837044 8648865 8929966 8281992 8333618 8598091 8145401 8065668 7954981
14128G954981K09353m45148j30378j88428K94536n35682P9908q4303j98496J52391
$$ 7954981 8164334 7719186 7588808 7400380 7694916 7159234 7239142 7154839 6956343 7108734
14118G108734k30859N7991m06919O652P1651J42751l34714j03425k10678K91313
$$ 7108734 6877875 6935866 6528947 6535599 6607250 6750001 6415287 6311862 6101184 6392497
14108F392497k48177k52910j27112K36573k77927r4877n3048j10370L77371m11672
$$ 6392497 6144320 5891410 5764298 6000871 5722944 5628067 5575019 5464649 5842020 5430348
14098E430348k07830M77964n33068J42249l99623L19396m91358K61362M690K89
$$ 5430348 5222518 5700482 5167414 5309663 4910040 5229436 4738078 4999440 5004130 5004419
14088E004419j53864J6992j29409O2881R6215k72975k86363J3743K92216l87745
$$ 5004419 4850555 4867547 4738138 4801019 4897234 4624259 4337896 4351639 4643855 4256110
14078D256110O0728Q3918m15287m0429J53289R3388o2625l43081O8903L60476
$$ 4256110 4316838 4400756 3985469 3945040 4098329 4191717 4129092 3786011 3854914 4215390
14068D215390k22343l1185l47852K81557j32905R3886j19643J78706q8056K56332
$$ 4215390 3993047 3961862 3614010 3895567 3762662 3856548 3736905 3915611 3827555 4083887
14058D083887n50448M45241m65709p5574J73793j12494J50596j02708j74792j17690
$$ 4083887 3533439 3978680 3512971 3437397 3611190 3498696 3649292 3546584 3371792 3254102
14048C254102K4644q4653n4901K7630P6577r3738j13206p1867Q2132J8642J21119
$$ 3254102 3278746 3194093 3139192 3166822 3243399 3149661 3036455 2964588 3046720 3065362 3186481
14037C186481l36901j33668K21590l8128O6751L2187j65231j33191K23743n3224
$$ 3186481 2849580 2715912 2937502 2899374 2966125 2998312 2833081 2699890 2923633 2870409
14027B870409j69034r4578J22045p1925J0438J88818j61965j12855k76423L02822
$$ 2870409 2701375 2606797 2728842 2656917 2667355 2856173 2694208 2581353 2304930 2607752
14017B607752P3307J08386n17774Q7647r502J53608J28066l74988o7411K62759
$$ 2607752 2681059 2789445 2271671 2359318 2349816 2503424 2631490 2256502 2189091 2451850
14007B451850O7953k90177p553l3184Q9748J38248l69787J41633k31623j849K31500
$$ 2451850 2519803 2229626 2222073 2188889 2278637 2416885 2047098 2188731 1957108 1955259 2186759
13996B186759K11213j03237J75962k14037J65519M11313K28740P45169L109572
$$ 2186759 2397972 2294735 2470697 2256660 2422179 2833492 3062232 3807401 6916973
13987F916973P933445J8259684N836172j7674803j0392511m413618j566709j049714
$$ 6916973 14850418 33110102 38946274 21271471 10878960 6465342 4898633 3848919
13979C848919j91907n97688j38762m54456J430k47995K69591L29j64843k00954
$$ 3848919 3657012 3059324 2920562 2466106 2467536 2219541 2489132 2489461 2324618 2123664
13969B123664l8818O1795P2693k1014k40517K89703m45462N9001P5479O3444P7133
$$ 2123664 2084846 2146641 2219334 2198320 1957803 2247506 1802044 1861045 1936524 1999968 2077101
13958B077101l12021J50296P1775j19002K14669l40826n1844J60906P8562l02615
$$ 2077101 1765080 1915376 1987151 1868149 2082818 1741992 1690148 1851054 1929616 1627001
13948A627001j8639K26600m57109l5148N15271J40177l76707L2858j35441J06889
$$ 1627001 1608362 1834962 1377853 1342705 1857976 1998153 1621446 1654304 1518863 1625752
13938A625752Q9395j71461j73606L32135N0934M1684m05167J28543J44122k60050
$$ 1625752 1715147 1543686 1370080 1702215 1753149 1794833 1389666 1518209 1662331 1402281
13928A402281M17935n01289J47706j0804j10685J56117K93627q6997m00255J09724
$$ 1402281 1820216 1318927 1466633 1455829 1345144 1501261 1794888 1707891 1307636 1417360
13918A417360k7912j14032J84629k08965O4852j09006J74619L5179l23356K32762
$$ 1417360 1389448 1275416 1460045 1251080 1315932 1206926 1381545 1416724 1093368 1326130
13908A326130J7284N0335O3081n7007p6796k14090J27614R370p1627m12279N43511
$$ 1326130 1343414 1393749 1456830 1399823 1323027 1108937 1236551 1245921 1174294 762015 1305526
13897A305526j08891K28324m76264j00444K26388K0473j41401K63897l3899J31773
$$ 1305526 1196635 1424959 948695 848251 1074639 1095112 953711 1217608 1183709 1315482
13887A315482l9942j42132m3085K19944k09124J01910j47438j10583L44750l90839
$$ 1315482 1275540 1133408 1090323 1310267 1101143 1203053 1055615 945032 1289782 898943
13877H98943L27720k11458K18528N025k26186l97587M42636k47730P5472n950
$$ 898943 1226663 1015205 1233733 1238758 1012572 614985 1057621 809891 885363 879413
13867H79413J8717j19209R6947L51447k55432l10744M57955p9356l50124N03520
$$ 879413 898130 778921 875868 1227315 971883 661139 1119094 1039738 689614 1193134
13857A193134m71143R1759Q9208M553R4294M7561j66318J34230j96466J51917
$$ 1193134 721991 813750 902958 907511 1001805 1049366 883048 1017278 820812 972729
13847I72729j93282K95467q0171o2763n1193k33818K06229p2990K47217L16034
$$ 972729 779447 1074914 994743 931980 880787 646969 853198 780208 1027425 1343459
13837A343459k78909k37947r1282O4486J80636N8931l81253J45755P5289K6113
$$ 1343459 1064550 826603 735321 799807 980443 1039374 658121 803876 879165 905278
13827I05278k30264o0183J90765J10014k28558K74460j01182M6629j09047P4566
$$ 905278 675014 614831 805596 915610 687052 961512 860330 906959 797912 872478
13817H72478j63910k4045n0069L07355k63502J66700N3477j27970k39784M25205
$$ 872478 708568 684523 634454 941809 678307 845007 898484 770514 530730 955935
13807I55935l5437m18972J06370K77476p8712l25676M41613j69570m6794J16484
$$ 955935 920498 501526 607896 885372 806660 480984 922597 753027 706233 822717
13797H22717l91229L83585P8111l49395L94272j04651R3516k25429Q540n8410
$$ 822717 431488 815073 893184 543789 938061 833410 926926 701497 710037 651627
13787F51627n8717P1960J7372K08743k66609j41976K68024m9101J82084k9240
$$ 651627 592910 664870 682242 890985 624376 482400 750424 701323 883407 854167
13777H54167J17535m84517J15648p9028K19821K03951n3197C36356M98859p0850
$$ 854167 971702 487185 602833 523805 743626 947577 894380 336356 835215 764365
13767G64365k27425K05796m3673j31287l5403j14141J45216J50136j67669J23421
$$ 764365 536940 742736 699063 567776 532373 418232 563448 713584 545915 669336
13757F69336N4551o7390j84232R8893n7075L75697j77873r9188k07021N00537
$$ 669336 723887 656497 472265 571158 514083 889780 711907 612719 405698 906235
13747I06235k73929q563j74813K1155q4360K59294J06687k83140j71529J94590
$$ 906235 632306 623743 448930 470085 385725 645019 751706 468566 297037 491627
13737D91627J7427J78941l2926j04803K68879k30230R8307q2370K8540k63316
$$ 491627 509054 687995 655069 550266 819145 588915 687222 604852 633392 370076
13727C70076J84003K4194P5991Q980l17905K23986K52307k75954O7211o4781M1522
$$ 370076 554079 578273 654264 663244 345339 569325 821632 545678 612889 548108 589630
13716E89630j44454q6218J89691F9350L80637J29469A86686K06250K27076j66817
$$ 589630 445176 358958 548649 69350 449987 579456 186686 392936 620012 453195
13706D53195J0074m9975N51115C34770J84922j74334m914M63075B23811K81177
$$ 453195 463269 413294 964409 334770 519692 345358 340444 803519 223811 504988
13696E04988o4994K78155k86028J27833k19042K72445l9307j68291j30740J04359
$$ 504988 439994 718149 432121 559954 340912 613357 574050 405759 275019 379378
13686C79378J56172B59644J00127K10952P8336k36562N2770J1524m5959k07520
$$ 379378 535550 259644 359771 570723 649059 412497 465267 476791 430832 223312
13676B23312R4212j56355L55172l4528N8691j66006A17207J96578K52035j03952
$$ 223312 317524 161169 516341 481813 540504 374498 117207 313785 565820 461868
13666D61868N6202L58105m19672j39370M7372q286m326L50118B93457n6882j6881
$$ 461868 518070 876175 456503 317133 364505 356219 351893 702011 293457 236575 219694
13655B19694J64351k1122L0962j3886K16831k43149o3L07699o2335k63331J69560
$$ 219694 384045 362923 393885 379999 596830 353681 353618 661317 598982 335651 505211
13644E05211J78929l1637J0131k29000J0211J49049k12130L1778m5612K0671O7502
$$ 505211 684140 652503 662634 433634 443845 592894 380764 412542 366930 387601 455103
13633D55103o3799j18254l8766Q8957A41010J88810r5961j06529F3225K00307
$$ 455103 391304 273050 234284 323241 141010 329820 233859 127330 63225 263532
13623B63532K6560k3781K63277B53544J0138M7697o7878K60084j72777A36429
$$ 263532 290092 266311 529588 253544 263682 311379 243501 503585 330808 136429
13612D37978A32832L54351r4201C8106L94675K99263j98426J5563B70325J646
$$ 437978 132832 487183 392982 38106 432781 732044 533618 549181 270325 271971
13602B71971k1618J7482K63288B20161Q4520N6009K01021B50387K96037k56932
$$ 271971 250353 267835 531123 220161 304681 360690 561711 250387 546424 289492
13592B89492n2458J40722L57378B82733R931J13185P4120A65102J74526L9106
$$ 289492 237034 377756 735134 282733 292664 405849 479969 165102 339628 378734
13582C78734d754F4604L70460j88107M33863b61857B04618p9791R4092O5633R0302
$$ 378734 -4754 64604 435064 246957 680820 -261857 204618 124827 218919 284552 374854
13571C74854A59125K82591l0905A74634R1194J26540o8053L04681I4175J28809
$$ 374854 159125 441716 410811 174634 265828 392368 324315 628996 94175 222984
13561B22984q436J24135M1124l2758l4d6483C32455j9677j28267J58752K24235
$$ 222984 214548 338683 379807 347049 347015 -46483 332455 312778 184511 343263 567498
13550E67498k30962J07254A51593J44261j6933L56566B81779n1875K90991j20585
$$ 567498 336536 443790 151593 295854 278921 635487 281779 229904 520895 400310
13540D00310j08450H2460k3671L22527p2268j48803J64198B4087O5727M65754
$$ 400310 291860 82460 58789 381316 309048 160245 324443 24087 89814 555568
13530E55568B69435A17016O9233l4133F8787L07452j36964J5486J02376j60175
$$ 555568 269435 117016 186249 152116 68787 376239 239275 254761 357137 196962
13520A96962q2645J97144J35366M89425D862P4586L15763j94832D2019L48851
$$ 196962 114317 311461 446827 936252 4862 79448 395211 200379 42019 390870
13510C90870A14817j8456J97615a0630k3069B25668f3704C7767P0258e7682C22759
$$ 390870 114817 96361 293976 -10630 -33699 225668 -63704 37767 108025 -57682 322759
13498D42950A80090N2745j06024m7135J30262K2290J20854A25435O0445A6095
$$ 442950 180090 232835 126811 79676 209938 232228 353082 125435 185880 16095
13487a23964B14452J17052J32329p2485j73565a34033A5992L52151f7100A81577
$$ -123964 214452 331504 463833 391348 217783 -134033 15992 368143 -67100 181577
13476B50797A12221a12437D63797B729M77716I4020B8949L28777A65742J27951
$$ 250797 112221 -112437 463797 2729 480445 94020 28949 357726 165742 293693
13466B93693j7197q0023n8185P162h675C90323F4499L3863A0964K60673J62021
$$ 293693 276496 196473 138288 145450 -8675 390323 64499 98362 10964 271637 433658
13455D33658P362A61265P8574J24109p8457n7117K11056j61226L3222P3963q2362
$$ 433658 441020 161265 239839 363948 285491 228374 439430 278204 311426 385389 303027
13444C03027K69308j0469j44466O4642a41976C94829j44028o3871J96669P412
$$ 303027 572335 561866 417400 482042 -141976 394829 250801 186930 383599 391011
13434C91011N2743f3480F22768a5871A40008K49581A20983m4428K77209F5270
$$ 391011 443754 -63480 622768 -15871 140008 389589 120983 76555 353764 65270
13423B04109J78854m8569g3841F04322a82342B67267j33158L08590r2110A33038
$$ 204109 382963 334394 -73841 604322 -182342 267267 134109 442699 350589 133038
13412E8734K550K14090N4209o7b2384A19642Q5824n2530L62808D7821L03408D8821
$$ 58734 61284 275374 329583 329516 -22384 119642 205466 152936 515744 47821 351229 48821
13399C59446A29147o590N0934A2528a63395O5146C1557b1260A73439J09027j03596
$$ 359446 129147 122557 173491 12528 -163395 -98249 31557 -21260 173439 282466 178870
13388A78870Q283I3368k816J22795R2446j48313B4684K15591l9638p1675J32751
$$ 178870 187153 93368 90552 213347 305793 157480 24684 240275 200637 128962 261713
13377B61713I7932L6173K75792j40356J93623R7836o8151A37349F3087K25641
$$ 261713 97932 134105 409897 269541 463164 561000 492849 137349 63087 288728
13367B88728j21281q3260l657J61803A19153N5642n4704A3602L15716r6802N1236
$$ 288728 167447 84187 80530 242333 119153 174795 120091 13602 329318 232516 283752
13356B83752K23340a6389I3482M57122A80364a15225D16633j98013p9435b0290
$$ 283752 507092 -16389 93482 550604 180364 -115225 416633 218620 139185 -20290
13345E46521B41655H8839L01277j18429L01574j25875j26151I4730L8972M81368
$$ 546521 241655 88839 390116 271687 573261 447386 321235 94730 133702 615070
13335F15070A13143j4555N0044K640J08741a15704G6319A6995d704B20355K26468
$$ 615070 113143 98588 148632 151272 260013 -115704 76319 16995 -4704 220355 446823
13324D46823H4260N9988R8919J3064K10490K9254c9054B22091J30332j39042L7011
$$ 446823 84260 144248 243167 256231 466721 495975 -39054 222091 352423 213381 250392
13313B50392o8379k6905l1496B9444L32225a64846L5360H4004M5283d8388B0442
$$ 250392 182013 155108 123612 29444 361669 -164846 -129486 84004 129287 -48388 20442
13301C20666R901A09096J18930m8892m4662F2910J7191O1517j6016K711k2324
$$ 320666 330567 109096 228026 179134 134472 62910 80101 141618 125602 128313 105989
13290A05989M2401a17150I9623b15288a3785q0025A66153n7666J0230k1248J08572
$$ 105989 148390 -117150 99623 -215288 -13785 -93810 166153 108487 118717 97469 206041
13279B06041G9379j9799A145J21353j2398g4459A92546G288K73187e315B14865
$$ 206041 79379 59580 1145 122498 110100 -74459 192546 7288 280475 -5315 214865
13267A64002h8103a0368A10304E217J54000i9247C73028n3241A8719H869L48412
$$ 164002 -88103 -10368 110304 5217 159217 -99247 373028 319787 18719 8869 357281
13256C57281n0751H4947a41817C50733r249j52528e7467B32810o9219n537C2212
$$ 357281 306530 84947 -141817 350733 341484 188956 -57467 232810 163591 158054 32212
13244C95568I6062K07973I1985L0866E881L81083D0244A3080J83620a84476f4557
$$ 395568 96062 304035 91985 122851 5881 386964 40244 13080 196700 -184476 -64557
13232I0090J22255J09533j583L8C5515a11470b1199B35436j00427l7091d9863
$$ 90090 212345 321878 320295 320333 35515 -111470 -21199 235436 135009 97918 -49863
13220G9105f1497C18249a08990p8712F74110B86089g0526F1205L6372J8025J41125
$$ 79105 -61497 318249 -108990 -187702 674110 286089 -70526 61205 97577 115602 256727
13209B56727c5777m7164A87542H3765r886c6496B24120J29407C0584Q0005b58238
$$ 256727 -35777 -82941 187542 83765 73879 -36496 224120 353527 30584 110589 -258238
13197F0117J50061P8171c2969B04175N0177d6649A94854P278e6329Q190l2657
$$ 60117 210178 288349 -32969 204175 254352 -46649 194854 202132 -56329 -48139 -80796
13186h0796C80272f3536E04375A45889B613M85823a31643J9760B27378a27122
$$ -80796 380272 -63536 504375 145889 2613 488436 -131643 -111883 227378 -127122
13175D30670j00578a32467B64484A23623c4476m1738A47061J5916D2809J14412
$$ 430670 330092 -132467 264484 123623 -34476 -76214 147061 162977 42809 157221
13165A57221k7395a60937f2885F5415K69344h7390p8656A19177L10458A37477
$$ 157221 129826 -160937 -62885 65415 334759 -87390 -166046 119177 429635 137477
13154I223c7584j18951D2584b08037F5937P8304a57943c3226B04292q7786P2372
$$ 9223 -37584 -156535 42584 -208037 65937 144241 -157943 -33226 204292 116506 188878
13143A88878g1689a8660J60q2835B19994E9166B6683J97560j02360M7535j305
$$ 188878 -71689 -18660 -18500 -101335 219994 59166 26683 224243 121883 169418 168113
13132A68113J58134A37724L7456b9261G1831K19513j20622K78b8247H2930J96927
$$ 168113 326247 137724 175180 -29261 71831 291344 170722 171000 -28247 82930 279857
13121B79857G2171P6747c43330m5543C1234R5524J37713k9360j1395K197a63703
$$ 279857 72171 148918 -343330 -388873 31234 126758 264471 235111 223716 225913 -163703
13109A17710a03241A34275J05954J9831R167b14867A96992b7576A36174f2941
$$ 117710 -103241 134275 240229 260060 269227 -214867 196992 -27576 136174 -62941
13098g6301B39633n2318a67096a7301o6506L0754j3495I5400J22465a19244e4868
$$ -76301 239633 187315 -167096 -17301 -83807 -53053 -66548 95400 217865 -119244 -54868
13086e4829j45483I463J89199b01326j5930A15180D6687K18748N6834A51519L6622
$$ -54829 -200312 9463 198662 -201326 -217256 115180 46687 265435 322269 151519 188141
13075A88141k3596J10917c24743C50229m8514F8608K79680p8407a08329c5730
$$ 188141 164545 275462 -324743 350229 301715 68608 348288 269881 -108329 -35730
13064B82530j34251J76297m5812C1610J90012q0792a17490e898r5173j56997b6720
$$ 282530 148279 324576 278764 31610 221622 140830 -117490 -5898 -101071 -258068 -26720
13052B36743a53739A9483J78586E2179J62534C7941b4114A71718j4499B7951J23449
$$ 236743 -153739 19483 198069 52179 214713 37941 -24114 171718 157219 27951 151400
13041A51400p3132R6719l4420Q1348k2575b54026D9870a04592B42131H1910c0979
$$ 151400 78268 174987 140567 221915 199340 -254026 49870 -104592 242131 81910 -30979
13029H4284O2291J13372b39748A12803J4822L8376D3930K06976K36963A48898
$$ 84284 146575 259947 -239748 112803 127625 166001 43930 250906 487869 148898
13018F2120J88344J47083F3016b3644D5909J34864Q7237J1627m0677F580f2144
$$ 62120 250464 397547 63016 -23644 45909 180773 268010 279637 238960 6580 -62144
13006b19977A27907a21404m1962p3050C6786K00066k3414R3424k2734b64819M6827
$$ -219977 127907 -121404 -163366 -236416 36786 236852 213438 306862 284128 -264819 -217992
12995b17992f5999B56513o0791J25591j22749K04764j85179O8428p4205N2368
$$ -217992 -65999 256513 195722 321313 198564 403328 218149 286577 212372 264740
12985B64740A00245b40862m4572A57952g2023A58074F832a9566B64689q8769b24709
$$ 264740 100245 -240862 -285434 157952 -72023 158074 6832 -19566 264689 175920 -224709
12973D13436a17487i607p4809m5455B17872d452j82929N3490B93529D3706K45168
$$ 413436 -117487 -9607 -84416 -129871 217872 -4452 -187381 -133891 293529 43706 288874
12962B88874R8052q9437J06598j37148B2868a31491M7416B6780J53093A4673c38456
$$ 288874 386926 297489 404087 266939 22868 -131491 -84075 26780 179873 14673 -338456
12950C56831b9346r0202A9872L3002K98898F225J10679D3061J40599M4300E4932
$$ 356831 -29346 -119548 19872 52874 351772 6225 116904 43061 183660 227960 54932
12938A67538p4941D4335a23571C08662r5523c44143A28242h1411A41109f8319
$$ 167538 92597 44335 -123571 308662 213139 -344143 128242 -81411 141109 -68319
12927a3541G9673a06456D75095E4483n350a88854r769k70407A17174E4632J55295
$$ -13541 79673 -106456 475095 54483 49133 -188854 -198623 -469030 117174 54632 209927
12916B09927q6541K5426A542K90013I6352d76218a2951l614l8843F4209L3048
$$ 209927 123386 148812 1542 291555 96352 -476218 -12951 -16565 -55408 64209 97257
12905I7257l3109L3945a7615A16950J9005j7351L5539n4845i23j9315j28569C9519
$$ 97257 64148 98093 -17615 116950 135955 118604 154143 99298 -923 -20238 -148807 39519
12892a26398K3283A65132E7985O4929N8277a4715B43600R7684c8777k35053B49107
$$ -126398 -103115 165132 57985 122914 181191 -14715 243600 341284 -38777 -273830 249107
12880B41522L3127j30343Q337g1930Q133A01752J08749M6806o8694c52679A68501
$$ 241522 274649 144306 152643 -71930 -63797 101752 210501 257307 188613 -352679 168501
12868i1677n3798m9285p6462P7063O0932C36865K1514l9186b33825F5022J68047
$$ -91677 -145475 -194760 -271222 -194159 -133227 336865 358379 319193 -233825 65022 233069
12857B33069E8329O01663A03432a91509n1386J7188f874D2654d63594A48558f1106
$$ 233069 58329 659992 103432 -191509 -242895 -225707 -6874 42654 -463594 148558 -61106
12845a70242A36693c9665j95915A54685c06547e9483G7792a66760G8207a25975
$$ -170242 136693 -39665 -235580 154685 -306547 -59483 77792 -166760 78207 -125975
12834C5576c40032A23435b1396j29890A33883l5213l5553a93740E3293b23949
$$ 35576 -340032 123435 -21396 -151286 133883 98670 63117 -193740 53293 -223949
12823a53554d8006j4644F73531a794o0288n683j43641f4945m4093k24096e312
$$ -153554 -48006 -62650 673531 -1794 -62082 -67765 -211406 -64945 -109038 -333134 -5312
12811A35354l8516J17602f6569A24483J47057H2798L83661h7975j71871L6456
$$ 135354 96838 214440 -66569 124483 271540 82798 466459 -87975 -259846 -223390
12801b23390c8804A76356C6397J03437k612a54626o9C10542B8022c1473A34427
$$ -223390 -38804 176356 36397 139834 137222 -154626 -154695 310542 28022 -31473 134427
12789B00503a63615H3496G555K25269a92461K1647B23303a98976F8632M1378D1803
$$ 200503 -163615 83496 7555 232824 -192461 -170814 223303 -198976 68632 110010 41803
12777F9182k8215P5783E7315J85490a12060A33154b6971C30412r8060M1806J50561
$$ 69182 40967 116750 57315 242805 -112060 133154 -26971 330412 232352 274158 424719
12766D24719a89853D2656R917a30423A36834K6878F5134a0049o9623C5252b41255
$$ 424719 -189853 42656 52573 -130423 136834 163712 65134 -10049 -79672 35252 -241255
12754h0451j76166d1699o6814C1588N420a37112g755B64965C3254J6151J22637
$$ -80451 -256617 -41699 -108513 31588 37008 -137112 -7755 264965 33254 49405 172042
12743A72042l5595f8568A68357a3569j82393A93567g3554D61717A47208F7704
$$ 172042 136447 -68568 168357 -13569 -195962 193567 -73554 461717 147208 67704
12732A31578M20131a08553B5365L581r190J0102K08342j03095n3326c20036Q802
$$ 131578 551709 -108553 25365 28946 19756 29858 238200 135105 81779 -320036 -311234
12721c11234B03228J02286f036B40061c49402A13582L0109J2650N5044l168r8906
$$ -311234 203228 305514 -6036 240061 -349402 113582 143691 156341 211385 208217 109311
12710A09311J23608G6442J54654L1846a28426D62829c3401D60792K0680A94866
$$ 109311 232919 76442 231096 262942 -128426 462829 -33401 460792 481472 194866
12699A52144P991C9003Q8363k510a12562D7056a27645B37857a6290q2589H3359
$$ 152144 160135 39003 127366 124856 -112562 47056 -127645 237857 -16290 -98879 83359
12687F4185A6710J70174C9813K6630R244L3337J01516r7479K38453D9226a11470
$$ 64185 16710 186884 39813 66443 75687 109024 210540 113061 351514 49226 -111470
12675B09109R2434I9445K48446E8916c2819j45855A42297g5697e738C6660K49575
$$ 209109 301543 99445 347891 58916 -32819 -178674 142297 -75697 -5738 36660 286235
12664B86235b86043B51724D8896J34400j6944J36621b1896k80445J39425B77103
$$ 286235 -286043 251724 48896 183296 166352 302973 -21896 -302341 -162916 277103
12653f6159B46865m3590J67094p8925b1490C210i0461A56267c30617C0603J2070
$$ -66159 246865 203275 370369 291444 -21490 3210 -90461 156267 -330617 30603 42673
12642D2673e45j44263J6664A48229a68709A05089h9907f373B63821K01803A69156
$$ 42673 -545 -144808 -128144 148229 -168709 105089 -89907 -6373 263821 465624 169156
12630D3709J07949e3571A35811P5919q8911l6561K76089A8893a23070H2571f2134
$$ 43709 151658 -53571 135811 211730 122819 86258 362347 18893 -123070 82571 -62134
12618e0399H7370L82747a81135E30a15584C35437e6321A06253B9565D152J1203
$$ -50399 87370 470117 -181135 530 -115584 335437 -56321 106253 29565 4152 15355
12607A5355J17153Q0172A6526h5436K459K9337B52854c9420B88416g4657k7590
$$ 15355 132508 212680 16526 -85436 -82977 -53640 252854 -39420 288416 -74657 -102247
12596a02247B55231E0329J70827a84003C31090A11986a4112j98304D5885J242
$$ -102247 255231 50329 221156 -184003 331090 111986 -14112 -212416 45885 47127
12586D7127a39076I6960J78758a13639A15695i2522A31797A9351n042J38116b99524
$$ 47127 -139076 96960 275718 -113639 115695 -92522 131797 19351 14309 152425 -299524
12574a35934c5836B40569D7619K32088D424a71003A32346C7941M7595a12086H0224
$$ -135934 -35836 240569 47619 279707 4424 -171003 132346 37941 85536 -112086 80224
12562A54507f0579m40985a7535l30571A31428a28807B83081A2582h9547M233l38814
$$ 154507 -60579 -501564 -17535 -348106 131428 -128807 283081 12582 -89547 -85314 -424128
12551d24128B40407c63583C50513c1815B62984b7211L616C07776E6697J81426
$$ -424128 240407 -363583 350513 -31815 262984 -27211 -23595 307776 56697 238123
12541B38123a08145A783J52154e2328j10356C58003l1429F5616i2791A78172D0392
$$ 238123 -108145 1783 153937 -52328 -162684 358003 326574 65616 -92791 178172 40392
12529a24080k94742a33275N5923B95076b20973b210D763b17568B47145h8777g244
$$ -124080 -418822 -133275 -77352 295076 -220973 -2210 4763 -217568 247145 -88777 -7244
12517A68109C5083A1378L9769p015L28239j10006J2562f7157D6973d0560A24429
$$ 168109 35083 11378 51147 44132 372371 262365 274927 -67157 46973 -40560 124429
12505g9497B9573M5181b2347o975j44241A99027N151A00621L4975G548J79623
$$ -79497 29573 74754 -22347 -29322 -173563 199027 204178 100621 135596 7548 187171
12494A87171f6385A63004d1903J8582j3789j78812A01447b42157B16656F7524
$$ 187171 -66385 163004 -41903 -23321 -37110 -215922 101447 -242157 216656 67524
12483a16116M400F660d66307a8358B29433q9941a87563A2916M9600P0033J4619
$$ -116116 -111716 6660 -466307 -18358 229433 139492 -187563 12916 62516 132549 147168
12472A47168a7117D4088P8848c30203a42878B1141a03652K2919A91861b99738
$$ 147168 -17117 44088 122936 -330203 -142878 21141 -103652 -80733 191861 -299738
12461A63188H1000a33176d3002C93748j90997F7726d23781g6827F9651c4656m2604
$$ 163188 81000 -133176 -43002 393748 202751 67726 -423781 -76827 69651 -34656 -77260
12450g7260B75779I7974b38009R4889C6886a38508A11171a39725B73211A27876
$$ -77260 275779 97974 -238009 -143120 36886 -138508 111171 -139725 273211 127876
12439C65235j43802a66096b8013b208l1312j65893A48468a70196o9351B87358
$$ 365235 221433 -166096 -28013 -2208 -33520 -199413 148468 -170196 -239547 287358
12428a53113C83205i8923K1241E8132I381M762N7014C5279L29063r8221O730d1694
$$ -153113 383205 -98923 -77682 58132 9381 14143 71157 35279 364342 266121 272851 -41694
12415b10575A61987i2325o656A54798J47153n4474r480A8967b15491F6392o121
$$ -210575 161987 -92325 -98981 154798 301951 247477 237997 18967 -215491 66392 60271
12404F0271P9211A085a29365j36012A2741J129h0082j39775B31176n7695b34529
$$ 60271 139482 1085 -129365 -265377 12741 13870 -80082 -219857 231176 173481 -234529
12392c00962n2056b4960F02J86590o8431J9548K29989j20276a12300A49376f7123
$$ -300962 -353018 -24960 602 187192 118761 138309 368298 248022 -112300 149376 -67123
12380b9731m9288A49634a82935b8209j08687j4735j7528A51002l9316a94899i1062
$$ -29731 -79019 149634 -182935 -28209 -136896 -151631 -169159 151002 111686 -194899 -91062
12368F8249O688h0783D7441b53537A17031b19293b2322k60611h0505p6981O9020
$$ 68249 74937 -80783 47441 -253537 117031 -219293 -22322 -282933 -80505 -157486 -88466
12357h8466c0762B19951b25412I0894a56142f6516q4359B75633A4359g0371j76027
$$ -88466 -30762 219951 -225412 90894 -156142 -66516 -150875 275633 14359 -70371 -246398
12346b46398A6076g342C6528f0724A69948F3324a98210A24805a60645j7936d4901
$$ -246398 16076 -7342 36528 -60724 169948 63324 -198210 124805 -160645 -178581 -44901
12334a13395F6627c2900B1289J93665c40520A22036f6453B17443d7141F5321b21685
$$ -113395 66627 -32900 21289 214954 -340520 122036 -66453 217443 -47141 65321 -221685
12322i3274J3492q2091d3265A30368a25210j2423B88548h0194q8701H166c6567
$$ -93274 -79782 -161873 -43265 130368 -125210 -137633 288548 -80194 -168895 8166 -36567
12310a76667E5887P6266L3245a22516A55318I583h3333C7474N4678a02085B36744
$$ -176667 55887 132153 165398 -122516 155318 9583 -83333 37474 92152 -102085 236744
12298G2287F557b03237A68278g6369j49482A00704b67656A35979R5939p8580a49528
$$ 72287 6557 -203237 168278 -76369 -225851 100704 -267656 135979 231918 153338 -149528
12286g4655j46144B50284n8252K8741o1360P2707r4050O0204a31404B79496a06387
$$ -74655 -220799 250284 192032 220773 159413 232120 138070 198274 -131404 279496 -106387
12274D82015b4087o410A34256l458K7511l5839j2577d3445B85461D2082a78907
$$ 482015 -24087 -30497 134256 130798 158309 122470 109893 -43445 285461 42082 -178907
12262B77196e5302B27058L2734d4399B3366K01515a16062B96821N730j33052B6993
$$ 277196 -55302 227058 259792 -44399 23366 224881 -116062 296821 302551 169499 26993
12250g459A33780K65906j01812a45424O2697A10803a00985A95782M8444P695c7326
$$ -7459 133780 399686 297874 -145424 -82727 110803 -100985 195782 244226 251921 -37326
12238G5874a98944G6619b32995D24108A35238a16667A91332p8451O4138a17226
$$ 75874 -198944 76619 -232995 424108 135238 -116667 191332 112881 177019 -117226
12227B10153J7544c8178B77720J10832J88652k49196H1007N8454P0851J2457j02664
$$ 210153 227697 -38178 277720 388552 577204 328008 81007 139461 210312 222769 120105
12216A20105r172A581b59490B7184K06888k52e3888B8676M4162J79904B4873L51639
$$ 120105 110933 1581 -259490 27184 234072 233820 -53888 28676 72838 252742 24873 376512
12204C76512A50634R3015H8440R7113B6300J17315N9191I6030Q6422R2665C707
$$ 376512 150634 243649 88440 185553 26300 143615 202806 96030 182452 275117 3707
12192B96662C6452I245L03949q1216a10521F8101J71791j12919a17533M2963F9875
$$ 296662 36452 9245 313194 231978 -110521 68101 239892 126973 -117533 -74570 69875
12180C92351a32454D22846a00312B41059p3223c700A00928K68057A22981E0207
$$ 392351 -132454 422846 -100312 241059 167836 -3700 100928 368985 122981 50207
12169B51533k5130j05412M4274a2964A55367G2732R4887l3767m8968b53031B53691
$$ 251533 226403 120991 165265 -12964 155367 72732 167619 133852 84884 -253031 253691
12157a21913a1621B24661M4516a06770A81208B0427R7945a44082A40938J88393
$$ -121913 -11621 224661 269177 -106770 181208 20427 118372 -144082 140938 329331
12147C29331H3995B6024R7791D5406i6623e67p2417A22267J68266p6891c4699
$$ 329331 83995 26024 123815 45406 -96623 -567 -72984 122267 290533 213642 -34699
12135F8729l1039K0686J37211k7681a97883q5088B66990a72835K7056d8582n1584
$$ 68729 37690 58376 195587 167906 -197883 -282971 266990 -172835 -145779 -48582 -100166
12124a00166B625a69517C03816J63878G5185n188f9391A51275o8318a77593O0156
$$ -100166 2625 -169517 303816 467694 75185 69997 -69391 151275 82957 -177593 -117437
12113a17437A82318b13273D4997a89597H3361f9469q0348g729B4354i6537A47670
$$ -117437 182318 -213273 44997 -189597 83361 -69469 -149817 -7729 24354 -96537 147670
12101b49833B18649f8102A24320d3634B83964j15750a14038A04918C6536J09692
$$ -249833 218649 -68102 124320 -43634 283964 168214 -114038 104918 36536 146228
12091A46228a8668j70895b3343k0832k11654E0758a93136C9971h6820K5990j74328
$$ 146228 -18668 -189563 -23343 -44175 -255829 50758 -193136 39971 -86820 -60830 -235158
12080b35158I5274b16630B5546J69614a81090A97972b35182B35685b13759B08879
$$ -235158 95274 -216630 25546 195160 -181090 197972 -235182 235685 -213759 208879
12069c2150q4682b7596B18749G2116a6369d291k1940j2718D6746J05193J96805
$$ -32150 -116832 -27596 218749 72116 -16369 -4291 -26231 -38949 46746 151939 348744
12058C48744r7951M8250c6881E7992L28987R04379J94828D26998r561J02342a96273
$$ 348744 250793 299043 -36881 57992 386979 1291358 1486186 426998 417437 519779 -196273
12046B65029A01829J37943F1701J8959K90242A68800a01335B78412f4879K5931
$$ 265029 101829 239772 61701 80660 370902 168800 -101335 278412 -64879 -38948
12036c8948J475a6733k83229i3547B39215i7808C1131P4356C6589g3996A11048
$$ -38948 -37473 -16733 -299962 -93547 239215 -97808 31131 105487 36589 -73996 111048
12024A3779a49978E0239O2513a79923O0653A03442J80369I8022C3668K1301K1523
$$ 13779 -149978 50239 112752 -179923 -119270 103442 283811 98022 33668 54969 76492
12013G6492O362a8133F3656a9953B25816a71903H7363C1114f6202I5912K6729
$$ 76492 82854 -18133 63656 -19953 225816 -171903 87363 31114 -66202 95912 122641
12002A22641b6l3019p5109L0077o883p3371A06921a3086D3405j9773c6760H7069
$$ 122641 -26 -33045 -108154 -78077 -84960 -158331 106921 -13086 43405 23632 -36760 87069
11989D8111d6216B610f8080J9096A06413b48090C37575g4702D2938d4448A9856
$$ 48111 -46216 2610 -68080 -48984 106413 -248090 337575 -74702 42938 -44448 19856
11977a5225m4440c777j56045I8943a2849j51531P4394p4603L7688G8698l7518
$$ -15225 -59665 -3777 -159822 98943 -12849 -164380 -89986 -164589 -126901 78698 41180
11966D1180b449j2543l74426J82014J03305A02742a45847l5672A41822F7513i9860
$$ 41180 -2449 -14992 -389418 -207404 -104099 102742 -145847 -181519 141822 67513 -99860
11954A27372e8226j43007A9949a32245q0638A58386C5438e6257j43041R6398C25006
$$ 127372 -58226 -201233 19949 -132245 -212883 158386 35438 -56257 -199298 -102900 325006
11942f1281A35752o7794A198b03668c4755j53227B06804B8500G38a40799e0160
$$ -61281 135752 67958 1198 -203668 -34755 -187982 206804 28500 738 -140799 -50160
11930A27453k7182A4646F80d3211k8751p5617j66029C08233i6210A79387n5609
$$ 127453 100271 14646 680 -43211 -71962 -147579 -313608 308233 -96210 179387 123778
11919A23778a59227A42861E9437J01710F2015b13373M9502I2708g5917A78627
$$ 123778 -159227 142861 59437 161147 62015 -213373 -163871 92708 -75917 178627
11908A71133b04781R3422E9666O7086j0711a65114A37594B6419M15068F8164F303
$$ 171133 -204781 -111359 59666 126752 116041 -165114 137594 26419 441487 68164 6303
11896D3728J8281M5219b6708r5977l8822N8331b3382m6482B17532h3806j29033
$$ 43728 62009 107228 -26708 -122685 -161507 -103176 -23382 -69864 217532 -83806 -212839
11885b12839A35848a33039A65978P9329a41984p7860m3688f1299n22818a92336
$$ -212839 135848 -133039 165978 245307 -141984 -219844 -263532 -61299 -584117 -192336
11874b03993A24479A3893L83902j80096j05830d3877r2926H1070O0743c38033
$$ -203993 124479 13893 397795 217699 111869 -43877 -136803 81070 141813 -338033
11863a91881j9820L294A95544h4417e642H4233a63872p090b1734E1695a8800A8258
$$ -191881 -211701 -208407 195544 -84417 -5642 84233 -163872 -170962 -21734 51695 -18800 18258
11850h2584a4793j59828g9879n2268m5666d3401n616k36294e789j42807k5235
$$ -82584 -14793 -174621 -79879 -132147 -177813 -43401 -49017 -285311 -5789 -148596 -173831
11839a73831b8442A17535b71757a2022j91505m244Q9197E5932f5804k51005C4683
$$ -173831 -28442 117535 -271757 -12022 -203527 -207771 -118574 55932 -65804 -316809 34683
11827F8660g891I2722D0939L2038f0594A17499k7852h6487A8057J91620q7792
$$ 68660 -7891 92722 40939 72977 -60594 117499 89647 -86487 18057 209677 121885
11816A21885a17294j03931A00123l2052c3767p3995a7n3341j12563A89823c83288
$$ 121885 -117294 -221225 100123 68071 -33767 -107762 -17 -53358 -165921 189823 -383288
11804G743Q9907d7788B12027q0014J9392b52828p9007D4026J53169a22547A20819
$$ 7743 97650 -47788 212027 132013 151405 -252828 -331835 44026 197195 -122547 120819
11792I5064a46988A03019D4958P0436f4356A12121a4109l24315a5404j45462e8717
$$ 95064 -146988 103019 44958 115394 -64356 112121 -14109 -338424 -15404 -160866 -58717
11780b22147d8943j48242B74992b28951K5406P3869C8781P0503K0526f0202k20270
$$ -222147 -48943 -197185 274992 -228951 -203545 -129676 38781 109284 129810 -60202 -280472
11769b80472C7499b92199F2737R5911B8438K02635I8900J31006b30716B15301
$$ -280472 37499 -292199 62737 158648 28438 231073 98900 229906 -230716 215301
11758C56724b4737B0289c4111j48472B98290l5838A26956J24656A05453c7158
$$ 356724 -24737 20289 -34111 -182583 298290 262452 126956 251612 105453 -37158
11747A17788a74364A48488c50507A04047l1134a45564D9836P114K08609H8167
$$ 117788 -174364 148488 -350507 104047 72913 -145564 49836 56950 265559 88167
11736f0178A91511b7431k80231D1051b8799A27479j0215J58182b5542B60356e9167
$$ -60178 191511 -27431 -307662 41051 -28799 127479 117264 275446 -25542 260356 -59167
11724a22039j1410L6719g164k34874f520G8650J05590a665E786J04040K77687
$$ -122039 -133449 -96730 -7164 -242038 -6520 78650 184240 -1665 5786 109826 387513
11713C87513D6748a03296B29714o4936I870c81787a35773B71946I6322m4264J21892
$$ 387513 46748 -103296 229714 164778 9870 -381787 -135773 271946 96322 52058 173950
11702A73950A3126O2083h7125K107B84362A28634L2234b29789A69031b13154B61168
$$ 173950 13126 75209 -87125 -85018 284362 128634 160868 -229789 169031 -213154 261168
11690e2720A43741a00280M4677p5469j8556C05896j42671D2946D81b3353D520
$$ -52720 143741 -100280 -55603 -131072 -149628 305896 163225 42946 481 -23353 4520
11678b3103j01826M0946C12408i3719A84534p6217g2485C69297a00969H0603B179
$$ -23103 -124929 -83983 312408 -93719 184534 108317 -72485 369297 -100969 80603 2179
11666G003L0666J02758b0879l25593c779o2351j9789j50042A34755l363F2330
$$ 7003 37669 140427 -20879 -346472 -3779 -66130 -85919 -235961 134755 131392 62330
11654A79472j6907B6332J46319l6297N0110K45030B09053b8428I9855R1889c2062
$$ 179472 162565 26332 172651 136354 186464 431494 209053 -28428 99855 191744 -32062
11642H8860i8338A13095d4613C07439j19789A5416c0426l54385A24J91320a57300
$$ 88860 -98338 113095 -44613 307439 187650 15416 -30426 -384811 124 191444 -157300
11630b89891B02875e5256A58097J30501p8584Q6930c6145A1196d3580F7702L81769
$$ -289891 202875 -55256 158097 288598 210014 296944 -36145 11196 -43580 67702 449471
11619D49471i289q5485A61273p3502K5369d39856B0093a1460k0266l00170A89429
$$ 449471 -9289 -94774 161273 87771 113140 -439856 20093 -11460 -31726 -331896 189429
11607H7498J8151A9536L79073A93734l3748e0230A32175F0097a70507b9458A64741
$$ 87498 105649 19536 398609 193734 159986 -50230 132175 60097 -170507 -29458 164741
11595b13838B05450G750N7596J24590q1294J34275A01884C0372a2106G3077J54245
$$ -213838 205450 7750 65346 189936 108642 242917 101884 30372 -12106 73077 227322
11584B27322O1800I1443K4472J39130A5397a11786C04198n1682e3531R600B87602
$$ 227322 289122 91443 115915 255045 15397 -111786 304198 252516 -53531 -43931 287602
11572A21360O8773Q0964k1310E8332b52058K3244k1638C34687C905g8430A81191
$$ 121360 190133 271097 249787 58332 -252058 -228814 -250452 334687 3905 -78430 181191
11560f0540a6140k501B58513A17237R1122K08395l0773I6123J44984E2413J27009
$$ -60540 -16140 -18641 258513 117237 208359 416754 385981 96123 241107 52413 179422
11549A79422e6792m9293a3623j0007A5419J13272f4039l0938a5558m9086A79370
$$ 179422 -56792 -106085 -13623 -23630 15419 128691 -64039 -94977 -15558 -64644 179370
11537A20352K0598J10164r9372f7480C41990A20821L83256a18542p0963Q9820
$$ 120352 140950 251114 151742 -67480 341990 120821 504077 -118542 -189505 -99685
11527i9685B80587j26331B6321K6173N5969d4997K34A84108b20586A02689b22040
$$ -99685 280587 154256 26321 52494 108463 -44997 -44763 184108 -220586 102689 -222040
11515a22901F606K82289j34126F4533K02354j16872Q2386A2406K8874P5824D036
$$ -122901 6606 288895 154769 64533 266887 150015 232401 12406 41280 117104 4036
11503a5223o1579B729J93051J94408j84962J43288J7792e6629m0334A21345a5251
$$ -15223 -76802 2729 195780 390188 205226 348514 366306 -56629 -96963 121345 -15251
11491B14902b15347b1154A21690m6687L50821f5057E6805J53137F3195J6864J8805
$$ 214902 -215347 -21154 121690 75003 425824 -65057 56805 209942 63195 80059 98864
11480I8864B4253M85087B05268p2143b62937B67165G97J69895O0934A09719a1367
$$ 98864 24253 509340 205268 133125 -262937 267165 797 170692 231626 109719 -11367
11468D1039a05740c8782B99497a47697D90197E8153f7738A35880E4106E369J9457
$$ 41039 -105740 -38782 299497 -147697 490197 58153 -67738 135880 54106 5369 24826
11457B4826K16284L08770g1792B02079D4975L29765a21E9343P2625a4674A17164
$$ 24826 241110 549880 -71792 202079 44975 374740 -121 59343 131968 -14674 117164
11445D628a68897C3461h1079L7537C0592R5039c98400B4368c02714C21937a28603
$$ 4628 -168897 33461 -81079 -43542 30592 125631 -398400 24368 -302714 321937 -128603
11433I4468J66886b28542A19774a83411d0764C3860e8001G694g2883o2121K964
$$ 94468 261354 -228542 119774 -183411 -40764 33860 -58001 7694 -72883 -135004 -132040
11422a32040C11444c23245a37548J837j28664b8225H458K04945C7113a00466C31154
$$ -132040 311444 -323245 -137548 -135711 -264375 -28225 8458 213403 37113 -100466 331154
11410D72291f6613G7426a73921f0929G1153C288a3686B18093E7997j6864d1972
$$ 472291 -66613 77426 -173921 -60929 71153 3288 -13686 218093 57997 41133 -41972
11398a952A49760a92923B0101h0492A19250M4518a86850L4297D3239b9001I4522
$$ -1952 149760 -192923 20101 -80492 119250 163768 -186850 -152553 43239 -29001 94522
11386E8418l30J69439B4114b64256D60976A33223o1514M2623N1310a61760d947
$$ 58418 58088 227527 24114 -264256 460976 133223 71709 114332 165642 -161760 -4947
11374A81228d3924e577A64913D5709N2772K61131b0673D8065b68432B47880A01408
$$ 181228 -43924 -5577 164913 45709 98481 359612 -20673 48065 -268432 247880 101408
11362F5625K29232G2554a23431N0935G0107a09989p9306A43623g3851B66107g5292
$$ 65625 294857 72554 -123431 -72496 70107 -109989 -189295 143623 -73851 266107 -75292
11350D120a48909g476C25543o1145n3406i4840B12346b12345A77085G7902a07780
$$ 4120 -148909 -7476 325543 264398 210992 -94840 212346 -212345 177085 77902 -107780
11338e6751C10597I2622a8574k41175E7063a58479C2772L1152r747a18021A26452
$$ -56751 310597 92622 -18574 -259749 57063 -158479 32772 63924 54177 -118021 126452
11326B5599a45253A6734J72399c463j17580A17668D3024a49450A28076g0854A62569
$$ 25599 -145253 16734 189133 -3463 -121043 117668 43024 -149450 128076 -70854 162569
11314C97764P4754a62234E0067J6347g7523C83273a60091g3992D7704b66124j71625
$$ 397764 472518 -162234 50067 66414 -77523 383273 -160091 -73992 47704 -266124 -437749
11303d37749D40312G4199L54535a14229K4736A96856f6608B05793E0734J25090
$$ -437749 440312 74199 428734 -114229 -89493 196856 -66608 205793 50734 175824
11293A75824E9801A0671M1388g929n16602b23421f2356j61968A67599a53184M9325
$$ 175824 59801 10671 52059 -7929 -524531 -223421 -62356 -224324 167599 -153184 -103859
11282a03859p6767d5323j88208B37830D0489b03994A36877b8799j924j07923G471
$$ -103859 -180626 -45323 -233531 237830 40489 -203994 136877 -28799 -30723 -138646 7471
11270b9448j17387I6915k717a09853E2100a87446D1998a55584c828j29080p6075
$$ -29448 -146835 96915 94198 -109853 52100 -187446 41998 -155584 -3828 -132908 -208983
11259b08983j5201B05771f1404m523M42j89866a16941I0540a95055E9340K4381
$$ -208983 -224184 205771 -61404 -65927 -65485 -255351 -116941 90540 -195055 59340 83721
11248H3721a92568A13510c92316B37986D3524d4856J7405G8717b1927i800k33286
$$ 83721 -192568 113510 -392316 237986 43524 -44856 -27451 78717 -21927 -9800 -243086
11237b43086J12480A96076b58824h12j35673a2584j17404A11287f4361K394C09218
$$ -243086 -130606 196076 -258824 -812 -136485 -12584 -129988 111287 -64361 -61967 309218
11225h3296l2116j88107P3689J08496j36620B59213A3803K5897Q8443g5106r5457
$$ -83296 -115412 -303519 -229830 -121334 -257954 259213 13803 39700 128143 -75106 -170563
11214a70563M7160l0037d195A92145q0466a41731f7315F533b7404D1753b21527
$$ -170563 -123403 -153440 -4195 192145 111679 -141731 -67315 6533 -27404 41753 -221527
11202b9807B08783G655N047J10204c66640A19495a34542I2442K65527h8002A15533
$$ -29807 208783 7655 12702 122906 -366640 119495 -134542 92442 357969 -88002 115533
11190a26391F5144c57487B8367e3585A02967d6018I1305b91397a04591m42595
$$ -126391 65144 -357487 28367 -53585 102967 -46018 91305 -291397 -104591 -547186
11180e47186a11783A45306i5019A91604B4399a28676E4622c07233d8214G4444
$$ -547186 -111783 145306 -95019 191604 24399 -128676 54622 -307233 -48214 74444
11169c7549J0854l63826J84332G0455e7714j57688L7365B01973b08423F2787a28923
$$ -37549 -26695 -390521 -206189 70455 -57714 -215402 -178037 201973 -208423 62787 -128923
11157a44259B90686a57198A92880L7024G346a39681C6165h8547a6235j02413j07650
$$ -144259 290686 -157198 192880 229904 7346 -139681 36165 -88547 -16235 -118648 -226298
11146b26298H4335b28480B24951a84900B56050r2316b0124C3845b02725H4237
$$ -226298 84335 -228480 224951 -184900 256050 163734 -20124 33845 -202725 84237
11135d671H090K2709K6953N548h3923D50332a22925I5392a24327B8090b63657
$$ -4671 8090 30799 57752 63300 -83923 450332 -122925 95392 -124327 28090 -263657
11123f523H946a7408j93897f7760B46784b10131P3741o6844L2645B14855a5700
$$ -6523 8946 -17408 -211305 -67760 246784 -210131 -136390 -203234 -170589 214855 -15700
11111A40157c48198A78977K1954h9229B91891a22830a9498D6408M8420P8434m3150
$$ 140157 -348198 178977 200931 -89229 291891 -122830 -19498 46408 94828 173262 130112
11100A30112c00155A83797Q5334G742R3026e3988A98402M2193K4287m2688r6879
$$ 130112 -300155 183797 269131 7742 100768 -53988 198402 240595 264882 222194 125315
11089A25315J55532A02736J56616g6946A44924L28025E8642N99275E8697J92320
$$ 125315 280847 102736 259352 -76946 144924 472949 58642 657917 58697 251017
11079B51017A16520J33574p6182a2684D45226j29788D3786J44515J29183J48956
$$ 251017 116520 250094 173912 -12684 445226 315438 43786 188301 317484 466440
11069D66440j30952m7055K22012j74997M29307C44573j19058N66893A69325J98253
$$ 466440 335488 288433 510445 335448 764755 344573 225515 792408 169325 367578
11059C67578J78302L3388L9330p8371K81852K3906k73318K31975C84196J6286
$$ 367578 545880 579268 618598 540227 822079 845985 572667 804642 384196 400482
11049D00482N07238l78970L59141k19347L26772K95997o11352J26309j68895k25546
$$ 400482 907720 528750 887891 668544 995316 1291313 679961 806270 637375 411829
11039D11829K78491k25999L22682P8531k10231K38687k17193M9600k29846J89403
$$ 411829 690320 464321 787003 865534 655303 893990 676797 726397 496551 685954
11029F85954J00494l85640L92620J52426l29353J4816l04095M22611K718J50711
$$ 685954 786448 400808 793428 945854 616501 631317 327222 749833 752551 903262
11019I03262m37019K8553O7930n891o0415q9694K07690n8748K73219j7071o1925
$$ 903262 466243 494796 562726 556835 496420 406726 614416 555668 828887 811816 749891
11008G49891O7747k10227j89918K07091j34200K96244K478J22872j65004K08822
$$ 749891 817638 607411 417493 624584 490384 786628 789106 911978 746974 955796
10998I55796B51282M07701J41215l14994J76197N456N2566p7627L27096l65489
$$ 955796 251282 658983 800198 485204 661401 666857 719423 641796 968892 603403
10988F03403L15506r4373L00701j4886r0166K69940n9601J64214k05437J74173
$$ 603403 918909 824536 1125237 1110351 1020185 1290125 1230524 1394738 1189301 1363474
10978A363474L55753K3086Q7583J94123j74611O80557L02815J92479K11048l19315
$$ 1363474 1719227 1742313 1829896 2024019 1849408 2529965 2832780 3025259 3236307 2916992
10968B916992l86238j94141j8676Q9811l73357k37990N3746R8241J89339k8436
$$ 2916992 2530754 2336613 2317937 2407748 2034391 1796401 1850147 1948388 2137727 2109291
10958B109291J95145j77588J27779l05585J18555n76801J73320n23724r5673p4843
$$ 2109291 2304436 2126848 2254627 1949042 2067597 1490796 1664116 1140392 1044719 969876
10948I69876D25822J72337A00614K30523n9303A08298N63667B99891N8794A37918
$$ 969876 425822 598159 100614 331137 271834 108298 671965 299891 358685 137918
10937a52540D04240g8094C34070e7700k0564C33256a4891I7815K3389O5503J6006
$$ -152540 404240 -78094 334070 -57700 -78264 333256 -14891 97815 121204 186707 202713
10926B02713H9835b41221A37680E9972b05158R5093l9984p0261F3698G588O0327
$$ 202713 89835 -241221 137680 59972 -205158 -110065 -150049 -220310 63698 7588 67915
10915F7915K30839a6542C8613K02461J19865a38821b3522j23975A0904K54502
$$ 67915 298754 -16542 38613 241074 360939 -138821 -23522 -147497 10904 265406
10905B65406A22413C9296d31936i5769E2192Q0701M0421j2610K7821a64958P1717
$$ 265406 122413 39296 -431936 -95769 52192 132893 173314 160704 188525 -164958 -93241
10894i3241E6007c78876O1619A83503i5395F7754N6477J42184a81689K7474P2072
$$ -93241 56007 -378876 -317257 183503 -95395 67754 124231 266415 -181689 -154215 -82143
10883h2143B97634h1606b2709A47193F153K04827f5199n3215k21584G0877a39478
$$ -82143 297634 -81606 -22709 147193 6153 210980 -65199 -118414 -339998 70877 -139478
10871B56313A03495b08540K7124f869B43906i6082a9640g055l07590B6139K87180
$$ 256313 103495 -208540 -181416 -6869 243906 -96082 -19640 -7055 -314645 26139 313319
10860C13319A06410a61523m7861d3469b1509I4339Q4960E4536Q7419a59257a0570
$$ 313319 106410 -161523 -209384 -43469 -21509 94339 179299 54536 141955 -159257 -10570
10848c788j83789n2966A8287a59841a2201j32556E19818k59560B9293O1608b11620
$$ -3788 -187577 -240543 18287 -159841 -12201 -144757 519818 260258 29293 90901 -211620
10836C3173a84232O3190G5480Q363K50648j35961m1618E4197h956F611g0119A07356
$$ 33173 -184232 -121042 75480 83843 334491 198530 156912 54197 -8956 6611 -70119 107356
10823A47757o8496J19068a42433r1705F5169F820h4341p4790O5453n3929C05917
$$ 147757 79261 198329 -142433 -234138 65169 6820 -84341 -159131 -93678 -147607 305917
10811i111j44727j90405c5590A28555B1541g6243A1067N80i8708A08284b2770
$$ -9111 -153838 -344243 -35590 128555 21541 -76243 11067 11647 -98708 108284 -22770
10799D5599a04468A63483h5496j40892c6609I5843G366e6546k29441E1747g2442
$$ 45599 -104468 163483 -85496 -226388 -36609 95843 7366 -56546 -285987 51747 -72442
10787i7855A9323L362a93204E1396b10568J22M0434J8289D3844K6608c89327a93056
$$ -97855 19323 22685 -193204 51396 -210568 -210446 -170012 -151723 43844 70452 -389327 -193056
10774C3769a28751A85832c5395a5212r5155L7475A25065P5950c62046G4263i4417
$$ 33769 -128751 185832 -35395 -15212 -110367 -72892 125065 201015 -362046 74263 -94417
10762b84168E7248N120h5299j27972h2373d0631J3753j64097B05067n0052i7223
$$ -284168 57248 62368 -85299 -213271 -82373 -40631 -26878 -190975 205067 155015 -97223
10750a65311I7485a35876F2516O5915d1005B25107K97247A54567h8147k4181A17974
$$ -165311 97485 -135876 62516 128431 -41005 225107 522354 154567 -88147 -112328 117974
10738G6774f0077k24918I6454h1184a4647C7337f0191f417A21668A740a90892
$$ 76774 -60077 -284995 96454 -81184 -14647 37337 -60191 -6417 121668 1740 -190892
10726a60682A41135B2239h818c548A75775N115c28133P8798j91180d6913l2656
$$ -160682 141135 22239 -8818 -3548 175775 180890 -328133 -249335 -440515 -46913 -79569
10715g9569J5094l64086M6428E0382Q5642a89807m6781A14013k06b84451d5697
$$ -79569 -64475 -428561 -382133 50382 136024 -189807 -236588 114013 113807 -284451 -45697
10703d7178C35507A02996f3264A84245b46128A29941J15376a99552A39871J67753
$$ -47178 335507 102996 -63264 184245 -246128 129941 245317 -199552 139871 307624
10693C07624C7337c9310E7811d27559J21464g0310A4575J90066b33330h4891A49404
$$ 307624 37337 -39310 57811 -427559 -306095 -70310 14575 204641 -233330 -84891 149404
10681a1211r2220j8270e1906J516J0773n900j57616B90518A2244i7925d3435p8083
$$ -11211 -103431 -121701 -51906 -50390 -39617 -45517 -203133 290518 12244 -97925 -43435 -121518
10669a21518e4477k05017b0532k5645j56473A89040a5168k77487g5062K2251J1554
$$ -121518 -54477 -259494 -20532 -46177 -202650 189040 -15168 -292655 -75062 -52811 -41257
10658d1257o1091F1409B8104a04626d8541j89592g4360C2664a41542j47051a14553
$$ -41257 -102348 61409 28104 -104626 -48541 -238133 -74360 32664 -141542 -288593 -114553
10646i0737C5407a02906B1367g6742c114j99598A14146K97755h6864G7255a3524
$$ -90737 35407 -102906 21367 -76742 -3114 -202712 114146 411901 -86864 77255 -13524
10634A95723o7058P5141a62819L9229a5799C9948q547a77927M8360q3835i9278
$$ 195723 128665 203806 -162819 -123590 -15799 39948 31401 -177927 -129567 -213402 -99278
10622a52527C11445f1219C304N7214i8324q2870g7845n1284L0410B98770G5229
$$ -152527 311445 -61219 3304 60518 -98324 -181194 -77845 -129129 -98719 298770 75229
10610b27755j44043G4015B0238J86050f4093j69977B47685e11691A89733c85528
$$ -227755 -371798 74015 20238 206288 -64093 -234070 247685 -511691 189733 -385528
10599C7618e06398H8328a69354Q1288f697j17370E8454L69b85241B2102a50834
$$ 37618 -506398 88328 -169354 -88066 -6697 -124067 58454 58823 -285241 22102 -150834
10587b21257B02588f952l5173M795A44418F5294N1050d0495j75815B17784C8958
$$ -221257 202588 -6952 -42125 -37330 144418 65294 116344 -40495 -216310 217784 38958
10575E8746f8144f0A321J28895b93547A15021i5086m8840j2785A3302e2991E0991
$$ 58746 -68144 -60 1321 130216 -293547 115021 -95086 -143926 -156711 13302 -52991 50991
10562A8218c30113A18186n5651b428k06149A50179B5643J18114n3386a44669D4252
$$ 18218 -330113 118186 62535 -2428 -208577 150179 25643 143757 90371 -144669 44252
10550a46403C42453a38757f6969p5595G3445k132g7238B77390a29839B2662J34359
$$ -146403 342453 -138757 -66969 -142564 73445 71313 -77238 277390 -129839 22662 157021
10539A57021b17866a04999a3597B10677b7593G2372a07641j3094H2304J22700
$$ 157021 -217866 -104999 -13597 210677 -27593 72372 -107641 -120735 82304 205004
10529B05004c1086q6482K8334k30748B5350b1856n6241B60443j16030j0217L5414
$$ 205004 -31086 -117568 -89234 -319982 25350 -21856 -78097 260443 144413 134196 169610
10518A69610a37447j40433B43416G5857k003g0618b5683m6831l18043J66200B71361
$$ 169610 -137447 -277880 243416 75857 73854 -70618 -25683 -72514 -390557 -224357 271361
10506g9339k23526l2840A28558a80728M984i004A54789a16814l7410B15593c10999
$$ -79339 -302865 -335705 128558 -180728 -175744 -9004 154789 -116814 -154224 215593 -310999
10494a87987Q6835K2309k16917M6352A17805g4701l0984B8640J1374J74995J52948
$$ -187987 -101152 -78843 -295760 -249408 117805 -74701 -105685 28640 40014 215009 367957
10483C67957n961j02709R1203J98084B20956K79228B16792N8965o2717a38408
$$ 367957 361996 259287 350490 548574 220956 500184 216792 275757 213040 -138408
10472A59199f8506J7878n7357A41526b37916C8527r934a73899C3644J6072j6102
$$ 159199 -68506 -50628 -107985 141526 -237916 38527 28593 -173899 33644 49716 33614
10461C3614Q5488c4505k62267i5548J9631A30522b26406l4990B79063d29836C8764
$$ 33614 119102 -34505 -296772 -95548 -75917 130522 -226406 -261396 279063 -429836 38764
10449a84480P27I9494b60856Q4189d6114p506G1623J01978a83055g7016A42739
$$ -184480 -183753 99494 -260856 -176667 -46114 -53620 71623 173601 -183055 -77016 142739
10437a05314C4614A3374c5260k16604f8116c456A98280j9103b665j75183A99376
$$ -105314 34614 13374 -35260 -251864 -68116 -3456 198280 179177 -2665 -177848 199376
10425a06435B31660c60020H1048g2938B15266b08625M8318f9918A37885b7588
$$ -106435 231660 -360020 81048 -72938 215266 -208625 -160307 -69918 137885 -27588
10414a05978A18300K6596d8578n2444d4044D42474b53629f8231A58994B5127N6437
$$ -105978 118300 144896 -48578 -101022 -44044 442474 -253629 -68231 158994 25127 81564
10403H1564J51642a41515I1670e2267E16078A36281g9943j10495B10209h400B2588
$$ 81564 233206 -141515 91670 -52267 516078 136281 -79943 -190438 210209 -8400 22588
10391B02489o4980J5712c6943A24663Q9052a49695M5558B62204g2638A48741J94032
$$ 202489 137509 153221 -36943 124663 213715 -149695 -104137 262204 -72638 148741 342773
10380C42773K02252j44222A39716C5936R7155a22082E25229A22306e1807B27270
$$ 342773 545025 400803 139716 35936 133091 -122082 525229 122306 -51807 227270
10369H0135J07501D8488K51281O607J75987j37898N5161G9492L66504j02311j38976
$$ 80135 187636 48488 299769 306376 482363 344465 399626 79492 445996 343685 204709
10358B04709J470K7201I928m54A035a60192A43479N28847J04653C19255J63197
$$ 204709 206179 233380 9928 9474 1035 -160192 143479 672326 776979 319255 482452
10347D82452J60252j81389j10366K52071B84440J48517j3716M123B09030a7487
$$ 482452 642704 461315 350949 603020 284440 432957 419241 423364 209030 -17487
10336I5814M1378L8149f0989K3682j24054A81728P0767n066j17342K11313A04696
$$ 95814 137192 175341 -60989 -37307 -161361 181728 252495 247429 130087 341400 104696
10324A92504D4273O7958Q4656J69712j73690K21010A39431e6997i531G5921K87690
$$ 192504 44273 112231 196887 366599 192909 413919 139431 -56997 -9531 75921 363611
10313C63611a98759A20447e1935r6889C21241j00363C0584J16168E4734c47858
$$ 363611 -198759 120447 -51935 -148824 321241 220878 30584 146752 54734 -347858
10302c84672a00002E8534J56567b9054m9408C42080j42493b02571h1936K5178
$$ -384672 -100002 58534 215101 -29054 -78462 342080 199587 -202571 -81936 -56758
10292e6758j5646j89101a03786B00046a45267K339B41496r1409A5956i6439B01460
$$ -56758 -72404 -261505 -103786 200046 -145267 -142928 241496 150087 15956 -96439 201460
10280A97056e0024j63621C27360a52094j1674l490k9874Q3323e5618k58499A65676
$$ 197056 -50024 -213645 327360 -152094 -163768 -167258 -197132 -113809 -55618 -314117 165676
10268B60569a10231A0930R6808b0499a308B53114E691M31864j20956F5616N26271
$$ 260569 -110231 10930 107738 -20499 -1308 253114 5691 437555 316599 65616 591887
10257E91887B66512l3747A07223O7652N3760d5310j72422J05890q108A15831c10465
$$ 591887 266512 232765 107223 174875 228635 -45310 -217732 -111842 -119950 115831 -310465
10245G1961i438H495L4446r730a62071q2616A93199F1464L134a59363b4712C7294
$$ 71961 -9438 8495 42941 33211 -162071 -244687 193199 61464 64598 -159363 -24712 37294
10232i9750H0601g7603j75539i7126b8143j75214G8857e1296p9317M3745H6707
$$ -99750 80601 -77603 -253142 -97126 -28143 -203357 78857 -51296 -130613 -86868 86707
10220a81552k07710A01252b24495A6627J1998e6749K1392j74063h575j62811j13867
$$ -181552 -389262 101252 -224495 16627 28625 -56749 -35357 -209420 -8575 -171386 -285253
10209b85253H5640d9033I9591J275b88117i4436r296A06664h5470j6585l6880
$$ -285253 85640 -49033 99591 100866 -288117 -94436 -103732 106664 -85470 -102055 -138935
10198a38935k1438A96243a42344H723f8794j50589d7507j3069k37608g6573H5979
$$ -138935 -160373 196243 -142344 8723 -68794 -219383 -47507 -60576 -298184 -76573 85979
10186E3365J87519q2316a73054e97A98549a1015j29619E1700b69399D4233M343
$$ 53365 240884 158568 -173054 -597 198549 -11015 -140634 51700 -269399 44233 48576
10175D8576K13042a36799b8478A7455g370p0101b1118o3571j38881q4709j06824
$$ 48576 261618 -136799 -28478 17455 -7370 -77471 -21118 -84689 -223570 -308279 -415103
10164d15103I4483J20197c78305j2233q5025A138h7360A94618b49747A01341a58614
$$ -415103 94483 214680 -378305 -390538 -475563 1138 -87360 194618 -249747 101341 -158614
10152a53410B22396c1359k31231M8507N6934N5303G666M9878a8295B48051A0672
$$ -153410 222396 -31359 -262590 -214083 -157149 -101846 7666 57544 -18295 248051 10672
10140H505a75370H225i1858H2308i4645q5107O1066b2068A01956D6067c21349
$$ 8505 -175370 8225 -91858 82308 -94645 -179752 -118686 -22068 101956 46067 -321349
10128d5218O876B39798A1352e4554k07755A56342m6868e6310j05656M5051b0628
$$ -45218 -38342 239798 11352 -54554 -262309 156342 109474 -56310 -161966 -116915 -20628
10116a15319L3656j0903l7520C9301b82413h8926m0219C09982c42793A76128f8639
$$ -115319 -81663 -92566 -130086 39301 -282413 -88926 -129145 309982 -342793 176128 -68639
10104b37519b0283k91601B494e07275B39140i3055k21833d599k37438C43371a22787
$$ -237519 -20283 -311884 2494 -507275 239140 -93055 -314888 -4599 -242037 343371 -122787
10092i3008B21270g6132N301D6930c03636d0367j01898p5879J2416b52D5449i8500
$$ -93008 221270 -76132 -70831 46930 -303636 -40367 -142265 -218144 -205728 -252 45449 -98500
10079a40304E6624j4128g5909k59296Q0634I2927a18263j00416B49845a09381
$$ -140304 56624 42496 -75909 -335205 -254571 92927 -118263 -218679 249845 -109381
10068C14960I163a52591G3768k4771b6034M199A21687a25870D9889a75209A873
$$ 314960 9163 -152591 73768 48997 -26034 -21835 121687 -125870 49889 -175209 1873
10056b03551D2835d4151j69934B31687b18916Q6685K2324A06480m9733c6442m9127
$$ -203551 42835 -44151 -214085 231687 -218916 -132231 -109907 106480 56747 -36442 -85569
10045h5569A07982g2338A1302P0727b00430P501p115A54499E3046a92535m8251
$$ -85569 107982 -72338 11302 82029 -200430 -192929 -200044 154499 53046 -192535 -240786
10034b40786f4913G3939O7689h1802m99295f4756j23808h1747j95957A78865a58860
$$ -240786 -64913 73939 141628 -81802 -581097 -64756 -188564 -81747 -277704 178865 -158860
10022C8729R3166a04305L7010j27249j06383A52224F608b8930E2735b4928k77538
$$ 38729 131895 -104305 -67295 -194544 -300927 152224 6608 -28930 52735 -24928 -302466
10011c02466G5554k9866P5827a9103F0686G201e4081B28688g9383A0815g7626
$$ -302466 75554 45688 121515 -19103 60686 7201 -54081 228688 -79383 10815 -77626
9999F10P4582a38282B8046K933b12341f7194a216j74325f3952E5651a32022I4859
$$ 610 75192 -138282 28046 30979 -212341 -67194 -1216 -175541 -63952 55651 -132022 94859
9986e8663q2960D803a11990j08953A6317B449R9624g0558j4508Q00A03070J87061
$$ -58663 -141623 4803 -111990 -220943 16317 2449 102073 -70558 -85066 -84266 103070 290131
9974B90131h0960q0433P5510b9764k95746g7429C2807a50575p7638p8404k9812
$$ 290131 -80960 -161393 -85883 -29764 -325510 -77429 32807 -150575 -228213 -306617 -336429
9963c36429b4856j46575F3420K5931k5023L033O1929a15355A09611d07401a55505
$$ -336429 -24856 -171431 63420 89351 64328 67361 129290 -115355 109611 -407401 -155505
9951B19525d34518A56637b01166d9520k42198J36388e6543k16588L1873d4994
$$ 219525 -434518 156637 -201166 -49520 -291718 -155330 -56543 -273131 -241258 -44994
9940h6274k46514A11295c33909E4849R6489O5708c66472J50376K0109m7454K9729
$$ -86274 -332788 111295 -333909 54849 151338 217046 -366472 -216096 -195987 -243441 -213712
9929b13712B0070b44129A60995a80334k1296j63375a75425A00961c82747i349
$$ -213712 20070 -244129 160995 -180334 -201630 -365005 -175425 100961 -382747 -9349
9918a17045E3243J89643b6191o994j7822j7529I689c09310C4306O702K59022a73103
$$ -117045 53243 242886 -26191 -33185 -51007 -68536 9689 -309310 34306 41008 300030 -173103
9905a68097k2634B8889a59850G5021d00463A3608J31117C843h5301d210k55898
$$ -168097 -190731 28889 -159850 75021 -400463 13608 144725 3843 -85301 -4210 -260108
9894b60108H0639b7645q8259L2222A7448c56749B07921H7742b512G0435K00616
$$ -260108 80639 -27645 -115904 -83682 17448 -356749 207921 87742 -2512 70435 271051
9883B71051C7618J70551d3123g067j33783e5443m9012j58145g3679a931k09165
$$ 271051 37618 208169 -43123 -7067 -140850 -55443 -104455 -262600 -73679 -1931 -211096
9872b11096B33536J8809j02554b51246J25324l4077d8984F8779i8194l63996i4732
$$ -211096 233536 252345 149791 -251246 -125922 -159999 -48984 68779 -98194 -462190 -94732
9860A35721C0164J7447A4963a74754B29185L7128a53087f3122E2113g5486A0858
$$ 135721 30164 47611 14963 -174754 229185 266313 -153087 -63122 52113 -75486 10858
9848a34058A02675a88097P4725a9333B08099a31567H6546l1986b71091A7504a58213
$$ -134058 102675 -188097 -113372 -19333 208099 -131567 86546 54560 -271091 17504 -158213
9836a98107e2365k08711E4939b19097a3536l60494a32721N1951B5043J6025J39129
$$ -198107 -52365 -261076 54939 -219097 -13536 -374030 -132721 -80770 25043 41068 180197
9825A80197C7885f9289j68742h9836A44769A8167K761c03505p1238a26942A70774
$$ 180197 37885 -69289 -238031 -89836 144769 18167 20928 -303505 -374743 -126942 170774
9813E9234b65259a01346b1482j65653A62368g3989B58431i8026C3659c85092C6812
$$ 59234 -265259 -101346 -21482 -187135 162368 -73989 258431 -98026 33659 -385092 36812
9801B89638G1292i0593n8428G0200L9588D8799d249A42864h3227b8955j27813
$$ 289638 71292 -90593 -149021 70200 109788 48799 -4249 142864 -83227 -28955 -156768
9790a56768f8366J0884A09025a41949H0208a41229r852o7099J02841A36109a81364
$$ -156768 -68366 -57482 109025 -141949 80208 -141229 -151081 -218180 -115339 136109 -181364
9778b94118A39415b68815G404J9571J29471D9888o41J68736b97130B59832r2384
$$ -294118 139415 -268815 7404 26975 156446 49888 49247 217983 -297130 259832 167448
9767A67448o1476O6435G8793a45507k61300a89845M8587e8484M058j27843A8191
$$ 167448 105972 172407 78793 -145507 -406807 -189845 -141258 -58484 -54426 -182269 18191
9755b32121A98395B872a92687b4642C7538J29997d17349R4551g0883I425c52753
$$ -232121 198395 2872 -192687 -24642 37538 167535 -417349 -322798 -70883 9425 -352753
9743g4502j28654A72722a10768K2640c5196k3965A06934Q4878b75447D1580d0605
$$ -74502 -203156 172722 -110768 -88128 -35196 -59161 106934 191812 -275447 41580 -40605
9731H0410J41387f3434q8586H8707g2531l45227a42821D6528b47510A19565E7827
$$ 80410 221797 -63434 -152020 88707 -72531 -417758 -142821 46528 -247510 119565 57827
9719B3357c08689E1683b01045R7741C0880c88722a80818c936n276D754g8291G239
$$ 23357 -308689 51683 -201045 -103304 30880 -388722 -180818 -3936 -9212 4754 -78291 7239
9706c37702a31261A98323b10717j85207a26194L2035A27391h0222G1057d19372
$$ -337702 -131261 198323 -210717 -395924 -126194 -94159 127391 -80222 71057 -419372
9695d1926j0156C22909F4271c06781F360b31650b971j92747a2964F172J85506
$$ -41926 -52082 322909 64271 -306781 6360 -231650 -2971 -195718 -12964 6172 191678
9684A91678c34396C2211c04551J04628O0812A15643C1337b48051a17152j72638
$$ 191678 -334396 32211 -304551 -199923 -139111 115643 31337 -248051 -117152 -289790
9674b89790j0333D3227d5617G8698J4963M8328a70097e9283B7814a96184O1441
$$ -289790 -300123 43227 -45617 78698 93661 141989 -170097 -59283 27814 -196184 -134743
9663a34743j65154h8560j38698d8398B07270e15287B13404J9336b31815A13928
$$ -134743 -299897 -88560 -227258 -48398 207270 -515287 213404 232740 -231815 113928
9652b26648F8954a87948b7734B8120a12402H669K88079i4884C5064P8327d6008
$$ -226648 68954 -187948 -27734 28120 -112402 8669 296748 -94884 35064 113391 -46008
9640d31623f9686A71584b03448A06367e0777C7131J57756n2786c82799I2582Q092
$$ -431623 -69686 171584 -203448 106367 -50777 37131 194887 142101 -382799 92582 100674
9629A00674a32002J1982G7091l1225L3945i768k53493A63693f5843C41955B161
$$ 100674 -132002 -120020 77091 45866 79811 -9768 -263261 163693 -65843 341955 2161
9617f5639G8025a94394L6757N6207H6006A6421c69840h970k55608I2601d7148
$$ -65639 78025 -194394 -157637 -101430 86006 16421 -369840 -8970 -264578 92601 -47148
9605a37877m8129j34381A52776K378g2979l5268H5594a45163m260L2034k20375
$$ -137877 -186006 -320387 152776 155154 -72979 -108247 85594 -145163 -149423 -117389 -337764
9594c37764A14400a76903F3859J55239P2144a31100f4651A07427a21348A58227
$$ -337764 114400 -176903 63859 219098 291242 -131100 -64651 107427 -121348 158227
9583C56016a45517K0159A38577D621a35794a999k8500j98158C3537f5628G909
$$ 356016 -145517 -125358 138577 4621 -135794 -1999 -30499 -228657 33537 -65628 7909
9571d78390h3811A7242a99318o7993B000d69021f7500D085K52396b73246A26739
$$ -478390 -83811 17242 -199318 -267311 2000 -469021 -67500 4085 256481 -273246 126739
9559a70547N7868l6730B31331C6291b41315G7068c3872A53622D2927b93129G5868
$$ -170547 -112679 -149409 231331 36291 -241315 77068 -33872 153622 42927 -293129 75868
9547a67711C0670a61904f403j18496m14442K63079B12772h6133j90389c2120k78411
$$ -167711 30670 -161904 -6403 -124899 -539341 -276262 212772 -86133 -276522 -32120 -310531
9536c10531D5466c02409b0322n9965A03760a45574K0929d9808j7916k07821J03464
$$ -310531 45466 -302409 -20322 -80287 103760 -145574 -124645 -49808 -67724 -275545 -172081
9525a72081B03634e573k07969L4782J5020B665f5317l0572j26893L4660B64021
$$ -172081 203634 -5573 -213542 -178760 -163740 2665 -65317 -95889 -222782 -188122 264021
9513a6138j78407p6360F8891d6545m2908j4862C67451b68096F2801b73408C3315
$$ -16138 -194545 -270905 68891 -46545 -89453 -104315 367451 -268096 62801 -273408 33315
9501C82557A1184J7388O1609O3138D5391b06775i7480k26295a49010A77726j7518
$$ 382557 11184 28572 90181 153319 45391 -206775 -97480 -323775 -149010 177726 160208
9490A60208j9958o4903A3020Q5144g160j17168A44191a0267k28272A24588b6513
$$ 160208 140250 75347 13020 98164 -7160 -124328 144191 -10267 -238539 124588 -26513
9478A4725g7830A27438a85831C670J50822c39828A45431k359b6996q3890e2782
$$ 14725 -77830 127438 -185831 3670 154492 -339828 145431 143072 -26996 -110886 -52782
9466a59108O4332j27912N7879m5146G8652c2021A92184b29895Q4379H7213b03819
$$ -159108 -94776 -222688 -164809 -209955 78652 -32021 192184 -229895 -145516 87213 -203819
9454a38595j61360B4403J1554J804M7299h7799A51403F595a01453A23611J18578
$$ -138595 -299955 24403 35957 37761 85060 -87799 151403 6595 -101453 123611 242189
9443B42189j00685d6452j28775j95565i7612A72366a57706e807A15734A7239e2686
$$ 242189 141504 -46452 -175227 -370792 -97612 172366 -157706 -5807 115734 17239 -52686
9431C1277h1869j38322d822k04619K5578D5034b48313b9366A13308b34732A35844
$$ 31277 -81869 -220191 -4822 -209441 -183863 45034 -248313 -29366 113308 -234732 135844
9419H9877d7339I7199C4585R2909m6838l6827b48141Q6378d4200H4171Q4135i2530
$$ 89877 -47339 97199 34585 127494 80656 43829 -248141 -161763 -44200 84171 168306 -92530
9406b95234A6104c19240J24433e8970l9680A63182c2218E4599a76506E4054a3018
$$ -295234 16104 -319240 -194807 -58970 -98650 163182 -32218 54599 -176506 54054 -13018
9394a81565H0927K51706g66p8381a4819q1275D5068L5942a61398L2097H3802A1032
$$ -181565 80927 332633 -766 -79147 -14819 -96094 45068 81010 -161398 -129301 83802 11032
9381I3272b83482L9714i7273B59137A26602m5882J97248b59509g6374o6422m6787
$$ 93272 -283482 -243768 -97273 259137 126602 80720 277968 -259509 -76374 -142796 -189583
9370a89583l20118C05673j49215b05431E9679g2879K3595J5427p4295d5131J6085
$$ -189583 -509701 305673 156458 -205431 59679 -72879 -49284 -33857 -108152 -45131 -29046
9359b9046p05A20350k1924D9103f3938a827j56574n7520C028K41058D6439j4999
$$ -29046 -29751 120350 98426 49103 -63938 -1827 -158401 -215921 3028 244086 46439 31440
9347C1440h0703C08617d44422A92962n9811i5826L7134g443G3293c43474a48160
$$ 31440 -80703 308617 -444422 192962 133151 -95826 -58692 -7443 73293 -343474 -148160
9335h3736k6006J6338L2754F7202f4417r5234k47606F8871b6753j69424j484k23184
$$ -83736 -109742 -93404 -60650 67202 -64417 -159651 -407257 68871 -26753 -196177 -197661 -420845
9323d20845C6172a1387A71172a75282k7889L4097A02284D4795e8809A35518E9332
$$ -420845 36172 -11387 171172 -175282 -203171 -169074 102284 44795 -58809 135518 59332
9311e5462j97653a14315A8184L6851h2924A65418n9938a2826m1182a9087j52615
$$ -55462 -253115 -114315 18184 55035 -82924 165418 105480 -12826 -54008 -19087 -171702
9300a71702j14273B9254c86504J09038k3590l808i1920A35048J40249c7999A31041
$$ -171702 -285975 29254 -386504 -277466 -301056 -304864 -91920 135048 275297 -37999 131041
9288F0491d2490j4471r6708O5988l26912b126B54160B1483b80464H602a09870
$$ 60491 -42490 -56961 -153669 -87681 -414593 -2126 254160 21483 -280464 8602 -109870
9276b8581n3761j68242f2121k40498Q6706i8661A32651c0162j21153q0773a10187
$$ -28581 -82342 -250584 -62121 -302619 -215913 -98661 132651 -30162 -151315 -232088 -110187
9264b97991a47856k29036J66606B32028a10662A15052g2106l69389i9392B2582
$$ -297991 -147856 -376892 -210286 232028 -110662 115052 -72106 -441495 -99392 22582
9253B4777K32739b61320P7150M7558j18561j7680B62062b8118I507c52216A49662
$$ 24777 257516 -261320 -184170 -136612 -255173 -272853 262062 -28118 9507 -352216 149662
9241b31664e6671A1943a42421c4721m8433k86719A6618l703a10319A88560c42522
$$ -231664 -56671 11943 -142421 -34721 -83154 -369873 16618 12915 -110319 188560 -342522
9229B62689n5554C239e3223r1796B9878J20699l9937h6017k30374f2197k59452
$$ 262689 207135 3239 -53223 -145019 29878 150577 110640 -86017 -316391 -62197 -321649
9218c21649A6107c15618K2037I6400a12693N2109C18163g8878E3631b35252g5396
$$ -321649 16107 -315618 -293581 96400 -112693 -60584 318163 -78878 53631 -235252 -75396
9206g8457j0223A75716h3200H5694J12850b69205A53535a70336g8972B252a97235
$$ -78457 -88680 175716 -83200 85694 198544 -269205 153535 -170336 -78972 2252 -197235
9194a7504j3350j93630h5908E59a48991D0999A2718c35752J29904d1895a3820
$$ -17504 -30854 -224484 -85908 559 -148991 40999 12718 -335752 -205848 -41895 -13820
9182a30016b7445A60443a00138A44465N2132Q2050j36823A3501i1991I6162f2303
$$ -130016 -27445 160443 -100138 144465 196597 278647 141824 13501 -91991 96162 -62303
9170A24997c74882D9370a78212C14883b0294j38379d389m7307E5074k1127h3004
$$ 124997 -374882 49370 -178212 314883 -20294 -158673 -4389 -51696 55074 33947 -83004
9158a78811K3041H9130c4922A6396e7011b11l4830j70689j9373O1252L1174j81947
$$ -178811 -155770 89130 -34922 16396 -57011 -211 -35041 -205730 -225103 -163851 -132677 -314624
9146c14624F2878i155o9192A38884a07180A46541f4399q5438C07846h3073j41444
$$ -314624 62878 -9155 -78347 138884 -107180 146541 -64399 -149837 307846 -83073 -224517
9135b24517R2145A11327L0062j5968k2205b06092B42712a53864A94297c02473
$$ -224517 -132372 111327 141389 125421 103216 -206092 242712 -153864 194297 -302473
9124b51993a19972M4342C6938a52129k9841I7765d0729j87579Q3070B4638A1182
$$ -251993 -119972 -75630 36938 -152129 -181970 97765 -40729 -228308 -145238 24638 11182
9112G2559c5468F2915a12740j73680j2505P134c1170k64732A18940b68832E4543
$$ 72559 -35468 62915 -112740 -286420 -298925 -291791 -31170 -295902 118940 -268832 54543
9100A35756g1857M456o5230r7320D5524B144M0699b32619j15291J51450F3093
$$ 135756 -71857 -67401 -132631 -229951 45524 2144 42843 -232619 -347910 -196460 63093
9088a61444B6413a7201j04054j6688D7814a88891b5175G5037o96A3696K24469
$$ -161444 26413 -17201 -121255 -137943 47814 -188891 -25175 75037 74341 13696 238165
9077B38165B2489J97653A05763g6034j2164j32978p7613a8986k8598k2079A5293
$$ 238165 22489 220142 105763 -76034 -88198 -221176 -298789 -18986 -47584 -69663 15293
9065b05348g2213j79797A25537a94689J8740j43609b511k27032O0783o5224a13996
$$ -205348 -72213 -252010 125537 -194689 -175949 -319558 -2511 -229543 -168760 -233984 -113996
9053c92436a53316e6132B19929E2676L5742i7499B1280R676g6334p0251B5075
$$ -392436 -153316 -56132 219929 52676 88418 -97499 21280 30956 -76334 -146585 25075
9041c31921f2351a5284B61546c61018a46980D9531a85495b7894m3206E2c36867
$$ -331921 -62351 -15284 261546 -361018 -146980 49531 -185495 -27894 -71100 52 -336867
9029b35326B0501L1393b33610b9385o8292j51746A71769J47676A6863J47730A2563
$$ -235326 20501 51894 -233610 -29385 -97677 -249423 171769 319445 16863 164593 12563
9017A73597a02372A50478b80922A00129h6698J0778k98367D2746J00035K0213
$$ 173597 -102372 150478 -280922 100129 -86698 -75920 -374287 42746 142781 162994
9007A62994c86366C8452a36798c7446A16239J52b46014J02017A6326b11110j20858
$$ 162994 -386366 38452 -136798 -37446 116239 116391 -246014 -143997 16326 -211110 -331968
8996c31968a15248A36549N0087o1436m6346k7113d4633D5232a03576j33109E8269
$$ -331968 -115248 136549 186636 125200 78854 51741 -44633 45232 -103576 -236685 58269
8984b5290l41328d2300E5K1038c13488I7657l7482j9909h1430B5682a31729A85654
$$ -25290 -366618 -42300 55 21093 -313488 97657 60175 40266 -81430 25682 -131729 185654
8971c12532J33683C8746a27985j11908C1596J19546a65003k9064k2586d6586G1070
$$ -312532 -178849 38746 -127985 -239893 31596 151142 -165003 -194067 -216653 -46586 71070
8959c71876a85885D7959J03426b94741A01974h8303B6944a75877q4898C03537
$$ -371876 -185885 47959 151385 -294741 101974 -88303 26944 -175877 -260775 303537
8948A00572b71861h2563k95678I2099J85444b31931i8512O617M4889m4185H8078
$$ 100572 -271861 -82563 -378241 92099 277543 -231931 -98512 -91895 -47006 -91191 88078
8936A15018a97254f2737j15683A47783n2125b81237A39633A8082a23749n141I9429
$$ 115018 -197254 -62737 -178420 147783 95658 -281237 139633 18082 -123749 -128890 99429
8924b71662A80981K57547J218441F71583a5845C38693A26904d9814n6371A38432
$$ -271662 180981 438528 1656969 671583 -15845 338693 126904 -49814 -106185 138432
8913c57492a40099B9873c3180A09191c45790j03636A34650D9862e314E1870c6070
$$ -357492 -140099 29873 -33180 109191 -345790 -449426 134650 49862 -5314 51870 -36070
8901c04346N4216A54048a10484C1596c0558m627l32093B458a31652I2186a89136
$$ -304346 -250130 154048 -110484 31596 -30558 -35185 -367278 2458 -131652 92186 -189136
8889h9348P860c4160B792Q652a35512B05170C5747a5108n3214r509E4770e5851
$$ -89348 -81488 -34160 2792 11444 -135512 205170 35747 -15108 -68322 -77831 54770 -55851
8876a23181A8989a27526r4101D3326d09852l0158I0590b33982a5620m4627j90565
$$ -123181 18989 -127526 -221627 43326 -409852 -440010 90590 -233982 -15620 -60247 -250812
8865b50812F4723L1589a09258D6651a90239K4227A62991h3968A48927J03811c70462
$$ -250812 64723 96312 -109258 46651 -190239 -166012 162991 -83968 148927 252738 -370462
8853a65954A806b60203a16950d7091n7844a0778I8763j2409J3662a4544l5252
$$ -165954 1806 -260203 -116950 -47091 -104935 -10778 98763 86354 100016 -14544 -49796
8842d9796A18447J6542a46683I8521A2495J923b15691d3100j29210O77d9875r0013
$$ -49796 118447 134989 -146683 98521 12495 14418 -215691 -43100 -172310 -171633 -49875 -139888
8830a39888K5201A77811L2145a4016j35057E34873a62469N3303a3492r9790B9874
$$ -139888 -114687 177811 209956 -14016 -149073 534873 -162469 -109166 -13492 -113282 29874
8818i8288K4464l82668A99560F0572a9278j51045B69168a31855a5272m06738f8446
$$ -98288 -73824 -456492 199560 60572 -19278 -170323 269168 -131855 -15272 -422010 -68446
$$ [...]
##END NTUPLES=NMR SPECTRUM
##END=
