##TITLE=AC1719_BRAAN15005_9207238_U6kIEr0Urk
##JCAMPDX= 6.0         $$ Bruker NMR JCAMP-DX V2.0
##DATA TYPE= NMR SPECTRUM
##DATA CLASS= NTUPLES
##ORIGIN= BRUKER
##OWNER= Administrator
$$ 1.72 TOPSPIN		Version 2.1
$$ 2015-06-01 21:52:53.467 -0700  Administrator@X
$$ Compression mode = diff/dup
##.OBSERVE FREQUENCY= 400.02188249412
##.OBSERVE NUCLEUS= ^1H
##.ACQUISITION MODE= SIMULTANEOUS (DQD)
##.ACQUISITION SCHEME= undefined
##.AVERAGES= 64
##.DIGITISER RES= 22
##SPECTROMETER/DATA SYSTEM= spect
##.PULSE SEQUENCE= noesygpps1d.comp
##.SOLVENT NAME= COFFEE_meoh
##.SHIFT REFERENCE= INTERNAL, COFFEE_meoh, 1, 14.96073
##AUDIT TRAIL= $$ (NUMBER, WHEN, WHO, WHERE, PROCESS, VERSION, WHAT)
$$ ##TITLE= Audit trail, TOPSPIN		Version 2.1
$$ ##JCAMPDX= 5.01
$$ ##ORIGIN= Bruker BioSpin GmbH
$$ ##OWNER= Administrator
$$ $$ E:\/data/COFFEE/nmr/AC1719_BRAAN15005_9207238_U6kIEr0Urk/12/pdata/1/auditp.txt
$$ ##AUDIT TRAIL=  $$ (NUMBER, WHEN, WHO, WHERE, PROCESS, VERSION, WHAT)
(   1,<2015-06-01 21:52:48.248 -0700>,<Administrator>,<X>,<go>,<TOPSPIN 2.1>,
      <created by zg
	started at 2015-06-01 21:41:18.108 -0700,
	POWCHK enabled, PULCHK disabled,
       configuration hash MD5:
       21 0F 79 D6 B3 7B B4 F6 88 20 88 DB 03 48 BD 9F
       data hash MD5: 64K
       6D EB EF B0 F8 D1 27 02 BC BB AF B5 82 28 EC 45>)
(   2,<2015-06-01 21:52:51.389 -0700>,<Administrator>,<X>,<proc1d>,<TOPSPIN 2.1>,
      <Start of raw data processing
       efp LB = 0.3 FT_mod = 6 PKNL = 1 PHC0 = 0 PHC1 = 0 SI = 128K 
       data hash MD5: 128K
       34 EA 0B 93 9C 7A AD 52 1F 10 A4 47 14 EA 9D 3F>)
(   3,<2015-06-01 21:52:52.264 -0700>,<Administrator>,<X>,<proc1d>,<TOPSPIN 2.1>,
      <pk PHC0 = -87.96204 PHC1 = 0 
       data hash MD5: 128K
       D3 E6 60 39 EC CF FD 3F A8 EE 00 FB 80 FB 2B AB>)
(   4,<2015-06-01 21:52:52.655 -0700>,<Administrator>,<X>,<proc1d>,<TOPSPIN 2.1>,
      <abs ABSG = 1 
       data hash MD5: 128K
       CD 04 C2 AC 20 4A 78 1F 14 0D 08 B9 56 D0 20 BA>)
(   5,<2015-06-01 21:52:52.748 -0700>,<Administrator>,<X>,<proc1d>,<TOPSPIN 2.1>,
      <abs ABSG = 2 
       data hash MD5: 128K
       F4 78 25 66 A6 1D 2F C8 AE 6C 3B 99 02 99 20 D3>)
(   6,<2015-06-01 21:52:52.842 -0700>,<Administrator>,<X>,<proc1d>,<TOPSPIN 2.1>,
      <abs ABSG = 3 
       data hash MD5: 128K
       A5 E3 C5 03 83 92 70 B7 49 4C BD 4C 40 0B A8 10>)
(   7,<2015-06-01 21:52:52.936 -0700>,<Administrator>,<X>,<proc1d>,<TOPSPIN 2.1>,
      <abs ABSG = 4 
       data hash MD5: 128K
       E7 6C F5 B7 60 B2 27 C8 10 EB AC B8 A6 10 1E 9B>)
(   8,<2015-06-01 21:52:53.014 -0700>,<Administrator>,<X>,<proc1d>,<TOPSPIN 2.1>,
      <abs ABSG = 5 
       data hash MD5: 128K
       D6 98 BB 47 A0 79 24 EC AD DF 5E 3C 53 EC DF D9>)
$$ ##END=
$$ 
$$ $$ hash MD5
$$ $$ B5 64 23 FB 54 FE E6 E7 66 7A 9F FF B7 D2 5B DA
##$RELAX= 
##$RELAX= 
##$RELAX= 
##$RELAX= 
##$RELAX= 
##$RELAX= 
##$RELAX= 
##$RELAX= 
$$ Bruker specific parameters
$$ --------------------------
##$DU= <E:\>
##$EXPNO= 12
$$ [...]
##$TP07= 0
##$TPNAME0= <>
##$TPNAME1= <>
##$TPNAME2= <>
##$TPNAME3= <>
##$TPNAME4= <>
##$TPNAME5= <>
##$TPNAME6= <>
##$TPNAME7= <>
##$TPOAL= (0..7)
0.5 0.5 0.5 0.5 0.5 0.5 0.5 0.5
##$TPOFFS= (0..7)
0 0 0 0 0 0 0 0
##$TUNHIN= 0
##$TUNHOUT= 0
##$TUNXOUT= 0
##$USERA1= <user>
##$USERA2= <user>
##$USERA3= <user>
##$USERA4= <user>
##$USERA5= <user>
##$V9= 5
##$VALIST= <valist>
##$VCLIST= <CCCCCCCCCCCCCCC>
##$VD= 0
##$VDLIST= <DDDDDDDDDDDDDDD>
##$VPLIST= <PPPPPPPPPPPPPPP>
##$VTLIST= <TTTTTTTTTTTTTTT>
##$WBST= 2048
##$WBSW= 25
##$XGAIN= (0..3)
0 0 0 0
##$XL= 0
##$YL= 0
##$YMAX_a= 7122105
##$YMIN_a= -13115980
##$ZGOPTNS= <>
##$ZL1= 120
##$ZL2= 120
##$ZL3= 120
##$ZL4= 120
##$ABSF1= 14.96073
##$ABSF2= -5.597452
##$ABSG= 5
##$ABSL= 3
##$ALPHA= 0
##$AQORDER= 0
##$ASSFAC= 0
##$ASSFACI= 0
##$ASSFACX= 0
##$ASSWID= 0
##$AUNMP= <proc_prof1d_extract.lims>
##$AXLEFT= 0
##$AXNAME= <>
##$AXNUC= <1H>
##$AXRIGHT= 0
##$AXTYPE= 0
##$AXUNIT= <>
##$AZFE= 0.1
##$AZFW= 0.1
##$BCFW= 0
##$BC_mod= 0
##$BYTORDP= 0
##$COROFFS= 0
##$CY= 15
##$DATMOD= 1
##$DC= 0
##$DFILT= <>
##$DTYPP= 0
##$F1P= 0
##$F2P= 0
##$FCOR= 0.5
##$FTSIZE= 131072
##$FT_mod= 6
##$GAMMA= 0
##$GB= 0
##$INTBC= 1
##$INTSCL= 1
##$ISEN= 128
##$LB= 0.3
##$LEV0= 0
##$LPBIN= 0
##$MAXI= 10000
##$MC2= 0
##$MEAN= 0
##$ME_mod= 0
##$MI= 0
##$NCOEF= 0
##$NC_proc= -2
##$NLEV= 6
##$NOISF1= 0
##$NOISF2= 0
##$NSP= 0
##$NTH_PI= 0
##$NZP= 0
##$OFFSET= 14.96073
##$PC= 1
##$PHC0= -87.96204
##$PHC1= 0
##$PH_mod= 1
##$PKNL= yes
##$PPARMOD= 0
##$PPDIAG= 0
##$PPIPTYP= 0
##$PPMPNUM= 2147483647
##$PPRESOL= 1
##$PSCAL= 4
##$PSIGN= 0
##$PYNMP= <proc.py>
##$REVERSE= no
##$SF= 400.020009746532
##$SI= 131072
##$SIGF1= 0
##$SIGF2= 0
##$SINO= 400
##$SIOLD= 131072
##$SPECTYP= <>
##$SREGLST= <1H.CDCl3>
##$SSB= 0
##$STSI= 131072
##$STSR= 0
##$SW_p= 8223.68421052631
##$SYMM= 0
##$S_DEV= 0
##$TDeff= 65536
##$TDoff= 0
##$TI= <>
##$TILT= no
##$TM1= 0
##$TM2= 0
##$TOPLEV= 0
##$USERP1= <user>
##$USERP2= <user>
##$USERP3= <user>
##$USERP4= <user>
##$USERP5= <user>
##$WDW= 1
##$XDIM= 131072
##$YMAX_p= 367875267
##$YMIN_p= -10891
##$CURPLOT= <Network HP LaserJet P1505>
##$CURPRIN= <$Network HP LaserJet P1505>
##$DFORMAT= <normdp>
##$LAYOUT= <+/1D_H.xwp>
##$LFORMAT= <normlp>
##$PFORMAT= <normpl>
##$SURQMSG= 1
$$ End of Bruker specific parameters
$$ ---------------------------------
##NTUPLES= NMR SPECTRUM
##VAR_NAME=  FREQUENCY,     SPECTRUM/REAL,   SPECTRUM/IMAG
##SYMBOL=    X,             R,               I
##VAR_TYPE=  INDEPENDENT,   DEPENDENT,       DEPENDENT
##VAR_FORM=  AFFN,          ASDF,            ASDF
##VAR_DIM=   131072,        131072,          131072
##UNITS=     HZ,            ARBITRARY UNITS, ARBITRARY UNITS
##FACTOR=    0.0627417313425164, 1,          1
##FIRST=     8223.62146879497, 3596,         -58319
##LAST=      0,             4420,            -57787
##MIN=       0,             -10891,          0
##MAX=       8223.62146879497, 367875267,    0
$$ Real data points
##PAGE= N=1
##DATA TABLE= (X++(R..R)), XYDATA
$$ [...]
64997 198011 198987 199112 198902 199007 199601 200271 200607 200732 201066 201753 202527 203100 203439 203736 204307 205512 207532 210110
64979 210110 212601 214316 214775 213822 211804 209631 208201 207476 206418 204123 200873 197735 195270 193052 190526
64964 190526 187879 185838 184779 184311 183717 182696 181626 181110 181164 181034 179985 178160 176267 174534 172537 170294
64948 170294 168810 168903 169883 170165 169111 167589 166660 166450 166531 166744 167150 167571 167734 167720 167950 168826 170516 172793
64930 172793 174839 175616 174911 173742 173261 173462 173453 172851 172238 172243 172798 173524 174267 174956 175324 175222 175032 175342 176274
64911 176274 177326 177986 178340 179090 180958 184083 187978 192091 196313 200922 206224 212408 219542 227447 235656
64896 235656 243806 251939 260161 268097 275116 280986 285962 290312 294272 298362 303068 308046 312260 315127
64882 315127 316937 317847 317119 313911 308333 301181 293040 284293 275716 268251 262176 257046 252528 248830 246262
64867 246262 244808 244234 244322 244848 245515 245921 245539 243860 240773 236665 231956 226813 221488 216520 212142 207873
64851 207873 203291 198910 195544 193012 190410 187713 186099 186276 187331 187845 187531 187100 186912 186596 185855 184936
64835 184936 184173 183577 183094 182926 183333 184218 185103 185600 185930 186829 188792 191439 193848 195564 197011 198902 201530
64818 201530 204808 208694 213260 218532 224507 231202 238459 245820 252876 259680 266659 274141 282016 289684
64804 289684 296188 300604 302533 302144 299713 295421 289740 283596 277659 271752 265424 258898 252872 247459
64790 247459 242066 236541 231816 228972 228052 228209 228730 229437 230323 231340 232558 234044 235443 236191 236407 237211
64774 237211 239698 243784 248466 253145 258195 264137 270820 277815 285270 293763 303309 313011 321801 329217
64760 329217 335328 340341 344600 348666 352966 357385 361485 365045 368139 370745 372644 373800 374533 375073 375043
64745 375043 373561 369847 363691 355429 345679 335133 324492 314396 305197 296761 288651 280726 273603
64732 273603 268316 265442 264623 264969 265725 266440 266765 266496 265824 265167 264665 264194 264051 265176 268173 272396 276669
64715 276669 280862 285997 292595 299659 305772 310559 314363 316956 317493 315602 311685 306056 298653 289806
64701 289806 280578 271933 264140 257259 251543 246850 242299 237294 232543 229344 227981 227521 227096 226697 226585
64686 226585 226625 226564 226542 226987 228195 230273 233309 237316 242040 246999 251916 257135 263530 271769 281560 291795
64670 291795 301525 310493 318558 324968 328700 329369 327375 323198 317025 309143 300271 291304 282957 275751
64656 275751 270022 265755 262559 259949 257649 255705 254511 254628 256272 258945 261827 264539 267291 270397
64642 270397 274003 278317 283683 290310 298245 307676 318828 331401 344512 357416 369952 382069 393284
64629 393284 402888 410342 415118 416497 414016 407984 399231 388409 375869 362091 347855 333968 321002
64616 321002 309258 298764 289376 281066 274018 268248 263291 258558 253911 249671 246152 243394 241248 239385
64602 239385 237390 235195 233328 232333 231963 231418 230386 229375 228833 228518 228116 228125 229566 232880 237477 242396
64586 242396 247150 251894 257019 262738 269023 275892 283667 292753 302966 313246 322346 329865 336385 342565
64572 342565 348315 352970 355973 357152 356549 354321 350796 346323 340981 334661 327503 320024 312692 305652
64558 305652 299046 293353 289098 286280 284365 282768 281161 279464 277876 276873 276793 277381 278041 278606 279523 281192
64542 281192 283454 285867 288110 289875 290680 290154 288331 285442 281610 277045 272284 267860 263781 259644 255275
64527 255275 250980 247216 244236 242061 240570 239601 239080 238961 238975 238616 237661 236562 236057 236480 237707 239523
64511 239523 241670 243710 245432 247434 250768 255778 261674 267456 272935 278657 285206 292829 301420 310497
64497 310497 319286 327109 333628 338652 341974 343580 343735 342574 339784 335160 329404 323964 319954 317419
64483 317419 315750 314567 314018 314308 315129 315669 315168 313411 310635 307099 303008 298871 295514 293397 292052
64468 292052 290544 288531 286682 286021 287099 289781 293554 297798 301846 305114 307312 308569 309243 309549 309344
64453 309344 308344 306570 304537 302936 302191 302337 303271 304973 307464 310649 314306 318337 322979 328622 335333
64438 335333 342732 350529 359028 368777 379823 391856 405225 421227 440883 463804 488928 516265
64426 516265 547233 583248 624720 671798 725471 787333 858562 939719 1031343 1133769 1245818
64415 1245818 1363961 1483210 1598989 1708321 1809721 1902397 1985445 2057326 2115765 2158159
64405 2158159 2182297 2187036 2172715 2141072 2094494 2034891 1963095 1879300 1783930 1678018 1563236
64394 1563236 1442246 1319130 1198758 1085220 980845 886654 803130 730143 666669 611420
64384 611420 563738 523378 489548 460883 436470 416236 400069 387146 376497 367663 360372 354025
64372 354025 348105 342761 338255 333977 328737 322145 315077 308544 302592 296606 290278 283817 277435 271137
64358 271137 265077 259844 256221 254711 255279 257474 260716 264544 268691 273090 277841 283047 288485 293462
64344 293462 297101 298862 298732 296998 293998 290081 285569 280655 275455 270254 265575 261881 259204 257148
64330 257148 255242 253297 251513 250318 250080 250889 252531 254642 256875 259006 260924 262561 263905 265155 266768
64315 266768 269100 271906 274415 276050 276877 277160 276719 275084 272166 268377 264082 259289 253967 248311 242574
64300 242574 236914 231546 226843 223114 220459 218868 218180 217844 217126 215861 214802 214892 216341 218614 221129
64285 221129 223653 226198 229001 232637 237757 244448 251971 259298 265926 272186 278831 286303 294307 302024
64271 302024 308709 314018 317926 320595 322388 323642 324252 323725 321950 319710 318126 317737 318350 319522 320714
64256 320714 321134 320026 317229 313077 307750 301162 293596 285848 278484 271354 264153 257052 250447 244430
64242 244430 238960 234338 230989 228875 227569 226870 226911 227642 228675 229751 230992 232457 233830 234805 235521 236254
64226 236254 236821 236749 236051 235430 235482 235987 236322 236430 236895 237921 238688 238120 236067 233298 230468 227687 225135
64209 225135 223407 222850 223039 223457 224336 226173 228615 230590 231666 232556 233978 235584 236536 236848 237633 240082
64193 240082 244605 250914 258571 267321 277114 288011 300059 313198 327155 341261 354375 365291
64181 365291 373337 378421 380422 378872 373561 365183 354973 343796 331977 319939 308501 298316 289395
64168 289395 281376 274027 267315 261216 255728 250909 246683 242709 238707 234885 231845 230059 229557 230095 231402
64153 231402 233203 235161 237002 238765 240876 243893 248111 253350 259099 264794 269958 274213 277329 279271
64139 279271 280135 280019 279064 277580 275966 274448 272972 271396 269672 267840 266007 264372 263145 262372 261970
64124 261970 262022 262884 264894 268032 271941 276208 280623 285319 290739 297310 305081 313789 323239 333341 343691
64109 343691 353478 362056 369341 375381 379801 382174 382848 382998 383791 385767 388984 393349 398627 404442 410441
64094 410441 416338 421695 425868 428332 428954 427902 425360 421395 415963 409017 400745 391761 382862 374540
64080 374540 366821 359588 352918 347030 342018 337669 333535 329308 325316 322500 321557 322122 323177 324239 325706
64065 325706 327912 330372 332367 333934 335839 338718 342667 347552 353256 359553 366127 372862 379873 387116
64051 387116 394165 400545 406182 411326 416079 420141 423053 424604 424908 424200 422725 420869 419233 418377 418537
64036 418537 419628 421350 423112 424147 424075 423309 422514 421753 420594 419023 417626 416738 416047 415431 415552 416994
64020 416994 419188 420849 421266 420542 418762 415676 411302 406187 400820 395278 389648 384372 379884 376177 372953
64005 372953 370018 367335 364924 362804 360897 358929 356687 354457 352951 352721 353830 356087 359206 362734
63991 362734 366292 370140 375057 381310 388068 394226 399572 404746 410312 416377 422956 430101 437603 445118
63977 445118 452776 461218 470723 480648 490150 499236 508660 518888 529704 540999 553427 567840 584254
63964 584254 601833 619873 638410 657857 678546 700889 725619 753470 784806 819861 859224
63953 859224 903712 953930 1010441 1074453 1147962 1233022 1331021 1442627 1568228 1708365 1863918
63942 1863918 2035711 2223539 2425586 2639144 2861931 3092332 3328323 3566632 3802910
63933 3802910 4032037 4247950 4443970 4614280 4755213 4864910 4941957 4984682 4991466 4961196
63923 4961196 4893495 4789115 4650363 4481077 4286205 4071417 3842698 3605704 3365249 3125380
63913 3125380 2889685 2661338 2443082 2237490 2046998 1873259 1716609 1576558 1452694
63904 1452694 1344690 1251674 1172264 1105282 1049820 1004434 966875 934997 907663 884494 865041
63893 865041 848491 834006 821035 809378 799064 790081 782165 775119 769318 765566 764270 765040 767363
63880 767363 771391 777801 787118 799552 815339 834855 858355 885841 917191 952243 990802 1032842
63868 1032842 1078737 1129021 1183727 1242038 1302692 1364735 1427882 1492207 1557544 1623102 1687507
63857 1687507 1749153 1806556 1858599 1904572 1943947 1976048 2000058 2015442 2022224 2020537 2009995 1989887
63845 1989887 1960145 1921807 1876297 1824460 1766583 1703187 1635461 1564884 1492650 1419583 1346464
63834 1346464 1274271 1204033 1136459 1071806 1010180 951955 897685 847682 801876 760115 722304
63823 722304 688047 656473 626803 599060 573891 551627 531750 513390 496210 480710 467700
63812 467700 457526 449718 443402 438022 433634 430478 428427 426980 425618 423853 420951 416026 408713 399619
63798 399619 389870 380214 370741 361400 352437 344126 336314 328582 320868 313711 307791 303406 300411 298345
63784 298345 296485 294086 290944 287620 284833 282707 280853 279042 277393 275974 274627 273279 272042 270923
63770 270923 269787 268687 267813 267032 265941 264548 263372 262547 261471 259827 258386 258018 258231 257640 255851 254022
63754 254022 253338 253672 254157 254484 255094 256363 258088 259705 260741 261151 261366 261919 262963 264281 265783 267688
63738 267688 270028 272313 273984 275020 275884 276976 278399 280141 282299 285087 288692 292965 297284 301033
63724 301033 304397 308355 313604 319675 325426 330258 334518 338862 343544 348251 352245 354689 355195 354186
63710 354186 352474 350502 348191 345518 342806 340317 337876 335139 332116 329299 327391 326991 328272 330789
63696 330789 333712 336455 339044 341814 344918 348230 351603 355002 358464 362046 365754 369306 372009 373169
63682 373169 372783 371708 370942 370749 370629 370151 369581 369492 369924 370320 370372 370548 371506 373230 375059 376394 377018 376973
63664 376973 376670 377008 378632 380792 381636 380064 376822 373245 369483 364722 358820 352728 347211 342091 337090
63649 337090 332674 329485 327434 325991 325042 324825 325188 325621 326096 327303 329793 333302 337239 341508 346442
63634 346442 352010 357511 362268 366451 370960 376500 382931 389596 396148 402823 409972 417584 425426 433412
63620 433412 441688 450518 460297 471505 484316 498340 513058 528619 545873 565495 587235 610212
63608 610212 633766 657846 682668 708139 733530 757574 778882 796414 809582 818015 821491 820344
63596 820344 815807 809610 803060 796560 790015 783454 777046 770571 763124 753502 740914 725298 707115
63583 707115 687071 666065 645066 624715 605121 586347 569058 554330 542644 533469 526082 520511
63571 520511 517234 516178 516568 517754 519637 522143 524894 527821 531609 536887 543141 549146 554476 560014
63557 560014 566760 574759 583636 593638 605548 619772 636243 655178 677289 703015 732167 764647
63545 764647 800966 841291 883938 925149 960426 986181 1000759 1004721 1000358 990441 977186 962399
63533 962399 948147 936387 927623 920533 913353 905327 896426 886101 873039 856065 834802 809508
63521 809508 780885 750182 718983 688549 659487 632047 606378 582380 559812 538805 519911
63510 519911 503301 488297 474180 461221 450252 441287 433251 425277 417707 411389 406364 401784 396942
63497 396942 391900 387116 382916 379513 377166 376008 375832 376234 376892 377590 378146 378510 378897 379602 380732 382232
63481 382232 384153 386703 390035 394170 399115 404841 411013 416916 421831 425452 427838 429014 428783 427022
63467 427022 424092 420850 418092 415890 413554 410410 406630 403146 400764 399562 399129 399077 399137 399037 398650 398237
63451 398237 398333 399430 401916 406096 411894 418601 425350 432020 439396 448281 458691 470176 482687 496880
63437 496880 513706 534006 558469 587523 621012 657908 696337 733699 766847 792607 808786
63426 808786 815138 813542 807212 799557 793313 790144 790623 794612 802003 813338 829589 851131 876881
63413 876881 904604 932041 957622 980117 998007 1009715 1014574 1013432 1008107 1000271 990910 980639
63401 980639 970163 960059 950183 939546 926909 911427 892737 870694 845345 817212 787364 757032
63389 757032 727059 697747 669231 642036 617135 595284 576299 559281 543723 530172 519523
63378 519523 511816 506153 501773 498804 497779 498845 501780 506508 513129 521452 530877 540982 551997 564535
63364 564535 578909 594904 612234 631082 652077 675813 702419 731522 762438 794374 826661
63353 826661 858942 890975 921999 950288 973617 990396 1000417 1004660 1004521 1001208 995613 988506 980699
63340 980699 972833 964957 956460 946611 934997 921210 904368 883544 858817 831507 803264 775250
63328 775250 748204 722683 698873 676656 656403 639372 626775 618658 614280 613306 615701 620182 623431
63315 623431 621510 612118 595567 574018 550074 525736 502170 480149 460578 444305 431402 420953
63303 420953 411832 403548 396162 389599 383436 377430 371936 367568 364437 361870 358973 355517 352140 349653
63289 349653 348190 347164 345956 344540 343420 343057 343267 343156 341810 339229 336456 334574 333766 333580 333802 334528
63273 334528 335491 336066 336183 336684 338439 341406 344837 348042 350669 352650 354237 355870 357713 359549 361381
63258 361381 363731 366988 370891 375135 380042 385965 392333 398135 403298 408763 415108 421850 428328 434556
63244 434556 440895 447519 454624 462681 472019 482531 494189 507475 522884 540265 559069 578920
63232 578920 599502 620242 640710 661240 682565 704835 727403 749610 771395 793087 814889
63221 814889 836666 858057 878873 899614 921337 944625 968763 992342 1014484 1034924 1052985
63210 1052985 1067274 1076695 1081139 1080792 1075248 1063837 1046563 1024227 997886 968646 937830 906785
63198 906785 876459 847510 820762 797085 776777 759565 745496 735411 730123 729333 731859 737007
63186 737007 745286 757544 773639 792395 812810 834926 859289 885802 913434 940967 967756 993789
63174 993789 1019330 1044560 1069274 1092792 1114374 1133927 1152046 1169136 1184602 1197102 1205422 1208824
63162 1208824 1206744 1198645 1184323 1164074 1138336 1107372 1071542 1031829 989864 947253 904871 862901
63150 862901 821637 782171 746045 714118 685928 660381 636969 616068 598097 582771 569343
63139 569343 557391 547124 538945 532820 528019 523455 518461 513414 509503 507620 507428 507658 507426 507069 507575
63124 507575 509350 511824 514272 516644 519356 522530 525847 529095 532399 535822 539120 542262 545783 550191
63110 550191 555109 559465 562633 564989 567251 569594 571609 572888 573360 573180 572569 571779 571095 570791 571105 572183
63094 572183 574044 576642 579953 583815 587690 590787 592607 593288 593378 593372 593521 593890 594404 594976 595752 597155 599575
63077 599575 603092 607626 613194 619758 626958 634373 642080 650653 660448 671169 682320 693891 706286
63064 706286 719709 734000 749200 765888 784695 805668 828527 853468 881240 912239 945967
63053 945967 981782 1019886 1061033 1105343 1152051 1200563 1251123 1304057 1358804 1414234 1469649
63042 1469649 1524966 1580068 1634641 1688698 1742689 1796871 1850993 1904807 1958535 2012419 2065988
63031 2065988 2117999 2166906 2211108 2248888 2278497 2298405 2307364 2304337 2288654 2260379 2220464 2170501
63019 2170501 2112358 2047972 1979351 1908627 1838034 1769699 1705396 1646516 1594231 1549463 1512589
63008 1512589 1483357 1461373 1446685 1439777 1441010 1450182 1466588 1489257 1517159 1549332 1585003 1623566
62996 1623566 1664464 1707158 1751157 1795963 1841024 1885895 1930504 1975068 2019601 2063541 2105884
62985 2105884 2145551 2181466 2212311 2236423 2252081 2257926 2253086 2236984 2209248 2169970 2120022 2060886
62973 2060886 1994060 1920816 1842617 1761590 1680227 1600543 1523623 1449884 1379575 1313094 1251134
62962 1251134 1194532 1143656 1097835 1055733 1016461 980086 946888 916519 888234 861681 836953
62951 836953 813938 792106 771016 750645 731145 712539 694789 677846 661556 645811 630905
62940 630905 617436 605630 595060 585262 576369 568770 562340 556447 550751 545643 541702 538870 536329
62927 536329 533193 529303 525337 522161 520059 518671 517520 516373 515076 513467 511722 510477 510224 510662 510979
62912 510979 510727 510087 509344 508499 507474 506294 504858 502850 500157 497242 494780 492976 491423 489684 487866
62897 487866 486551 486151 486394 486558 486227 485665 485287 484932 483982 482165 479890 477726 475942 474755 474585 475641
62881 475641 477407 478993 480041 481000 482443 484376 486298 487688 488296 488165 487581 486901 486222 485204 483376 480660
62865 480660 477485 474350 471407 468549 465747 463111 460750 458843 457824 458121 459556 461297 462691 463898
62851 463898 465412 467197 468758 469913 470962 472061 472934 473422 473846 474529 475298 475748 475732 475319 474557 473654 473128
62834 473128 473358 474101 474848 475552 476627 478240 480039 481643 483075 484611 486472 488793 491584 494616 497561
62819 497561 500421 503626 507563 512126 516849 521368 525610 529659 533611 537577 541672 546018 550746 556025
62805 556025 561995 568660 575815 583164 590680 598908 608706 620478 633701 647341 660666 673543 686142
62792 686142 698774 712095 727134 744855 765774 790146 818418 851227 888895 931052 977003
62781 977003 1026581 1080556 1140040 1205533 1276707 1353022 1434102 1519304 1607273 1696306 1784880
62770 1784880 1871365 1953396 2028114 2093106 2146701 2187312 2213101 2222679 2215873 2193568 2157016 2107554
62758 2107554 2046773 1976615 1899261 1816951 1731724 1645227 1558865 1474098 1392288 1314234 1240248
62747 1240248 1170877 1107056 1049190 996468 947649 902355 861163 824564 792397 764246 739823
62736 739823 718750 700447 684486 670741 659004 648778 639711 631947 625717 620806 616802 613753 612183
62723 612183 612380 614046 616718 620255 624752 630212 636592 644058 652954 663529 675878 690153 706617
62710 706617 725460 746748 770660 797605 827986 861959 899594 941164 987094 1037642 1092809
62699 1092809 1152615 1217309 1287299 1362881 1443967 1529840 1619167 1710382 1802128 1893170 1981789
62688 1981789 2065370 2140701 2204660 2254708 2288989 2306253 2305797 2287503 2252006 2200781 2135946 2059851
62676 2059851 1974874 1883559 1788684 1692927 1598370 1506290 1417390 1332214 1251459 1175945 1106255
62665 1106255 1042418 984049 930857 882942 840516 803369 770682 741395 714764 690629 669167
62654 669167 650371 633790 618749 604650 591007 577410 563764 550523 538408 527831 518742 511039
62642 511039 504803 500061 496580 494052 492320 491295 490818 490704 490718 490453 489479 487750 485645 483419 480944 478203
62626 478203 475789 474471 474282 474370 473782 472258 470339 468949 468849 470202 472557 475312 478275 481658 485616
62611 485616 489931 494223 498430 502985 508463 515014 522303 530154 539148 550210 563638 578929 595698
62598 595698 614370 635745 660308 688247 719710 754482 791718 830568 870904 912867 955769
62587 955769 998063 1038426 1076248 1110847 1140763 1164210 1179956 1187535 1186867 1178010 1161194 1136982
62575 1136982 1106503 1071508 1033844 994698 954529 913797 873427 834404 797237 762077 729172
62564 729172 698899 671496 646978 625258 606156 589401 574783 562261 551736 542752 534515 526296
62552 526296 517905 509864 503034 497882 494153 491361 489414 488478 488367 488601 489020 489844 491046 492296 493742
62537 493742 496141 499710 503380 505852 507075 508076 509619 511777 514694 518918 524826 532339 541450 552545
62523 552545 565893 581264 598361 617287 638326 661519 686837 714582 745365 779790 818279
62512 818279 860989 907618 957356 1009182 1062115 1115124 1167069 1216906 1263691 1306091 1342123
62501 1342123 1369832 1388235 1397405 1397740 1389531 1373267 1349995 1321270 1288949 1255071 1221526 1189581
62489 1189581 1159846 1132875 1109610 1091087 1077861 1069929 1067036 1068783 1074484 1083226 1094035 1105738
62477 1105738 1116679 1125013 1129523 1130033 1126873 1120117 1109424 1094231 1073800 1047380 1014894 977586
62465 977586 937552 896512 855231 814138 773951 735403 698780 664245 632432 604273 580245
62454 580245 560149 543531 529877 518412 508288 499257 491836 486569 483418 482012 482034 483040 484357
62441 484357 485719 487746 491175 495722 500359 504658 509104 513870 518056 520623 521491 521084 519226 515262 509210
62426 509210 502067 494878 487999 481377 475016 468955 463185 457925 453663 450648 448491 446514 444325 441879
62412 441879 439248 436610 434312 432600 431298 430020 428645 427406 426516 425903 425350 424742 424178 423991 424661 426497
62396 426497 429334 432636 436065 439920 444871 451111 457785 463526 467722 471106 474792 478991 483178 487421
62382 487421 492752 499805 507795 515481 522749 530459 538958 547660 556127 564723 573804 582927 591397 599249
62368 599249 607170 615745 625175 635557 647038 659791 674252 691362 712202 737311 766526 799472
62356 799472 836014 876248 920173 967332 1016581 1066252 1114632 1160247 1201651 1237265 1265836
62345 1265836 1286974 1301037 1308584 1310225 1306820 1299264 1287873 1272335 1252474 1228786 1202127 1173220
62333 1173220 1142732 1111513 1080343 1049544 1019210 989757 961875 935873 911346 887632 864360
62322 864360 841397 818498 795260 771484 747447 723784 701091 679580 659078 639390 620669
62311 620669 603402 588056 574778 563359 553335 544164 535557 527754 521322 516612 513566 512035 511914
62298 511914 512729 513507 513571 513346 513916 515744 518280 520875 523557 526659 530087 533365 536159 538393 540034 541145
62282 541145 542053 543158 544542 545965 547166 547916 547959 547275 546389 546067 546587 547627 548958 550947 554217 559134
62266 559134 565904 574905 586555 600870 617534 636530 658422 683901 713270 746604 784186 826353
62254 826353 872861 922721 974831 1028408 1082450 1134971 1183224 1224764 1258133 1282702 1298439
62243 1298439 1305890 1305876 1298827 1284613 1263267 1235572 1202675 1165310 1123668 1077949 1028923 978158
62231 978158 927780 879640 834480 792132 752656 716822 685238 657583 633165 611731 593200
62220 593200 577078 562870 550681 540536 531371 521791 511874 503292 497295 493360 490105 486787 483508
62207 483508 480586 478299 476781 475783 474848 473982 473794 474657 476207 477935 479848 482225 485179 488820 493443
62192 493443 499170 505754 513020 521086 529884 538990 548327 558437 569493 580532 590381 599024 607337
62179 607337 615633 623125 628781 632220 633884 634834 636316 639137 643525 649780 658689 670863 686151 704366
62165 704366 726262 752972 784557 819789 857255 895833 934043 969816 1001345 1027728 1048631
62154 1048631 1063871 1073554 1078120 1077922 1073056 1063680 1050074 1032273 1010158 984183 955589 925652
62142 925652 895080 864486 835086 808466 785682 766740 750932 737563 726525 718241 713028 710537
62130 710537 709971 710734 712694 716031 721171 728655 738564 750161 762644 776281 792193 810934 831841
62117 831841 853962 876937 900608 924302 946996 967796 985821 999985 1009543 1014819 1017047 1017530
62105 1017530 1017171 1016582 1016084 1015475 1014038 1011014 1006165 999945 993174 986512 980278 974859 971069 969700 970652
62090 970652 972832 975064 976935 978840 981573 985892 992044 999511 1007504 1015841 1025105 1035955 1048722 1063707
62076 1063707 1081249 1101193 1122736 1145177 1168348 1192020 1215309 1237185 1257245 1275547 1292079
62065 1292079 1306947 1320813 1334541 1348474 1362479 1376507 1390503 1403859 1415600 1425232 1432983 1439105
62053 1439105 1443363 1445351 1444918 1442090 1436829 1428947 1417991 1403057 1383001 1357139 1325735 1289817 1250637
62040 1250637 1209318 1166761 1123627 1080352 1037206 994476 952730 912931 876052 842444 811767
62029 811767 783688 758415 736302 717123 700095 684576 670411 657616 646074 635588 625992 617044
62017 617044 608380 599708 591000 582426 574187 566482 559673 554362 551095 549816 549730 549992 550533 551949 554658
62002 554658 558571 563568 569690 576554 583166 588763 593430 597370 600058 600855 600135 598958 597608 595191 590780
61987 590780 584302 576162 566727 556517 546312 536636 527453 518644 510387 502781 495593 488791 483002 478868
61973 478868 476091 473567 470450 466786 463137 459921 457185 454795 452752 451332 450873 451320 452140 452792 453159
61958 453159 453398 453565 453615 453702 454200 455393 457297 459792 462876 466814 472086 479094 487773 497545 507806 518451
61942 518451 529865 542518 556714 572597 590091 608755 627869 646863 665626 684277 702639
61931 702639 720075 735971 750318 763618 776121 787339 796447 803004 807026 808501 807227 803274 797270
61918 797270 790073 782396 774926 768533 764022 761733 761609 763623 767935 774668 783716 794820 807703 822108
61904 822108 837638 853409 867908 879497 887293 891316 891610 887598 878806 866017 851037 835191 818599
61891 818599 801096 783249 766011 749789 734404 719734 705816 692466 679443 667005 655686
61880 655686 645285 634649 622854 610276 598061 586840 576427 566593 557575 549760 543307 538222
61868 538222 534463 531849 530160 529526 530493 533523 538548 545143 552962 561873 571875 583112 595911 610589
61854 610589 627284 646053 667081 690663 717019 746180 777860 811264 845095 877963 908803
61843 908803 936981 962129 984039 1002466 1016807 1026106 1029656 1027634 1021061 1011274 999664 987692
61831 987692 976691 967474 960447 956176 955583 959395 967540 979218 993360 1008804 1024174 1037901 1048507
61818 1048507 1054848 1056136 1051853 1041785 1026130 1005510 980656 952063 920109 885706 850578 816513
61806 816513 784248 753426 723754 695888 670950 649454 631065 615259 601808 590574 581224 573351
61794 573351 566666 560873 555581 550593 546250 543150 541411 540411 539381 538101 536859 535890 535124 534459 533939
61779 533939 533532 532959 532012 530895 529974 529248 528328 527006 525503 524009 522258 519905 517230 515027 513689 512749
61763 512749 511575 510313 509743 510282 511501 512760 513965 515494 517615 520252 523135 525858 527865 528764 528722
61748 528722 528295 527795 527038 525745 523968 521968 519880 517652 515264 512961 511292 510822 511590 512887 513856 514337
61732 514337 514937 516283 518517 521429 524685 527787 530356 532683 535610 539522 543806 547630 550963 554439
61718 554439 558476 562950 567535 571877 575550 578321 580425 582256 583812 584788 585052 584657 583481 581373 578668
61703 578668 576049 573857 571874 569902 568122 566807 566069 566043 566922 568578 570464 572199 574027 576480 579663
61688 579663 583032 585804 587502 588277 588761 589516 590590 591650 592401 592671 592211 590828 588743 586438 584062 581296
61672 581296 577871 573874 569447 564552 559269 554031 549343 545458 542438 540259 538695 537377 536190 535394
61658 535394 535187 535438 536009 536997 538343 539542 540157 540443 541040 542171 543551 544979 546583 548420 550266 551990
61642 551990 553842 556132 558805 561542 564096 566266 567605 567545 565995 563562 560948 558156 554620 550104 545163
61627 545163 540610 536885 534153 532583 532003 531521 530163 528017 526270 525870 526490 527004 526667 525575 524198 522742
61611 522742 520878 517976 513700 508424 502924 497609 492306 486852 481586 477053 473450 470523 467874 465213
61597 465213 462476 459777 457163 454446 451517 448784 446892 445907 445224 444458 443999 444310 445012 445111 444076 442383
61581 442383 441016 440554 440625 440143 438309 435487 432886 431242 430117 428626 426454 423881 421243 418787 416818
61566 416818 415450 414350 413068 411538 409982 408473 406912 405273 403556 401675 399760 398358 397900 398066 398087
61551 398087 397596 396837 396129 395595 395332 395368 395412 395085 394488 394096 394014 393784 393157 392665 393100 394610 396631 398640 400688
61532 400688 403067 405599 407415 407611 406048 403363 400186 396702 393069 389800 387285 385118 382377 378609
61518 378609 374239 370056 366634 364215 362807 362241 362332 362990 364056 365147 365872 366119 365925 365205 363909 362304
61502 362304 360726 359192 357571 356033 354912 354213 353659 353214 353103 353333 353673 354122 354924 356008 356882 357225 357186
61485 357186 357036 356982 357446 358936 361333 363713 365229 365875 366171 366512 367110 368104 369287 370070 370225 370383 371272
61468 371272 372636 373507 373502 373281 373554 374174 374527 374452 374348 374543 374956 375449 376147 377146 378155 378720 378796 378781 378912 378921
61448 378921 378450 377539 376525 375705 375319 375574 376342 377059 377410 377901 379294 381591 384100 386433 388771 391127
61432 391127 393048 394288 395161 395930 396434 396649 397070 398084 399431 400786 402422 404686 407174 409060 410132
61417 410132 410911 411893 413180 414744 416455 417852 418420 418161 417500 416623 415395 413908 412517 411157 409175 406132
61401 406132 402423 398778 395498 392448 389566 387019 385038 383819 383422 383529 383530 383157 382809 382900 383038 382415 381076
61384 381076 380218 380933 382966 385145 386778 388136 389647 391195 392507 393775 395444 397512 399499 401140 402786
61369 402786 404948 407628 410241 412130 413142 413772 414730 416216 417703 418633 419290 420650 423290 426747 430167
61354 430167 433292 436613 440798 446239 453015 460995 469997 479985 490927 502289 512961 522074 529754
61341 529754 536676 542966 548036 551538 553934 555919 557687 559041 559863 560097 559522 558001 555825 553388 550578
61326 550578 546929 542473 538005 534319 531501 529225 527463 526540 526622 527525 528994 530877 533054 535510 538563
61311 538563 542700 548018 554095 560571 567658 575869 585463 596382 608495 621580 635123 648445 660951
61298 660951 671990 680543 685527 686566 684270 679606 673222 665457 656670 647279 637552 627669 617948 608880
61284 608880 600844 593856 587627 581873 576607 572121 568762 566743 566150 566966 568947 571648 574740 578244 582308
61269 582308 586831 591512 596156 600697 605024 609101 613247 618013 623746 630553 638623 648254 659468 671903
61255 671903 685064 698313 710624 720861 728534 733904 737232 738459 737831 736158 733867 730297 724617
61242 724617 717176 709258 701717 694630 688193 683066 679552 677197 675552 674689 674521 674204 673019 671578 671452
61227 671452 673570 677556 682633 688483 694983 701699 708222 714718 721605 728705 735278 740992 746454 752576
61213 752576 759679 767368 774943 781639 786772 790196 792620 795067 797919 800726 803020 805035 807523 811134
61199 811134 816171 822810 831339 842203 855846 872344 891109 911089 931423 951874 972530 993108
61187 993108 1012592 1029549 1042873 1052356 1058624 1062524 1064604 1065177 1064557 1062963 1060318 1056465 1051506 1045591
61173 1045591 1038447 1029550 1018812 1006660 993341 978663 962648 945987 929430 912982 896069 878315
61161 878315 859904 841359 823320 806375 790834 776756 764284 753715 745031 737695 731352 726554
61149 726554 724355 725185 728412 732967 738010 742997 747326 750080 750135 746809 740610 733115 725862 719475 714081
61134 714081 710144 708320 708626 710355 712902 716318 721053 727636 736701 748832 764067 781792 801277
61121 801277 822105 844045 866956 891117 917327 946227 977499 1009950 1042403 1074308 1105550
61110 1105550 1135949 1165162 1192960 1219264 1243777 1265843 1284961 1301305 1315271 1326487 1333788
61099 1333788 1336424 1334767 1329431 1320101 1305897 1286669 1263267 1236573 1206988 1175018 1141786 1108573
61087 1108573 1076156 1044726 1014150 984139 954637 926281 900139 876683 855382 835623 817668
61076 817668 802270 789595 779033 769972 762276 755986 751025 747279 744621 742716 741145 739883 739412 740197
61062 740197 742313 745726 750533 756552 763032 769297 775668 783263 792877 804494 817889 833075 849882
61049 849882 867692 886155 905854 927687 951740 977332 1004048 1032135 1061777 1092485 1123429
61038 1123429 1154112 1184615 1215422 1247016 1279444 1312352 1345701 1380130 1416165 1453376 1491016
61027 1491016 1529301 1569118 1610546 1652680 1695099 1738453 1783220 1829060 1876190 1926527 1982648
61016 1982648 2046304 2118669 2201090 2294488 2398702 2513694 2641238 2784786 2948647 3138927
61006 3138927 3365022 3638805 3972392 4377948 4869475 5463308 6176875 7029055 8043218
60997 8043218 9249599 10682642 12368789 14299656 16394361 18476128 20298823 21631794
60989 21631794 22360135 22534805 22342540 22024909 21798533 21800770 22053308 22441718 22735111 22665560
60979 22665560 22040490 20822274 19127203 17156608 15114717 13157100 11376305 9809780
60971 9809780 8457150 7299637 6314695 5481664 4781539 4196681 3711504 3311907 2983819
60962 2983819 2713376 2488517 2299591 2138622 1999106 1876540 1768183 1671981 1586159 1509636
60952 1509636 1441989 1382771 1331207 1286360 1246913 1210840 1175927 1140783 1105012 1068678 1032159
60941 1032159 996370 962279 930090 899309 869638 841268 814317 788594 764024 740830 719143
60930 719143 698839 679920 662683 647429 634164 622542 611877 601415 590915 580800 571385 562316
60918 562316 553256 544797 537911 532601 527888 523213 519097 516232 514547 513488 512638 511739 510523 508933 507283
60903 507283 505952 505051 504430 503809 502898 501703 500641 500011 499435 498289 496682 495386 494758 494331 493713 493308 493723
60886 493723 494953 496582 498447 500601 502774 504308 504658 503748 501883 499501 496947 494339 491603 488618 485277
60871 485277 481489 477296 472937 468659 464569 460892 458221 457110 457424 458378 459254 459886 460536 461626 463466
60856 463466 465875 468194 470064 471990 474581 477408 479406 480394 481400 483283 485853 488645 491672 494840
60842 494840 497347 498455 498408 497931 497171 495817 493965 492119 490488 488955 487745 487495 488491 490228 491825 492663
60826 492663 492671 492375 492679 494248 496995 500231 503210 505351 506219 505659 503892 501256 497977 494380 490986 487975
60810 487975 484819 480999 476869 473247 470212 466915 462659 457567 452121 446656 441590 437544 434765 432756
60796 432756 430874 429022 427409 425928 424296 422643 421463 420842 420119 418559 416222 413963 412603 412175 412053
60781 412053 411766 411519 411804 412607 413295 413393 413247 413737 415444 418252 421718 425653 430275 435849 442225 448811
60765 448811 455077 461018 466910 472695 477933 482531 487145 492485 498419 504111 508965 513015 516389 518890
60751 518890 520348 521039 521434 521799 522274 523103 524362 525637 526397 526692 527044 527528 527369 525651 522191 517501 512165
60734 512165 506567 501045 495952 491474 487490 483633 479444 474628 469358 464264 459967 456626 453994 451756
60720 451756 449721 447853 446379 445701 445990 446898 447868 448660 449383 450153 451006 452079 453552 455416 457548 460020
60704 460020 463051 466665 470735 475405 481118 488034 495678 503273 510250 516395 521829 526961 532176 537444
60690 537444 542422 547041 551634 556310 560613 564130 567158 570363 573953 577621 581219 585091 589677 595090
60676 595090 601122 607416 613625 619756 626448 634653 644783 656313 668354 680475 692805 705506 718495
60663 718495 731730 745473 760004 775231 790844 806873 823788 841926 860982 880226 899041
60652 899041 917096 934201 950316 965593 980030 993094 1003962 1012153 1017614 1020208 1019506 1015212 1007422
60639 1007422 996381 982374 966156 949110 932500 916550 900508 883602 865813 847881 830747
60628 830747 814958 800463 786952 774355 762875 752540 743043 734071 725516 717260 709105 701062 693325
60615 693325 685773 677904 669601 661530 654295 647513 640239 632100 623457 614626 605596 596555 588056 580433
60601 580433 573408 566448 559256 551895 544718 538206 532556 527459 522609 518336 515198 513033 511049 508945
60587 508945 507214 505966 504262 501256 497525 494510 492893 492213 491894 491805 491717 491082 489903 489305 490630 494063
60571 494063 498612 503319 508059 513143 518684 524725 531739 540494 551300 563539 575979 587423 597074
60558 597074 604520 609542 611884 611231 607624 601953 595695 589904 584601 579388 574435 570502 568189 567615 568835
60543 568835 572072 577360 584377 592840 602791 614194 626516 638893 650586 660996 669437 675212 677926
60530 677926 677540 674237 668561 661626 654850 649202 644788 641268 638569 637011 636673 636829 636279 634397 631765
60515 631765 629666 629031 629940 631975 634676 637610 640390 642937 645620 648938 653152 658368 664893 673291 684117
60500 684117 697703 714242 733933 757082 784128 815556 851581 891802 935140 980098 1025005
60489 1025005 1067937 1106513 1138056 1160246 1171672 1171650 1159652 1135383 1099726 1055363 1006049 955211
60477 955211 905282 857955 814380 775042 739870 708678 681296 657334 636281 617891 602069
60466 602069 588335 575952 564739 555150 547266 540289 533482 527037 521431 516434 511514 506867 503187
60453 503187 500485 497916 494790 491133 487235 483398 480274 478734 478937 479952 480585 480292 479240 477948 477013
60438 477013 476674 476398 475362 473519 471712 470518 469592 468506 467581 467316 467487 467514 467437 467745 468374 468586 467884 466502
60420 466502 464981 463759 463261 463859 465448 467408 469192 470795 472514 474466 476442 478110 479301 480157 480956
60405 480956 481648 481710 480744 479159 477990 478009 479206 481025 482800 484039 484681 485190 486164 487823 490033 492738
60389 492738 495977 499516 502909 506042 509206 512469 515394 517598 519278 520918 522732 524625 526456 528069
60375 528069 529265 530062 530837 531933 533239 534358 535084 535477 535589 535423 535156 535099 535364 535707 535773 535360 534462 533227
60357 533227 532014 531388 531863 533451 535480 537014 537633 537743 538084 539068 540687 542848 545491 548498 551858 555898
60341 555898 560927 566664 572403 577773 582797 587073 589593 589842 588586 586924 584875 581587 576782 571272
60327 571272 565920 560748 555392 549944 544944 540734 537251 534428 532472 531622 531790 532588 533697 535050 536652
60312 536652 538432 540476 543232 547170 552261 558167 565037 573689 584788 598156 613161 629481 647082
60299 647082 665660 684382 701968 716691 726603 730407 728228 721227 710578 697205 682390 667927
60287 667927 655336 645164 637146 630771 625622 621496 618391 616138 613984 610825 606059 599944 592990 585287
60273 585287 576702 567499 558423 550207 543198 537430 532740 528735 524865 520815 516882 513747 511752 510461
60259 510461 509168 507748 506655 506022 505222 503641 501562 499849 498922 498502 498297 498516 499551 501399 503499 504984
60243 504984 505174 504141 502774 502083 502430 503548 505084 506751 508210 509372 510895 513820 518502 524173 529688
60228 529688 534447 538572 542588 547014 551928 556755 560787 563966 566884 570008 573379 577083 581384 586172
60214 586172 590841 595205 600075 606416 614141 622247 629965 637350 644735 652068 658926 664957 670127 674577
60200 674577 678356 681414 683871 686094 688217 689723 689890 688703 686913 685123 683167 680564 677192 673261
60186 673261 668928 664289 659540 654887 650423 646221 642381 638861 635450 632054 628812 625892 623343 621208
60172 621208 619421 617595 615296 612670 610397 608895 607955 607252 606727 606269 605581 604695 604121 604128 604382 604644 605290
60155 605290 606630 608228 609510 610599 611889 613206 614192 615273 617348 620489 623763 626505 629101 632216
60141 632216 635816 639348 642670 646416 651428 657871 664934 671531 677370 683108 689327 695611 700854 704222
60127 704222 705586 705364 704329 703272 702466 701694 701024 701100 702146 703225 703250 702466 702109 702716 703528 703545 702478 700578
60109 700578 698305 696237 694646 692946 690164 686106 681464 676668 671384 665456 659650 654901 651265 648103
60095 648103 645008 642117 639730 638047 637156 637012 637490 638683 641010 644807 649863 655443 660746 665380 669526
60080 669526 673634 677821 681608 684362 685840 686063 684838 681823 677005 670771 663562 655803 648106 641085
60066 641085 634922 629429 624458 619903 615400 610557 605517 600844 596808 593199 589822 586681 583666 580608
60052 580608 577688 575317 573561 572287 571896 573212 576462 580974 586115 591880 598306 604961 611410 617633
60038 617633 623603 628952 633428 637200 640286 642156 642355 641110 638872 635722 631665 627119 622530 617800
60024 617800 612537 606632 600154 592976 585013 576640 568445 560666 553195 545955 539035 532669 527296 523300
60010 523300 520443 517934 515374 513212 511953 511411 511173 511256 511693 511977 511689 511383 512031 513749 515819 517847
59994 517847 520168 523108 526584 530545 535115 540144 545156 549968 554902 560199 565604 570680 575123 578641
59980 578641 580891 581785 581547 580314 577957 574388 569782 564379 558367 552141 546423 541896 538770 536813 535709
59965 535709 535305 535561 536327 537248 538073 539086 540935 543791 546857 549019 549843 549732 549326 549114 549428 550303 551322
59948 551322 551949 552030 551710 550970 549732 548307 547243 546573 545670 543971 541496 538507 535075 531269 527507 524424
59932 524424 522457 521666 521808 522453 523170 523800 524534 525705 527512 529881 532496 534990 537238 539342 541286 542819
59916 542819 543939 545223 547264 549927 552594 555078 557751 560785 563828 566584 569117 571314 572620 572782
59902 572782 572467 572550 573070 573405 573386 573591 574486 575852 577353 579232 581974 585534 589329 593035 597009 601778
59886 601778 607420 613650 620306 627391 634705 641819 648572 655377 662755 670642 678251 684585 689003 691380
59872 691380 691909 690819 688262 684429 679671 674373 668744 662830 656730 650577 644315 637815 631362 625785
59858 625785 621817 619381 617628 615677 613200 610454 607962 606187 605445 606058 608366 612427 617817 624090 631339
59843 631339 639806 648799 656536 661499 663637 663979 663432 662461 661704 662171 664516 668285 671950 673716 672532
59828 672532 668585 662803 655838 647729 638543 628874 619405 610297 601398 592717 584315 576077 568080 560971
59814 560971 555415 551302 548039 545438 543726 542738 541799 540549 539301 538352 537456 536265 534881 533625 532500
59799 532500 531168 529342 527054 524625 522487 520908 519857 519159 518713 518409 518030 517519 517188 517375 517965 518571
59783 518571 519042 519452 519774 520065 520884 522841 525623 527988 529011 528958 528747 528982 529730 530828 531986 532841 533288
59766 533288 533707 534637 536263 538344 540532 542633 544668 546795 549153 551803 554880 558706 563534 569221 575352
59751 575352 581639 587976 594186 599995 605321 610290 614953 619193 622977 626479 629896 633282 636480 639120
59737 639120 640842 641736 642397 643245 643974 644096 643799 643832 644627 646027 647768 649625 651129 651808 651898 652196 652975 653565
59719 653565 653294 652391 651650 651657 652664 654817 658035 661812 665463 668532 670883 672618 674055 675526 677086 678602
59703 678602 680152 682070 684520 687391 690619 694225 697954 701393 704624 708307 712792 717479 721307 723562
59689 723562 724046 722874 720442 717346 713993 710497 707090 704327 702591 701595 700535 698604 695352 690920 686055
59674 686055 681539 677462 673324 668883 664429 660166 655922 651666 647743 644258 640776 637059 633611 631029
59660 631029 629189 627522 625768 624031 622429 621176 620671 621099 622171 623623 625624 628205 630688 632196 632491
59645 632491 631794 630030 626882 622534 617750 613180 608920 604707 600249 595461 590715 586750 584053 582525
59631 582525 581939 582332 583518 584567 584403 582804 580325 577488 574634 572389 571397 571397 571209 569971 568009 566162
59615 566162 564574 562493 559200 554936 550859 548079 546793 546422 546545 547406 549442 552657 556606 560667 564110
59600 564110 566282 567098 567091 566685 565763 564256 562644 561382 560229 558779 557292 556365 555989 555649 555129 554475 553348
59583 553348 551314 548855 547173 546713 546529 545411 543021 539739 535993 532211 528858 526057 523464 520921 518891
59568 518891 517876 517624 517340 516563 515552 514890 514973 515796 517015 518190 519089 519814 520686 522010 523806 525647 526946
59551 526946 527705 528831 531360 535352 539870 544046 547820 551672 556100 561535 568385 576828 586782 598281
59537 598281 611767 627758 646056 665122 682155 694208 699785 699622 695875 690713 685831 682771 682715
59524 682715 685743 690850 697020 703847 710962 717419 722130 724640 725103 723714 720511 715518 708705 699921
59510 699921 689240 677334 665200 653492 642336 631788 622191 613930 606979 600877 595178 589886 585407
59497 585407 582155 580262 579612 579963 580951 582214 583673 585523 587747 589879 591566 593236 595820 599826 605045
59482 605045 611123 617985 625577 633679 642279 651869 663059 675939 689939 704071 717108 727703 734722
59469 734722 737713 737070 733779 728959 723580 718513 714643 712697 712885 715010 719086 725614 734965 746730
59455 746730 760084 774697 790879 808913 828624 849569 871175 892684 913414 933090 951391
59444 951391 966947 977350 980535 975945 964324 947035 926056 904045 883411 865080 848540 833072
59432 833072 818453 804410 790117 774863 759143 744581 732651 723764 717751 714785 715338 719386 726330
59419 726330 735865 748406 764231 782576 802079 821940 842237 863277 885005 906667 926210 940028
59407 940028 944319 937486 921260 899471 876021 853950 835584 822759 816752 817882 824720 833482 838852
59394 838852 836305 824078 803230 776459 747145 718704 693573 672324 654082 637988 624023 612459
59382 612459 603107 595539 589757 586105 584440 583801 583139 582192 581407 581109 581083 581009 580949 581238 582091 583582 585797
59365 585797 588677 591765 594465 596713 599226 603011 608648 615985 624329 632928 641492 650469 660855 673669
59351 673669 689372 707471 726678 745848 764947 784852 805987 827515 848231 867865 886905
59340 886905 905232 921572 934443 943217 948110 949442 947217 941311 931903 919655 905306 889123 871063
59327 871063 851659 832284 814073 796977 780418 764578 750277 737749 726407 715915 706690 699077
59315 699077 692788 687576 683859 682094 681865 682144 682306 682535 683316 684828 686909 689462 692838 697658 704182
59300 704182 712111 721223 731902 744588 758942 774021 788868 802158 811538 814591 810843 802079 790512
59287 790512 777532 764487 753366 745657 741146 738727 737962 739110 742097 746473 752278 760113 770305
59274 770305 782588 796667 812580 830369 849728 869995 890237 909461 927051 942902 956898
59263 956898 968428 976698 981264 981895 978261 970282 958702 944772 929400 912957 895854 878794 862407
59250 862407 846949 832463 818989 806612 795540 786156 778791 773436 769836 767797 767185 767742 769113
59237 769113 771077 773593 776699 780479 784951 789724 793844 796172 795978 793158 788000 780806 771617 760294
59223 760294 747012 732606 718122 704105 690683 678262 667501 658409 650150 642128 634765 628785
59211 628785 624208 620493 617241 614272 611397 608677 606656 605755 605688 605932 606534 607898 610047 612676 615728
59196 615728 619303 623087 626430 628958 630799 632331 634072 636488 639431 642098 644125 646377 649897 654414
59182 654414 658780 662736 667182 672663 678627 684564 690940 698425 706834 715458 724009 732801 742274 752726
59168 752726 764166 776104 787797 798992 810074 821211 831731 840775 848208 854396 859326 862485
59156 862485 863504 862463 859550 854866 848612 841137 832652 823219 813199 803385 794366 785851 776971 767286
59142 767286 757257 747614 738595 730071 722182 715384 709868 705349 701534 698489 696361 695143 694925 696041
59128 696041 698646 702399 706861 712038 718226 725585 734155 744132 755774 769177 784377 801391 819835
59115 819835 838794 857547 876228 895228 914099 931573 946598 958889 968583 976010 981853 986838
59103 986838 991015 993747 994604 993810 991614 987715 981725 973916 965168 956314 947758 939601 931914 924890 918810
59088 918810 913747 909321 904929 900226 895176 889576 882816 874268 863793 851747 838669 825087 811535
59075 811535 798567 786628 775883 766171 757264 749150 741865 735015 727778 719670 711140 703181 696490
59062 696490 691181 687027 683613 680445 677302 674402 671894 669323 666032 662010 657913 654287 651157 648353
59048 648353 645810 643490 641409 639823 639079 639147 639569 639924 640136 640423 641167 642743 645116 647739 650227 653013
59032 653013 656802 661534 666511 671619 677689 685380 694347 703934 714142 725383 737589 750200 762863
59019 762863 775594 788175 799845 809807 817807 824009 828402 830603 830338 828023 824691 821323 818403 816063
59005 816063 814422 813639 813902 815525 818894 824091 830796 838630 847341 856414 864885 871971 877725 882642 886801
58990 886801 889710 890906 890350 888325 885267 881488 876817 870730 863251 855393 848326 842427 837667 834511
58976 834511 833634 834956 837775 841888 847789 855769 865572 877074 890563 906105 923274 941710 961254
58963 961254 981281 1000551 1018094 1033746 1047491 1058774 1066816 1071100 1071191 1066498 1056702 1042276 1024329
58950 1024329 1004154 982987 961798 941040 920800 901310 883045 866290 851051 837471 825889
58939 825889 816389 808710 802686 798283 795093 792325 789526 786799 784175 781307 778003 774480 770831 766768
58925 766768 762217 757639 753462 749720 746500 744098 742363 740544 738364 736719 736647 738029 739959 742088 744942
58910 744942 749071 754478 760864 767934 775479 783518 792381 802434 813815 826522 840538 855611 871193
58897 871193 886844 902484 918083 933465 948667 964143 980343 997490 1016075 1037111 1061261
58886 1061261 1087887 1115342 1142002 1166663 1188310 1206079 1219440 1228008 1231268 1228879 1221138 1208739
58874 1208739 1192120 1171416 1147050 1120030 1091600 1062874 1034872 1008636 985053 964471 946460
58863 946460 930123 914832 900649 887854 876208 865088 854291 844213 835170 826960 819206 811684
58851 811684 804147 796375 788624 781512 775168 769025 762806 757095 752370 747962 742723 736503 730241 724591
58837 724591 719097 712930 706005 699120 693137 688263 684200 680827 678432 677070 676070 674704 673245 672730
58823 672730 673644 675460 677596 680143 683385 687316 692010 697813 704576 711160 716324 719787 722015 723331
58809 723331 723766 723477 722752 721779 720775 720086 719715 718987 717151 714208 710830 707591 704520 701286 697559 693392
58793 693392 689303 685770 682627 679427 676416 674511 674110 674686 675842 678019 681633 686213 691036 696099 701768
58778 701768 707892 713823 718959 722788 724903 725511 725331 724414 721667 716348 709432 702631 696502 690459 684226
58763 684226 678153 672323 666480 661007 657069 655505 656094 657951 660206 662415 664817 668058 672180 676268
58749 676268 679684 683221 688113 694276 700605 706857 714084 723037 733263 744152 755834 768438 781169
58736 781169 792851 803073 812380 821569 831104 840910 850377 858618 864935 869051 870963 870789 868703 864872
58722 864872 859510 853086 846248 839409 832713 826564 821753 818667 816803 815497 814651 814275 813806 812580 810644
58707 810644 808373 805643 802034 797502 792047 785066 775948 765033 753101 740183 725960 711163 697305
58694 697305 684890 673047 661266 650373 641294 633826 627353 621935 617864 614592 610908 606111 600546
58681 600546 595084 590396 586662 583690 581227 579154 577457 576247 575971 577234 580071 583754 587769 592680
58667 592680 599379 607749 616834 626230 636458 647826 659547 670204 678571 683988 686476 686630 685010
58654 685010 681694 676829 671360 666454 662235 657873 652954 648005 643500 639205 634830 630698 627413 625329
58640 625329 624615 625328 627075 629050 630749 632404 634521 637237 640235 642961 644808 645365 644611 642811 640390
58625 640390 638104 636931 637306 638670 640263 642135 644860 648634 653353 659385 667412 677503 688986 701182
58611 701182 713572 725371 735808 744880 753086 760339 765822 769020 770279 770310 769744 769074 768261 766466 762997
58596 762997 758605 755037 753213 752586 752373 752570 753621 755898 759837 765912 774275 784895 797962 813445
58582 813445 830300 846969 862716 877686 891675 903789 913420 920675 925715 928620 930094 931408 933425
58569 933425 936491 941289 948768 959097 971772 986922 1005314 1026781 1049860 1073455 1097601 1121985
58557 1121985 1144912 1164566 1180343 1192194 1199679 1202646 1202080 1199300 1194761 1188421 1180803 1172914 1165424
58544 1165424 1158401 1151427 1143498 1133296 1120048 1103838 1084902 1063292 1039557 1014990 990733 967266
58532 967266 945156 925522 909103 895419 883487 872957 864154 857456 853007 850508 849013 847477 845846
58519 845846 845048 845696 847465 849919 853065 856686 859985 862493 864643 866981 869459 871946 874745 878062 881563
58504 881563 884940 888368 892042 895824 899619 903391 906545 908066 907644 906005 903861 901291 898404 895685
58490 895685 893393 891480 890364 890860 893093 896576 901574 909151 919438 931275 944165 959212 977224
58477 977224 997079 1016829 1035320 1051822 1065236 1074724 1080263 1081760 1078648 1071267 1061576 1051488 1041385
58464 1041385 1031160 1021552 1013349 1006353 1000390 996423 995388 996822 999918 1005136 1013355 1024049 1035581
58451 1035581 1046776 1056964 1065037 1069817 1071051 1069013 1063589 1054797 1043777 1032172 1020855 1010127
58439 1010127 1000627 993069 987558 984054 983006 984645 988268 993033 998826 1005542 1012445 1019284 1027188 1037263
58425 1037263 1049087 1061732 1075335 1090202 1105059 1117755 1127211 1133292 1135408 1132962 1127026 1119966
58413 1119966 1113290 1106955 1100613 1094280 1087829 1080987 1073955 1067236 1060973 1055260 1050799 1048348 1047705 1048032
58399 1048032 1048917 1050487 1052832 1056029 1060289 1065464 1070981 1076724 1083159 1089980 1095712 1099510 1102260 1104856
58385 1104856 1106590 1106555 1105575 1105265 1106004 1107200 1108831 1111322 1114684 1119035 1125186 1133378 1142371 1151192 1160778
58370 1160778 1172331 1185083 1197492 1209747 1223193 1238011 1253480 1269907 1288235 1307992 1327523
58359 1327523 1346020 1363706 1380310 1394963 1407318 1417344 1424511 1428697 1431249 1433562 1435314 1435774 1436036
58346 1436036 1438009 1441943 1446955 1453296 1461953 1472621 1484310 1497513 1513489 1531729 1550482 1569514
58334 1569514 1590062 1612267 1634930 1657700 1681083 1704259 1725202 1743168 1758947 1772563 1782940
58323 1782940 1790078 1795515 1800371 1804838 1809626 1815893 1823533 1831459 1839690 1849365 1860745 1873149 1886758
58310 1886758 1902427 1919766 1937500 1955710 1975703 1997696 2020687 2044504 2069828 2096243 2122409
58299 2122409 2148132 2174167 2200216 2225415 2250562 2277429 2305955 2334559 2363111 2393100 2424885
58288 2424885 2457365 2490428 2525204 2561778 2599085 2637094 2676737 2717863 2759723 2803133 2849388
58277 2849388 2897469 2945358 2993804 3045536 3100860 3157510 3214900 3275017 3338661 3404288 3471174
58266 3471174 3540547 3613070 3688205 3766437 3848997 3935124 4022655 4111358 4202395 4294589 4384921
58255 4384921 4472906 4560868 4649932 4739573 4831101 4927379 5028882 5134142 5244136 5361835
58245 5361835 5487448 5618846 5756768 5904497 6062158 6226783 6398539 6581249 6776009
58236 6776009 6980153 7193557 7419914 7660451 7912564 8176284 8455930 8753698 9067955
58227 9067955 9399708 9754285 10134492 10538698 10967933 11428319 11924447 12457338 13031122
58218 13031122 13654341 14332309 15065924 15860540 16727922 17677173 18713003 19846144 21096195
58209 21096195 22481274 24015673 25722167 27636504 29796710 32241487 35025807 38227493
58201 38227493 41936335 46255436 51324016 57326179 64472226 72992205 83158421 95289514
58193 95289514 109712077 126738335 146702028 169979329 196880358 227375912 260696900
58186 260696900 294903404 326685504 351797283 366266550 367875267 357007284 336335049
58179 336335049 309634321 280483331 251431726 223799632 197975018 173935682 151675116
58172 151675116 131334833 113103090 97085909 83265284 71512535 61611088 53297542
58165 53297542 46318311 40459880 35539417 31393582 27887048 24916501 22395776 20245337
58157 20245337 18399420 16810193 15436820 14238259 13180817 12243042 11407238 10653360
58149 10653360 9965339 9335717 8759367 8228820 7739139 7290573 6882285 6508916 6166203
58140 6166203 5854233 5572150 5315078 5078834 4862222 4662214 4472399 4288953 4113166
58131 4113166 3945864 3784600 3628606 3481086 3343833 3214466 3091467 2976958 2871849
58122 2871849 2773128 2678778 2590736 2510058 2433743 2359497 2289466 2225977 2167335 2110976 2057311
58111 2057311 2007338 1959699 1913096 1868678 1827244 1786888 1746050 1706122 1668462 1631555 1593700
58100 1593700 1555901 1519549 1483783 1447712 1413006 1381649 1353125 1326107 1301071 1279026 1259411
58089 1259411 1241338 1225280 1211728 1199698 1188096 1176925 1165866 1153508 1139320 1124414 1109228
58078 1109228 1092580 1074260 1056274 1040042 1024522 1008549 992792 977938 963169 948085 934018
58067 934018 921851 910565 899432 889538 881606 874466 867248 860908 855905 850629 843973 837335 832124
58054 832124 827241 821038 813898 806900 799708 791773 784033 777481 771612 766039 761941 760021 758656 756027
58040 756027 752498 749036 744993 739631 734321 730887 728883 726564 723441 719885 715399 709437 702989 697337
58026 697337 692060 686133 680098 675214 671272 667160 662976 659779 657764 656289 655110 654179 652860 650868
58012 650868 649270 649176 650111 651015 651993 653653 655545 656825 657739 659021 660489 661645 662971 665230 668158 671102
57996 671102 674179 677490 680094 681241 681894 683560 686307 689293 692502 696428 700687 704470 707849 711299
57982 711299 714501 716942 719048 721349 723124 723238 721768 719547 716778 713430 710246 707873 705592 702367
57968 702367 698625 695567 693310 691206 689383 688354 687520 685734 683137 680945 679536 678120 676178 673933
57954 673933 671574 669175 667266 666344 666020 665608 665303 665786 667098 668922 671527 675368 680188 685588 691939
57939 691939 699600 707825 715724 723786 733155 743837 754910 766046 777438 788561 798377 806533 813140
57926 813140 817653 819239 818085 815175 810964 805284 798165 789698 779593 767990 756229 745591 735806
57913 735806 725971 716287 707568 699780 692673 687191 684456 683768 683425 683215 684189 686216 687748 688153 688320 688660
57897 688660 688344 686974 685407 684429 684008 684241 685677 688245 691180 694349 698367 703060 707234 710404 713400
57882 713400 716697 719527 721387 723196 726026 729515 732375 733899 734400 734687 735475 736856 738145 738792 739387
57867 739387 741101 744206 748055 752442 757869 764307 770749 776405 781539 786920 793210 800977 810360 820479
57853 820479 829987 838374 846068 853307 859829 865608 870861 875234 877993 879179 879616 879724 879277 878363 877481
57838 877481 876593 875175 873301 871633 870282 868870 867747 867767 868712 869392 869626 870627 872947 875585 877819 880474
57822 880474 884440 889177 893665 897819 902055 906399 910931 916213 922301 928067 932391 935363 937469 938352
57808 938352 937247 934096 929408 923568 917037 910690 905141 900221 895754 892267 890143 888667 886791 884450
57794 884450 882310 880662 879428 878980 879952 882241 884969 887528 890133 893300 897274 902013 907333 912936 918555
57779 918555 924179 930081 936605 943849 951470 958950 966307 974263 983240 992301 999695 1004442 1006922 1008067
57765 1008067 1008690 1009469 1010617 1011370 1010621 1008340 1005703 1003659 1002237 1001449 1001850 1003706 1006423 1009362 1012506
57750 1012506 1015880 1019097 1022125 1025776 1030752 1036656 1042495 1047712 1052273 1056354 1060445 1065204 1070622 1075817
57736 1075817 1080146 1083989 1087945 1091936 1095688 1099525 1103922 1108740 1113656 1118976 1125273 1132456 1139867 1147037
57722 1147037 1153754 1159687 1164657 1169178 1174035 1179278 1184103 1187843 1190734 1193614 1197039 1200696 1203660 1205361
57708 1205361 1206314 1207672 1210123 1213508 1217354 1221221 1224574 1227046 1229051 1231535 1234956 1239086 1243824 1249416
57694 1249416 1255674 1261921 1268067 1274875 1282700 1290792 1298396 1305691 1313103 1320547 1328105 1336668 1347067 1359255
57680 1359255 1373169 1389795 1410460 1435644 1465419 1500578 1542348 1591406 1648258 1714423 1792238
57669 1792238 1883382 1987872 2103483 2224363 2339729 2435092 2496237 2513672 2485645 2418966
57659 2418966 2326834 2223871 2121320 2025713 1940539 1867630 1807053 1757212 1716147 1682654 1656135
57648 1656135 1635996 1621550 1612046 1606458 1603414 1601639 1600455 1599958 1600789 1603554 1608188 1613974 1620299 1627059
57634 1627059 1634160 1641146 1647829 1654815 1662733 1671207 1679292 1686745 1694067 1701306 1707638 1712429 1716171 1720073
57620 1720073 1724952 1730671 1736416 1741510 1746136 1751168 1757142 1763605 1769819 1775831 1782351 1789766 1797801 1806047
57606 1806047 1814250 1822057 1829074 1835404 1841769 1848906 1857007 1865730 1874501 1882756 1890154 1896693 1902580 1908040
57592 1908040 1913330 1918702 1924219 1929751 1935346 1941358 1948013 1955128 1962453 1970037 1977914 1985798 1993454 2001162
57578 2001162 2009418 2018261 2027175 2035580 2043286 2050675 2058535 2067372 2076770 2085935 2094999 2105052 2116499
57565 2116499 2128185 2138829 2148660 2158743 2169259 2179502 2189375 2199736 2211204 2223457 2235918 2248429
57553 2248429 2261049 2273712 2286323 2298877 2311453 2324340 2337964 2352277 2366528 2380161 2393645
57542 2393645 2407747 2422302 2436573 2450677 2465624 2481770 2498145 2513671 2528307 2542610 2556730
57531 2556730 2570403 2583577 2596629 2610076 2624215 2638889 2653531 2667704 2681624 2695976 2711228
57520 2711228 2727396 2744261 2761461 2778531 2795319 2812274 2829873 2847828 2865371 2882245 2898864
57509 2898864 2915581 2932388 2949329 2966529 2983743 3000442 3016517 3032364 3048166 3063608 3078446
57498 3078446 3092829 3106895 3120601 3134191 3148329 3163489 3179513 3195919 3212292 3228352 3244155
57487 3244155 3260323 3277577 3295807 3314067 3331628 3348534 3365055 3381214 3397261 3413947 3431763
57476 3431763 3450249 3468513 3486254 3503900 3521979 3540725 3560085 3579781 3599479 3619207 3639467
57465 3639467 3660664 3682513 3704261 3725472 3746428 3767787 3789976 3812870 3835963 3858852 3881542
57454 3881542 3904226 3926934 3949620 3972508 3996013 4020243 4044840 4069437 4094019 4118736 4143541
57443 4143541 4168223 4192711 4217249 4242238 4267873 4293958 4320168 4346491 4373219 4400407 4427639
57432 4427639 4454530 4481145 4507709 4534182 4560464 4586703 4613035 4639294 4665402 4691750 4718687
57421 4718687 4745899 4772839 4799541 4826388 4853284 4879778 4905970 4932520 4959724 4987272 5014978
57410 5014978 5043109 5071816 5100891 5130179 5159632 5188788 5216973 5244302 5271835 5300346 5329420
57399 5329420 5358153 5386283 5414306 5442810 5472051 5501873 5531783 5561362 5590710 5620204 5649765
57388 5649765 5678889 5707500 5736270 5765851 5796308 5827530 5859613 5892454 5925406 5957782 5989449
57377 5989449 6020660 6051677 6082818 6114427 6146465 6178416 6209904 6241024 6271917 6302559 6333316
57366 6333316 6365132 6398532 6432751 6466494 6499362 6532022 6565114 6598556 6631881 6664770 6697156
57355 6697156 6729199 6761311 6793973 6827372 6861327 6895532 6929771 6963895 6997725 7031096 7063977
57344 7063977 7096573 7129229 7162155 7195307 7228626 7262196 7295998 7329684 7362974 7396145 7429754
57333 7429754 7463900 7498115 7532031 7565710 7599274 7632575 7665404 7697758 7729853 7762091 7794953
57322 7794953 7828553 7862351 7895757 7928934 7962565 7996855 8031358 8065786 8100329 8135049 8169592
57311 8169592 8203754 8237751 8271698 8305431 8339081 8373194 8407902 8442558 8476659 8510573 8544893
57300 8544893 8579581 8614333 8649337 8685023 8721254 8757355 8792805 8827477 8861423 8894925 8928657
57289 8928657 8963297 8998943 9035235 9071969 9109254 9147030 9184755 9221712 9257573 9292627 9327433
57278 9327433 9362149 9396292 9429362 9461614 9493916 9526907 9560697 9595334 9630988 9667451 9703938
57267 9703938 9739666 9774264 9807400 9838442 9866895 9893150 9918886 9947083 9981463 10024927 10077775
57256 10077775 10137396 10199843 10261558 10319975 10373542 10421859 10465456 10505006 10540973 10574170 10606067
57245 10606067 10638064 10670716 10703915 10737428 10770904 10803634 10834628 10862824 10887196 10907152 10922990
57234 10922990 10935535 10945182 10951764 10955438 10956943 10956684 10954282 10949515 10943138 10936298 10929602 10923212 10917335 10912131
57220 10912131 10907641 10904283 10902932 10903927 10906493 10909740 10913813 10919383 10926370 10933878 10941198 10948170 10954602 10959961
57206 10959961 10963827 10966389 10968414 10970790 10973873 10977153 10979732 10981176 10981615 10981003 10978816 10974657 10968746 10961613
57192 10961613 10953569 10944457 10933597 10920103 10903721 10885111 10864763 10842121 10816666 10789267 10761152
57181 10761152 10732014 10700860 10668480 10637059 10607247 10577719 10547896 10518816 10490797 10462697 10433878
57170 10433878 10403715 10368257 10321616 10263249 10199860 10136430 10069526 9995583 9923336 9869990 9843295
57159 9843295 9832964 9821950 9801329 9771533 9734352 9689470 9637206 9579666 9518409 9453386 9384384
57148 9384384 9311674 9235096 9153874 9067423 8975498 8877938 8775204 8668766 8560086 8449640
57138 8449640 8337695 8225461 8114647 8006458 7901944 7802781 7710703 7626364 7549330 7478636
57128 7478636 7412638 7348831 7284612 7218009 7147329 7070955 6988466 6901735 6814407 6730750 6655193
57117 6655193 6591759 6542530 6506841 6482721 6468956 6465444 6472639 6491919 6526466 6580987 6660778 6771431
57105 6771431 6918916 7109304 7349120 7647145 8016220 8473689 9041710 9748728 10630485
57096 10630485 11728897 13090199 14764267 16803468 19258837 22175302 25588877 29524761
57088 29524761 33993208 38983492 44457771 50342749 56516641 62797379 68944007 74675321
57080 74675321 79696980 83727958 86527672 87928086 87864258 86387578 83652332 79881657
57072 79881657 75327387 70235465 64822672 59266596 53707775 48258872 43013831 38052541
57064 38052541 33440786 29227677 25442781 22094879 19173667 16654074 14501225 12674481
57056 12674481 11130771 9827920 8727436 7795759 7004229 6328778 5749600 5250382 4817461
57047 4817461 4439636 4108206 3816307 3557898 3327581 3121152 2935615 2768487 2617523
57038 2617523 2481081 2358091 2247439 2147908 2058794 1979999 1911317 1852260 1802901 1764289 1737629
57027 1737629 1723574 1722941 1737816 1771076 1823611 1890482 1958590 2008861 2023451 1993652 1922554 1821287
57015 1821287 1703311 1580817 1463064 1355330 1259168 1174320 1100295 1036117 979878 929840
57005 929840 885600 847353 814467 785671 760247 738013 718323 700032 682387 665261 648633
56994 648633 632563 617613 604534 593565 584616 578001 574304 573599 575514 579953 586992 595876 604697
56981 604697 611228 613684 610839 602169 588228 570593 551236 531974 514129 498190 483888 471021
56969 471021 460048 451554 445424 441181 438924 439231 442243 447567 455106 465317 478520 494382 512000
56956 512000 529823 545405 555946 559478 555385 543992 526390 504756 482045 460692 441694 425022
56944 425022 410543 398339 388472 380893 375641 373120 374075 379040 387702 399168 413134 430407 451717
56931 451717 476143 501110 523547 540433 548667 545839 531850 509386 482395 454152 426565 400495
56919 400495 376187 353663 333079 314695 298563 284539 272666 263199 256097 250691 245950 241027
56907 241027 235735 230775 227327 225972 226021 226226 226099 226149 226955 228528 230590 232988 235671 238729 242669 248316
56891 248316 256246 266484 278785 292879 308381 324667 340918 356034 368522 376769 379635 376874
56879 376874 369263 358565 347012 336301 327040 319296 313382 309742 308441 309366 312746 318908 327735 339115
56865 339115 353850 373351 398299 428132 461833 498387 536109 572067 602502 623695 632734 628470
56853 628470 612331 587850 559033 529200 500987 476458 456735 441994 432258 427857 428936 435081
56841 435081 445953 462055 484519 514273 551577 596093 647020 703077 762157 820481 871976
56830 871976 909169 925724 918946 890597 845908 791662 734250 678409 627078 581921 543733 512603
56818 512603 488216 470243 458429 452595 452871 459758 473555 493974 520582 553216 591203 632297
56806 632297 672913 709099 736583 750579 747329 726627 692190 649278 602610 556285 513902 477421
56794 477421 446507 419960 397509 379702 366603 357500 351755 349324 350548 355868 365628 379737 397587
56781 397587 418301 440557 461820 478252 486115 483397 470225 448324 420479 389933 359423 330619
56769 330619 304478 281688 262375 245825 231141 218096 206985 197833 190100 183131 176633 170795
56757 170795 166096 162819 160627 158852 157166 155606 153937 151635 148733 146070 144351 143447 142926 142661 142519
56742 142519 142053 141098 140189 139829 139812 139806 140051 140790 141479 141417 140784 140280 140057 139863 140031 141234 143225 144788 145236
56723 145236 145241 145876 147388 149212 150685 151449 151561 151473 151689 152336 153256 154421 155831 157068 157564 157447 157601 158660
56705 158660 160381 162215 163975 165607 166743 166934 166190 164920 163509 162264 161544 161492 161617 161104 159705 158109
56689 158109 157249 157381 157972 158354 158304 158046 157934 158162 158581 158732 158232 157242 156413 156243 156664 157364 158176 158892 159037
56670 159037 158356 157429 157203 157809 158371 158146 157448 157123 157542 158449 159570 160920 162536 164179 165441 166128 166505
56653 166505 167095 168119 169273 170166 170825 171494 172162 172663 173096 173698 174401 175012 175722 176853 178143 178925 179089
56636 179089 179162 179361 179344 179098 179254 180111 181099 181711 182284 183241 184165 184357 183913 183511 183399 183252 182906 182640 182780
56617 182780 183437 184556 185944 187353 188780 190448 192288 193745 194346 194196 193745 193432 193686 194710 196015 196792
56601 196792 197065 197775 199276 200522 200424 199333 198318 197558 196391 194620 192774 191261 190113 189458 189437 189699
56585 189699 189697 189399 189072 188504 187212 185372 183852 183295 183726 184969 186716 188276 189023 189188 189627 190801 192602
56568 192602 195066 198410 202257 205719 208603 211876 216528 222533 229313 236745 245140 254383 263534 271338
56554 271338 277052 280837 283393 285240 286468 287134 287560 288003 288352 288416 288260 287943 287285 286240 285144 284161 282878
56537 282878 280887 278426 275893 273146 269876 266210 262255 257550 251895 246330 242219 239480 236755 233333
56523 233333 229897 227278 225471 224051 222653 220780 218013 214732 211854 209607 207358 204930 203204 202900
56509 202900 203503 203961 203907 203658 203472 203317 203120 202829 202452 202190 202211 202182 201514 200247 199184 198879 198982 198862 198461
56490 198461 198219 198514 199421 200709 201879 202528 202841 203409 204476 205733 206872 207849 208474 208300 207219 205792
56474 205792 204778 204608 205304 206484 207423 207660 207635 208213 209470 210583 210973 210920 210912 211130 211813 213314 215383 217105
56456 217105 218049 218841 220053 221159 221276 220482 219597 218960 218185 217087 216180 216134 217138 218845 220612 221712 221684
56439 221684 220749 219834 219957 221367 223237 224387 224387 223793 223244 222725 222066 221669 222047 222816 222896 221803 220292 219613
56421 219613 220516 222865 225670 227597 228024 227623 227458 227703 227908 228238 229449 231595 233659 234711 234640 233681 232145
56404 232145 230837 230713 231626 232259 231821 231065 231158 232262 233802 235422 237021 238373 239402 240471 241896 243470
56388 243470 244867 246153 247522 248910 250198 251451 252708 253955 255466 257590 259995 261726 262351 262474 262892
56373 262892 263890 265601 268204 271253 273553 274346 274133 273861 273897 274224 274952 276040 277037 277722 278508 279703 280908
56356 280908 281645 282063 282533 283084 283757 284895 286495 287850 288437 288680 289274 290310 291575 293072 294647 295757
56340 295757 296350 297381 299653 302667 305404 307709 310076 312535 314662 316388 317975 319514 321214 323799
56326 323799 327691 331999 335213 336842 337717 338851 340663 343121 345884 348328 350020 351166 352201 353238
56312 353238 354334 355863 358004 360218 361906 363283 364964 367021 369184 371702 375239 380046 385855 392375
56298 392375 399246 405758 411259 415708 419279 421759 422991 423589 424462 425872 427697 430360 434591 440338 446685
56283 446685 452935 459195 465899 473328 481591 490597 500098 510083 520939 532797 545047 557012 568779
56270 568779 580922 593747 607436 622489 639328 657770 677525 698906 722378 747780 774749
56259 774749 803678 835559 871152 910963 955698 1006009 1062098 1124374 1194062 1272250 1358572
56248 1358572 1451741 1551153 1657084 1769469 1887404 2009653 2134603 2259697 2381837 2498451
56238 2498451 2607402 2705954 2790709 2858678 2907656 2935712 2941392 2924832 2887966 2833371 2763399
56227 2763399 2680412 2587054 2485922 2379342 2269483 2158253 2047106 1937404 1830883 1729178
56217 1729178 1632999 1542310 1457274 1378462 1306102 1239622 1178042 1120621 1067326 1018882 976003
56206 976003 938284 904266 872904 844382 819137 796916 777432 761062 747938 737060 727300 718634
56194 718634 711345 704695 697645 690455 684295 679589 675911 673110 671274 669858 668174 666574 665906 665988 665853
56179 665853 665344 665127 665296 665359 665563 666772 668859 670643 671719 673129 675920 680070 685093 690684 696539 702512
56163 702512 709123 717051 726156 735878 746458 758563 771792 784847 797297 809976 823577 838108
56151 838108 853892 871831 892367 915275 940697 969316 1001396 1036842 1076368 1121474 1173095
56140 1173095 1231458 1297387 1372502 1457846 1553341 1658369 1771228 1887534 2000665 2104621
56130 2104621 2196031 2273859 2338962 2394279 2443671 2489397 2531216 2567780 2597413 2617400 2624616
56119 2624616 2618258 2601188 2577816 2551152 2521831 2488451 2448002 2396991 2333213 2256426 2167794
56108 2167794 2069851 1967026 1864778 1767535 1678060 1598405 1529960 1472462 1424401 1384747 1353064
56097 1353064 1327972 1307251 1289910 1276631 1267726 1262080 1258572 1257061 1257507 1259572 1263563 1270319 1279529
56084 1279529 1289475 1298951 1308187 1317655 1327422 1338103 1350863 1365878 1382072 1398729 1415987 1433613
56072 1433613 1451043 1469022 1489425 1512811 1537738 1562944 1588572 1614818 1641144 1667426 1694189
56061 1694189 1721198 1747422 1772678 1797539 1821450 1843065 1862748 1882462 1902745 1922222 1940624
56050 1940624 1959710 1980377 2001561 2023044 2046633 2073240 2101286 2129523 2159128 2191534 2226396
56039 2226396 2263156 2302354 2343934 2386437 2429396 2474406 2522370 2571838 2621500 2672122 2724618
56028 2724618 2778521 2833825 2891920 2953121 3015645 3078652 3143905 3212807 3284320 3357479 3433390
56017 3433390 3513007 3595480 3680487 3769552 3863239 3959857 4058812 4162338 4271858 4385614 4502099
56006 4502099 4622812 4749362 4880931 5017093 5160044 5311513 5470480 5636434 5811675
55997 5811675 5997810 6193355 6397490 6612698 6840879 7080586 7331147 7595761 7877323
55988 7877323 8175224 8489698 8825121 9185291 9569670 9978227 10415642 10886641 11391912
55979 11391912 11933233 12517936 13153543 13842977 14590135 15405025 16298039 17274844 18343135
55970 18343135 19519104 20821418 22265477 23871117 25670248 27700478 29999692 32616923
55962 32616923 35623373 39107372 43171664 47950269 53621137 60392040 68486959 78161678
55954 78161678 89716944 103470791 119726688 138794337 161022906 186732451 215981973
55947 215981973 248197633 281737257 313596730 339643272 355643025 358764326 348681080
55940 348681080 327562367 299050836 266978607 234483245 203676400 175690655 150920692
55933 150920692 129329823 110699141 94752021 81192516 69726999 60081758 52001059
55926 52001059 45240570 39577807 34825618 30827575 27447367 24571363 22113753 20007590
55918 20007590 18192819 16617897 15245350 14045973 12990535 12053120 11217234 10470891
55910 10470891 9798929 9186304 8625065 8111459 7639137 7201085 6795117 6421376 6076566
55901 6076566 5755819 5457806 5182885 4928339 4690300 4468425 4264065 4075643 3900107
55892 3900107 3737056 3587096 3447849 3315784 3190598 3073889 2964957 2861720 2764507 2675301
55882 2675301 2594236 2520004 2452379 2390994 2332804 2274050 2213897 2153307 2091647 2027454 1961497
55871 1961497 1896055 1831973 1769101 1708634 1652244 1599649 1549550 1502102 1458107 1416846 1377082
55860 1377082 1339179 1303867 1270118 1236739 1204928 1176554 1150979 1126299 1102737 1081879 1063238
55849 1063238 1044504 1024914 1005653 987057 967958 947853 927499 907329 887240 867796 849749
55838 849749 832536 815097 797916 782425 768604 755083 741438 728600 717110 706673 697376 689646
55826 689646 683002 676345 669399 662574 655599 647668 638724 629296 619391 608861 598504 589422 581562 574165
55812 574165 567232 561227 555771 550146 544829 541144 539569 539657 541253 544475 548739 553138 557612 562575 567618
55797 567618 571635 573960 574410 572705 568887 563789 557968 550845 542056 532948 525407 519870 515808 513295
55783 513295 512347 511295 507754 501148 492731 483403 473111 462256 452055 443309 436127 430839 427905 426944
55769 426944 427058 428048 430108 432530 434010 434206 433770 432913 431107 428086 423957 418433 411143 402624 393852
55754 393852 384913 375226 364919 354863 345523 336901 329422 323617 319098 314920 310804 306942 302963 298361
55740 298361 293616 289593 286092 282338 278596 275803 273808 271551 268902 266808 265573 264482 263215 262115
55726 262115 260931 258801 255724 252692 250180 247835 245769 244644 244213 243224 241177 238861 236932 235268 234000
55711 234000 233656 233902 233617 232711 232392 233132 233907 234087 234512 235754 236738 236218 234483 232500 230389 227889 225499
55694 225499 223936 223047 222216 221369 220706 219978 218966 218319 219029 221219 224068 226747 228982 230930 232932 235175
55678 235175 237360 239072 240585 242717 245608 248268 249758 250213 250233 249853 248758 247122 245592 244587 244088
55663 244088 244002 244401 245377 246833 248382 249603 250626 252221 254889 258028 260587 262349 263850 265140 265518
55648 265518 264575 262532 259353 254468 247912 240927 234814 229672 224821 219930 215211 210866 206857 203086
55634 203086 199493 196160 193442 191650 190461 189074 187144 185218 184078 183939 184373 184666 184193 182831 181043
55619 181043 179284 177432 175208 172905 171036 169430 167482 165231 163322 161843 160172 158159 156515 155648
55605 155648 154946 153733 152197 150909 150017 149383 148952 148539 147777 146745 146177 146593 147604 148444 148799 148754 148332
55588 148332 147505 146402 145240 144285 143911 144300 144985 145250 145117 145441 146770 148680 150441 151823 153004 154221
55572 154221 155758 157778 159913 161526 162562 163623 165022 166378 167403 168387 169516 170301 170103 168785 166572
55557 166572 163795 161075 159145 158047 156951 155193 153108 151568 151133 151894 153559 155385 156542 156983 157501
55542 157501 158669 160227 161757 163316 164981 166401 167298 167974 168837 169860 170868 171868 172703 172884 172210 171125
55526 171125 170046 168790 167062 164983 162754 160306 157741 155554 153922 152224 149841 147042 144572 142692
55512 142692 141116 139541 137879 136309 135393 135655 136643 137015 136029 134401 133189 132441 131653 130951 130933 131616 132360
55495 132360 132681 132485 131688 130324 128911 128088 127913 127998 128187 128614 129178 129446 129081 128037 126526 125154 124842
55478 124842 126101 128413 130627 131858 131837 130720 128949 127040 125183 123282 121540 120527 120361 120362 119997 119581
55462 119581 119534 119565 119365 119528 120767 122559 123606 123564 123310 123414 123321 122383 120904 119712 119226 119295 119583 119776 119729
55443 119729 119664 120013 120883 121884 122558 122741 122481 121941 121560 121995 123580 125896 127986 128986 128560 126917 124599
55426 124599 122230 120359 119349 119316 120144 121589 123271 124590 124947 124335 123534 123343 123771 124320 124901 125883 127245
55409 127245 128379 128866 128874 128573 127742 126315 124783 123677 123013 122526 122061 121482 120663 119816 119397 119429 119415 119137 118963
55390 118963 119041 118867 118081 117067 116256 115497 114691 114460 115409 117210 119098 120829 122421 123447 123506 123106 123160 123705
55372 123705 123912 123291 122148 120884 119589 118390 117573 117197 117018 116875 116786 116741 116751 116970 117410 117679 117388 116633
55354 116633 115681 114530 113225 112318 112382 113217 114124 114764 115243 115593 115821 116283 117293 118395 118674 117790 116183
55337 116183 114390 112764 111808 112068 113493 115348 116815 117384 116886 115705 114859 115160 116212 116804 116403 115759
55321 115759 115922 117053 118382 119056 118967 118831 119335 120143 120185 119154 118146 118221 118944 119126 118560 118017 117774 117290
55303 117290 116383 115725 115875 116631 117633 118867 120290 121548 122383 122798 122628 121526 119680 118035 117461 117953
55287 117953 118824 119379 119322 118866 118534 118579 118652 118351 117952 118065 118691 119215 119289 119138 119001 118935 119158 119909 120804 121027
55267 121027 120404 119645 119344 119351 119433 119891 121005 122332 123094 123114 122959 123211 123807 124109 123604 122566 121826 121781 121939
55248 121939 121752 121504 121840 122715 123494 123859 123970 123864 123461 123073 123117 123360 123255 123028 123488 124600 125215 124545 123095
55229 123095 121709 120548 119530 119064 119596 120799 121791 121982 121419 120571 120033 120170 120817 121532 122185 122959 123813
55212 123813 124418 124648 124630 124293 123486 122570 122233 122590 123125 123564 124105 124657 124766 124510 124589 125149 125418 125007 124665
55193 124665 125115 125886 126029 125404 124541 123774 123229 123268 124155 125502 126581 126978 126581 125369 123720 122448 121925
55176 121925 121530 120521 119172 118422 118664 119443 120144 120463 120347 120014 119967 120587 121803 123362 125110 126722 127569
55159 127569 127380 126824 126915 127969 129493 130900 131917 132503 132763 132905 132994 132847 132319 131510 130539 129431 128423
55142 128423 128030 128540 129696 131003 132033 132384 131861 130887 130214 130049 130018 130119 130811 131881 132179 131132 129700
55125 129700 129033 128959 128652 128109 127894 127943 127797 127696 128276 129300 129787 129493 129272 129820 130947 132236 133545 134566
55107 134566 134696 133780 132466 131508 131179 131558 132867 135107 137751 140154 142085 143666 145006 146034 146533 146238
55091 146238 145147 143825 143181 143729 145150 146594 147384 147477 147313 147205 146973 146354 145639 145463 145917 146388 146524 146775
55073 146775 147546 148338 148323 147487 146578 146087 145818 145370 144577 143527 142534 142011 142078 142413 142718 143078 143556 143813 143522
55054 143522 142852 142133 141421 140801 140689 141252 141921 142108 142051 142308 142774 142964 142914 142970 142971 142510 141872 141737 142045 142092 141807
55033 141807 141933 142774 143675 144078 144243 144506 144566 144026 143159 142614 142628 142853 142713 141810 140261 138728 137790 137333 136941
55014 136941 136740 137252 138484 139862 141116 142448 143640 143796 142354 139811 137115 134929 133736 133981 135508
54999 135508 137351 138621 139308 139862 140338 140471 140294 140186 140405 140977 141924 143292 144917 146366 147193 147266 146888
54982 146888 146580 146648 147109 148101 149951 152479 154669 155708 156092 156893 158061 158439 157564 156453 156230 156851 157729
54965 157729 158730 159834 160462 160093 159220 158895 159415 160102 160321 160082 159617 158875 157666 156035 154404 153372 153317
54948 153317 154052 154967 155630 156128 156778 157701 158741 159539 159657 158945 157943 157589 158329 159798 161482 163315 165400
54931 165400 167622 169918 172687 176534 181679 187843 194584 201679 209376 218343 229051 241089 253364
54918 253364 265022 275705 284876 291512 294840 294874 291947 286214 278063 268413 258033 246970 235259
54905 235259 223837 213994 206109 199564 193805 188776 184417 180480 177086 174861 174177 174627 175470 176329 177264
54890 177264 178436 179948 181880 184300 187246 190734 194715 199070 203787 209171 215726 223729 232951 242818
54876 242818 252845 262844 272585 281243 287388 289929 289008 285643 280485 273312 263844 252586 240602 228815
54862 228815 217853 208222 200139 193358 187512 182562 178610 175436 172556 169700 166909 164245 161691 159315
54848 159315 157268 155544 153949 152303 150585 148905 147416 146210 145237 144388 143687 143240 143029 142946 143051 143521
54832 143521 144322 145205 146051 146875 147458 147474 147079 146827 146803 146434 145538 144892 145191 145956 146214 145905 145818 146342 147079 147684
54812 147684 148334 149260 150363 151494 152655 153769 154658 155370 156105 156793 157113 157057 157058 157445 158103 158808 159532 160224
54794 160224 160633 160601 160362 160351 160731 161227 161373 160986 160424 160320 160916 161818 162552 163123 163842 164874 166325 168519
54776 168519 171730 175788 180401 185681 191864 198657 205579 212903 221546 231869 243216 254817 266421
54763 266421 277688 287659 295358 300492 303022 302513 298526 291442 282300 271931 260777 249462 238896
54750 238896 229625 221452 213897 206791 200375 195052 191199 188968 188064 187799 187496 186885 186077 185310 184723 184376
54734 184376 184350 184829 186094 188388 191749 195894 200319 204677 209151 214362 220820 228543 237288 246915 257186
54719 257186 267260 275742 281468 284095 283928 281384 276686 269878 261047 250742 240186 230671 222519 214970
54705 214970 207376 200185 194354 190016 186399 183028 180335 178738 177622 175793 172812 169421 166659 164938
54691 164938 164007 163425 162854 162131 161307 160532 159789 158897 157921 157366 157685 158723 159879 160710 161078 160818 159718 157939
54673 157939 156091 154750 154085 154006 154308 154578 154345 153587 152794 152339 152108 151997 152317 153251 154246 154473 153812 152904
54655 152904 152355 152355 152957 154175 155719 157098 158089 158793 159198 159144 158742 158392 158228 158034 157856 158224 159440 161010
54637 161010 162144 162575 162557 162313 161855 161227 160587 160060 159699 159509 159296 158698 157614 156571 156315 156980 157846 158014
54619 158014 157273 156292 155997 156716 157936 158885 159285 159416 159533 159569 159432 159287 159390 159856 160687 161737 162500 162352
54601 162352 161266 159979 159122 158534 157873 157530 158214 159732 160945 161112 160678 160461 160594 160675 160514 160250 159919 159401
54583 159401 158726 158071 157514 157066 156915 157308 158191 159197 159995 160415 160327 159714 158911 158467 158645 159252 159903 160217 159808
54564 159808 158601 157245 156728 157271 158043 158336 158587 159697 161709 163821 165519 166902 167882 167931 166924 165487
54548 165487 164071 162321 159974 157862 157219 158185 159756 161132 162418 163908 165472 166954 168561 170401 172008
54533 172008 172874 173221 173771 174821 175947 176617 176705 176385 175919 175700 176150 177246 178332 178717 178458 178247 178536 179057
54515 179057 179319 179256 179099 178840 178213 177208 176205 175490 174908 174126 173048 171781 170446 169211 168308 167769 167292
54498 167292 166630 165966 165640 165615 165613 165686 166155 166872 167030 166066 164504 163479 163501 164041 164339 164276 164298 164772 165720 167092
54478 167092 168911 171022 172890 173869 173709 172727 171569 170860 170974 171919 173376 174945 176325 177247 177445 176987
54462 176987 176509 176716 177535 178087 177708 176747 176150 176453 177386 178280 178635 178381 177865 177537 177537 177639 177644 177645 177771 177870 177646
54441 177646 176973 175904 174573 173260 172329 171875 171616 171356 171314 171689 172121 172040 171431 170943 171237 172504 174485 176650
54423 176650 178434 179622 180407 180841 180529 179311 177972 177649 178544 179809 180695 181195 181516 181618 181525 181487 181498 181124
54405 181124 180243 179576 180045 181829 184260 186408 187575 187613 187155 187269 188426 189942 190752 190612 190285 190613 191673
54388 191673 192750 193017 192325 191399 191098 191424 191595 191154 190565 190409 190438 189912 188654 187256 186316 185849 185455 184762
54370 184762 183740 182807 182607 183399 184777 186176 187471 188801 189967 190509 190344 189883 189446 188931 188265 187821 188061
54353 188061 188949 189920 190414 190342 190050 189952 190163 190415 190337 189801 188984 188132 187312 186455 185624 185128 185252 185844 186383 186588
54333 186588 186737 187117 187396 187045 186315 186161 186965 187956 188258 187963 187668 187396 186780 186112 186303 187638 189229 190038
54315 190038 189943 189501 189097 188776 188661 189014 189874 191006 192298 193991 196334 199102 201636 203402 204435 205137
54299 205137 205786 206426 207207 208493 210478 212978 215868 219475 224108 229291 233907 237178 239165 240170 240067
54284 240067 238512 235550 231675 227378 222933 218609 214786 211686 209135 206742 204336 202121 200380 199096
54270 199096 197994 196952 196174 195847 195782 195593 195244 195146 195622 196428 197021 197304 197857 199278 201370 203174 203884 203612
54252 203612 203075 202723 202409 201885 201243 200714 200273 199698 198944 198223 197756 197583 197549 197392 196930 196314 195976 196136 196393
54233 196393 196041 194794 193081 191561 190518 189748 188995 188387 188368 189052 189750 189461 188021 186504 186162 187111 188404
54216 188404 189254 189717 190133 190405 190145 189236 187899 186350 184739 183338 182435 181982 181649 181412 181780 183158 185125
54199 185125 186750 187680 188507 189854 191468 192604 193082 193419 193963 194460 194647 194736 194955 195002 194451 193492 192776 192546
54181 192546 192356 191739 190854 190309 190504 191227 191814 191726 190994 190107 189409 188803 188123 187468 186930 186270 185336 184655 185045
54162 185045 186539 188093 188631 188080 187239 186901 187346 188449 189935 191453 192590 193004 192658 191976 191600 191846 192446
54145 192446 192990 193468 194112 194790 194970 194428 193687 193519 194135 194986 195236 194411 192760 191160 190503 191039 192276 193525
54127 193525 194396 194848 195086 195542 196664 198443 200261 201442 201883 201954 201914 201755 201583 201793 202611 203640 204219 204244
54109 204244 204400 205391 207090 208626 209265 209003 208352 207830 207730 208063 208509 208606 208170 207369 206298 204802 203005
54092 203005 201672 201489 202112 202451 201935 201027 200448 200384 200675 201237 201940 202388 202312 202050 202274 203284 204856 206729
54074 206729 208887 211226 213224 214235 214099 213341 212682 212451 212588 213093 214172 215817 217518 218726 219502 220413
54058 220413 221844 223707 225775 227917 229881 231279 232057 232814 234352 236988 240394 244009 247441 250603 253646
54043 253646 256806 260244 264024 268175 272715 277656 283083 289148 295863 302997 310399 318278 326862 335846
54029 335846 344520 352442 359646 366198 371934 376792 381007 384840 388451 392072 395842 399166 400764 399801
54015 399801 396795 393099 389674 386550 383186 378947 373441 366794 359572 352277 345040 337952 331330 325391
54001 325391 319971 314872 310179 305871 301527 296948 292799 289962 288351 286963 285018 282481 279574 276464
53987 276464 273535 271280 269655 268065 266234 264575 263436 262531 261520 260648 260321 260397 260450 260496 260850 261361 261421
53970 261421 260870 260431 260938 262332 263754 264568 265082 266164 268248 270932 273602 276217 279228 282855 286887
53955 286887 291324 296822 304170 313521 324426 336603 350394 366444 384986 405282 425525 443293
53943 443293 456408 463595 464613 460144 451793 441906 432786 425739 420768 417190 414474 412640 412039 412853
53929 412853 414715 416873 418751 420305 421823 423600 425902 428957 432673 436611 440684 445680 452495 460834
53915 460834 469303 477086 484933 493985 504097 514048 523205 532087 541057 549187 554968 557830 558456 557718
53901 557718 555890 552982 549329 545438 541406 536829 531333 524954 517906 510221 501838 492851 483417 473444
53887 473444 462735 451583 440877 431313 422606 413808 404396 394840 386071 378622 372265 366211 359600
53874 359600 352149 344551 337992 333008 328970 324930 320804 317318 314824 312618 309691 305850 301802 298271
53860 298271 295390 292954 290839 288912 286777 284018 280742 277578 275020 272995 271248 269861 269065 268712 268325
53845 268325 267708 267174 267078 267409 267896 268194 267851 266463 264181 261820 260231 259692 260031 260980 262092 262627 262106
53828 262106 260951 260148 260224 260859 261553 262248 263213 264600 266326 268176 269874 271198 272138 272915 273851 275280 277429
53811 277429 280178 283048 285754 288726 292706 297815 303403 308902 314443 320408 326788 333298 339919 346958
53797 346958 354655 362881 371161 378783 385083 389888 393710 397346 401192 404944 407923 409756 410836 412085
53783 412085 414075 416425 418260 419178 419485 419553 419392 419023 418797 419133 420299 422697 427062 434097 444191 457625
53767 457625 474371 492998 510024 521132 523352 516088 500585 479157 454760 430272 407435 386567
53755 386567 367430 350128 335054 322385 311910 303267 296116 290185 285319 281431 278339 275734 273381
53742 273381 271260 269480 268158 267367 267057 266962 266772 266484 266488 267165 268407 269593 270091 269846 269519 269932 271325 273207
53724 273207 274924 276170 276900 277099 276928 276881 277357 278229 279124 280067 281370 282978 284413 285477 286565 288101
53708 288101 290091 292443 295294 298677 302216 305555 308834 312325 315803 318804 321505 324841 329518 335241
53694 335241 341119 346637 351953 357350 362683 367553 371885 376116 380693 385576 390477 395441 400702 405860
53680 405860 409685 411172 410485 408421 405155 400163 393387 385808 378566 372027 366008 360454 355411 350711
53666 350711 346308 342733 340533 339291 337883 335830 333778 332332 331072 329233 326923 324954 323679 322647
53652 322647 321462 320395 319944 320188 320802 321455 321970 322294 322494 322698 322991 323411 324061 324992 326000 326740 327090 327221
53634 327221 327347 327604 328172 329177 330450 331708 333020 334783 337145 339791 342407 344980 347497 349775 351816
53619 351816 353958 356394 358949 361654 365047 369443 374234 378488 382038 385452 389097 392849 396572 400314
53605 400314 403956 407242 410255 413369 416623 419581 421945 423926 425838 427673 429245 430399 430986 430979 430758
53590 430758 430872 431331 431551 431231 430820 430736 430511 429290 426985 424422 422361 420907 419916 419457 419476 419330 418138
53573 418138 415659 412562 409735 407513 405687 404049 402626 401477 400558 399870 399506 399439 399482 399563 399805 400233 400676
53556 400676 401131 401887 403037 404191 405012 405690 406455 406959 406775 406337 406658 408124 410242 412700 415892 420063
53540 420063 424564 428487 431710 434846 438464 442784 447922 453965 460827 468287 476165 484333 492739 501564
53526 501564 511168 521656 532691 543934 555455 567439 579699 591873 604065 616982 631353 647362
53514 647362 664654 682816 701854 722235 744373 768075 792677 817777 843599 870532 898554
53503 898554 927256 956255 985330 1014231 1042464 1069208 1093520 1114950 1134005 1151688 1168483
53492 1168483 1184155 1198672 1212763 1227106 1241429 1255029 1267982 1281225 1295474 1310570 1325943
53481 1325943 1341277 1356572 1371901 1387228 1402238 1416351 1429149 1440811 1451789 1461973 1470493
53470 1470493 1476495 1479833 1480799 1479411 1475323 1468410 1459175 1448456 1436817 1424388 1411254 1397798 1384490
53457 1384490 1371481 1358607 1345666 1332361 1318000 1301747 1283420 1263759 1243693 1223668 1203937
53446 1203937 1185000 1167250 1150379 1133738 1117227 1101457 1087077 1074330 1063259 1053854 1045924 1039165
53434 1039165 1033443 1028760 1025009 1022113 1020386 1020335 1022028 1025025 1029006 1034113 1040586 1048462 1057723 1068286
53420 1068286 1079737 1091546 1103880 1117842 1134478 1153708 1174408 1195354 1215979 1236574 1258036
53409 1258036 1281180 1306081 1332344 1360114 1390257 1423136 1457780 1492981 1528929 1567005 1608078
53398 1608078 1651768 1697400 1744741 1793436 1842553 1891395 1940417 1990639 2042343 2094833 2147404
53387 2147404 2199914 2252319 2304118 2354552 2403086 2449456 2493416 2534707 2573225 2609036 2642158
53376 2642158 2672349 2699158 2722171 2741259 2756549 2768158 2775966 2779672 2778978 2773587 2763097 2747018
53364 2747018 2724925 2696576 2662155 2622594 2579474 2534130 2486858 2437374 2386099 2334476 2283768
53353 2283768 2234061 2184957 2136850 2090870 2047587 2006326 1965861 1925327 1884382 1842953 1801192
53342 1801192 1759485 1718281 1677990 1639069 1601914 1566529 1532507 1499578 1468094 1438886 1412702
53331 1412702 1389736 1369487 1351023 1333598 1317045 1301406 1286223 1270625 1254229 1237580 1221478
53320 1221478 1206203 1191630 1177770 1164864 1153120 1142712 1133882 1126776 1121310 1117424 1115229 1114618 1114931
53307 1114931 1115443 1116088 1117395 1119847 1123733 1129525 1137788 1148508 1160936 1174377 1188887 1204930 1222544
53294 1222544 1241164 1260267 1279967 1300883 1323447 1347346 1371671 1395638 1419114 1442348 1465216
53283 1465216 1486875 1506310 1523203 1538186 1552123 1565189 1576707 1585821 1592139 1595687 1596555 1594890
53271 1594890 1591022 1585154 1577010 1566200 1552932 1537841 1521077 1502183 1481193 1459224 1437436 1415723
53259 1415723 1393052 1368843 1343497 1317642 1291440 1264754 1237629 1210427 1183700 1157969 1133454
53248 1133454 1110021 1087397 1065308 1043340 1021012 998214 975292 952403 929132 905155 881006
53237 881006 857679 835668 814848 795177 776917 760238 745090 731446 719196 707833 696732
53226 696732 685764 675225 665165 655237 645155 634750 623644 611484 598626 585914 573610 561056
53214 561056 547674 533765 520080 507124 495193 484618 475448 467134 458959 450673 442531 434871 427901
53201 427901 421716 416283 411411 406719 401587 395350 387932 380186 373164 367049 361254 355508 350247 345883
53187 345883 342362 339631 337853 336822 335825 334445 332952 331496 329607 327064 324669 323360 322969 322642 322207
53172 322207 322298 323199 324319 324961 325085 325140 325577 326615 328065 329274 329553 328808 327576 326411 325458 324631 323984
53155 323984 323800 324373 325653 327099 328040 328312 328302 328254 327840 326664 324943 323361 322407 322125 322236 322257 321707 320616
53137 320616 319642 319369 319613 319766 319625 319483 319523 319580 319456 319105 318517 317701 316742 315632 314176 312326 310488 309181
53119 309181 308550 308444 308756 309285 309572 309327 308868 308643 308512 308076 307516 307405 307643 307386 306254 304964 304380 304367
53101 304367 304019 302772 300984 299485 298727 298296 297257 295140 292558 290594 289639 289123 288290 286841 284867 282693
53085 282693 280904 280069 280242 281050 282325 284161 286180 287275 286556 284233 281285 278460 275952 273773 272019
53070 272019 270797 270172 270209 270925 272199 273749 275158 275972 276048 275863 276167 277182 278337 278987 279162 279435 280212
53053 280212 281394 282634 283730 284744 285861 287167 288539 289747 290632 291173 291497 291898 292618 293444 293783 293408
53037 293408 292900 292959 293517 294028 294457 295252 296353 296947 296514 295511 294680 294140 293581 292926 292434 292389 292955 294064
53019 294064 295222 295862 296122 296837 298416 300210 301425 302210 303236 304611 305830 306545 306713 306161 304764 303063
53003 303063 301993 301847 302042 302038 301903 301778 301403 300577 299745 299621 300409 301701 303012 304129 305031 305792 306622 307776
52985 307776 309311 311001 312543 313772 314650 315121 315111 314680 314056 313457 312957 312619 312628 313105 313883 314729 315767 317363
52967 317363 319570 321927 323921 325399 326497 327491 328778 330561 332337 333157 332707 331748 331109 330639 329647 327974
52951 327974 326002 323901 321631 319593 318392 317842 316958 315292 313620 312836 312705 312303 311394 310719 310961 311945
52935 311945 312942 313396 313160 312305 311013 309631 308561 307894 307188 305828 303719 301520 300046 299546 299673 300036
52919 300036 300524 301182 302047 303106 304171 304814 304737 304247 304056 304482 305105 305313 304978 304439 304042 303870 303732 303296
52901 303296 302402 301414 301030 301545 302396 302678 302011 300779 299638 299052 299177 299900 300833 301435 301345 300622 299604 298433
52883 298433 296801 294344 291419 289224 288804 289934 291343 292006 291903 291479 290920 290228 289583 289171 288883 288643 288861
52866 288861 290071 292187 294557 296784 299071 301622 304137 306107 307358 308056 308395 308492 308487 308509 308562 308504 308093 307048
52848 307048 305264 302998 300729 298678 296622 294209 291343 288202 285120 282568 280978 280295 279801 278679 276727
52833 276727 274379 272139 270272 269001 268579 268968 269651 269955 269597 268828 268106 267594 266950 265658 263685 261726
52817 261726 260627 260605 261251 262241 263631 265440 267374 269245 271331 273974 277012 279920 282299 283847 284113
52802 284113 282810 280378 277710 275204 272526 269460 266498 264326 263075 262402 262014 261742 261331 260611 259777 259189
52786 259189 258974 259060 259471 260181 260821 261015 261046 261691 263193 264844 265918 266699 268078 270223 272125 272622 271591
52769 271591 269931 268610 267964 267864 268137 268625 269050 269141 268954 268854 269125 269750 270629 271740 272964 273993 274640
52752 274640 275070 275455 275565 275110 274421 274338 275230 276439 276988 276689 276340 276866 278412 280264 281547 281997 282073 282311
52734 282311 282683 282713 282183 281509 281355 282009 283212 284429 285255 285671 285964 286262 286157 285035 282928 280736 279359
52717 279359 278755 278198 277330 276598 276502 276719 276332 274959 273477 273380 275314 278356 280928 282383 283439 285065 287275
52700 287275 289289 290541 291092 291128 290560 289323 287783 286546 285933 285779 285764 285803 286105 286858 287903 288802 289289 289566
52682 289566 290032 290799 291644 292396 293141 293993 294903 295775 296623 297462 298207 298848 299654 300994 302925 305011 306585
52665 306585 307210 307024 306676 306797 307448 308193 308759 309345 310127 310790 310998 311157 312170 314266 316509 317753 317711 316838
52647 316838 315468 313581 311274 308929 306752 304532 302021 299360 296982 295273 294387 294185 294236 294087 293690 293401
52631 293401 293452 293655 293798 294085 294891 296256 297918 299686 301409 302669 302985 302451 301811 301715 302139 302707 303277 303958
52613 303958 304699 305214 305334 305271 305456 306106 306945 307386 307100 306384 305757 305280 304561 303493 302570 302284 302543 302997 303634
52594 303634 304641 305903 307131 308378 309892 311400 312116 311728 311013 311186 312819 315598 318792 321653 323609
52579 323609 324543 324926 325401 326201 327185 328363 329967 331863 333207 333110 331630 329841 328786 328565 328594 328543 328620 328909
52561 328909 328832 327619 325160 322119 319291 317118 315733 315068 314816 314621 314422 314357 314310 313892 313109 312638 313077 314129
52543 314129 314888 314810 314098 313284 312817 312965 313730 314746 315560 316106 316680 317489 318466 319518 320556 321223 320971 319669
52525 319669 317941 316686 316394 316997 318160 319505 320724 321717 322590 323426 324200 324998 326134 327848 329995 332191
52509 332191 334191 336063 338060 340372 342840 344796 345419 344421 342262 339569 336572 333249 329738 326353 323389
52494 323389 321176 320087 320111 320588 320815 320785 320913 321121 320834 319959 319266 319494 320529 321779 322989 324255 325527
52477 325527 326626 327690 329123 331025 332937 334268 334858 335065 335428 336243 337401 338656 340094 342238 345515
52462 345515 349680 353895 357354 359691 360898 361080 360348 358756 356316 353213 350014 347417 345649 344268 342706
52447 342706 340913 339263 337951 336731 335266 333456 331304 328743 325867 323176 321232 320050 319156 318303 317781
52432 317781 317826 318093 318019 317418 316408 314989 313266 311967 312064 313614 315412 316096 315379 314043 313105 313256 314760
52415 314760 317396 320535 323595 326477 329432 332690 336428 340930 346488 353207 361115 370329 380823 392035
52401 392035 402972 412585 419811 423457 422639 417557 409606 400505 391435 383009 375635 369583 364833 361171
52387 361171 358495 356833 356055 355765 355612 355636 356168 357376 359110 361246 363981 367494 371491 375480 379532 384354
52371 384354 390416 397296 404118 410225 415154 418335 419459 418956 417659 416015 414042 411917 410046 408533
52357 408533 407127 405851 405207 405522 406501 407621 408636 409501 410205 410956 412292 414725 418419 423254 428844 434389
52341 434389 439050 442863 446872 451879 457377 462260 466389 470866 476780 484254 492856 502399 512983 524590
52327 524590 537080 550583 565589 582501 601029 620094 638379 655124 670482 685131 699598
52316 699598 714002 728395 743219 759325 777419 797468 818739 840465 862315 884131 905462
52305 905462 925800 945248 964500 984027 1003563 1022463 1040250 1056649 1071507 1084854 1096715
52294 1096715 1106576 1113442 1116792 1117212 1115744 1112923 1108867 1103919 1098591 1092965 1086773 1080035 1073133 1066326
52280 1066326 1059773 1054068 1050031 1047769 1046437 1045333 1044764 1045459 1047467 1050110 1052941 1056351 1061209 1068125
52266 1068125 1077127 1087916 1100319 1114323 1129632 1145444 1161082 1176795 1193440 1211196 1229022
52255 1229022 1245725 1261308 1276814 1292942 1309168 1324229 1337122 1347521 1355460 1360943 1363952 1364723
52243 1364723 1363831 1361903 1359297 1356188 1352822 1349430 1345870 1341574 1336083 1329501 1322361 1315071 1307644 1299945
52229 1299945 1292099 1284548 1277602 1271020 1264316 1257576 1251642 1247153 1243661 1240157 1236378 1233079 1231018 1230238
52215 1230238 1230512 1231920 1234592 1238215 1242271 1246583 1251392 1257070 1263946 1272094 1280917 1289202 1296012 1301489
52201 1301489 1306488 1311599 1316893 1322539 1329144 1337243 1346669 1356583 1366088 1374852 1383218 1391655 1400004 1407412
52187 1407412 1413102 1417064 1419768 1421363 1421394 1419228 1414507 1407310 1398181 1388037 1377793 1367944 1358518 1349266
52173 1349266 1339788 1329732 1319270 1309267 1300683 1293803 1288385 1284416 1282284 1282149 1283587 1286020 1289158
52160 1289158 1292803 1296564 1300016 1303003 1305500 1307258 1307769 1306619 1303868 1300202 1296796 1294803 1294692 1295971
52146 1295971 1297573 1298641 1299027 1299127 1299245 1299165 1298439 1297017 1295330 1293664 1291805 1289563 1287347 1285857 1285431 1286177
52130 1286177 1288538 1293161 1300179 1309152 1319875 1332775 1348303 1366369 1386528 1408338 1431309 1454933
52118 1454933 1479065 1503992 1529802 1555930 1581567 1606253 1629886 1652499 1674319 1695711 1716683
52107 1716683 1736744 1755624 1773858 1792213 1810775 1829063 1846843 1864225 1880999 1896385 1909546
52096 1909546 1919964 1927293 1931324 1932161 1930042 1924811 1915938 1903265 1887525 1869992 1851875 1834097 1817277
52083 1817277 1801522 1786455 1771747 1757749 1745388 1735412 1727753 1721638 1716373 1712067 1709564 1709701 1712688
52070 1712688 1718179 1725636 1734501 1744324 1755094 1767259 1781069 1796051 1811532 1827520 1844476 1862259
52058 1862259 1879976 1897058 1913748 1930098 1945076 1957351 1966661 1973730 1978931 1981690 1981281 1977599 1970892
52045 1970892 1961219 1948637 1933684 1917250 1899954 1881939 1863357 1844715 1826594 1809133 1792056
52034 1792056 1775134 1758427 1742084 1726188 1710859 1696211 1682037 1667812 1653281 1638853 1625089
52023 1625089 1612018 1599333 1587110 1575732 1565115 1554644 1544093 1534046 1525055 1516856 1508855 1500978
52011 1500978 1493381 1485508 1476126 1464485 1450944 1436207 1420192 1401981 1380801 1356891 1331282 1304835
51999 1304835 1277714 1250025 1222733 1197360 1174578 1153568 1133146 1113128 1094045 1075886 1057880
51988 1057880 1039498 1020951 1002451 983603 963942 943752 923924 905112 887261 869833 852279
51977 852279 834371 816347 798760 782222 767263 754320 743610 735062 728670 724893 724260 726463 730254
51964 730254 734540 739271 744927 751404 757901 763653 768241 771144 771554 768912 763358 755510 746069 735886
51950 735886 726082 717644 710889 705549 701482 699083 698901 701056 705213 711018 718382 727264 737310 747820
51936 747820 758009 767288 775365 782138 787445 790817 791492 788791 782553 773188 761374 747698 732544
51923 732544 716207 699021 681403 663779 646587 630369 615745 603119 592447 583509 576299 570839
51911 570839 566542 562414 558291 555521 555800 559432 565266 572206 580089 589063 598801 608679 618021 625755
51897 625755 630381 630939 627761 621760 613249 602079 588734 574542 560721 547813 536186 526508 519360
51884 519360 514815 512661 512783 515057 519163 524843 532161 541248 551940 563915 576961 590718 604188
51871 604188 615901 624702 630229 632607 631976 628519 622799 615756 608279 600815 593475 586519 580629 576599
51857 576599 574751 574789 576244 578906 582690 587216 591779 595714 598636 600402 601141 601389 601870 602913 604343
51842 604343 606162 609129 614203 621439 629769 637867 644827 649928 652341 651546 647816 641906 634461 626076
51828 626076 617636 609896 602617 594734 585612 575791 566261 557443 549270 541923 535941 531661 528923 527373
51814 527373 526763 526935 527772 529246 531308 533617 535403 535757 534124 530716 526459 522327 518586 514826 510842
51799 510842 507199 504688 503472 503199 503707 505018 506561 507031 505504 502485 499486 497679 497175 497462 498097 498831
51783 498831 499355 499282 498424 496918 494981 492703 490263 488283 487634 488819 491704 495948 501394 507861 514888
51768 514888 522146 530000 539140 549510 559919 568842 575438 579636 581485 580677 576761 569748 560456 550203
51754 550203 540107 530799 522756 516445 511825 507965 503727 498831 493952 489908 487212 486267 487301 489990
51740 489990 493749 498593 505086 513160 521676 529690 537597 546342 555787 564506 571084 575047 576642 576408
51726 576408 575152 573929 573748 575265 578500 582535 585670 586354 584101 579442 573314 566857 561460 558182 556919
51711 556919 556566 556031 554751 552357 548633 544129 540293 538542 539379 542441 546930 551659 555183 556464 555439
51696 555439 552780 549334 546011 543821 543557 545339 548645 552590 556008 557587 556427 552581 546846 540099
51682 540099 532929 525738 518882 512789 508163 505864 506217 508418 510957 512749 513732 514493 515632 517527 520432
51667 520432 524662 530776 539470 550955 564306 577626 588996 597221 601830 602763 600252 594789 587012
51654 587012 577789 568458 560658 555587 553497 554033 556786 561124 565632 568278 567417 562543 554110 542952
51640 542952 530074 516598 503459 491051 479421 468832 459937 453327 449019 446392 444519 442618 440476
51627 440476 438582 437703 438188 439723 441762 443996 446237 448129 449264 449511 449030 448063 446910 445958 445409 445001
51611 445001 444315 443339 442369 441349 439793 437600 435479 434235 433874 433817 433867 434579 436679 440414 445552 451816
51595 451816 459256 468229 478990 491223 504009 516261 527043 535509 540939 543141 542710 540659 537980
51582 537980 535665 534783 536046 539395 544442 551295 560671 573342 589844 610456 634734 661071 687486
51569 687486 713352 739922 768746 799864 831867 863337 893759 923430 953311 985174 1021210
51558 1021210 1062864 1109869 1160430 1212105 1262198 1307374 1343450 1366367 1373918 1366575 1346524 1315930
51546 1315930 1276178 1228454 1174478 1116511 1056887 997611 940127 885411 834455 788589 748925
51535 748925 715424 686985 662610 642066 625185 611087 598640 587378 577484 569056 561849 555559
51523 555559 549898 544462 538971 533609 528711 524210 519785 515481 511664 508333 504972 501208 497231 493411
51509 493411 489858 486484 483189 479860 476459 473175 470129 466949 463059 458542 454266 450987 448780 447576
51495 447576 447621 448913 450638 451834 452462 453253 454615 456238 457771 459246 460614 461313 460697 458732 456018 453229
51479 453229 450667 448292 446029 444020 442534 441572 440586 438811 435940 432407 428920 425878 423347 421397 420136
51464 420136 419360 418512 417264 416105 416026 417501 419902 422085 423469 424471 426019 428861 433234 438911 445383
51449 445383 452173 459160 466690 475391 485834 498252 512462 528100 544922 562683 580536 596683
51437 596683 608964 615974 617757 615750 612206 609258 607796 607039 605289 601098 593711 582995 569763 556015
51423 556015 543912 534183 526123 519269 514264 511585 510188 508277 505090 501328 498071 495880 494741 494273
51409 494273 494021 493937 494463 495783 497323 498533 499865 502314 506151 510776 515737 521087 526709 532052 536869
51394 536869 541669 547226 554070 562548 572825 584639 597613 612060 628994 649151 672678 700104
51382 700104 732959 772778 819821 873254 932225 996145 1064121 1134731 1206204 1276129 1340840
51371 1340840 1395666 1436418 1460856 1468878 1461497 1439696 1404191 1356143 1297840 1232418 1162883 1091585
51359 1091585 1020506 951584 886512 826475 772220 724150 682223 646069 615394 590015 569350
51348 569350 552269 537754 525392 514985 506033 497927 490310 482893 475325 467689 460750 455114 450340
51335 450340 445516 440529 436080 432577 429725 427315 425598 424661 424083 423572 423405 423816 424455 424936 425542 426780
51319 426780 428431 429656 429985 429726 429368 429050 428813 428927 429620 430757 432097 433743 436001 438824 441701 444098
51303 444098 445730 446397 445993 444903 443955 443526 442959 441335 438712 436039 433951 432278 430775 429591 428695 427542
51287 427542 425867 424265 423404 423133 423052 423536 425328 428267 431341 433981 436413 438596 439822 439835 439546 439937
51271 439937 440732 440868 439928 438497 437273 436565 436614 437771 440070 443030 446084 448991 451693 453996 455660 456730
51255 456730 457600 458705 460153 461637 462656 462881 462377 461454 460308 458799 456611 453657 450309 447145 444430
51240 444430 441862 438875 435124 430703 426085 421998 419133 417655 416932 415990 414314 412152 410097 408588 407803
51225 407803 407742 408279 409251 410527 411931 413148 413975 414685 415872 417866 420532 423667 427171 430645 433278 434592
51209 434592 435185 436301 438639 441902 445443 449021 452770 456782 460980 465292 469658 473757 476903 478420
51195 478420 478234 477082 476057 475800 476061 476007 475032 473380 471975 471580 472105 472826 473227 473396 473533 473395 472573 471127
51177 471127 469550 468085 466424 464183 461382 458325 455248 452259 449509 447242 445686 444888 444642 444655 444922
51162 444922 445819 447629 450096 452715 455332 458064 460742 462956 464697 466334 467784 468239 467140 464970 462668
51147 462668 460546 458251 455492 452367 449161 446223 443907 442200 440577 438609 436612 435317 435010 435403 436186
51132 436186 437228 438290 439090 439731 440650 442057 443839 445990 448682 451793 454877 457755 460705 463812 466634
51117 466634 468849 470915 473626 477174 481018 484590 487781 490755 493513 495727 496948 497104 496811 496997 498121
51102 498121 499879 501789 503811 506230 509198 512654 516449 520229 523360 525347 526260 526469 526036 524789 522958
51087 522958 521278 520215 519415 518184 516345 514361 512706 511380 510072 508643 507340 506527 506329 506557 507006
51072 507006 507668 508598 509747 511123 513038 515902 519771 524356 529565 535733 543145 551617 560848 570951
51058 570951 582238 594398 606218 616200 623397 627742 629978 631399 633409 636967 642336 649265 657233
51045 657233 665553 673605 681217 688671 696202 703628 710651 717297 723811 730219 736295 741822 746506 749608
51031 749608 750038 746956 740169 729959 716895 701962 686459 671405 657170 643870 631982 622250
51019 622250 615080 610328 607730 607223 608773 612067 616536 621636 627005 632475 638071 643971 650351 657230
51005 657230 664514 672160 680147 688262 696041 703108 709533 715707 721865 727906 733707 739390 745204 751389
50991 751389 758286 766352 775833 786657 798894 813092 829746 848583 868908 890594 914200 940015
50979 940015 967518 996015 1025263 1055088 1084793 1113479 1140865 1167453 1193989 1221067 1249185
50968 1249185 1278961 1311207 1346791 1386164 1429006 1474606 1522786 1574100 1628931 1686720 1746408
50957 1746408 1807181 1868414 1929159 1988203 2044425 2096660 2143563 2184264 2219044 2248781 2273833
50946 2273833 2294121 2310247 2323801 2336353 2348791 2361715 2375670 2390418 2404370 2415217 2421055
50935 2421055 2420952 2415100 2404749 2391465 2375888 2357312 2334678 2307494 2275461 2237764 2193532 2142812
50923 2142812 2086534 2025635 1960819 1893070 1823735 1753896 1684205 1615534 1549330 1486990 1429159
50912 1429159 1375882 1327144 1282934 1242982 1206872 1174405 1145557 1119993 1096954 1075807 1056531
50901 1056531 1039353 1024037 1009883 996591 984717 975001 967394 961128 955646 951064 947709 945609 944567
50888 944567 944358 944647 945085 945799 947477 950652 955059 960014 965247 971026 977631 985122 993584 1003122 1013560
50873 1013560 1024421 1035370 1046490 1058142 1070868 1085367 1102237 1121534 1142814 1165663 1190021
50862 1190021 1215988 1243740 1273783 1307015 1344311 1386273 1433505 1486781 1546638 1613088 1686144
50851 1686144 1766509 1855329 1953321 2060496 2176686 2301840 2435665 2577302 2725571 2879301
50841 2879301 3037173 3197435 3357885 3515848 3667844 3809518 3936457 4045369 4134572 4203661
50831 4203661 4253175 4284567 4300011 4301839 4292360 4274403 4251780 4228823 4209281 4195689 4189545 4191710
50819 4191710 4202369 4220561 4243627 4267079 4285231 4292507 4284642 4259043 4214365 4150063 4066278 3963754
50807 3963754 3843636 3707410 3557266 3396544 3229610 3061001 2894439 2732580 2577681
50798 2577681 2432303 2299044 2179496 2073697 1980837 1900241 1831420 1773418 1724753 1684242
50788 1684242 1651574 1626726 1608953 1596602 1587902 1581775 1577828 1575677 1574443 1572957 1570345 1566196 1560206
50775 1560206 1551984 1541482 1529357 1516520 1503314 1489337 1473967 1456789 1437626 1416645 1394477
50764 1394477 1371803 1348735 1324950 1300620 1276748 1254333 1233567 1214213 1196449 1180913 1168011
50753 1168011 1157613 1149484 1143800 1141160 1142124 1146648 1154017 1163577 1175567 1190883 1209923 1232159 1257145
50740 1257145 1285483 1318286 1356091 1398843 1446622 1499570 1557198 1618580 1683389 1752074 1824764
50729 1824764 1900631 1978687 2058639 2140467 2223556 2306807 2389354 2470597 2549526 2624530 2693886
50718 2693886 2755959 2808716 2849525 2875980 2887125 2883831 2868135 2842516 2809846 2773645 2737769
50707 2737769 2705516 2679034 2659500 2647562 2643315 2646063 2654448 2666840 2681293 2695106 2704794 2706823
50695 2706823 2698380 2677497 2642773 2593443 2529859 2453857 2368527 2277453 2183940 2090735 2000212
50684 2000212 1914527 1835437 1764126 1701464 1648311 1605240 1571956 1547362 1530440 1521001 1519472 1526077
50672 1526077 1540275 1560845 1586393 1615839 1648422 1683210 1718678 1753033 1784914 1813572 1838446
50661 1838446 1859049 1875479 1888693 1899917 1909894 1918832 1926776 1933676 1939314 1943562 1946751 1949470 1952010
50648 1952010 1954275 1956333 1958886 1963122 1970248 1981132 1996241 2015816 2040086 2069200 2102834 2140051
50636 2140051 2179823 2221622 2265270 2310230 2355430 2399926 2443463 2486257 2528466 2570194 2611711
50625 2611711 2652941 2692010 2724152 2742508 2740957 2717254 2674250 2618454 2557309 2497077 2442014
50614 2442014 2394305 2354404 2321762 2295737 2276009 2262275 2253848 2249593 2248002 2247124 2244609 2238098 2225647
50601 2225647 2205882 2178075 2142264 2099087 2049223 1993163 1931821 1867161 1801663 1737023 1673752
50590 1673752 1612154 1553180 1497977 1446950 1399838 1356604 1317706 1283425 1253400 1227090 1204251
50579 1204251 1184714 1168022 1153855 1142725 1135720 1133448 1135516 1141149 1149882 1161402 1175143 1190481
50567 1190481 1207203 1225332 1244476 1263757 1282501 1300654 1318363 1335583 1352451 1369870 1389272
50556 1389272 1411710 1437356 1465777 1496506 1529303 1564137 1600955 1639274 1677942 1715473 1750668
50545 1750668 1782807 1811374 1836103 1857586 1877557 1898135 1920747 1945960 1974207 2006294 2043049
50534 2043049 2084731 2130970 2181316 2235754 2294866 2359626 2431008 2509620 2595470 2687930 2785953
50523 2785953 2888420 2994341 3102610 3211571 3318939 3422211 3519003 3606936 3683455 3746043
50513 3746043 3792628 3821725 3832426 3824558 3798726 3755909 3697088 3623620 3538012 3443951 3345394
50502 3345394 3245746 3147923 3054824 2969480 2894841 2833477 2787206 2756850 2742348 2743072 2757751 2784195
50490 2784195 2819491 2860580 2904081 2945295 2978020 2996206 2995949 2975765 2935398 2875173 2796594 2702905
50478 2702905 2598550 2488073 2375429 2263776 2155411 2051829 1954004 1862693 1778538 1701998
50468 1701998 1633152 1571461 1515837 1465205 1419107 1377621 1340715 1307892 1278519 1252288 1229231
50457 1229231 1209475 1193122 1180241 1170808 1164623 1161288 1160240 1160884 1162863 1166213 1171080 1177263 1184272
50444 1184272 1191893 1200491 1210526 1221859 1233690 1245116 1255607 1265073 1273693 1281789 1289660 1297361 1304577
50431 1304577 1310870 1316234 1321419 1327557 1335303 1344398 1354166 1364346 1375277 1387359 1400605 1414868 1430362
50418 1430362 1447841 1468307 1492560 1520937 1553388 1589853 1630562 1675875 1725770 1779543 1836095
50407 1836095 1894468 1954089 2014530 2075070 2134512 2191437 2244622 2293188 2336335 2373084 2402381
50396 2402381 2423383 2435488 2438121 2430638 2412536 2383691 2344518 2296041 2239851 2177959 2112632 2046289
50384 2046289 1981264 1919425 1862088 1810417 1765720 1729088 1700845 1680611 1667834 1661978 1662320 1667968
50372 1667968 1678028 1691132 1704660 1714955 1718803 1714514 1701468 1679246 1647925 1608948 1564811 1517612
50360 1517612 1468407 1418088 1368199 1320329 1275048 1232084 1191422 1153617 1118914 1086684 1056125
50349 1056125 1027203 1000508 976499 955365 937441 923095 912063 903438 896570 891626 889015 888619
50337 888619 889862 892218 895248 898417 901291 903793 906024 908044 910169 913153 917488 922618 927380 931265
50323 931265 934779 938607 942971 947952 953871 960963 968905 976926 984309 990779 996591 1002211 1007692 1012536
50309 1012536 1016509 1020395 1025355 1031534 1037920 1043597 1048501 1052830 1056540 1059778 1063102 1066724 1070103 1072864
50295 1072864 1075598 1079109 1083226 1087027 1089886 1091661 1092154 1091302 1089872 1089205 1090117 1092609 1096759 1103297 1113086
50280 1113086 1126530 1143551 1163439 1184139 1202157 1214021 1218410 1216959 1213028 1209593 1208046 1208623 1211537
50267 1211537 1217311 1226035 1236783 1248146 1259098 1268873 1276137 1278903 1275621 1266240 1252181 1235503 1218117
50254 1218117 1201374 1185866 1171463 1157591 1143718 1129815 1116505 1104726 1095167 1088039 1083302 1080817
50242 1080817 1080208 1080877 1082423 1084906 1088529 1093219 1098672 1104602 1110721 1116694 1122288 1127337 1131365 1133585
50228 1133585 1133587 1131792 1128849 1124859 1119557 1112938 1105205 1096336 1086226 1075116 1063347 1050899 1037750
50215 1037750 1024610 1012544 1001818 991682 981408 971034 961027 951854 943942 937450 931818 926127
50203 926127 920174 914681 910187 906350 902724 899699 898185 898657 900912 904407 908449 912378 916121 920492
50189 920492 926602 934978 945435 957582 971260 986730 1004691 1025938 1050695 1078427 1108350 1139879
50177 1139879 1172400 1205017 1236882 1267565 1296898 1324769 1351406 1377475 1403485 1429284 1454485
50166 1454485 1478994 1502497 1523535 1539753 1549223 1551128 1545114 1530497 1506516 1473344 1432799 1388110
50154 1388110 1342841 1299638 1259720 1223392 1190861 1162477 1138395 1118353 1101821 1088283 1077383
50143 1077383 1068834 1061984 1055393 1047113 1035652 1020596 1002336 981609 959639 938252 919171 903129
50131 903129 890001 879681 872343 867781 864968 862602 859984 857240 854775 852594 850201 847253 844362 842922
50117 842922 843867 846695 849992 852776 855080 857450 860337 864025 868697 874373 880827 887606 894044 899514
50103 899514 903940 907947 912228 916867 921581 926385 931492 936673 941336 945371 949391 954004 959323 965416
50089 965416 972702 981507 991523 1002107 1013000 1024509 1037192 1051595 1068044 1086412 1106227 1127183
50077 1127183 1149417 1173117 1198110 1224096 1251115 1279501 1309482 1341092 1374390 1409550 1446820
50066 1446820 1486667 1529825 1576907 1627878 1682002 1738243 1795536 1852756 1908683 1962140 2012308
50055 2012308 2059182 2103923 2148471 2194425 2242230 2291510 2341745 2392005 2439994 2481979 2514017
50044 2514017 2533193 2537818 2527218 2501983 2464136 2416391 2360994 2299485 2233521 2165453 2097804
50033 2097804 2032388 1970181 1911892 1858329 1810087 1767103 1728712 1694086 1662584 1633735 1607103
50022 1607103 1582264 1558900 1536801 1515660 1494865 1473503 1450656 1425718 1398498 1369198 1338503
50011 1338503 1307691 1278331 1251504 1227156 1204276 1181833 1159637 1138447 1119401 1103360 1090723
50000 1090723 1081710 1076641 1075633 1078041 1082449 1087520 1092694 1097754 1101910 1103933 1103420 1101427 1099422 1097723
49986 1097723 1095264 1090631 1082982 1072205 1058897 1044343 1030001 1016634 1004101 992143 981083 971558
49974 971558 963810 957596 952652 948982 946740 946052 946861 948754 951062 953378 955968 959382 963773 968894 974760
49959 974760 981877 990738 1001439 1013997 1028722 1045993 1065774 1087640 1111184 1136233 1162684 1190321
49947 1190321 1218819 1247853 1277223 1306923 1337068 1367818 1399349 1431685 1464149 1495093 1522648
49936 1522648 1545911 1565067 1580364 1591657 1599367 1605235 1611410 1618968 1627810 1637503 1647169 1654491 1655781
49923 1655781 1647647 1628411 1597990 1557214 1507718 1451998 1392896 1332988 1274441 1219009 1167772
49912 1167772 1121118 1079321 1042954 1012523 988041 969266 956053 948047 944290 943717 945995 951380
49900 951380 959666 969670 979936 989563 998110 1004928 1009107 1010216 1008822 1005841 1001274 993852 982240
49887 982240 966376 947408 926555 904607 882482 861457 842370 824903 808003 790783 772893
49876 772893 754576 736828 721177 708632 698880 690812 683739 677791 673369 670667 669580 669711 670588 672248
49862 672248 675452 680902 688424 697430 707981 720707 735667 751961 768681 785636 802890 819976
49850 819976 835906 849634 860356 867785 872445 875420 877409 878113 876573 871933 863803 852292 838027
49837 838027 822033 805401 789096 773987 760662 749151 739192 730964 725170 722131 721106 720935 721204
49824 721204 722518 725748 731385 739494 749903 762294 776226 791214 806828 822809 839092 855475
49812 855475 871187 885046 896321 905313 912867 919373 924436 927396 927901 925985 921870 915899 908594 900645
49798 900645 892670 884852 876797 867893 857927 847267 836428 825630 814943 804710 795530 787740 781108
49785 781108 775199 769970 765812 762990 761260 760216 759788 760030 760509 760494 760051 760491 763229 768379 774867 781726
49769 781726 788784 796198 803917 811650 818853 824688 828516 830571 831635 831954 831054 828804 825923 822918 819041
49754 819041 812834 803418 790831 775556 758484 741109 724989 710840 698571 688135 679797 673507
49742 673507 668637 664675 661788 660338 660104 660388 660876 661985 664227 667492 671261 675352 680041 685349 690682
49727 690682 695598 700575 706454 713314 720662 728757 738922 752093 767621 783971 800088 815537 829706
49714 829706 841636 850503 855728 856796 853586 846853 837837 827300 815350 802163 788333 774416 760640
49701 760640 747359 735444 725903 719089 714347 710361 705976 700914 695804 691525 688647 687465 688091 690225
49687 690225 693177 696628 701155 707547 715721 724823 734306 744469 756014 769566 785553 804053 824684
49674 824684 846910 870151 893017 912700 926164 932291 932382 928567 922519 915756 909997 906346 904572
49661 904572 903778 903404 903094 901996 898754 891942 880215 862675 839884 814337 789193 766455 746610
49648 746610 729619 715476 703844 693878 684843 676684 669927 665148 662462 661279 660652 660046 659611 659477
49634 659477 659156 658129 656665 655340 653846 651001 646118 639728 632822 626002 619633 614154 609678 605643
49620 605643 601415 597104 593387 590689 588921 587861 587328 587016 586594 586110 586024 586652 587820 589193 590766 592768
49604 592768 595085 597008 597744 597208 596131 595257 594572 593618 592538 592321 593649 595830 597433 597959 598372 599768
49588 599768 602002 603995 605071 605552 606147 607277 608962 610940 612750 614093 615281 617076 619887 623431 627354
49573 627354 631817 637136 643240 649999 657875 667616 679281 692112 705512 719615 734571 749679 763576
49560 763576 775111 783772 789426 792043 791676 788602 783446 777158 770701 764689 759427 755202 752165 749936
49546 749936 747868 745965 745073 745754 747308 748450 748702 748599 748714 749101 749755 751001 753260 756780 761751 768277
49530 768277 776164 785095 795187 806994 820765 836101 852617 870649 890903 913531 937753 962128
49518 962128 984869 1004183 1018906 1029153 1036269 1042060 1048029 1055023 1063245 1072407 1081930 1091005 1098492
49505 1098492 1102900 1102658 1096524 1083949 1065482 1042973 1019025 995724 973758 952864 932987 914736
49493 914736 898814 885361 873992 864185 855488 847476 839776 832257 825225 819341 815098 812239 809842
49480 809842 807235 804632 802620 801218 799920 798634 797993 798463 799642 800822 801941 803516 805914 809162 813385
49465 813385 818850 825510 832901 840628 848554 856359 863302 868706 872412 874533 874984 873574 870362 865615
49451 865615 859511 852195 844044 835572 827067 818613 810516 803479 798251 795186 794048 794084 794400 794635 795293
49436 795293 797180 800574 805274 811400 819623 830440 843696 859110 876820 897075 919805 945024
49424 945024 973423 1006108 1043996 1087687 1136913 1188548 1234976 1266105 1274818 1261196 1231738 1195026
49412 1195026 1158049 1125214 1098856 1079773 1067679 1061803 1061395 1065898 1074860 1087686 1103396 1120756
49400 1120756 1138795 1157094 1175508 1193883 1212191 1230551 1248625 1265268 1279291 1290453 1299114
49389 1299114 1304994 1307033 1304730 1298918 1290746 1280341 1267083 1250914 1232843 1214218 1195985 1178592
49377 1178592 1162163 1146660 1132261 1119801 1110538 1105290 1103814 1105120 1108177 1112244 1116737 1121076 1124755
49364 1124755 1127446 1129006 1129382 1128486 1126090 1121811 1115315 1106646 1096365 1085239 1073745 1062033 1050500
49351 1050500 1040182 1032254 1027128 1024318 1023191 1023499 1024970 1026787 1027868 1027570 1025784 1022429 1017241 1010215
49337 1010215 1002002 993601 985605 977821 969705 961259 953398 947238 943047 940156 937952 936568 936407 937428
49323 937428 939305 941991 945528 949472 953151 956571 960476 965281 970477 975396 980169 985397 991049 996220
49309 996220 1000088 1002818 1005373 1008597 1012632 1017134 1021767 1026341 1030690 1034783 1038989 1043868 1049583 1055803
49295 1055803 1062322 1069273 1076412 1082702 1087248 1090370 1093082 1095714 1097802 1099164 1100140 1100699 1100253 1098757 1097155
49280 1097155 1096311 1096317 1097375 1100488 1106395 1114399 1123143 1132182 1141905 1152212 1162309 1171789 1181009 1190161
49266 1190161 1198696 1205954 1211891 1216897 1221245 1224948 1228026 1230941 1234954 1241839 1252873 1268242 1287735
49253 1287735 1311583 1339952 1371771 1404707 1436169 1463678 1484587 1496689 1499483 1494138 1482017 1464053
49241 1464053 1441784 1417851 1394632 1372932 1352642 1334052 1317781 1303926 1292231 1282976 1276926 1274459
49229 1274459 1275269 1278894 1285050 1293520 1304243 1317504 1333479 1351388 1369281 1384733 1395688 1401056
49217 1401056 1401093 1397299 1391599 1385420 1379521 1374344 1370141 1366940 1364848 1364385 1366206 1370623 1377749 1387956
49203 1387956 1401617 1418393 1437275 1457510 1479109 1502313 1526946 1552395 1577853 1602314 1624612
49192 1624612 1643772 1659302 1671113 1679414 1684787 1688152 1690412 1692165 1693791 1695703 1698491 1702959 1710030
49179 1710030 1720483 1734844 1753771 1778380 1809755 1848090 1892741 1943289 1999918 2062154 2127131
49168 2127131 2189284 2241759 2278518 2296286 2295755 2281345 2259276 2235227 2213168 2195429 2182950 2175298
49156 2175298 2171153 2169295 2169151 2170440 2172887 2176579 2182194 2190296 2200533 2211974 2224108 2237024 2250634
49143 2250634 2264381 2277971 2291775 2306098 2320442 2334016 2346721 2359081 2371392 2383549 2395697
49132 2395697 2408375 2421807 2435491 2448785 2461552 2474059 2486633 2499631 2513427 2528127 2543559
49121 2543559 2559769 2577170 2595961 2615830 2636671 2659210 2684338 2712116 2742163 2775019 2812472
49110 2812472 2856442 2908205 2968982 3040417 3123297 3215284 3310281 3400979 3483225 3558722 3632976
49099 3632976 3709091 3782187 3839690 3868106 3861201 3823418 3766390 3701652 3634860 3565138 3489091
49088 3489091 3405657 3317950 3231504 3151438 3080948 3021221 2971831 2931270 2897804 2870235 2847881
49077 2847881 2829974 2815254 2802193 2789489 2776406 2762860 2749221 2735917 2723114 2710805 2699120
49066 2699120 2688415 2678888 2670221 2661761 2653166 2644760 2637088 2630214 2623687 2617206 2611006 2605362 2600008 2594415
49052 2594415 2588475 2582457 2576294 2569384 2561308 2552478 2543915 2536616 2531244 2528027 2526614 2526236 2526444 2527673
49038 2527673 2530893 2536789 2545564 2557369 2572447 2590697 2611409 2633586 2656251 2678289 2698226 2714458
49026 2714458 2725626 2730656 2728790 2720158 2706402 2690245 2674057 2658848 2644643 2631497 2619831 2610068
49014 2610068 2602410 2596941 2593585 2591890 2591202 2591220 2592153 2594226 2597297 2601095 2605588 2610900 2617027 2623752 2630617
48999 2630617 2636873 2641762 2645140 2647676 2650136 2652562 2654269 2654450 2652610 2648725 2643415 2637777 2632581 2627585
48985 2627585 2621955 2615336 2608235 2601416 2595229 2589500 2583778 2577650 2571091 2564493 2558121 2551701 2544846 2537733
48971 2537733 2530925 2524615 2518521 2512566 2507135 2502597 2499131 2497159 2497401 2500151 2504894 2510980 2518322 2527158
48957 2527158 2537515 2549306 2562662 2577744 2594359 2612146 2631021 2651124 2672391 2694447 2716885
48946 2716885 2739431 2761898 2784092 2805766 2826645 2846786 2867058 2888893 2913225 2939817 2967907
48935 2967907 2997392 3029089 3063962 3102423 3144308 3189217 3236761 3286688 3338872 3393224 3449714
48924 3449714 3508448 3569536 3632799 3697894 3764842 3834079 3905568 3977962 4048989 4116716 4180372
48913 4180372 4240246 4297122 4351743 4404423 4454927 4502799 4547801 4590014 4629658 4666808 4701200
48902 4701200 4732295 4759785 4784106 4806213 4826705 4845474 4862248 4877009 4889652 4899787 4907358
48891 4907358 4913062 4917602 4920831 4922173 4921568 4919298 4915152 4908585 4899683 4889155 4877217 4863241 4846744
48878 4846744 4827958 4806932 4782583 4753206 4717677 4675873 4628322 4575924 4519778 4460797 4399484
48867 4399484 4336337 4272308 4208550 4145797 4084267 4024192 3966193 3911037 3859058 3809786 3762253
48856 3762253 3715823 3670779 3627932 3587689 3549824 3514129 3480846 3450308 3422589 3397821 3376409
48845 3376409 3358511 3343590 3331020 3320962 3314140 3310690 3309679 3309848 3310602 3312282 3315820 3322159 3331641
48832 3331641 3343776 3357782 3373424 3391048 3410666 3431329 3451709 3471260 3490618 3510884 3532598
48821 3532598 3555362 3578337 3601097 3624060 3648060 3673504 3699982 3726629 3752732 3778031 3802671
48810 3802671 3827091 3851800 3877026 3902519 3927856 3952960 3978290 4004488 4031928 4060607 4090366
48799 4090366 4121099 4152678 4184649 4216082 4245913 4273561 4299170 4323070 4345131 4364876 4382149
48788 4382149 4397223 4410054 4419771 4425357 4426712 4424616 4419616 4411323 4398925 4382045 4360921 4336058
48776 4336058 4308053 4277614 4245375 4211631 4176399 4139698 4101602 4062101 4021104 3978565 3934477
48765 3934477 3888848 3841928 3794439 3747308 3701064 3655679 3611068 3567504 3525489 3485447 3447727
48754 3447727 3412730 3380742 3351614 3324806 3299772 3276239 3254144 3233417 3213924 3195582 3178540
48743 3178540 3163309 3150739 3141701 3136610 3135159 3136530 3139854 3144461 3149788 3155273 3160473 3165221 3169559
48730 3169559 3173560 3177333 3181017 3184620 3187930 3190862 3193847 3197487 3201693 3205508 3208102 3209739 3211424 3213687
48716 3213687 3216010 3217524 3217988 3218012 3218486 3219944 3222452 3225963 3230577 3236310 3242793 3249531 3256576 3264553 3273849
48701 3273849 3284055 3294541 3305299 3316744 3328860 3341134 3353389 3366107 3379603 3393247 3405895
48690 3405895 3416884 3426221 3433866 3439226 3441620 3441120 3438872 3436540 3435375 3435613 3436566 3437196 3436654 3434397 3429943
48675 3429943 3422662 3412034 3398165 3381893 3364155 3345318 3325322 3304291 3282650 3260589 3237933
48664 3237933 3214720 3191553 3169093 3147514 3126652 3106199 3085202 3061695 3033550 2999828 2961119
48653 2961119 2918830 2874699 2830729 2788788 2749943 2714496 2682662 2654650 2629954 2607180 2585007
48642 2585007 2563058 2541595 2520669 2499830 2478484 2456336 2433680 2411411 2390440 2370885 2351940
48631 2351940 2332605 2312334 2290980 2268538 2245183 2221338 2197472 2174020 2151595 2131005 2112811
48620 2112811 2097020 2083324 2071470 2061333 2052948 2046568 2042485 2040693 2040987 2043327 2047586 2052769 2057053
48607 2057053 2058985 2058372 2055772 2051658 2046460 2040995 2036196 2032555 2030179 2029127 2029234 2029745 2029596 2027914 2023895
48592 2023895 2016579 2005474 1991382 1975979 1960389 1944640 1928573 1912732 1898019 1884857 1873023
48581 1873023 1862133 1851944 1842298 1833090 1824443 1816810 1810797 1806827 1805028 1805444 1808213 1813338 1820405 1828891
48567 1828891 1838798 1850612 1864355 1878922 1892524 1903480 1910380 1912021 1907884 1898663 1885922 1871177
48555 1871177 1855531 1839936 1825294 1812184 1800737 1790712 1781352 1771288 1759126 1744292 1727113
48544 1727113 1708108 1687632 1666228 1644819 1624199 1604510 1585390 1566596 1548388 1531390 1516106
48533 1516106 1502551 1490530 1480314 1472735 1468187 1465757 1463928 1462259 1461975 1464845 1471821 1482851 1497482
48520 1497482 1515055 1534218 1552373 1565853 1571204 1566958 1554409 1536616 1516733 1497398 1481062 1469774
48508 1469774 1464222 1463537 1466452 1472398 1481274 1492652 1505628 1519247 1532801 1546048 1559509 1574251
48496 1574251 1590851 1608476 1624996 1637665 1643584 1640238 1626672 1604430 1576874 1547217 1517216 1487533
48484 1487533 1458678 1431268 1405723 1382284 1361360 1343486 1328742 1316400 1305402 1295244 1286240
48473 1286240 1278958 1273588 1269947 1267807 1266909 1266762 1266897 1267402 1268954 1272192 1277311 1284353 1293484 1304630 1317113
48458 1317113 1330027 1342875 1355409 1366865 1375831 1381122 1382603 1381070 1377557 1372933 1367847 1362715 1357777
48445 1357777 1353328 1349747 1346987 1344109 1339738 1333083 1324345 1314150 1303044 1291710 1281053 1271524 1262561
48432 1262561 1253299 1243829 1235273 1228600 1223856 1220581 1218372 1216775 1215144 1213121 1210992 1209239 1207827 1206185
48418 1206185 1203669 1199913 1195046 1189865 1185459 1182299 1179860 1177399 1174809 1172387 1170211 1168240 1166671 1165569
48404 1165569 1164360 1162410 1160075 1158458 1158036 1158163 1158073 1157744 1157420 1156814 1155250 1152372 1148301 1143225 1137098 1129823
48388 1129823 1121586 1112945 1104508 1096497 1088783 1081399 1074686 1068721 1062995 1057082 1051332 1046368 1042160 1038170
48374 1038170 1034202 1030411 1026561 1022144 1017370 1013308 1010737 1009472 1009058 1009461 1010693 1012338 1013908 1015344
48360 1015344 1016773 1018122 1019296 1020469 1021827 1023224 1024262 1024500 1023569 1021480 1018925 1016838 1015536 1014699 1014164
48345 1014164 1014073 1014129 1013538 1012087 1010514 1009298 1007892 1005799 1003800 1003157 1003962 1005100 1005683 1005715 1005453 1004855 1003879
48328 1003879 1002835 1002223 1002359 1003177 1004293 1005449 1006973 1009458 1012812 1016100 1018635 1020700 1022694 1024102 1023959
48313 1023959 1022010 1018666 1014119 1008298 1001685 995377 990104 985633 981323 976914 972733 969414 967506 967114
48299 967114 967942 969767 972672 976589 980982 985365 989972 995514 1002441 1010733 1020219 1030708 1041968 1053871
48285 1053871 1066386 1079205 1091759 1103962 1116608 1130514 1145541 1160888 1176117 1191442 1207266
48274 1207266 1223879 1241380 1259531 1277971 1296934 1317377 1339977 1364391 1389917 1416413 1444059
48263 1444059 1472765 1502443 1533309 1564986 1595629 1622732 1644674 1661062 1672164 1678970 1683481 1688020
48251 1688020 1694174 1702743 1714153 1728280 1744508 1762813 1784249 1809537 1837945 1868631 1902354 1940570
48239 1940570 1983470 2030329 2081315 2137544 2199805 2268786 2346136 2433754 2532424 2642847 2767781
48228 2767781 2911823 3079956 3278483 3516960 3807131 4160686 4590740 5114994 5754319
48219 5754319 6528422 7456680 8564468 9885529 11453378 13279509 15314883 17402728
48211 17402728 19262447 20552553 21004491 20543056 19306039 17559725 15585111 13604376
48203 13604376 11759084 10117230 8692771 7471052 6430137 5549450 4809393 4190882
48195 4190882 3676520 3250391 2897345 2604140 2360575 2158092 1988224 1843803 1720627
48186 1720627 1616204 1527440 1450844 1384205 1326463 1276255 1231832 1192097 1156642 1124915 1096189
48175 1096189 1070077 1046393 1024823 1005230 987820 972489 958597 945890 934993 926406 919711 914349
48163 914349 910437 908262 907731 908962 912445 917790 923103 926373 926692 923518 916025 904424 890868 877579
48149 877579 864745 851623 838949 828511 820722 814341 808538 803629 799644 795723 791351 787022 783237
48136 783237 779870 776934 775019 774492 774977 775982 777419 779257 781304 783571 786245 789076 791391 792883 793910
48121 793910 794912 796116 797795 800082 802451 804198 805675 808303 813027 819348 826156 832897 839607 846408
48107 846408 853424 860838 868791 877522 887626 899623 913170 927306 941653 956666 972572 988831
48095 988831 1005034 1021566 1038846 1056511 1073962 1091169 1108383 1125536 1142521 1159629 1177033
48084 1177033 1194176 1210360 1225703 1240852 1255889 1270208 1283417 1295782 1307696 1319244 1330428
48073 1330428 1341397 1352328 1363359 1374656 1386200 1397453 1407676 1416846 1425990 1436244 1447608 1458837
48061 1458837 1468635 1476759 1483820 1490098 1495044 1498169 1500005 1501491 1502408 1501126 1496274 1488156 1478083 1466759
48047 1466759 1454025 1440058 1426000 1412974 1400728 1387609 1371961 1353527 1333538 1313508 1294015
48036 1294015 1274698 1255144 1235416 1215719 1196013 1176201 1156394 1136689 1116931 1096973 1076955
48025 1076955 1057099 1037408 1017858 998669 980111 962218 945015 928790 913766 899734 886468
48014 886468 874328 863876 854904 846482 838058 829984 822731 816108 809637 803334 797702 793084 789347 786144
48000 786144 783274 780841 779136 778362 778455 779365 781385 784812 789217 793529 797100 800308 803752 807226 810029
47985 810029 812065 814008 816362 818909 821235 823270 825020 826196 826499 826177 825961 826466 827825 829761 831794
47970 831794 833405 834257 834324 833765 832728 831321 829681 827970 826402 825279 824817 824836 824859 824738 824879 825538 826156
47953 826156 825964 825147 824846 825885 828064 830877 834307 838469 842962 847238 851383 855964 861170 866684 872357
47938 872357 878443 885016 891650 897941 903944 909864 915618 921015 926122 931086 935710 939545 942404 944511
47924 944511 946053 946698 945710 942573 937494 931222 924363 916943 908719 899703 890152 880156 869626 858715
47910 858715 847913 837619 827896 818770 810407 802785 795540 788475 782025 776844 773072 770303 768197 766744
47896 766744 765974 765834 766463 768284 771580 776142 781458 787110 792879 798636 804374 810378 817172 825141 834177
47881 834177 843692 853037 861915 870428 878814 887173 895368 903086 910049 916234 921853 926940 931040 933526
47867 933526 934197 933363 931312 928067 923734 918688 913157 906894 899569 891345 882775 874325 866236 858649 851493
47852 851493 844397 837126 830038 823664 817900 812077 805972 800296 796041 793684 793207 794435 797006 800238
47838 800238 803509 806757 810457 815164 821181 828402 836202 843673 850344 856583 862978 869339 874801 879031
47824 879031 882865 887428 892910 898645 904251 910198 917161 925252 934277 944480 956624 971306 988454
47811 988454 1007646 1028685 1051667 1076480 1102430 1128523 1154137 1179221 1203585 1226119 1245141
47800 1245141 1259711 1270169 1277009 1279576 1276523 1267422 1253236 1235179 1213921 1190213 1165536 1141438
47788 1141438 1118555 1096828 1076394 1057754 1041281 1027157 1015664 1006958 1000629 995987 992755 990990
47776 990990 990314 989846 989001 987887 986767 985601 984311 983038 981896 980789 979707 978866 978351 977832 976846 975162
47760 975162 972839 970206 967951 966821 967001 968005 969291 970734 972435 974489 977163 980856 985491 990254
47746 990254 994324 997723 1001182 1005348 1010366 1016002 1021836 1027479 1032943 1038751 1045525 1053562 1062941 1073771
47732 1073771 1086118 1099782 1114345 1129276 1143944 1157898 1171206 1184119 1196182 1206203 1213481
47721 1213481 1218512 1221997 1223707 1223017 1220100 1215630 1209498 1200817 1189347 1176005 1161649 1146096 1128766
47708 1128766 1109777 1089956 1070186 1051076 1032943 1015744 999299 983851 970134 958664 949286
47697 949286 941704 936041 932448 930409 929014 927915 927588 928582 930840 933889 937484 941904 947693 955224 964532
47682 964532 975484 987926 1001554 1015723 1029680 1043058 1056005 1068790 1081470 1093927 1105983
47671 1105983 1117291 1127266 1135341 1141319 1145436 1148159 1149846 1150389 1149114 1145238 1138495 1129271 1118151 1105565
47657 1105565 1091916 1077714 1063400 1049191 1035243 1021846 1009362 998003 987725 978253 969284 960931
47645 960931 953958 949345 947516 948137 950659 954759 960279 967141 975497 985668 997807 1011878 1028071
47632 1028071 1046860 1068540 1093077 1120598 1151557 1186149 1223944 1264398 1307270 1352084 1397585
47621 1397585 1442319 1485460 1526563 1564710 1598455 1626453 1647542 1660399 1663886 1657883 1643264 1620915
47609 1620915 1591309 1555171 1513892 1468960 1421347 1371772 1321238 1270929 1221792 1174504 1129696
47598 1129696 1087950 1049566 1014464 982264 952497 924889 899482 876350 855267 835874 818166
47587 818166 802427 788634 776231 764642 753781 743959 735492 728432 722329 716233 709384 702127 695757
47574 695757 691183 688046 685372 682675 680043 677500 674905 672330 669999 667809 665336 662373 659158 656027
47560 656027 653222 651058 649852 649397 648843 647422 645252 643203 642002 641650 641665 641726 641962 642739 644336 646855
47544 646855 650282 654525 659369 664539 669728 674507 678305 680815 682465 684198 686527 688982 690602 690878
47530 690878 690053 688746 687567 686998 687236 688014 688772 689143 689270 689620 690466 691462 691753 690769 689022 687836 688018
47513 688018 689086 690139 691157 692852 695395 698054 700197 701935 703391 704086 703676 702780 702325 702226 701494 699644
47497 699644 697278 695143 693250 691184 688748 685904 682488 678476 674359 670910 668672 667845 668352 669650 670783
47482 670783 671129 671078 671543 672852 674612 676550 678937 682028 685599 689324 693167 697104 700824 704067 707066
47467 707066 710333 714143 718464 723067 727391 730582 732165 732549 732549 732570 732606 732740 733068 733292 733033 732602 732856 734278
47449 734278 736855 740911 747197 755817 765862 776769 789393 804909 823092 842633 863016 885082
47437 885082 909556 935890 963027 990687 1019220 1048430 1077091 1103685 1127270 1147511 1164173
47426 1164173 1176819 1185033 1188780 1188485 1184801 1178447 1170182 1160632 1149952 1137905 1124552 1110719 1097454
47413 1097454 1085091 1073179 1061246 1049250 1037237 1025025 1012529 1000051 987944 976150 964393
47402 964393 952749 941726 931777 922991 915296 908751 903426 899052 894997 890768 886583 883288 881613 881552
47388 881552 882577 884324 886839 890211 894417 899716 906835 916307 927658 939562 950903 961486 971746
47375 971746 981994 992079 1001497 1009610 1015813 1019769 1021516 1021264 1019063 1014783 1008420 1000285 990838 980365
47361 980365 968890 956269 942339 927062 910646 893513 876074 858588 841329 824793 809555
47350 809555 795868 783494 771958 760931 750424 740701 731965 724046 716521 709251 702601 696868 691754
47337 691754 686823 682393 679329 677853 677219 676817 676975 678166 680036 681944 684125 687456 692099 697091 701398
47322 701398 704764 707466 709865 712431 715666 719604 723662 727159 729704 731027 730935 729679 727875 725769 723002
47307 723002 719405 715631 712562 710395 708721 707188 705697 704171 702625 701393 700900 701305 702558 704537 706875
47292 706875 709063 711207 714373 719504 726214 733312 740429 748312 757459 767295 777062 786804 796951 807426
47278 807426 817770 827851 837869 847769 857170 865850 873964 881698 888994 895647 901497 906484 910697
47265 910697 914350 917526 920020 921605 922394 922668 922340 920908 918072 914152 909680 904727 898905 892054 884661
47250 884661 877500 871024 865236 860082 855705 852258 849646 847629 846120 845234 845037 845359 845890 846452 847163 848319
47234 848319 850081 852296 854743 857619 861614 867310 874591 882826 891620 901114 911523 922598 933745
47221 933745 944608 955408 966756 979165 992534 1005926 1017930 1027481 1034500 1039661 1043539 1046002
47209 1046002 1046517 1044900 1041563 1036963 1030968 1023062 1013217 1002346 991698 981881 972661 963655 955015 947310
47195 947310 940945 935880 931948 929320 928538 930117 934169 940452 948713 958913 971193 985764 1002807
47182 1002807 1022232 1043394 1065110 1086066 1105208 1121896 1136014 1148186 1159664 1171737 1185140
47171 1185140 1200029 1216247 1233379 1250679 1267269 1282466 1295835 1307040 1315863 1322282 1326344 1328019
47159 1328019 1327367 1324676 1320184 1313769 1305237 1294858 1283272 1270896 1257752 1243859 1229406 1214600
47147 1214600 1199724 1185405 1172310 1160474 1149386 1138938 1129829 1122730 1117500 1113616 1111011 1110020 1110717
47134 1110717 1112745 1115713 1119432 1123919 1129500 1136679 1145436 1154722 1163121 1170050 1175981 1181439 1186097 1188921
47120 1188921 1188975 1186040 1180676 1173733 1165665 1156361 1145772 1134511 1123480 1112948 1102358 1091026 1078783
47107 1078783 1065979 1053271 1041371 1030555 1020256 1009524 998065 986502 975459 964804 954118
47096 954118 943531 933634 924711 916545 908966 902194 896484 891752 887757 884519 882366 881595 882202 883945
47082 883945 886541 889769 893427 897364 901594 906313 911636 917340 922908 927844 931903 935107 937698 940023
47068 940023 942186 943800 944293 943590 942266 940815 939033 936453 933293 930514 928795 927792 926722 925474 924768
47053 924768 925211 926635 928553 930975 934424 939223 945156 951893 959459 968103 977871 988423 999177 1009531
47039 1009531 1019168 1028277 1037325 1046449 1055226 1063187 1070358 1077137 1083917 1091104 1099169 1108129 1117098 1124959
47025 1124959 1131597 1137984 1144919 1152266 1159637 1167201 1175254 1183308 1190206 1195052 1197637 1198121 1196826 1194340
47011 1194340 1191257 1187589 1182797 1176611 1169573 1162560 1155972 1149590 1143082 1136437 1129980 1124180 1119391 1115622
46997 1115622 1112576 1110024 1108099 1107109 1107114 1107845 1109069 1110856 1113404 1116756 1120764 1125367 1130815 1137566 1145882
46982 1145882 1155483 1165676 1175990 1186682 1198398 1211297 1224771 1238189 1251665 1265781 1280671
46971 1280671 1295775 1310465 1324484 1337719 1350031 1361586 1372923 1384199 1394676 1403507 1410855 1417599
46959 1417599 1423892 1428701 1431128 1431673 1431660 1431720 1431385 1430122 1428206 1426362 1424934 1423745 1422712 1422273 1423104 1425491
46943 1425491 1429156 1433703 1439108 1445633 1453256 1461364 1469104 1476039 1482446 1489043 1496424 1504699 1513594 1522883
46929 1522883 1532629 1542972 1553713 1564307 1574291 1583608 1592426 1600733 1608124 1613883 1617200 1617520 1614838
46916 1614838 1609682 1602656 1593958 1583369 1570752 1556531 1541655 1527081 1513288 1500287 1487994 1476469
46904 1476469 1465866 1456470 1448878 1443851 1441698 1441994 1444167 1448231 1454605 1463393 1474339 1487459 1503191
46891 1503191 1521724 1542612 1565229 1589228 1614273 1639742 1665040 1689964 1714394 1737869 1759838
46880 1759838 1780197 1799163 1816643 1831998 1844457 1853599 1859552 1862984 1864860 1866061 1867193 1868718 1870957
46867 1870957 1873864 1877146 1880928 1885951 1892813 1901290 1910864 1921626 1934124 1948496 1964329 1981240 1998952
46854 1998952 2016757 2033604 2049020 2063508 2077740 2091665 2104521 2115352 2123365 2128240 2130452 2131033
46842 2131033 2130724 2129452 2126670 2121960 2115227 2106715 2097049 2087056 2077367 2068361 2060443 2053986 2049000 2045423
46828 2045423 2043849 2045300 2049894 2056435 2063912 2072893 2084779 2100016 2117694 2136586 2155823 2174784
46816 2174784 2193211 2211425 2229635 2246981 2262032 2274305 2284487 2292950 2298985 2301985 2302567 2301789 2299858
46803 2299858 2296402 2291489 2285471 2278051 2268545 2257115 2244913 2232809 2220798 2208988 2198298 2189514
46791 2189514 2182155 2174994 2167524 2160345 2154230 2149421 2145794 2143130 2141047 2139181 2137701 2137341 2138647 2141360
46777 2141360 2144627 2147529 2149310 2149539 2148513 2147248 2146706 2147125 2148354 2150559 2154055 2158577 2163363 2168149 2173615
46762 2173615 2180609 2189306 2199368 2210617 2223219 2237431 2253432 2271244 2290532 2310609 2330831 2350917
46750 2350917 2370793 2390384 2409762 2429187 2448656 2467603 2485297 2501317 2515335 2526799 2535459
46739 2535459 2542018 2547623 2552656 2556624 2559281 2561154 2562718 2563717 2563759 2563129 2562535 2562424 2563082 2565064 2568906 2574503
46723 2574503 2581260 2588790 2597012 2605654 2614240 2622601 2630880 2638865 2645749 2650786 2653864 2655220 2654825 2652267
46709 2652267 2646997 2638514 2626521 2611135 2592801 2571861 2548377 2522394 2494182 2464068 2432346 2399537
46697 2399537 2366413 2333440 2300447 2267232 2234251 2202278 2171509 2141534 2112181 2083929 2057312
46686 2057312 2032422 2009161 1987569 1967558 1948600 1930128 1912165 1895233 1879648 1865105 1850998
46675 1850998 1837003 1823405 1810983 1800426 1791668 1783824 1776003 1768211 1761294 1756075 1752832 1751612 1752619
46662 1752619 1755943 1761127 1767437 1774599 1782956 1792776 1803753 1815388 1827499 1839938 1851952 1862423
46650 1862423 1870886 1877888 1884098 1889431 1893363 1895750 1896807 1896550 1894848 1892113 1889389 1887608 1887195 1888448
46636 1888448 1891824 1897563 1905509 1915645 1928429 1944231 1962760 1983410 2005916 2030157 2055545 2081148
46624 2081148 2106375 2130998 2154554 2176186 2195119 2210786 2222464 2229343 2231269 2228994 2223356 2214527
46612 2214527 2202347 2187082 2169407 2149784 2128312 2105200 2081022 2056387 2031604 2006901 1982809
46601 1982809 1960115 1939285 1920062 1901771 1884091 1867462 1852642 1839905 1828736 1818212 1807630
46590 1807630 1796883 1786438 1776910 1768451 1760515 1752282 1743328 1733806 1724189 1715015 1706690 1699135 1691674
46577 1691674 1683655 1675258 1667355 1660565 1654824 1649938 1646042 1643181 1640876 1638541 1636207 1634469 1633792 1634124
46563 1634124 1635077 1636282 1637633 1639367 1641761 1644670 1647634 1650660 1654505 1659797 1666044 1672085 1677472 1682936
46549 1682936 1689449 1697298 1706214 1715967 1726478 1737607 1749143 1760991 1773167 1785712 1798800 1812788
46537 1812788 1828003 1844440 1861834 1880022 1899135 1919391 1940857 1963565 1987834 2014245 2043117
46526 2043117 2074065 2106270 2139224 2173069 2208194 2244659 2282058 2319698 2356682 2392021 2425005
$$ [...]
##END NTUPLES=NMR SPECTRUM
##END=
