##TITLE=AC1720_SALAH15006_9207540_TxWVUnM79i
##JCAMPDX= 6.0         $$ Bruker NMR JCAMP-DX V2.0
##DATA TYPE= NMR SPECTRUM
##DATA CLASS= NTUPLES
##ORIGIN= BRUKER
##OWNER= Administrator
$$ 1.72 TOPSPIN		Version 2.1
$$ 2015-06-01 16:09:10.951 -0700  Administrator@X
$$ Compression mode = diff/dup
##.OBSERVE FREQUENCY= 400.02188249412
##.OBSERVE NUCLEUS= ^1H
##.ACQUISITION MODE= SIMULTANEOUS (DQD)
##.ACQUISITION SCHEME= undefined
##.AVERAGES= 8
##.DIGITISER RES= 22
##SPECTROMETER/DATA SYSTEM= spect
##.PULSE SEQUENCE= zg30
##.SOLVENT NAME= COFFEE_meoh
##.SHIFT REFERENCE= INTERNAL, COFFEE_meoh, 1, 14.98509
##AUDIT TRAIL= $$ (NUMBER, WHEN, WHO, WHERE, PROCESS, VERSION, WHAT)
$$ ##TITLE= Audit trail, TOPSPIN		Version 2.1
$$ ##JCAMPDX= 5.01
$$ ##ORIGIN= Bruker BioSpin GmbH
$$ ##OWNER= Administrator
$$ $$ E:\/data/COFFEE/nmr/AC1720_SALAH15006_9207540_TxWVUnM79i/10/pdata/1/auditp.txt
$$ ##AUDIT TRAIL=  $$ (NUMBER, WHEN, WHO, WHERE, PROCESS, VERSION, WHAT)
(   1,<2015-06-01 16:09:03.623 -0700>,<Administrator>,<X>,<go>,<TOPSPIN 2.1>,
      <created by zg
	started at 2015-06-01 16:07:57.889 -0700,
	POWCHK enabled, PULCHK disabled,
       configuration hash MD5:
       21 0F 79 D6 B3 7B B4 F6 88 20 88 DB 03 48 BD 9F
       data hash MD5: 64K
       B9 11 5A EF A4 B1 52 B4 10 9D 5F AE 02 0F 16 FA>)
(   2,<2015-06-01 16:09:06.983 -0700>,<Administrator>,<X>,<proc1d>,<TOPSPIN 2.1>,
      <Start of raw data processing
       efp LB = 0 FT_mod = 6 PKNL = 1 PHC0 = 0 PHC1 = 0 SI = 32K 
       data hash MD5: 32K
       52 28 FB 90 E2 66 FD AE F7 AF 5C D6 A4 B3 16 89>)
(   3,<2015-06-01 16:09:07.264 -0700>,<Administrator>,<X>,<proc1d>,<TOPSPIN 2.1>,
      <pk PHC0 = 91.4447 PHC1 = 0 
       data hash MD5: 32K
       18 E8 09 E0 78 4F 4B D5 DE D3 C5 6A FB 8F 30 FE>)
(   4,<2015-06-01 16:09:07.358 -0700>,<Administrator>,<X>,<proc1d>,<TOPSPIN 2.1>,
      <abs ABSG = 1 
       data hash MD5: 32K
       C4 05 2C 76 72 5A 65 98 AA 71 81 F8 07 6C 34 40>)
(   5,<2015-06-01 16:09:07.420 -0700>,<Administrator>,<X>,<proc1d>,<TOPSPIN 2.1>,
      <abs ABSG = 2 
       data hash MD5: 32K
       A2 5D 10 99 25 41 34 D1 99 AA 68 E9 A8 78 A5 B7>)
(   6,<2015-06-01 16:09:07.483 -0700>,<Administrator>,<X>,<proc1d>,<TOPSPIN 2.1>,
      <abs ABSG = 3 
       data hash MD5: 32K
       0F A7 9C 52 A1 54 94 68 5E 00 45 34 17 85 34 66>)
(   7,<2015-06-01 16:09:07.530 -0700>,<Administrator>,<X>,<proc1d>,<TOPSPIN 2.1>,
      <abs ABSG = 4 
       data hash MD5: 32K
       8A 0A 80 B2 3D 40 BB 29 BF BA 5F E6 BB C4 89 1C>)
(   8,<2015-06-01 16:09:07.592 -0700>,<Administrator>,<X>,<proc1d>,<TOPSPIN 2.1>,
      <abs ABSG = 5 
       data hash MD5: 32K
       0F EB C2 5C C8 BC A7 0F D1 F6 8F 0D 39 DD 2A AF>)
$$ ##END=
$$ 
$$ $$ hash MD5
$$ $$ 08 03 0A C4 4F 0D 95 5E 51 F6 6C E7 8F E4 F8 A7
##$RELAX= 
##$RELAX= 
##$RELAX= 
##$RELAX= 
##$RELAX= 
##$RELAX= 
##$RELAX= 
$$ Bruker specific parameters
$$ --------------------------
##$DU= <E:\>
##$EXPNO= 10
##$NAME= <AC1720_SALAH15006_9207540_TxWVUnM79i>
$$ [...]
150 150 150 150 150 150 150 150
##$TP07= 0
##$TPNAME0= <>
##$TPNAME1= <>
##$TPNAME2= <>
##$TPNAME3= <>
##$TPNAME4= <>
##$TPNAME5= <>
##$TPNAME6= <>
##$TPNAME7= <>
##$TPOAL= (0..7)
0.5 0.5 0.5 0.5 0.5 0.5 0.5 0.5
##$TPOFFS= (0..7)
0 0 0 0 0 0 0 0
##$TUNHIN= 0
##$TUNHOUT= 0
##$TUNXOUT= 0
##$USERA1= <user>
##$USERA2= <user>
##$USERA3= <user>
##$USERA4= <user>
##$USERA5= <user>
##$V9= 5
##$VALIST= <valist>
##$VCLIST= <CCCCCCCCCCCCCCC>
##$VD= 0
##$VDLIST= <DDDDDDDDDDDDDDD>
##$VPLIST= <PPPPPPPPPPPPPPP>
##$VTLIST= <TTTTTTTTTTTTTTT>
##$WBST= 2048
##$WBSW= 25
##$XGAIN= (0..3)
0 0 0 0
##$XL= 0
##$YL= 0
##$YMAX_a= 584272
##$YMIN_a= -496883
##$ZGOPTNS= <>
##$ZL1= 120
##$ZL2= 120
##$ZL3= 120
##$ZL4= 120
##$ABSF1= 14.98509
##$ABSF2= -5.573092
##$ABSG= 5
##$ABSL= 3
##$ALPHA= 0
##$AQORDER= 0
##$ASSFAC= 0
##$ASSFACI= 0
##$ASSFACX= 0
##$ASSWID= 0
##$AUNMP= <proc_prof1d_extract_pilot.lims>
##$AXLEFT= 0
##$AXNAME= <>
##$AXNUC= <1H>
##$AXRIGHT= 0
##$AXTYPE= 0
##$AXUNIT= <>
##$AZFE= 0.1
##$AZFW= 0.1
##$BCFW= 0
##$BC_mod= 0
##$BYTORDP= 0
##$COROFFS= 0
##$CY= 15
##$DATMOD= 1
##$DC= 0
##$DFILT= <>
##$DTYPP= 0
##$F1P= 0
##$F2P= 0
##$FCOR= 0.5
##$FTSIZE= 32768
##$FT_mod= 6
##$GAMMA= 0
##$GB= 0
##$INTBC= 1
##$INTSCL= 1
##$ISEN= 128
##$LB= 0
##$LEV0= 0
##$LPBIN= 0
##$MAXI= 10000
##$MC2= 0
##$MEAN= 0
##$ME_mod= 0
##$MI= 0
##$NCOEF= 0
##$NC_proc= -8
##$NLEV= 6
##$NOISF1= 0
##$NOISF2= 0
##$NSP= 0
##$NTH_PI= 0
##$NZP= 0
##$OFFSET= 14.98509
##$PC= 1
##$PHC0= 91.4447
##$PHC1= 0
##$PH_mod= 1
##$PKNL= yes
##$PPARMOD= 0
##$PPDIAG= 0
##$PPIPTYP= 0
##$PPMPNUM= 2147483647
##$PPRESOL= 1
##$PSCAL= 4
##$PSIGN= 0
##$PYNMP= <proc.py>
##$REVERSE= no
##$SF= 400.02
##$SI= 32768
##$SIGF1= 0
##$SIGF2= 0
##$SINO= 400
##$SIOLD= 32768
##$SPECTYP= <>
##$SREGLST= <1H.CDCl3>
##$SSB= 0
##$STSI= 32768
##$STSR= 0
##$SW_p= 8223.68421052631
##$SYMM= 0
##$S_DEV= 0
##$TDeff= 65536
##$TDoff= 0
##$TI= <>
##$TILT= no
##$TM1= 0
##$TM2= 0
##$TOPLEV= 0
##$USERP1= <user>
##$USERP2= <user>
##$USERP3= <user>
##$USERP4= <user>
##$USERP5= <user>
##$WDW= 1
##$XDIM= 32768
##$YMAX_p= 426207480
##$YMIN_p= -782009
##$CURPLOT= <Network HP LaserJet P1505>
##$CURPRIN= <$Network HP LaserJet P1505>
##$DFORMAT= <normdp>
##$LAYOUT= <+/1D_H.xwp>
##$LFORMAT= <normlp>
##$PFORMAT= <normpl>
##$SURQMSG= 1
$$ End of Bruker specific parameters
$$ ---------------------------------
##NTUPLES= NMR SPECTRUM
##VAR_NAME=  FREQUENCY,     SPECTRUM/REAL,   SPECTRUM/IMAG
##SYMBOL=    X,             R,               I
##VAR_TYPE=  INDEPENDENT,   DEPENDENT,       DEPENDENT
##VAR_FORM=  AFFN,          ASDF,            ASDF
##VAR_DIM=   32768,         32768,           32768
##UNITS=     HZ,            ARBITRARY UNITS, ARBITRARY UNITS
##FACTOR=    0.250966925370066, 1,           1
##FIRST=     8223.43324360094, -98312,       -179913
##LAST=      0,             11870,           -89846
##MIN=       0,             -782009,         0
##MAX=       8223.43324360094, 426207480,    0
$$ Real data points
##PAGE= N=1
##DATA TABLE= (X++(R..R)), XYDATA
$$ [...]
19547e4247B21163H5061a91546f1257a5932j74772l76464a35250j37784a01801
$$ -54247 221163 85061 -191546 -61257 -15932 -190704 -567168 -135250 -273034 -101801
19536g1664c1042k24044K1777j02007g1978j1989B33297n9341A102b57698I6076
$$ -71664 -31042 -255086 -233309 -335316 -71978 -83967 233297 173956 1102 -257698 96076
19524b25518b4884E9659b09608r369N4012N4427j84309A98710a4149A47565p1365
$$ -225518 -24884 59659 -209608 -218977 -164965 -110538 -294847 198710 -14149 147565 76200
19513G6200d88295A45807D5884a95824d5081B03267B5098c1391B25457G1281J99306
$$ 76200 -488295 145807 45884 -195824 -45081 203267 25098 -31391 225457 71281 270587
19502B70587A22489j7715i8606G2917J0431f4496b0485A16765g3987j8550E4868
$$ 270587 122489 104774 -98606 72917 83348 -64496 -20485 116765 -73987 -92537 54868
19490b48371A65071a83673k12451g1898A18598P0294l0225i4701B17148f1054
$$ -248371 165071 -183673 -396124 -71898 118598 188892 158667 -94701 217148 -61054
19479B30297a38445K2918r2155b383A10278h2345c5323k38088j8326q3930h155
$$ 230297 -138445 -115527 -207682 -2383 110278 -82345 -35323 -273411 -291737 -375667 -8155
19467e020k6324B59818a75697b0334A74109m1143h6223K9973k35838a1380k56467
$$ -5020 -31344 259818 -175697 -20334 174109 132966 -86223 -56250 -292088 -11380 -267847
19456b67847b5489A35742E862i5622A77850b99072d8602j80950k3377A46919a16848
$$ -267847 -25489 135742 5862 -95622 177850 -299072 -48602 -229552 -252929 146919 -116848
19444e9782j03819j75471h6940A84532b70054i2581j36569j0707A36753a32742
$$ -59782 -163601 -339072 -86940 184532 -270054 -92581 -229150 -239857 136753 -132742
19433g9147L673j48369b9390G5390f3642H3628a50479A39256C0390a12848j19003
$$ -79147 -75474 -223843 -29390 75390 -63642 83628 -150479 139256 30390 -112848 -231851
19422b31851A88147c84071a3783A23219Q5127E0428J68951H8657a2497H7737b86625
$$ -231851 188147 -384071 -13783 123219 208346 50428 219379 88657 -12497 87737 -286625
19410a80293J4535k51391A28207a1509j6904j4355B3369R2671b45803g7002m75022
$$ -180293 -165758 -417149 128207 -11509 -28413 -42768 23369 116040 -245803 -77002 -552024
19399e52024a50752j04816B18026P6654a76811B3389K12663b81560a38660G1597
$$ -552024 -150752 -255568 218026 294680 -176811 23389 236052 -281560 -138660 71597
19388C91504b1488H890K59549h7753a6340A26069a17129c8247l11308A19544J5523
$$ 391504 -21488 8890 268439 -87753 -16340 126069 -117129 -38247 -349555 119544 135067
19377A35067h2936j35536F2786a27727L3169A04881J5260b17656q5553B54678
$$ 135067 -82936 -218472 62786 -127727 -94558 104881 120141 -217656 -303209 254678
19366B10267b47568K9228A97351a64885n5467j15817R2389j5468F7791a30874
$$ 210267 -247568 -218340 197351 -164885 -220352 -336169 -243780 -259248 67791 -130874
19355a97863D9291a04370d3365j48116e3610H5103g8334k1579A21184Q8246a44068
$$ -197863 49291 -104370 -43365 -191481 -53610 85103 -78334 -99913 121184 209430 -144068
19343a5759k21387A54430i0036q8564B43009q6986Q6482b97691F7700c00000A19070
$$ -15759 -237146 154430 -90036 -178600 243009 156023 242505 -297691 67700 -300000 119070
19331b54157R0662O271a6300G214c54956A10710j7606g1606q2087C8079J359i3297
$$ -254157 -163495 -157224 -16300 7214 -354956 110710 93104 -71606 -153693 38079 39438 -93297
19318f3741k60271M5272A545b83913j0432A71452D0441L85006F8993d11046a8583
$$ -63741 -324012 -278740 1545 -283913 -294345 171452 40441 425447 68993 -411046 -18583
19306B2136a89821E9035a06009k6121e7425j99420A5318P2409k6126b10567H1628
$$ 22136 -189821 59035 -106009 -132130 -57425 -256845 15318 87727 61601 -210567 81628
19294F9775b69634j34391a60327e115j2791C9205b75685a12768I9667e0172n083
$$ 69775 -269634 -404025 -160327 -5115 -17906 39205 -275685 -112768 99667 -50172 -55255
19283e5255m6260H0063M9843b89250M3967A06655a50597B157a29213a5884j32341
$$ -55255 -101515 80063 129906 -289250 -245283 106655 -150597 2157 -129213 -15884 -148225
19272a48225O2477A90307b48454A04789b65768P1342B4050b44156L9685B3148
$$ -148225 -85748 190307 -248454 104789 -265768 -194426 24050 -244156 -204471 23148
19261a20354A3345K96227n7012a58044l9336O091h1431j40079C2763A4516a01728
$$ -120354 13345 309572 252560 -158044 -197380 -191289 -81431 -221510 32763 14516 -101728
19249c82510E2997Q4939a64517C1456b28390f2711k32896I5409q670J7011b16737
$$ -382510 52997 137936 -164517 31456 -228390 -62711 -295607 95409 86739 103750 -216737
19237c43245f5312j46775L7237m1206B54552F1727A8154a86623A48505a57170
$$ -343245 -65312 -212087 -174850 -216056 254552 61727 18154 -186623 148505 -157170
19226a75117B45462j01889b56452A9439r112b88760a16157E42J04161b27413q4429
$$ -175117 245462 143573 -256452 19439 10327 -288760 -116157 542 104703 -227413 -311842
19215c11842f978A23465a08741r3781N2946j0736I1277A2097h7613C21436a3523
$$ -311842 -6978 123465 -108741 -202522 -149576 -160312 91277 12097 -87613 321436 -13523
19203b08476d8080k98665a56862o3696j2157J1821j36510D7682a30162J6390K02
$$ -208476 -48080 -346745 -156862 -220558 -232715 -220894 -357404 47682 -130162 -113772 -113570
19192a13570A49840c8832A63404h256p4782b7534A03641b5006j26603r4082a15376
$$ -113570 149840 -38832 163404 -8256 -83038 -27534 103641 -25006 -151609 -245691 -115376
19180a420l9819p0378L3182o4743A03929a63736C9668f2428b7675j82995F1695
$$ -1420 -41239 -111617 -78435 -143178 103929 -163736 39668 -62428 -27675 -210670 61695
19168b29014B62358B624g6409l0643j73853J20122D3288R2398J27679j26362c4952
$$ -229014 262358 2624 -76409 -107052 -280905 -160783 43288 135686 263365 137003 -34952
19156a27270E2463K3366N3182o3032i9905j98810A95389A6502a92623a0737p4568
$$ -127270 52463 75829 129011 65979 -99905 -298715 195389 16502 -192623 -10737 -85305
19145h5305m38518c0656l18479J53090b6653D38340b67236K9585g1380r7509c592
$$ -85305 -523823 -30656 -349135 -196045 -26653 438340 -267236 -237651 -71380 -168889 -3592
19133I1893h1700H0512O9880n6207b16867A73863A4766a53444C3093J58147a35390
$$ 91893 -81700 80512 150392 94185 -216867 173863 14766 -153444 33093 191240 -135390
19121D1248b1832j02918D6770F35a2146k03334Q5429k1730A18425m7561a98251
$$ 41248 -21832 -124750 46770 635 -12146 -215480 -130051 -151781 118425 70864 -198251
19109A01362a52003g991j51945j16781a21968l8728A74491A3692J54719n3163
$$ 101362 -152003 -7991 -159936 -276717 -121968 -160696 174491 13692 168411 115248
19099A15248a38559B36447a15083A32300N3078a37209O0853m03072f0006b6806
$$ 115248 -138559 236447 -115083 132300 185378 -137209 -76356 -479428 -60006 -26806
19088a51162E2562b63282j1879a03212E9359b5569o1513L4999k06592k0275J26470
$$ -151162 52562 -263282 -275161 -103212 59359 -25569 -87082 -52083 -258675 -278950 -152480
19077a52480m28610b10133c6538j03011G9264i0286H1964a13751J5938k31843
$$ -152480 -581090 -210133 -36538 -139549 79264 -90286 81964 -113751 -97813 -329656
19067c29656B27574h4601A5961L8175A4533f8148k12847c2298l2952o6138E8706
$$ -329656 227574 -84601 15961 54136 14533 -68148 -280995 -32298 -65250 -131388 58706
19055A13818D8977b0639k03833m6295b4122H2020i4278K9174l5734K3816N581
$$ 113818 48977 -20639 -224472 -270767 -24122 82020 -94278 -65104 -100838 -77022 -71441
19044g1441C15877g6331L4355a6154A08182J06097E9694b7746F3885J53607k9605
$$ -71441 315877 -76331 -41976 -16154 108182 214279 59694 -27746 63885 217492 187887
19033A87887h5516m3845A0924J76308n3097f573n6100b1386B09410J14614j39360
$$ 187887 -85516 -129361 10924 187232 134135 -6573 -62673 -21386 209410 324024 184664
19022A84664d9592o0461I504h0047l9064h813j10923o9099j23040J24638a2676
$$ 184664 -49592 -110053 9504 -80047 -119111 -8813 -119736 -188835 -311875 -187237 -12676
19010B65146a73034A53983e3577A17072a08421C05350i6488c3561j10405O4425
$$ 265146 -173034 153983 -53577 117072 -108421 305350 -96488 -33561 -143966 -79541
19000g9541r6865B14814b22986h8477n5528A44193b56629I522K58147a5233j46060
$$ -79541 -176406 214814 -222986 -88477 -144005 144193 -256629 9522 267669 -15233 -161293
18989a61293o8715P2239K8625n9291r0600E6169a26012K3781A81071q7967N8910
$$ -161293 -230008 -157769 -129144 -188435 -279035 56169 -126012 -102231 181071 93104 152014
18978A52014l9946a04078j40938N4100h76I0708j7101d3534n6o6166j6850E12179
$$ 152014 112068 -104078 -245016 -190916 -876 90708 73607 -43534 -43590 -109756 -126606 512179
18965A46977a1087l28805E3482K76507g8320m4461k04719F0676K22382e8819r2100
$$ 146977 -11087 -339892 53482 329989 -78320 -122781 -327500 60676 283058 -58819 -150919
18954a50919f8536A81240g1840B2626i6055k30481H9682J41751D4466K335b6032
$$ -150919 -68536 181240 -71840 22626 -96055 -326536 89682 231433 44466 46801 -26032
18942a3621r8418j90979F7432A6171i6585M5699n0442m1454p8416O5509C2628
$$ -13621 -112039 -303018 67432 16171 -96585 -50886 -101328 -142782 -221198 -155689 32628
18930H188J63917d0635m6813o0448b2839l67F627g1556p128n0958B40210a64323
$$ 8188 172105 -40635 -87448 -147896 -22839 -23206 6627 -71556 -78684 -129642 240210 -164323
18917C5336J06209n9244f1941C0358b27743Q5358p5688j11179J35272e979o3914
$$ 35336 141545 82301 -61941 30358 -227743 -142385 -218073 -329252 -193980 -5979 -69893
18906f9893l56816J96424b344j59648m5337B56910a95006A06760e8478k49370
$$ -69893 -426709 -230285 -2344 -161992 -207329 256910 -195006 106760 -58478 -307848
18896c07848b0233B33448a3972j63628C5689L4747G031J00122i7637b3019B2370
$$ -307848 -20233 233448 -13972 -177600 35689 70436 7031 107153 -97637 -23019 22370
18884I8833a45437A69845k8607e27r8347o2071H9876M9903a29335c8828r8623
$$ 98833 -145437 169845 141238 -527 -98874 -160945 89876 139779 -129335 -38828 -137451
18873a37451k80744a37633b8097r8670j0567M3128E0374c14202a14944k4258A97877
$$ -137451 -418195 -137633 -28097 -126767 -137334 -94206 50374 -314202 -114944 -139202 197877
18861A80148b2416j22878A12498b09818K8540f8633o25380f789B05782A1593b66643
$$ 180148 -22416 -145294 112498 -209818 -181278 -68633 -694013 -6789 205782 11593 -266643
18849A22819A6088a83695p7935A10618e1565C05923a4560C18Q208i4900e4r3187
$$ 122819 16088 -183695 -261630 110618 -51565 305923 -14560 318 8526 -94900 -54 -93241
18837i3241H2285f976M75j74663E62h1968E6382j9724j4776a37042p8141l2752
$$ -93241 82285 -6976 -6501 -181164 562 -81968 56382 36658 21882 -137042 -215183 -247935
18825b47935Q2747K7682j84952R8955A01578D2300h1423A95934H678a66796P5138
$$ -247935 -165188 -137506 -322458 -223503 101578 42300 -81423 195934 8678 -166796 -91658
18814i1658B37372p8070e9542C28481b55571A01315b68154A6639a16848A06311
$$ -91658 237372 159302 -59542 328481 -255571 101315 -268154 16639 -116848 106311
18803I9911c14273A22093f1949k15331A41191g4413q6985L5171A06188J00689
$$ 99911 -314273 122093 -61949 -277280 141191 -74413 -161398 -126227 106188 206877
18793B06877G342a5264j71260e1999p9375A58538b28273N0416j55825a7758F411
$$ 206877 7342 -15264 -186524 -51999 -131374 158538 -228273 -177857 -333682 -17758 6411
18781a11072L4246j23016L0120H2266C8800a50503e9880G6490a10505o721A40652
$$ -111072 -76826 -199842 -169722 82266 38800 -150503 -59880 76490 -110505 -117226 140652
18769i3881B0801a34532B6439L2248M9950a79230f8378j48766O9455G6371A3807
$$ -93881 20801 -134532 26439 58687 108637 -179230 -68378 -217144 -147689 76371 13807
18757A25972a48675o751B9153L5306b28364E5879b30601i3517M6650j94276L9434
$$ 125972 -148675 -155426 29153 64459 -228364 55879 -230601 -93517 -46867 -241143 -201709
18746b01709h4516I8719a26522D766i2259m97788B29919G0478f7071k43654j0191
$$ -201709 -84516 98719 -126522 4766 -92259 -590047 229919 70478 -67071 -310725 -320916
18735c20916B64666I4725h5751B64718a90031N3911j4434H2414B8450K03172a7183
$$ -320916 264666 94725 -85751 264718 -190031 -136120 -150554 82414 28450 231622 -17183
18723b16948e3136H0421B6076a04474a3065j5508H4612P3435o1595b42197e096
$$ -216948 -53136 80421 26076 -104474 -13065 -28573 84612 158047 96452 -242197 -5096
18711d1459j86215c3823n7820B17210g0178A30765d6764j43220J682A16213M7353
$$ -41459 -227674 -33823 -91643 217210 -70178 130765 -46764 -189984 -188302 116213 163566
18700A63566P5401b05723g047l6487D6778c64793J34489l9901A56956g9251r2255
$$ 163566 238967 -205723 -7047 -43534 46778 -364793 -230304 -270205 156956 -79251 -171506
18689a71506h0721k05557G1176g5944j045k06335I0937a04623A57873i1473I7559
$$ -171506 -80721 -286278 71176 -75944 -76989 -283324 90937 -104623 157873 -91473 97559
18677A69617k5412b32541A6938B400c2519l20444A0786d0336j52500h1183j74103
$$ 169617 144205 -232541 16938 2400 -32519 -352963 10786 -40336 -192836 -81183 -255286
18666b55286A9471d5008l57347A64035F4271H584F6h1639a1022l96001A74695
$$ -255286 19471 -45008 -402355 164035 64271 8584 66 -81639 -11022 -407023 174695
18654A11283b69001J30221D2008e694G7464J74346a03424m1317m541A38730b18121
$$ 111283 -269001 -138780 42008 -5694 77464 251810 -103424 -144741 -149282 138730 -218121
18642C06765o4900d2438B02116b67403a10472B37875B1815K02796p4091g5336
$$ 306765 241865 -42438 202116 -267403 -110472 237875 21815 224611 150520 -75336
18631f4740j38212K1056l72493B62522D0771a62164L6771A2123a43357A36610
$$ -64740 -202952 -181896 -554389 262522 40771 -162164 -125393 12123 -143357 136610
18620b17507B1973a05437A87738a9620A68586a66542n4219A72996f380l57151
$$ -217507 21973 -105437 187738 -19620 168586 -166542 -220761 172996 -6380 -363531
18610c63531a4098l5494k86545a0893j98612m5504J17181N2450a5851j66316H6400
$$ -363531 -14098 -49592 -336137 -10893 -209505 -255009 -137828 -85378 -15851 -182167 86400
18598c186D7569b08021D86312a81687N9831l7004A08737a03880j42128C4906J63871
$$ -3186 47569 -208021 486312 -181687 -121856 -158860 108737 -103880 -246008 34906 198777
18587A98777g1008l58968A20281c19193h760k46077h732E0072R8554j4522b00477
$$ 198777 -71008 -429976 120281 -319193 -8760 -254837 -8732 50072 148626 134104 -200477
18575a44814j48897b2054k23924J17177B6546a50829K2040c7063A40828h2835
$$ -144814 -293711 -22054 -245978 -128801 26546 -150829 -128789 -37063 140828 -82835
18564b72029O5824A62934j714d181j46302F4588b30894a14613A01179c20081a31621
$$ -272029 -206205 162934 161220 -4181 -150483 64588 -230894 -114613 101179 -320081 -131621
18552c83261a13662C42969a05437r4027A16b78363a1105j60806A05038a64910
$$ -383261 -113662 342969 -105437 -199464 116 -278363 -11105 -171911 105038 -164910
18541B30306I6282J16937a34881M2491l15874F7664a61743A22124a22833A00937
$$ 230306 96282 213219 -134881 -92390 -408264 67664 -161743 122124 -122833 100937
18530B83109O2347b8032k74430R7954c2503k84657f8290A08869C4471J10129P0095
$$ 283109 345456 -28032 -302462 -204508 -32503 -317160 -68290 108869 34471 144600 214695
18519B14695a45612H7314e9625A06056a5935C00649j24849C2273c2248A27223
$$ 214695 -145612 87314 -59625 106056 -15935 300649 175800 32273 -32248 127223
18508c73233b41j68013c6595B13942d7732F5575a07458D5569a36785q2261i0875
$$ -373233 -241 -168254 -36595 213942 -47732 65575 -107458 45569 -136785 -219046 -90875
18496C1218P7331H66K29095e0347A22999A361h4876k23238n2793A35960m5478
$$ 31218 108549 866 229961 -50347 122999 1361 -84876 -308114 -360907 135960 90482
18485I0482a49665A1333Q6522K52067c45131C19229b25452F6582L5364g7858C40475
$$ 90482 -149665 11333 97855 349922 -345131 319229 -225452 66582 101946 -77858 340475
18473C9734J4620a70288n05r1956d3048k24766J6357A59395b40760B4026P7027
$$ 39734 54354 -170288 -170793 -262749 -43048 -267814 -251457 159395 -240760 24026 101053
18462A01053a28489a6003j07049N9266L0142B66343A06765k8765J08654a05061
$$ 101053 -128489 -16003 -123052 -63786 -33644 266343 106765 78000 186654 -105061
18451B32649a14030m2858N5784j85643R0914b6492k9678A36405a76184d0641B2325
$$ 232649 -114030 -156888 -101104 -286747 -195833 -26492 -56170 136405 -176184 -40641 22325
18439A07583a41564k08166b5150j83413H4111J57406c11436F6984f5925j9941
$$ 107583 -141564 -349730 -25150 -208563 84111 241517 -311436 66984 -65925 -85866
18429h5866L1350j09758B56502a27038e9069k39142H2266A9492b03648A02140
$$ -85866 -54516 -164274 256502 -127038 -59069 -298211 82266 19492 -203648 102140
18418A5447a10458A25326D4310J64367i6951D7884a09692j37905A31926a16983
$$ 15447 -110458 125326 44310 208677 -96951 47884 -109692 -247597 131926 -116983
18407e558B3016a43237m1743L329B34167A0956a59328B7440M5846Q8839b2543
$$ -5558 23016 -143237 -184980 -181651 234167 10956 -159328 27440 73286 162125 -22543
18395A80386D5842g9042E4991K96464a4526k8400q0248k18355i8995M412J596
$$ 180386 45842 -79042 54991 351455 -14526 -42926 -123174 -341529 -98995 -94583 -92987
18384i2987j43315E2243d27027i8865q4279A3098b93995G2867J05360l7503j7907
$$ -92987 -236302 52243 -427027 -98865 -183144 13098 -293995 72867 178227 140724 122817
18373A22817a06621o2731k2240B1861P7419B4796a16718J409B23068c26702A01895
$$ 122817 -106621 -169352 -191592 21861 99280 24796 -116718 -115309 223068 -326702 101895
18361A74733m0064f1299o9386A35206E1130f4489l8985B10329l8185b16570J02456
$$ 174733 134669 -61299 -130685 135206 51130 -64489 -103474 210329 172144 -216570 -114114
18350a14114l7428g2958C11256o8149a62717B50670g6333P897b1045e452j69081
$$ -114114 -151542 -72958 311256 243107 -162717 250670 -76333 -68436 -21045 -5452 -174533
18339a74533h2271r7180d5913A84394b32994A52535D0402a07937I9168a11698
$$ -174533 -82271 -179451 -45913 184394 -232994 152535 40402 -107937 99168 -111698
18328A02202a81549i704H7293b02205d2373E1393a1860j49905n9747e4076j09575
$$ 102202 -181549 -9704 87293 -202205 -42373 51393 -11860 -161765 -221512 -54076 -163651
18317a63651r8856A72953D7598A301a0103j75654g0504p1108j45435e7996j34021
$$ -163651 -262507 172953 47598 1301 -10103 -185757 -70504 -141612 -287047 -57996 -192017
18306a92017h2745B62724b3201A06284d4531j98959A08549c23241h1500F1346
$$ -192017 -82745 262724 -23201 106284 -44531 -243490 108549 -323241 -81500 61346
18295a14308K0424A62999b01064H1243C2859j5207E578c3316B75963a78918k07595
$$ -114308 -93884 162999 -201064 81243 32859 17652 5578 -33316 275963 -178918 -386513
18284c86513A1376b86559H9973J07941b23962A05157a44194o6596g3873p4345
$$ -386513 11376 -286559 89973 197914 -223962 105157 -144194 -210790 -73873 -148218
18274a48218j11408a10348A27227J67719b47064I029K51361c56045c1489J0200
$$ -148218 -259626 -110348 127227 294946 -247064 9029 260390 -356045 -31489 -21289
18264b1289A71804b49519A18066c08380A47686a20655D6338M9442d9561k62394
$$ -21289 171804 -249519 118066 -308380 147686 -120655 46338 95780 -49561 -311955
18254c11955A42949A510b43854e8049m2427B52361a50104A78100g8757D608b79426
$$ -311955 142949 1510 -243854 -58049 -100476 252361 -150104 178100 -78757 4608 -279426
18242a41220c8926C57204a252k52104d5005B9250N0064b77643J22929n7957I4420
$$ -141220 -38926 357204 -1252 -253356 -45005 29250 79314 -277643 -154714 -212671 94420
18230E5246a1147A71442b01442n005n1361O0724j42476H3610N0425a58537O4323
$$ 55246 -11147 171442 -201442 -206447 -257808 -197084 -339560 83610 134035 -158537 -94214
18219i4214A25033J9370g9346A20022J01896h0634j55411K3534B8348Q1020e0789
$$ -94214 125033 144403 -79346 120022 221918 -80634 -236045 -212511 28348 109368 -50789
18207G2961H051a01062I7469C4502J14654l8331b2620j08752j76241J40513A89952
$$ 72961 8051 -101062 97469 34502 149156 110825 -22620 -131372 -307613 -167100 189952
18195D3306a62784L7152j01804d223j00224j01053b1662j84088L8294L8653B27763
$$ 43306 -162784 -125632 -227436 -4223 -104447 -205500 -21662 -205750 -167456 -128803 227763
18183G2351a9964j28673D5225R9238b65522d3069A1491b99990J18331K3097B10026
$$ 72351 -19964 -148637 45225 144463 -265522 -43069 11491 -299990 -181659 -158562 210026
18171A84834G4210J9835R134f2388A90785J02845a7128r2677B94883E715J85187
$$ 184834 74210 94045 103179 -62388 190785 293630 -17128 -109805 294883 5715 190902
18160A90902o8352a88946A1465a20413D2023b58847J07483C47839a79221j51399
$$ 190902 122550 -188946 11465 -120413 42023 -258847 -151364 347839 -179221 -330620
18150c30620E9391a71332h0674B03403A4767K04935d9906A39222a89857K6807
$$ -330620 59391 -171332 -80674 203403 14767 219702 -49906 139222 -189857 -163050
18140a63050b3612P051A54777c7194G2689b48102g5023m11694a17261B67180j28285
$$ -163050 -23612 -16561 154777 -37194 72689 -248102 -75023 -486717 -117261 267180 138895
18129A38895d04755a78639A34568d2361I5532a67582a2022A09731a6510D1046
$$ 138895 -404755 -178639 134568 -42361 95532 -167582 -12022 109731 -16510 41046
18118A39721a02107A1676b76123B29923h9451A86079A5345L0462L6265i6366p0178
$$ 139721 -102107 11676 -276123 229923 -89451 186079 15345 45807 82072 -96366 -166544
18107a66544p8302I6391K44395G1340g1414j73885J02739B18033A8283n956K25105
$$ -166544 -244846 96391 340786 71340 -71414 -245299 -142560 218033 18283 12327 237432
18096B37432e2201B61743b04242F0400N8463J001a41704M446G3159a26138k1197
$$ 237432 -52201 261743 -204242 60400 118863 119864 -141704 -137258 73159 -126138 -147335
18085a47335b9855j27867j15677J19984A17571O7688a53088A34585n8142a35359
$$ -147335 -29855 -157722 -273399 -153415 117571 185259 -153088 134585 76443 -135359
18074a9941A54077a78200B60190F0906f3483C5075c7866k94484a31707N8102A53013
$$ -19941 154077 -178200 260190 60906 -63483 35075 -37866 -332350 -131707 -73605 153013
18062A27751D021a62587D7207b9065k23308J8802J8911C3738L12028i9804G9638
$$ 127751 4021 -162587 47207 -29065 -252373 -233571 -214660 33738 345766 -99804 79638
18050h050r6512A3681a49145F0509A2597k275i3202C43866C9011K69236b80660
$$ -8050 -104562 13681 -149145 60509 12597 10322 -93202 343866 39011 308247 -280660
18038F9832a6604B12660A9060a86328c8507j90694B13002a33219A84925g6285
$$ 69832 -16604 212660 19060 -186328 -38507 -229201 213002 -133219 184925 -76285
18027a9741D6128a00466A00887A611J34249B6249a27154F6503a46615r1801F6851
$$ -19741 46128 -100466 100887 1611 135860 26249 -127154 66503 -146615 -238416 66851
18015G7197B0656J30547E9196d18869a2803A44782h1563a0073j27427l5996d7606
$$ 77197 20656 151203 59196 -418869 -12803 144782 -81563 -10073 -137500 -173496 -47606
18003a05183C8349N0057b47775C02123b93615C098Q4760J85088a45144H807b7273
$$ -105183 38349 88406 -247775 302123 -293615 3098 87858 272946 -145144 8807 -27273
17991a10921A05136C1208N9898c8891B67888A13139b44529A02966R0224B9552
$$ -110921 105136 31208 91106 -38891 267888 113139 -244529 102966 193190 29552
17980b92768a39773c2492m94024B50372j1970J98925b7491a3730j78541E3237
$$ -292768 -139773 -32492 -526516 250372 238402 437327 -27491 -13730 -192271 53237
17969g2284A01289a69478B15568D1284g8641A26790a41507B64937P586b44530
$$ -72284 101289 -169478 215568 41284 -78641 126790 -141507 264937 272523 -244530
17958a64018C4724a00365B14816r9426a54491f5400j2591k03610a7565L082m673
$$ -164018 34724 -100365 214816 115390 -154491 -65400 -77991 -281601 -17565 -14483 -19156
17947a9156G9942a09396I4258i358k7973I6634c1070C34937f8132j30576p3897
$$ -19156 79942 -109396 94258 -9358 -37331 96634 -31070 334937 -68132 -198708 -272605
17936b72605g8071L2825d619j00783G8225N2152k781Q3238m0863K9160P8782A36215
$$ -272605 -78071 -45246 -4619 -105402 78225 130377 127596 210834 169971 199131 277913 136215
17923A36040g0868J0526l91698a84792P663B1465b05081A31947a20183B0933g1717
$$ 136040 -70868 -60342 -452040 -184792 -177129 21465 -205081 131947 -120183 20933 -71717
17911c0861j91316p4580R3317L8568A82261M6903a9392A33049M0706F3929b37885
$$ -30861 -222177 -296757 -203440 -164872 182261 229164 -19392 133049 173755 63929 -237885
17899F7212a26562K8436B0590J04346P9804c6790A77455f0768P56D19790g0380
$$ 67212 -126562 -98126 20590 124936 204740 -36790 177455 -60768 -60012 419790 -70380
17887E455a75961a3122G5845c02617A32117g453I1088a39j96170C54794a55384
$$ 5455 -175961 -13122 75845 -302617 132117 -7453 91088 -139 -196309 354794 -155384
17875B27287A7148f4457j32043A04016M3370e2983A09761h051B11259F3243a83106
$$ 227287 17148 -64457 -196500 104016 147386 -52983 109761 -8051 211259 63243 -183106
17863A06774R9454k3403o8042a79095f220k4253q284k0204C61570I2536R2869
$$ 106774 206228 182825 114783 -179095 -6220 -30473 -38757 -58961 361570 92536 185405
17852A85405g2364C25210f4291B00710q4118b44182h1210H6675a53936l92237
$$ 185405 -72364 325210 -64291 200710 116592 -244182 -81210 86675 -153936 -546173
17842e46173A43762e0964m9002B26211J4343O0005A04826m1800c42132a59342
$$ -546173 143762 -50964 -99966 226211 240554 300559 104826 63026 -342132 -159342
17831a20320k30483b1432l68706a39389L9191G916e3831B06577b368m2822F0164
$$ -120320 -350803 -21432 -390138 -139389 -100198 7916 -53831 206577 -2368 -45190 60164
17819I2714b22131e060j30922j14966p9984a5029j91382C27160l514q0523c9439
$$ 92714 -222131 -5060 -135982 -250948 -330932 -15029 -206411 327160 323646 243123 -39439
17807A20469b49679I0315c88094B95143a48915E7655h3913B73851L9229E9840
$$ 120469 -249679 90315 -388094 295143 -148915 57655 -83913 273851 313080 59840
17796a5473A08901a93664c8950l9628j1302A30318a58036E7611l772j3137J65554
$$ -15473 108901 -193664 -38950 -78578 -89880 130318 -158036 57611 53839 40702 206256
17785B06256p3906M8379i537j38303r883e5945o1518E034M0703J19093a34536
$$ 206256 132350 180729 -9537 -147840 -157723 -55945 -117463 5034 45737 164830 -134536
17773A24221I927J71976f2163D1549k0743N26044A81489b7898A48365a72185a6553
$$ 124221 9927 181903 -62163 41549 20806 546850 181489 -27898 148365 -172185 -16553
17761d3644D5011O6391E2439a13293b4020j38859A6007J33039l9703a42749H5107
$$ -43644 45011 111402 52439 -113293 -24020 -162879 16007 149046 109343 -142749 85107
17749c1329k01205C679c20083J21100f0277B02121e3535D72858b66021D3632a2637
$$ -31329 -232534 3679 -320083 -198983 -60277 202121 -53535 472858 -266021 43632 -12637
17737A97918a36645B29197B3592p211g5731B52722p7886M3141g2931B43216a7084
$$ 197918 -136645 229197 23592 16381 -75731 252722 174836 217977 -72931 243216 -17084
17725A54145a48893I6930c1617r7250C9372J47798J20445D9970K9986J01061a93917
$$ 154145 -148893 96930 -31617 -128867 39372 187170 307615 49970 79956 181017 -193917
17713a60663A05177J37672A13799e5988r2657K070O8573k3261B19009R9254E9815
$$ -160663 105177 242849 113799 -55988 -148645 -146575 -78002 -101263 219009 318263 59815
17701c5207H0393C4872p806K22530A06998J24044d87525E3060B2559J22206b87518
$$ -35207 80393 34872 27066 249596 106998 231042 -487525 53060 22559 144765 -287518
17689a4134B59328b03545h2315A05386g6034j26022A73913b03256O8804l01339
$$ -14134 259328 -203545 -82315 105386 -76034 -202056 173913 -203256 -134452 -435791
17679d35791J30933E4584a32528h434A62530e2219l3088A33774A9455K18766a10753
$$ -435791 -304858 54584 -132528 -8434 162530 -52219 -85307 133774 19455 238221 -110753
17667B11381J4464d43761H2697j4079j0654d2185C22855b79761q9714A78645A1562
$$ 211381 225845 -443761 82697 68618 57964 -42185 322855 -279761 -369475 178645 11562
17655b74605A51118B0394J08933f1995j08697A54376G635K64152a06198I6031
$$ -274605 151118 20394 129327 -61995 -170692 154376 7635 271787 -106198 96031
17644A86592a03276d9571A45171c1817A71439e4398p2322j3084b8608F9236C363
$$ 186592 -103276 -49571 145171 -31817 171439 -54398 -126720 -139804 -28608 69236 3363
17632C6719b4658D23707A22560a80186d4407A9594c42560a59372k9621J7794A28100
$$ 36719 -24658 423707 122560 -180186 -44407 19594 -342560 -159372 -188993 -171199 128100
17620C15576j56310L231c0650A70354a38537H7185a09135b620G986i1806A78898
$$ 315576 159266 162497 -30650 170354 -138537 87185 -109135 -2620 7986 -91806 178898
17608a66921c508B01466a5025l81847I0216c8131A69143K8b23555P7986j27817
$$ -166921 -3508 201466 -15025 -396872 90216 -38131 169143 169171 -223555 -145569 -273386
17597b73386A55127c5397A34158c58273a01597i842I8256L4669m6002f6893A13698
$$ -273386 155127 -35397 134158 -358273 -101597 -9842 98256 132925 86923 -66893 113698
17585b7539F5605b0244j6779C8420K28948a33447B44551a0607j85650C34134i1637
$$ -27539 65605 -20244 -37023 38420 267368 -133447 244551 -10607 -196257 334134 -91637
17573A05538e05619B38807k7878d2924A4197h3730D00098H2228F053J72303J1817
$$ 105538 -505619 238807 210929 -42924 14197 -83730 400098 82228 6053 178356 190173
17562A90173H644J58231C96J95038d0709j7958j06370B65494J91960h2428B6704
$$ 190173 8644 166875 396 195434 -40709 -58667 -165037 265494 457454 -82428 26704
17550I8807a56114C0762L23778j53954b8180C09349A19316c65751b5166D15590
$$ 98807 -156114 30762 354540 200586 -28180 309349 119316 -365751 -25166 415590
17539a50360C6947L1618b14932O0421A60404a04747B428b0847A18699Q5168b29510
$$ -150360 36947 68565 -214932 -154511 160404 -104747 2428 -20847 118699 203867 -229510
17527I3667P9773D5545M20058A22116a07562A42232a4123C96540a72522C3621
$$ 93667 173440 45545 465603 122116 -107562 142232 -14123 396540 -172522 33621
17516b1612A89373E3522L2876l1181J26785a53063C05302o8095G4916K624K74386
$$ -21612 189373 53522 86398 55217 182002 -153063 305302 237207 74916 77540 351926
17505C51926r2428i356E1112g1505j69671I5559A1158K43728H2987d4590C47512
$$ 351926 259498 -9356 51112 -71505 -241176 95559 11158 254886 82987 -44590 347512
17493i581j25164A83623i207n1071B028g8156b8151D2164K05428b39533D5632
$$ -9581 -134745 183623 -9207 -60278 2028 -78156 -28151 42164 247592 -239533 45632
17481a39147A26188A4150J57586K34702j78774J89953i2119C09208j05629d5968
$$ -139147 126188 14150 171736 406438 227664 417617 -92119 309208 203579 -45968
17470B31251D1709C222J75317p0538P7175K14157A02063D0587P3258J54421q8348
$$ 231251 41709 3222 178539 108001 185176 399333 102063 40587 113845 268266 179918
17459A79918d2795A80561o7562J34740A18691A455J696L12846E1487K7113J2464
$$ 179918 -42795 180561 112999 247739 118691 1455 3151 315997 51487 78600 91064
17448I1064J11964R8322J86778C4185L21645H4486a7566A97245J34390P5542m1517
$$ 91064 203028 301350 488128 34185 355830 84486 -17566 197245 331635 407177 365660
17437C65660K4946j90947P6161R3446a96335C2599J89250J18695M0924j47420
$$ 365660 390606 199659 275820 369266 -196335 32599 221849 340544 381468 234048
17427B34048L9318J25720n2468G5394L15590c4219A8981P7845b176A61781K46870
$$ 234048 273366 399086 346618 75394 390984 -34219 18981 96826 -2176 161781 408651
17416D08651M776G9232N17896A62718M25289Q698k82217p1072K17873D3132O7677
$$ 408651 413427 79232 597128 162718 588007 596705 314488 243416 461289 43132 110809
17405A10809e3189D6414J69751E7033K90467m7775g2922B06101J69202j77617
$$ 110809 -53189 46414 216165 57033 347500 299725 -72922 206101 375303 197686
17395A97686N8262D519a18186A01709l6125L58592j10175p5474o3998a961D11020
$$ 197686 255948 4519 -118186 101709 65584 424176 314001 238527 174529 -1961 411020
17383A03155L0999d2240K014A49733J22101F2133f2433A15716a7859F0575B9871
$$ 103155 134154 -42240 -40226 149733 271834 62133 -62433 115716 -17859 60575 29871
17371B36384B8394a07407B39343o4516K4977k6453a04757B54619m384P3027g2405
$$ 236384 28394 -107407 239343 174827 199804 173351 -104757 254619 250235 323262 -72405
17359A58246D9249L28136d5074n1254K1664C87077B4371J23699n4748M1063L11863
$$ 158246 49249 377385 -45074 -96328 -74664 387077 24371 148070 93322 134385 446248
17348D46248q4251A22674n7157J8760F014K97913p1607A2366L74652A28503K5493
$$ 446248 361997 122674 65517 84277 6014 303927 232320 12366 387018 128503 153996
17337A53996K4422K1278B9100N5769B6874K90900J59753f4526D87384A99191N0906
$$ 153996 178418 199696 29100 84869 26874 317774 477527 -64526 487384 199191 250097
17326B50097j6433n7893D7260b5163j78059B28729p030I6489k7450K54327q047
$$ 250097 233664 175771 47260 -25163 -203222 228729 221699 96489 69039 323366 315319
17315C15319A33657R4040Q7253l2871n4628m4228J1716I5951m7243Q0022d2878
$$ 315319 133657 227697 314950 282079 227451 183223 194939 95951 48708 128730 -42878
17303a47639C14585O316J17294a25172B58987k1948M1058J52164J86566c1795
$$ -147639 314585 320901 438195 -125172 258987 237039 278097 430261 616827 -31795
17292B19064J12898Q5960G9460L19011G9208K5599e4419o3233D10762L5614a06448
$$ 219064 331962 417922 79460 398471 79208 104807 -54419 -117652 410762 446376 -106448
17280A22384f3020D20287G7831L17267A27208n6516K0395J1383J14454N3444l811
$$ 122384 -63020 420287 77831 395098 127208 70692 91087 102470 216924 270368 266557
17269B66557M7695I0297M2754Q2938J8578b6407A00193J26088I4433L36270m6119
$$ 266557 314252 90297 133051 215989 234567 -26407 100193 226281 94433 430703 384584
17258C84584j32585J29743K9670h0754C30807C8189L26411m2314p8953L83896
$$ 384584 251999 381742 411412 -80754 330807 38189 364600 322286 243333 627229
17248F27229A32918K75971F1255O8267C0833M6656J40106L6587i1382B63346n7909
$$ 627229 132918 408889 61255 129522 30833 77489 217595 254182 -91382 263346 205437
17237B05437l5759K66114A09723R9680b2248A38279E4819K78582R935j67982R1797
$$ 205437 169678 435792 109723 209403 -22248 138279 54819 333401 343336 175354 267151
17226B67151I9476Q4716o2697J309l7182K41941j03969K136r092k9363R5394L05414
$$ 267151 99476 184192 121495 122804 85622 327563 223594 225730 216638 187275 282669 588083
17214E88083B71150J36357J5444j2030A25792J34135p2066b75972A14950K06270
$$ 588083 271150 407507 422951 410921 125792 259927 187861 -275972 114950 321220
17204C21220r0698a59110A00931J39068J90702k04812o5696J27480K09562b2066
$$ 321220 230522 -159110 100931 239999 430701 225889 160193 287673 497235 -22066
17193A23108M42107B70232F1142P4911N338o692K71367L54959C52054j59405n1392
$$ 123108 565215 270232 61142 136053 141391 134699 406066 761025 352054 192649 141257
17182A41257J87654j52780J61087j66362C7952L90774A10154l7037A8633J46627
$$ 141257 328911 176131 337218 170856 37952 428726 110154 73117 18633 165260
17172A65260J42949B3683N40851A24437J65647j5370A14198L07564r3439J08139
$$ 165260 308209 23683 564534 124437 290084 274714 114198 421762 328323 436462
17162D36462j30308G1152L10673F1471L26013A1323K79662m3730l2329B3592M01811
$$ 436462 306154 71152 381825 61471 387484 11323 290985 247255 214926 23592 425403
17151D25403m8864K91864A24100J62539q3912K6886K85940A26738L07309j06366
$$ 425403 376539 668403 124100 286639 202727 229613 515553 126738 434047 327681
17141C27681r1062J36903P8899j76096N3657P803J48897A00832J48502E0585N9857
$$ 327681 236619 373522 452421 276325 329982 337785 486682 100832 249334 50585 110442
17130A10442L47K64195L6824L63859C14856J25263q1490A44383J04398L350o1969
$$ 110442 110789 374984 411808 775667 314856 440119 358629 144383 248781 252131 190162
17119A90162B0869P5818O03876j71350B28304K12181J8009B03883L17296k40219
$$ 190162 20869 96687 700563 529213 228304 440485 458494 203883 521179 280960
17109B80960J24779P1672p6208j20785J71098j44653L8808K35982k79077P7560
$$ 280960 405739 477411 401203 280418 451516 306863 345671 581653 302576 380136
17099C80136j81897R7568K27854j24732K10101o7959j89595O9628J33075B17663
$$ 380136 198239 295807 523661 398929 609030 541071 351476 421104 554179 217663
17088E43786j26306n3411P9177k20719M40877k77292K00009j25056J02308k61013
$$ 543786 417480 364069 443246 222527 663404 386112 586121 461065 563373 302360
17078C02360K87219n4112J37890j49088j66887K40580K31064B32795M60911L4025
$$ 302360 589579 535467 673357 524269 357382 597962 829026 232795 693706 727731
17068G27731j03105j29919O5621j59270K05804P6990K8300j24487l5262J420M26339
$$ 727731 624626 494707 560328 401058 606862 683852 712152 587665 552403 553823 980162
17057I80162l96752k73695M10045k40225j21412K41130q404k05132J0791L22301
$$ 980162 583410 309715 719760 479535 358123 599253 590849 385717 396508 718809
17047G18809P6620o9125j82356P9816L99927k77242j75100J56077l05294K40589
$$ 718809 795429 726304 543948 623764 1023691 746449 571349 727426 422132 662721
17037F62721k79535L45696k47649j47443J48613J32961J22753l23779J61393M5537
$$ 662721 383186 728882 481233 333790 482403 615364 738117 414338 575731 621268
17027F21268J19313j64976J17146j32215l1745K08420k45807P6824K25881o3603
$$ 621268 740581 575605 692751 560536 528791 737211 491404 568228 794109 730506
17017G30506K15341k11319j9191P841k3590J47328j64885M07435J16540F02608
$$ 730506 945847 734528 715337 723178 699588 846916 682031 1089466 1206006 602608
17006G84901J49347k83800K34535J49654r8986l8695l66068O39848m29764L02073
$$ 784901 934248 650448 884983 1034637 935651 896956 530888 1170736 740972 1043045
16996A043045j04766j37980J59450l37737K63610J15879k1475r3712K54904j99485
$$ 1043045 938279 800299 959749 622012 885622 1001501 980026 886314 1141218 941733
16986I41733J94780l77060K65723k5120K3429m0449l59515J90577J91503K3223
$$ 941733 1136513 759453 1025176 1000056 1023485 983036 623521 814098 1005601 1028824
16976A028824k14553J68179P7516m32583O25192k82982l19928K31097R7359L50386
$$ 1028824 814271 982450 1059966 627383 1252575 969593 649665 880762 978121 1328507
16966A328507k76636q9761K10016K65805l11968N0377j9242l8560K8914j26539
$$ 1328507 1051871 962110 1172126 1437931 1125963 1176340 1157098 1118538 1147452 1020913
16956A020913O9251k5355j381l3104j59476K45854K24269k10344l40515N59868
$$ 1020913 1090164 1064809 1063428 1030324 870848 1116702 1340971 1130627 790112 1349980
16946A349980m18501K82544K5229J36644N1050k27993O4850J31032j54912J09452
$$ 1349980 931479 1214023 1239252 1375896 1426946 1198953 1263803 1394835 1239923 1349375
16936A349375M9010n4591L03235l77298m2460J74478k48105R5802J41722K29738
$$ 1349375 1398385 1343794 1647029 1269731 1227271 1401749 1153644 1249446 1391168 1620906
16926A620906l49777J79514J88228l71351N99809l85875j42836J16400J02664
$$ 1620906 1271129 1450643 1638871 1267520 1867329 1481454 1338618 1455018 1557682
16917A557682K52742k81629j008O23463m14820r891j28358R4913k17615M89573
$$ 1557682 1810424 1528795 1527787 2151250 1736430 1726539 1598181 1693094 1475479 1965052
16907A965052j1660r5371j75020L57835k87454O1296J60582P3583o3558P893q8701
$$ 1965052 1953392 1858021 1683001 2040836 1753382 1814678 1975260 2048843 1985285 1993178 1904477
16896A904477k3464L17992J61589k01576P0786k41603K13176j87332J65675K66106
$$ 1904477 1881013 2199005 2360594 2159018 2229804 1988201 2201377 2014045 2179720 2445826
16886B445826l95764N7443L10479j9155l1094j09794q4817K86319j27578M43460
$$ 2445826 2050062 2107505 2417984 2398829 2367735 2257941 2173124 2459443 2331865 2775325
16876B775325n1889l68453M56111k44255j6494m203R8476P2425l8114L31198N7924
$$ 2775325 2723436 2354983 2811094 2566839 2550345 2546142 2644618 2717043 2678929 3010127 3068051
16865C068051l3456L8526j02683j80283K72500k28611L34650n3829p7636O50002
$$ 3068051 3034595 3073121 2970438 2790155 3062655 2834044 3168694 3114865 3037229 3687231
16855C687231l38248o9827R8549L8384M8506M01703n58032L86354k3977J29850
$$ 3687231 3348983 3279156 3377705 3416089 3464595 3866298 3308266 3694620 3670643 3800493
16845C800493n159k46112Q21907j49828J50720n23432N39090j96462J20035P3781
$$ 3800493 3795334 3549222 4371129 4221301 4372021 3848589 4387679 4191217 4311252 4385033
16835D385033j18137K38316J11520j45095N00733k14682J47670K11909k55641
$$ 4385033 4266896 4505212 4616732 4471637 4972370 4757688 4905358 5117267 4861626
16826D861626N07570k62242L25607j08394K67360Q3296L7654R0298L51603k14568
$$ 4861626 5369196 5106954 5432561 5324167 5591527 5674823 5712477 5802775 6154378 5939810
16816E939810L45930j15215n3603L21494L75083R8714p4346L86913j8734O6161
$$ 5939810 6285740 6170525 6116922 6438416 6813499 6912213 6837867 7224780 7206046 7272207
16806G272207L61244l0040J43763j68116N60827N2457J15449J19353N58938P6241
$$ 7272207 7633451 7603411 7747174 7579058 8139885 8192342 8307791 8427144 8986082 9062323
16796I062323J91518M92453q6617L41760M0311M59721K38478L18083L29379L53668
$$ 9062323 9253841 9746294 9659677 10001437 10041748 10501469 10739947 11058030 11387409 11741077
16786A1741077N9253L44788N34040l20949R28449L41955J80100M19224K53894
$$ 11741077 11800330 12145118 12679158 12358209 13286658 13628613 13808713 14227937 14481831
16777A4481831P19459M61328L11808N13704O18708J67690Q63961L34737P63472
$$ 14481831 15201290 15662618 15974426 16488130 17106838 17274528 18138489 18473226 19236698
16768A9236698M73436R99477O85305O79393J068012P26226R02768Q42498P77203
$$ 19236698 19710134 20709611 21394916 22074309 23142321 23868547 24771315 25613813 26391016
16759B6391016J230089J174365J159655J309712J105536J630454J163804J862764
$$ 26391016 27621105 28795470 29955125 31264837 32370373 34000827 35164631 37027395
16751C7027395J797050J409773J945484J785048K230739J943330K866524K465857
$$ 37027395 38824445 40234218 42179702 43964750 46195489 48138819 51005343 53471200
16743E3471200K304313L346885K988120L355204L695167L450399M119866M268260
$$ 53471200 55775513 59122398 62110518 65465722 69160889 72611288 76731154 80999414
16735H0999414M576381M576718N813299N210938N649489N907329N920175O356630
$$ 80999414 85575795 90152513 95965812 101176750 106826239 112733568 118653743 125010373
16727A25010373N998387O212971O423905O006745N670703N300104M259303L236164
$$ 125010373 131008760 137221731 143645636 149652381 155323084 160623188 164882491 168118655
16719A68118655K489839J687766M50651p31869k004428l122580l893803m796868
$$ 168118655 170608494 172296260 172746911 172015042 170010614 166888034 162994231 158197363
16711A58197363n542674o211399o447749o519832p038228o618569o379168o203085
$$ 158197363 152654689 146443290 139995541 133475709 126437481 119818912 113439744 107236659
16703A07236659o408139n889730n597535n706498m382113m998727m367983l856498
$$ 107236659 100828520 94938790 89341255 83634757 79252644 74253917 69885934 66029436
16695F6029436l817714l560691l707809k601897l068122k549537k566067k186733
$$ 66029436 62211722 58651031 54943222 52341325 49273203 46723666 44157599 41970866
16687D1970866j988204j922814k076322j698251j786110j382661j469574j289401
$$ 41970866 39982662 38059848 35983526 34285275 32499165 31116504 29646930 28357529
16679B8357529j325681j185541j095559q39513j153408o93725j061687j099375
$$ 28357529 27031848 25846307 24750748 23911235 22757827 22064102 21002415 19903040
16671A9903040k49786q74615p70340q74018l36748p98358n54734n23105o00550
$$ 19903040 19653254 18778639 18008299 17134281 16797533 15999175 15444441 14921336 14320786
16662A4320786l24055n00419m39843m65885o87123r2830k24936l32958o54008
$$ 14320786 13996731 13496312 13056469 12590584 11903461 11810631 11585695 11252737 10598729
16653A0598729j40944k56562m47437k3422m18198k25155n86594J85476m58764
$$ 10598729 10457785 10201223 9753786 9730364 9312166 9087011 8500417 8685893 8227129
16644H227129j27163k77125j84410k82769n0811m14809K85228l17808k5454l37145
$$ 8227129 8099966 7822841 7638431 7355662 7304851 6890042 7175270 6857462 6832008 6494863
16634F494863k08102l26701M01131m94764J27366l08293l56104J2068O8764j27872
$$ 6494863 6286761 5960060 6361191 5866427 5993793 5685500 5329396 5341464 5410228 5282356
16624E282356j16541m22709K14738k34797j22813q1396J4942l87961K81067k17805
$$ 5282356 5165815 4743106 4957844 4723047 4600234 4518838 4533780 4145819 4426886 4209081
16614D209081l25129q3818n890n8622n8212k61179K76157k94318O2149l28839
$$ 4209081 3883952 3800134 3794244 3735622 3677410 3416231 3692388 3398070 3460219 3131380
16604C131380J76494O6175o8594K62727p06000P1718L71581l85731n6417j29164
$$ 3131380 3307874 3374049 3305455 3568182 2862182 2933900 3305481 2919750 2863333 2734169
16594B734169j36750J64637n4235M60236n98228K89211l07396l6026k4665l03979
$$ 2734169 2597419 2762056 2707821 3168057 2569829 2859040 2551644 2515618 2490953 2186974
16584B186974K33470j74569N4641q2880J78983l45274K12584R5304k87525j00159
$$ 2186974 2420444 2245875 2300516 2217636 2396619 2051345 2263929 2359233 2071708 1971549
16574A971549K01772J4213q1360m41040J59486O8194L1098l72271K03970j7496
$$ 1971549 2173321 2187534 2106174 1665134 1824620 1892814 1923912 1551641 1755611 1738115
16564A738115P0919l08579K39037n06778N74856j6736k53920L31253k58950k30128
$$ 1738115 1809034 1500455 1739492 1232714 1807570 1790834 1536914 1868167 1609217 1379089
16554A379089K79598k97043n6788Q2989M0945j62024J44793O1563k19539K16909
$$ 1379089 1658687 1361644 1304856 1387845 1428790 1266766 1411559 1473122 1253583 1470492
16544A470492j22195P6354N7223k28974j00791J25252M4447K97411l84474K6845
$$ 1470492 1348297 1424651 1481874 1252900 1152109 1277361 1321808 1619219 1234745 1261590
16534A261590m0703j41145J31152l8498J75448l96282J8925K39474k92691K06933
$$ 1261590 1220887 1079742 1210894 1172396 1347844 951562 970487 1209961 917270 1124203
16524A124203J8995j81079L9338r6261K05924J12930j40698J89984j54601j42985
$$ 1124203 1143198 962119 1001457 905196 1111120 1224050 1083352 1273336 1118735 975750
16514I75750j329J56337k68421p7577K41685l07619q497K46402r4902m6299l7169
$$ 975750 974421 1130758 862337 784760 1026445 718826 710329 956731 861829 815530 778361
16503G78361Q477j31732J84936J18426r4050o7157M6067K45396k67792K66482
$$ 778361 786838 655106 840042 958468 864418 797261 843328 1088724 820932 1087414
16493A087414l42292K28314k05244K79080j46944q880k70323K90429l149k07209
$$ 1087414 745122 973436 768192 1047272 900328 891448 621125 911554 908405 701196
16483G01196J85768j62540P5270Q7920j21762j09166J82266l22803J94320j71619
$$ 701196 886964 724424 799694 887614 765852 656686 838952 516149 710469 538850
16473E38850J59145J06932k14551N984j32614q690N1404j42985L62603j81046
$$ 538850 697995 804927 590376 596360 463746 455056 506460 363475 726078 545032
16463E45032P8079k00491M8212M02591D02150J55403o060K45738p6750j94939
$$ 545032 623111 422620 470832 873423 402150 557553 551493 797231 720481 525542
16453E25542r6372k6329J88520o7724O4494J28479F5525K61229J1459q7328K56144
$$ 525542 429170 402841 591361 523637 588131 716610 65525 326754 338213 250885 507029
16442E07029A63414M36581j80171k0729K93848l08260K12882j69647J80776k76766
$$ 507029 163414 599995 419824 399095 692943 384683 597565 427918 608694 331928
16432C31928j8519J56201j48262J15267K818m0704j35679L30603n500j92735o1318
$$ 331928 313409 469610 321348 436615 439433 398729 263050 593653 588153 395418 334100
16421C34100Q4151j01214K04665R1637B41275J67384m561K3551q7848L84550k54446
$$ 334100 418251 317037 521702 613339 241275 408659 404098 427649 339801 724351 469905
16410D69905d5851F32917j80967p0568n6478A60171m4536L44171N6837k14306
$$ 469905 -45851 632917 451950 381382 324904 160171 115635 459806 516643 302337
16400C02337O8411k2471p2555A9983J30049L7667O24M19444k42532A64833P9317
$$ 302337 370748 348277 275722 19983 150032 187699 188323 607767 365235 164833 244150
16389B44150J4686O211N1561D3166j3616M55620A07733M09104c3108D29944A37522
$$ 244150 258836 265047 316608 43166 29550 485170 107733 516837 -33108 429944 137522
16377d1952C65138n5440m1704J65647l9113E8480J03398K82310j32952K8109j21510
$$ -41952 365138 309698 267994 433641 394528 58480 161878 444188 311236 339345 217835
16366B17835J21390d7181D15092k0665o2755j00838c4004B93017Q769p5751a20100
$$ 217835 339225 -47181 415092 394427 331672 230834 -34004 293017 301786 226035 -120100
16354a6554d344A85970q9063L03824N9550j63476j04732J70718j66837R5043k3930
$$ -16554 -4344 185970 96907 400731 460281 296805 192073 362791 195954 290997 267067
16343B67067j6435p8867J01957J21198j72858Q1930q163N7329j62752B2194L13277
$$ 267067 250632 171765 273722 394920 222062 303992 295829 353158 190406 22194 335471
16332C35471M59A1104d5663B09594b3544C40231j60806Q5936L1081j28927J92210
$$ 335471 335930 11104 -45663 209594 -23544 340231 179425 265361 296442 167515 359725
16321C59725a0415F2421J41787a1661B44339j04303n7110P3510R554b9891k73852
$$ 359725 -10415 62421 204208 -11661 244339 140036 82926 156436 165990 -29891 -303743
16310c03743a43393A13714N27625F1265b3379C7036J90730L2172l3912J22340
$$ -303743 -143393 113714 641339 61265 -23379 37036 227766 259938 226026 348366
16300C48366L6587G8917b24243E22117A30769k8008D0992K14070H5374f3476B53342
$$ 348366 384953 78917 -224243 522117 130769 102761 40992 255062 85374 -63476 253342
16288C3622M20252B3306b72575E8696h8912j99985A62475D0314L52358m4119A18233
$$ 33622 453874 23306 -272575 58696 -88912 -288897 162475 40314 392672 348553 118233
16276A34919e0909j64702I5662K29874J73286h3174K0041E34314j95278a00620
$$ 134919 -50909 -215611 95662 325536 498822 -83174 -63133 534314 339036 -100620
16265b35854A49118R1939c9839C13773A53183F0321Q1816E1534J51705d8627B23718
$$ -235854 149118 241057 -39839 313773 153183 60321 142137 51534 203239 -48627 223718
16253a08786D6597J57579D217J91771i5690c1699F6690L76087A69153G5602L0568
$$ -108786 46597 204176 4217 195988 -95690 -31699 66690 442777 169153 75602 106170
16242A06170D1526P3235E5764J01947E4003P1054J92521k9440I8419N4641J61696
$$ 106170 41526 114761 55764 157711 54003 125057 317578 288138 98419 153060 314756
16231C14756E9946a18845I7619J07472E0689L25829p7571K0491A6933h0387j01390
$$ 314756 59946 -118845 97619 205091 50689 376518 298947 319438 16933 -80387 -181777
16220a81777E7180h2420j17245C60885a25196D4227J71096L71877D055g027B81275
$$ -181777 57180 -82420 -199665 360885 -125196 44227 215323 587200 4055 -7027 281275
16208A85126O9128A3017a80279g6840r0994A88620c20097f3191A56288J31522
$$ 185126 254254 13017 -180279 -76840 -167834 188620 -320097 -63191 156288 287810
16198B87810b93875D35150g6471G5904J03202E3379i2048b5179A87857m4040G432
$$ 287810 -293875 435150 -76471 75904 179106 53379 -92048 -25179 187857 143817 7432
16186a35693I4582J5230E4457a40306k70619e5525n5284l27137B43211r4352J83893
$$ -135693 94582 109812 54457 -140306 -410925 -55525 -110809 -437946 243211 148859 332752
16175C32752J50I4615B1187a64731O4253B82247p1063A04274a01375n9879B229
$$ 332752 332902 94615 21187 -164731 -100478 282247 211184 104274 -101375 -161254 2229
16163a38748l4948A29326n3171b38727D7270a60636B02730I3546J73873g2274
$$ -138748 -173696 129326 76155 -238727 47270 -160636 202730 93546 267419 -72274
16152B00001B1230K45073h3686b953j38015H658K45364b01935C79003Q113B8244
$$ 200001 21230 266303 -83686 -2953 -140968 8658 254022 -201935 379003 387116 28244
16140c39699e1746q3654O45B17843C5171J00638F6927h0811H2879A5885b88522
$$ -339699 -51746 -135400 -134755 217843 35171 135809 66927 -80811 82879 15885 -288522
16128e5978l2131D941J00915m4282J28464a48258B47545f8487D2021b76265K7850
$$ -55978 -88109 4941 105856 61574 190038 -148258 247545 -68487 42021 -276265 -248415
16117b48415A26945a20601J1027j04894K9834c9750G223d5151I9261C7436B884
$$ -248415 126945 -120601 -109574 -214468 -184634 -39750 7223 -45151 99261 37436 2884
16105b84191M8093e5665D24522d4439C086a41172C03046A2690J56869K923b29637
$$ -284191 -236098 -55665 424522 -44439 3086 -141172 303046 12690 169559 172482 -229637
16093g1393C12540p6420c1562B51261r9786J13152h1711N632A51505P78b84206
$$ -71393 312540 236120 -31562 251261 151475 264627 -81711 -76079 151505 152283 -284206
16081b9058E4024A1136J5597a58443e479j215p5828a5406j08079A43932c31588
$$ -29058 54024 11136 26733 -158443 -5479 -6694 -82522 -15406 -123485 143932 -331588
16069a2065B02252a33783A52487L61480A29550A1153N2968J25304c5853A47132
$$ -12065 202252 -133783 152487 513967 129550 11153 64121 189425 -35853 147132
16058c109r537C651a29153A67331c65848I4398a1607A29194e4551p0727I365J6143
$$ -3109 -12646 3651 -129153 167331 -365848 94398 -11607 129194 -54551 -125278 9365 25508
16046B5508J95708b22524B70560r1491a9884B67000b50722e9902A62999b843k08950
$$ 25508 221216 -222524 270560 179069 -19884 267000 -250722 -59902 162999 -2843 -211793
16035b11793c8253m23549A27054m7529a64286O1450B62260a26649c2063j04978
$$ -211793 -38253 -461802 127054 79525 -164286 -102836 262260 -126649 -32063 -137041
16025a37041a976j2704B7313P9302c4796k40090A16026b38391g8166b3105j9336
$$ -137041 -1976 -14680 27313 106615 -34796 -274886 116026 -238391 -78166 -23105 -42441
16014d2441m6370j5162d0987J3252G667K1193M16R546f001j9320A45297G1031
$$ -42441 -88811 -103973 -40987 -27735 7667 28860 29276 38822 -6001 -25321 145297 71031
16001A68245D1942O5127a20890a4046A03727J10058a09415A90649J0952e1801
$$ 168245 41942 107069 -120890 -14046 103727 213785 -109415 190649 201601 -51801
15990a429A35674a7735k28475c7391B8788K27587a24629C42725j27726H5054K40772
$$ -1429 135674 -17735 -246210 -37391 28788 256375 -124629 342725 214999 85054 325826
15979C25826o5619b5593B19320a61296A09690f8443b5257j49189O2525c0183l2508
$$ 325826 260207 -25593 219320 -161296 109690 -68443 -25257 -174446 -111921 -30183 -62691
15968f2691A16978a33696B38235D3135L39311b08250B22467a14991A3306b68901
$$ -62691 116978 -133696 238235 43135 382446 -208250 222467 -114991 13306 -268901
15957f0340A66265a27511d7166A68647b3214o5765A70496b43220a4127k13531
$$ -60340 166265 -127511 -47166 168647 -23214 -88979 170496 -243220 -14127 -227658
15947b27658b5525n4758E629k11e7694G7562b09382J1957j3092C5070g4140f473
$$ -227658 -25525 -80283 5629 5418 -57694 77562 -209382 -197425 -210517 35070 -74140 -6473
15934B406a55437A4155c4148G4339a5433A48589J38761D3015J03490F6166a72679
$$ 2406 -155437 14155 -34148 74339 -15433 148589 287350 43015 146505 66166 -172679
15922b03730P7277M0204p5936f4679m9002j68953J23548b8184I6441e8274B98680
$$ -203730 -126453 -86249 -162185 -64679 -113681 -282634 -159086 -28184 96441 -58274 298680
15910a63368P9222G2752k2753c712C19649J12555j74226o5756d60021B59392c89918
$$ -163368 -84146 72752 49999 -3712 319649 432204 257978 192222 -460021 259392 -389918
15898d1247C82962a90230K5030B76562B0056J80619B40a88562D4930b92545C84622
$$ -41247 382962 -190230 -165200 276562 20056 200675 240 -188562 44930 -292545 384622
15886f9204b6731k38427A10020f3086k27428J03173A5342d6187f237A7985K38423
$$ -69204 -26731 -265158 110020 -63086 -290514 -187341 15342 -46187 -6237 17985 256408
15875B56408c9088B31342a01423d8806n0807A60274o808a65066j3873d5081e40
$$ 256408 -39088 231342 -101423 -48806 -99613 160274 153466 -165066 -178939 -45081 -540
15863B02300D6695a3640j58342I1327a59790B37028a06613h154k77124G316b03148
$$ 202300 46695 -13640 -171982 91327 -159790 237028 -106613 -8154 -285278 7316 -203148
15851a87090A5443b96837F5433a19108n2811A56708f4366E806i9692I7759B9011
$$ -187090 15443 -296837 65433 -119108 -171919 156708 -64366 5806 -99692 97759 29011
15839C3850K0553J8087a62087C62320i6002j57375e5105K22j14842B22069E7153
$$ 33850 54403 72490 -162087 362320 -96002 -253377 -55105 -54883 -169725 222069 57153
15827B20791J5772c72293a8059m1926o016p84j6681j63976g4544A76794b74495
$$ 220791 236563 -372293 -18059 -59985 -66001 -66785 -83466 -247442 -74544 176794 -274495
15815b66423h2739n3273j50496A23421m4332e2027G8588a19168j01645B70921
$$ -266423 -82739 -136012 -286508 123421 79089 -52027 78588 -119168 -220813 270921
15804a33115c1738M291A04182K7209B8165A4020f6001B02982N8622H8881Q0398
$$ -133115 -31738 -27447 104182 131391 28165 14020 -66001 202982 261604 88881 169279
15793A69279a41623r1245R5568D7654P9461Q1320i8411E6396J1255a37113j37208
$$ 169279 -141623 -232868 -137300 47654 127115 208435 -98411 56396 67651 -137113 -274321
15782b74321q938B3013J4670J60783M1763C9443e6506j50304p5957A99116a6724
$$ -274321 -283259 23013 37683 198466 240229 39443 -56506 -206810 -282767 199116 -16724
15770A01481o597h0670j18223A62421J10546b09596C7977b02169l2833c757k9352
$$ 101481 94884 -80670 -198893 162421 272967 -209596 37977 -202169 -235002 -3757 -33109
15759c3109G7921C3944b10745A83238f6368o0504G1116a2592C3642a43471C20839
$$ -33109 77921 33944 -210745 183238 -66368 -126872 71116 -12592 33642 -143471 320839
15747f8364B4111c3277o791B74309b29385A94737i6002A36815q238b22899d3037
$$ -68364 24111 -33277 -40068 274309 -229385 194737 -96002 136815 128577 -222899 -43037
15735E362K03254E1329J22124f81867C6124b9089B1167a63900d1062B22105I3875
$$ 5362 208616 51329 173453 -681867 36124 -29089 21167 -163900 -41062 222105 93875
15723F031b53874A31776a9286k9162j47355B41426b17635D94905F7014b01650
$$ 6031 -253874 131776 -19286 -48448 -195803 241426 -217635 494905 67014 -201650
15712B07739a41502f5036G7504Q3032a18678o5408D7798R8503g4390k18620J37692
$$ 207739 -141502 -65036 77504 160536 -118678 -184086 47798 146301 -74390 -293010 -155318
15701a55318h801k32229a11112F0463f5859r5653C6753Q254J09494L9850C0559
$$ -155318 -8801 -241030 -111112 60463 -65859 -161512 36753 45007 154501 194351 30559
15689h6952d1628q1380A8865K71531D3892J21091e4629A86687C4948c2478A05768
$$ -86952 -41628 -123008 18865 290396 43892 164983 -54629 186687 34948 -32478 105768
15677A89253c22035g9284c514l79855D1394d6606J871F0098A1177g1598A38238
$$ 189253 -322035 -79284 -3514 -383369 41394 -46606 -44735 60098 11177 -71598 138238
15665B0530L9349N7563C9542J77529p7902b39327C6760b42061D6464R424K5314
$$ 20530 59879 117442 39542 217071 139169 -239327 36760 -242061 46464 55888 81202
15654H1202h7485D63005c96808b4443B32995c44644d0442G9432L1123i4906D9605
$$ 81202 -87485 463005 -396808 -24443 232995 -344644 -40442 79432 110555 -94906 49605
15642A13619b05387A17462a42186E5025P9770F1680b5621o1937j47504E1656J23473
$$ 113619 -205387 117462 -142186 55025 134795 61680 -25621 -87558 -235062 51656 175129
15631A75129N657d5652l4611r5820A68209f7923k6252A13242l7374b23887R2526
$$ 175129 180786 -45652 -80263 -176083 168209 -67923 -94175 113242 75868 -223887 -131361
15620a31361P909A7274J05256b11491B56750B9242L5332M0264l7504h5922F8623
$$ -131361 -123452 17274 122530 -211491 256750 29242 64574 104838 67334 -85922 68623
15608a71039M5769j10932d7999j77047I9501a0913G2293J4074K15662G6067a82171
$$ -171039 -125270 -236202 -47999 -225046 99501 -10913 72293 86367 302029 76067 -182171
15596A67875K93282e5959o1677B33410a245j0775j71520B7699N7881J24653K0226
$$ 167875 461157 -55959 -117636 233410 -1245 -12020 -183540 27699 85580 210233 230459
15585B30459g4251C38501F0479R9929b48637B27586B5395e3512o5688E3488a98509
$$ 230459 -74251 338501 60479 160408 -248637 227586 25395 -53512 -119200 53488 -198509
15573h7462k16160a15209c3811J979F1396J89363H8622J44272e4757m6256j92657
$$ -87462 -303622 -115209 -33811 -31832 61396 250759 88622 232894 -54757 -101013 -293670
15562b93670B10292A7247e7205k56987I4864a70998B2031J47473a04009A01840
$$ -293670 210292 17247 -57205 -314192 94864 -170998 22031 169504 -104009 101840
15551F8021J77389l0536A4450J66762R4443a23529K4901A95889b5921E2874c59090
$$ 68021 245410 214874 14450 181212 275655 -123529 -98628 195889 -25921 52874 -359090
15539h3335D3393f0838K6928H393J3961a1031I72h2939A55112D4746b34432B93191
$$ -83335 43393 -60838 -33910 8393 22354 -11031 972 -82939 155112 44746 -234432 293191
15526A3047K03436b89391K8041d1080B4503c19386a11141j44786Q9175j48910
$$ 13047 216483 -289391 -261350 -41080 24503 -319386 -111141 -255927 -166752 -315662
15516c15662B11133I798a70875k16314F1305P2917b19999B04750c71088B88068
$$ -315662 211133 9798 -170875 -387189 61305 134222 -219999 204750 -371088 288068
15505a68792e1625r2212C650b00856N7276D8469J01136b34347a12574C9774J53744
$$ -168792 -51625 -143837 3650 -200856 -143580 48469 149605 -234347 -112574 39774 193518
15494A93518b14646j15324C2453i1793p350H4978N4893i5048L0002P726I7816
$$ 193518 -214646 -329970 32453 -91793 -99143 84978 139871 -95048 -65046 -57320 97816
15482H7097L5384c15961A11793b72053E8510a82599f6300j31552A20675a48850
$$ 87097 122481 -315961 111793 -272053 58510 -182599 -66300 -197852 120675 -148850
15471B11929a363A31219K86488a4725F124c924j88854a7764A63229a47493L9530
$$ 211929 -1363 131219 417707 -14725 6124 -3924 -192778 -17764 163229 -147493 -107963
15460a07963o9502F9897e3165B49444c96781a5618A84696c4398m2441K9263j7663
$$ -107963 -177465 69897 -53165 249444 -396781 -15618 184696 -34398 -76839 -47576 -65239
15449f5239p0596p4969Q9867p8844g0856j59532F1657h7672I696N7313b93187
$$ -65239 -135835 -210804 -120937 -199781 -70856 -230388 61657 -87672 9696 67009 -293187
15437d7612J3788I2638O4807K6926B6680f2521p9992I5788P8166p6557f2296r1439
$$ -47612 -33824 92638 157445 184371 26680 -62521 -142513 95788 173954 97397 -62296 -153735
15425a53735j64402F217J33511r384a62591c240B7419j3340J38920f3488o686
$$ -153735 -318137 6217 139728 130344 -162591 -3240 27419 14079 152999 -63488 -70174
15414g0174A60642a76851I2715l9962h0942A71947g1280B32505q901I1963J12347
$$ -70174 160642 -176851 92715 52753 -80942 171947 -71280 232505 223604 91963 204310
15403B04310E8665b34617C78103D1969Q8166a60335D8002N5683b03834a4847B12981
$$ 204310 58665 -234617 378103 41969 130135 -160335 48002 103685 -203834 -14847 212981
15391I551b18595j9574L1354B69163a29008A70105K19695g0544K4131D13454j91200
$$ 9551 -218595 -238169 -206815 269163 -129008 170105 389800 -70544 -46413 413454 222254
15380B22254F2687j3210J82026I7275g1714q0311L1222C7987b11004e3216k3625
$$ 222254 62687 49477 231503 97275 -71714 -152025 -120803 37987 -211004 -53216 -76841
15369g6841D7235a45810A03690f8572A21289K08303e5646C04848b05456j22568
$$ -76841 47235 -145810 103690 -68572 121289 329592 -55646 304848 -205456 -328024
15359c28024a4493B71241a04677A93K44863A14971e7521A49261D5386h5980j0801
$$ -328024 -14493 271241 -104677 193 245056 114971 -57521 149261 45386 -85980 -96781
15348i6781A75139H018h6303E88K03794I2241R9724p9176f0765r6724B0648J40914
$$ -96781 175139 8018 -86303 588 204382 92241 191965 112789 -60765 -157489 20648 161562
15336A61562N3632p5323d66844A28641C5194n674J95499c37845a45948m2169A8291
$$ 161562 215194 139871 -466844 128641 35194 29520 225019 -337845 -145948 -188117 18291
15324e8525G5490J24761d6266G9859B769a10470a4377D793L064a21732G2375a09040
$$ -58525 75490 200251 -46266 79859 2769 -110470 -14377 4793 7857 -121732 72375 -109040
15311F3197A3946f8234k1800b3539B33303H5254a19802B30960K61674j58175c55707
$$ 63197 13946 -68234 -90034 -23539 233303 85254 -119802 230960 492634 334459 -355707
15299A26936C5702P3602J72483a92689C5182h9203C25817j56457a48723a8962
$$ 126936 35702 109304 281787 -192689 35182 -89203 325817 169360 -148723 -18962
15288i5539B41121i8476B22789a11528c0547C18074A03421b62347I2079K65736
$$ -95539 241121 -98476 222789 -111528 -30547 318074 103421 -262347 92079 357815
15278C57815f934m3530F8214d1032B94081F3557N7591a4677A4266N273M4872M7128
$$ 357815 -6934 -50464 68214 -41032 294081 63557 121148 -14677 14266 19539 64411 111539
15266A11539d763G7973c3371B52480E0548K55158j52357o1006b39649J19310M6153
$$ 111539 -4763 77973 -33371 252480 50548 305706 153349 92343 -239649 -120339 -74186
15255g4186j86811A63989L52107B25148l7085K1504R2871J007426l29651j14329
$$ -74186 -260997 163989 516096 225148 188063 209567 302438 1309864 980213 865884
15245H65884M12212o10171J61198C05436C8217J49642a82836E0792J0259J74036
$$ 865884 1278096 667925 829123 305436 38217 187859 -182836 50792 61051 235087
15235B35087A5217a23276a3497o6684A00382C7494K98611A16921K4935K02872
$$ 235087 15217 -123276 -13497 -80181 100382 37494 336105 116921 141856 344728
15225C44728A22797O5869N3200n9483K11041C9201J22566g3501g040j1446G0784
$$ 344728 122797 188666 241866 182383 393424 39201 161767 -73501 -7040 -18486 70784
15213E2336K12324D5322f4221A74166a53094b5905A79200i1225E9716g4875A69184
$$ 52336 264660 45322 -64221 174166 -153094 -25905 179200 -91225 59716 -74875 169184
15201A50085L6149J48880A3182M7600P7884J52409l5899D153L08836A05422c00354
$$ 150085 186234 335114 13182 60782 138666 291075 255176 4153 312989 105422 -300354
15189b58893A50356F1508R5466J49188a42529A56413l0164c2523j71874F7205
$$ -258893 150356 61508 156974 306162 -142529 156413 126249 -32523 -204397 67205
15178b6783j8121A03379K52275j15124E5645K10174a73372A56414K7981a25872
$$ -26783 -44904 103379 355654 240530 55645 265819 -173372 156414 184395 -125872
15167d4448B63723A1735a61709F38025B89366m1679C1722d9687j6172C7311b63972
$$ -44448 263723 11735 -161709 638025 289366 247687 31722 -49687 -65859 37311 -263972
15155D9517a86786c1687F4698Q1031M01609A06014K97760l3419F9498d8041A19725
$$ 49517 -186786 -31687 64698 145729 547338 106014 403774 370355 69498 -48041 119725
15143C63487I695J96966J22176C5812A3338J54839e1462A89799E8625a32251D70294
$$ 363487 9695 206661 328837 35812 13338 168177 -51462 189799 58625 -132251 470294
15131h8427A08258J68544a39038a8243M374D21936a19674G6464J69751K3294j0323
$$ -88427 108258 276802 -139038 -18243 -13869 421936 -119674 76464 246215 269509 259186
15120B59186a63552A02939a911A66598a01438A06377a9233H054J75921G6242P6898
$$ 259186 -163552 102939 -1911 166598 -101438 106377 -19233 8054 183975 76242 153140
15109A53140b7334A35417k0728k4097E241c4291l19501A98832M8847i979F8047
$$ 153140 -27334 135417 114689 90592 5241 -34291 -353792 198832 247679 -9979 68047
15097E174J00647D5422O5009M1636i1417H3142K10877A26328d2576A79582o4162
$$ 5174 105821 45422 110431 152067 -91417 83142 294019 126328 -42576 179582 115420
15086A15420P346a5142A54216J13214J9172b08921B87391a03620J7946A08053
$$ 115420 122766 -15142 154216 267430 286602 -208921 287391 -103620 -85674 108053
15075I4562K25648j28307D1044L15021j46393D4600L21795A09984J58937a36411
$$ 94562 320210 191903 41044 356065 209672 44600 366395 109984 268921 -136411
15064C5766J96296p9725a88974g7988A71495R2396B8980J25563G2790K77190a159
$$ 35766 232062 152337 -188974 -77988 171495 263891 28980 154543 72790 349980 -1159
15052A15394L62629j21184j36389J54152p2527E6211K21179m265C0476J7801L95349
$$ 115394 478023 356839 220450 374602 302075 56211 277390 273125 30476 48277 443626
15041D43626A38127L50076k41312k524C2125J71901p0928C7049K3976K83559A33273
$$ 443626 138127 488203 246891 244367 32125 204026 133098 37049 61025 344584 133273
15029H5876L41855O5786B04180O9071J40139r0177A21882O6603q0984M4656J50140
$$ 85876 427731 493517 204180 273251 413390 323213 121882 188485 107501 152157 302297
15018C02297J39378j31146R0133j73426J91289c8202A04313J10482p8576J68740
$$ 302297 441675 310529 400662 227236 418525 -38202 104313 214795 136219 304959
15008C04959j27744I296M36543q9791A68027P5215J734m5146M6899n0966F8939
$$ 304959 177215 9296 445839 356048 168027 243242 244976 199830 246729 195763 68939
14996A23419K83100A92245K2109l7386o6965Q9531l2367A6784J22183J66026k1903
$$ 123419 406519 192245 214354 176968 110003 199534 167167 16784 138967 304993 283090
14985B83090k7488J09865j58542L1252G7810L02716J82761B40875c7388C57705
$$ 283090 255602 365467 206925 238177 77810 380526 563287 240875 -37388 357705
14974C52220q6143A03267J44026A21157L509l49J79867p9989K05838p2460p6219
$$ 352220 266077 103267 247293 121157 124666 124317 304184 224195 430033 357573 281354
14963B81354A4967K71328j5294P0799k2049A52243J00930J95610e4000C63683
$$ 281354 14967 286295 271001 341800 319751 152243 253173 448783 -54000 363683
14952F3588A0049L44429J32153k36210q7056C0877J42150K42982p9624r8173K85699
$$ 63588 10049 354478 486631 250421 163365 30877 173027 416009 336385 238212 523911
14941E23911q7134d050C11862j24814q009J154K12854K5761R0425k16138H5462
$$ 523911 436777 -4050 311862 187048 179039 180193 393047 418808 509233 293095 85462
14929D57144k25665L04746j48330j41999J76624o8531A66829J04982J10346K43043
$$ 457144 231479 536225 387895 245896 422520 353989 166829 271811 382157 625200
14919F25200l06918K15482k45889G4683J15117L04665A35620M94511k68008p8301
$$ 625200 318282 533764 287875 74683 189800 494465 135620 630131 362123 283822
14909B83822J27524P5562A99061J19178p5949L68952a53779B61880R4834q8426
$$ 283822 411346 486908 199061 318239 242290 611242 -153779 261880 356714 268288
14899B68288J19449m4847O8444j02221o1134J75347j4112E1200Q2001K07083K48956
$$ 268288 387737 342890 411334 309113 247979 423326 409214 51200 133201 340284 589240
14888E89240B84174L945j7131o7047J97266k1802q9093q7981L10960A32612K01478
$$ 589240 284174 288119 270988 203941 401207 379405 290312 202331 513291 132612 334090
14877C34090J2013P995J28343B08555P2108A28397L64441j80989K55984J53664
$$ 334090 346103 354098 482441 208555 280663 128397 492838 311849 567833 721497
14867G21497p1703B98834M30510k62271j99168m4060J24242Q6508Q8559j30889
$$ 721497 649794 298834 729344 467073 267905 223845 348087 434595 523154 392265
14857C92265P7524j87150K38220p8028b5684C95349p0329k5678J22361L03613
$$ 392265 469789 282639 520859 442831 -25684 395349 325020 299342 421703 725316
14847G25316l42632N3129N0009L5839j10281j74825K6886L05075l0847K83043
$$ 725316 382684 435813 485822 521661 411380 236555 263441 568516 537669 820712
14837H20712k62725B34894M1330J82822Q5566q268Q5143j26352J2223J86915B70466
$$ 820712 557987 234894 276224 459046 544612 536344 621487 495135 507358 694273 270466
14825I0045M08315q4518l7950J82014p2195n872j53188O0881K63986J70427k78156
$$ 90045 498360 413842 375892 557906 485711 479839 326651 387532 651518 821945 543789
14814E43789k4025K5266k22039J56769R2953k3798j15490K19138k57049R975J94455
$$ 543789 519764 545030 322991 479760 572713 548915 433425 652563 395514 405489 599944
14803E99944k67357j42892L62136R9031L3075n1034k79199J12238K66125j50935
$$ 599944 332587 189695 551831 650862 683937 632903 353704 465942 732067 581132
14793E81132K935k60886L36426K06691J27488j44122l57457j05423K67939J75051
$$ 581132 584067 323181 659607 866298 993786 849664 492207 386784 654723 829774
14783H29774k07100k65489O0458M35569j90976j43843Q5422J14963R12M4956l27155
$$ 829774 622674 357185 417643 853212 662236 518393 603815 718778 719690 764646 437491
14772D37491O06955k98273j3019r8028k17693J82714j80134K84944o5642K55024
$$ 437491 1044446 746173 733154 635126 417433 600147 420013 704957 639315 894339
14762H94339l52096L94362m32474L39613j05809r7426l6694K35857k609O4617
$$ 894339 542243 936605 504131 843744 737935 640509 603815 839672 837063 901680
14752I01680j65165M3515K556J54973k35779K75791l51092K15181j54080K64153
$$ 901680 736515 780030 782586 937559 701780 977571 626479 841660 687580 951733
14742I51733j41630J0007j32194K49249N4178q1203k58376J46526l78904P04185
$$ 951733 810103 820110 687916 937165 991343 910140 651764 798290 419386 1123571
14732A123571j20998m71020J89037J93138j66521J90022m18223K86576p3368O7846
$$ 1123571 1002573 531553 720590 913728 747207 937229 519006 805582 732214 800060
14722H00060P5695K26094k53985l9370K4962j1334j30911K4020N0987L57767k35491
$$ 800060 875755 1101849 847864 808494 833456 822122 691211 715231 766218 1123985 888494
14711H88494K01446k39616L20299j74889m4886J10760j67447j00148R9J66940
$$ 888494 1089940 850324 1170623 995734 950848 1061608 894161 794013 794112 961052
14701I61052o4167K00698m3070j68793j27377N9778j16434K82966l25389P02962
$$ 961052 896885 1097583 1054513 885720 758343 818121 701687 984653 659264 1362226
14691A362226k73748j77232r9990N16694j7928l43462P3068j52069J76338l4551
$$ 1362226 1088478 911246 811256 1327950 1310022 966560 1039628 887559 1063897 1029346
14681A029346K05506J27935l90319J11818k59743J13245m4415K11988p1100L91764
$$ 1029346 1234852 1362787 972468 1084286 824543 937788 893373 1105361 1034261 1426025
14671A426025k29389k24590R7263J82726k68405J79838L0868j41432Q7374M1728
$$ 1426025 1196636 972046 1069309 1252035 983630 1163468 1194336 1052904 1140278 1182006
14661A182006j58962J55202j09463M3673L11988l38569J90019J69482j72700O0778
$$ 1182006 1023044 1178246 1068783 1112456 1424444 1085875 1275894 1445376 1272676 1333454
14651A333454J5155l7928k52579J55021M9309n1988K72073l93776K43663K61742
$$ 1333454 1348609 1310681 1058102 1213123 1262432 1210444 1482517 1088741 1332404 1594146
14641A594146n6788N7591j86524r2381k53487K88962k27170J17760K39561k3868
$$ 1594146 1537358 1594949 1408425 1316044 1062557 1351519 1124349 1242109 1481670 1457802
14631A457802Q6654k22307J95701N9738L4016L2113L8806j75751J20097j09865
$$ 1457802 1544456 1322149 1517850 1577588 1611604 1643717 1682523 1506772 1626869 1517004
14621A517004J09917o1859J7531m0939J66388L3254J18589k74687J01845J77235
$$ 1517004 1626921 1565062 1582593 1541654 1708042 1741296 1859885 1585198 1687043 1864278
14611A864278m8777k55258J47432R8603J06130m36953M04408l25136N2310K0490
$$ 1864278 1815501 1560243 1707675 1806278 1912408 1475455 1879863 1554727 1607037 1627527
14601A627527P2606L44918j11415k4267J71843j74846J1217m17023J54350J72953
$$ 1627527 1700133 2045051 1933636 1909369 2081212 1906366 1917583 1500560 1654910 1827863
14591A827863J0053K12310K27769m10147M78386j06710l86811J22093K23279Q5605
$$ 1827863 1837916 2050226 2277995 1867848 2346234 2239524 1852713 1974806 2198085 2283690
14581B283690k3456j76563Q5049L33070P0844l78394j92498O8233L98643K54914
$$ 2283690 2260234 2083671 2168720 2501790 2572634 2194240 2001742 2069975 2468618 2723532
14571B723532n0306j86940P3445o8798M7421O3909M1709k02457M19671p5215P1333
$$ 2723532 2673226 2486286 2559731 2490933 2538354 2602263 2643972 2441515 2861186 2785971 2857304
14560B857304P2902N8539L50928J28981K56907j83411N65459n8808Q31772O51385
$$ 2857304 2930206 2988745 3339673 3468654 3725561 3542150 4107609 4048801 4880573 5531958
14550E531958J016732J975243M155778P661849J6583112j641907A6916108G284107
$$ 5531958 6548690 8523933 12679711 20341560 36924672 35282765 16916108 7284107
14541C709395p42127l44271l95698R8952j65720J22914j32270J35398L15191l81318
$$ 3709395 2967268 2622997 2227299 2326251 2160531 2283445 2151175 2286573 2601764 2220446
14531B220446k14888K35512M34027k92199K69340k33183L58938j60032L61837
$$ 2220446 2005558 2241070 2675097 2382898 2652238 2419055 2777993 2617961 2979798
14522B979798m48447L69595M6218j10381K69500k81745J10482j8434J89821n32617
$$ 2979798 2531351 2900946 2947164 2836783 3106283 2824538 2935020 2916586 3106407 2573790
14512B573790P14872j50017L64258l64098J29468j00610O8712j42175L90575k0987
$$ 2573790 3288662 3138645 3502903 3138805 3268273 3167663 3236375 3094200 3484775 3463788
14502C463788R635O0232r1433J60443L7790L50936n09390L53866j46041Q5793
$$ 3463788 3473423 3533655 3442222 3602665 3640455 3991391 3482001 3835867 3689826 3775619
14492C775619q9748j62684M63155J79013m20182P4563J77046J75667q9183N4744
$$ 3775619 3685871 3523187 3986342 4165355 3745173 3819736 3996782 4172449 4083266 4138010
14482D138010J92336O1452p2483M74525n63037N0354n623J63293k0367K22485
$$ 4138010 4330346 4391798 4319315 4793840 4230803 4281157 4275534 4438827 4418460 4640945
14472D640945K16507J07835j59095K56567k53619l840P3743J37556J08659l7288
$$ 4640945 4857452 4965287 4806192 5062759 4809140 4805300 4879043 5016599 5125258 5087970
14462E087970K76361q417q7315K55381K44605k04025r9418K80774M9107Q6760
$$ 5087970 5364331 5355914 5268599 5523980 5768585 5564560 5465142 5745916 5795023 5881783
14452E881783j67946J58802J1666Q8066J56168O9325J66657J20709J3636N7570
$$ 5881783 5713837 5872639 5884305 5972371 6128539 6197864 6364521 6485230 6498866 6556436
14442F556436k92310M39109L1734K64844m28837L73124J83535J484J38798K5956
$$ 6556436 6264126 6703235 6734969 6999813 6570976 6944100 7127635 7129119 7267917 7293873
14432G293873K08492J41606k83569K70179K0092j2338M89463k03262J93036O8817
$$ 7293873 7502365 7643971 7360402 7630581 7650673 7638335 8127798 7924536 8117572 8186389
14422H186389K16468K35214R4994j99700P33823k56670K43563L5813q0922K61717
$$ 8186389 8402857 8638071 8733065 8533365 9267188 9010518 9254081 9289894 9208972 9470689
14412I470689K86839R6667K04632j70913N05531r6249K74384R6863N5417M22252
$$ 9470689 9757528 9854195 10058827 9887914 10393445 10297196 10571580 10668443 10723860 11146112
14402A1146112k44647N99031j20558N7092L62147K7836J53113L04410J05777M53485
$$ 11146112 10901465 11500496 11379938 11437030 11799177 11827013 11980126 12284536 12390313 12843798
14392A2843798O908K50874M99122P7672J34267M20808q0019L26935Q0221L81265
$$ 12843798 12850706 13101580 13600702 13678374 13812641 14233449 14153430 14480365 14560586 14941851
14382A4941851M58948L58740N4217L37337K86725P0676M33279J30098P09022N50176
$$ 14941851 15400799 15759539 15813756 16151093 16437818 16508494 16941773 17071871 17780893 18331069
14372A8331069k23019J85676N30845L27863K23587O26197M37424M27160M64724
$$ 18331069 18108050 18293726 18824571 19152434 19376021 20002218 20439642 20866802 21331526
14363B1331526K15075M75400N13151K54088P57329K66166N89511N38110P02896
$$ 21331526 21546601 22022001 22535152 22789240 23546569 23812735 24402246 24940356 25643252
14354B5643252M80118M76640O68094P13141P52044N26516N32412Q82895O12108
$$ 25643252 26123370 26600010 27268104 27981245 28733289 29259805 29792217 30675112 31287220
14345C1287220P89233N38382J286687O76231J040341O82006P67550J075235R84244
$$ 31287220 32076453 32614835 33901522 34577753 35618094 36300100 37067650 38142885 39127129
14336C9127129P60956J429554J199193J518327Q13425J088529J521182J122880
$$ 39127129 39888085 41317639 42516832 44035159 44848584 45937113 47458295 48581175
14328D8581175J680378J690465J570651J766982J496664J641593J707403K358254
$$ 48581175 50261553 51952018 53522669 55289651 56786315 58427908 60135311 62493565
14320F2493565J853746K136153K395216K457302K633558K203341L315223K642902
$$ 62493565 64347311 66483464 68878680 71335982 73969540 76172881 79488104 82131006
14312H2131006L145152L511444L399356L380931L957062M010026M289671M367220
$$ 82131006 85276158 88787602 92186958 95567889 99524951 103534977 107824648 112191868
14304A12191868M792344N082285N565010N275562N950638O052051O247040P245084
$$ 112191868 116984212 122066497 127631507 132907069 138857707 144909758 151156798 158401882
14296A58401882O861022P810441P806181Q950713Q980771R625879R791414J0701778
$$ 158401882 165262904 173073345 180879526 189830239 198811010 208436889 218228303 228930081
14288B28930081J0920111J1602019J1903466J2392439J2269029J2563210J3354720
$$ 228930081 239850192 251452211 263355677 275748116 288017145 300580355 313935075
14281C13935075J3641039J3716329J3888012J3517826J2664305J2303176J1298360
$$ 313935075 327576114 341292443 355180455 368698281 381362586 393665762 404964122
14274D04964122R612683N111682J467153K107936K943904j788531j744008k975348
$$ 404964122 414576805 419688487 421155640 423263576 426207480 424418949 422674941 419699593
14266D19699593o460859r201394j0856509j2888200j3706692j5068082j5162901
$$ 419699593 413238734 404037340 393180831 380292631 366585939 351517857 336354956
14259C36354956j5346352j5090412j5031520j4492086j3324189j2975890j3245887
$$ 336354956 321008604 305918192 290886672 276394586 263070397 250094507 236848620
14252B36848620j1713260j1768383j0935900j0549763r566963r112464q782864
$$ 236848620 225135360 213366977 202431077 191881314 182314351 173201887 164419023
14245A64419023q077264p221586p235168o828014o655875n837409n507491m941219
$$ 164419023 156341759 149120173 141885005 135056991 128401116 122563707 117056216 112114997
14237A12114997n137495m461678m549071m160206m037608l448609k976797l996149
$$ 112114997 106977502 102515824 97966753 93806547 89768939 86320330 83343533 79347384
14229G9347384k860577k849392k588617l240642k662278j864805k611579k076955
$$ 79347384 76486807 73637415 71048798 67808156 65145878 63281073 60669494 58592539
14221E8592539j816469k017175j794667j953875j456131k127351j138239j388134
$$ 58592539 56776070 54758895 52964228 51010353 49554222 47426871 46288632 44900498
14213D4900498j136042j256791j727085j052558j393449q91791m49507j231842
$$ 44900498 43764456 42507665 40780580 39728022 38334573 37442782 36993275 35761433
14205C5761433j200231j160257j029597r35061p85691k03091r90958p84571p82989
$$ 35761433 34561202 33400945 32371348 31436287 30650596 30447505 29456547 28671976 27888987
14196B7888987r00042m34924k98479j036553m27630q95665n63867n85509l83647
$$ 27888987 26988945 26554021 26255542 25218989 24791359 23895694 23331827 22746318 22362671
14187B2362671r34336l25593l07505k47296n89303k29552n77923l62927n96823
$$ 22362671 21428335 21102742 20795237 20547941 19958638 19729086 19151163 18788236 18191413
14178A8191413m5722m17203m37940m85486p4152m43247l71933m45829m07727j77429
$$ 18191413 18145691 17728488 17290548 16805062 16730910 16287663 15915730 15469901 15062174 14884745
14168A4884745K6517n57608p1501k58370k82730n30027j33606m01834j41604J17434
$$ 14884745 14911262 14353654 14282153 14023783 13741053 13211026 13077420 12675586 12533982 12651416
14158A2651416k68277j84362l65880k83541K13446l95517j86681j78486J4705
$$ 12651416 12383139 12198777 11832897 11549356 11762802 11367285 11180604 11002118 11016823
14149A1016823l80867m352j68035l59680l74691l39002J60326p9129j94978j82128
$$ 11016823 10635956 10631604 10463569 10103889 9729198 9390196 9550522 9471393 9276415 9094287
14139I094287R3636m3408k32345j79849l60293r3006K42570k06729m26936J39935
$$ 9094287 9187923 9144515 8912170 8732321 8372028 8279022 8521592 8314863 7887927 8027862
14129H027862k64742o115j47189n11337R9128n0705L46026o9054l85820k26150
$$ 8027862 7763120 7757005 7609816 7098479 7197607 7146902 7492928 7423874 7038054 6811904
14119F811904j58108L63167k06411k67376j79762Q5839m50355K39270m0568k68120
$$ 6811904 6653796 7016963 6810552 6543176 6363414 6449253 5998898 6238168 6197600 5929480
14109E929480J29853m85575N60065q42768O86336l74674j81659R0298l9958o50304
$$ 5929480 6059333 5573758 6133823 5291055 5977391 5602717 5421058 5511356 5471398 4821094
14099D821094L46232m7318o4453k4925L3637K9100k36831j95827L63473m95824
$$ 4821094 5167326 5120008 5055555 5030630 5064267 5093367 4856536 4660709 5024182 4528358
14089D528358K09040P7186p0869R2915l84959k51387J7932M26213j26111l18324
$$ 4528358 4737398 4814584 4743715 4836630 4451671 4200284 4218216 4644429 4518318 4199994
14079D199994k69649J06019K11442j86660K66192j60063Q303o5513l05406J5408
$$ 4199994 3930345 4036364 4247806 4061146 4327338 4167275 4175578 4110065 3804659 3820067
14069C820067r5993j31637r3971R1689k273p9497J1567M42453l55675K4473R9393
$$ 3820067 3724074 3592437 3498466 3590155 3587882 3508385 3519952 3962405 3606730 3631203 3730596
14058C730596K70319n35720N7407q5144K3672j6391j66993J96656j43474j84902
$$ 3730596 4000915 3465195 3522602 3437458 3461130 3444739 3277746 3474402 3330928 3146026
14048C146026j50431j54565L72695q4747k19725M4280R3653l07906L12455l16137
$$ 3146026 2995595 2841030 3213725 3128978 2909253 2953533 3047186 2739280 3051735 2735598
14038B735598l7226m0997K20861J60795l05316K25521o8684l95493J11781K50601
$$ 2735598 2698372 2657375 2878236 3039031 2733715 2959236 2890552 2495059 2606840 2857441
14028B857441k36622m894L54528l77201j95592K35439n1958n69342O31412l61262
$$ 2857441 2620819 2615925 2970453 2593252 2397660 2633099 2581141 2011799 2643211 2281949
14018B281949Q5141k97542L00892L4256J07051k58585J07283k06897K8752K0190
$$ 2281949 2367090 2069548 2370440 2404696 2511747 2253162 2360445 2153548 2182300 2202490
14008B202490K00204k41238k30528K45109m1167m20550L54465K25548M0510k66528
$$ 2202490 2402694 2161456 1930928 2176037 2134870 1714320 2068785 2294333 2334843 2068315
13998B068315J76254J00958j33953k74332K21656J82190Q2611M30750L89418J294661
$$ 2068315 2244569 2345527 2211574 1937242 2158898 2341088 2423699 2854449 3243867 4538528
13988D538528L508822O017354J7032640O000708j7519463r392235l411047j960659
$$ 4538528 8047350 14064704 31097344 37098052 19578589 10186354 6775307 4814648
13980D814648j174976m05261n1815j87933r3998l20703l1741j68118K22311m50758
$$ 4814648 3639672 3234411 3182596 2994663 2900665 2579962 2548221 2380103 2602414 2151656
13970B151656l4967J6552q5598J05583q0661R477j26511j23345L16693l13296
$$ 2151656 2116689 2133241 2047643 2153226 2072565 2082042 1955531 1832186 2148879 1835583
13960A835583J90733m63000J11080j12281K69939p86k60432j2706J44974L19497
$$ 1835583 2026316 1563316 1674396 1562115 1832054 1831268 1570836 1558130 1703104 2022601
13950B022601l48752p9278J34984k66930L86366l32968M9007q5772L16033J01808
$$ 2022601 1673849 1594571 1729555 1462625 1848991 1516023 1565030 1479258 1795291 1897099
13940A897099k47323Q6090l76081R1651J77226l69420N1395l0333L65577l67931
$$ 1897099 1649776 1735866 1359785 1451436 1628662 1259242 1310637 1280304 1645881 1277950
13930A277950L21851q8950k72334J65998l2086l02451M30322k43369l4680J27953
$$ 1277950 1599801 1510851 1238517 1404515 1372429 1069978 1500300 1256931 1222251 1350204
13920A350204O314j23429K91982k04394j96280O1168n4180J14192K53863j15254
$$ 1350204 1356518 1233089 1525071 1320677 1124397 1185565 1131385 1245577 1499440 1384186
13910A384186j89556K30757r1263q7719j75439L79039q7124l98482J87282J27607
$$ 1384186 1194630 1425387 1334124 1246405 1070966 1450005 1362881 964399 1151681 1279288
13900A279288j8484k34949J48696M22997k14135j44411K61148l66578j87413L0213
$$ 1279288 1260804 1025855 1174551 1597548 1383413 1239002 1500150 1133572 946159 976372
13890I76372K04420N23936o76124J98730m72115L15584o6475L46597l10917J66105
$$ 976372 1180792 1704728 1028604 1227334 755219 1070803 1004328 1350925 1040008 1206113
13880A206113J6010k15280k7876L86696K35401l86633K65674m70364k3238K83608
$$ 1206113 1222123 1006843 978967 1365663 1601064 1214431 1480105 1009741 986503 1270111
13870A270111q6276k30758Q5738m53151N03065Q1586L3403k83121j56763R8053
$$ 1270111 1183835 953077 1038815 585664 1088729 1170315 1203718 920597 763834 861887
13860H61887j01874K68736l75775K60062J95412k71566k8307K56786l4134j04649
$$ 861887 760013 1028749 652974 913036 1108448 836882 808575 1065361 1031227 926578
13850I26578K08185k61904K56525j69504J3287l57372L33909C01720N11345P1233
$$ 926578 1134763 872859 1129384 959880 973167 615795 949704 301720 813065 884298
13840H84298k47058N61706m75509M58934l56742J51295p8853n9512L5992q0392
$$ 884298 637240 1198946 723437 1182371 825629 976924 898071 838559 874551 794159
13830G94159k32746J62450m3126L15492k17684J84851l80911P76061n41760J44574
$$ 794159 561413 723863 680737 996229 778545 963396 582485 1358546 816786 961360
13820I61360L7480D92100K24833J83534l37029m61p8621J27393k2159M69577l33462
$$ 961360 998840 492100 716933 900467 563438 562977 484356 611749 589590 1059167 725705
13809G25705J63959L5217C06255N02923j00912j12089k65739K55477o409L14655
$$ 725705 889664 924881 306255 809178 708266 596177 330438 585915 579506 894161
13799H94161q4816j87559L68803k26068l5025j53344K91170C85713J64097L37295
$$ 894161 809345 621786 990589 764521 729496 576152 867322 385713 549810 887105
13789H87105r7094k68050K13915j6580j35461j11220m0069L18070l02447L36639
$$ 887105 790011 521961 735876 719296 583835 472615 432546 750616 448169 784808
13779G84808k75976L97382n9175k32041J03716j4322J68351C13761m4538M70642
$$ 784808 508832 906214 847039 614998 718714 704392 872743 313761 269223 739865
13769G39865k07485J42146q616k64649K45403l1315Q173k80773K74343j16151
$$ 739865 532380 674526 665910 401261 646664 615349 623522 342749 617092 500941
13759E00941j25141L00271j73284L14746Q177l18901j47088M87747C95295L42439
$$ 500941 375800 676071 502787 817533 825710 506809 359721 847468 395295 737734
13749G37734C25548L85688k62810M43517l58428J18383L55998l86662j6797k46268
$$ 737734 325548 711236 448426 891943 533515 651898 1007896 621234 604437 358169
13739C58169j69822K90589j91921L80915K4686j74883j17476L075j08609J13164
$$ 358169 188347 478936 287015 667930 692616 517733 400257 403332 294723 407887
13729D07887K25123A94398J81263M23564j99959j9896q3286p4178J88908j53841
$$ 407887 633010 194398 375661 799225 599266 579370 496084 421906 610814 456973
13719D56973K31546k65063k07928K11084R1911N4798B15917J01677j2386K43102
$$ 456973 688519 423456 215528 426612 518523 573321 215917 317594 305208 548310
13709E48310m5872L509J6136K43539l3700l46124M1225j97488J02798j1745l642
$$ 548310 502438 505947 522083 765622 731922 385798 427023 229535 332333 320588 316946
13698C16946P4255K28014M5812j85900p4575K8967J46699B79969M27873l32661
$$ 316946 391201 619215 665027 479127 404552 433519 580218 279969 707842 375181
13688C75181L57361j78163k51314J06550M67894l15971k12830F5322h385B88389
$$ 375181 732542 554379 303065 409615 877509 561538 348708 65322 -8385 288389
13677B85431Q0149J60932J50141B50706l2608J17599j10361J26477j58056K85546
$$ 285431 365580 526512 676653 250706 218098 335697 225336 351813 193757 479303
13667D79303A96898K78829j54941n7157q629J32970n7564j49628L53104B38278
$$ 479303 196898 475727 320786 263629 255000 387970 330406 180778 533882 238278
13656B95561R5729q599R6941r5890K48930k70028n4428J16581A54111L13607k9120
$$ 295561 391290 382691 479632 383742 632672 362644 308216 424797 154111 467718 438598
13645D38598j83731K60701e3958A3489O13105k38014b5019D27293j22591N9571
$$ 438598 254867 515568 -53958 13489 626594 388580 -25019 427293 304702 364273
13635C64273Q627J50773j86906J39785Q6996k48141k4988L5247j09455L30170
$$ 364273 372900 523673 336767 476552 563548 315407 290419 325666 216211 546381
13625E46381j1773j83079R8494p3347r8670m4661J65969L15815l34335j54141
$$ 546381 534608 351529 450023 376676 278006 233345 399314 715129 380794 226653
13615B26653i783A56568K53884k6508O1270K75772j52035j21111B09326L18251
$$ 226653 -9783 156568 410452 383944 445214 720986 568951 447840 209326 527577
13605E27577B50748J11777A66639N52J00277J6704A35404K17766I1407K97852
$$ 527577 250748 362525 166639 167191 267468 284172 135404 353170 91407 389259
13595C89259M01628A19295J91499p800c09077A87585J44282o9966R5703o0198
$$ 389259 790887 119295 310794 302994 -309077 187585 331867 261901 357604 297406
13585B97406J78403j81333J80406j1381A13911N12271B29463J14717K26223j40044
$$ 297406 475809 294476 474882 463501 113911 626182 229463 344180 570403 430359
13575D30359P1706I9520L05485k4691j89587O9958l5435K57804l1659A99358K44235
$$ 430359 502065 99520 405005 380314 190727 260685 225250 483054 451395 199358 443593
13564D43593C1667K24970Q1748j15812N4183B9723i1048B27254I2236J32786R0747
$$ 443593 31667 256637 338385 222573 276756 29723 -91048 227254 92236 225022 315769
13553C15769a3503A70856K3270K51169J15120j16842B20739J45132K47382A50177
$$ 315769 -13503 170856 194126 445295 560415 443573 220739 365871 613253 150177
13542B96036b7055D12497m8420l7840N2346q9253j25527a24089D22081L8227B13276
$$ 296036 -27055 412497 364077 326237 378583 289330 163803 -124089 422081 460308 213276
13530B32725K7344E6347L39891j19258J04669E0224K22005A2494M30836J00558
$$ 232725 260069 56347 396238 276980 381649 50224 272229 12494 443330 543888
13520E43888A63183p6531J24819J1252J63106B6291J69640j9087J21516Q5272
$$ 543888 163183 86652 211471 222723 385829 26291 195931 176844 298360 383632
13510C83632K24989k93947L2992F3628N15389B55316Q7745O0488C4660K92742
$$ 383632 608621 314674 347666 63628 579017 255316 343061 403549 34660 327402
13500C27402A19672n7584e981C57415J89324q8470A86321M53144B77291r0325
$$ 327402 119672 62088 -5981 357415 546739 458269 186321 639465 277291 186966
13490A86966K5237r0428D3225J63127I0989J6819O9667j8743O9385L17499j57299
$$ 186966 212203 121775 43225 206352 90989 107808 177475 158732 228117 545616 388317
13479C88317J385a23371C82994A43199g9586C49269a83783A54923K95671B21768
$$ 388317 389702 -123371 382994 143199 -79586 349269 -183783 154923 450594 221768
13468C36342a8702B49390J68755j18825A39064F5213a2097j8332D34631j99548
$$ 336342 -18702 249390 418145 299320 139064 65213 -12097 -30429 434631 235083
13458B35083A14330a6374A60663l582a02654E92790A66467p9776J19632E1206
$$ 235083 114330 -16374 160663 157081 -102654 592790 166467 86691 206323 51206
13447C61592G1065A6666J28896m7110Q513N8626J81351l8135j10738c1936B29151
$$ 361592 71065 16666 145562 98452 106965 165591 346942 308807 198069 -31936 229151
13435d51467H3076c9205A92544J0804J76835k5797J78474e536A60312N1372J34874
$$ -451467 83076 -39205 192544 203348 380183 354386 532860 -5536 160312 211684 346558
13424C46558c1170B49857m1744r6179h3741B44326p6456J0331j9100b15160B45588
$$ 346558 -31170 249857 208113 111934 -83741 244326 167870 178201 159101 -215160 245588
13412D28527j07349b6420A17187e0033A45985K49726A33185J66975j15228m3901
$$ 428527 321178 -26420 117187 -50033 145985 395711 133185 300160 184932 141031
13402A41031i7097A03821j518b394B89630A31998E2215P4656C3529K15530I5890
$$ 141031 -97097 103821 102303 -2394 289630 131998 52215 126871 33529 249059 95890
13390A41549l1440K6269a90180B75812E0530J23241C071M19658B1952K43401M22201
$$ 141549 110109 136378 -190180 275812 50530 173771 3071 422729 21952 265353 687554
13379F87554C9057L96315O9713a19195A39936J50726m6337N8269K629h05B46866
$$ 687554 39057 435372 505085 -119195 139936 290662 244325 302594 305223 -805 246866
13367A49009j4474J22818j01607J10359K71083k50774K54009B04055D3075j6517
$$ 149009 134535 257353 155746 266105 537188 286414 540423 204055 43075 26558
13357B6558J75498n2742J79414j37842J56338e0242B38952H3436L6004K77990
$$ 26558 202056 149314 328728 190886 347224 -50242 238952 83436 119440 397430
13347C97430I6754J88314m2168r3488K06746a41750A76855J67652j06577H4928
$$ 397430 96754 285068 242900 149412 356158 -141750 176855 344507 237930 84928
13336A82376M7233q9414K01010D2148L31352j65979n7677F600J5106N6497k9752
$$ 182376 229609 140195 341205 42148 373500 207521 149844 6600 21706 78203 48451
13325D8451L66798L8492j5991J921C8593J74520r7781J12609a48689D30171G500
$$ 48451 415249 453741 437750 439671 38593 213113 115332 227941 -148689 430171 7500
13313D4639J80315K23843K0418b6075B01811H024K84753G3693P2188n7042a09162
$$ 44639 224954 448797 469215 -26075 201811 8024 292777 73693 145881 88839 -109162
13301A51059k0174J46689e5673B90573k3947a8656C44554j54653a3851C15080
$$ 151059 130885 277574 -55673 290573 266626 -18656 344554 189901 -13851 315080
13290I8317m3136a05670a0104D6628c4473B67358A24051n7767a61913E4151J0900
$$ 98317 55181 -105670 -10104 46628 -34473 267358 124051 66284 -161913 54151 65051
13279F5051p347K98699g4074q0351A38650J58387B6575a04349A30666f6767B99234
$$ 65051 57704 356403 -74074 -154425 138650 297037 26575 -104349 130666 -66767 299234
13267a12573D2984K61357i4644I8470D6214J9597b44069F9008a42874A64312K776
$$ -112573 42984 304341 -94644 98470 46214 65811 -244069 69008 -142874 164312 167088
13256A67088L2236F1960K4992f8824E9514K92089h3633A39918j899b10226A35579
$$ 167088 199324 61960 86952 -68824 59514 351603 -83633 139918 138019 -210226 135579
13244A09921K61595j71142m3486j5894A8524c2558B68849C6035J92451A08970
$$ 109921 371516 200374 156888 140994 18524 -32558 268849 36035 228486 108970
13233i567B28195J36863d8671j07230m828m2378d0773q8586B9379c7602G070L2881
$$ -9567 228195 365058 -48671 -155901 -160729 -203107 -40773 -129359 29379 -37602 7070 39951
13221C9951K78434c49784a50936O8112C11248A04313J00101a77813P1860B4937
$$ 39951 318385 -349784 -150936 -82824 311248 104313 204414 -177813 -105953 24937
13210B3170b8890A67822O1127H9651b39375N5701A69052Q2901b49195A02155j637
$$ 23170 -28890 167822 228949 89651 -239375 -183674 169052 251953 -249195 102155 100518
13199A00518h6220C73050a54659O4950D13057b44229R6409A68424O4920a3556
$$ 100518 -86220 373050 -154659 -89709 413057 -244229 -147820 168424 233344 -13556
13188E1907M7281l5528d3487A32272e2012D2593a2315D38896F3510J5071L77663
$$ 51907 99188 63660 -43487 132272 -52012 42593 -12315 438896 63510 78581 456244
13177D56244C4583d2406k9815B16611a45251G1225J65081a65019e987C1001L13188
$$ 456244 34583 -42406 -72221 216611 -145251 71225 236306 -165019 -5987 31001 344189
13166C44189B5853e7168g152j23906l910C9435b21938A93697B2533J58408N0114
$$ 344189 25853 -57168 -7152 -131058 -134968 39435 -221938 193697 22533 180941 231055
13155B31055m6620a49173D4532K36070B3973f5631n5033A00595P1751a63667A81734
$$ 231055 184435 -149173 44532 280602 23973 -65631 -120664 100595 172346 -163667 181734
13143d5901A70058a27732K0510C99643b90363B52680j16651J64379a4642A24958
$$ -45901 170058 -127732 -107222 399643 -290363 252680 136029 300408 -14642 124958
13132A50743K8827i1968G8161J86583R2743o4212A43596c0345C6178m145J12234
$$ 150743 179570 -91968 78161 264744 357487 293275 143596 -30345 36178 32033 144267
13121A44267J01772j02651J70643q9513b09551B30318a33415N8098H0183c67338
$$ 144267 246039 143388 314031 224518 -209551 230318 -133415 -75317 80183 -367338
13110a64459I7698K00059M3493a97816D1807a60855A33382c57419A34172M4972
$$ -164459 97698 297757 341250 -197816 41807 -160855 133382 -357419 134172 179144
13100A79144a78487A44554L66051A11816n4149k5427J41967c0703B54790o7231
$$ 179144 -178487 144554 510605 111816 57667 32240 174207 -30703 254790 187559
13090A87559b49082l6757F7698Q8575j3042k4288m2024b90855A58008a30253B206
$$ 187559 -249082 -285839 67698 156273 143231 118943 76919 -290855 158008 -130253 2206
13078A96773I7507C7123J26749n1535a43864C24998b4185I857N2775a5420B64072
$$ 196773 97507 37123 163872 112337 -143864 324998 -24185 9857 62632 -15420 264072
13066G0011g2686B42171o4094G289Q0964J39789f158D76746d3552B20512D7803
$$ 70011 -72686 242171 178077 7289 88253 228042 -6158 476746 -43552 220512 47803
13054g0866C34943A04896K00135H1820k7445K29217G6774J40376M730r2375a9896
$$ -70866 334943 104896 305031 81820 54375 283592 76774 217150 221880 129505 -19896
13042B86852r4390n1448e6562h999A80525N506L4112E6899K71924L795I6178R5151
$$ 286852 192462 141014 -56562 -8999 180525 186031 220143 56899 328823 332618 96178 191329
13030A91329i1115E8753J25237G7026J39245D4593L27918h6446A28893A2833h7510
$$ 191329 -91115 58753 183990 77026 216271 44593 372511 -86446 128893 12833 -87510
13018b48086b6096k1326B50773C219b47614J16263b8086B66964G3848c1705A42789
$$ -248086 -26096 -47422 250773 3219 -247614 -131351 -28086 266964 73848 -31705 142789
13006A77281b05732B87431B2191Q4611a59426B49167B0996J69053C8934A7458
$$ 177281 -205732 287431 22191 106802 -159426 249167 20996 190049 38934 17458
12995i3907L351C8121Q403a30260B75638a65232D6829a32342B06076B0366i3001
$$ -93907 -90556 38121 46524 -130260 275638 -165232 46829 -132342 206076 20366 -93001
12983G8180P4312J22826i5173C6563J06469K34505G8375g7950D0112b17339B65958
$$ 78180 152492 275318 -95173 36563 143032 377537 78375 -77950 40112 -217339 265958
12971C9450M3754b03465P0898J5805a0989n3161o6296C29413A5819N1534R8327
$$ 39450 83204 -203465 -132567 -116762 -10989 -64150 -130446 329413 15819 67353 165680
12960A65680l7007a54631j20835B76268g4397b3768A38392J3858a29183I0951
$$ 165680 128673 -154631 -275466 276268 -74397 -23768 138392 152250 -129183 90951
12949A43496c5747J0513A95420A4281M2457Q0490h1849C19670i4479A18976a59267
$$ 143496 -35747 -25234 195420 14281 56738 137228 -81849 319670 -94479 118976 -159267
12937a12732e4963O191A94063J23608b61118C25179b78584B629M98b44261M7213
$$ -112732 -54963 -48772 194063 317671 -261118 325179 -278584 2629 3127 -244261 -197048
12926a97048H4228b70557B1362b7870B61386b10173g8931j5862M1432A02809J78069
$$ -197048 84228 -270557 21362 -27870 261386 -210173 -78931 -94793 -53361 102809 280878
12915B80878H696h0742j43696L4479B23059q1614n8783M0259l2776a80550a2339
$$ 280878 8696 -80742 -224438 -189959 223059 141445 82662 122921 90145 -180550 -12339
12903E46228a91277b3250l4417B4277d6959G7664f5851F9389b24345A40351a42800
$$ 546228 -191277 -23250 -57667 24277 -46959 77664 -65851 69389 -224345 140351 -142800
12891C26620a06168c9568l7991A71139a2203m0599E8286c57960J71229A71286
$$ 326620 -106168 -39568 -77559 171139 -12203 -52802 58286 -357960 -186731 171286
12880f8883H4223P6752d2003I5433a19307A80446k5011b25250N8679A6552M41500
$$ -68883 84223 160975 -42003 95433 -119307 180446 155435 -225250 -166571 16552 458052
12869D58052A01267a39212e2817B55308C1277K11306p801a25750B98804m9469
$$ 458052 101267 -139212 -52817 255308 31277 242583 234782 -125750 298804 249335
12859B49335a94931H2743J40735k7653a35787f6216B01310e2129m4793F1650b3982
$$ 249335 -194931 82743 223478 195825 -135787 -66216 201310 -52129 -96922 61650 -23982
12847B8625K49661j14613G2014P5721o5884O3177L4043O2057p028O310Q5628C416
$$ 28625 278286 163673 72014 147735 81851 145028 179071 241128 234100 240410 326038 3416
12834E2849O9090B3712a41063B06091g3584C8282f396B82063c5551A42973N9477
$$ 52849 121939 23712 -141063 206091 -73584 38282 -6396 282063 -35551 142973 202450
12823B02450a9195j97245B57780c26767d2023D32337h0101H6833a10104k01385
$$ 202450 -19195 -216440 257780 -326767 -42023 432337 -80101 86833 -110104 -311489
12813c11489A60646f6177k4524c9690A18833l1647K2581i2145D5616f5748j18508
$$ -311489 160646 -66177 -90701 -39690 118833 87186 109767 -92145 45616 -65748 -184256
12802a84256j7376i310q8069q3372E4514a39445Q639C10899b68463B7974P4058
$$ -184256 -201632 -9310 -97379 -180751 54514 -139445 -130806 310899 -268463 27974 102032
12791A02032b54352m979G3049R617J21783r541b7351A17917i8845d2797A58837
$$ 102032 -254352 -259331 73049 82666 204449 194908 -27351 117917 -98845 -42797 158837
12779D15639B1528L0418J86027h0874A25616F0179a31880G8797a83869A89638
$$ 415639 21528 51946 237973 -80874 125616 60179 -131880 78797 -183869 189638
12768B01977O3050D3218K55470j48946D434c54586a6900c724j72338A55273R7012
$$ 201977 265027 43218 298688 149742 4434 -354586 -16900 -3724 -176062 155273 252285
12757B52285r7320a0800E6030b1299k09849e7427A28451a36769b478j86651B11975
$$ 252285 154965 -10800 56030 -21299 -231148 -57427 128451 -136769 -2478 -189129 211975
12745G6851a86243m0281B05193o2151a02621K6011D5374P8461E7298K52376A25079
$$ 76851 -186243 -226524 205193 143042 -102621 -76610 45374 123835 57298 309674 125079
12733B43334j8614B20K38647C7662P8304K49879f388B16834F2310L42955f6474
$$ 243334 224720 220 238867 37662 115966 365845 -6388 216834 62310 405265 -66474
12721a50261b1395k29993A56974c29362A63311R7180b13027A88467m7367a58277
$$ -150261 -21395 -251388 156974 -329362 163311 260491 -213027 188467 141100 -158277
12710A69725m9703K38093j56375M8864B173K68263q7244c151B27745D6870J21618
$$ 169725 120022 358115 201740 250604 2173 270436 183192 -3151 227745 46870 168488
12699A68488H764b24468A69950a15175l7119I2732a09206C78236h4853l4948A83950
$$ 168488 8764 -224468 169950 -115175 -152294 92732 -109206 378236 -84853 -119801 183950
12687a10836d2629e494C30820A07487a19168j34265i4461q5407A5629Q2L65819
$$ -110836 -42629 -5494 330820 107487 -119168 -253433 -94461 -179868 15629 15711 381530
12676C81530a97453A32868Q6294J19985f7887p5467F5513J34421R331a72558C73813
$$ 381530 -197453 132868 219162 339147 -67887 -143354 65513 199934 209265 -172558 373813
12664c2327k3874F1446h8089k28962A11847b44406A13930d3582B14270p2044c3053
$$ -32327 -56201 61446 -88089 -317051 111847 -244406 113930 -43582 214270 142226 -33053
12652b85951d2607A10660E32L08813a11264j8276a5051B45935b3170j5203B13461
$$ -285951 -42607 110660 532 309345 -111264 -129540 -15051 245935 -23170 -38373 213461
12640B31861p7374J80860A2232g6042C79987g0019A39441n7652K32008b30540
$$ 231861 154487 335347 12232 -76042 379987 -70019 139441 81789 313797 -230540
12629A53094k7615K62233j16270N1599M5276A34135J2639c2439A03942n089J25489
$$ 153094 125479 387712 271442 323041 368317 134135 146774 -32439 103942 98853 224342
12618B24342J02419i8520c0478D00933b15286c6517A9842K3352J563h3088k04325
$$ 224342 326761 -98520 -30478 400933 -215286 -36517 19842 43194 44757 -83088 -287413
12607b87413f8749A93962a74973C4763L6615a74366e2719C36686g566m0656A61099
$$ -287413 -68749 193962 -174973 34763 71378 -174366 -52719 336686 -7566 -48222 161099
12595B08245p3070D3240B1161c0943o0677A12411a18137A8131a20759a4909o0137
$$ 208245 135175 43240 21161 -30943 -91620 112411 -118137 18131 -120759 -14909 -75046
12584g5046H4963J01895m9401a01791H6079J2217a65759I9735k9682o20a75724
$$ -75046 84963 186858 137457 -101791 86079 98296 -165759 99735 70053 69433 -175724
12572B47452a826A3160K28424m2192b69873a6404F0738h7321k0746h157A08325
$$ 247452 -1826 13160 241584 199392 -269873 -16404 60738 -87321 -108067 -8157 108325
12560A64892D601J88994f5275j59317j8958A50743L6842b90762a05802E1307a27927
$$ 164892 4601 193595 -65275 -224592 -243550 150743 187585 -290762 -105802 51307 -127927
12548d8864j08399B8785b67051B1619N2515J25565a629p9008B09934A01632b9896
$$ -48864 -157263 28785 -267051 21619 74134 199699 -1629 -80637 209934 101632 -29896
12536B19948d18107B82874i2344F8780K08028A09909A3035g0661J0972D73075
$$ 219948 -418107 282874 -92344 68780 276808 109909 13035 -70661 -59689 473075
12525G4333C5988R2999a32656a8077j63697G0241J66856a19104o9812P3739D2954
$$ 74333 35988 128987 -132656 -18077 -181774 70241 237097 -119104 -188916 -115177 42954
12513F2351N3842M4829Q6437A21216a5084k62148R0553n506a6195B28563r3067
$$ 62351 116193 161022 247459 121216 -15084 -277232 -186679 -192185 -16195 228563 135496
12502A35496j9587O0180b20161B6135J03612d38899A60602K7087A2835E619J15702
$$ 135496 115909 176089 -220161 26135 129747 -438899 160602 187689 12835 5619 121321
12491A21321e7487a2434A22610i4469A79716m0804m4694l3657L0612a3649j6774
$$ 121321 -57487 -12434 122610 -94469 179716 138912 94218 60561 91173 -13649 -30423
12480c0423j11588A27885i0652j74957c4037A17555K24207b7969E3190a01213
$$ -30423 -142011 127885 -90652 -265609 -34037 117555 341762 -27969 53190 -101213
12469A97266L9674a09626I9266d8224j85360j77228i745k5679a4989j10545M2918
$$ 197266 236940 -109626 99266 -48224 -233584 -410812 -9745 -35424 -14989 -125534 -82616
12458h2616C04020E643M4061d1634A78203H324a25296c9385G9595K18817j01401
$$ -82616 304020 5643 49704 -41634 178203 8324 -125296 -39385 79595 298412 197011
12447A97011a54525p0818n7743R8321H0539f2479C8150n982d4526A65108e5128
$$ 197011 -154525 -225343 -283086 -184765 80539 -62479 38150 32168 -44526 165108 -55128
12435F2217J57853k6649a22694M7861d566m79088B30793B647P4233g2879A07259
$$ 62217 220070 193421 -122694 -74833 -4566 -483654 230793 2647 76880 -72879 107259
12423c0247A1878c3557B20191c21419a35724C5853e4678j96790B56806q9468F6845
$$ -30247 11878 -33557 220191 -321419 -135724 35853 -54678 -251468 256806 167338 66845
12411a57238B75460d5001k28872n3278e017k8523o2240j14712G8509P7790a4757
$$ -157238 275460 -45001 -273873 -327151 -5017 -33540 -95780 -210492 78509 156299 -14757
12399I4833c93958k34J69522B7323O6377b51752a1711j85761J9615H8129b32245
$$ 94833 -393958 -394192 -224670 27323 93700 -251752 -11711 -197472 -177857 88129 -232245
12387a36543B61452c60095a6164B11825p72g7832k12591A84208a5977k69653F1007
$$ -136543 261452 -360095 -16164 211825 211053 -77832 -290423 184208 -15977 -285630 61007
12375a86107k6784R9380j66101D2561h7019a5010B4777a85327G90K83403j5219
$$ -186107 -212891 -113511 -279612 42561 -87019 -15010 24777 -185327 790 284193 268974
12364B68974H9924C5069P8477a35936K679F0840K86243e675j92666P5697A25211
$$ 268974 89924 35069 113546 -135936 -133257 60840 347083 -5675 -198341 -122644 125211
12352B76998o6035h368E3210b09978j2049B30534F6271K5480e8509j32362g1297
$$ 276998 210963 -8368 53210 -209978 -222027 230534 66271 91751 -58509 -190871 -71297
12340E8734a81969C10952C1475a44807j17541F9831B3360a04623f295j34858b9932
$$ 58734 -181969 310952 31475 -144807 -262348 69831 23360 -104623 -6295 -141153 -29932
12328C16663a24754I5087B7735K04962b22138A99273J94069D5705a27714I7768
$$ 316663 -124754 95087 27735 232697 -222138 199273 393342 45705 -127714 97768
12317i8421J6492D9414i4495A8523h6594C2165b6600k29198e0192A03692K7563
$$ -98421 -81929 49414 -94495 18523 -86594 32165 -26600 -255798 -50192 103692 131255
12306A31255F1894R4655H589c473m4490B58071j17762a06054j9705B2682a10257
$$ 131255 61894 156549 8589 -3473 -47963 258071 140309 -106054 -125759 22682 -110257
12294e1972F3996K11587A31446Q1110i6233C66446a39068A46961K9393J31960
$$ -51972 63996 275583 131446 212556 -96233 366446 -139068 146961 176354 308314
12284C08314j00404f5224a4763q2160M441E5503b30537B54123q8209a2221B07314
$$ 308314 207910 -65224 -14763 -96923 -92482 55503 -230537 254123 165914 -12221 207314
12272A53904J05184c7042I0179b8304K443m8016I2523Q530N396J48875N7218e0230
$$ 153904 259088 -37042 90179 -28304 -25861 -73877 92523 101053 106449 255324 312542 -50230
12259D11069b1900k2348C6605b19851A07197K85979A62071c7476C0463g0600j03826
$$ 411069 -21900 -44248 36605 -219851 107197 393176 162071 -37476 30463 -70600 -174426
12248a74426B65964k7935h4377B3989J68880c7807A8611H206Q4587a96949B50741
$$ -174426 265964 238029 -84377 23989 192869 -37807 18611 8206 92793 -196949 250741
12236B09623k710E8095j6119n563a79652D4129J51302K80223j53352p8217n6752
$$ 209623 206913 58095 41976 36413 -179652 44129 195431 475654 322302 244085 187333
12225A87333p4279B964J96166a8072A72108a26449C89103N8760j08047A9219L62036
$$ 187333 113054 2964 199130 -18072 172108 -126449 389103 447863 339816 19219 381255
12214C81255F9668L00600A55963K44301a95920G8048b98341A55144O9162d285
$$ 381255 69668 370268 155963 400264 -195920 78048 -298341 155144 224306 -4285
12203A52922k3601m6201h1167A5930K54481F5030J49081J36526a78655j4199I5906
$$ 152922 129321 83120 -81167 15930 270411 65030 214111 350637 -178655 -192854 95906
12191A70121h3337D9422K18940i0496M0720C94506j40109G3386E823M1325a06569
$$ 170121 -83337 49422 268362 -90496 -49776 394506 254397 73386 5823 47148 -106569
12179B32394R6896A62173R9228D2672L1104b20701c5235B68436F2038K59381A47123
$$ 232394 329290 162173 261401 42672 73776 -220701 -35235 268436 62038 321419 147123
12167b8562A47159O790J53983G7689L67779A08190f428o525A21256B5419Q2672
$$ -28562 147159 153949 307932 77689 445468 108190 -6428 -12953 121256 25419 108091
12156A08091d7811C29312a57764A65153K7989M8372A07792P2392a88962N2116
$$ 108091 -47811 329312 -157764 165153 193142 241514 107792 180184 -188962 -136846
12146a36846A28180e997j29099C3337J00480K6591c38385J19128P2179C59782
$$ -136846 128180 -5997 -135096 33337 133817 160408 -338385 -219257 -147078 359782
12135G0809p257e7600j83355d2974j40340C99575g1061n486A94910H247h5372
$$ 70809 63552 -57600 -240955 -42974 -183314 399575 -71061 -76547 194910 8247 -85372
12123a6035p6208j52077m4737A29943I892c22788E14619k20704D2190j1410h6880
$$ -16035 -92243 -244320 -289057 129943 9892 -322788 514619 293915 42190 30780 -86880
12111B29667g5475q7850C71342a39818k9391R978M125l1681A30796K7357a89j44994
$$ 229667 -75475 -163325 371342 -139818 -169209 -159231 -155106 -186787 130796 158153 -189 -145183
12099a45183A8946J27906b6366l68755A45748B1312b20991B22543b77094M5965
$$ -145183 18946 146852 -26366 -395121 145748 21312 -220991 222543 -277094 -231129
12089b31129A51161F2042d44784A85587a85615c6566k86799J10343h4245A30418
$$ -231129 151161 62042 -444784 185587 -185615 -36566 -323365 -213022 -84245 130418
12078A65858K20785d6758C70513D8593n548J54310J65895P65890l8193C23185
$$ 165858 386643 -46758 370513 48593 43045 197355 363250 1129140 1090947 323185
12067A71843g9254j3272p5871G7781a2561r2714k3776b7233n507p2761A39999
$$ 171843 -79254 -92526 -168397 77781 -12561 -105275 -129051 -27233 -32740 -105501 139999
12055i8264B3790K87854d0617A74945l1345a54412A31885o0844c95177M1875a00379
$$ -98264 23790 311644 -40617 174945 143600 -154412 131885 71041 -395177 -353302 -100379
12043b3729A99471a64186A520J25606F1704a34405J7432j77128Q4678I6776J5221
$$ -23729 199471 -164186 1520 127126 61704 -134405 -116973 -294101 -209423 96776 111997
12032A11997c33449C1587g57A4851J1719c94740F2143J4890A2780i4583G413b40053
$$ 111997 -333449 31587 -757 14851 26570 -394740 62143 77033 12780 -94583 7413 -240053
12019F4144g5130j15214E2918e2568k11499e24p0625j13826A6365d7136m1257
$$ 64144 -75130 -190344 52918 -52568 -264067 -524 -71149 -184975 16365 -47136 -88393
12008h8393g120A54161i2818H7346J1602O5883b14970G8039b12355A79585p7753
$$ -88393 -7120 154161 -92818 87346 98948 164831 -214970 78039 -212355 179585 101832
11997A01832n0170L2267a87866j86301D5112c30534E10068A08316O6958c11282
$$ 101832 51662 83929 -187866 -374167 45112 -330534 510068 108316 175274 -311282
11986a69422f057j32854k3968d2056k14792A90903i6852k38760e3710q1686I1613
$$ -169422 -6057 -138911 -162879 -42056 -256848 190903 -96852 -335612 -53710 -135396 91613
11974a27080A00068a83844d2892I12N2689b81193a20984E377a55973A65532K4149
$$ -127080 100068 -183844 -42892 912 53601 -281193 -120984 5377 -155973 165532 189681
11963A89681C3283L6264R0995a30197A8245M6934b5707B44142m4440c1959m312
$$ 189681 33283 69547 160542 -130197 18245 65179 -25707 244142 199702 -31959 -36271
11952c6271j88268J3444B87089G9687b06830B36368A01201h260l36245a41095
$$ -36271 -224539 -211095 287089 79687 -206830 236368 101201 -8260 -344505 -141095
11941b49618E7004B2972J7947a29987a9313A18679g82009c3042G817J32850b49647
$$ -249618 57004 22972 40919 -129987 -19313 118679 -782009 -33042 7817 140667 -249647
11929h7902B01633b7304A32915k647E5156b50115a07205A02874h0666A7967Q0114
$$ -87902 201633 -27304 132915 130268 55156 -250115 -107205 102874 -80666 17967 98081
11918I8081j9131a89009G5746l2078M4047K2099c1397F1832J77361J089F9577
$$ 98081 78950 -189009 75746 43668 87715 109814 -31397 61832 239193 240282 69577
11906g0148k14719d0750J8820A19327f0968n431A9947J3285P2320J33622I4954
$$ -70148 -284867 -40750 -21930 119327 -60968 -66399 19947 33232 105552 239174 94954
11894C7181M833a45033B2369K16449l4880a01538A39173a20118k8093D4763j2991
$$ 37181 42014 -145033 22369 238818 203938 -101538 139173 -120118 -148211 44763 31772
11883C1772a43458j03755F7802P6650o9316R0450m2275b69775D1659a35014A7926
$$ 31772 -143458 -247213 67802 144452 75136 165586 123311 -269775 41659 -135014 17926
11871f6240m237j14352h1274p3573A0453a35514K9580H5414c01115C09513a98674
$$ -66240 -70477 -184829 -81274 -154847 10453 -135514 -105934 85414 -301115 309513 -198674
11859h2734B4041L2589f8591c1638k97779B68962a2237H9966f5984j45365M5428
$$ -82734 24041 56630 -68591 -31638 -329417 268962 -12237 89966 -65984 -211349 -165921
11848a65921K3646p775i615F3029a56515a336B7365b24407A0022N6268B6681N924
$$ -165921 -142275 -150050 -9615 63029 -156515 -1336 27365 -224407 10022 66290 26681 32605
11836C2605J59713i7986j41994G3495c3150C42663H7655a1163k32529A59520E0823
$$ 32605 192318 -97986 -239980 73495 -33150 342663 87655 -11163 -243692 159520 50823
11824d6498B6318c14977a38542D420a17542H0280J72435b03691o1495B23784H5631
$$ -46498 26318 -314977 -138542 4420 -117542 80280 252715 -203691 -265186 223784 85631
11812A46105j8823o2988b88751G2734k7204a84916k5084H2423a3791k06947O7361
$$ 146105 127282 64294 -288751 72734 45530 -184916 -210000 82423 -13791 -220738 -153377
11801a53377M7823l44592K23439B56332A1736E591d8496C07703a02511b2745q2123
$$ -153377 -105554 -450146 -226707 256332 11736 5591 -48496 307703 -102511 -22745 -104868
11790a04868o7293K059I6067I059b9797H9913J28091Q7865h2185K9076j82516
$$ -104868 -172161 -170102 96067 9059 -29797 89913 218004 305869 -82185 -53109 -235625
11779b35625Q5740A14414d0060j03792B73044a84704L6975I8448g7643a2877A04161
$$ -235625 -149885 114414 -40060 -143852 273044 -184704 -147729 98448 -77643 -12877 104161
11767F1089B0059N2106a3556B2641c36605A03311J9058E5222a35680b3337A49127
$$ 61089 20059 72165 -13556 22641 -336605 103311 122369 55222 -135680 -23337 149127
11755a54726G1039c43024A89188h6146p0045K7100C3473j0630a53611f829F8083
$$ -154726 71039 -343024 189188 -86146 -156191 -129091 33473 22843 -153611 -6829 68083
11743B04114a79553n6237a2772r4712E1820a05599A07273a3687A81277J36861
$$ 204114 -179553 -235790 -12772 -107484 51820 -105599 107273 -13687 181277 318138
11733C18138a39982A67862a87846P9152A94342h8644a5155N018E3005i417A8141
$$ 318138 -139982 167862 -187846 -108694 194342 -88644 -15155 -10137 53005 -9417 18141
11721A27864D2854j1779b8414B97033b9787A54542G4790h4679B98992j32202a1282
$$ 127864 42854 31075 -28414 297033 -29787 154542 74790 -84679 298992 166790 -11282
11709A03155e8974A56018i369E3092L0446a74501A02524c25737O5367a09819I0279
$$ 103155 -58974 156018 -9369 53092 83538 -174501 102524 -325737 -260370 -109819 90279
11697C7637b18587B1057R1558C1907b17270j99279A9480b1197C13750D8303p301
$$ 37637 -218587 21057 112615 31907 -217270 -416549 19480 -21197 313750 48303 41002
11686D1002M36323j78511e6904C66815A27904a24204E1884g9923A32023M8090
$$ 41002 477325 298814 -56904 366815 127904 -124204 51884 -79923 132023 180113
11676A80113J2599q9105b18762A08222P6701a24178B77417A28961J19975c5809
$$ 180113 192712 103607 -218762 108222 184923 -124178 277417 128961 248936 -35809
11665A4715J59079K5455a68017d3389A52003K63466e3843I2243N5267L6588A3379
$$ 14715 173794 199249 -168017 -43389 152003 415469 -53843 92243 147510 184098 13379
11653a54038A55011a23458F4856a03981A05979k2336l9555J03981M8566j0792
$$ -154038 155011 -123458 64856 -103981 105979 83643 44088 148069 196635 185843
11643A85843b51760e3272n7473A62684Q4222F0510J04472K4293c3420B20450E3638
$$ 185843 -251760 -53272 -110745 162684 246906 60510 164982 189275 -33420 220450 53638
11631A62825j3571K0271a250A10832d9300A31026J08968F7945J55804b06343L2536
$$ 162825 149254 169525 -1250 110832 -49300 131026 239994 67945 223749 -206343 -173807
11620a73807A03808L23460p9629a99731A79207p3788Q1927a91972e7839G0900
$$ -173807 103808 427268 347639 -199731 179207 105419 187346 -191972 -57839 70900
11609b58583A2993J1795L25763b54946O7466P1372F2108K15619b3263F0237B1325
$$ -258583 12993 24788 350551 -254946 -187480 -116108 62108 277727 -23263 60237 21325
11597A13956a41481E0256a11682B52178a93458B50339h7362A26803F672K65882
$$ 113956 -141481 50256 -111682 252178 -193458 250339 -87362 126803 6672 272554
11587B72554q8148H8035J02273N1959b47793C03795k6238A6422K10442g4905J1424
$$ 272554 184406 88035 190308 242267 -247793 303795 277557 16422 226864 -74905 -63481
11576f3481A40992a9790A10342J80991A06711L121b06373H796J57790L04555F9151
$$ -63481 140992 -19790 110342 291333 106711 109832 -206373 8796 166586 471141 69151
11564A97065L3522m3971p8236J0328b06056D8513b03379A69829K601B5756K00109
$$ 197065 230587 186616 108380 118708 -206056 48513 -203379 169829 172430 25756 225865
11553B25865B2799J1057a13016A43841a67456n0633E67577D8629N9892J35357
$$ 225865 22799 33856 -113016 143841 -167456 -218089 567577 48629 108521 243878
11543B43878A05286l1546J81907Q6633b15488c2561j01676k7507B18455a18101
$$ 243878 105286 73740 255647 342280 -215488 -32561 -134237 -161744 218455 -118101
11532D2006L93012G9711J6323a73682h4666K3071b2593A91731b93414h8891A49074
$$ 42006 435018 79711 96034 -173682 -84666 -61595 -22593 191731 -293414 -88891 149074
11520F3530a54199f4180A97211I7629K1872n5802M62822f6047o7740A33623M9264
$$ 63530 -154199 -64180 197211 97629 119501 63699 526521 -66047 -133787 133623 182887
11509A82887K1788I4541K64851G2639R7178J94168j36734D538K6546g8260C34414
$$ 182887 204675 94541 359392 72639 169817 363985 227251 4538 31084 -78260 334414
11497g7567a9568B33246O4727A19394B6731K42106A2764a17010E1196q915K03915
$$ -77567 -19568 233246 297973 119394 26731 268837 12764 -117010 51196 42281 246196
11486B46196J9526p405r8764i9449L6761G0591J32822J3404K82852a9655B77073
$$ 246196 265722 258317 159553 -99449 -62688 70591 203413 216817 499669 -19655 277073
11474B08432C7100O582K15771D5831Q4019R2318a83939A46534b36281A74968C279
$$ 208432 37100 43682 259453 45831 129850 222168 -183939 146534 -236281 174968 3279
11462E7401a24785B75355b2732A25339E3627L4444a28074B16167b31890B09222
$$ 57401 -124785 275355 -22732 125339 53627 88071 -128074 216167 -231890 209222
11451a63354E2370J04963J30702j14044p5261N5563j8886f843j8098B06272B8352
$$ -163354 52370 157333 288035 173991 98730 154293 135407 -6843 -24941 206272 28352
11439G8395L79079i628C7583h3058j98292A50740a7775D0655f8463B6038a17161
$$ 78395 457474 -9628 37583 -83058 -281350 150740 -17775 40655 -68463 26038 -117161
11427a20280K7881B91121A15129J10599g3271j11892E7675k2700L40436F9256
$$ -120280 -92399 291121 115129 225728 -73271 -185163 57675 34975 375411 69256
11416A33080J34455N192A9499a75819J5676B91360d8619a8485C62201F6825m241
$$ 133080 267535 272727 19499 -175819 -160143 291360 -48619 -18485 362201 66825 62584
11405F2584e7799C00213M7192a34530B1112J73827k6675d052A5796R230h4074
$$ 62584 -57799 300213 347405 -134530 21112 194939 168264 -4052 15796 25026 -84074
11393A54503J09860a8546n49473A65526a53437K4966C706J553i7614J0751I8815
$$ 154503 264363 -18546 -568019 165526 -153437 -128471 3706 5259 -97614 -86863 98815
11381A65108b36847a14709l9873C78168H6579g6339A5654M1111J8819a56421a0669
$$ 165108 -236847 -114709 -154582 378168 86579 -76339 15654 56765 75584 -156421 -10669
11369B30977g0795F4815L47758D4564J67260c80049G9732g3424j00940Q3964a4144
$$ 230977 -70795 64815 412573 44564 211824 -380049 79732 -73424 -174364 -90400 -14144
11357B89620f4606F226J22935a17416A90144a8251m0625j98836M8060C17322e98193
$$ 289620 -64606 6226 129161 -117416 190144 -18251 -58876 -257712 -209652 317322 -598193
11345B38887f906k07243g6650a2244k17616A93387j0194C9477f235A3642c47229
$$ 238887 -6906 -214149 -76650 -12244 -229860 193387 183193 39477 -6235 13642 -347229
11333F2167b945p679n3468Q661A1960K4107b27607A04049L60625b30561A59140
$$ 62167 -2945 -10624 -64092 -55431 11960 36067 -227607 104049 464674 -230561 159140
11321b69893A31491a35701A10514f2110C60223c7047j06771b1605A32749A572
$$ -269893 131491 -135701 110514 -62110 360223 -37047 -143818 -21605 132749 1572
11310A29114A9192Q7989a99457D2012i9350B30261e761j5470q556G5874J16862
$$ 129114 19192 107181 -199457 42012 -99350 230261 -5761 -21231 -29787 75874 192736
11299A92736a80987I700a24548j8136N0105j74890j02168a70094A97693b40507
$$ 192736 -180987 9700 -124548 -142684 -92579 -267469 -369637 -170094 197693 -240507
11288a29039F7220j8240b00093B4850P2420c50314K3709A9871a39657m6596B40267
$$ -129039 67220 48980 -200093 24850 97270 -350314 -326605 19871 -139657 -186253 240267
11276B08981c2064j42759j08310A94016g4983C3768J17153c20091a52895B9546
$$ 208981 -32064 -174823 -283133 194016 -74983 33768 150921 -320091 -152895 29546
11265A80979a05909L4935l74965a23052A42007a78818B23210b80108A3901h9028
$$ 180979 -105909 -70974 -445939 -123052 142007 -178818 223210 -280108 13901 -89028
11254a8545j3522l85368A87341b05827A74468g7763n3871A90798b02690B22354
$$ -18545 -32067 -417435 187341 -205827 174468 -77763 -131634 190798 -202690 222354
11243A59218a67621D0727d2417j0422k21550d7608A9578P3781a03710o0615N3228
$$ 159218 -167621 40727 -42417 -52839 -274389 -47608 19578 93359 -103710 -164325 -111097
11232a11097e4811r8798A23179b39572B39429J34019a33069d4534k3482a2880
$$ -111097 -54811 -153609 123179 -239572 239429 373448 -133069 -44534 -68016 -12880
11221E9514c8068q8179k46900g6962q5798H4347b57196A33561b99228c5379k50173
$$ 59514 -38068 -126247 -373147 -76962 -162760 84347 -257196 133561 -299228 -35379 -285552
11210b85552h5076A9017B607g0996c83A89532a38891D8553J46974A9955b25102
$$ -285552 -85076 19017 2607 -70996 -383 189532 -138891 48553 195527 19955 -225102
11198A84271a36810A18515b92906a13430M149A64000a87117Q887A26967J43297
$$ 184271 -136810 118515 -292906 -113430 -109281 164000 -187117 -178230 126967 270264
11188B70264a27358K3756j50795a03569L133D3257e2143J1255F8195a27545A99203
$$ 270264 -127358 -103602 -254397 -103569 -100436 43257 -52143 -40888 68195 -127545 199203
11176D9252a5048F7512c86998A35230B806d62696A71567M5011M0955m7849n1601
$$ 49252 -15048 67512 -386998 135230 2806 -462696 171567 216578 257533 209684 158083
11165A58083a93132n2211g88B7512d2460k2187A86824q8707f9924K4627C5923
$$ 158083 -193132 -245343 -788 27512 -42460 -64647 186824 98117 -69924 -45297 35923
11153a78882I0147a07840n0604q0749D8517O0008k0639b24895A17842a49899a6480
$$ -178882 90147 -107840 -158444 -239193 48517 108525 87886 -224895 117842 -149899 -16480
11141F1101a92550C6550C735K02430j02398J11128I7424B5799g6315j45297A71108
$$ 61101 -192550 36550 3735 206165 103767 214895 97424 25799 -76315 -221612 171108
11129h0077A07098a03913J4864A82172j644F3800j5399A6186J94512k5159E2022
$$ -80077 107098 -103913 -89049 182172 180528 63800 48401 16186 210698 185539 52022
11117A75255q0212R5807o90C7989a874A06470L00506i3850n241A6934J55968F0437
$$ 175255 95043 190850 190160 37989 -1874 106470 406976 -93850 -99091 16934 172902 60437
11104F0373K57203j08849G347K19704R2215A51331L0948b95878A4454L24004l3077
$$ 60373 317576 208727 7347 227051 319266 151331 182279 -295878 14454 338458 305381
11093C05381J92361A90910P4687e097C22917O7013j60782M2104j27752M0956E4692
$$ 305381 497742 190910 265597 -5097 322917 389930 229148 271252 143500 184456 54692
11081B02330E6118J37388d314F9662J37393L71707q127B30959f7442E22971j07859
$$ 202330 56118 193506 -4314 69662 207055 578762 570635 230959 -67442 522971 415112
11070D15112b6905C15183J02679m2146R9075A74219L58720n4500L2526j3743N3357
$$ 415112 -26905 315183 417862 375716 474791 174219 532939 478439 510965 497222 550579
11059E50579A79402J72655K13588m3887N2165j07871j889L57031l89463K33804
$$ 550579 179402 352057 565645 521758 573923 466052 464163 821194 431731 665535
11049F65535l1141O2073n5195K08014k66937k79087K50124L86764C57401J43370
$$ 665535 634394 696467 641272 849286 582349 303262 553386 940150 357401 500771
11039E00771p342M07194m06645N4268L16290m25638J09351j48210K62888m7803
$$ 500771 493429 900623 493978 548246 864536 438898 548249 400039 662927 615124
11029F15124L0916J85440k70274j39650J84689k4514k67743P41591n02179n092
$$ 615124 646040 831480 561206 421556 606245 581731 313988 1055579 553400 548308
11019E48308P6161J26732J8159k85794o465j64145P06233m98419m8289J09661
$$ 548308 624469 751201 769360 483566 477101 312956 1019189 520770 472481 582142
11009E82142M0107J25445l73360K7953K1222L68608K8027D05907K32429B50059
$$ 582142 622249 747694 374334 402287 423509 792117 820144 405907 638336 250059
10998G38854l17350K29100k26019K47867K34967m18671J64872q7810N29750l45565
$$ 738854 421504 650604 424585 672452 907419 488748 653620 565810 1095560 749995
10988G49995P2521l97081L62524K16522O3112l84685N41507K21618l64146k68440
$$ 749995 822516 425435 787959 1004481 1067593 682908 1224415 1446033 1081887 813447
10978H13447O86205R38l6986K65924q79O00994L35919l73667J75870l3513l7500
$$ 813447 1499652 1500590 1463604 1729528 1728649 2329643 2665562 2291895 2467765 2434252 2396752
10967B396752l36001k66487j21496p2023p2623M12162o5345P013q8164K47358
$$ 2396752 2060751 1794264 1672768 1600745 1528122 1940284 1874939 1881952 1793788 2041146
10957B041146l28931j45935K34581j56608j46078l19744l03591k8787j18378B38883
$$ 2041146 1712215 1566280 1800861 1644253 1498175 1178431 874840 846053 727675 238883
10946G19473l41382J5714A81627j4793N6576K34742A87900J80853e1356F5388
$$ 719473 378091 393805 181627 166834 223410 458152 187900 368753 -51356 65388
10935A50894N2593k0920G8973N5002c2286C6939R0065a29636I8032N9492o9178
$$ 150894 203487 182567 78973 133975 -32286 36939 127004 -129636 98032 157524 88346
10924H8346r058i7232p5554B62850N5089d8075C8866b5433P197o38k19775A82993
$$ 88346 79288 -97232 -172786 262850 317939 -48075 38866 -25433 -18236 -18874 -238649 182993
10911b15502K580Q8809J4639j64399r9960C1818f2903B08719g2717H4057g8434
$$ -215502 -212922 -124113 -109474 -273873 -373833 31818 -62903 208719 -72717 84057 -78434
10899a67589A53524d8417B9796L7363k4391P6966a80059Q533A38968d0825B05153
$$ -167589 153524 -48417 29796 67159 42768 119734 -180059 -171526 138968 -40825 205153
10887C3725b04825B29718b08098a8259b087o7957A0523L57348E7201a60012j67695
$$ 33725 -204825 229718 -208098 -18259 -2087 -70044 10523 367871 57201 -160012 -327707
10876c27707C06223A22922b38529k29539A98211a54811A67687E7233J51657I7317
$$ -327707 306223 122922 -238529 -468068 198211 -154811 167687 57233 208890 97317
10865a93108J6285b8495n2682A40683h0341j7363r221N555j00182o2529E0076
$$ -193108 -176823 -28495 -81177 140683 -80341 -97704 -106925 -101370 -201552 -264081 50076
10853i1748C45073M7830A21410a63180A09439g208A37419b47117B03186k4008
$$ -91748 345073 392903 121410 -163180 109439 -7208 137419 -247117 203186 179178
10843A79178a10729m0413O1775J9799K6789A23877b14011D3246a72103b3944A08760
$$ 179178 -110729 -151142 -89367 -69568 -42779 123877 -214011 43246 -172103 -23944 108760
10831g4563p5179b9110j95017A62199j1283n5339j6482a136A96459f0298D2004
$$ -74563 -149742 -29110 -224127 162199 150916 95577 79095 -1136 196459 -60298 42004
10819b7620r3323D9488N5179a60247l2494A98005I4056N1062b84854a37163F407
$$ -27620 -120943 49488 104667 -160247 -192741 198005 94056 145118 -284854 -137163 6407
10807d7220G2890c16674J56053j52380Q3608A52167d9920K0621o8027Q185K4012
$$ -47220 72890 -316674 -160621 -313001 -229393 152167 -49920 -29299 -97326 -89141 -65129
10796f5129j99320a1856p6174a3087B37324a55861j97687A57267a06277a2888
$$ -65129 -264449 -11856 -88030 -13087 237324 -155861 -353548 157267 -106277 -12888
10785e52295B2574C925h0199k516B52273a9105j40286N5567d0479b328j98277
$$ -552295 22574 3925 -80199 -82715 252273 -19105 -159391 -103824 -40479 -2328 -200605
10774b00605h1251j09317g274k8785B11376E1306h2087A22968c71795J70228K2209
$$ -200605 -81251 -190568 -7274 -36059 211376 51306 -82087 122968 -371795 -201567 -179358
10763a79358j5402k24984B3434c87668h1784H5824e1647G0483a962A69547b22206
$$ -179358 -194760 -419744 23434 -387668 -81784 85824 -51647 70483 -1962 169547 -222206
10751B82183f5161B16563H6064i7623A41524A2505L27353A41724i5652j89701
$$ 282183 -65161 216563 86064 -97623 141524 12505 339858 141724 -95652 -285353
10741b85353A13983b2330m1003A29345a63476l0629B6231J88973d93255K31438
$$ -285353 113983 -22330 -63333 129345 -163476 -194105 26231 215204 -493255 -261817
10731b61817e6975J4549G6819A9598b54373B99028d52371B45778G8448P4871i498
$$ -261817 -56975 -42426 76819 19598 -254373 299028 -452371 245778 78448 153319 -9498
10719h3261k0636q3288B63336a92594A91676b51193H3246F487b94565G3896a74445
$$ -83261 -103897 -187185 263336 -192594 191676 -251193 83246 6487 -294565 73896 -174445
10707d69277a4349A84661a98381o489g4174j47902D5620a42427J3013C9504J22939
$$ -469277 -14349 184661 -198381 -204870 -74174 -222076 45620 -142427 -129414 39504 162443
10696A62443d4927B28759c74916A67942K1651H5467l5196r341Q3361f6651j7985
$$ 162443 -44927 228759 -374916 167942 189593 85467 50271 40930 124291 -66651 -84636
10685h4636A85562i8237a8074k69056b3180G2739j3006c22115H4844b56289k0554
$$ -84636 185562 -98237 -18074 -287130 -23180 72739 59733 -322115 84844 -256289 -276843
10674b76843B1739b63672n9398j2122F0888A4481P1303b25148a12290J8963R205
$$ -276843 21739 -263672 -323070 -335192 60888 14481 85784 -225148 -112290 -93327 -84122
10663h4122A68813b28818I750J43418b46385I1767a5348A03173b13912M2335f2675
$$ -84122 168813 -228818 9750 153168 -246385 91767 -15348 103173 -213912 -171577 -62675
10651c46247C0617a54047I6622b1184k24607e2542j27152a6929q7590B76428i2900
$$ -346247 30617 -154047 96622 -21184 -245791 -52542 -179694 -16929 -104519 276428 -92900
10639d5949p1127c8007B57962c7797I8889c35333a5694D5049b97977M0125I4883
$$ -45949 -117076 -38007 257962 -37797 98889 -335333 -15694 45049 -297977 -257852 94883
10627a21054r5037l607A43998J9721K2225H5216Q1850a27452o0021A55310b09463
$$ -121054 -216091 -219698 143998 163719 185944 85216 167066 -127452 -187473 155310 -209463
10615b06587d8264C0461K3241d364p1188B63030a07506j05983L4663I9152d1424
$$ -206587 -48264 30461 53702 -4364 -75552 263030 -107506 -213489 -178826 99152 -41424
10603B237c04155e4063k2088K6803J0995B76945c3987j6170j07953O3614n0789
$$ 2237 -304155 -54063 -76151 -49348 -38353 276945 -33987 -50157 -158110 -94496 -145285
10592a45285M1694e0725A2642b82170F7794b97575A28449P1279J0641a95938b1525
$$ -145285 -103591 -50725 12642 -282170 67794 -297575 128449 199728 210369 -195938 -21525
10580A02259a25716I6367a12364d1716I6407K29075a16091j77032I4184A2947
$$ 102259 -125716 96367 -112364 -41716 96407 325482 -116091 -293123 94184 12947
10569b1887k73447a44985O9567F898K08760G9474E079g8597E0635a79667I6531
$$ -21887 -295334 -144985 -75418 6898 215658 79474 5079 -78597 50635 -179667 96531
10557c9787m73143B998J62562c8934q0294l3919j62807A92650b7666k070j17097
$$ -39787 -512930 2998 165560 -38934 -119228 -153147 -315954 192650 -27666 -29736 -146833
10546a46833a6469f099B70008b39406R0681H4720Q4438b28553m0200a12059B313
$$ -146833 -16469 -6099 270008 -239406 -148725 84720 169158 -228553 -268753 -112059 2313
10534H024e5134l73090a28870O243b0849D6524J42886B772a62673O7289D7979
$$ 8024 -55134 -428224 -128870 -122627 -20849 46524 189410 2772 -162673 -95384 47979
10522A42945a766A25055a12952H0295c01359B72661m8614F6220c9718J7949h098
$$ 142945 -1766 125055 -112952 80295 -301359 272661 224047 66220 -39718 -21769 -8098
10510b72834B01321C5339i3400A68691g1447p0993C9047J59320a64530K711d0223
$$ -272834 201321 35339 -93400 168691 -71447 -142440 39047 198367 -164530 -161819 -40223
10498B8151f4181D8798J9900k7255D489M05709A17014b1883A41212c00530A16358
$$ 28151 -64181 48798 68698 41443 4489 410198 117014 -21883 141212 -300530 116358
10486b97197A15775L4316C7475a62139k61148D74737l6373B19029q6935O3872
$$ -297197 115775 150091 37475 -162139 -423287 474737 438364 219029 132094 195966
10476A95966p6288J08712J9992b32200A91472E8528e61557K16680B29543a17933
$$ 195966 119678 228390 248382 -232200 191472 58528 -561557 -344877 229543 -117933
10465e0946B06664c74903A85622a52523N9114a1748k65217J28606k15281a52034
$$ -50946 206664 -374903 185622 -152523 -93409 -11748 -276965 -148359 -363640 -152034
10454a92310j20936E5363g755E5607a09352c2605F1650b17374A5742O2109P5173
$$ -192310 -313246 55363 -7755 55607 -109352 -32605 61650 -217374 15742 77851 153024
10443A53024m0395N30B3995L3123b09238a3628j24622B91495F8912J81874j134
$$ 153024 112629 113159 23995 57118 -209238 -13628 -138250 291495 68912 250786 249652
10432B49652M0454g4231o4277B26872A9868b24952C01772b2837j48197j2652A56816
$$ 249652 290106 -74231 -138508 226872 19868 -224952 301772 -22837 -171034 -183686 156816
10420E9453c3153A54062A9803c2066m4210C063J21454l8978J07436r2586j3988
$$ 59453 -33153 154062 19803 -32066 -76276 3063 124517 85539 192975 100389 86401
10409H6401L279J76955r4482a85920B84810g3214D4534b44344E486g0499j5826
$$ 86401 89680 266635 172153 -185920 284810 -73214 44534 -244344 5486 -70499 -86325
10398h6325F7247f6814j9822B80164A0388J9170a03265A77820g8011J7352o180
$$ -86325 67247 -66814 -86636 280164 10388 29558 -103265 177820 -78011 -60659 -66839
10387f6839C13645b78077A91413C6549K53894E203J72219F2685L3773c5797I750
$$ -66839 313645 -278077 191413 36549 290443 5203 177422 62685 96458 -35797 9750
10375A51609J11183a35089A96047L4739m5868R7281P8082p9895K54468A0187M15224
$$ 151609 262792 -135089 196047 230786 184918 282199 360281 280386 534854 10187 425411
10364D25411A10655J03654p2741J068J7034L57373A50247M3942b3935l80337B20139
$$ 425411 110655 214309 141568 142636 159670 517043 150247 194189 -23935 -404272 220139
10352A53734m0250N09789B88167Q7981L51439C06840P1539G0518O59229l55168
$$ 153734 113484 623273 288167 376148 727587 306840 378379 70518 729747 374579
10342C74579j15478h3952A05029D9696K56291A18417J09215a14783B9666M0879
$$ 374579 259101 -83952 105029 49696 305987 118417 227632 -114783 29666 70545
10332G0545k834L32783F5184J82817r0061l4048J64220d9797A90127l0720J75602
$$ 70545 67711 400494 65184 248001 157940 123892 288112 -49797 190127 159407 335009
10321C35009A13409D6503J06564j5826J945K38112a54322d2982k4369j1974A14312
$$ 335009 113409 46503 153067 137241 139186 377298 -154322 -42982 -67351 -79325 114312
10309c6998B90871g036A44708g3450q7097C23726A28717b33842A79607O212c63102
$$ -36998 290871 -7036 144708 -73450 -160547 323726 128717 -233842 179607 185819 -363102
10297B43550A09412R2252h2007A71397q0186l867a40166j635D41310a82292g9118
$$ 243550 109412 201664 -82007 171397 91211 87344 -140166 -141801 441310 -182292 -79118
10285b23219j66015g6980j69586B19131a38294j45656H5981I282f1848A23709
$$ -223219 -389234 -76980 -246566 219131 -138294 -283950 85981 9282 -61848 123709
10274d14323R8182B30218j13091c06726h6802B05670a42439j7360J5809D525L85920
$$ -414323 -316141 230218 117127 -306726 -86802 205670 -142439 -159799 -143990 4525 390445
10263C90445A27285K7220M9067K08110G9671M68177A41376L28893j41130n8880
$$ 390445 127285 154505 203572 411682 79671 547848 141376 470269 329139 270259
10253B70259d6900k84234A04988J48784e7656D4596a60689A29397a93253A41168
$$ 270259 -46900 -331134 104988 253772 -57656 44596 -160689 129397 -193253 141168
10242a36884d687k03143B7699e0155G4644a88317M5054A82465h6092l67788J53732
$$ -136884 -4687 -207830 27699 -50155 74644 -188317 -143263 182465 -86092 -453880 -300148
10231c00148O3839a778H8895B2534b38618i2086H7459K22810j17278L4986c52975
$$ -300148 -236309 -1778 88895 22534 -238618 -92086 87459 310269 192991 227977 -352975
10219D5400a75112A09300J50448H0879a10823A88084a74061a4567E4639J0737
$$ 45400 -175112 109300 259748 80879 -110823 188084 -174061 -14567 54639 65376
10209F5376g6755Q659k3048m0651j55655k4658l4846a69229P4715K751l8673j44858
$$ 65376 -76755 -68096 -91144 -131795 -287450 -312108 -346954 -169229 -94514 -91763 -130436 -275294
10197b75294A87227f9531l15717a66683B5681a86235M1424E9513c73146a05446
$$ -275294 187227 -69531 -385248 -166683 25681 -186235 -144811 59513 -373146 -105446
10186A2752d72987d6437F3898O6970e997j97217e7091d013j2740B3780i4122k5267
$$ 12752 -472987 -46437 63898 130868 -5997 -203214 -57091 -4013 -16753 23780 -94122 -119389
10174a19389e2328l9337o9683O7722p9762j2257P5659q8859B799J28445b6026
$$ -119389 -52328 -91665 -161348 -93626 -173388 -185645 -109986 -198845 2799 131244 -26026
10162a3292p1324A3208c64132A89660N2841a11031r6787c2278F2965B0728a82029
$$ -13292 -84616 13208 -364132 189660 242501 -111031 -207818 -32278 62965 20728 -182029
10150c15278J24770k24154C1508O2806h9479J8593k79688d4818p9724A48007b32996
$$ -315278 -190508 -414662 31508 94314 -89479 -70886 -350574 -44818 -124542 148007 -232996
10138h2984A18729a2928l2265A4638K6398n119b59633R5417B0945g2046A85134
$$ -82984 118729 -12928 -45193 14638 41036 35917 -259633 -164216 20945 -72046 185134
10126a72172M8919A0726J52009p7569a733A69411C1844a93985K2215A8278C46
$$ -172172 -123253 10726 162735 85166 -1733 169411 31844 -193985 -171770 18278 346
10114b52385a0298k68199c1045A73593b8283A68600a76551J9230G6393L1702C1828
$$ -252385 -10298 -278497 -31045 173593 -28283 168600 -176551 -157321 76393 108095 31828
10102b5646j03329k69738A34459a50514j7820H2665a71731A31130a30143H9833
$$ -25646 -128975 -398713 134459 -150514 -168334 82665 -171731 131130 -130143 89833
10091a95455N5746f4507B4865c789j49428I4918e1509a128j07228F1184c2869
$$ -195455 -139709 -64507 24865 -3789 -153217 94918 -51509 -1128 -108356 61184 -32869
10079b97770B3831J67142O4871q8362k1227a47776E6006h9523H044b45651a10886
$$ -297770 23831 190973 255844 167482 146255 -147776 56006 -89523 8044 -245651 -110886
10067e7586l72547P8882A7848K5584e4367C23274H2396r141b30086O0709h2681
$$ -57586 -430133 -351251 17848 43432 -54367 323274 82396 73255 -230086 -169377 -82681
10055a06839Q773L9310k64822g8251A36553F7181M575e8986B4496a94416q5814
$$ -106839 -98066 -58756 -323578 -78251 136553 67181 71756 -58986 24496 -194416 -280230
10044b80230e0105A64439J95950G3592J74914j00649b59969A22227m6035g1756
$$ -280230 -50105 164439 360389 73592 248506 147857 -259969 122227 76192 -71756
10033a04217B49588a26111q1842B83789a94446J7077I8063A7273b55771J17225
$$ -104217 249588 -126111 -207953 283789 -194446 -177369 98063 17273 -255771 -138546
10023a38546H9075a76542o685A35185b37916j91582q3582f2479A02531P1485c20510
$$ -138546 89075 -176542 -183227 135185 -237916 -429498 -513080 -62479 102531 174016 -320510
10011c35526f4144K207H065a93334E7698A1582d3208B9595b38905L2929o6882
$$ -335526 -64144 -61937 8065 -193334 57698 11582 -43208 29595 -238905 -205976 -272858
10000b72858O8774L7696O9932A48419B660J6458d7273A42930c39747g8817J7648
$$ -272858 -204084 -166388 -96456 148419 2660 19118 -47273 142930 -339747 -78817 -61169
9989f1169a6652p5903b2506G2766b01000F3247R3878b7129M933o284j17186k8
$$ -61169 -16652 -92555 -22506 72766 -201000 63247 157125 -27129 -22196 -28480 -145666 -145694
9977a45694j54688J34675B36752a49234M9981C8847d45234E2511a91430k91527
$$ -145694 -300382 -165707 236752 -149234 -99253 38847 -445234 52511 -191430 -482957
9967d82957B3771e8506k634j78761Q0574l477j56996a5478F8857b11837g4419
$$ -482957 23771 -58506 -61140 -239901 -159327 -162804 -319800 -15478 68857 -211837 -74419
9955b39762h2033D4420J22657c97651A90995b58278J03787A56994h2131A84602
$$ -239762 -82033 44420 167077 -397651 190995 -258278 -154491 156994 -82131 184602
9944A08035J09030a37816C46794d1412m30A9495J20945a98397j40349a20866B58902
$$ 108035 217065 -137816 346794 -41412 -41842 19495 140440 -198397 -338746 -120866 258902
9932h0497A25657B9074a57980j48978J19703k72351c232I5035f7277l9251B1517
$$ -80497 125657 29074 -157980 -306958 -187255 -459606 -3232 95035 -67277 -106528 21517
9920b76860a12608N3129k9355D5278a89973k5181A27648N8847a81687l4461J8338
$$ -276860 -112608 -59479 -88834 45278 -189973 -215154 127648 186495 -181687 -216148 -197810
9909a97810L7796e5025B02744n4981a63617B1583d60617a51563j7799b0024n7326
$$ -197810 -160014 -55025 202744 147763 -163617 21583 -460617 -151563 -169362 -20024 -77350
9898g7350j58636B56611h6053j7950G6030A9289b43949m4605B76504N8087b22150
$$ -77350 -235986 256611 -86053 -104003 76030 19289 -243949 -288554 276504 334591 -222150
9886c84183H643J24908f8099C06292f910D2677B205b85385J11828f5450C4120
$$ -384183 8643 133551 -68099 306292 -6910 42677 2205 -285385 -173557 -65450 34120
9874A10115c38284O5682E5325b85703b5104E322K09887d5770m5804b6619D1711
$$ 110115 -338284 -272602 55325 -285703 -25104 5322 215209 -45770 -91574 -26619 41711
9862b23221K4914j75501a40174j45928J12749b7922l40305J43118k7020A19911
$$ -223221 -198307 -373808 -140174 -286102 -173353 -27922 -368227 -225109 -252129 119911
9851b10919A50206a90283H0916A9041E06c78502J69800R5437j632C54526d1452
$$ -210919 150206 -190283 80916 19041 506 -378502 -208702 -113265 -114897 354526 -41452
9839a52196A03162a22145j19746J8348d3773g239j95332O7869C30567E7484b8293
$$ -152196 103162 -122145 -241891 -223543 -43773 -7239 -202571 -134702 330567 57484 -28293
9827C0047K2162L6901B0601J69180a53768C491g7061b09D14111a3096B8016L7812
$$ 30047 52209 89110 20601 189781 -153768 3491 -77061 -209 414111 -13096 28016 65828
9815F5828A7717i2804B03014A5954b01558C24166c10596a48605j6140q7722f8362
$$ 65828 17717 -92804 203014 15954 -201558 324166 -310596 -148605 -164745 -252467 -68362
9803A44856a66396r8556A25259E1292a3373C5192K09906f2933C9176d8437A6905
$$ 144856 -166396 -264952 125259 51292 -13373 35192 245098 -62933 39176 -48437 16905
9791D04274c78682J67982q1963f8945A6029a39039j20185c496A201Q2336c16795
$$ 404274 -378682 -210700 -292663 -68945 16029 -139039 -259224 -3496 1201 83537 -316795
9779b27783G5109i6322l6109I1894b75000J34616q5265F4095b51086H5314b80269
$$ -227783 75109 -96322 -132431 91894 -275000 -140384 -225649 64095 -251086 85314 -280269
9767c19130k2906g3327C61274I4548B7726b72183b7365B71283c2917A58823c59078
$$ -319130 -342036 -73327 361274 94548 27726 -272183 -27365 271283 -32917 158823 -359078
9755A27524c6558A20372a87536j43161J27150C3668c74275A780a58364F7975b09522
$$ 127524 -36558 120372 -187536 -330697 -203547 33668 -374275 1780 -158364 67975 -209522
9743c6026C03581A05368a52901j0808E876b5066j12779A82533e0802A01007J21744
$$ -36026 303581 105368 -152901 -163709 5876 -25066 -137845 182533 -50802 101007 222751
9732B22751k3667H4229b62363J9097F3589k7519c66036C810a68375M7466A37627
$$ 222751 199084 84229 -262363 -243266 63589 36070 -366036 3810 -168375 -120909 137627
9720b2533l03139l0896a01641D10202b82693e3396B64748a87675m4755a03349
$$ -22533 -325672 -356568 -101641 410202 -282693 -53396 264748 -187675 -232430 -103349
9709a60624e4807E0547a18720c6489C4911N3503J16537H5974c32593e518D2124
$$ -160624 -54807 50547 -118720 -36489 34911 88414 204951 85974 -332593 -5518 42124
9697g0251j68990R0706L0220J7011k03656A42030a99271P7138j35484A1997L64856
$$ -70251 -239241 -148535 -118315 -101304 -304960 142030 -199271 -122133 -257617 11997 376853
9686C76853a87595d4930j93205A14634a13659K9183p8859k5121P4182j09176O6436
$$ 376853 -187595 -44930 -238135 114634 -113659 -84476 -163335 -188456 -114274 -223450 -157014
9675a57014C6731M1212f4903G1466F33i6519B74708b90181J35280a231B5566d8107
$$ -157014 36731 77943 -64903 71466 633 -96519 274708 -290181 -154901 -1231 25566 -48107
9662A62597l0279a13782B49408M7110b01760i5863F4906b6886E4545a67238j04670
$$ 162597 132318 -113782 249408 296518 -201760 -95863 64906 -26886 54545 -167238 -271908
9651b71908J23431I4311R4452c9690l7869A56330l0460E6836Q809a98971B09003
$$ -271908 -148477 94311 188763 -39690 -77559 156330 125870 56836 65645 -198971 209003
9639b16017A4245J2758N9177a28414b9218j38606b3023m71252h0558k42415A4266
$$ -216017 14245 27003 86180 -128414 -29218 -167824 -23023 -494275 -80558 -322973 14266
9627A48234a24206M5313a5895j29167l1654d0199A9162a52148G3814b67408M4870
$$ 148234 -124206 -78893 -15895 -145062 -176716 -40199 19162 -152148 73814 -267408 -222538
9616b22538B6734J43032D5275J8526L06651b62906Q7443N5096j31027i8929A39730
$$ -222538 26734 169766 45275 63801 370452 -262906 -175463 -120367 -251394 -98929 139730
9604F1831b62252a22590k59999A81030H2757b47258d648k9481j20249C51216j03983
$$ 61831 -262252 -122590 -382589 181030 82757 -247258 -4648 -34129 -154378 351216 247233
9593B47233a27531G7477L55001c92014a7575o2591r2448j29145Q0466J7892Q2909
$$ 247233 -127531 77477 432478 -392014 -17575 -80166 -172614 -301759 -221293 -203401 -120492
9582a20492F3780c70308J36312J08275C23445b10126P6347G8804a14726B41194
$$ -120492 63780 -370308 -233996 -125721 323445 -210126 -133779 78804 -114726 241194
9571b6342j92657J5801j58871a26399b5809j42931H0454a10469A16849f9729k68674
$$ -26342 -218999 -203198 -362069 -126399 -25809 -168740 80454 -110469 116849 -69729 -338403
9560c38403a57265N0033g023j56504E4163k0808O92N6987K7837b87591a078p0543
$$ -338403 -157265 -107232 -7023 -163527 54163 33355 34047 91034 118871 -287591 -1078 -71621
9548g1621j83301N6026A84894A2471J37641e1902k11841J23427k04126b3053j2512
$$ -71621 -254922 -198896 184894 12471 150112 -51902 -263743 -140316 -344442 -23053 -35565
9537c5565j24875a4972A03830J95110D8967a16129l6722a9596j61362J4483K05
$$ -35565 -160440 -14972 103830 298940 48967 -116129 -152851 -19596 -180958 -166475 -166270
9526a66270B01623a17055J1075A7328d3690A60682b39227L4422A75213d836j9291
$$ -166270 201623 -117055 -105980 17328 -43690 160682 -239227 -204805 175213 -4836 -24127
9515b4127B18911G3249g7186C96579a47456j36656F8615j2071c02823A09571O944
$$ -24127 218911 73249 -77186 396579 -147456 -284112 68615 56544 -302823 109571 116515
9504A16515b31535i2763o2607r5759A51549c03444a36468a1197A47886h209A3035
$$ 116515 -231535 -92763 -155370 -251129 151549 -303444 -136468 -11197 147886 -8209 13035
9492G2973b00052j26953C9925i5280k3413j56966d4530j05230B9297a64529A4914
$$ 72973 -200052 -327005 39925 -95280 -118693 -275659 -44530 -149760 29297 -164529 14914
9480g0645F6617c9777C6311a92333B4914d69508a9924B0238E558O8611b12223
$$ -70645 66617 -39777 36311 -192333 24914 -469508 -19924 20238 5558 74169 -212223
9468h973j42093b7213k70012a11172D729K65258a12752j23799m4705P9208N0332
$$ -8973 -151066 -27213 -297225 -111172 4729 269987 -112752 -236551 -281256 -202048 -151716
9457a51716C34618a52810g5290k76173a45186k664m5942h6589o0912f3845A41034
$$ -151716 334618 -152810 -75290 -351463 -145186 -147850 -193792 -86589 -147501 -63845 141034
9445b60870H9810N5826O647b69266a03072r185j46819A991g327p11k82597h5310
$$ -260870 89810 145636 152283 -269266 -103072 -112257 -259076 1991 -7327 -8038 -290635 -85310
9432D7256b96941c7893r4006B37073F3087K66167h4216B166J42782n4804a16961
$$ 47256 -296941 -37893 -131899 237073 63087 329254 -84216 2166 144948 90144 -116961
9420A12336c5829D9154a24498E5424L0378J9243K8386a62338A16929i1337P559
$$ 112336 -35829 49154 -124498 55424 85802 105045 133431 -162338 116929 -91337 -83778
9409h3778e45m9800k45671G156a40579n70b0310I5027b02933P539A24759h1956
$$ -83778 -545 -50345 -296016 7156 -140579 -141149 -20310 95027 -202933 -195394 124759 -81956
9396b20371C8270c46172a6067A02448a05308j40140A54028a70986A38252b09625
$$ -220371 38270 -346172 -16067 102448 -105308 -245448 154028 -170986 138252 -209625
9385a22803A48074K9782a48993j88479a51985k52517i0298m11756e2660A4654
$$ -122803 148074 177856 -148993 -337472 -151985 -404502 -90298 -502054 -52660 14654
9374G4814O7658F134R8066b61253Q5350Q6501d3037r9815o0607g3499j76427a266
$$ 74814 142472 6134 104200 -261253 -175903 -89402 -43037 -142852 -203459 -73499 -249926 -1266
9361g0422j94580d2775H1002a10391B6587a0712B20386b0413G3122b56884i0318
$$ -70422 -265002 -42775 81002 -110391 26587 -10712 220386 -20413 73122 -256884 -90318
9349A18451f5396n3579e2043j34008j06272A2659N1439E426b61339F4708a04693
$$ 118451 -65396 -118975 -52043 -186051 -292323 12659 64098 5426 -261339 64708 -104693
9337a55603d0212A47911i8653I0229a84658O4033k38345a42364j4588A85596b88001
$$ -155603 -40212 147911 -98653 90229 -184658 -120625 -358970 -142364 -156952 185596 -288001
9325H8037a20026j89089D8197a34199M5361A5618H13R0244a13323A21040i5666
$$ 88037 -120026 -309115 48197 -134199 -88838 15618 813 91057 -113323 121040 -95666
9313B02362b65993B14498c02650I4304b5079E3690g8782j54139f6333j50717j29213
$$ 202362 -265993 214498 -302650 94304 -25079 53690 -78782 -232921 -66333 -217050 -346263
9302c46263A01012L53616C7201a35924A28354C2217h5934M000A6156g9264A53731
$$ -346263 101012 454628 37201 -135924 128354 32217 -85934 -81934 16156 -79264 153731
9290c4013B02055E3981a68062d8434A050b14743R5251A04068b06158r8834P5273
$$ -34013 202055 53981 -168062 -48434 1050 -214743 -119492 104068 -206158 -304992 -229719
9279b29719d958C6477A1642b73707I7199C6368J44298c2545l3961A90229a12275
$$ -229719 -4958 36477 11642 -273707 97199 36368 180666 -32545 -66506 190229 -112275
9267c04669J32764B25789r6032c77647g5843j97805h3222A34387A558d542I003
$$ -304669 -171905 225789 129757 -377647 -75843 -273648 -83222 134387 1558 -4542 9003
9255A09451h6458C082O0266N6018b41180n78a6389j56445f7115I5481i4461L4644
$$ 109451 -86458 3082 63348 119366 -241180 -241758 -16389 -172834 -67115 95481 -94461 -59817
9243e9817A74816n4435E3286e6512C3382K60403a48256L8476F7909i5557r9987
$$ -59817 174816 120381 53286 -56512 33382 293785 -148256 -109780 67909 -95557 -195544
9232a95544d3723A70506b27736l1920A75297e4421F7525K4874K38484f6071F9394
$$ -195544 -43723 170506 -227736 -259656 175297 -54421 67525 92399 330883 -66071 69394
9220b37321J11687L6948A47205a07699A34425k671i9041A07716f4707j21135H102
$$ -237321 -125634 -88686 147205 -107699 134425 131754 -99041 107716 -64707 -185842 8102
9208G4185B005K68794f6717A43872d8623k731O560E0853h792o1795B1181a23725
$$ 74185 2005 270799 -66717 143872 -48623 -51354 -44794 50853 -8792 -70587 21181 -123725
9195I1748g6663j67162O7375j45931a12085E2055a56876P5016k39826J60650B32679
$$ 91748 -76663 -243825 -176450 -322381 -112085 52055 -156876 -81860 -321686 -161036 232679
9183e1622k95431A93700a89725E5866Q6910a97247l2834f8881A47555B8982b97438
$$ -51622 -347053 193700 -189725 55866 142776 -197247 -230081 -68881 147555 28982 -297438
9171b18097C6727O1857a00264n7565k66054J84819D5646J46909B9014J03228i125
$$ -218097 36727 98584 -100264 -157829 -423883 -239064 45646 192555 29014 132242 -9125
9159g7654A71801E0193K50635a63609k49654J42154a5250k13184j00059a02322
$$ -77654 171801 50193 300828 -163609 -413263 -271109 -15250 -228434 -328493 -102322
9148c08821P9527B5854c4793F9812a4068A67076a71431B25943H983f2586A5560
$$ -308821 -229294 25854 -34793 69812 -14068 167076 -171431 225943 8983 -62586 15560
9136D0298h8506D9604c72782B31452q3234a11580j2382c6882j78748k89314C7460
$$ 40298 -88506 49604 -372782 231452 148218 -111580 -123962 -36882 -215630 -504944 37460
9124A74847b0375C1911a70374C7085O496c2652k82569f410D3917d31093A21059
$$ 174847 -20375 31911 -170374 37085 43581 -32652 -315221 -6410 43917 -431093 121059
9112b44926r3429c0818B28364j01156n0408c40717h2282H0486J5486a3805k91395
$$ -244926 -338355 -30818 228364 127208 76800 -340717 -82282 80486 95972 -13805 -305200
9101c05200i6787r3817G7572n165b43777A39948a84472J6166B66324C7567a29786
$$ -305200 -96787 -190604 77572 72407 -243777 139948 -184472 -168306 266324 37567 -129786
9089e9610E5451J61553a64661C34934A47755a28758M7708F7214h037j61188o7423
$$ -59610 55451 217004 -164661 334934 147755 -128758 -81050 67214 -8037 -169225 -236648
9078b36648J0451N0150g8424k37748J22064C74973b41459H089J14761c23804f9900
$$ -236648 -226197 -176047 -78424 -316172 -194108 374973 -241459 8089 122850 -323804 -69900
9066c91858B770i4772a1086j41396G5203a82809M6271j20552c7629h918F155a47549
$$ -391858 2770 -94772 -11086 -152482 75203 -182809 -136538 -257090 -37629 -8918 6155 -147549
9053B10303a88328i097j64958N5324j4501l8632F9404h1223B62017e4439B34551
$$ 210303 -188328 -9097 -174055 -118731 -133232 -171864 69404 -81223 262017 -54439 234551
9041a36270d9281E57c89537A65629c73662a66719N2049B9215b3563k26016B16511
$$ -136270 -49281 557 -389537 165629 -373662 -166719 -114670 29215 -23563 -249579 216511
9029C9949L596K8771d1945k51174O3005R2770O7019l2987c1732k07929H7923h023
$$ 39949 43545 72316 -41945 -293119 -230114 -137344 -70325 -103312 -31732 -239661 87923 -8023
9016A9804a69929k8072h99r8999b5830A37183b32245A89185a41733j55828A55031
$$ 19804 -169929 -198001 -899 -99898 -25830 137183 -232245 189185 -141733 -297561 155031
9004B7237g0318k90412a25841l07163A99056h1837I9285b92418g4314l8688E9293
$$ 27237 -70318 -360730 -125841 -433004 199056 -81837 99285 -292418 -74314 -113002 59293
8992A82337c0001j54340k57312A81523P6839D6556J94622I0383a6624j05778f0964
$$ 182337 -30001 -184341 -441653 181523 258362 46556 241178 90383 -16624 -122402 -60964
8980i177j76793D70215b96078L7947f0318l46017C01a64086A14119A107b42948
$$ -9177 -185970 470215 -296078 -258131 -60318 -406335 301 -164086 114119 1107 -242948
8968g6669k10393J12912j03533e6912b1962E6967c35600N5845a0396k66968A00047
$$ -76669 -287062 -174150 -277683 -56912 -21962 56967 -335600 -279755 -10396 -277364 100047
8956G281J31566d4942J4379o9445c4120C0465j0975P8137R0115d2110o0929l0632
$$ 7281 138847 -44942 -30563 -100008 -34120 30465 19490 97627 187742 -42110 -103039 -133671
8944a33671j1405C31028j24769a90613M7619F3833a58905J1992I540J19086B7863
$$ -133671 -145076 331028 206259 -190613 -142994 63833 -158905 -146913 9540 128626 27863
8932A15713a73668B0364P2928j0806a69163A84508E549L31059k430K19470J276000
$$ 115713 -173668 20364 93292 82486 -169163 184508 5549 336608 334178 553648 1829648
8921A829648G53097A17851a59034E3158c7274k03910A5855n172b75275a8561p9721
$$ 1829648 753097 117851 -159034 53158 -37274 -241184 15855 10683 -275275 -18561 -98282
8910i8282r0649e4419I2652m1484b31218j54529e7219K0954k28210A01793m6541
$$ -98282 -188931 -54419 92652 51168 -231218 -385747 -57219 -36265 -264475 101793 55252
8899E5252b24251m7723J16082A17083n6546M2595f2148E8228a79941P6073j6370
$$ 55252 -224251 -271974 -155892 117083 60537 103132 -62148 58228 -179941 -103868 -120238
8888a20238d5415j26717D6155b13694k86303B15027m9312k6695a96859F3054a03401
$$ -120238 -45415 -172132 46155 -213694 -499997 215027 165715 139020 -196859 63054 -103401
8876a88490C3058L5019J97466h7983K6445G993a42905k57993J18410a09418D3816
$$ -188490 33058 68077 265543 -87983 -61538 7993 -142905 -400898 -282488 -109418 43816
8864B3982c3823G8178g4956j66057F0236b1123A35567b04312B44755p9848a90712
$$ 23982 -33823 78178 -74956 -241013 60236 -21123 135567 -204312 244755 164907 -190712
8852D27536a19892i544j84727A57344h8918c6093a6901A13763B5885J31215n7475
$$ 427536 -119892 -9544 -194271 157344 -88918 -36093 -16901 113763 25885 157100 99625
8841I9625a40130r7687j8974A1428b05222B23388b01610g1382A08078J31624E6513
$$ 99625 -140130 -237817 -256791 11428 -205222 223388 -201610 -71382 108078 239702 56513
$$ [...]
##END NTUPLES=NMR SPECTRUM
##END=
