##TITLE=AC1721_HONAH15007_9207496_3N34gzxHaS
##JCAMPDX= 6.0         $$ Bruker NMR JCAMP-DX V2.0
##DATA TYPE= NMR SPECTRUM
##DATA CLASS= NTUPLES
##ORIGIN= BRUKER
##OWNER= Administrator
$$ 1.72 TOPSPIN		Version 2.1
$$ 2015-06-01 18:35:27.155 -0700  Administrator@X
$$ Compression mode = diff/dup
##.OBSERVE FREQUENCY= 400.02188249412
##.OBSERVE NUCLEUS= ^1H
##.ACQUISITION MODE= SIMULTANEOUS (DQD)
##.ACQUISITION SCHEME= undefined
##.AVERAGES= 8
##.DIGITISER RES= 22
##SPECTROMETER/DATA SYSTEM= spect
##.PULSE SEQUENCE= zg30
##.SOLVENT NAME= COFFEE_meoh
##.SHIFT REFERENCE= INTERNAL, COFFEE_meoh, 1, 14.98509
##AUDIT TRAIL= $$ (NUMBER, WHEN, WHO, WHERE, PROCESS, VERSION, WHAT)
$$ ##TITLE= Audit trail, TOPSPIN		Version 2.1
$$ ##JCAMPDX= 5.01
$$ ##ORIGIN= Bruker BioSpin GmbH
$$ ##OWNER= Administrator
$$ $$ E:\/data/COFFEE/nmr/AC1721_HONAH15007_9207496_3N34gzxHaS/10/pdata/1/auditp.txt
$$ ##AUDIT TRAIL=  $$ (NUMBER, WHEN, WHO, WHERE, PROCESS, VERSION, WHAT)
(   1,<2015-06-01 18:35:20.076 -0700>,<Administrator>,<X>,<go>,<TOPSPIN 2.1>,
      <created by zg
	started at 2015-06-01 18:34:14.373 -0700,
	POWCHK enabled, PULCHK disabled,
       configuration hash MD5:
       21 0F 79 D6 B3 7B B4 F6 88 20 88 DB 03 48 BD 9F
       data hash MD5: 64K
       96 27 4E 2D 7A CA 7E 0C 54 FA C1 FA 54 FB 87 5D>)
(   2,<2015-06-01 18:35:23.139 -0700>,<Administrator>,<X>,<proc1d>,<TOPSPIN 2.1>,
      <Start of raw data processing
       efp LB = 0 FT_mod = 6 PKNL = 1 PHC0 = 0 PHC1 = 0 SI = 32K 
       data hash MD5: 32K
       CB 4D 3F A4 6E 50 84 AF 8A 3F 22 02 3F 4A B3 28>)
(   3,<2015-06-01 18:35:23.436 -0700>,<Administrator>,<X>,<proc1d>,<TOPSPIN 2.1>,
      <pk PHC0 = 92.24121 PHC1 = 0 
       data hash MD5: 32K
       5A 2B F2 F0 A0 8D AC 43 2D 2A 74 AF C4 E1 21 68>)
(   4,<2015-06-01 18:35:23.545 -0700>,<Administrator>,<X>,<proc1d>,<TOPSPIN 2.1>,
      <abs ABSG = 1 
       data hash MD5: 32K
       D6 1E A7 B4 8F 5F ED C5 7D AA E9 13 AF 37 19 23>)
(   5,<2015-06-01 18:35:23.608 -0700>,<Administrator>,<X>,<proc1d>,<TOPSPIN 2.1>,
      <abs ABSG = 2 
       data hash MD5: 32K
       6A 67 FB ED 41 83 35 EA C0 61 D0 2D 3C D9 F3 8F>)
(   6,<2015-06-01 18:35:23.670 -0700>,<Administrator>,<X>,<proc1d>,<TOPSPIN 2.1>,
      <abs ABSG = 3 
       data hash MD5: 32K
       E0 2C DA 80 E6 AA 42 1C 1A CA 77 A9 25 40 09 9C>)
(   7,<2015-06-01 18:35:23.733 -0700>,<Administrator>,<X>,<proc1d>,<TOPSPIN 2.1>,
      <abs ABSG = 4 
       data hash MD5: 32K
       FF 40 D1 D1 95 36 DE 0D 32 9D B0 6E 49 BF 0B 82>)
(   8,<2015-06-01 18:35:23.795 -0700>,<Administrator>,<X>,<proc1d>,<TOPSPIN 2.1>,
      <abs ABSG = 5 
       data hash MD5: 32K
       70 B4 9D C2 56 BC D4 D9 75 A1 AE C0 43 96 00 C2>)
$$ ##END=
$$ 
$$ $$ hash MD5
$$ $$ 69 B3 D5 E4 CA 29 D2 22 95 B6 5B 8F 60 33 C8 E5
##$RELAX= 
##$RELAX= 
##$RELAX= 
##$RELAX= 
##$RELAX= 
##$RELAX= 
##$RELAX= 
$$ Bruker specific parameters
$$ --------------------------
##$DU= <E:\>
##$EXPNO= 10
##$NAME= <AC1721_HONAH15007_9207496_3N34gzxHaS>
$$ [...]
150 150 150 150 150 150 150 150
##$TP07= 0
##$TPNAME0= <>
##$TPNAME1= <>
##$TPNAME2= <>
##$TPNAME3= <>
##$TPNAME4= <>
##$TPNAME5= <>
##$TPNAME6= <>
##$TPNAME7= <>
##$TPOAL= (0..7)
0.5 0.5 0.5 0.5 0.5 0.5 0.5 0.5
##$TPOFFS= (0..7)
0 0 0 0 0 0 0 0
##$TUNHIN= 0
##$TUNHOUT= 0
##$TUNXOUT= 0
##$USERA1= <user>
##$USERA2= <user>
##$USERA3= <user>
##$USERA4= <user>
##$USERA5= <user>
##$V9= 5
##$VALIST= <valist>
##$VCLIST= <CCCCCCCCCCCCCCC>
##$VD= 0
##$VDLIST= <DDDDDDDDDDDDDDD>
##$VPLIST= <PPPPPPPPPPPPPPP>
##$VTLIST= <TTTTTTTTTTTTTTT>
##$WBST= 2048
##$WBSW= 25
##$XGAIN= (0..3)
0 0 0 0
##$XL= 0
##$YL= 0
##$YMAX_a= 536626
##$YMIN_a= -457264
##$ZGOPTNS= <>
##$ZL1= 120
##$ZL2= 120
##$ZL3= 120
##$ZL4= 120
##$ABSF1= 14.98509
##$ABSF2= -5.573092
##$ABSG= 5
##$ABSL= 3
##$ALPHA= 0
##$AQORDER= 0
##$ASSFAC= 0
##$ASSFACI= 0
##$ASSFACX= 0
##$ASSWID= 0
##$AUNMP= <proc_prof1d_extract_pilot.lims>
##$AXLEFT= 0
##$AXNAME= <>
##$AXNUC= <1H>
##$AXRIGHT= 0
##$AXTYPE= 0
##$AXUNIT= <>
##$AZFE= 0.1
##$AZFW= 0.1
##$BCFW= 0
##$BC_mod= 0
##$BYTORDP= 0
##$COROFFS= 0
##$CY= 15
##$DATMOD= 1
##$DC= 0
##$DFILT= <>
##$DTYPP= 0
##$F1P= 0
##$F2P= 0
##$FCOR= 0.5
##$FTSIZE= 32768
##$FT_mod= 6
##$GAMMA= 0
##$GB= 0
##$INTBC= 1
##$INTSCL= 1
##$ISEN= 128
##$LB= 0
##$LEV0= 0
##$LPBIN= 0
##$MAXI= 10000
##$MC2= 0
##$MEAN= 0
##$ME_mod= 0
##$MI= 0
##$NCOEF= 0
##$NC_proc= -8
##$NLEV= 6
##$NOISF1= 0
##$NOISF2= 0
##$NSP= 0
##$NTH_PI= 0
##$NZP= 0
##$OFFSET= 14.98509
##$PC= 1
##$PHC0= 92.24121
##$PHC1= 0
##$PH_mod= 1
##$PKNL= yes
##$PPARMOD= 0
##$PPDIAG= 0
##$PPIPTYP= 0
##$PPMPNUM= 2147483647
##$PPRESOL= 1
##$PSCAL= 4
##$PSIGN= 0
##$PYNMP= <proc.py>
##$REVERSE= no
##$SF= 400.02
##$SI= 32768
##$SIGF1= 0
##$SIGF2= 0
##$SINO= 400
##$SIOLD= 32768
##$SPECTYP= <>
##$SREGLST= <1H.CDCl3>
##$SSB= 0
##$STSI= 32768
##$STSR= 0
##$SW_p= 8223.68421052631
##$SYMM= 0
##$S_DEV= 0
##$TDeff= 65536
##$TDoff= 0
##$TI= <>
##$TILT= no
##$TM1= 0
##$TM2= 0
##$TOPLEV= 0
##$USERP1= <user>
##$USERP2= <user>
##$USERP3= <user>
##$USERP4= <user>
##$USERP5= <user>
##$WDW= 1
##$XDIM= 32768
##$YMAX_p= 387916751
##$YMIN_p= -723655
##$CURPLOT= <Network HP LaserJet P1505>
##$CURPRIN= <$Network HP LaserJet P1505>
##$DFORMAT= <normdp>
##$LAYOUT= <+/1D_H.xwp>
##$LFORMAT= <normlp>
##$PFORMAT= <normpl>
##$SURQMSG= 1
$$ End of Bruker specific parameters
$$ ---------------------------------
##NTUPLES= NMR SPECTRUM
##VAR_NAME=  FREQUENCY,     SPECTRUM/REAL,   SPECTRUM/IMAG
##SYMBOL=    X,             R,               I
##VAR_TYPE=  INDEPENDENT,   DEPENDENT,       DEPENDENT
##VAR_FORM=  AFFN,          ASDF,            ASDF
##VAR_DIM=   32768,         32768,           32768
##UNITS=     HZ,            ARBITRARY UNITS, ARBITRARY UNITS
##FACTOR=    0.250966925370066, 1,           1
##FIRST=     8223.43324360094, -67213,       -206234
##LAST=      0,             -156619,         -172730
##MIN=       0,             -723655,         0
##MAX=       8223.43324360094, 387916751,    0
$$ Real data points
##PAGE= N=1
##DATA TABLE= (X++(R..R)), XYDATA
$$ [...]
23869 -34654 111055 -186000 130130 -104748 98423 266345 138218 43535 -40104 -46295 79266
23857 366696 -157736 36064 34591 -84623 379612 140130 -48800 308184 110742 298068
23847 298068 -81364 -266366 -37134 47234 170850 105891 -24228 325367 8248 -22412 -72732
23836 -72732 244716 -3511 63737 31868 -84506 -66923 -69621 -117736 -723655 -163607 -76500
23824 -153008 17381 -169506 192531 -46257 170887 26201 443116 -159307 5714 -80062 -39270
23812 67443 -139926 -106533 -319310 204153 -122022 228016 52156 -53802 -125333 40231 213718
23801 213718 -60615 -113626 -256426 156708 199036 109126 -177681 76811 23787 45357 -145862
23789 85589 -209820 -135665 -233577 -3409 55427 -254755 56262 -173366 104375 -44577 -60621
23778 -60621 244933 99855 26155 -59008 -60366 -198925 88391 -162574 57131 -161254 126412
23766 325677 -113860 206241 -308334 162891 -97622 258218 -231453 -376957 -227161 13739
23755 -73184 -89250 36371 207090 56869 -131858 108636 -58006 -2991 189563 -203424 -467372
23744 -467372 101478 -202070 165829 79720 19161 -249964 -55755 125351 147099 -217248
23733 -49938 -106938 -130353 -42529 -64630 9684 168127 -6767 -19401 194939 -32618 50120 -225766
23720 -48331 203509 -314393 204127 -242513 -24835 -42971 208383 141341 169373 -222327
23709 13422 -328781 -160535 68327 157632 169071 -104245 -65354 82658 -289148 51742 87759
23698 87759 -150881 90743 -149515 -252587 -4649 -179334 93391 264204 -53444 233381 100122
23686 -171731 -157434 -309110 159970 -41819 -189708 226400 -67456 -206714 -124527 12888
23675 -106879 -193022 26172 96114 104118 -372556 -209006 410695 387358 50845 -290576 -181370
23664 -181370 -211005 240405 -227218 -154388 -167496 180771 -90419 247662 143730 42528
23653 -121227 -14389 -44614 162494 162917 -29886 -181854 28362 197301 -171619 -54118 -124656
23642 -124656 -172473 -71285 -84160 117131 -306082 -37543 23819 -91172 -202317 258653 -52574
23630 83245 -50989 57688 238711 188137 -137157 65096 97645 -170623 -109922 13172 -378288
23618 -57992 -67180 -21261 -3662 -7385 -108196 162478 -81496 -17485 -243414 -312910 19958 130755
23606 130755 -84065 -323180 -39390 -28130 213223 -128513 159617 -154301 -32556 -87822
23596 -87822 162290 -272589 56481 -31650 152085 415825 164155 48211 -251658 108624
23585 201541 31926 -233666 -68286 251983 -180556 -77294 -99176 22574 -122765 246377
23574 72273 -26039 -146765 22301 -69051 8122 62203 228980 -151963 -16099 90111 -116149
23562 120827 -183307 193738 36687 216134 28160 -300454 55081 -6157 128122 182717 -106286
23550 -44966 -11705 37059 238487 -337640 -189974 -344819 51553 -26589 -28053 -15894 10556
23538 58696 149493 300552 101395 120507 264132 97090 -105719 -38227 -181373 132176
23527 42775 147664 211250 341330 105744 -175590 137928 75259 103262 -361651 59674
23516 -193057 101318 -201690 -155812 80268 179216 -106821 -150529 1740 17357 -167431 167855
23504 -2458 -69534 -403042 -101999 36830 -4932 -370022 -16791 233911 118029 -86838 312562
23492 178392 -101484 26213 -261654 52197 -159229 23954 13188 113407 -180672 -209849
23482 -209849 -345694 -217631 69901 -71327 187249 76772 -82985 124878 69712 -202428
23471 220702 -83572 -92609 -45445 49332 -75144 -285226 -24244 -19616 -25011 -248314 -153164 -132086
23459 -132086 -163907 -224848 26032 -76809 -301315 177351 68959 -66760 259336 -29122 -66346
23448 -66346 -44609 32866 -173314 20538 -50476 -77574 114199 197741 -210559 -80143 -250849
23437 -250849 -240895 226698 130819 -235444 -46513 -94801 -307505 239037 -45108 -53637 266314
23425 201908 131261 348976 170037 -128621 -235155 122448 -250590 300057 -72258 -124644
23415 -124644 38397 38191 -389462 -403513 -187809 95778 261703 78130 145764 118022 -452727
23403 77877 55264 166780 138162 101450 -102713 155360 -30610 116088 -496042 -62135 88115
23391 -377776 -123315 323501 -106770 -200434 -2371 -139898 -215929 55202 318478 -26173 30582
23379 -56028 44402 116238 -74120 245395 177597 -266321 182259 56130 129542 133615 96935
23368 96935 -183160 -71324 41534 -224386 56546 -10432 -71997 -252470 -270558 -32392 18319
23356 -39345 -59259 -61355 79915 -117954 -221588 29063 61599 159612 106790 -96828 -176137
23345 -176137 85059 -1356 -80652 27738 -126049 198866 139947 -167689 276082 97416 -72351
23333 -127324 257050 -77866 203956 -82109 17448 161120 272686 26495 550 123209 -144181
23321 -55313 105236 45282 27081 -120769 -261436 -125039 107955 40883 -99155 -175161 -177554
23310 -177554 208613 -46213 -239635 -109693 -199594 -360158 14445 228797 27573 145088
23300 145088 -21478 165907 -34229 -170506 -121035 -252160 -66773 7785 144372 147637 -190805
23288 -44202 347694 -192878 172926 16559 159651 -61971 -278145 -261610 175224 93191
23278 93191 39315 308416 -100825 324830 -144089 -300043 90398 -412268 55275 -133118
23267 82164 -84370 -213029 48881 175608 -145125 -100360 35135 18431 286103 -110847 164822
23255 17879 167696 292269 -69999 -43884 -122 -44385 145293 -171248 126947 -358714 -51681
23243 99617 -133388 152158 -462528 -24936 -219907 26876 9251 225260 -136191 41720 248225
23232 248225 -80283 -310705 -106726 -146304 71303 148874 -74834 164026 70381 -38917 74278
23220 -31048 234626 17669 -5607 -84430 -312025 480 63842 -186032 -294294 116538 75120
23209 75120 61045 -95600 -215645 404 -13739 -157084 -468897 -48354 -48357 151199 -428432 26350
23196 286192 124756 -246432 -199289 149267 -81877 305634 -53289 -5099 329402 44346 -50602
23184 -33989 -456 123816 53272 -54235 -193397 -53224 55731 -343888 180413 -177473 9556
23172 -180924 -177483 -194602 -189992 -158979 180639 68163 85794 -125127 150107 -158588 232758
23160 368998 44513 -343758 19971 15481 15712 -334639 -93991 14062 -37022 -106976 292215
23148 -57650 343604 -84817 -239253 49046 -198603 95836 315139 248927 86768 -92050 -132311
23137 -132311 96361 49852 16620 -164801 243724 -189456 -168621 -13408 -189671 -178067 -138091
23126 -138091 -68665 -361508 -149405 -69398 -120638 85664 64322 -43968 92614 -244598 -60592
23114 159874 -122325 -59365 -205448 -83235 146727 -124373 -216764 -201785 184345 31931
23103 322656 -114336 -106797 37402 339136 -100481 -231326 89565 62440 95123 24083 32995
23092 32995 -108514 -14114 74691 -170989 94812 334341 -201806 5283 -483359 -79944 -186707
23081 -186707 269390 -184077 153473 1222 -49199 -78444 9109 -30067 81884 -51120 237458
23069 -25460 337272 116988 163835 -229821 400992 244146 -6895 111576 4099 -83391 -142498
23058 -142498 165468 -176020 -63859 -192590 11984 73766 58166 -199213 91137 232022
23048 232022 349804 72513 -79129 220984 -216456 83911 -70926 -13650 156435 174028 -22369
23036 -185834 -262375 -227099 258537 503271 -451176 -94204 11765 248144 -292595 -28974
23025 2874 39404 82195 26256 28577 -16357 66209 -38882 -289934 78006 -280976 -438750
23014 -438750 -51242 -170604 -74787 86804 259278 67637 -51830 22346 -117564 -169561 -106793
23003 -106793 -57543 144381 -16647 -176341 168006 -29689 59743 16201 106420 -315873 -1912
22991 -17855 -173762 53966 -168205 -69774 -42042 334897 -107663 -83487 -179564 90367 -89390
22979 29583 263986 371181 -271705 -213052 -3622 -261653 -141401 -355557 -93256 -152981 393191
22967 -147964 323461 104830 -72173 135110 380308 95288 -46198 111611 27409 -127899
22956 1058 102231 50190 291783 -141363 157713 22908 -67770 -251856 -77485 -111137 -262454
22945 -262454 43406 -148813 -121124 -353671 -114995 -18521 -122465 -72395 -232137 -52646
22934 -91525 -97958 -133783 -43276 -352504 29320 -366010 81827 -193411 -234205 -209482 -416343
22923 -416343 -109847 -174041 182011 -24173 -75539 257230 -290141 -39859 -131883 -79094 -357123
22912 -357123 -361443 -63858 -30674 47853 89760 -159671 -194825 -144052 -206383 116675 227493
22901 227493 181100 116688 -159105 191787 -290642 52911 -292490 146220 43062 171066
22891 171066 -73423 -263422 -54430 127871 -50896 -276513 -136707 -113471 -1590 25412 -213615
22879 -31931 -340647 91047 -185964 156163 50075 -60393 -137596 230626 -101587 131442
22868 -187899 111978 334803 132296 89302 -395662 -84910 15252 61238 -183448 56657
22857 174054 140222 -185216 172433 -35341 177584 -108997 6604 64163 -5416 87877 -112540
22845 188135 -126908 -208262 -282786 12766 -19427 221473 34348 381854 8255 -104586 -30481
22833 -131000 -154488 -145901 -101205 92291 224564 -282853 171850 258963 236769 167887 -120459
22821 109602 -149698 -29547 -1136 33371 -258109 -55921 204979 162087 -31346 -44879 257669
22809 -503961 -177759 -48872 -105359 24283 -126665 125157 -68232 -139945 -272295 226520
22798 -115452 -34179 -44298 -397284 -29499 -54398 -95457 -93498 -323124 -67936 -209487 -146748
22787 -146748 -50230 168858 -37012 50750 58709 -107047 -127192 -5896 50639 -90884 -134252
22776 -134252 16377 252679 267662 7096 -121515 140974 105924 -116844 -110609 129722 -21063
22764 4231 92903 -184430 -190129 -93673 -49181 -130446 -82361 -218610 -164753 -86536 -321610
22753 -321610 -247849 -112790 -120523 144705 51299 206668 -154735 -55103 -176419 -19642 -36836
22742 -36836 -34854 -40965 -18251 -265056 107958 -407758 -63751 12505 4288 284026 -317198
22730 94219 100171 -105612 65028 56140 149136 -62923 -141863 -132711 -203997 -297337 129571 -88947
22717 272694 -97678 53821 152473 135147 -56985 -149208 181796 -115307 -80409 299518 5750
22705 220209 172762 -14400 -80879 219278 -355076 32993 -93572 -17298 81030 26823 -55356
22693 -6492 -40782 -332163 43102 61985 42770 39404 -77821 110674 209118 151705 -214157
22681 95528 -101632 -159942 -12037 -153750 -274016 -159938 28145 -368237 -81186 -240498
22671 -240498 -211379 160147 -213585 -55015 -40751 -263776 -195725 -75285 -191639 -141659 76429
22659 -44400 35869 -21885 -118928 -109516 321360 -253019 39931 -182490 -100453 -196362 -273402
22648 -273402 37921 -9326 68056 3100 -76585 73665 -82417 -140925 -267373 8957 -143819 -17192
22635 29001 -73422 -131041 -27518 -142880 -68145 -217521 182875 65690 -269478 54859 24472
22623 -22207 -4423 -41230 231388 -3109 26090 129480 25637 -63472 -48873 -264839 -294921
22612 -294921 -425458 -73897 -13075 -78776 68627 164510 88784 -202782 244492 153842 132759
22601 132759 292011 -157112 52587 29219 -144826 37690 16764 -25614 143883 -4558 -603367
22590 -603367 -4524 -155632 -242605 224731 139057 -214112 10986 222918 -210490 -188979 -12173
22578 -227266 134431 -80631 184456 89664 -121640 -165824 -87756 -48464 29829 209414 101679
22566 -134604 -571190 239323 -215005 -165099 -211334 108314 -270411 -128247 100630 52057
22556 52057 222607 -73651 -72870 -194191 14098 -100810 200031 -64145 95773 -161444 -87688
22545 -87688 -61830 -83429 183185 -300217 -240927 -217017 143500 -255032 -184066 151560 -87384
22533 101613 -303194 -124061 -98020 -95791 -226700 10697 136748 214854 -354781 -109356
22522 -3857 -66923 88319 -110057 45866 89447 -54993 -231896 -95761 16594 -209744 -102528
22510 251376 -108527 -396049 133309 -114858 184625 -262940 -38175 166993 -181055 -85389
22499 80689 -138269 -48008 -234952 167527 326655 -143811 -110094 -100001 89525 209100
22489 209100 -48756 -110386 161374 44957 21917 309508 -154299 67863 55144 -269334 -123915
22477 -238083 -372118 72400 -173956 216720 92337 -56899 -87515 -59662 210676 2941 -113572
22465 -216503 -39177 -146808 -42631 -307377 192862 209037 31368 7579 134943 179536 263730
22454 263730 -158166 -267261 107715 32527 109690 -118168 81734 105125 154494 -222790
22443 -103893 -9422 -120722 71882 53500 87110 -321671 35318 -100179 -109590 42711 32053
22432 32053 -48232 284500 -200859 -94757 -145564 -99974 82944 -3058 -54145 -10974 -4751 -123649
22420 -123649 -118079 81255 83390 84407 -393446 -179536 4808 -208772 167787 74557 75689 132518
22408 132518 -122161 -176822 118567 -186070 122070 -86560 55358 -413662 -131809 13121
22397 -220133 -27896 110333 -14956 -41928 46791 -111970 106808 117771 117523 -88994 -142975
22386 -142975 -208514 205566 -79921 -151410 102704 -198229 -544325 -62507 -107891 -139033 -140495
22375 -140495 58370 -87936 -81014 -65214 -178880 201826 -115186 -116676 -300459 -130624 157214
22363 -192381 -191276 156010 64589 -21080 7516 46893 443164 -61527 266236 122579 48372
22351 34315 -158428 95981 -252294 -391801 -53737 89761 302617 -198696 -382703 179889
22340 22854 306104 124133 -397855 28318 212724 -36045 326085 244943 -70419 -58388 250853
22328 -33669 51752 8724 169685 64793 108413 5893 -302021 -21959 151866 -40810 -275986
22317 -275986 20341 23268 -240480 -118635 -121247 -35116 103067 56934 113102 207976 -32867
22305 -253238 -249175 113716 253824 -20250 -20697 -106933 -245855 72450 198572 -49350 128473
22293 -246257 249197 -229847 -96014 -63455 -138865 -172893 177887 -40354 -13694 195964 39419
22281 72347 -38107 -77899 -155256 24094 -192991 -95583 -66091 -173752 -104809 -13616 165455
22269 -216647 72241 9600 -158792 336006 -249658 37305 716 -235240 -72360 -142053 76822
22257 366871 -121904 206988 -50595 -71508 78059 24280 -87001 321716 -99351 -108080 189014
22245 -102418 115830 -117763 210810 203470 109977 -183797 25819 3056 -164711 -124813 324635
22233 -30493 56610 92942 176274 178556 53468 -103819 -112764 -133295 -261131 -73027 395438
22221 114034 -201396 71441 -213063 -51992 1143 -223713 -293198 -174510 92894 161682 -32648
22209 14968 52846 51737 142507 -291212 -306090 -79676 -218716 -59116 -15765 189867 369897
22198 369897 -90006 -283905 249139 357922 -195684 55442 94357 265479 -44512 -359005
22188 -359005 -221654 -32056 -279520 50389 -166570 -60645 -59535 90404 -131339 -78581 -75740
22177 -75740 -290838 117531 -64150 53563 34333 -216208 -252186 -6700 -34986 94254 268182
22166 268182 12025 -160499 -1691 -84939 164628 -100093 -292050 -148255 324313 -102646
22155 -235874 89716 -153588 -87758 -59608 10160 78938 102273 -136603 -157000 77302 -128321
22143 -56775 49751 -269068 -152977 -243728 -220063 1482 -129971 -83353 171403 100341 -108251
22131 -64516 -379759 149580 -300942 -38934 -329362 42415 -370244 -150416 127269 229943
22121 229943 23045 188973 315706 -41681 30006 132017 -319494 -55589 85157 195458
22111 195458 -212224 413875 -15823 -51528 -252667 164487 -377391 -372349 -260585 5782 23665
22100 23665 -54957 -248223 104183 -28886 -121525 45916 74213 18575 -419424 22201 -47987
22088 -203619 68851 70477 -75090 16063 135872 -124619 19181 6525 6293 -154462 -58464 -197816
22076 -197816 48676 -237021 -168875 -281208 259396 -26473 -37761 -66495 -55253 -69773 151576
22064 254487 456259 126570 -8073 83389 -37545 205430 -291477 281810 -327135 86629
22053 -50860 176760 -355680 -96320 132063 123720 -323140 33842 118817 125086 -217335 -195510
22042 -195510 -55117 -136074 41562 145246 -268201 -221289 1257 -182842 -280794 -142081 -185015
22031 -185015 -236776 -60886 -167338 51081 -246465 -127677 -181440 -194566 90591 -2374 -33320
22020 -33320 -453026 152221 24750 47746 318531 18972 378755 -68858 -129894 -199228 239118
22008 62539 -405020 -89697 -62742 -62626 149577 -55044 -34182 -158394 -314776 76398 -197775
21996 -128730 -322107 52928 61589 -6564 102027 -158381 76384 -118389 23283 -62719 -262120
21985 -262120 59507 -112456 -87125 69198 -70362 -115809 171767 -5451 -236735 258420 17143
21973 104634 218439 -384054 48112 -25761 -67534 -9176 -29107 -130033 -248107 -96816 -164557
21962 -164557 -40081 -32460 72123 -387293 -168968 -55408 -49984 -59410 104733 -13857 115127
21950 -63417 151917 -98714 11890 -100858 -98007 -112628 34274 231301 -266866 53537 204708
21939 204708 200264 -79669 116823 132736 14769 -145895 -242181 -32535 -60651 -47197 30856
21927 86860 34181 19090 -217215 -107715 -25267 44268 48385 106992 -32443 -105216 -201121
21916 -201121 -111337 62706 191909 -225594 -98309 2278 -6080 -63103 -272347 141587 -262346
21904 -350897 23565 233192 -151788 -287083 42677 130877 -163818 -271810 59037 81603
21894 81603 13595 -184596 159995 118885 115553 181219 -56052 -315063 -36925 -120929 236346
21882 -203238 -123853 17266 46611 33756 -115753 -69665 51498 218569 -247272 -56411 204364
21870 -56025 -336893 86248 -195929 -114960 -230593 -140970 -330209 -363712 358170 98022 124647
21859 124647 -59924 196460 150243 115209 142751 -346813 54343 -114370 25668 -126921 -61905
21847 -45002 50932 -57272 -243005 298679 375475 128343 251158 122250 -50487 -342251
21837 -342251 -161896 208544 320574 -153635 59267 -153222 23770 -274426 246202 103567
21826 24211 -177193 -257335 161697 141037 -162881 161714 19927 -158505 -179202 82478 94445
21815 94445 -107470 -135363 4574 181191 -100951 1233 -48010 -267540 -263084 -225886 -28639
21803 189527 -71827 -96419 54514 -353185 -83870 -185394 2698 -48544 262991 -22944 -89498
21792 -89498 -58593 47006 33997 -263299 -85523 147382 139774 -279171 117332 -24838 -71112
21781 -71112 -276569 60926 36240 100532 -10821 -52059 43066 -115839 -114728 -145976 151128
21769 186431 -229222 53364 -43172 -114300 -343271 -10095 -31940 183337 -258754 -196238 150815
21757 -353030 67222 42471 -166303 96064 71103 16715 384406 -315527 72332 -71760 62240
21745 436213 -210865 -100705 207574 -258161 29145 -5195 80593 198494 52119 -224409
21734 36349 -107476 -59886 -123840 -24247 88274 -92308 -234463 111966 154151 121581 128540
21723 128540 272062 -72929 -120714 19872 -56165 -31610 -50407 37058 -212998 -42481 -88890
21712 -88890 -184032 -135372 -398827 80766 91641 134627 -258924 -80885 -135566 24470 65280
21701 65280 112103 -188337 -295556 -7459 -22588 -168065 -279376 -271247 -51943 -152919 -130172
21690 -130172 -12195 -109356 167641 -119594 -257448 -65052 -267703 90745 -81603 138708
21679 -166524 132032 -333659 220386 135433 -39795 -283759 -503202 14008 55852 130813
21669 130813 -72601 -34043 -213802 189320 29124 -169362 -37021 -111711 10096 -83958 -107842
21658 -107842 89145 145687 204044 41225 136390 -1462 80647 47127 -381450 -76367 -101136
21647 -101136 -89263 17745 -8110 -129941 192350 118998 -297503 215118 -247814 185661
21636 -117229 -149332 5235 -350909 94624 278362 -5730 -148888 -457872 -78315 -75401 273082
21624 63856 49705 -95026 -159455 298698 -37932 220583 -91418 -68115 -126201 291119 -343520
21612 -318868 -21657 211652 -104470 -120296 30524 -45831 156240 -250938 12092 -102407
21601 128990 -110655 291355 -150183 124089 328936 193418 -433206 -145 92798 127054
21591 127054 123796 -269006 196855 -46590 184792 -204401 97193 -78050 251162 64188 68692
21580 68692 -259971 -31630 -41303 158043 150603 140380 -43483 253785 28645 180496 -376713
21568 -39969 -68950 3183 -47836 265205 -224300 80061 -395758 -111342 -131224 -128211 -188391
21557 -188391 -319257 -271969 -373991 -81306 -125641 159629 -163607 -333299 -58306 -219892
21547 -219892 -137330 59355 -317828 -185370 116005 136703 -325715 35769 -228903 -74544
21536 -132095 -64821 -42086 84716 -335729 -39923 263861 234311 -171297 -17647 -115598 77762
21524 108017 -92293 58973 -48243 -163186 -95040 150188 246428 -87846 117316 248542 -99797
21512 42195 90944 103885 -212331 209696 -54715 -135564 -113266 -115632 110310 -249877 -19565
21500 -38241 -125765 -125831 53442 -66797 116320 -261753 238790 -323445 177660 137473 32635
21488 -421191 108477 -420076 -327021 -79826 -411620 236917 -15558 -304717 56665 212987
21478 212987 -164179 -199261 392142 -57816 -44373 -270165 34527 -105193 -35936 -54574 -18227
21466 37563 -198580 -66857 -27798 61129 -59374 -116005 -113425 15692 -257941 -148170 -146669
21455 -146669 -177998 10036 23342 -240493 -378557 -358248 4354 -136124 13066 171610 125357
21444 125357 49746 130678 206626 122663 321255 127775 293270 324394 232718 134667 198305
21433 198305 119535 168727 -194231 42259 -129267 210846 183721 -108700 -31141 -60177 -48175
21422 -48175 13836 -177030 210107 177105 -28732 -6028 -249327 -14165 -375010 54753 9427
21410 -148036 -323308 112841 -90662 81455 -146324 12202 -67172 -278725 -15656 -310301
21400 -310301 -35662 -239129 -167940 -8192 -259459 -54325 -263954 100214 369464 109827
21389 -153030 -178783 136643 -124640 93299 -477807 193379 -229202 -211198 58390 -274199
21378 103710 -47113 -116667 92169 -169228 -233738 -58083 181980 -138954 -175977 44527 30128
21367 30128 -88231 144735 -268872 154445 246349 -123226 36752 -31909 214720 -77068 -86479
21356 -86479 122604 -73827 -7745 -175916 -84583 242341 -219081 -157003 -134102 -44664 -138010
21345 -138010 -51471 -30526 -125901 -5625 -541326 38488 203237 180448 153505 66327 -139434
21333 -112673 -31340 -124761 13916 -87674 -8322 69861 -16454 -403224 -86093 1756 -99159 -26339
21320 -130571 -165267 -214814 -351997 93245 -249527 112080 -26558 -29839 -150810 -17078 -134990
21309 -134990 -75820 -240183 -148287 -67449 100493 -343765 -108518 68014 -34106 -84133 -176632
21298 -176632 -182075 -109394 -252863 101458 -139421 -69637 -500214 201543 -140107 52869
21287 -227943 103019 114145 -98608 2454 -114722 -57439 -23850 -328790 -382900 212248 -59609
21275 -257515 -179679 82041 155145 118013 -256206 50068 61085 168161 -198439 -31646 263493
21263 -15742 149944 79160 272031 -59657 -104934 326150 -7741 -208189 216943 -84148 -259041
21252 -259041 149717 -201134 70800 -184598 139498 -119417 -58393 149157 -65318 -270565
21242 -270565 424073 -283201 146548 -168347 32006 -80576 120664 -168173 96263 242878
21232 242878 58477 -31947 -216615 108703 134836 176641 131622 -93791 -151907 220878 -190520
21220 -154195 113498 151760 227114 -208939 128794 -140053 147732 -147727 195962 -98763
21209 -184338 10986 -324302 58691 -178072 17078 38578 -296798 -33038 70168 -10964 -300379
21198 -300379 288552 114762 -149354 -209915 43212 -299582 -367417 -192659 46394 -153965
21187 -42099 33008 65981 -106579 137434 -272815 -289723 282038 -116850 53324 272823
21177 272823 -335303 -112175 -71788 49432 43752 -172694 -219065 -152554 -180453 11235 -109628
21165 117509 -5610 -320353 189891 -89171 -192460 -12408 -31221 94974 -120730 157997 146605
21154 146605 135488 -78986 91778 44923 -266770 -250152 52354 19284 115744 -48106 65143
21142 -439499 266876 -411752 86753 -21188 -110331 13706 -103276 -133990 -503238 288589
21131 19585 -234494 328352 260001 -74587 -416903 238665 -72295 -136958 -186375 -180295 -134038
21120 -134038 -333986 -216130 -192750 -64454 -31355 -150152 -44682 -264144 -210242 -31085 -60966
21109 -60966 -135357 -56282 134816 324839 76762 88032 15657 -226941 -224342 -13409 -538962
21098 -538962 209038 -144280 -128047 4657 30954 110534 -23273 -63572 -437121 -83264 -4887
21086 -132786 -251136 343755 -217274 -4321 -254726 9711 101283 -198482 -31713 -383338 200093
21074 129312 -191206 -372628 -23707 169433 84036 149911 31709 159762 50071 -157738
21063 -309739 142811 225817 -19369 109767 2891 -96879 -104421 83403 145751 -302287 86244
21051 40410 23670 15625 -56790 -220289 130685 -81965 30044 -219701 -30464 71717 -146246
21039 38640 -395870 97788 -34993 -148784 82430 197675 159107 306334 -286539 124986
21028 57775 -151994 -319 -353551 -167724 20053 -140 6346 32048 -63609 40394 84917 -193300
21015 -6415 -117366 -14085 -171842 189200 44146 73340 -31699 -54901 -277955 160450 -142351
21003 752 31843 4428 -59168 -206606 -148112 -342465 -243121 -229683 37555 -12962 -57328 68081
20990 -50671 101522 -232864 81644 3997 -76073 -23759 -132754 -239853 -187674 -421096 -16796
20978 -336128 356159 -105845 -250060 -177181 93469 24281 -205580 54019 174081 332487
20968 332487 255722 37304 247102 86977 -192178 40264 129270 -374051 -18724 -162369 99450
20956 -175645 -223189 177750 -256550 -200812 48127 -87734 57147 -128664 -196072 593104 -39075
20944 -161546 -305973 -257327 -121912 -101431 -14762 8137 59900 202509 182143 30881 -95945
20932 151973 -77314 -165070 -204019 160633 140175 136956 239123 -75928 -26732 62099 -178879
20920 3654 -171850 22209 244996 -119571 -69592 -409161 98535 -137410 -82047 -64551 12591
20908 -45208 461375 -265422 -107180 -310088 -206503 -49912 -197154 -21604 168703 -191874
20897 -6389 114154 -185699 209101 -59461 -160829 30785 125636 151041 -295741 -371561 -102199
20885 -111774 -302018 42378 25764 -53961 -68441 -79839 -133850 192015 -533715 -254128 -66136
20873 -49697 34954 253815 -21969 -241299 -39959 254614 -302013 -2590 -86857 -54237 66777
20861 78375 -142167 -205966 -28509 -41206 -162353 32087 -197386 68511 -214490 89862 -50314
20849 -396320 125723 -261366 44979 79654 -319765 -85772 81527 -235963 -29447 -158088
20839 -158088 213427 180719 272555 -383804 -102551 226154 -98270 -76952 -212413 -52968
20828 -1980 30031 -43973 187641 83034 210358 196877 -159510 -234165 -96465 -287906 -1967
20816 30302 -191466 -268776 46995 62005 -206446 -9904 152742 -61196 57776 -246990 -403308
20805 -403308 -82328 -117000 41418 25658 -14409 -125440 -168268 -194785 -212308 -265747 -134059
20794 -134059 -164595 -134763 152380 -235595 205 -112211 154940 101171 -129646 40763 -77502
20782 16371 71530 -81688 -157455 -5495 -172754 46785 54286 228195 19733 -417827 108196
20770 1911 63839 -6941 -33417 -184968 2557 -148625 151031 -214048 -239809 40579 218361
20759 218361 -39185 -406823 -283798 -48252 -65919 -83185 -17207 289982 332477 -380059 -487161
20748 -487161 84345 -172056 40350 -372622 -193793 -49160 -50323 -107504 128764 -184375 -92864
20737 -92864 -121779 54011 -226270 -18293 7423 3587 -80316 90833 89535 -121679 -178174 201165
20724 46202 475678 86069 -98536 64853 -151329 -480224 4487 366539 -37851 271573 -167243
20712 172259 -232105 160378 -164619 -127040 -321653 -311568 -128523 26898 -45112 -165604
20702 -165604 -233911 127900 205022 184483 -287476 -99229 215626 -10190 47630 4051 -110247
20690 -75318 -39775 -99270 183443 -201964 136833 -285528 44324 -129900 128054 -322941
20679 -240837 -15065 -137445 -5092 -237127 -48449 -32011 59507 17761 -14838 -39831 -142950
20668 -142950 -163388 123687 175796 172311 172481 -120113 -130752 94967 6159 123189 -214303
20656 179495 -84486 -125973 -53281 -26865 140775 217481 -32275 -10471 145560 157905 -77863
20644 43149 -60593 -34598 57606 311033 171305 206912 125863 -257940 22488 -381561 -440551
20633 -440551 -322251 -122427 19568 -50034 -111904 -116213 -105328 -71794 -78938 -232890 50696
20621 54330 -243713 47802 -109114 -288731 -73514 89727 54929 139182 -56041 -76649 -22952
20609 37610 -70989 -189415 -354576 183252 -21450 -107166 -150556 -157402 -19780 -290319 14636
20597 85152 -226086 43867 -57082 -50770 106751 -218507 -6528 -126787 -129052 -165701 176521
20585 -96718 313997 -3409 214146 -39484 106476 -258538 -54640 -174259 -199667 -35663 -258633
20574 -258633 -54430 289954 -131370 -29598 -175969 48037 97555 34705 -81648 80420 -127798
20562 120219 -89451 -173510 -339635 -246574 122662 -160008 -280118 189825 85406 -138518
20551 22589 262812 132148 73374 -212970 -87610 142770 -392025 -75868 30806 -32006 -7456
20539 174744 -112014 -167292 -5253 95159 8398 -67641 -55882 -176844 265874 341441 -110210
20527 -113820 -144367 52203 229505 -163824 -291491 -165989 58212 -288344 -287339 -947 109727
20515 -28112 69735 22542 -49864 -9049 131733 62611 -63706 -269896 -96991 -247608 25766
20503 -4481 -62187 -177985 -149880 -105647 139447 -124528 -54554 -20365 -61782 -46238 365472
20491 -141039 351267 -194970 108152 -235060 -56161 7660 119005 86476 -85925 -67695 53024
20479 -78364 -120736 13390 185637 147749 110713 65311 -217161 147849 -112140 53045 -398618
20467 -69172 -246648 287310 -55331 -39820 -102776 -46493 -81550 57794 88995 -824 -92680 -154964
20455 -154964 103680 -369178 -8021 -43902 -45126 197841 50511 99394 -156519 -107472 -213644
20444 -213644 -209631 -87120 -40539 58649 125704 -119500 -74980 -164685 -36782 98671 -93108
20432 53982 -80058 -194613 119672 30747 -67133 -92299 -378275 -130774 -188209 22924 -206715
20420 29676 -55683 -46959 -169898 -89747 -80326 122570 -40584 54358 -377106 -324916 -355885
20409 -355885 -43701 154519 -148607 -482542 -106390 68801 -189077 -127945 -382368 38316
20398 -1010 107385 -83410 212372 63570 -307006 225564 -262082 -205136 -176948 150448 177652
20387 177652 -138584 -90693 193477 154108 -140839 -231427 -18755 -132443 -133524 -207432 -214136
20376 -214136 -146603 -273872 -193938 -224992 -12330 41753 131616 -184571 61820 34442 -31969
20364 109056 -93931 -62704 74928 -138267 -92434 127305 96064 -123709 11019 -244983 -28792
20352 -91071 254933 -177070 -109337 -15411 -35716 -89967 -69164 -350731 29112 -219120 -186875
20341 -186875 -19887 90579 -265052 37176 -83491 -204246 -90938 328150 -111223 75812 -35986
20329 -352800 82129 235398 -96575 18941 79203 -166126 -81827 -67797 -91365 218233 -254235
20317 -202389 172336 -154061 -168594 27724 -120560 -132074 223780 35767 -251167 -37452
20306 203383 -292129 20174 207826 180223 -31669 90523 21293 -93998 -54261 -131 -72991
20295 -72991 -110906 145899 23352 66511 -62473 -81336 100785 4714 -133970 -59866 -66911
20284 -66911 167525 -16134 -247922 -62745 -129866 -300426 258939 -89619 -114484 123308 -89364
20272 81366 -208052 -119156 -393461 -202346 -333787 -246798 -157459 -120318 -150688 -43872 116044
20260 -121791 -216184 -111474 -118886 85614 -180411 -164202 -172433 -208352 -180405 -49808 -104082
20249 -104082 -126882 83864 220731 -7654 17581 -80033 -124021 69526 283738 51541 -42750
20237 98057 73169 192465 -19179 -162120 79936 -117889 -30019 -126042 49147 -132693 119321
20225 -267181 -182811 -128331 -255465 -40214 7632 -156625 -6459 -145986 -91856 284361 -134576
20213 -390902 25380 22967 133339 -153834 -120961 -69226 63158 31171 -158051 27163 -121892
20201 -81380 119832 -124079 -315251 -398154 175078 48922 -308202 9085 -18112 -123595 -351067
20190 -351067 -50804 -98823 -121429 220513 35494 -78654 202963 -196412 34403 105182 -37154
20178 -335430 -247536 217387 -64198 212805 -20116 -289855 77816 129236 -8712 -2347 -61367
20167 -61367 -255997 66050 178615 211339 -69076 281805 -288110 -72720 -64183 -126884 182
20155 1812 122888 -296003 156446 -121672 -105962 -95357 122307 162831 -52693 -16358 123317
20143 104775 -207995 346415 132657 -50588 128399 -173679 -225206 -95717 -144713 -94781
20133 -94781 -82632 -94278 32194 157678 123006 -9485 98128 -107089 73773 -198689 324948
20121 122153 73077 115054 -247622 -231858 -99664 -144167 -155730 53888 -28348 270455 11578
20109 137328 -87163 -200875 103391 -236329 -314446 -90030 16119 -47551 -86110 97186 -379807
20097 61191 162908 -145588 -275328 31659 -89358 -20640 -331783 -46708 239106 -282354
20086 115406 23123 -257031 111233 -157828 -176895 208082 148555 -87419 1021 87051 -217769
20074 -49779 -336167 373961 -173977 263126 109648 -103764 -387513 -179307 -266525 -17397
20063 71634 26978 -231728 -298269 -314029 -149903 -22527 -116698 155277 -264283 -39640 268069
20051 -48401 -60200 172505 247866 -448125 2790 -270735 -30348 -348139 -288300 -68132 -174975
20040 -174975 -313932 132944 -491170 -71235 159864 -170745 164459 141500 -241314 -275223
20030 -275223 -120237 108544 -225314 -8169 -39958 83433 -83000 102176 32054 133622 -228819
20018 -208207 29291 -171599 -132911 26422 -405299 16507 -316282 167262 78055 163198 -110333
20006 192794 -33198 211099 5649 -152152 -82921 -6198 91390 46046 -131345 -266598 81152
19994 256498 -151094 -92752 94544 -330565 -165803 72967 53927 145571 -75752 -190473 -85464
19982 -78938 -21889 -83686 -284151 -240766 -259936 17198 -217653 44015 -217134 -218955 193997
19970 -185899 101399 40875 31036 199263 127023 -31810 -51950 -46197 -267817 110759 -117814
19958 -245062 184217 -12238 -81377 182935 -178627 24998 223937 33622 114224 -93581 -358792
19947 -358792 -130202 -77731 24568 -426529 103326 -98023 -167656 -292080 37251 8479 -241561
19935 5127 40822 -408351 126652 70673 134589 -75750 27657 -171471 -171542 103467 -54486 -379402
19923 -379402 165388 -222687 -70840 -133667 136921 119578 204622 -110026 -96459 -48302 115375
19911 -26509 -72509 258746 -131653 -12847 267248 -93032 -120002 15286 -207889 739 -153594
19899 -71467 311958 227347 115207 95541 -73165 141260 -89658 -189607 126293 -132925 -201990
19888 -201990 408771 -379986 -330036 -301750 -157472 -13871 -223164 69437 -183983 -215401
19878 -215401 71357 59062 -63165 -284243 -5898 -146889 -98049 -62449 -151262 -294093 86828
19866 45806 -387797 257186 -295989 -61843 -249969 -152278 -371568 -41680 196448 -70115
19855 -416085 -118418 11893 -436613 5689 -123453 146880 -190344 -96988 -69967 217810
19844 76888 -79234 -125453 -99185 160779 -68501 152746 -424646 -110860 -73485 38172 -371581
19832 -162365 -336337 45259 -90379 -72005 -203789 65629 -5598 -96087 40291 -199176 -44197
19820 -149985 -58775 -17775 -52235 136016 60315 155484 -1884 6515 -72051 -138980 29261 -48608
19807 -121525 374186 -190061 -30742 -11521 -122392 -92813 180548 -77113 -318268 -159844
19797 -159844 126362 561 -104042 -104909 -21537 -307882 155327 336945 104104 -157362 20372
19785 -13132 -45363 -127490 -54829 -186295 -60081 97149 -140353 -14915 -211202 -80060 238399
19773 123250 31364 -166363 -142168 -3940 -183175 -118828 -140875 -320804 46549 157556 99708
19762 99708 124928 149446 -51074 -177088 -54970 99755 66692 183220 252093 -33282 -293977
19751 -293977 -360236 -140262 96561 -291768 185547 278913 -149344 165148 -76402 239348
19740 -113468 -17929 230709 -74373 -352390 -219487 -239575 230628 -213208 -167997 234394
19729 112207 -207938 -29726 -97132 -98620 7898 55016 79861 -90558 157922 -100223 88253
19717 22616 290506 32820 -218933 -102922 247300 74172 113399 -160383 -406993 -222592
19707 -222592 289255 -198444 -23765 -150411 342393 -70743 16902 -202150 -78693 -1960 -88254
19696 -88254 62208 -129197 67962 472561 -128468 349087 60999 -387310 -62093 -74686 -250118
19685 -250118 132788 -376629 9058 340135 31860 277246 -65313 180356 -145868 54624
19674 -87888 135885 108307 -205148 -67952 -239202 -12854 -196478 32713 -188569 -4260 -41142
19663 -41142 -19158 -82760 175133 -184981 90156 131415 164558 -466405 -190030 135092 -28784
19651 109545 -132345 -46668 55854 -205665 -136870 137145 -223646 -287325 139684 -50529
19640 -135535 -24667 288807 -317616 -131076 48430 -53102 17657 12565 -191819 -296303 -92812
19628 -109688 -127460 -193710 -260906 -53579 -23895 37356 45506 -122936 -92757 92181 -204052
19616 -144917 -178982 -205028 48504 35636 -225980 14570 -225531 88731 20519 258225 -245304
19604 -176117 227008 40719 -268187 105019 -287334 -276434 203004 -393679 58026 14577
19593 34283 -83297 -57089 -131237 -59555 -267270 163954 92152 90109 -171597 -88856 -126601
19582 -126601 205894 -1505 -216203 -132688 -77661 -300067 -204529 -176961 15795 -303999 -16945
19570 16203 14007 154428 -198380 -58270 37470 -31483 64996 99400 -322967 23643 -110060
19558 -136153 -88546 -2617 -347716 -422095 -130325 87601 -24773 59515 -21586 -23109 -255381
19547 -255381 25793 59586 9470 -65162 -48914 203433 -404387 -49317 -270784 100538 126091
19536 126091 134431 148481 -110515 -422825 -14802 -274807 -109748 112103 110759 -151050 -47879
19524 -312422 -244842 186125 -246373 -153308 17963 -123770 111495 -320465 242887 -47252
19513 -43675 77327 64188 106956 -198742 -30304 -473841 -121394 -91122 104806 49926 -81172
19501 -130088 -60998 -176300 42089 -273620 23840 131233 101042 94838 -106016 52458 -60473
19489 -10165 106083 -10509 -111978 92819 -176779 77620 -471965 -189162 -45317 14831 12245
19478 12245 81320 81521 -26959 -281219 -16800 201917 2920 -40165 48167 18006 147502 -158856
19465 204782 -234147 -161224 -236319 -162516 154473 34315 22187 66457 -65435 -233173 262129
19453 82875 86440 -95872 341338 -172319 -75953 162317 51868 67493 -113100 127866 -75448
19441 -102679 -30685 -151072 215885 -207066 35177 -150172 52172 66805 152835 141975 -83548
19429 234067 -391787 179386 167829 -109788 52842 215344 -262610 -170768 95685 218350
19419 218350 55914 -340347 -147062 -247835 -14756 -94363 -273906 -291466 290251 -268691
19408 86726 -186283 5938 20938 119121 99753 111964 88434 -21992 27934 54984 -209224
19396 69890 3821 -28389 4417 123431 -27242 -130243 -17934 -269682 -96499 -313690 33482
19384 187142 -351199 -199202 741 -10649 -84351 -150549 53790 -195363 -149328 -268723 -148569
19373 -148569 165099 -380564 -75502 -391186 -219120 -240143 -43892 39662 -57282 -128702 -243821
19362 -243821 -196453 -151745 327759 -228547 -119882 177855 -285096 56813 151426 86419
19352 86419 98701 91087 23278 -389214 28331 -69322 130260 -268240 110268 -213246 45540
19340 -152771 -248580 64164 126364 -405802 160993 4347 -80682 31505 -290209 -134363 30305
19328 431867 -10167 -175448 25783 -272087 23637 10451 -102310 -11546 -45135 53654 264706
19317 264706 -388173 -202468 -78256 97429 -50005 -64713 -108311 68049 108494 -53091 -25285
19305 -368082 -324784 -112012 -148010 -172308 -145407 274274 -10874 29288 -263623 232703 -45450
19293 63086 -35817 -219724 30768 -239936 -27654 238551 -148625 59487 165306 53912 -19247
19281 138082 -137431 -50681 -50578 57239 90842 -263861 -199247 -147437 -4920 -33787 -87974 -2567
19268 348089 -35959 62826 -61807 42157 -157624 -336925 191612 111329 -106863 -220678
19258 -220678 95801 -145011 -87059 -168150 11207 431282 33842 -290762 -85261 24021 -107804
19246 -186931 -71756 -40756 -76762 -109744 -197445 -164452 -15157 119625 -170514 91359 -233505
19234 -194122 305157 130442 36718 5852 -112973 88564 -107737 45875 144603 -72330 -255965
19223 -255965 214267 -199304 -307653 -184699 -314090 -294171 101735 -141640 62064 -45016
19212 -93328 63970 -129126 -65750 55674 -77546 -301461 79755 -93432 -35116 -228973 -31686
19200 -218517 288121 -93209 -210264 108516 88413 10186 -211079 -41607 -188337 -125699
19190 -125699 -384986 49202 -331979 28149 -24494 -87625 -159123 106215 -90576 -139623 -52148
19178 -153427 223872 -422944 -139318 64463 -329512 -271056 27065 96221 89263 -268689 85111
19166 -240421 160898 -56986 41068 -196674 77993 -61236 269411 -128439 -19234 106010
19155 -111062 106221 -246950 -33884 -63651 -331273 -103526 -344505 -104156 -369531 -250899
19145 -250899 113097 -86636 -101600 -130040 81484 -103712 -221858 -42779 116786 -39880 -84047
19134 -84047 -65112 153412 -28395 225623 230111 70937 -147740 -268383 -229140 -7764 -10571
19123 -10571 42288 249946 -210199 -75808 -199299 -83259 -36604 -112823 -49048 -220676 15884
19111 -245716 8284 -205169 -188074 -71305 -433677 -55202 -144752 27232 -187209 -199851 -304828
19100 -304828 -96232 -29256 -49501 53059 -165567 233601 -52169 -202859 -260853 -233992 45717
19088 -255735 -286068 -1897 160072 -99285 -49485 67463 -283664 247480 -351066 69155 -318765
19076 48949 -92686 -35811 29610 171978 -395976 -52238 -145258 -167739 17160 32890 76844
19065 76844 -42552 -149986 -202870 -180282 125758 32691 -110224 -167767 -39694 -258318 111752
19053 219392 174633 -24212 -197727 -40741 -141078 102657 -307010 -77633 -118851 -64613 146955
19041 15906 -36466 -226748 267976 12337 -48569 -44887 -543992 -232786 -4885 143617 -238099
19029 117509 -97567 0 109920 -228440 288612 341773 244833 163052 184652 108483 -200293
19017 113832 -82106 -199586 -80897 61212 259485 -140455 -2030 -133173 62845 135085 14840
19005 81417 -101139 69594 64016 91685 171736 -213931 285444 208768 287167 -135093 -108977
18994 -108977 -142767 -164868 112638 11654 73882 -74374 11054 105607 319148 -37122 24658
18982 -118046 355042 -97471 10411 -211563 -365607 -24862 -201757 347992 168495 -355393
18971 130423 -328819 -150010 -79196 -104910 -124422 7601 -185461 -218791 120508 -48312 -78209
18960 -78209 34964 -94808 -154915 -279297 -146361 -76121 8707 -210059 -7347 -98259 139660
18948 -199892 -64774 307774 133586 118925 14365 -2955 -192458 10204 19690 -78180 -251682
18937 -251682 195313 127276 15259 193467 -2006 -226749 -138047 -69433 -23693 48972 203982
18926 203982 -72937 -197004 141463 105336 61739 -62840 46113 381023 -321993 122571
18915 -78504 159195 14998 -39605 -77074 -456569 93933 -276537 -32884 -183187 -33623 -110759
18904 -110759 -122717 -87956 -423 34307 -243924 15723 -29867 -41866 62597 -62283 -10315 -46233
18892 -46233 -170479 -237575 -224878 -126977 -116577 -293451 -5907 22561 -384641 33132 64914
18881 64914 -220644 57812 -51297 -110107 17256 -28223 -4992 -158258 -198884 -348631 145264
18869 -43301 -61419 21291 87250 4653 -324250 -272715 7353 -18002 281881 11975 126451
18858 126451 -145303 -229170 237963 -255371 141038 125703 -44120 -149093 -46480 85836
18847 241258 59638 10571 59129 -132008 160488 161477 -20040 -174098 -186696 -14852 -81007
18836 -81007 -61983 -96194 1654 -120205 -130696 -107081 28088 -130551 -124308 -154739 -250227 -271209
18824 -271209 438 -341551 -418225 -304642 239782 303386 21442 267604 346073 50435 -150626
18812 207759 172704 269865 125803 -153393 298038 22717 -85502 -27616 121991 -113537
18801 50698 235059 -131736 -196079 -177019 35539 -83132 -144685 -49326 -29727 68110 -174937
18789 -179312 -2206 -121836 -305451 95971 -138921 -73908 -209295 112859 -159076 -125540
18779 -125540 -272354 -95545 -164739 -226922 -11133 14003 -345772 139074 133730 -118371 332809
18767 -44062 145122 194629 91866 114105 -103390 -32425 -180632 -182069 -248298 -66280 -102631
18756 -102631 -290299 -95948 96717 -70181 -111892 121454 -52389 108557 -370421 190444
18745 152594 2837 65885 -137672 -51023 -176034 -264590 -18192 -44762 -198536 251399 -118499
18733 -3267 26891 -97110 -123487 -123742 -65687 167657 -34803 135480 -78999 -195666 -115622 -188212
18721 -188212 -86971 14215 -111188 179581 244856 -76478 93235 -230708 532934 -233383
18710 -113661 10901 20360 115426 -158254 -14695 151981 -182856 33338 180993 -189405 177889
18698 132428 -288688 -334179 -193958 89575 -361315 41464 -252997 69460 -108775 -258467
18688 -258467 292234 -229521 -71345 159070 -114322 -229613 -101413 87695 -62012 42008
18677 -54603 -15092 -73219 403867 -64632 -234310 -77030 203679 -546723 -191280 -192786 92436
18665 145412 -145263 -291891 -176070 -61497 134698 24496 -199007 -96455 -9353 61083 80957
18654 80957 -325129 73268 -128724 55581 -410667 -117817 -80344 -230468 68177 -75313 99958
18642 38110 -429636 382861 126850 -283790 85702 -197267 102785 151220 -292258 71700
18631 -226356 61602 -37200 -48813 -378728 147223 -123403 49901 -203354 -67881 34292 36881
18620 36881 -109385 -116693 59017 8515 -345425 -124777 -253439 40087 -103109 -78731 88221
18608 172914 121032 -160905 55848 -6109 -480983 -146441 -71287 311612 125058 99261 89118
18597 89118 -236862 -236926 -207111 21869 250322 227983 -159968 -188972 -190411 -305789 -142965
18585 -56370 -27370 264284 -151337 343494 73030 -120306 -54307 239068 35843 -270806
18574 151004 -41761 -100654 -96424 -118485 52533 -455211 -184161 210694 -57256 -136660 22210
18562 -360394 -153780 160332 -159237 154651 -28493 -80998 125489 -345292 -132687 -184291
18552 -184291 224512 -174261 -61834 -156620 169652 -203237 -413 -105843 -180117 -14747 76458
18540 300061 172265 -38798 3027 72077 216044 -6048 223436 44752 -134649 -116337 -18760
18528 87379 -313397 153164 -3477 -4963 38576 -295854 -386888 -163174 31592 -85573 -173400
18517 -173400 -219977 144258 157930 159292 -233488 -28456 -35004 -85010 -459643 75137 49158
18506 49158 200638 -79689 201223 -215270 -162163 22610 196866 -192672 -233666 -101957
18495 176393 200282 22468 -113155 -186715 -50780 -13556 -112925 105284 30881 -300153 -212861
18484 -212861 -118348 23048 -157747 -249196 -179714 -130069 -35747 -124822 -28225 2323 79346
18473 79346 -148868 91013 -134454 9135 -25637 132838 98553 -137204 56111 -42597 -350667
18462 -350667 -257574 56006 156390 -286467 120516 -129883 -14146 -186708 -319714 -13099
18451 -101639 240249 -36862 93628 -480960 -24883 -146607 -187344 -112240 -110692 -170508 -235909
18440 -235909 -173109 -200534 180919 205388 20463 8563 188951 -144625 -217793 171664 251532
18429 251532 -363076 77371 17909 176325 -275949 -146546 -12837 -121525 6462 -56461 -67541
18418 -67541 -57423 -249669 -49051 16109 -170231 -331008 43791 27241 -102528 -369094 216377
18406 -25068 382269 132652 240155 -191960 224335 125417 -217060 -14574 -149598 -88545
18396 -88545 -56717 -84795 78288 -92021 -240020 -64869 -279739 46071 74571 176947 -229966
18384 -292209 39981 -28737 -341168 -20112 30579 -194598 -216110 60595 276331 56160 -476108
18372 -189171 -46391 -271776 183141 288173 -175160 99538 179176 -269271 -129083 -208997
18362 -208997 56668 -352326 87017 22472 23901 -133583 187923 -48085 307977 95335 188995
18351 188995 291398 49259 -178926 -96827 -151393 247333 48563 -46503 -324091 -152765
18340 -216705 104211 -109290 93863 61117 48063 -262032 -42192 39072 62924 149571 -18280
18328 89312 -255487 -123880 155671 111269 -357263 319098 407430 -1494 -175859 -164962 -47166
18316 237185 -97537 -151473 164570 -12298 211839 -108374 175934 -449997 -180414 80957
18305 43021 10650 -338599 23787 71442 104288 -62688 -307308 44096 102255 9734 -173244
18293 -125127 232486 28500 -40607 -122148 223446 -303233 78450 -81456 -9243 41820 -462739
18281 -41544 88890 117175 -188422 -46812 45487 -28563 -53147 -205671 213430 -33179 -146420
18270 -146420 85844 28560 -398381 -49035 -76255 30834 -220090 -317306 -60985 -65237 1155
18258 10979 -120504 140568 243953 306270 -205169 2447 308495 -266289 217855 -52301
18247 -46997 -185948 -241627 124255 -327997 -32124 -202659 -129017 1534 207078 28773 74742
18236 74742 -4043 234905 276148 -48744 -48110 -140 -25340 -79940 95460 47196 -252549 -124479
18223 267039 122640 -188873 -183458 376243 -199328 -199900 9563 -92806 93359 -12789 98902
18211 -55207 39772 297440 -38806 28426 37774 65650 -397023 -165014 -68706 -32700 -94885
18200 -94885 -66901 179294 -355464 -131093 111659 142836 -184899 155490 -7315 -97371 74816
18188 -311015 45234 -254680 82254 125038 -318752 -95446 -77923 139638 44325 -247228 153178
18176 -19330 38925 -157282 -256135 -22679 36351 169944 -86328 -211651 72956 99747 -151651
18164 -19701 -354185 -62188 421860 150895 73930 -9638 28258 -168305 -49081 121377 -83899
18152 36415 -82437 60214 -77247 -450424 70438 216565 -205283 178891 -2431 193326 -263445
18140 -505707 48617 60939 -380682 -75468 395078 74078 -483235 -97586 -162322 300178 -43984
18128 -184584 150923 126455 29196 23791 -158213 -208084 -13424 -131961 -69210 142562 -100578
18116 -23068 59290 -47776 -55551 146406 224480 -239445 35680 121647 -78549 79950 127554
18105 127554 66314 212225 -3232 140912 -90998 34334 -111203 290327 73577 -3359 -167975
18094 -167975 -270034 -28909 368372 -113996 216809 -194068 -50601 187108 -114388 -93960
18084 -93960 168974 66427 -169112 18489 -136831 -101483 -127443 31982 181066 -163637 87509
18072 72575 -269840 -221933 -195957 142878 183940 -166924 -352400 -183206 1379 -164761 14120
18060 -34180 -185564 -158495 49771 -47713 -207261 -265745 -6002 3785 -234160 31062 -190429
18048 -132886 185922 -32372 173567 -121353 -13080 117122 -48560 -39456 -148810 -69932 -359686
18037 -359686 -59690 -735 -59076 -246512 106054 -126776 -342172 -43294 217045 227738 114847
18026 114847 -4575 -187913 54416 -197652 -40236 -1565 -12023 -131190 86615 -154979 162109
18014 29589 -167386 14986 30800 70359 -91157 -161573 -115465 -300871 -64030 28076 -61664
18002 -348981 126300 62514 -149587 112120 99594 -171792 -8714 -192800 -185828 -237928 12349
17990 30 159247 -187473 345723 -39121 -215701 68131 134008 104886 182088 -43342 -18043
17978 258593 301300 137483 4559 283316 -81498 -258393 262667 -427568 236936 113586
17967 43482 -44156 151839 -211140 160546 -41528 -59794 -158271 -235529 -5089 -186931 -17345
17955 -194142 136859 -227028 30254 -111703 -263187 -97570 -94339 -218035 -298470 86256 -159295
17943 -1397 9573 -7864 -85279 -138373 -30756 -28415 -15940 -104227 -34031 -146010 203461 114452
17931 114452 -157842 -201553 -93873 84439 -112519 -342044 -15235 149877 -319469 28081
17920 135892 371969 -72396 -31504 -152274 -24894 182684 -27326 -173624 25383 26818 -330421
17908 -140095 225268 22793 -43993 15719 26318 12361 20400 5019 96844 155114 26043 130105
17896 130105 -190160 -121343 -3999 179570 -394631 43672 -166683 39965 39163 117033 1749
17884 14948 197472 -143349 126804 -103230 -106451 -180747 283905 153730 70505 83107 296702
17873 296702 -146854 220693 -1514 122753 -22367 137963 371 121299 -109229 94884 -258702
17861 -252985 377696 169028 -103449 -178926 -171572 101057 20411 -208700 -278169 269820
17850 8196 141934 -334169 -26506 170335 222443 -148225 -47109 108164 -127491 -149661 155985
17838 164005 141411 -102917 -181905 5095 -199320 -206479 -101375 151366 -243545 79029 -301450
17826 -158821 33761 44787 -9975 -190848 -105076 -228031 38307 58474 224490 187583 -226038
17814 -182689 95549 56591 137638 148097 -154050 -214846 -109146 -175771 222440 145060 -245443
17802 -12504 -49814 -203779 -65447 -170305 -28218 35542 -86892 47082 109214 40511 -30136
17790 -75 -101439 -8670 179812 98886 -87497 -109283 8713 199345 -53181 187339 -173299 207287
17777 -75342 227729 -107361 95652 -118595 -89662 49561 225861 -303477 -89157 -128736 45548
17765 -107540 -85609 9206 -132320 5614 225672 -2674 -174195 60869 312720 -13228 244813
17753 -273233 203135 57850 -52840 118472 -201829 -80462 -5468 64729 -74274 68198 214256
17742 214256 39266 -109608 -133926 134362 -180335 -112997 -56475 21195 -489902 110269
17731 50646 260872 -118412 144768 -81751 -67423 -14330 121118 143028 247099 260536 -136701
17719 133261 77631 104879 149848 63999 39409 131913 127807 8068 276956 -68108 92211 -20198
17706 -106808 -40151 -26382 -207915 -95302 54285 36728 118137 -339173 17674 139665 24290
17694 -208109 110877 -81648 -8544 53170 255174 193051 -160889 82379 -116358 50924 -47131
17682 197099 -4895 148244 133006 -311826 -491107 131729 55015 -115009 -43677 38567 111143
17671 111143 78417 14221 123789 -31004 -28791 146354 -650 67975 -223598 113544 -86027
17659 -132071 207143 -133570 53805 203255 53468 -149229 161431 33753 148637 -133421
17648 6914 489529 -120646 -186169 -218621 82908 251438 -145306 -122705 -196144 -220952 50379
17636 216663 -98607 -118353 280118 20351 -37535 -209640 152606 -147598 119804 283679
17626 283679 -21008 -245067 -71445 -337169 -129226 224108 287128 208755 -50548 127472
17615 -31142 78617 17990 7354 -114711 -152665 55896 66050 87839 110481 180043 -237771
17603 188594 23132 36809 -1780 61970 287934 -128841 154873 50073 -47322 526331 319375
17592 319375 -402263 -80365 30367 -38302 465759 -61668 74659 -1489 287792 -82064 12642
17580 40533 -35120 168429 19658 -70360 -34281 30437 238898 -119369 -38629 -2484 -218443
17569 -218443 -223729 130916 -128037 -439418 -165738 -286350 140132 159606 -121070 285616
17558 202821 107873 159524 260143 -38178 213854 -303647 224358 245795 197867 205776 138194
17547 138194 147136 404307 -121264 -34112 -22125 53137 87102 171068 231224 178563 -126012
17535 -155863 -96477 19985 -116501 -74345 159821 142298 157124 252301 144164 329685 -125462
17523 -70508 174763 270092 163969 35275 245453 -65523 146741 113664 69053 225956 -274931
17511 142413 168391 305383 130661 52403 -30615 214370 102210 1732 2144 9874 77233
17500 77233 173989 -203146 317313 144049 -102927 -57469 278102 -100035 2166 162396
17490 162396 59235 160494 140155 65853 47208 -55246 80583 -62772 321685 259256 74110
17478 78397 291403 100442 -265714 -119750 -19575 102280 -180949 -226689 252241 131649
17468 131649 232903 151080 374972 6930 -78025 -105793 128950 247718 117042 91451 354207
17457 354207 253650 73684 -97879 140507 138353 309238 68816 88234 188855 238255 425036
17446 425036 173549 376399 280125 -160458 24673 -63282 18201 -302124 213765 166621
17436 166621 -238189 193887 186246 255390 360079 312196 276832 236755 366354 190672 243695
17425 243695 226504 135778 303335 177754 1979 95396 522153 -51361 184895 273107 81007
17413 561199 95901 80864 138565 29829 -121490 354069 213915 -203266 350268 174624
17402 4416 69354 39034 138859 -67824 66875 221841 127994 250653 132082 311872 202221
17391 202221 216816 165653 164195 456919 147527 167310 -128163 -10283 18316 -37431 31798
17379 -212574 238032 127630 19629 167230 256688 601607 -146121 147437 647611 -175360
17368 175455 106098 -38656 291194 209092 140278 -101911 291182 198846 153863 272358 189263
17357 189263 170650 -126817 7322 188004 203941 314255 202038 203600 93981 106646 -65645
17345 265378 68826 -14005 -21934 209253 47551 167589 -65254 -192102 -372296 379910 41713
17333 297960 224477 133215 52223 249964 37970 -63917 135954 123641 210993 145843 -7049
17321 -70248 -30592 311942 135522 -30489 193906 369610 153884 266092 -46324 7611 113155
17310 113155 159011 -92640 -31242 157204 -158490 -102813 356877 -54918 50211 60307 233654
17299 233654 165972 -99302 128500 198232 280946 39835 53308 -36167 139288 169360 48621
17287 122664 -205528 295782 -180370 258434 240811 22435 10339 -82696 -206207 315165
17276 217395 159020 -24606 89456 205890 26983 52096 129506 80091 -99160 252391 393711
17265 393711 -85644 152504 275581 287773 123115 -167744 201593 262536 -17712 177529
17254 72139 -96875 149390 1427 204848 74592 118604 149023 181315 211207 209705 -34001 -24068
17242 -24068 110187 95962 184142 82534 105959 -69126 -130612 329777 216384 52349 -38760
17230 39722 -19024 -86917 447445 -41991 100732 248806 233066 242583 324536 -28772 232891
17218 59827 353083 190822 524080 226153 154462 255524 282629 -108078 -57744 226966
17207 166622 248237 41243 172475 179125 243616 474309 620254 84216 63027 113073 277206
17196 277206 319747 134071 102260 -30033 93965 317054 362860 187582 200275 213126 311212
17185 311212 -180622 423281 -10854 197269 185710 337388 126205 312194 288117 483965
17175 483965 54761 -100390 170614 192522 -71099 296267 155592 476061 408064 130923
17164 372810 158095 309160 396055 377468 191682 86933 318458 437684 216942 286028
17154 286028 472248 246221 155075 222221 138600 159345 305267 152601 164488 203210 282536
17143 282536 99313 211273 500875 541889 279844 273587 178300 445270 147063 141335 471807
17132 471807 168465 97006 231311 5847 335620 81119 70119 389536 125491 493354
17122 493354 482436 166988 243579 410499 282666 287517 492087 21694 544341 302212
17112 302212 275019 188324 99624 314300 306265 226960 191262 520724 447301 230583 83071
17100 548006 529961 209495 584297 749142 389658 584908 390692 80866 598865 392646
17090 392646 602779 471247 53381 384345 504955 245937 258831 425124 219460 604690
17080 604690 290567 340761 477050 230230 420930 240447 160600 426275 300708 350304
17070 350304 297257 423274 608804 591739 470351 409622 510008 567957 274034 327733
17060 327733 493777 313748 256446 418296 307659 368154 481060 346020 390330 470220
17050 470220 483345 212682 449199 306770 429069 555624 177886 480516 591774 479837
17040 479837 218750 443654 578077 444870 810659 538295 826162 -37675 309492 502445
17030 502445 754135 293435 424038 384843 632863 703557 525227 723847 549456 621535
17020 621535 349624 548962 537277 536576 306833 524100 520073 660139 480580 601682 553163
17009 553163 703476 338220 309233 596672 348284 367548 587016 746821 638961 415806
16999 415806 754720 490439 497036 406393 738339 316572 235321 595218 353590 464926
16989 464926 796152 737374 755170 506344 760644 350120 771655 444227 701453 891738
16979 891738 743348 771283 630726 783264 817372 735397 714973 737110 632524 618961 625671
16968 625671 797652 712320 799440 583103 897305 841454 757204 824895 539276 871603
16958 871603 1113495 550123 922920 605117 850766 929713 1006897 1048325 633226 608406
16948 608406 1028219 814060 1122550 1170886 775912 1076759 1071073 920875 859719 1011445
16938 1011445 1076195 886602 846717 1134302 1234505 1152861 1409008 1165282 1129626 1274680
16928 1274680 1048839 844598 1337270 818527 934304 1142779 1306578 1214166 1235263 1243485
16918 1243485 1405347 1269374 1153957 1236096 1017933 1237927 1246959 1211511 1185567 1265962
16908 1265962 1562059 1103697 1448304 1387933 1356451 1677824 1438568 1400492 1659119 1219426
16898 1219426 1539325 1795618 1091506 1621958 1284363 1878803 1721782 1322022 1522500
16889 1522500 1478094 1731807 1610852 1514154 1446392 1731032 1635676 1733678 1732764 1868512 1780546
16878 1780546 1782109 1954950 1940558 2125495 2188540 2062807 2019885 2035987 1809682 2044417
16868 2044417 2345440 2114883 2164750 2147733 2222290 2140802 2202166 2704968 2342992 2343238 2515107
16857 2515107 2466188 2333294 2200611 2559284 2516828 2667100 2710721 2574356 3020222 2705608
16847 2705608 2845478 2624239 3090468 2652787 3254385 3194406 3369323 3260014 3019400 3599387
16837 3599387 3137440 3308013 3522281 3343697 3381664 3764719 3992949 3740360 3903428 3765877
16827 3765877 4103419 4346908 3839151 4238361 4180707 4434314 4483365 4516646 4388739 4928812
16817 4928812 4886471 4719555 4889864 4768915 5026904 5335535 5125324 5409434 5581434 5744938
16807 5744938 6113316 6025262 6125491 6382042 6263532 6468345 6522788 6638287 7223070 6994822
16797 6994822 7608491 7545111 7723957 7817376 7948320 8036983 8512789 8466504 8871722 9388889
16787 9388889 9402751 9535836 9884160 10483419 10437292 11025299 11282474 11601488 11713137 12295149
16777 12295149 12653799 12890226 13509254 14117629 14223057 14798287 15390814 15927960 16467126
16768 16467126 17164318 17505474 18340635 19206818 19731554 20378502 21053725 22373330 22918432
16759 22918432 23886635 25156682 26148470 27529249 28286837 29669641 31267890 32525437
16751 32525437 34240512 36288100 37543968 39432469 41650571 43706180 46216173 48377630
16743 48377630 51593093 53917827 57367192 60340153 63956822 67628014 71975849 76079325
16735 76079325 80684865 85468402 90662033 96079579 101691539 107303752 113868495 119502603
16727 119502603 125966261 132106590 137914589 143284065 148379661 153216059 157108126 159681170
16719 159681170 161485639 162321831 162467109 160886649 158667038 155382611 151272884 146520980
16711 146520980 140935944 135208429 129157328 122734733 116680623 110284807 104247585 98715564
16703 98715564 93043641 87461162 82651657 77553399 73097774 68926819 64766646 61214249
16695 61214249 57643534 54376019 51529915 48730155 46543557 43564266 41362129 39328378
16687 39328378 37495966 35573637 33526175 32116404 30620916 29031298 27848218 26335609
16679 26335609 25323132 24289811 23184009 22053069 21302008 20536133 19705935 18774083 17877030
16670 17877030 17797659 17000913 16312128 15723017 14710955 14535371 13997328 13733362 13046391
16661 13046391 12676686 12049701 11671923 11848318 11145720 10668204 10435737 10158771 9918826
16652 9918826 9365783 8956553 9209412 8833396 8406155 8162057 8128099 7682696 7643064 7237804
16642 7237804 7284747 7076918 6700151 6526138 6653497 6558078 6302305 6184411 5933765 5617450
16632 5617450 5910106 5412931 5544755 5289269 5245285 4960721 5007031 5173356 4518324 4585965
16622 4585965 4308343 4496045 4143194 4198887 4261466 3952340 3892164 4133775 3661947 3720962
16612 3720962 3931787 3647287 3555063 3374665 3513708 3116819 3543993 3179094 3147934 3230997
16602 3230997 3123388 3217372 2917968 3038420 2616054 2581316 2990055 2464953 2823072 2634436
16592 2634436 2683833 2557289 2584857 2423117 2600064 2473504 2261711 1956511 2456664 2218830
16582 2218830 2483774 2183649 1926347 2334743 2086020 1779296 1890290 2193607 2027760
16573 2027760 1868675 1648073 1777074 1727132 1574982 1981745 1633592 1751009 1687216 1947147
16563 1947147 1696450 1707049 1329813 1593562 1734175 1710854 1419917 1730342 1427777 1570582
16553 1570582 1578737 1206559 1382534 1108763 1174277 1100614 1184784 1492305 1445469 1607041
16543 1607041 1220797 1169183 1242361 1214598 1115517 1161982 1272119 1225765 1294140 1275152 1045797
16532 1045797 763135 1193463 632509 1153889 949207 1099344 778753 871250 707725 739151
16522 739151 907066 1193880 1024140 595488 1269787 862408 830282 997176 883343 746267
16512 746267 1104422 857335 988527 1001776 826267 801591 823290 846892 949787 592336
16502 592336 766754 777849 892709 586934 718983 793700 703751 841208 814891 612042
16492 612042 981693 924251 520750 681739 802222 542121 687135 474021 276916 739804
16482 739804 992940 564422 483320 394768 903611 854752 523168 568586 595083 494465
16472 494465 749633 576071 245039 533356 513227 227200 333364 526136 287521 489916
16462 489916 531160 662018 358529 427277 681700 488243 625551 629969 260104 244669
16452 244669 574837 269665 320952 731303 490992 399263 563452 624517 661345 358719
16442 358719 679368 384460 686326 253312 408492 495551 317540 508249 370283 300585
16432 300585 575902 621860 581205 469948 126039 151349 274000 409446 333013 183114
16422 183114 573385 378267 164072 555595 622136 596287 497221 414820 629117 435247
16412 435247 117695 488607 327492 219214 253027 308009 131709 94404 160821 27124
16401 374317 521006 222476 250005 -58329 335482 342290 292467 309129 333440 129319 296724
16390 296724 364990 366113 390727 95834 77986 500440 331734 166702 148317 203900 56528
16378 426851 281217 144324 350263 93044 -98955 287133 6286 214174 349112 153471
16367 368200 692970 242188 339870 27590 249377 78177 -56373 159362 175664 20582 63647
16356 63647 156851 99177 383103 239503 67283 272047 -88373 250253 129459 129858 477742
16345 477742 197941 229285 376765 199878 202863 188754 12889 -23148 172592 314345 226118
16334 226118 -156534 337106 -15207 -90548 62433 451758 309421 361380 233038 230740 213583
16323 213583 111547 377892 323419 52990 274812 289662 247562 -23667 91613 337464 -53925
16311 250498 66104 -66339 328906 331392 164959 327701 -62932 193008 -9301 76354 83312
16300 83312 319627 315609 17234 63044 91096 184758 112827 54186 288070 290225 167688
16289 167688 176555 290665 91298 417681 -2784 52144 -32575 15629 -86482 -113784 152810
16277 33231 127902 171992 160048 216979 174213 -266831 60839 265631 529069 120565 -69930
16265 161962 151779 72825 279572 128708 130692 62837 -178978 -90151 106934 -84997 294432
16253 144542 105693 232829 172031 7910 97577 253153 6051 114097 70067 277317 -133611
16241 300073 1363 286867 25289 133224 286798 -41381 -35371 63056 -157714 110002 215048
16230 215048 277264 -89782 -11401 -83331 193900 114425 -58321 -87329 40337 214775 -242579
16218 11751 -4098 -123430 130084 -98904 544365 134600 82691 -138843 280157 76458 153613
16207 153613 -136295 192039 -72693 2630 200425 -58379 -174215 167294 152824 -69412 -90810
16196 -90810 -266249 -21383 -46282 -38502 36139 203221 132407 -71124 -31865 26353 133400
16185 133400 -38241 -91840 -32211 -150320 140878 -74988 1579 -293638 -171676 -21239 195685
16173 -47380 226824 42317 25728 -134006 29653 -162969 -22758 -357763 -18892 -175107 -133906
16162 -133906 280945 -184278 40463 -31241 48707 -310891 112363 131404 309499 261788
16152 261788 138088 -56930 -16682 -122346 -81485 -104414 222856 5124 -119499 -140744 392682
16140 -62807 98759 -331514 16197 -161644 271887 124483 -121518 -217380 -68540 -60962 -85446
16129 -85446 143754 101505 203285 277407 262401 216660 6355 144624 -28171 -80395 -1635
16117 145412 91871 263825 117011 -3455 -28335 -120200 -107662 -269674 153506 -317752 -49886
16105 -208698 39415 -5643 -3386 -32244 61336 173722 36217 259513 182726 21966 222155
16094 222155 -212022 113743 172153 -10453 186801 39343 6116 241716 216013 -18889 217058
16082 -305764 -7830 40992 53279 -21879 -6481 -15941 -269312 -93300 284859 182901 -45565
16070 -77310 -102566 -95231 -297009 -214325 40057 -44343 68846 246345 -164824 13483 -39191
16058 -303798 -47853 63076 -289346 -211960 125051 -99812 274149 17209 111156 -77087 -8229
16046 -82834 -10875 -67710 -1858 -223126 7657 -120807 49551 19078 -111284 -487 -74132 145604
16033 -174562 -5606 -196105 -402794 -146095 -62240 -51285 163723 1823 -27379 37697 -300833
16021 25439 -183561 -109123 219539 307786 -123542 148176 89443 42091 -38697 100992 -27014
16009 137891 -71338 205630 -69821 -217944 -277224 137276 85428 -190934 -46046 -151411
15999 -151411 -19579 -166716 -252787 -225980 16393 -95233 -10346 -189080 342154 51687 -10491
15987 14292 -93567 -10275 -255953 220096 223011 58481 18894 104239 323797 50054 138666
15976 138666 -154987 -91316 -515022 201590 -21459 -110325 65377 116296 -23446 -7203 -83940
15965 -83940 90554 162824 -36402 -340921 -232516 -146974 -109682 110389 203729 89919 46195
15954 46195 107580 -152736 -85294 364163 150949 -158828 -156455 -187668 -257818 -69214 -118842
15943 -118842 136868 161228 130460 4427 16920 73473 -231087 89035 -100085 -154996 9938
15931 -226037 -249763 262792 -2653 59742 -271325 -74574 15840 -119122 -63248 -166328 -137133
15920 -137133 -111635 -158599 121711 102159 -315103 113474 -234507 -90617 -103870 40317 -1129
15908 142697 -220128 -205970 92738 -157430 -299274 119438 -31836 -34571 -108165 -93371 -114657
15897 -114657 82111 -76901 -67638 391137 -58540 -87287 -108151 221163 89354 77830 -189776
15885 76484 -136542 135013 -48512 -87047 1806 -61997 -303061 11731 126713 214443 -98745
15873 163477 -15606 -163563 129351 -95665 278314 -80302 108089 -193419 -135556 -206113
15863 -206113 43390 -68675 133921 -12314 112175 -2675 62745 27862 -172154 197371 -216064
15851 -166204 -278493 50207 363530 159487 196072 101734 21814 -42538 142340 -13149 -220808
15840 -220808 -137009 -112617 -146279 23443 -163316 -104797 85360 -8876 -217375 -345564 -193638
15829 -193638 151190 471962 -378007 61383 -113310 -91812 81725 -101101 177479 94410
15819 94410 230643 -197906 -310050 -16256 -100671 6505 -70011 -90419 -116957 -243614 135070
15807 -319708 -83553 53222 -180811 -232577 211849 -59013 -49892 56964 -70872 -22410 -271863
15796 -271863 -37622 43380 71823 17815 -66683 -81301 -72356 -14669 -25714 -44630 -138772 -1699
15783 -178295 -55421 39713 215929 -160188 -98624 -258000 100702 -74922 -16593 -87927 -301979
15772 -301979 -30611 92764 234411 -5623 -55445 110550 -16961 96066 -63008 -26472 422372
15760 -64726 251891 89999 -71311 61261 -90135 334232 254304 -124837 -240667 63500 -190709
15748 118908 43657 -25127 -219798 -100502 -120253 243322 84416 -236248 -94434 -228082
15738 -228082 -128279 -120116 197 -250434 152291 -15151 -222411 -62296 210891 207154 -201475
15726 136035 -110272 -132257 -207061 170816 -253902 -104198 73875 36909 248528 -192387
15715 43300 101992 -165361 20833 -101312 -142409 -69096 -120500 -23678 122242 154071 159201
15704 159201 -59503 -329807 -169551 -256311 338283 86005 -141263 -222569 -284526 -101777
15693 -65620 20258 14807 -201095 23829 0 17138 27491 83446 -54163 -149476 -145977 90857 -57640
15679 -248329 -100894 -3392 44726 -149969 106703 -51683 90863 -24844 81888 275569 -95243
15667 83604 -43269 89090 -226428 -110451 55980 -90649 -302335 -56098 -679454 4328 160501
15656 160501 -16444 9443 197912 16798 -23047 -64327 -66826 -36373 -12853 -153138 149785
15644 35110 178384 81895 -197065 113141 178164 -260865 -303238 -287886 319643 81923 -426969
15632 49019 -193955 -68981 271000 161155 54285 -327748 54608 97088 -70347 87682 -215761
15620 -124339 -13680 -64005 155003 106931 213878 -223941 10453 176172 -68563 112521
15609 -169074 -116431 -3451 52291 -8392 257089 25467 -100767 60341 33521 -58640 -3703 74928
15596 243452 -225619 -155998 -32604 -28282 -47437 -4637 -38712 -55327 -284188 -100687 -109606
15585 -109606 128685 171081 385899 67593 -226514 402938 -118688 -142558 -106446 52066
15574 -52733 141070 -63819 202599 -71656 -55976 94494 -78834 -105520 -131923 -304245 -96517
15562 -138779 -435066 6092 -17991 -53318 -181951 140857 108921 -51987 -138737 152001 -115359
15550 -135583 1144 68166 109343 212922 -186495 129711 -50098 -36983 -101095 -131162 -219392
15539 -219392 -77561 -65908 -45482 332480 80970 -37117 -343025 -56890 162799 56817 133695
15528 133695 234878 190768 327131 186553 84661 -58885 -23451 343328 -383488 171522
15517 7627 -99622 -22605 -120542 71542 167913 197672 -247645 -261329 58976 -42735 39915 199264
15505 199264 -216414 123464 43960 98075 -132545 -254854 -365546 -48766 168748 -182385
15494 220570 -349754 -25113 -130585 -33268 -7849 -141851 -87290 84868 75116 -240370 -162743
15483 -162743 -155696 132833 -28277 153671 -274334 -127396 -157492 -249071 -80733 -221312 29869
15471 -51251 -219716 -85516 -223749 191633 1289 156488 -260109 -65949 -260372 -104745
15460 7623 -114239 154057 86899 99715 -232755 53617 -98718 259555 -28841 467054 -203966
15448 320464 121203 -262832 -239556 4528 33449 239869 -162370 -202163 -185306 -289729 325524
15436 278280 105406 -8093 -334030 -89778 24534 4009 -119573 27154 86552 185750 22199
15424 -69357 -271340 276266 75563 31561 -26847 -85693 -15903 -15910 -308804 118065 -216835
15412 -130143 5158 24280 -316833 -73105 -266911 -185553 -29128 55104 -163962 134748 55556
15400 139428 -61620 49415 -110581 -272908 -86802 124507 -135887 183394 -349872 -19483
15389 130048 239702 53558 97217 -4888 -89703 -28910 -212299 -111905 338282 139421 -15961
15377 -141593 -25636 122034 -71915 97136 -331246 -477358 -267161 -168944 -145856 122400
15366 351974 -175318 -85732 -202889 63155 -65131 40942 30286 88128 90412 237482 163964
15355 163964 -237237 15239 -85269 114741 -37137 -116977 25551 -196743 -123815 396762 209996
15344 209996 -35433 -97147 62027 -69209 -31539 253659 -42553 178432 171374 -225253 -209650
15333 -209650 258323 -78141 -75526 -101634 -129009 131545 90920 259299 -101026 182492 -187445
15321 -174824 14431 -19414 11326 -199657 11923 128110 14103 -106384 -185750 -133463 -231206
15310 -231206 -233098 -66578 186754 -42916 -23551 48596 174237 -41780 -169077 -70867 -46461
15299 -46461 -62217 44120 102777 68988 7660 -101416 292230 -51004 359930 -127005 189143
15287 87429 145304 191928 -99802 207560 -61428 -80210 -233116 -50725 41725 -54422 423447
15275 106281 21820 -137499 257895 85782 132990 -17724 364999 162496 -246845 -35992
15264 249810 156514 -27515 113957 -67021 427316 -138138 -163301 14574 214649 -105213
15253 191626 -10144 -38508 -66855 194323 420201 753498 1114638 1126642 1267165 793950
15243 793950 389958 132932 -133789 121802 494481 6890 144977 13434 217202 -271560
15232 -149021 -112532 114981 -87754 157529 76979 6534 -187122 -94431 49827 290824 -221221
15220 -141596 35619 -84917 241647 1831 -111962 95203 192534 295225 103662 56088 -77916
15208 -137953 66052 56180 -92290 455555 29306 -44707 -60750 -12940 116868 108941 20530
15196 153825 50886 217666 127285 84235 -156483 66944 84823 -98004 221826 -113500 229461
15184 73751 158465 66912 -150119 141782 13238 -128433 320973 176570 -244959 201645
15173 -7644 304624 -235 80289 70660 161843 210571 203575 -223608 240892 10526 198199 91058
15160 216771 155784 -7961 -27791 139256 312910 468020 102554 68547 53924 -324402 87125
15148 -28614 -117578 -152649 -217626 211553 206938 324375 183942 -208839 57228 -189746 -117408
15137 -117408 260971 -21066 286578 126306 112215 -9786 -33821 271648 427850 142976
15126 359094 -45275 -153106 118343 183398 133333 313663 285679 -12278 188060 41650 104283
15115 104283 282303 250558 -119663 196644 287281 80465 190244 114776 266998 89963
15104 109220 191693 66531 387895 504797 -109037 278880 223872 25275 -167737 -41305
15093 113746 166995 -74112 292443 -171239 75418 85508 286103 172730 -101145 -81473
15083 -81473 48223 -4733 40909 315969 -218091 9026 49388 -112962 55333 56858 -58057 271434
15070 226820 25035 41492 -150478 156585 -52849 190349 100112 327489 213735 345633
15060 345633 86889 21094 104084 234853 -687 64954 381066 -278496 58349 480610 68089
15048 43873 -195300 -1855 89399 53903 70083 -60990 18262 -126042 251149 214105 135831
15037 135831 -65801 -17823 220948 -39237 434810 494111 -305840 252526 -5701 228989 21366
15025 5074 -62075 -34856 100355 79389 28415 40289 372225 369280 368625 5579 348859 444994
15013 444994 88243 63034 223034 127333 300903 181472 311691 187444 39880 -120653
15002 137419 376018 475266 188400 367532 275454 -113485 215146 276746 438657 260019
14992 260019 389091 73967 171512 459151 -151045 244089 106047 467836 96808 61702
14982 61702 167896 283097 197522 35318 -142325 255072 145575 60992 88622 301516
14972 301516 246959 292027 43562 174902 129087 102723 77688 187332 -33496 184098 152041
14961 152041 114680 213476 46066 107953 85619 55965 144142 96271 147289 172902 -161071
14949 139599 50826 703155 201962 308513 217940 44573 227355 511436 125577 469169
14939 469169 404108 264890 381595 353049 325288 125496 228356 254950 377069 354510
14929 354510 447946 77323 137491 335171 44094 220870 362942 314202 389090 49133 369741
14918 369741 357591 435027 249713 278514 465423 467834 166051 344969 395 191534 -33963
14906 214797 2076 38170 196073 485428 104152 466429 191861 291849 271130 218859 386436
14895 386436 485614 226552 253434 258966 354520 126325 46815 -36785 146541 262483 -199589
14883 199031 213683 161581 265750 222724 224107 255880 503773 423225 379054 588809 342977
14872 342977 244699 88504 78706 260743 193584 440805 -42938 222217 223413 364968 317111
14861 317111 114538 78502 313963 94214 -4029 348852 -83302 430361 468412 495906 614016
14850 614016 346457 81652 303231 419137 341121 241007 269108 408470 95950 374446
14840 374446 671544 607512 513244 78792 397252 392031 291296 488777 481038 418752 486856
14829 486856 429000 143971 2159 321559 423309 305330 172626 472334 418422 163959
14818 554096 439948 225878 493985 104161 536473 410044 138998 533786 264626 349144
14808 349144 287605 526668 483042 415944 98860 396417 236255 514084 419018 563589
14798 563589 580734 420616 477497 425532 227296 529617 127082 279538 372067 470110
14788 470110 234346 518954 797273 620370 733852 340822 574754 426098 79586 681494
14778 681494 392587 389444 489225 383484 317112 520446 531693 362726 618434 571862 790323
14767 790323 398783 618256 463711 282295 436820 464708 638982 646290 365676 483385
14757 483385 367590 663902 498770 757427 637550 474089 235391 350826 661468 439253
14747 439253 574719 1024660 363841 596378 392802 556178 569123 824464 472553 794095
14737 794095 705481 656048 292164 532486 926713 757684 262423 304612 689170 526862
14727 526862 811474 527125 561108 850599 478765 638197 495844 640543 684624 746478
14717 746478 557627 691500 645974 854136 868439 713440 669187 990810 523896 617109
14707 617109 704593 708239 832701 963415 554646 663890 775394 440485 510121 852662
14697 852662 654715 566054 782917 621449 804727 897774 623370 782555 993240 962367
14687 962367 922753 699763 829107 665274 844273 560090 456182 663308 683075 948729
14677 948729 282073 671826 879728 990204 867674 849775 859937 857181 958156 717047
14667 717047 777092 802986 872679 534904 1046850 688061 829741 1007908 1077808 874487
14657 874487 959405 1007725 1130826 719296 926603 1238151 1062254 862420 1106001 873975
14647 873975 730774 1164284 1038486 874329 769995 1003725 1151406 1188977 938133 1144047
14637 1144047 1095602 1028712 909210 1021109 1150606 965725 993070 1141550 1160514 920899
14627 920899 1072138 1229803 1393200 1405326 1159751 1096442 925037 1205238 1373347 1383607
14617 1383607 1074057 1295801 850853 969463 1106523 1074724 1164416 1537283 1301529 1178691
14607 1178691 1253580 1306008 1417279 1166704 1687168 1309530 1262843 900038 1210384 1340269
14597 1340269 1523055 1087325 1301804 1380715 1335915 1003690 1614614 1444266 1417426 1378530
14587 1378530 1416298 1676367 1625929 1531340 1274861 1612689 1703036 1563928 1549638 1703336
14577 1703336 1449031 1809938 1593800 2120014 1757296 1687800 1701101 1799321 1800173 1548181
14567 1548181 1760086 1850277 1833751 1982632 2089936 1915051 2108475 2111699 2392961 2513461
14557 2513461 2751738 2850493 2696170 3102292 2937987 3388149 3660393 4686219 6761516
14548 6761516 10822022 20340712 34786108 32370197 16978195 8751194 4612461 2823714
14540 2823714 2212130 2184502 1729568 1561400 1968881 1642693 1811758 1401073 1962011 1723363
14530 1723363 1734412 1729268 1459018 1749478 1690453 1803435 1724410 1918014 1977045 1902179 2285568
14519 2285568 2038943 2239859 1927847 1987901 2220043 2469891 2147537 2329536 2293927 2054189
14509 2054189 2400254 2530723 2173919 2649641 2306513 2354861 2524837 2464155 2514613 2631149
14499 2631149 2561672 2625813 2443022 2682004 2741459 3065800 3049863 2651186 3234962 2851498
14489 2851498 3021320 2907274 2785844 2852413 3114163 3065703 3229900 3237940 3249785 3168063
14479 3168063 3272998 3110066 3459988 3367002 2996134 3597321 3499072 3553743 3369310 3441127
14469 3441127 3522469 3462936 3636923 3931822 3760183 3652616 3974223 4087549 4240128 3830948
14459 3830948 3897809 4201129 4109645 4351447 4326571 4264267 4107746 4578045 4548909 4473566
14449 4473566 4307213 4927867 4828043 4877255 4567680 4740362 5093062 4993172 5028011 5348609
14439 5348609 5412764 5165442 5049952 5534901 5003555 5654665 5224809 5915428 5727233 5683870
14429 5683870 5733088 5718960 5874950 5971040 6158511 6239580 6376488 6040808 6583884 6620459
14419 6620459 6569393 6747644 6831744 7167275 7059319 7215988 7194810 7147373 7100774 7489977
14409 7489977 7729782 7818581 8043284 8030469 8190143 8588327 8445393 8604270 8618953 9030129
14399 9030129 8884459 9131909 9073855 9387085 9415492 9304070 9749485 9919013 9813921 10602694
14389 10602694 10459485 10551955 11078714 10934115 11444498 11584742 11648143 11992090 12215621 12302635
14379 12302635 12476042 12765782 13368697 13021794 13183459 14045636 14065915 14307926 14690340
14370 14690340 14556317 15316570 15756458 16051106 16054191 16615185 17004670 17384816 17495846 17941106
14360 17941106 18132922 18762803 19332241 19670973 19959404 20632624 21052030 21464357 21932461
14351 21932461 22608465 23052889 23712094 24224714 24547297 25925221 26087612 26591414 27574537
14342 27574537 28055928 28767098 29679720 30505731 31012271 32332928 33020984 34193275 35047058
14333 35047058 36040209 37346059 37946625 39333638 40565792 41908127 43453348 44743390
14325 44743390 46177856 47652797 49184115 51045420 52942432 55158849 56692662 58805883
14317 58805883 60898835 63202874 65966572 68515573 70640223 74155706 77174648 80464959
14309 80464959 83755563 87109912 90885424 94737346 99262163 103482953 108428082 113754374
14301 113754374 118970962 124622917 130420016 136696140 143863192 150836706 158210791 166039323
14293 166039323 174649733 182838306 192494930 202233606 212481926 223135464 234519412
14286 234519412 245966478 258347935 270319258 283098381 295819507 308732784 320893137
14279 320893137 332784517 344431962 355502817 365054050 373501511 381018325 386060021
14272 386060021 387913024 387916751 386256768 385097180 382190253 379326605 374265147 367682925
14264 367682925 359344462 349396077 338108225 325875425 313305369 300587163 287309624
14257 287309624 274435587 261472929 249140824 237777179 226725481 215413218 204432307
14250 204432307 194442175 184844145 175603580 166991396 158856727 151448778 144123504 137721720
14242 137721720 130734361 124878118 118990340 113932425 108980636 104069616 99493771 95401865
14234 95401865 91066479 87283361 84038105 81205414 77837979 74686796 71298953 68965316
14226 68965316 65953302 63716228 61474647 58939025 57225337 55506392 53948769 51711599
14218 51711599 49707716 48202157 46422725 45119108 43886779 42722858 41292479 39910471
14210 39910471 38483416 37690576 36684341 36155861 34564860 33813657 32591113 31522925
14202 31522925 30877314 30477348 29624266 28430947 27843299 27254428 26289817 25766069 25198071
14193 25198071 24591869 24028476 23238411 22823642 22065219 21935496 21399646 20665044 20337360
14184 20337360 19753776 19380875 18910893 18617228 18203934 18033574 17506684 17120954 16831220
14175 16831220 16210810 16297677 15830829 15511793 14951168 15024028 14293113 14159467 14138503 13535928
14165 13535928 13372682 13057571 12929002 12881713 12549788 12296619 12142897 11938902 11443533
14156 11443533 11510170 11247394 11069316 10800343 10625828 10488157 9947556 10161418 10194685 9918670
14146 9918670 9768690 9628448 9582488 9249467 9374363 9051830 8788946 8822776 8580660 8570060
14136 8570060 8164062 8086710 8203801 7862443 8074357 7805636 7715114 7589170 7869297 7756657
14126 7756657 7428619 7264590 7181826 6737399 7138469 6791149 6936513 6783265 6860058 6451178
14116 6451178 6361982 6179651 6386474 6288581 6255640 6074645 5979397 5802730 5929661 5801534
14106 5801534 5527735 5611250 5378638 5707903 5378651 5289155 5270123 5001059 5104005 4969250
14096 4969250 4717623 4997395 4645164 4585929 4732884 4692218 4714203 4654014 4533435 4648132
14086 4648132 4602040 4487753 4432804 4082817 4285456 4465642 4093109 4256139 4364878 4064508
14076 4064508 4112388 3775880 3800549 3956722 3817033 3665240 4029917 3513870 3670033 3859781
14066 3859781 3722965 3403129 3559902 3587212 3218619 3443350 3066494 3199113 3262369 3542407
14056 3542407 3279757 3117680 3134688 3229766 3323138 2854066 3319953 3015712 2917311 3154081
14046 3154081 2788749 2776263 3018271 2662357 2877682 2820481 2936113 2525654 2976947 2790190
14036 2790190 2532643 2500421 2469486 2884378 2667737 2730377 2753892 2358220 2129480 2814725
14026 2814725 2375149 2370810 2409311 2306719 2334233 2421997 2285669 1987307 2220448 2285813
14016 2285813 2104578 2353364 2187062 2222497 2184826 2306656 1991389 1759012 2095030 2047924
14006 2047924 2149297 1909491 1965014 1865925 1868390 1898831 1639385 1990310 1841262 1691494
13996 1691494 1792228 1873117 1766718 1733106 1730100 2346723 2493253 3147031 6074965 14136815
13986 14136815 30497500 34473456 20702729 11038704 6943876 5007031 4403563 3387048
13978 3387048 3401191 3165336 2345903 2703489 2766165 2562319 2170106 2297779 2113010 2052715
13968 2052715 2158639 2136744 2051768 2010516 1724203 1809817 1783459 1934706 1863782 1664180
13958 1664180 2002060 1862136 1611372 1745327 1828075 1683573 1704150 1872965 1509757 1790706
13948 1790706 1503469 1577335 1687123 1325372 1661220 1745993 1445387 1332609 1501726 1459816
13938 1459816 1514452 1654285 1383855 1675555 1313075 1656138 1380900 1633767 1515588 1073537
13928 1073537 1483811 1378286 1425046 1170507 1391204 1183267 1590673 1396381 1288613 1018422
13918 1018422 1087035 1207448 1074068 1272143 1319105 1353385 1247231 1379296 1183897 1174085
13908 1174085 1474400 1156324 1149458 1372123 1222134 1266478 970101 995123 1290626 1322471
13898 1322471 970286 1133438 1421372 988056 1000793 1354457 1025500 1122894 925557 1158931
13888 1158931 927241 1107901 843746 1022708 1215757 1352371 736398 995614 891933
13879 891933 976993 857386 1115900 1270488 747287 704036 1015288 1033740 1077609 982923
13869 982923 785421 765409 1164540 1110906 998245 990793 880355 819645 990969 661679
13859 661679 941843 1030266 1235911 1175590 922761 929107 995856 993303 848807 654173 672839
13848 672839 972279 821821 971097 961015 633535 881997 1125960 865033 853540 836210
13838 836210 902183 688404 675187 929088 1071526 976444 853815 800119 1164678 830664
13828 830664 795108 860399 829164 827852 839944 822301 592524 1097766 843340 684510 752978
13817 752978 717800 712731 926871 541600 692564 654202 1034679 846067 568661 739965
13807 739965 475949 581947 719597 473992 764072 332364 912517 613472 981548 701660
13797 701660 820436 786123 762749 775351 859904 825025 654155 424986 795481 639194
13787 639194 709747 658912 901148 410800 244656 624216 688211 525715 561619 771286
13777 771286 465366 484180 567196 755339 586091 408158 283906 794302 972915 595903
13767 595903 887755 574029 611591 525168 380016 798346 762208 716052 594991 603954 618198
13756 618198 754118 550470 517836 345072 789244 542604 293059 575637 694428 877659
13746 877659 552352 408988 827580 478849 573626 469855 572768 567581 703951 517800
13736 517800 277264 660560 837570 719079 661928 595129 523717 378831 428445 334952
13726 334952 369000 563636 735695 496129 523257 317735 554093 468779 529158 372775
13716 372775 569642 261000 726243 207036 254699 286764 431082 209238 436298 683223
13706 683223 235778 332222 340536 318334 329887 329084 729184 396963 541319 580165 376776
13695 376776 530472 596170 523313 246454 598410 399201 217214 369434 392148 302529
13685 302529 436796 731738 743789 653699 266122 513810 593691 388468 418384 335508
13675 335508 315959 246225 519795 327027 475313 346241 670683 230853 193114 463591
13665 463591 470403 518663 623141 342504 19932 581484 533072 205464 371865 315794 300256
13654 300256 287606 179050 459273 516413 458201 361990 622573 286345 282332 281807 633997
13643 633997 238766 137423 300447 462468 241644 520087 284446 4352 446002 318008
13633 318008 250426 320272 406257 422494 129123 300553 -94468 468296 397505 292052 226326
13622 226326 512236 281686 464271 462942 229844 230080 132234 453876 273127 193345 388138
13611 388138 358150 397301 25414 43446 418560 274134 111080 463273 479694 490946 328235
13600 328235 568107 302758 122661 422880 27679 371365 545504 219329 240469 229920
13590 229920 321108 228601 185582 323212 414818 421169 322580 302230 44994 333648 31709
13578 518205 355890 55607 223281 465667 203343 202549 351121 419541 134146 149545 87230
13567 87230 285523 140951 471563 527121 233896 489214 -48441 71027 495563 210432
13556 313591 237363 404279 477609 397010 171109 295752 316126 146628 125514 57646 351957
13545 351957 182267 212147 186569 221675 112747 299586 401392 142698 224167 -285854
13534 -153652 317788 231246 495288 161876 91376 209648 223770 278888 250201 71522 481460
13523 481460 303554 20107 109188 29161 151296 192961 435643 362379 342840 413236 283158
13512 283158 367538 159953 452654 61402 -187931 420940 205865 586346 165826 374573
13502 374573 126823 38311 243134 89416 29328 90360 308835 377283 151568 334728
13492 334728 328355 281626 342090 181913 363538 137039 196590 332090 296972 263971 300677
13481 300677 437402 142603 177293 91286 431528 523368 484013 430339 34776 69732 336519
13470 336519 152985 86067 256592 311642 544567 397059 274283 276656 -32829 24758 159980
13459 159980 145626 295531 242687 35323 313871 240472 -7880 129038 339304 368821 128465
13447 119094 205666 395358 -119026 130538 -159198 279822 242639 80823 -31669 322998
13436 99931 293670 136661 53166 -35989 13218 74265 92343 -65557 484270 335630 113455
13424 -68130 319436 295903 227949 85469 193537 185363 66003 473002 232245 271461 323018
13413 323018 -40855 377571 -50181 204661 140470 53343 -21250 237937 367003 287045 332368
13402 332368 133779 -23595 309588 252937 190342 10808 212681 -18360 343498 162960
13391 11564 232143 332634 29575 285803 248389 234583 -71262 179996 105628 -140445 147526
13379 56250 185229 361370 416707 685458 146371 91762 253357 201056 264554 132477
13369 132477 102607 352292 218288 227073 29723 -15528 136698 161204 106804 270940 -54947
13357 319005 172344 128007 5985 348745 350402 329713 23664 -17972 156292 179231 -188931
13345 29807 326373 433402 276852 197560 193473 138183 48256 54232 318302 395075 373960
13334 373960 16522 337364 163686 351888 117258 224731 19840 360689 218221 275810
13324 275810 -170023 369840 104670 183470 137648 196560 56221 315929 179469 -54052
13313 441661 205128 172364 13072 200228 256022 41090 164267 180856 521296 169816
13302 92146 -60361 29673 113478 155838 425339 104891 107064 420109 12122 254893 265280
13291 265280 367766 -161664 -57658 101799 -18882 180873 154819 90709 193097 228492
13281 228492 159782 523647 290525 -50821 -163423 -117018 -125204 -297151 151219 52086 46937
13270 46937 209574 393594 57595 203819 295617 164625 102631 335391 -151212 61856
13259 18996 189977 -110456 -89115 -65678 -119553 75015 68567 280032 298392 61824 382339
13248 382339 72748 -29479 -96825 211086 113481 -207751 446237 91179 -49666 103846 222302
13237 222302 -44811 5045 146285 53883 31613 186316 -143047 -107880 108563 109553 -111531
13225 302386 61748 -110528 223383 153674 51059 284420 174749 13606 372019 234845
13215 234845 -51010 164403 105634 -134202 -227205 -152003 -69086 86261 89843 63809 128896
13204 128896 -304203 -149969 141846 63889 -46486 88883 -60214 -104386 308323 244318 198831
13193 198831 174322 -16108 225053 146482 -58116 54182 250909 -1041 -149816 208362 2492
13181 90311 223355 190846 259771 -19870 -147161 128015 86237 147176 94539 188146 272870
13170 272870 177350 192986 -11545 165760 286807 69906 95466 12557 268644 7033 -196872
13158 416704 81978 123169 -46825 101072 -177213 36313 86999 -6572 229781 134865 20936
13146 -41120 400313 75547 95823 196060 -47592 111954 176089 39134 406835 7876 127908
13135 127908 85090 126689 192480 173010 -105163 265951 -196952 53407 117235 -89083 -80044
13124 -80044 3084 141179 65343 -192059 10802 119319 -69994 -83461 21000 215249 69498
13112 21978 42441 238415 -22702 -35400 25526 55407 -109202 -32791 -256978 430295 167729
13100 202 -122633 -67410 16833 362964 232047 340712 2148 219672 -183561 -13947 31416
13088 -140071 -133817 -66735 11345 84443 -46116 -120792 74940 -56496 32476 175070 129387
13077 129387 -106608 82571 108261 -274340 134031 -143924 210580 272322 56060 260093
13067 260093 -42956 104183 417313 66577 -69134 -28483 108874 272176 -19896 -13014 -69263
13056 -69263 120145 115514 66513 86906 -8652 -15248 -51861 -39813 -201124 -180017 23061 145131
13044 145131 293586 58645 -140576 453782 -365252 38444 265083 17998 249006 104919
13033 36872 236341 -263305 267515 110635 75264 -206446 -114276 238035 102981 -278016
13022 -136711 293363 148271 -57374 184547 17088 -73990 379172 -98737 146355 149953 -2418
13010 -63272 64602 -47931 -438799 242749 405813 127426 -81314 30182 95471 368423 -78405
12998 21688 276764 133928 -18722 -73705 211711 168951 202294 202262 277298 26071 226406
12987 226406 46950 -49955 -82853 -6601 248082 53844 385167 -121592 3029 52906 103759
12976 103759 72019 200442 21553 10984 60783 122558 178023 136126 165903 73994 158686
12965 158686 -154499 319933 -25776 252423 164890 48283 -28667 49638 28540 -174303 171333
12953 225739 -132449 82883 59953 36731 -529391 -159186 -103997 402411 50349 3712 178381
12942 178381 117138 -72742 158533 19891 72268 -120323 109401 -22394 -170719 145852
12931 68285 -78652 156934 101795 321313 127505 9011 192284 -325717 -51838 -57379 257841
12919 192173 215606 292102 -406264 110193 217822 211864 -53543 159055 67480 61852 -136853
12907 46407 59164 342997 36503 -81053 118031 370386 -15731 74207 24360 -342226 37145
12895 69475 -163510 -429476 14283 -95903 -41227 -44155 16586 89233 64181 -84021 -196465
12884 -196465 189512 28259 -101150 -23216 -260370 48583 -66135 73458 39487 159483 -99012
12872 82923 74277 -163341 54624 98781 -39053 -241287 134805 -6966 5510 245836 -101816
12860 -29940 -53201 71061 249496 49672 -24142 193952 93772 72849 433406 68050 -68512
12848 -158063 61529 391383 -75832 96083 -324016 -141803 20778 89379 -16400 -208860 -106754
12837 -106754 178315 -143463 80554 4416 59795 14345 75064 -84137 65176 -57023 114048
12825 -32019 237441 -150344 104088 56711 178971 -85910 182381 -26424 189280 182129 34746
12813 -16830 84676 241298 -79676 91600 141346 129336 -172814 -2436 190307 -108105 -10155
12801 -227208 -45670 25469 164818 236659 50047 69227 -63950 -297664 34888 -260598 177186
12789 -115810 60056 10017 -175184 -40096 109023 -313840 2505 55494 181104 -190104 -177116
12778 -177116 315127 131350 -258818 103121 83063 18742 262771 -164608 -39233 -142731
12768 -142731 109351 336824 -218539 45818 21990 -131453 -23842 -245684 4602 -71854 67150
12756 97597 136677 160958 160321 39154 120760 163786 -253134 -88330 -90986 95407 -3941 163093
12743 -272774 59075 -364888 192270 -187594 -200693 -280 166606 93520 -191944 -118278 152573
12731 290072 -68670 17780 -134039 34526 -178854 112132 -148162 11757 67060 -61737 62259
12719 -86576 254252 -84746 153330 112851 -11579 133624 87156 -396061 119187 165039 331011
12708 331011 191249 123603 210327 331967 147702 233225 -181402 133035 190590 26935
12697 -160444 -275523 65516 -79931 -282596 141886 77466 -143814 241322 192206 18325
12686 9368 274017 -342724 76038 -213060 -99521 156044 386399 -21866 215571 70585 70519
12675 70519 -201996 96993 -199577 271850 -243251 83392 -103152 31538 170433 -18556
12664 9529 320053 -203879 115935 115522 34768 37049 15616 -53692 321438 -9718 240813 181675
12652 181675 -196109 382233 288330 193655 -38815 -43164 -108545 396168 101843 -177652 174894
12640 190216 490210 -116234 211068 49844 92767 214330 74277 371271 -36185 6061 100835
12629 100835 -98820 106104 264518 -168262 186600 18783 45976 -154187 148753 202280
12619 202280 259262 251670 -8221 50413 -38285 -163301 34229 286981 -105269 196036 -36634
12607 102682 119746 263726 15356 -260455 -19000 -16567 346264 187279 221540 -21763 57810
12595 158360 -25447 -103974 197603 168549 -70543 51113 4548 -86188 8415 166573 -143650
12583 258878 -20840 112621 -210086 -10968 -19058 -177885 243908 151134 -195353 -84398 -98282
12572 -98282 -45880 -44027 -110699 6565 262996 -64278 206612 379210 107673 -155647 -135422
12561 -135422 -395352 -277854 510874 39527 46333 229505 124003 363289 -64289 -159048
12551 -159048 147 88256 -30308 80504 -197192 -191035 164057 50152 -241354 -141855 -7647 255658
12538 113858 286879 259344 195316 -33956 -228425 120456 -22277 87227 -381208 67987 32975
12526 350547 -9957 216392 10825 85165 -65565 -111119 179489 -42844 -106201 310146 18354
12514 -173022 83647 -213013 -224060 62949 44895 26120 193672 22805 61467 25744 420481
12503 420481 62710 -53906 -69799 -50664 -90241 -143886 113093 11245 -188606 -154247 -121693
12492 -121693 -279240 -235997 8897 133492 -19051 234794 -77271 216300 172360 367770 -106245
12480 -262854 -89926 -299475 -72035 155651 -222407 133509 55660 105598 -24904 68068 -67638
12468 -355195 297234 -18733 -2461 82329 61641 -55938 -77878 46943 -257161 -116680 -40897
12456 -43184 85721 10257 -256852 116186 244885 -137250 -3193 -91876 65789 -92552 166370
12444 273617 -156909 -261288 -279444 -212260 103185 -46400 -295327 256488 -243347 -303352
12434 -303352 190336 31807 -159064 216674 -41007 213393 -128055 57681 -170019 -90627
12424 -90627 -3424 -151822 -463992 -301441 264013 130172 -87285 -135666 152178 -67703 24960
12412 68419 -123466 -171357 -104318 -98251 160493 64614 -108234 -73236 14625 176854 158914
12401 158914 -336457 -82067 -90605 -41577 7631 -11857 175562 -49386 185539 114497 -135019
12389 79784 -235585 -50704 -188292 -12340 -17059 -128184 -198667 98027 -31683 -82522 378861
12377 -163400 194937 -124780 215701 -38475 -268078 34343 -212695 59269 -241579 15937
12366 218914 13124 -169434 129770 -120789 -185589 53797 -2105 188066 27033 89538 -154520
12354 -10259 368910 259807 28940 -16094 -65614 231487 283426 -202005 266699 -23729 -234356
12343 -234356 -78416 -7720 -159367 55231 -59294 103303 68116 199023 -151746 -143503 388388
12331 304057 301754 171582 -34888 108762 37012 36207 -255043 -147040 -226498 -95599 -594898
12320 -594898 -38072 -6502 254869 -177845 -134320 -383314 -47896 191370 -3511 244651 50337
12308 -117938 2298 -178138 -12843 -20594 298787 174135 247764 296431 -195711 -208077 -35147
12296 13294 247622 -10310 65498 -161652 -13930 121140 137962 128145 112071 -26290 159239
12284 103651 -248032 -81475 127304 178306 35074 162518 103182 -98576 -24604 249255 120865
12272 239018 389124 46634 141275 240697 -49904 57837 -115926 -53327 166095 -125980 -98338
12261 -98338 -12113 37652 -67936 -11506 -197958 -75162 73352 197123 145998 144942 -126952
12249 71003 -132478 -223382 -31702 109597 -235346 -201553 182806 -28733 163090 82720 146949
12238 146949 201658 293568 274264 80879 9691 -95083 -22896 102778 167035 159501 -166121
12226 190740 556417 31179 305637 209034 108169 176545 191904 93282 260736 73919 459479
12215 459479 56739 -181047 307664 83887 -220191 415655 51008 53747 2041 196732 244772
12204 244772 43611 186887 156467 -104653 182358 210790 86122 127698 218644 15135 321471
12193 321471 144579 85964 200323 86140 192226 88279 154250 239170 11694 170187 289287
12182 289287 58099 234070 336165 -102021 63794 -190840 422265 179795 190717 237869
12172 237869 90059 45573 253388 -26892 35256 139152 357629 318198 -220693 -184150 253445
12160 63773 -58845 82070 399853 116208 448839 46583 -35328 52404 -237175 90963 3096
12148 204397 257190 -30802 -127611 187236 122414 47639 95025 147218 82843 -59230 -43418
12137 -43418 66576 -275025 -187252 -21645 -163018 66853 216827 11741 99045 -33275 121348
12125 15119 137130 227569 6912 129137 -195455 310269 -128893 215087 -57478 91425 -306784
12113 -61506 51267 -90668 -290112 -235583 107847 253457 -51627 38246 96316 -46409 93935
12101 -22666 -257653 147758 115409 -60721 146705 -112503 -134434 -151401 -100705 -136654 -109667
12090 -109667 84828 -237589 154059 196884 119423 -201385 -52079 145460 -199427 119249
12079 -153583 174151 93961 -296790 157295 -12668 -114074 399152 921758 1399881 1089798
12069 1089798 184406 253503 77778 65755 125510 -112150 -299005 -44595 -31755 -139182
12059 -139182 555497 -50926 117672 -336412 60771 151735 -89960 63039 -224989 128361
12048 -61045 -116120 -17838 -77727 -201624 161437 -271936 -49480 -70733 -431681 25766 150638
12037 150638 -158550 197521 -14072 96238 -103213 105615 38512 -179029 -51573 44597
12026 -91000 31719 -122774 157103 -108543 -137791 325634 42583 -179846 236203 61639
12015 22104 75278 -70417 197419 -23240 -161622 -27277 -22162 -117461 66022 -39495 267964
12003 17136 229710 178659 -105785 199018 256078 -181463 -56379 -217419 -284333 -148496
11993 -148496 81695 -119374 6528 -41202 -350023 -162695 14027 -120218 -24843 -423466 55972
11981 316182 -320005 -79079 -120818 -359725 -347664 -358600 71854 2011 -342482 -113387 13107
11969 65028 -201571 184839 -47853 -169738 10100 113668 -179253 -32004 -267096 -374431
11959 -374431 -200543 -34925 19664 152869 404190 -142217 -110946 241004 178900 -199105
11948 95324 325096 37767 265663 -111719 39034 -93111 125971 149933 169584 -40190 7169
11936 -209354 -287705 -52605 112716 -211780 -161792 -127020 303170 -70028 -316654 -122150
11925 99526 101825 36832 -175393 -273605 229204 -11699 94182 280819 -184027 -183780 316784
11913 -111558 -111321 63387 -300556 66710 -89908 294353 -50407 40341 -58458 -119765 -35247
11901 103777 -500866 -196636 102420 36791 -6062 -230812 -233722 -86590 -40250 -75830 146850
11889 42414 -22960 -68521 78828 44257 -43931 -19566 -102587 -36138 -96577 25461 235816
11878 235816 -122819 79587 -50872 -362623 15940 14925 -86144 -114401 253135 -113391 -103318
11867 -103318 159059 20775 -26061 -195104 -86694 17528 271320 -179968 -60924 -176792
11857 -176792 188633 1852 45732 8057 11328 58591 -236630 -70602 3614 17725 -58697 -54116
11845 -54116 143656 19601 -103048 -32856 160037 -206727 -92504 254340 65522 7047 -55959
11833 -52199 -96272 260025 -340898 115560 118346 -68060 -101571 94515 -32523 -59887 119943
11821 -6140 28323 -42127 40618 -86480 194145 336514 -86459 -19494 -78301 -122196 -168235
11810 -168235 375423 -52981 128754 -34895 35676 5523 174041 -40679 175099 327212 -315892
11798 150510 6428 -85379 -29941 -32635 -167815 -179889 -147939 -116360 148848 -247859 101434
11786 -48431 -14812 -121878 -121116 -143019 -462544 107811 -3456 -170225 -65931 -217648 15320
11774 40129 -84470 -45115 222513 -473998 -186919 148433 -105095 -83009 -249248 -340524
11764 -340524 -200540 -103432 -5242 -179676 -151913 8273 208891 247425 -339535 -166902 -171117
11753 -171117 47570 -122286 47140 92216 5721 29150 -309249 93637 12320 104840 -177751
11741 122517 132443 -210198 -86342 -37277 325718 -97255 157156 131115 287311 -4032 -130514
11730 -130514 -38344 154278 111124 173708 14255 35410 -383819 14912 -27785 -475629 5070
11718 -253162 -19904 -224660 -117423 26493 -27019 -38414 298883 36443 -231762 24256 299403
11707 299403 -222716 232234 323263 -9249 -265882 124663 268395 294116 -103692 -206937
11697 -206937 241835 273920 -62137 151872 54025 359082 16781 -38600 -406260 41786 -230988
11685 95835 -176519 296143 -52870 -84241 128956 -40446 62638 -11528 68284 -150052 25657
11673 33291 240781 168363 -162458 -132610 -99961 -100245 -273925 36065 306365 -6942 99601
11661 197357 24317 252647 184989 147446 -43939 270229 -33593 271839 204553 310087 -48891
11649 263744 247961 -28781 147196 151579 13693 -63659 -320535 -50366 168788 -119914 207385
11637 46746 124769 -248258 -238734 28494 125819 139263 181312 62676 -271513 -146416 250973
11625 117432 -3337 14617 159547 -75865 18449 180263 329829 64888 305672 56827 -233380
11613 223791 191932 52365 -114190 -34139 280245 -61261 336373 2615 40995 -42545 -28041
11602 -28041 68251 -28995 126312 69895 -165806 168680 -294147 120050 75395 -38994 -20610
11591 -20610 -115009 189004 -26788 33079 -195687 20546 32196 178585 363188 -249839 260556
11579 -142755 -36816 290244 122797 206231 -185572 16355 41997 327022 93658 249189
11569 249189 59524 15450 190257 121912 255940 53774 17306 282505 258915 313447 -41145
11557 -51784 -145172 109625 -124410 -220476 110554 108594 123933 -134105 479622 933 171237
11546 171237 -169387 -111053 250610 155351 48867 -70126 -230675 194534 75921 190407
11536 190407 -298031 73563 151590 130199 257816 303333 -125504 89636 298937 45553 97081
11525 97081 -27033 -351232 118937 146337 -41369 -94815 -128727 23306 347470 -154886 145918
11513 385104 -58411 -211686 88716 176418 -109158 -163546 -88848 185548 -47529 20266 393369
11502 393369 115006 -224368 108964 203875 194314 69581 202394 -443239 23513 260437
11492 260437 -104843 224353 93069 167730 173057 365066 203944 3301 117712 263103 440205
11481 440205 -29794 293131 -61522 133270 -278779 -135434 -77866 461908 316827 291021
11471 291021 206837 349042 601006 82835 552303 220226 354620 9727 247382 -35689
11460 -37269 -63693 -254295 -20157 370748 212716 172273 217856 137072 222438 -195847 128975
11448 -172415 -107862 49260 -54048 16827 -84976 183451 -361611 122522 -56901 86749 141328
11437 141328 91372 289986 -82983 112514 -58461 37333 -124848 -48639 -74887 -143625 -8084
11425 153358 303583 -76394 187515 213438 -16439 167525 206650 -197847 -76603 -46570 -12231
11413 99197 -147973 -343757 -69344 -187610 175144 109484 111201 11155 72617 349148 5988
11401 164667 -256862 -206152 -209211 125856 360299 -124958 -112571 148316 231796 -84283 -28775
11389 -116133 75012 -159527 188993 -324561 -133599 -206760 151114 169099 -62431 -303306
11379 -303306 434541 -61337 229624 100506 14754 216741 93276 151030 -34174 19260 24349
11368 24349 -478964 -89969 -149716 -203610 216350 155911 237747 166890 -133050 -116943 92203
11356 -72712 -148305 126682 -18679 -101756 -8093 -219673 -4271 75451 20684 -207802 52766
11344 -242759 -48818 73269 141468 78122 183722 62120 -176790 279705 -140233 -8857 49597
11332 145373 -120499 -231249 -101601 304782 307008 -150441 12141 142635 -93921 37656
11321 404375 300612 141745 -157135 -56564 121252 -95395 -141720 -274136 -127091 20326
11310 142085 -49931 -52723 -37546 337229 17714 -193421 154411 35631 131659 32038 63616
11299 63616 51098 -10823 120113 -91265 23514 -106765 -263684 -104299 407154 -53583 -343437
11288 -343437 47797 -93853 82306 108710 -55183 -269795 -193766 110932 -237799 -31142 -262243
11277 -262243 -144003 56625 -213386 177162 -36148 -48959 -117685 -87198 -78667 74054 -335592
11265 31766 -34192 51144 -64514 254994 -250402 -319796 134183 182803 -139296 178688 51014
11253 -79492 169714 -372053 190231 138206 277700 126367 -226046 -55000 -204000 -107861
11243 -107861 -68299 83384 -184241 74704 -223703 47430 -160476 7966 199162 -45360 -244061
11232 -244061 -230830 -55717 -20405 214200 -339321 -132162 -134026 -39644 -148060 -143931 58438
11220 -97314 -249563 -65362 -259284 116807 16668 185966 86697 225564 -85077 103254
11209 -263223 -9795 -164872 -263591 -78358 -233655 19176 -209845 124586 -125778 -178802 -108765
11198 -108765 -289966 83551 31392 -205949 85753 28549 -58296 164816 14134 69040 -81151
11186 -53360 326992 148481 140387 -23458 -425707 -21593 51826 -45264 -160235 -97478 23197
11174 -226955 -68524 -49768 -236807 230874 -445690 -80911 158423 44554 -116884 -138015
11164 -138015 -157848 -143857 -14921 339564 -27567 -165601 -57187 -81615 123406 -237755 -230839
11153 -230839 -100035 -254676 22335 34112 -448162 201797 229285 -26942 -24877 184967 -48246
11141 126444 -202011 24483 18347 -284339 146861 189005 -42784 71848 82347 -166382 12486
11129 132307 -151562 -240126 332606 -44544 49891 261683 426668 53591 -43827 198838
11118 188219 -171032 -127763 39184 -22914 397169 -3500 104196 -82524 -3746 47675 291114
11107 291114 -136304 97678 -98175 1626 236668 75116 82388 389500 189787 70535 28863
11095 128518 77565 259134 11593 -50606 116572 356451 -2017 224414 182117 291723 325266
11084 325266 250872 139433 -23267 174767 503357 291438 208911 426683 176411 256117
11074 256117 9308 -41605 174691 126436 289164 545157 137388 235431 218952 326705 458969
11063 458969 395718 79687 549386 450796 449243 280363 710166 608529 420037 620502
11053 620502 597855 513344 780044 917591 877990 617411 290692 709454 439808 484857
11043 484857 592664 647474 799990 701798 518206 989593 418302 692033 582716 632447
11033 632447 336281 674889 604242 612096 636284 486660 530110 618985 506636 328667 374611
11022 374611 538632 560441 289528 290231 441824 655672 484075 420829 917304 397448
11011 295777 458393 668896 679173 582019 350363 540164 601268 530223 527024 308479 574398
11000 574398 523096 568654 781965 467691 422327 1165703 315846 702357 677515 677933 575251
10989 575251 643820 566110 677835 786079 847171 723132 843025 992912 1014499 1343919
10979 1343919 1250050 1367809 1818745 1683620 1763287 1982071 2344995 2684375 2563132 2084117
10969 2084117 2441461 2225803 2327798 2061640 1661819 1393209 1757091 1665831 1417382 1687238
10959 1687238 1895638 1772468 1504969 1772259 1647043 1334844 1269287 1208198 1017521 730134
10949 730134 754165 623478 515521 448943 477806 451768 497443 54531 418943 554837 77020
10937 209533 271691 304920 204576 318870 198740 -97657 48231 105942 28517 78454 -269041
10925 143413 -99905 -4662 -110593 -304787 150426 18082 206416 64917 38673 202725 133620
10914 133620 -278267 56530 -91806 -61632 -177479 -8849 213884 20010 -238124 3757 -155647
10902 -35432 40444 -190733 -154298 -81371 -31411 61689 -111967 -22884 17995 -168558 53876
10890 -292903 -161900 47265 16157 -191408 -382786 -62922 100219 -128515 216967 58228
10879 -63742 -55937 23662 -179935 58323 -58251 -54487 -15204 127549 36782 -125071 -191100
10868 -191100 88459 -146148 -125996 162150 52771 -13441 -12981 170693 -65831 130909 -63276
10856 53280 -244613 -30015 285455 66892 56130 134081 107089 -89948 -145516 -31113 -156216
10845 -156216 -245213 399606 130489 -199870 -163337 -411745 288095 -22551 238113 98695
10834 259233 28796 64670 -62999 -536692 77795 -14324 4670 261347 -120694 -35037 -34265
10823 -34265 -137225 -130602 -132813 359810 -127798 79721 114787 89814 282223 -89613 -264580
10812 -264580 -185367 -69442 3468 63949 68159 77678 7869 -197606 -324115 -252221 -131604 -210274
10800 -210274 -102599 -91072 179242 -89314 142075 4573 47216 75963 -217066 29267 -79267
10788 -116383 122167 161424 -430034 -213554 -120804 12051 -252069 -268434 -263726 -93998 10914
10776 136172 1797 -144518 80293 -149882 257869 -232758 -163423 -42598 -99289 16785 95922
10765 95922 -108287 439 -301779 136000 25320 -85353 -112492 8246 -126147 44975 100570
10754 100570 285530 -206899 -192625 151074 -36064 193471 106932 -21159 -69392 -53144 -63884
10743 -63884 -105613 153188 58205 -64806 -16686 3392 281366 -109879 -8970 68164 70188 127512
10731 127512 -34244 281988 61921 68767 -57400 -38929 -284914 -384327 -5017 171145 -27624
10719 -78655 179539 -205886 -118695 69834 -30030 121668 -110932 -33069 -62470 -234619 -330742
10708 -330742 -323717 241726 -233348 -22331 -24962 -260504 30651 -321326 -266800 285259 122574
10696 -1127 186892 108186 78608 -118689 -191391 -133275 -458986 27404 -186275 7514 118996
10685 118996 228851 -100249 -152717 -358571 -8948 -314039 261681 -342497 -303068 -60005
10674 179465 -135614 -146197 -146477 -132247 196328 -269110 -13810 143501 104435 20012 85956
10663 85956 -284733 35616 -73343 134828 13116 68367 -73872 -102366 99588 34891 124998
10652 124998 -138702 -9072 -344306 88728 -20053 275729 -265793 -202432 -88783 -84862 103371
10640 -223341 183931 98681 -320513 -94329 23254 -51584 -46567 207849 65770 -378782 -273548
10629 -273548 -168647 136659 -137585 -296125 183444 -105151 60564 -40504 74976 -91373
10618 -353980 298901 192587 -161808 48589 191403 202985 -226809 181705 141848 -96134
10607 290552 -50871 158836 -308417 67713 -218228 -154455 97522 81564 16777 36767 -432
10595 -58347 -101347 9450 -69608 -49053 91938 -99736 81808 -296369 48364 70802 -137569
10583 63503 149020 -215052 -121952 54527 -51684 -381365 -183423 -115633 146708 -85180 207202
10571 -373034 -261475 -127749 85437 -197970 62097 -66734 86344 -377781 159967 78121
10560 7642 -298665 39081 -257938 -91639 -150463 160117 -310769 39003 256380 -167869 -65164
10548 -217743 31573 -282423 191771 -146592 89241 -62220 48518 4484 -218693 115187 11394
10536 30753 -57360 -112027 -58916 -354338 311400 64652 -226658 -27993 158053 -62231 36987
10524 187180 66022 206065 311698 23072 -137529 -41884 -124482 340456 -67236 63085 -15635
10512 222272 -106265 -165628 -316761 -148534 226584 -108069 -166105 -226439 -159851 133721
10501 59291 271368 -50936 -73907 -55562 52236 -28700 10369 109273 101043 -197155 38366
10489 62826 184381 -258279 -171069 -309922 37482 253197 213717 124543 55103 234271 504946
10478 504946 312832 261213 154736 22359 472361 268772 43687 34330 67672 215709 -377249
10466 358627 95716 31059 209992 -152141 -278344 -173998 88427 -277167 50672 -203198
10455 72307 -132425 -69253 333517 -119128 174896 2462 38399 12884 104215 -95793 60015
10443 -189571 87002 -77933 132524 41150 27725 102984 -77164 -309809 85717 -87943 291768
10431 -130027 -283134 -43103 172865 12477 163076 -74352 -13766 76138 181983 -292921
10420 -106974 141916 -98979 7850 -32402 -126943 16189 -179656 -141996 -6471 134359 255978
10409 255978 -36906 -291288 36341 -175073 20914 42918 64441 79199 -104449 16541 -67533
10397 89318 -99608 -320311 -5653 -283855 231604 333589 166220 181189 -16126 255966 215328
10386 215328 -30743 269045 83464 109344 247668 -87158 168005 -29635 213742 205340 -231742
10374 173880 436358 42557 181232 474128 115753 102526 478785 387374 469907 265004
10364 265004 187815 68905 265792 -24622 131765 229657 295452 242925 28941 -306409 40656
10352 412392 478163 376964 446747 248882 354454 24927 170283 414116 306660 140290
10341 374734 339183 138646 82033 193514 71507 305339 201545 75790 299661 288669
10331 288669 224602 -73589 145857 -135125 204566 64240 175265 172976 -7927 -140877 51366
10319 -9219 -17585 276642 25493 -110347 -13471 210978 -55464 130266 160247 279945 -2142
10307 65803 -91178 -287449 199138 -108482 -54580 180170 54103 -66563 27572 -237092 47445
10295 91262 132726 -227001 -38861 112365 -23093 57145 -175984 -314365 379785 -144046
10284 -139551 -113888 -424512 56448 -147759 -31385 -179989 69723 -89306 61088 -171178 -36894
10272 122005 -181019 -250936 152748 -144016 -169925 -72309 -165164 -95612 310000 -191748
10261 91389 93104 605827 -49123 354058 795056 29983 65304 146848 145965 141113 162027 -324290
10248 70694 -17629 -82255 -9529 -427387 -311880 -219065 64582 73158 185087 85562 243333
10237 243333 -83208 -32536 145410 -150869 -190039 -170545 -242054 408276 -124317 33783 -272008
10225 -4727 51368 61679 118785 77562 -117479 100054 -231591 8988 -149695 -207511 -173078
10214 -173078 -54170 -46561 -37086 18972 -2182 20777 -153849 -448566 -101165 -150881 -209213
10203 -209213 -85992 -98085 -200733 259367 -250112 -75336 -408289 21135 -60404 -81132 -120835
10192 -120835 115173 -238699 -221589 -37632 -224456 317121 -370882 224290 -27070 -27672 11193
10180 46623 -150367 31989 -155127 -339475 171495 -20797 -89475 -318112 -95915 -138729 -447045
10169 -447045 -83042 -251702 153457 -10876 -222924 239395 -193505 146660 -130498 -60130
10158 117546 -223822 100886 -131245 -37018 -58013 -74624 14842 163075 -108229 -279077
10148 -279077 66308 10912 -311651 39553 75869 -57846 -178798 166769 65569 -26876 -138714
10137 -138714 243796 12081 340212 -7807 -76229 -87395 -12230 135052 200719 -221242 -252254
10126 -252254 -121767 -127098 -70641 20213 155122 175093 -148478 95337 96763 1587 -478635
10114 -238928 25803 1816 -36884 -237369 89840 -125720 -68103 252860 90177 141107 164702
10103 164702 -129099 -174553 -146035 -37197 -29821 15149 -56887 4457 -311166 117040 126521
10092 126521 -221667 -160115 -320040 160783 357479 31955 -149971 139954 -53164 -251055
10082 -251055 732 -75494 160322 153705 -269252 -162098 285985 -139854 60419 53893 313712
10071 313712 -132947 97677 -23662 37217 2522 -166401 73321 179521 -147234 -69472 298633
10059 56274 -136541 -264552 -186734 -80203 -289590 -77334 90518 4454 -131076 131983 100681
10048 100681 -83873 143655 -71608 89574 209638 -300647 -18339 -180505 -28080 51761 -246842
10036 -140068 117711 312285 -126731 -5664 -344500 -83039 109802 -356265 100712 -160942
10025 124505 41902 106684 255211 -69883 -146666 -176594 412636 -84709 -157429 -400999 326108
10013 62373 190 -255495 30804 20568 -25068 -90839 -108148 -145286 -36558 -83914 36331 -179319
10000 77656 -206109 -172705 2550 13232 -339794 -262911 -7409 215353 -423200 17994 -305021
9988 -15946 -342164 -132933 34673 -250819 -91354 -62687 279266 -174555 76992 -136992 -21776
9976 -415488 140732 125134 -41846 -193831 -267022 -121029 50189 -238756 -213559 -86576 -43770
9965 -43770 -96213 -328839 -105226 200567 -128925 -273620 312753 -161292 68739 173997
9955 173997 -169602 -222301 -158448 -191978 43697 -241285 -197152 48717 194627 -228181 -13935
9943 130641 -59044 6334 66366 -390037 -143473 36977 -376692 -208954 -213296 -122275 -160963
9932 -160963 -186060 -120153 -28545 109051 103265 108387 129675 -97494 -53264 -31134 -37902 -34707
9920 -34707 -93124 -67948 123552 -5341 -421564 -12997 -121998 -59823 142910 46276 77704
9909 77704 -229605 -208541 -333602 -199481 -118873 -94406 -170783 -14696 -146619 -20071 61696
9897 49156 155289 25068 18030 -57318 -149452 68714 42761 62723 -53896 86154 -215403 293401
9884 -50750 -10473 146410 246629 313120 22863 -246042 143479 -234098 -112663 -6133 -89591
9873 -89591 26479 3266 -333075 41419 -129063 -55864 -306141 -310027 -211066 -302569 278192
9861 -184393 -134010 -104907 85539 -101649 219002 242987 -92247 164501 -318995 -146338 -85758
9850 -85758 35582 441391 98062 -310759 175525 -487206 -103489 -45470 -15953 39213 -13701
9838 2807 -342788 -317388 -358989 -25144 102799 -269069 31778 -177258 40189 43676 -282647
9826 78742 309219 -314226 -279594 172050 14895 -64975 -91557 -240469 154443 -107261 -104310
9815 -104310 -231928 241505 -280581 -280697 302195 -457974 157903 83077 121995 25645 -176006
9803 -146764 -79313 48845 -332631 -921 160954 -257388 -57333 -121694 19897 -270747 12155
9791 245311 -250114 -55105 -249858 -69382 91691 -77549 118447 -91081 -61521 21219 -243425
9779 134369 -260885 60451 -174545 -200092 -257742 -193507 89306 -215720 422230 209623 126407
9768 126407 43162 -113788 -153744 -272634 -41428 178904 -176380 -25823 -79531 123745 -126086
9756 -56392 -73595 -203921 95639 37939 -371971 -227631 -93158 156818 299206 -107661 -168539
9745 -168539 -213546 -144204 -278433 -146006 285221 -33626 22080 -123075 93066 100455 201936
9734 201936 188203 -413459 -110247 41115 -133535 -235791 -104445 -83983 -52424 53048 268342
9723 268342 -232460 -57403 -95053 116971 135039 3257 -50237 -183604 74337 219007 -256734
9711 63367 86588 -155152 -232814 -89050 79402 -210083 -12032 -4515 -97277 -123493 123606
9699 -13537 237180 -303145 -165239 206997 107644 -122186 147685 -148103 -139002 188698
9688 159404 -349625 -233323 -131266 88404 -146813 53267 -94193 -59858 18542 96420 -52667
9676 -50994 -12128 -10568 -8688 2063 -20938 645 -35569 21066 19306 115746 -131253 -8599 -151308
9663 -151308 57299 31116 -279972 72510 14970 193375 23052 -162911 -237740 -157597 -257458
9652 -257458 -95870 -65140 -22749 -303979 -92682 -305012 181879 256431 -201383 21300 189872
9641 189872 -155409 10218 -288917 -180388 -243708 -76845 40494 139805 -28284 -29740 246146
9629 -239859 -30585 -133912 -169710 -57718 -234262 183224 -41748 -233108 10033 188817 64900
9617 -464249 144079 -87754 -23881 110884 -263215 -30639 -18576 136275 -7777 321442 120504
9605 113538 -377642 -241174 240557 -149203 -166698 -44862 -359214 -24672 -98280 -6359 20442
9593 -165535 -59909 124501 -70435 -128131 -102638 -174681 -385713 -42437 -215109 -170983 -91165
9582 -91165 87190 -157748 71726 102927 -342789 -322650 -303422 -165945 -179915 183573 -198943
9570 -116387 -263674 320713 -275234 343558 195542 71539 -30408 -127090 -129561 -54738 -104838
9559 -104838 -174713 -206695 -171368 55653 210502 -380431 -171730 151607 152270 69698 104322
9548 104322 -291163 -61888 -208195 137829 212678 -178051 -223634 -130970 293298 -144265
9537 47649 21793 91181 318111 222851 58288 -347614 -24460 59520 67454 130677 -197689
9525 31488 -55407 -126494 -123685 -46260 -56505 173725 -155426 -29686 190543 -262857 33253
9513 164184 -186662 -139312 -16991 -362907 179773 79300 -438804 150864 8377 144739 232414
9502 232414 -19241 202373 -199587 -377708 68874 -100240 -130613 -91774 -61364 184513 -134921
9490 -73961 -196564 -84247 -8672 -279743 -49840 23266 -161915 73687 179185 125281 -135745
9478 251403 224554 151357 -149641 -242515 54312 -6915 -244360 100154 299861 -143811 47515
9466 94790 -73070 81540 504389 -113641 -557533 178316 -211125 -14987 31426 -389220 -72349
9454 -436536 292600 -206168 49634 172156 -154700 -39957 -116340 -117525 -119334 -77353 -100928
9443 -100928 -55272 -102466 -179172 65983 -255434 -67174 -311504 76335 -50361 -339990 -14646
9431 13445 -1237 52623 -434139 -123690 -248034 -17635 42953 -343303 74366 252369 -97875
9419 -284306 38482 -50925 -87333 54087 60610 -180134 46000 -125332 -159557 -66554 -80189
9408 -80189 -103615 -117515 -26068 110326 -167769 6157 -218406 -199392 3222 -57223 47868 -22167
9395 316431 231730 -197203 -264154 177968 54282 6780 -48513 -296201 -106586 -367257 100270
9383 -80025 -197585 -366448 -81609 266377 102498 -140116 -262099 -251284 2036 99010 -90810
9371 -193945 -36476 246824 -301688 190050 -162327 66891 226468 -17727 15417 -151092
9360 -282885 -266351 -246671 -266921 12264 335924 1582 94280 -214576 53088 323260 -90429
9348 -34670 141714 43891 201092 -124754 -315693 -152507 -167667 48343 -165870 -70773 202939
9336 -250841 76863 -106114 2864 -264474 -45067 313305 -4972 16303 -86683 140221 112728
9325 112728 -301166 -6200 -70306 -418132 -124100 -89585 64648 6081 131041 -104469 36347
9313 17028 -10936 -40185 -296282 -48275 37445 53979 169625 -81316 -239700 4709 123411
9302 123411 -125892 -119656 71445 241458 -371488 129127 106703 -203507 -30254 -231641 -190684
9291 -190684 252284 -72698 169873 -37277 243982 106988 -128614 48694 -117710 245405
9280 -131604 6263 -144440 -157815 -447409 138814 -263130 -37201 -202080 -25804 102674 -52237
9268 66590 -49534 -88011 153576 -62313 164993 -185552 -334116 83679 -51522 -249370 -188206
9257 -188206 -184003 -9552 -42847 -369499 -202561 159588 144851 30106 57436 56789 155898 67241
9244 -212003 -72452 -81352 -294053 -75645 124663 -255565 130307 -9887 -88987 -123794 56172
9232 -168439 -155892 -142430 219864 122901 -174278 -211625 -293241 -117568 -183888 96437 77521
9221 77521 46949 -107075 -143312 6834 -18100 -89864 170006 200909 -133621 -158374 -209443
9210 -209443 -102750 98461 -128235 34198 -8338 -22049 99861 -267868 512283 56991 -25499
9198 69794 -96373 -164120 -219841 -190945 -183935 13374 80875 -202539 238381 -185378 -324241
9187 -324241 -156565 -160644 -23307 63055 91798 66076 117787 -88465 -255627 -4088 -72948 36279
9174 26788 -102565 -188796 -181751 -80877 -154213 -83996 227743 -106 -335954 -11992 123630 -217257
9161 -155111 111601 188617 -79515 -94491 -9220 233694 -23063 95994 17507 -30702 41059
9149 202083 -13264 107339 -48457 87976 7847 47797 -229305 -21953 -51847 -94954 -208769
9138 -208769 -74678 -27592 102010 24836 -69130 -273114 -280121 -275584 86354 -572021 104299
9126 -295609 107588 79934 46803 28848 -197607 -254708 168682 -122816 144099 389571
9116 389571 -92507 -314451 -300165 -255040 39929 -420254 28811 123437 -33253 -238740 -300102
9105 -300102 -269510 -122551 -189486 -171194 -113778 273473 -117716 47172 -43674 -200802 -118354
9094 -118354 300303 -327129 182590 119169 132040 -302216 -294775 -60969 -132987 -157269 -218151
9083 -218151 69853 -44476 -149267 315700 -53848 -105980 126631 58437 52602 -97771 -57209
9072 -57209 -247342 45975 -192831 -17031 81068 345001 -381724 -184887 -11267 -25511 198717
9060 -3333 -61153 -149974 -44240 -296955 -11059 -155641 13644 -1293 12180 -31980 2189 -49442
9047 -7924 26658 -258940 -122227 4751 185927 86456 105753 271171 168886 319193 279510
9036 279510 -189041 -103712 -23705 -118601 -113969 333410 146834 -392551 152056 -14665 -493342
9025 -493342 7934 19735 -157812 -119699 84122 35627 42455 -97121 -131986 -128212 -167369 -92008
9013 -92008 -48963 -119436 -253108 -7476 -36799 98181 -244476 -396288 -126424 -347070 53759
9001 288212 -14285 -194853 115202 -35212 -223071 -274948 -25870 285096 -57359 54371 -162365
8989 -117443 74545 66630 -69571 -222979 -77777 -73281 -29925 205389 -169110 67722 36482
8978 36482 88973 42820 -530088 -12354 148944 59635 -51152 -46032 50238 -132208 -145198
8967 -145198 -88941 -164786 -255871 -238916 -287994 154803 -9939 -368543 -210345 54149 -257773
8955 60132 -255153 225790 -320476 -115365 294514 231641 -33504 41597 -241708 69730 -291908
8943 -170211 60454 -105802 -310451 112185 -192500 86082 -289437 -67116 46277 -36058 -169610
8932 -169610 12193 -376378 28931 63575 -190852 500 -119701 55993 -387031 370033 1158596
8921 1158596 1243202 239863 56828 74449 132827 -43036 -293978 27389 -49196 64970 -386449
8909 38217 43183 63159 -174826 362663 -201711 112845 -52284 -4488 29894 -60948 -181615
8898 -181615 54841 -52947 112491 -7118 -137433 -540427 -216995 -289780 213390 225557 155696
8887 155696 -393997 399723 100756 4327 96893 -189795 -53804 -255284 83952 164228 233122
8876 233122 308194 -137282 -367996 -72532 90929 -136360 151767 21346 -133656 -181644 -239052
8865 -239052 39710 -114342 82797 129810 -9551 -167794 -310409 -53012 111721 -97736 -69455
8854 -69455 -225356 -138365 -178433 72666 109528 -205189 64303 106643 48590 -232850 35360
8842 191692 -217850 -183548 -163698 -44329 -313357 -140141 112164 32052 -231475 53152 87124
8831 87124 -218366 -200134 -65784 -4472 99307 -290998 -127310 -313394 112272 -120696 110482
8819 -45867 -87602 -51818 -197190 -12745 14386 -247191 -167792 -152092 -115274 -52501 -273596
8808 -273596 22970 -238884 242936 -90612 -224175 -84080 -181826 -33347 78179 262422 -461347
8796 -254564 -87516 24831 -42928 -205267 -8353 -101957 -268648 -118852 -150976 -107603 -164549
8785 -164549 130978 7594 -205318 -503815 248493 -55260 44007 2309 37225 -179429 -307993
8774 -307993 -133923 234582 -232509 137181 -22396 -131673 -207831 37253 -122274 -533004
8764 -533004 -220751 182099 43647 -88729 -11491 28338 -327530 -16822 -263763 427818 60354
8752 283422 -231700 151092 374710 -51316 59219 94731 -304376 -372906 -54969 7837 -71337
8740 -135003 -342366 -54488 -36194 -63222 -62731 145945 -83040 -139037 82200 89358 166383 -166167
8727 273428 186370 -25122 -213282 221264 -4451 -3736 239059 -53164 -301914 326059 -163815
8715 -159121 -178361 51686 -115296 -14988 120285 -119241 -95832 -78074 96528 98901 97911 -461654
8702 -287333 132721 -33147 192334 24854 -175694 -161502 167472 -189652 -108478 71096 90844
8691 90844 91683 -189349 111699 -154895 -64553 157657 -180186 11749 -164357 -204684 -167311
8680 -167311 -58097 -324891 -126496 -38150 -236770 75010 -195504 47646 -178685 102212
8669 -180192 109729 -7190 -416994 -96274 -86849 157662 341432 89010 -153355 18476 -235467
8657 -9264 -146142 37704 -57557 113820 247711 -211736 58652 -57490 -191223 109540 -142004
8645 138870 -184882 -130026 -249579 6112 41840 -523809 -84647 -106137 -33021 144713 -187503
8633 -67102 10956 -62411 140426 -19557 -100595 309191 -53535 350167 77971 -228047 -158038
8622 -158038 -302040 247588 -23906 -249616 -36824 -73882 318230 66841 -240825 98634 -279413
8610 -116223 -135350 125280 37695 -468344 53757 -2734 230162 -67888 151895 -31916 -138369
8599 -138369 34508 -179478 303765 6339 89647 -96912 -10088 -115671 77273 -29150 17899
8587 105251 27168 21498 -159333 -270823 368395 -218050 81281 41375 -78711 15371 -3745
8575 -60111 93485 -55223 -306839 -288350 -289568 -234217 -85408 218010 -419998 70744 298285
8564 298285 -13372 -218342 -75341 -331280 -236013 13994 57927 -245518 63708 -97609 19247
8552 -32301 -193316 48020 72574 399368 -97829 -226154 -43365 17944 -291045 138215 -69396
8540 -191151 156085 -301039 14850 -52170 -426285 -87590 322748 -72236 -169970 -73558 -129309
8529 -129309 -73473 -185726 -59825 5967 -213437 1269 244440 120001 -227814 -80172 -121546
8518 -121546 -125350 211682 -71212 -164023 -367280 169329 33635 -213821 -86083 -113628 -56561
8506 394983 -35773 -868 -194782 -176244 -171305 -67535 -108906 -200224 -77447 -150164 -220273 169141
8493 -137834 -162169 11847 197937 -95783 -405166 75720 -225226 72425 22460 -77136 129362
8481 -34048 89242 46310 -171652 -102047 -347633 113755 -323945 -418526 -89749 -168901 32107
8469 -638608 -95963 -331491 -298784 209854 -62428 -106834 114699 163937 -77162 -244512 -248096
8458 -248096 184091 63842 70968 51616 -204795 -242659 -128037 -174683 300489 -118244 -77333
8447 -77333 43491 -154908 -506159 40999 30957 -50706 34283 -127973 30631 -10158 54543
8435 -37971 16435 1040 -30582 14031 -68354 -89558 -131814 -98913 76956 265172 69886 -81948
8422 -187200 -47802 279270 272318 -74565 168002 161431 -137761 -201532 -62867 -70567 -80598 52590
8409 -108228 -105603 110432 -34514 87345 -92416 55188 -215983 -181589 368829 -236541 24178
8397 -102079 75005 -16006 196206 119429 213140 396 -33618 74 -43041 37590 85266 -415792
8384 -56266 -74184 21436 -233397 207279 -138296 -219140 19393 -261325 -443866 227246 -85316
8372 -2453 -529680 229697 -219240 -134798 -71579 -376022 122725 131302 -109644 150405 -209694
8360 -110409 -117391 -19 38327 -123481 -111967 140868 -16852 53857 307020 -11960 74156 -129144
8347 -137706 -76110 174921 137013 106041 -61913 -279369 -33671 -89588 -121157 126442 -30938
8335 -131082 134969 201273 -52580 190728 282203 -4775 33105 91775 -55158 -474703 -19744
8323 2838 -69785 -204148 -100037 60816 -14652 -40577 117487 -258291 121758 43014 127913
8312 127913 33579 -225183 -214 244258 -205727 34005 60187 -29795 -8384 132400 -129506
8300 266645 -68042 -179374 -40928 -860 -319985 63404 67715 -115631 33389 69634 73673 -224331
8287 -147946 -294642 -128335 210317 -143049 295583 -326439 132526 88986 186944 -17058
8276 -74081 108866 -173845 -288787 -137984 59563 407427 6504 -38291 -13276 -137659 -153057
8265 -153057 -236726 -30593 -135018 -255368 12402 -39649 -59044 -275 260921 -267651 103290
8253 -93895 -208691 -122292 218120 155489 -23338 66374 -194562 -231094 -136255 121456 235594
8242 235594 -106781 114244 -309282 -15527 -146122 -26140 206632 -262114 -159134 12016
8231 65113 -32109 99744 -195450 65996 -88152 -117247 -97236 69279 -79663 41496 -17982 -226200
8219 -226200 87276 30559 44299 111515 186843 -89569 231232 94327 259965 -204075 123958
8207 -113628 -5898 128028 112675 35492 -310502 29949 -217496 -6174 130700 35853 -177751
8195 -206523 -1865 -10133 -189361 -290064 -74992 -241663 173822 -87225 -272155 -252806 -89523
8183 -322501 -50677 78011 -128906 -190730 -131138 -97837 -62040 -198675 96353 -231350 -40450
8171 155401 -127939 -60625 -280525 -16457 -113615 -371970 -12824 297651 136093 22457 -155593
8159 -58780 -318561 230315 96234 156564 47780 182097 72134 -15139 303535 274554 -46780
8147 -218916 -96639 56032 235671 -132238 5683 -191115 361692 -320873 179152 -104595
8136 25982 -106895 -24381 -48130 -133755 79889 -249081 238577 154415 -180379 -81290 -70727
8125 -70727 -57466 152671 113187 22548 62750 -27297 92410 106257 -9033 -148363 -55763 -193253
8113 -193253 -26411 30357 -60820 336801 -172609 -380135 -51911 -127258 244793 -64934 -181825
8102 -181825 120246 -189029 -67197 -36517 -42194 -122005 106571 -102594 -4726 -63060 43787
8090 74100 333497 103775 -59694 215236 -130257 -93832 -147889 3741 -28280 -312106 -151481
8078 -421558 -115612 -296500 -42761 97032 1239 104698 -18141 -32724 7075 -90216 -108858
8067 -108858 45559 -147230 -83115 -20889 -2525 12604 235266 -38275 -12512 -277099 -94458
8055 125784 78702 52639 -304084 199812 -267220 19079 -142626 -41527 -23194 -216188 -8304
8043 -252700 -275579 -125781 -43500 20907 -31811 -13633 -219278 61578 30551 -63250 -35764
8032 -35764 121926 -39505 -32476 299138 -122971 -269549 82210 -269275 247496 -259947 159864
8020 230801 -84893 15606 -135962 -258211 -141998 252761 -81135 16646 -138445 -85094 -35520
8008 -49824 11529 286487 -291324 -159797 229603 130483 -79954 -256240 -83582 137096 -75271
7996 -116402 -94236 88135 29084 -220425 14632 -157105 -119706 36785 145640 -101145 189468
7984 -50636 -75784 -210476 -196460 -353502 28195 116543 26408 -95044 13467 -300937 -13493
7972 24081 251489 120897 -120551 -66 -174063 -37158 -31378 -292665 -152221 -63321 128223
7960 111595 -349624 -147185 -113372 267197 -72168 44833 206485 -171333 -216006 137179
7949 -23164 189505 -194153 -42772 -84559 -401135 -32675 -67043 -177208 -232154 35370 -183146
7937 -136430 -225084 70631 -59588 -82694 28723 -11130 159020 -114099 10727 -299553 -187916
7926 -187916 156 -91828 -138335 -165250 86001 333013 108939 166441 -149283 48481 -2055 -204961
7914 -204961 -105194 215880 2164 -10689 197117 33401 258713 -97996 -61927 209968 -1033
7902 -42923 213382 27197 27536 400688 -159669 30836 279614 195699 88319 18779 -218438
7890 -180914 158200 -245339 73545 -17335 334821 56689 -225702 -97554 -295712 -225887 -332986
7879 -332986 69449 85414 -47656 -151240 -186107 -13966 -52286 -140126 171066 -85033 14061
7867 -481956 118097 -321876 -15036 -93632 134027 76224 142060 -33489 109127 242168 -467743
7855 46956 -368496 -138879 -171921 -41548 -24684 54881 -71169 72296 -142321 -17515 -495447
7844 -495447 -268332 -329695 -272874 57362 -181169 67644 -123614 108367 -177815 -143762 23783
7832 -239535 -129821 -70475 241964 50941 -56805 9184 457512 16274 183252 -193181 59038
7820 -180667 -120021 -210011 65303 -120802 154569 274033 22004 -148273 -200999 -100879 -24956
7808 140325 -151754 -39920 231181 186257 -35917 24047 67182 157475 -279251 204339 66988
7796 218010 -252309 -282298 -99483 14858 -103075 319176 -39229 116245 99876 -188136 43468
7784 -224632 273092 -229456 149582 31468 -103490 50825 -317920 35676 -165980 -272261
7774 -272261 -53095 40364 -344557 -27857 87170 215520 -123786 199702 -18339 217266 -55159
7762 53423 128629 -146774 -48715 -133222 53788 -22225 178018 -355893 -210368 -288077 -150600
7751 -150600 -124817 361987 -57193 -4160 -6208 237859 206821 -100810 45996 12462 -109804
7739 -272269 -80768 -84929 -5813 491979 245706 178403 59473 -22190 -174466 -78705 -205144
7728 -205144 -84330 -309062 -245483 -70419 -266017 157195 -227847 -187139 -55475 93521 -80401
7716 18185 256867 181467 56337 -151095 -85011 -36380 -23623 -166653 -32333 49069 -1147
7704 -47586 -141266 -44757 -229516 -113946 129715 -92885 165375 -133104 3340 -56620 -206357
7693 -206357 -109693 37147 -43311 -253365 40388 -84864 -198027 -283330 -15002 -276821 79402
7681 138174 226415 -32492 110289 -41727 -328195 -27916 -144369 -218114 -36341 -167483 -143714
7670 -143714 -90492 122547 100794 48779 -86485 124462 70078 262355 -205732 -194671 -171534
7659 -171534 -7861 -299944 -96848 -113221 -117940 -154622 171162 107903 -27096 -191003 182409
7647 102893 -120021 -64145 381740 135741 20415 -173749 -323101 -12904 42279 -145458
7636 -310688 -121129 -108643 -59110 23373 -23713 -124162 -621513 -46826 -206079 -205351 253860
7624 22563 75064 11934 208254 -126990 176025 -120820 -44114 -153098 44405 -70195 -221449
7613 -221449 -91883 29425 102177 -76878 27630 141861 184258 -21156 -270196 134204 26084
7601 7739 29778 -151170 147306 -154923 -140669 20865 182460 206365 -147413 166830 253630
7590 253630 -202364 112303 -50099 -174664 288886 20797 -120148 264163 16498 -133692
7579 -31355 22641 -29496 -93308 -165697 61749 -59677 -30300 -30407 84381 -225432 133849 45375
7566 -26708 214921 50923 24895 45632 -221698 -62139 25981 -88444 -318212 -47955 124254
7554 -164239 -75252 -177578 -91501 -431480 38643 391784 -27788 37791 -146284 -29567 -34675
7543 -34675 263987 -156899 344802 53784 -46692 175585 -24635 84629 -23818 157971 -76334
7531 135973 -284900 138700 -127126 57445 298783 -2997 -45186 -13631 58499 -185093 174980
7519 -121846 -263179 239233 188235 -112828 50351 -4485 -133367 1261 46889 26714 -35297
7507 148607 20652 145822 -175608 105756 -338850 25018 81488 -5856 82631 293919 -89846
7495 55537 -117177 -160636 166707 172095 12358 -178524 -8731 6354 -33559 -173767 -17892 -193955
7483 -193955 -315106 103125 -148968 -71465 -461823 -228065 -292507 32998 185569 166941
7473 166941 -40976 110290 89 -335342 1150 -149778 124444 -15276 283291 275750 -4042 235381
7460 83252 139037 -184646 66037 -91045 43250 178902 291271 -19347 -50590 -122670 -238374
7449 -238374 -298168 -3595 -30806 -14832 23257 -224503 -137266 -199307 -368801 253581 -83177
7437 -44281 238956 -109261 -17082 195093 -112815 -108036 113643 79892 -227121 -107094 78186
7425 -88429 154261 84589 62672 105304 -180483 3145 22232 -134759 96417 -210357 114119
7413 -139341 285489 -136326 -110408 -301048 -220793 154524 3256 82470 -240430 -3750 -213048
7402 -213048 248683 31967 -215475 -271188 117457 22562 -9282 -115090 -35057 -216434 -142246
7391 -142246 52690 22413 152274 -137263 -58391 -257559 162372 -255703 -37950 -17160 -164658
7380 -164658 -319732 -67302 -91780 15048 31954 -280116 -73318 -45892 -23690 124013 81035
7369 81035 -6303 147740 201403 68763 -63716 -88709 -35386 16763 -19118 -227549 237601
7357 -203214 62332 -3778 133539 -444212 -44282 -39042 -110948 187487 -129150 -248070 195349
7345 94667 -85592 -232091 -126140 -28447 14874 -114214 137926 159997 -60595 23887 -15510
7333 134783 39345 78926 101314 -376912 -1843 -164730 327437 128801 36633 276789 -93179
7321 -79630 -150856 -54088 -169927 -96574 100225 169555 -190042 19178 98458 85406 -13506
7309 70654 190486 134920 -122315 124345 527396 -11055 -37550 -74235 -333320 -167657 -247037
7298 -247037 -312766 106266 164812 152707 -289102 -65461 -46581 -5886 277367 -127974 100123
7286 -131070 -150768 56450 -14996 161431 -279654 -11701 -196038 173364 -254968 -100800
7275 137385 -105755 60569 -145564 233775 -25163 -66709 -49335 -124992 184543 144120 22099
7263 151634 189463 -3359 341581 -227183 183831 -321071 -102527 -43103 -351805 -223913
7253 -223913 -269753 -400625 16713 -175782 211633 54625 -70601 -619402 145219 82613 99087
7242 99087 -144521 215156 32358 21401 -51338 -94824 54436 -9697 -165514 -75804 -16756
7230 241667 -154234 180476 101691 30451 142017 -194833 109597 -109089 -67239 182661
7219 -74284 -87233 92821 -46162 -344343 -138719 -64806 -290211 -116015 49803 56274 -164606
7207 92433 93057 -215072 -8611 -10158 -26091 -11417 -96918 -125892 305524 240219 -123503 76308
7194 -147484 184712 -129934 -311221 -149442 133226 -261063 -106120 200924 -96231 -14914
7183 2366 -149712 -163374 153625 -53165 136736 118948 26941 99310 -147959 119310 110492
7172 110492 186109 -329210 -161327 -378732 -191490 -1114 -31263 131128 -230820 117594
7161 274190 -162521 -2617 156793 -244145 -109246 -72426 -262763 162473 -103625 -29762
7150 26972 120399 -148350 237696 -21684 -112807 -184917 152899 -117205 61687 -87605 -195531
7139 -195531 -121744 6907 53367 -15852 -131869 128150 -62438 307927 76959 -74396 138139
7127 34575 55612 3609 9061 -43473 -299185 68163 -242429 131852 -45554 -66140 107344
7115 -144769 219260 -42460 -95190 59899 -123712 132492 -99249 362369 -393498 -17944 86358
7103 -56492 113152 -75560 -205229 27453 -471710 145008 -165776 148717 -185123 208085
7092 -183318 23648 -187721 -93249 226104 -69301 -34862 107166 103604 -188060 250741 -34363
7080 -197884 -151957 -216937 155843 3512 -737 119300 139920 33795 -63817 42512 -51833 -349946
7068 -349946 247635 259337 126225 -149585 37832 332175 -124476 -69649 159962 84977
7058 84977 289560 -205411 -178955 143604 -414196 16357 173674 135119 -89795 11512 -37461
7046 -27753 -43383 -181372 7818 157418 245765 1825 -184979 95305 -190225 -18251 16796
7034 20134 217226 334876 -6151 124954 155370 -137654 -254271 -258004 173298 -59182 43638
7022 -174306 19403 -90813 -32374 -101588 138309 234061 20146 274538 -231808 -157711 -17099
7010 213560 144408 66833 186072 -59030 56411 15013 247434 199736 -156066 144396 23328
6998 -28862 -203444 -173441 58682 180752 -83844 -142493 36516 94793 -44508 6385 97603 134161
6986 134161 -6802 167749 -103082 56709 78644 -139983 -281875 119117 212392 -24722 -124081
6975 -124081 -262027 27797 222333 -134315 -290478 8740 37414 -293222 -103674 -64831 -104449
6964 -104449 -1428 -100936 -48445 -552017 -263213 53207 152849 -109746 -30952 -20324 96280
6952 -307626 79054 407842 138750 -16836 -10705 9105 -171016 -160284 163397 -8303 -132153
6941 -132153 3338 329604 123933 -100017 -191608 193217 -39056 -17761 -282845 -262016 -33782
6929 -366351 186646 459587 -57340 323807 152250 27117 -25751 91268 56018 -45298 -109565
6918 -109565 33883 -43172 68369 29860 -150886 -6017 -325798 -162110 -96284 -93242 -131996
6907 -131996 139180 52512 -206592 70168 -302879 -239977 132189 -57287 -132353 43008 -252771
6895 -18603 -157045 -54767 -35464 91297 -111232 -82107 -147377 381482 -234386 46343 -25500
6883 74272 -11781 -379991 147961 56492 -4988 -23443 -80049 333280 -1178 -199389 -246652
6872 -246652 -30832 -119907 225434 -6283 -232557 103807 -43948 -177630 -130225 39192 78028
6861 78028 -125535 81663 76158 7747 66420 45785 -163287 4256 -97499 -11804 -196274 110615
6848 107866 -208929 80385 -4089 108891 -197925 -65105 552709 -49947 -139255 -55247 -235147
6837 -235147 -127218 439844 96267 -324787 -184130 -80413 125653 -1392 57759 209555 -359694
6825 72109 -5892 -444080 -19494 62149 -164935 -173934 -24219 -274118 108456 -197053 -169484
6814 -169484 92314 130424 -17144 236445 125955 -90946 85974 180203 -11718 -238397 243834
6802 -12761 -492976 -127222 -137129 -113696 -8961 48687 -101014 -139714 228742 130215 52979
6790 -388401 108751 166452 -113896 214605 68452 -273005 268800 -241849 -4182 -6130 -10825
6779 -10825 -113309 -33310 -91531 -47876 53644 -136948 -103895 -134850 -39587 -191185 -156055
6768 -156055 39118 -163467 -20359 223685 57127 -91902 -24926 2153 -191163 32306 -391434
6756 100115 145931 -192589 -343774 30839 -201865 -157340 4 -270022 73886 -593644 -187313
6744 -17388 159823 7930 -46667 104342 -89348 89615 54556 -78314 402307 64504 -6624 -81328
6732 -81328 198320 137779 134738 127248 -587344 -79858 36805 -187924 267895 87908 7246 184216
6720 184216 -17590 -81970 -156044 -195314 -117495 18869 -140827 147570 -124719 -32193 125168
6708 -41987 -112287 71428 -58169 184169 -73260 -285084 54515 214181 281404 76207 -27780
6696 -204065 -216421 150785 -103180 -154313 93920 9454 156000 233748 -33065 157454 376042
6685 376042 -49878 -139053 10500 30523 268313 -135155 233083 246461 189026 -262783 65540
6673 68365 -68714 -244048 338760 128040 172422 -192148 126905 25823 12738 -101113 30138
6661 -283850 207121 71917 371545 -148821 -20944 -136469 5346 60059 -56427 140289 180282
6650 180282 37491 77002 60631 234223 89239 -94327 -6853 82981 -19422 198317 -139534
6638 121475 -106685 266025 -46013 275220 -62683 -5883 -44889 192832 -17133 34149 367251
6627 367251 61483 -71086 -235314 -163122 29577 -181697 -156760 -244886 156767 197777 188393
6616 188393 186623 -108882 -146979 189935 -457468 -156083 -160045 -56328 337917 190078 3870
6604 276927 138648 25751 47096 -233982 53029 -95492 -104388 221020 -14003 165008 -42529
6592 -211098 136762 3584 -270555 -262615 62865 -178560 -33209 -243490 -233 84436 39587 -105139
6579 -57690 -271151 -205832 280125 -98458 -270686 -64528 7818 58233 90118 -80903 -206943
6568 -206943 366190 197568 -93982 32741 -93100 -220677 141446 41462 -5117 127594 31576
6556 -118794 36132 -79476 -94097 -28591 -73171 -105788 23861 -87112 -263136 173677 -30488
6544 -105203 103657 -69837 -57690 -45644 8114 155193 -144884 36031 148877 211032 -136360
6532 -71406 64084 464635 76599 -19749 172873 -191813 68485 27225 -58204 33737 -10588
6520 -262631 -77564 -176550 134494 -145328 -105397 58234 60376 14195 -86920 49469 -240116
6508 117446 236725 169468 -66257 -480580 -278649 -215884 -188941 -154856 -23082 120203 98688
6497 98688 112361 176509 177705 -155017 95084 101368 -79794 97910 -223341 144933 -34423 152888
6484 159644 -52930 -78322 288445 -289731 -78252 -107758 -11887 241476 -189301 -42680 110618
6472 -138996 -98160 -13869 186014 110814 42738 -95265 -262822 -146011 -139751 -336620 54507
6460 101969 -24308 -21991 219755 -80890 -189462 -115859 -205564 47265 349613 -106719 -249889
6449 -249889 -11774 66992 -140494 -184437 -30466 -281426 -86231 -8645 9333 269912 -11451
6437 -142138 365781 -317771 -155220 56363 138141 -120510 -67913 -145210 -119403 128651 162088
6426 162088 43250 -115432 16651 149504 -252340 182695 -4101 -50326 -199854 18852 -54539
6414 91137 -291817 -59708 192324 243284 -45342 116729 -50587 -197241 66857 -12613 316196
6402 12368 -203996 147325 1108 -7089 287046 281830 -131361 110535 -117462 -41212 -283032
6391 -283032 -158624 208035 239237 -126885 4873 74351 -66261 133156 190979 119735 316264
6380 316264 -40132 210694 82202 49943 -53130 -198026 -13960 -96952 41478 55244 88229
6369 88229 -62113 -224271 17377 -101572 149886 -14157 -144933 -224348 -127186 -235027 268533
6357 240342 -241145 70538 21332 153773 94154 -178310 49900 -223866 20979 136372 200980
6346 200980 205125 179502 -106544 40292 -101321 -320606 136011 170733 204029 -42261 -111952
6335 -111952 96037 91213 198698 126812 -93124 122053 67363 89917 207879 150402 -71966
6323 -133252 23838 174052 -20479 59857 -124697 -63570 -184763 -280471 -222755 -38476 30539
6311 -37045 73965 -294213 -293534 -3035 -149915 181435 152046 98781 139298 -36384 186189 180440
6299 180440 121481 176262 -133999 -183381 196850 -203662 -25990 -131803 87299 20092 -34409
6287 -124699 71843 -119014 250812 -179449 1728 -203681 59516 -283269 -200379 -47771 -341441
6276 -341441 108419 6797 235717 29261 -166960 111439 120646 78813 -12638 -24518 186700
6264 491740 1365 6988 90379 -215326 93486 -57194 -238967 -32394 318127 11227 -35877
6252 -289051 77006 36457 457383 53782 101684 -350672 107712 178082 54670 71688 -117565
6240 67990 13442 -124363 -24450 -108769 -154127 68326 -77874 -148954 -223986 -13401 -226489
6229 -226489 292369 -518139 91510 326131 -41036 105283 108751 -46696 -137154 21015 -319566
6217 -50993 134996 -206770 -104711 -111171 86629 -38385 -79491 -137880 23811 206113 -291733
6205 248069 17990 -235413 -24066 92902 116232 -169895 -39054 190659 159780 -72194 -98028
6194 -98028 118562 244239 262166 4537 117941 10423 -175472 -263970 12506 -178711 123605
6182 -206827 110555 247315 -63725 -141152 -54043 -73568 4416 207722 8945 13934 -274905
6170 171815 -47566 -18516 -100699 -361456 9885 -186323 -52237 138857 -163931 134896 176585
6159 176585 36313 190837 -211618 -52406 184308 -23715 34486 -169925 -193896 76091 138168
6148 138168 -80233 94352 -286780 197837 189318 324701 -156577 6065 -327888 -374073 14201
6136 -186116 467555 216519 -122084 60007 -27537 178968 -41510 63844 35846 14068 23256
6125 23256 -285337 -82467 -125456 -28424 37402 309102 -94999 59767 -53833 -201286 -92144
6113 283748 -60852 -103309 355011 4418 35573 82775 138201 228179 -122733 193294 -328799
6101 -44394 13260 56295 -71673 223219 -230376 -195069 -40112 183038 -123846 136811 -79203
6089 -185501 -20026 -131646 36975 287878 -232867 -160747 41529 -263926 198788 -69043 -180417
6078 -180417 10449 -109863 74601 128671 27850 -65125 -52436 -176035 -107640 -67521 17809
6066 101131 -125097 -65575 -140492 -286597 -192184 -36519 -23656 175432 55291 24409 1012
6054 -88434 61787 -292738 61684 -2887 107295 -140295 -29767 -19603 138318 -164740 -358774
6043 -358774 223341 106328 -189393 -89538 -169794 -116019 90656 262523 171198 -199544 158374
6031 2096 75479 151202 -219261 37375 228752 181184 -15352 -187373 53066 -213842 131764
6019 -74125 -198521 82990 -19142 208595 -305489 -147819 -22243 -39133 201249 175232 18650
6007 -70231 183163 29284 28603 16974 30855 64176 8821 -171061 -4537 -231417 898 171234
5995 171234 228723 -77228 -100967 -208737 -77174 -162652 -132928 -199342 -280970 92661 -272933
5983 -10734 -201772 21064 4413 7542 -9958 -41574 -229171 -347374 110112 -281161 -399464
5972 -399464 177552 42172 60232 -255732 40451 -97970 -156701 -4621 162661 3508 111778
5961 111778 181727 -196526 19827 186673 -186960 -134807 -59309 -2713 166064 238104 17811
5949 291315 -167855 -6709 93716 -306054 -35267 -25534 178690 49313 -152339 244786 -65681
5937 -25474 34016 -14600 -361124 71701 -97211 23603 -81692 -177315 -539094 -71716 29036
5925 -344372 30119 -137039 168769 -76195 294000 41466 -74757 -6409 29360 -251424 121438
5913 46426 -116863 -120534 150727 -105793 127240 -287464 353173 -907 -161882 -137735 -305040
5902 -305040 -135393 72766 258545 -254972 -147157 -135044 -71103 3810 33593 -125077 327782
5890 -91923 35513 -397941 -200138 -179096 -72742 36094 154270 -26274 81314 -128833 157673
5878 -140768 396328 -124384 160201 -49453 -99339 53466 327568 -215094 135709 209510
5868 209510 -146140 150659 157340 -188791 183659 40736 -51890 -266839 -133838 -36134 113882
5856 19859 -4700 -215194 -105014 226 -62046 14161 185923 46812 136281 -61269 -88136 -18614
5843 -218725 152955 96088 52605 283627 87478 5784 313647 85049 295445 -152265 -52553
5831 -7280 235396 55272 20525 -151686 344647 -261753 -121003 -437126 70146 16961 -143246
5819 -73676 -128748 30547 27085 202363 -135081 -38060 158972 -1968 404823 -156377 -178867
5808 -178867 44566 238547 174746 13169 341739 129269 -9255 -124996 -159446 38306 116138
5797 116138 -49169 125249 183336 53561 -137733 -220671 57212 33358 65474 -142055 236944
5785 146647 80158 124972 -181859 442004 12834 47261 5239 -265661 4512 314982 -145365
5773 188830 161365 -10992 -227998 -139022 -222549 127162 46861 309738 102256 129339 -231202
5761 14676 217506 93536 -226544 -241827 -117059 -84040 145238 -30250 -110552 18781 214197
5750 214197 158487 -283245 156539 183350 141774 -261636 191894 61991 -33528 109813 263995
5739 263995 -134318 218881 -196947 38496 -108453 53079 96256 200855 72866 -159554
5728 20654 -127500 97355 46102 45321 -144729 122753 -10960 -218361 -207122 361018 -14611
5716 -412260 61452 -68877 -29451 -244021 196890 194399 144707 241586 -144905 159091 -144493
5704 206042 178712 100940 128771 -18581 53967 118779 224881 -168405 -261952 -218227 -107002
5692 126244 -34428 -215037 10950 24169 69343 -2723 -215437 -76670 144545 -62279 -22020
5680 15777 -45230 -238569 -117929 -106792 52519 -24809 -438908 348166 -138633 31091 -177793
5668 110072 -101079 -234422 -215947 7573 352067 -133729 75959 241649 45786 61319 -185108
5656 -110704 60550 -158103 -56425 -99363 161449 152090 192453 68166 124530 92530 66849
5645 66849 -228276 120169 -44979 -79721 -252060 169538 -111255 -225651 114696 163263
5635 163263 89304 201529 -57575 -304374 199898 -57950 110769 17254 89352 -176722 63088
5623 29843 -23933 71849 -200916 -24899 -182636 -165044 -173729 -241732 -54404 -283770 -113818
5611 -190268 44690 243011 -53378 -56405 -66063 -192729 -131490 36499 -157227 -374091 128147
5599 -155620 -212583 114032 -114441 176433 -93411 64449 -110844 170439 -109536 -343918
5589 -343918 147611 -391701 -49437 -18734 -6446 -3514 160055 -219604 -118653 -85423 169979
5577 43163 125165 -28255 -32226 -83714 43390 92004 205887 54127 209235 200368 -60914 20995
5564 -85205 17297 -93520 349022 -42775 110159 -26253 109425 -19248 -65043 -149546 -263060
5553 -263060 6866 129449 450825 24154 -353554 33303 152116 -167972 -149508 -10897 -139254
5542 -139254 83066 -200978 -84703 37326 -49240 -5730 -191025 36014 69120 183716 4969
5530 -223092 86771 -128071 -271709 -180784 363604 366311 5428 238810 -40714 206505 32426
5518 -142286 -49420 15050 358113 -99351 -284707 -28533 220346 383525 -342823 61025 21614
5506 -146361 -127488 -183016 167100 -256584 -311254 241725 100444 302833 179701 -70190
5495 59939 -132574 -266377 -22329 -31720 58274 54241 -217472 -19156 -235566 50830 253177
5484 253177 107441 67989 -155819 -81325 -75502 -70648 263193 22342 -145948 351746 -36495
5472 141463 -61080 354360 190543 166883 -79561 -62577 -93503 24979 -134762 -45155 10412
5460 92021 16964 -280649 220412 -103822 57181 -113549 -100270 66609 -198339 -13860 -276121
5449 -276121 -113831 50462 -128478 -5985 -139572 100570 -136240 132697 -23335 -98706 -91955
5438 -91955 -54170 325472 113154 13858 221669 -16679 221476 -129698 86471 52223 -5336
5426 -165460 -364431 11232 -371915 -58510 413301 -62109 -1031 -201595 -178888 30817 -160030
5414 46393 63771 -44167 -114245 -337230 207564 -685 361734 6441 163336 102211 -6027 -220354
5402 -220354 175984 108641 104299 42265 44087 107710 351880 118051 -178124 -366409 -210163
5391 -210163 -95991 253896 -38111 -301718 -106462 213837 -297310 -32360 71943 243474
5381 243474 -78511 287358 124549 61162 29115 -159602 -273063 92691 57939 -39554 125783
5369 36570 -139017 150736 164253 124531 -266837 35972 77186 67125 334536 181246 17889
5357 171353 -111422 13808 40444 422154 -91875 39563 247093 196661 -66018 -478565 4578
5345 93969 -36729 -57071 -202080 -114540 -293389 -341709 -45778 96366 209110 168820 -22083
5333 -318333 24297 13284 -16248 96321 -180702 -1666 57799 193259 -157111 -131484 -41732
5321 -7289 -16560 36666 -160918 154242 -15472 226524 172623 -374572 -172112 289569 68306
5309 -125692 -136575 -24735 68262 -253174 153723 -99803 6959 -96619 -291130 -26120 -156690
5298 -156690 -204849 -338248 76227 -182277 208969 -70559 -24484 17905 338490 19197 373146
5287 373146 -90036 60568 -314789 -157855 209148 -73703 135420 189081 -30045 311195 -173294
5275 85173 -174326 51861 -27283 87390 -195457 -181357 -16299 -15829 277391 -103563 -181501
5264 -181501 91160 -7837 230071 -9010 -168411 -75766 233067 -278127 190654 258621 9828
5252 102363 -120965 63545 118107 193473 -148452 88603 75787 242808 189702 -41833 8712
5240 -10674 2099 -17058 20775 -188404 -478238 -162714 -54736 -266398 40760 -33848 -111125
5229 -111125 118947 -41852 -156017 -182470 -80543 183976 -144917 29104 5474 12406 165283
5218 165283 -102826 -75330 -77799 -265963 207942 132528 -36653 -159981 -404847 257795 260906
5207 260906 -137118 73188 -345036 134110 37866 70934 440475 23685 -24341 279319 81159
5195 106337 67002 -187822 -41002 -51999 465210 -112302 26645 -115327 -10548 -46401 40486
5183 -199542 -80710 -43610 -36195 291406 -166986 -148097 -378651 -27695 -105439 201794 36423
5171 124183 68590 -65439 -67511 55668 -111641 -48114 -31654 25837 -23271 -29394 222075 85631
5158 217982 49848 185520 -167265 -140402 -132483 102285 -144624 237139 -36951 198934 259498
5147 259498 -218273 10943 167130 -128894 -77268 -95751 29622 -6426 -92101 -177142 -209940
5136 -209940 101029 -37817 90748 -39005 -71036 109172 -2552 -89965 134828 -94646 -27941
5124 -24840 115558 141112 -22009 449544 288630 -74298 -105787 217615 -96227 162318 125508
5113 125508 -139508 -135488 182860 176307 63876 -199824 28667 -117569 165424 -235494 -31202
5101 73475 -555229 81261 -41158 138578 -92710 -88103 -21572 -28088 33920 352320 -352596
5089 -103463 -132056 224553 208367 -172522 -18074 7719 -180395 169585 222168 506903 -190920
5077 -44168 147332 -142776 53553 -36997 -185441 5764 -205135 -95071 -108195 50744 -365628
5065 110594 131666 -71996 11036 -33167 71271 -37524 109762 -202187 -112723 195803 121178
5054 121178 198321 212212 -5344 97757 -234113 -26230 -106241 -191788 217992 -56511 -155288
5043 -155288 59774 -247982 -46762 -138506 -13654 -261332 141728 -137350 151464 -99671 -80442
5032 -80442 85059 -91598 -203445 121810 -157718 115763 91890 149000 121458 34485 -113383
5020 -157868 66030 -150153 201347 -279042 348332 24595 -37552 -90637 224022 322560 -130235
5008 122077 67098 44762 92885 32053 -59634 43601 -78249 2847 -305824 173351 70321
4996 285258 -234983 -145707 -208304 50212 255 18242 336511 -46681 -58642 179690 199813
4985 199813 -282459 -150193 -277643 -2544 270433 -85127 -215647 -15710 -87636 59091 49920
4974 49920 6387 68710 -374 80651 -183891 -6268 -236396 25537 10443 215614 310008 13141
4961 -7244 70957 123989 70287 -228700 -258310 -285592 -253025 -16497 -161846 -129518 189950
4949 -102513 -127930 73640 100829 130197 198122 81956 -129258 -131056 210028 74050 92862
4938 92862 133330 53316 -18199 156325 61006 73399 26 -128886 43249 15140 145434 106556
4926 106556 71742 -180491 -59203 157900 -101548 -178441 100142 -202109 -370707 162044
4915 169665 99230 153414 96497 33639 397223 -89890 171688 371465 128407 233218 32438
4903 136433 -85606 -275254 97955 85997 345751 209464 -292759 -130199 -14716 114320
4892 177528 -253168 94603 168637 37681 54304 36787 -44021 -68430 -69077 -61463 276119 -54940
4879 -190319 106700 -6072 -99679 34852 -127210 -188062 410064 464553 38921 -7698 -138734
4868 -138734 313514 7092 105262 -206532 -120672 -95766 55063 -55057 207845 -83960 149351
4856 -84754 357250 -90764 -63051 122084 53459 245662 -17209 133828 -102806 152769 -71386
4844 152849 -85625 -156224 318617 -30552 -165571 -56790 -21727 157627 -9101 -156411 172704
4832 170288 -155837 259578 98155 -62983 229600 -37760 -162096 -2204 78399 -194347 -202638
4821 -202638 -156201 -57708 -53161 338368 116916 212878 188213 81979 -40253 188637 91035
4809 9678 85330 80622 -27639 -115747 38451 -111331 171252 349310 151896 76436 -186681
4797 402807 -90820 -94169 -118341 59703 42188 216983 -109011 -32609 -30585 -176444 -62807
4785 177514 -23240 -240422 1675 -162177 -384042 -215118 -119838 113557 -41071 -46032 30613
4773 -45394 -26618 31239 -222810 -173834 112775 -334892 102028 -124876 -78773 -219000 61818
4761 -239151 -132843 -200382 150657 96975 231761 343916 182651 329168 1227 212892
4751 212892 -59949 130885 -158129 -175345 28922 -182705 -15157 118153 -277122 -409310
4741 -409310 13428 -159137 280692 235376 -26322 180083 -46163 74714 -260234 -96330 -92576
4730 -92576 -86730 381150 230986 -337267 -41259 300411 234840 37963 367529 -203033 172207
4718 -140288 -96946 -146520 -45966 -59547 -25800 261472 81237 293818 204796 -233339 -231935
4707 -231935 129749 212020 -196441 48088 45138 221871 -285087 -20578 -45136 -209250 11649
4695 -114571 -191514 -69100 374361 130013 -105428 -100007 25455 -238416 -132 -78274 41936
4683 309182 -148597 -1024 334471 -109661 40622 244968 176301 74375 -97215 277050 120001
4671 62815 -178265 -125553 132508 -341726 85713 206376 89911 -56731 -64388 102867 -102466
4659 23574 63126 -254255 118369 -115823 55977 -115493 -284977 -74615 -193085 275081
4648 97258 187609 -130968 -127690 128289 -44525 415371 93966 -112376 -172550 264877 194861
4637 194861 249319 -40024 181795 45070 157402 390325 117428 281671 494323 -116718
4626 -9161 91339 -52677 37562 -14699 -43735 71978 -262246 170074 50366 277072 -74361
4614 293936 126968 -160351 29747 -398530 -60552 95468 -25052 -54688 -120679 33451 176404
4603 176404 111753 179113 61722 -93448 -982 -109638 -108920 23185 -17239 -100306 -100909 -122075 58812
4589 131130 142665 -107132 -101408 200264 114829 115342 101398 -221618 -41243 -100071 3250 -82813
4576 105943 23554 -115591 -248705 -141852 221143 -253568 52970 -277464 -169351 -13788
4565 -27697 118983 -37707 64495 -8882 376062 -223200 -196683 126526 -511982 -36719 42831
4553 173742 68351 189422 -148424 -246066 9456 -1521 -263274 -223778 -113464 -72353 -199789
4542 -199789 -31111 303279 -370254 253934 73378 104500 48752 145127 241112 8862 -154374
4530 22288 298506 203015 -193430 -124723 -75658 -315042 -57582 -99823 128117 -16549 -27981
4519 -27981 143953 -125318 251183 -94521 5928 295146 247931 -216566 5958 91360 66100
4508 66100 -297461 200576 -4089 -109982 -262604 -11503 70752 26323 -248747 86673 145429
4497 145429 182440 -14427 124500 -147796 26353 -233852 26526 36941 -81438 -14065 -52248
$$ [...]
##END NTUPLES=NMR SPECTRUM
##END=
