##TITLE=AC1721_HONAH15007_9207496_3N34gzxHaS
##JCAMPDX= 6.0         $$ Bruker NMR JCAMP-DX V2.0
##DATA TYPE= NMR SPECTRUM
##DATA CLASS= NTUPLES
##ORIGIN= BRUKER
##OWNER= Administrator
$$ 1.72 TOPSPIN		Version 2.1
$$ 2015-06-01 18:48:29.858 -0700  Administrator@X
$$ Compression mode = diff/dup
##.OBSERVE FREQUENCY= 400.02188249412
##.OBSERVE NUCLEUS= ^1H
##.ACQUISITION MODE= SIMULTANEOUS (DQD)
##.ACQUISITION SCHEME= undefined
##.AVERAGES= 64
##.DIGITISER RES= 22
##SPECTROMETER/DATA SYSTEM= spect
##.PULSE SEQUENCE= noesygpps1d.comp
##.SOLVENT NAME= COFFEE_meoh
##.SHIFT REFERENCE= INTERNAL, COFFEE_meoh, 1, 14.9608
##AUDIT TRAIL= $$ (NUMBER, WHEN, WHO, WHERE, PROCESS, VERSION, WHAT)
$$ ##TITLE= Audit trail, TOPSPIN		Version 2.1
$$ ##JCAMPDX= 5.01
$$ ##ORIGIN= Bruker BioSpin GmbH
$$ ##OWNER= Administrator
$$ $$ E:\/data/COFFEE/nmr/AC1721_HONAH15007_9207496_3N34gzxHaS/12/pdata/1/auditp.txt
$$ ##AUDIT TRAIL=  $$ (NUMBER, WHEN, WHO, WHERE, PROCESS, VERSION, WHAT)
(   1,<2015-06-01 18:48:24.670 -0700>,<Administrator>,<X>,<go>,<TOPSPIN 2.1>,
      <created by zg
	started at 2015-06-01 18:36:55.108 -0700,
	POWCHK enabled, PULCHK disabled,
       configuration hash MD5:
       21 0F 79 D6 B3 7B B4 F6 88 20 88 DB 03 48 BD 9F
       data hash MD5: 64K
       63 BD 77 8A D0 1A 55 E6 85 19 7C 4F FC F8 14 D7>)
(   2,<2015-06-01 18:48:27.811 -0700>,<Administrator>,<X>,<proc1d>,<TOPSPIN 2.1>,
      <Start of raw data processing
       efp LB = 0.3 FT_mod = 6 PKNL = 1 PHC0 = 0 PHC1 = 0 SI = 128K 
       data hash MD5: 128K
       C0 85 AC 22 AF AD F6 0A 90 B6 2E 51 49 4E 7B AC>)
(   3,<2015-06-01 18:48:28.670 -0700>,<Administrator>,<X>,<proc1d>,<TOPSPIN 2.1>,
      <pk PHC0 = -85.52307 PHC1 = 0 
       data hash MD5: 128K
       BA 91 46 9D B0 9A 4D A3 C9 FE 02 3F 66 6C F2 87>)
(   4,<2015-06-01 18:48:29.061 -0700>,<Administrator>,<X>,<proc1d>,<TOPSPIN 2.1>,
      <abs ABSG = 1 
       data hash MD5: 128K
       CB E6 8D C3 0C 78 EA C1 6B 21 E6 A6 57 06 80 5F>)
(   5,<2015-06-01 18:48:29.155 -0700>,<Administrator>,<X>,<proc1d>,<TOPSPIN 2.1>,
      <abs ABSG = 2 
       data hash MD5: 128K
       FB DC 31 AE 8E C4 33 C2 79 71 58 3A CA 4C 38 30>)
(   6,<2015-06-01 18:48:29.248 -0700>,<Administrator>,<X>,<proc1d>,<TOPSPIN 2.1>,
      <abs ABSG = 3 
       data hash MD5: 128K
       2F 3E 4A 8B 11 FB AE 18 C5 8F 3E F1 F3 FF BB 52>)
(   7,<2015-06-01 18:48:29.326 -0700>,<Administrator>,<X>,<proc1d>,<TOPSPIN 2.1>,
      <abs ABSG = 4 
       data hash MD5: 128K
       FE DD A2 A1 6B F8 C2 54 1E 03 F7 60 29 AE A9 18>)
(   8,<2015-06-01 18:48:29.451 -0700>,<Administrator>,<X>,<proc1d>,<TOPSPIN 2.1>,
      <abs ABSG = 5 
       data hash MD5: 128K
       62 27 6A ED A7 D0 DB 35 55 C0 F9 DB 81 B9 A0 31>)
$$ ##END=
$$ 
$$ $$ hash MD5
$$ $$ 52 F0 10 BD 50 AA E9 17 E0 DC 2C F5 B1 69 AB D8
##$RELAX= 
##$RELAX= 
##$RELAX= 
##$RELAX= 
##$RELAX= 
##$RELAX= 
##$RELAX= 
##$RELAX= 
$$ Bruker specific parameters
$$ --------------------------
##$DU= <E:\>
##$EXPNO= 12
$$ [...]
150 150 150 150 150 150 150 150
##$TP07= 0
##$TPNAME0= <>
##$TPNAME1= <>
##$TPNAME2= <>
##$TPNAME3= <>
##$TPNAME4= <>
##$TPNAME5= <>
##$TPNAME6= <>
##$TPNAME7= <>
##$TPOAL= (0..7)
0.5 0.5 0.5 0.5 0.5 0.5 0.5 0.5
##$TPOFFS= (0..7)
0 0 0 0 0 0 0 0
##$TUNHIN= 0
##$TUNHOUT= 0
##$TUNXOUT= 0
##$USERA1= <user>
##$USERA2= <user>
##$USERA3= <user>
##$USERA4= <user>
##$USERA5= <user>
##$V9= 5
##$VALIST= <valist>
##$VCLIST= <CCCCCCCCCCCCCCC>
##$VD= 0
##$VDLIST= <DDDDDDDDDDDDDDD>
##$VPLIST= <PPPPPPPPPPPPPPP>
##$VTLIST= <TTTTTTTTTTTTTTT>
##$WBST= 2048
##$WBSW= 25
##$XGAIN= (0..3)
0 0 0 0
##$XL= 0
##$YL= 0
##$YMAX_a= 6214225
##$YMIN_a= -12111600
##$ZGOPTNS= <>
##$ZL1= 120
##$ZL2= 120
##$ZL3= 120
##$ZL4= 120
##$ABSF1= 14.9608
##$ABSF2= -5.597382
##$ABSG= 5
##$ABSL= 3
##$ALPHA= 0
##$AQORDER= 0
##$ASSFAC= 0
##$ASSFACI= 0
##$ASSFACX= 0
##$ASSWID= 0
##$AUNMP= <proc_prof1d_extract.lims>
##$AXLEFT= 0
##$AXNAME= <>
##$AXNUC= <1H>
##$AXRIGHT= 0
##$AXTYPE= 0
##$AXUNIT= <>
##$AZFE= 0.1
##$AZFW= 0.1
##$BCFW= 0
##$BC_mod= 0
##$BYTORDP= 0
##$COROFFS= 0
##$CY= 15
##$DATMOD= 1
##$DC= 0
##$DFILT= <>
##$DTYPP= 0
##$F1P= 0
##$F2P= 0
##$FCOR= 0.5
##$FTSIZE= 131072
##$FT_mod= 6
##$GAMMA= 0
##$GB= 0
##$INTBC= 1
##$INTSCL= 1
##$ISEN= 128
##$LB= 0.3
##$LEV0= 0
##$LPBIN= 0
##$MAXI= 10000
##$MC2= 0
##$MEAN= 0
##$ME_mod= 0
##$MI= 0
##$NCOEF= 0
##$NC_proc= -2
##$NLEV= 6
##$NOISF1= 0
##$NOISF2= 0
##$NSP= 0
##$NTH_PI= 0
##$NZP= 0
##$OFFSET= 14.9608
##$PC= 1
##$PHC0= -85.52307
##$PHC1= 0
##$PH_mod= 1
##$PKNL= yes
##$PPARMOD= 0
##$PPDIAG= 0
##$PPIPTYP= 0
##$PPMPNUM= 2147483647
##$PPRESOL= 1
##$PSCAL= 4
##$PSIGN= 0
##$PYNMP= <proc.py>
##$REVERSE= no
##$SF= 400.020009715651
##$SI= 131072
##$SIGF1= 0
##$SIGF2= 0
##$SINO= 400
##$SIOLD= 131072
##$SPECTYP= <>
##$SREGLST= <1H.CDCl3>
##$SSB= 0
##$STSI= 131072
##$STSR= 0
##$SW_p= 8223.68421052631
##$SYMM= 0
##$S_DEV= 0
##$TDeff= 65536
##$TDoff= 0
##$TI= <>
##$TILT= no
##$TM1= 0
##$TM2= 0
##$TOPLEV= 0
##$USERP1= <user>
##$USERP2= <user>
##$USERP3= <user>
##$USERP4= <user>
##$USERP5= <user>
##$WDW= 1
##$XDIM= 131072
##$YMAX_p= 347390815
##$YMIN_p= -12438
##$CURPLOT= <Network HP LaserJet P1505>
##$CURPRIN= <$Network HP LaserJet P1505>
##$DFORMAT= <normdp>
##$LAYOUT= <+/1D_H.xwp>
##$LFORMAT= <normlp>
##$PFORMAT= <normpl>
##$SURQMSG= 1
$$ End of Bruker specific parameters
$$ ---------------------------------
##NTUPLES= NMR SPECTRUM
##VAR_NAME=  FREQUENCY,     SPECTRUM/REAL,   SPECTRUM/IMAG
##SYMBOL=    X,             R,               I
##VAR_TYPE=  INDEPENDENT,   DEPENDENT,       DEPENDENT
##VAR_FORM=  AFFN,          ASDF,            ASDF
##VAR_DIM=   131072,        131072,          131072
##UNITS=     HZ,            ARBITRARY UNITS, ARBITRARY UNITS
##FACTOR=    0.0627417313425164, 1,          1
##FIRST=     8223.62146879497, 435,          -57174
##LAST=      0,             1721,            -57309
##MIN=       0,             -12438,          0
##MAX=       8223.62146879497, 347390815,    0
$$ Real data points
##PAGE= N=1
##DATA TABLE= (X++(R..R)), XYDATA
$$ [...]
61703E02191j526k060k588l043l422l547l351l215l555m073l990l150k330k193
$$ 502191 500665 498605 496017 492974 489552 486005 482654 479439 475884 471811 467821 464671 462341 460148
61689D60148k423k335j930j734j863j917j699j479j447j513j688k135k626k574
$$ 460148 457725 455390 453460 451726 449863 447946 446247 444768 443321 441808 440120 437985 435359 432785
61675D32785j907j353j479j945k134k058k040j929j346n50k44n36p82o16m79q28
$$ 432785 430878 429525 428046 426101 423967 421909 419869 417940 416594 416044 415800 415264 414482 413866 413387 412559
61659D12559j353j358o21L87J031R84L71l23o12l24L65J182J898K351K527K614
$$ 412559 411206 409848 409227 409614 410645 411629 412000 411677 411065 410741 411106 412288 414186 416537 419064 421678
61643D21678K755K825K673K462K454K556K459K108J628Q98k86j550k073j604q58
$$ 421678 424433 427258 429931 432393 434847 437403 439862 441970 443598 444496 444210 442660 440587 438983 438125
61628D38125o97j312k329l267l661l263k458k021k130k082j337l82J9n5J7K67
$$ 438125 437428 436116 433787 430520 426859 423596 421138 419117 416987 414905 413568 413186 413205 413150 413167 413434
61612D13434Q6p74j827k630l270l977m677n203n557n723n531m969m366m012l764
$$ 413434 413520 412746 410919 408289 405019 401042 396365 391162 385605 379882 374351 369382 365016 361004 357240
61597C57240l294k632k261k545l306l950m014l469k630j883j537j665j944j826
$$ 357240 353946 351314 349053 346508 343202 339252 335238 331769 329139 327256 325719 324054 322110 320284
61583C20284j154m87m49q65r44m11K0l95j460k353k619k423k006j395o68p8K51
$$ 320284 319130 318643 318194 317329 316385 315974 315994 315599 314139 311786 309167 306744 304738 303343 302675 302597 302848
61566C02848M63P02Q28N67j11p84q75k29O25R92P65M85N67Q31R45R42J006R96
$$ 302848 303311 304013 304841 305408 305297 304513 303638 303409 304034 305026 305791 306276 306843 307674 308619 309561 310567 311563
61548C11563O63J65JL28P45P77M24J28L15R53J546J664J458J467J865K231K253
$$ 311563 312226 312391 312392 312720 313465 314242 314666 314794 315109 316062 317608 319272 320730 322197 324062 326293 328546
61531C28546K210K424K561J992O57q53j981k510k325j442l39K18q5q39j482j786
$$ 328546 330756 333180 335741 337733 338390 337537 335556 333046 330721 329279 328940 329158 329073 328234 326752 324966
61515C24966j694j123j58P33J043P04J06l20m62m87n67o51o08n07n61p21o53k99
$$ 324966 323272 322149 321991 322724 323767 324471 324577 324257 323795 323308 322741 322090 321482 320975 320414 319693 319040 318741
61497C18741j67o48j317j321m75N16R28P38L74J49P0L8RQ0L19N16L43m0J01J108
$$ 318741 318574 317926 316609 315288 314813 315329 316257 316995 317369 317518 317588 317626 317635 317715 318034 318550 318893 318853 318954 320062
61477C20062K166K213J441J126J797K468K018P26k01j38N26J147J413J226O10
$$ 320062 322228 324441 325882 327008 328805 331273 333291 334017 333816 333678 334204 335351 336764 337990 338600
61462C38600j44o17o44m25k32j88l40o64r12o79K57J578K518K413J343J71j58
$$ 338600 338456 337839 337195 336770 336538 336350 336010 335346 334434 333755 334012 335590 338108 340521 341864 342035 341877
61445C41877M88J346J587J140O64Q31J649K505K779K496K243K397K628K422J918
$$ 341877 342365 343711 345298 346438 347102 347933 349582 352087 354866 357362 359605 362002 364630 367052 368970
61430C68970J796K279K720K411J449N31J53K79O73J200J754K169K263J962J398
$$ 368970 370766 373045 375765 378176 379625 380156 380309 380588 381261 382461 384215 386384 388647 390609 392007
61415C92007Q97P37Q80R80P45K36k24l75k39j46m74j248k038k389k298k039j708
$$ 392007 392904 393641 394521 395501 396246 396482 396258 395883 395644 395498 395024 393776 391738 389349 387051 385012 383304
61398C83304j244p94o68q32q63n59k48l03o91j142j495j666j564j257r56o76j84
$$ 383304 382060 381266 380598 379766 378903 378344 378096 377793 377102 375960 374465 372799 371235 369978 369022 368346 368162
61381C68162N26J100J344J482J648J498Q64L03M54J047J302J097J049J400J619
$$ 368162 368688 369788 371132 372614 374262 375760 376624 376927 377381 378428 379730 380827 381876 383276 384895
61366C84895J402J247J595J929J550Q68J084K471L783L837L108L107M371N877
$$ 384895 386297 387544 389139 391068 392618 393486 394570 397041 400824 404661 407769 410876 415247 421124
61352D21124O544O562O744P171P266O991O959P242O952N559L959L471M115M631
$$ 421124 427668 434230 440974 448145 455411 462402 469361 476603 483555 489114 493073 496544 500659 505290
61338E05290M221L421L097L187K989K252J447R55N31k85j471k519l012k933k471
$$ 505290 509511 512932 516029 519216 522205 524457 525904 526859 527390 527105 525634 523115 520103 517170 514699
61323E14699j760r45l10j07l29p59j127j140n12P33K106L089L637M087M624N209
$$ 514699 512939 511994 511684 511577 511248 510489 509362 508222 507710 508443 510549 513638 517275 521362 525986 531195
61307E31195N922O979Q272R383J0078J0455J0457R738Q177O125L870J292j573
$$ 531195 537117 544096 552368 561751 571829 582284 592741 602479 610656 616781 620651 621943 620370
61294F20370m035n319n489n372n613o137o457o294n881n791o281o816o599n618
$$ 620370 616335 611016 605527 600155 594542 588405 581948 575654 569773 563982 557701 550885 544286 538668
61280E38668m692m261l710k409q19J21L79Q02J769K701L037L024L270L922M609
$$ 538668 533976 529715 526005 523596 522777 522898 523277 524079 525848 528549 531586 534610 537880 541802 546411
61265E46411M927M861M817N257O198P202P993Q789R700J0186R695Q553P589O980
$$ 546411 551338 556199 561016 566273 572471 579673 587666 596455 606155 616341 626036 634589 642178 649158
61251F49158O144M768L264K095J301P90M20k91j884l998n391n260m115l073k732
$$ 649158 655302 660070 663334 665429 666730 667520 667940 667649 665765 661767 656376 651116 647001 643928 641196
61236F41196l002l527l894l881l795m121m605m276k769r63K41J069K137L128L217
$$ 641196 638194 634667 630773 626892 623097 618976 614371 610095 607326 606363 606604 607673 609810 612938 616155
61221F16155K539K237K976M192M972N026M608M059L609L336L088K679K177J725
$$ 616155 618694 620931 623907 628099 633071 638097 642705 646764 650373 653709 656797 659476 661653 663378
61207F63378J184M01k98l54K36R38J551K468L922N493O743P873R401J1441J3565
$$ 663378 664562 664963 664665 664311 664547 665485 667036 669504 673426 678919 685662 693535 702936 714377 727942
61192G27942J5187J5877J5498J4374J3051J1757J0218Q222O127M578L821L504
$$ 727942 743129 759006 774504 788878 801929 813686 823904 832126 838253 842831 846652 850156
61180H50156L045K099P79m63j335k119l320m816n804n791n322n350o196p541r095
$$ 850156 853201 855300 856079 855616 854281 852162 848842 844026 838222 832431 827109 821759 815563 808022 798927
61165G98927j0740j2112j2748j2664j2368j2199j2038j1780j1577j1403j0805
$$ 798927 788187 776075 763327 750663 738295 726096 714058 702278 690701 679298 668493
61154F68493r496p858o507n489m313k724j103l0L27K45Mm61j410k869m466n741
$$ 668493 658997 651139 644632 639143 634830 632106 631003 630973 631300 631545 631549 631088 629678 626809 622343 616602
61138F16602o538o937o930o420n531m594l694k515q24J108K796M060N066N992
$$ 616602 610064 603127 596197 589777 584246 579652 575958 573443 572619 573727 576523 580583 585649 591641
61124E91641O975Q217R839J1641J3256J4590J5908J7505J9387K1206K2428K2724
$$ 591641 598616 606833 616672 628313 641569 656159 672067 689572 708959 730165 752593 775317
61112G75317K2411K2300K2860K3624K3801K3260K2447K1469J9962J7944J6081
$$ 775317 797728 820028 842888 866512 890313 913573 936020 957489 977451 995395 1011476
61101A011476J4642J2796R520M985L60l588p121j0646j3811j5904j6905j7688
$$ 1011476 1026118 1038914 1048434 1053419 1053779 1050191 1043070 1032424 1018613 1002709 985804 968116
61089I68116j9062k0835k2083k2289k1975k1944k2168k1835k0515j8782j7471
$$ 968116 949054 928219 906136 883847 861872 839928 817760 795925 775410 756628 739157
61078G39157j6731j6135j5376j4449j3335j2009j0708r646q531o838m701l049
$$ 739157 722426 706291 690915 676466 663131 651122 640414 630768 622237 615399 610698 607649
61066F07649k521k613k215q75P83J848K074K055K633M131O034P409P766P566P778
$$ 607649 605128 602515 600300 599425 600208 602056 604130 606185 608818 612949 618983 626392 634158 641724 649502
61051F49502Q879J0386J1451J1857J2275J3450J5300J6978J7906J8520J9806K2085
$$ 649502 658381 668767 680218 692075 704350 717800 733100 750078 767984 786504 806310 828395
61039H28395K4484K5813K5961K6063K7155K8885L0055L0291L0555L1745L3476
$$ 828395 852879 878692 904653 930716 957871 986756 1016811 1047102 1077657 1109402 1142878
61028A142878L4859L5877L7197L8823L9995M0487M0954M1751M2466M3155M5097
$$ 1142878 1177737 1213614 1250811 1289634 1329629 1370116 1411070 1452821 1495287 1538442 1583539
61017A583539M9422N5694O2680O9959P7725Q5622R3148J01177J11875J26987J47167
$$ 1583539 1632961 1688655 1751335 1821294 1899019 1984641 2077789 2178966 2290841 2417828 2564995
61006B564995J73209K06828K49976L04527L73255M60597N72311P15161Q95831
$$ 2564995 2738204 2945032 3195008 3499535 3872790 4333387 4905698 5620859 6516690
60997F516690J115780J362180J602141J787162J866519J803129J588606J255764
$$ 6516690 7632470 8994650 10596791 12383953 14250472 16053601 17642207 18897971
60989A8897971Q79931N57252L62995L15089L69804M49837M79111M02225J91661
$$ 18897971 19777902 20335154 20698149 21013238 21383042 21832879 22311990 22714215 22905876
60980B2905876j43904n52863r53235j268413j462172j545107j551854j513998
$$ 22905876 22761972 22209109 21255874 19987461 18525289 16980182 15428328 13914330
60972A3914330j449178j364807j264251j150130j026498r00136p78836o68025
$$ 13914330 12465152 11100345 9836094 8685964 7659466 6759330 5980494 5312469
60964E312469n69683m84069m11137l50156k99282k56363k19832j88710j62303
$$ 5312469 4742786 4258717 3847580 3497424 3198142 2941779 2721947 2533237 2370934
60955B370934j40103j21534j05672r1596p9013o8127n8922n1082m4599l9822l6735
$$ 2370934 2230831 2109297 2003625 1912029 1833016 1764889 1705967 1654885 1610286 1570464 1533729
60944A533729l4623l2627l0323k7761k5301k3433k2333k1560k0559j9367j8424
$$ 1533729 1499106 1466479 1436156 1408395 1383094 1359661 1337328 1315768 1295209 1275842 1257418
60933A257418j7787j7114j6419j6082j6110j6029j5694j5501j5560j5383j4755
$$ 1257418 1239631 1222517 1206098 1190016 1173906 1157877 1142183 1126682 1111122 1095739 1080984
60922A080984j4222j4253j4458j4301j4016j4174j4687j4941j4705j4292j3937
$$ 1080984 1066762 1052509 1038051 1023750 1009734 995560 980873 965932 951227 936935 922998
60911I22998j3571j3153j2778j2411j1953j1468j1079j0652r981r215q709q530
$$ 922998 909427 896274 883496 871085 859132 847664 836585 825933 815952 806737 798028 789498
60899G89498q426q279q190q184q059p646o955o206n820o237p330q223q093p076
$$ 789498 781072 772793 764603 756419 748360 740714 733759 727553 721733 715496 708166 699943 691850 684774
60885F84774o034n519n431n559n897o381o780p038p288p515p571p573p730p701
$$ 684774 678740 673221 667790 662231 656334 649953 643173 636135 628847 621332 613761 606188 598458 590757
60871E90757o795n081l696l563m315m955n107m977m502l363j814o94l99m30j95
$$ 590757 583962 578881 575185 571622 567307 562352 557245 552268 547766 544403 542589 541895 541496 541066 540871
60856E40871J85J79l94j253k046k533k499j909j163q57j139j511j479j240j496
$$ 540871 541056 541235 540841 539588 537542 535009 532510 530601 529438 528581 527442 525931 524452 523212 521716
60841E21716k568l982n040n553n814n999n968n667n274m864m218l233k268j766
$$ 521716 519148 515166 510126 504573 498759 492760 486792 481125 475851 470987 466769 463536 461268 459502
60827D59502j639j412q87l73j92k57l05l14m84p71p78k39M42M28n94j852k205
$$ 459502 457863 456451 455564 455191 454999 454742 454437 454123 453639 452868 452090 451851 452293 452721 452127 450275 448070
60810D48070j381j98M86N91M90K89j54p41j159j308j356j422j556j853k254k339
$$ 448070 446689 446491 446977 447568 448058 448347 448193 447452 446293 444985 443629 442207 440651 438798 436544 434205
60794D34205j808j115j098j915k829l160k961k633k348k168k213k394k317j869
$$ 434205 432397 431282 430184 428269 425440 422280 419319 416686 414338 412170 409957 407563 405246 403377
60780D03377j510j630j906j846j646j893k567k981k754k255j867j393n36L95P68
$$ 403377 401867 400237 398331 396485 394839 392946 390379 387398 384644 382389 380522 379129 378593 378988 379756
60765C79756N05K68O91J620K335K455K384K751L512L929L463K415J458Q84N23
$$ 379756 380261 380529 381220 382840 385175 387630 390014 392765 396277 400206 403669 406084 407542 408426 408949
60750D08949K40J15K29N83J150J762K003J659J078P30M13n12k043l304l711l760
$$ 408949 409189 409304 409533 410116 411266 413028 415031 416690 417768 418498 418911 418399 416356 413052 409341 405581
60734D05581m225m963n133m394l326k682k692l140l619l641k898j692q62r71j722
$$ 405581 401356 396393 391260 386866 383540 380858 378166 375026 371407 367766 364868 363176 362314 361343 359621
60719C59621k341k401k047j610j270j084j044j019p70k05M41P24L60n51j562k235
$$ 359621 357280 354879 352832 351222 349952 348868 347824 346805 346035 345830 346271 346995 347355 346804 345242 343007
60703C43007k403k124j428k91J088K234K808K892K639J899O06n98p56K10J327
$$ 343007 340604 338480 337052 336761 337849 340083 342891 345783 348422 350321 350927 350329 349573 349783 351110
60688C51110J856K177K887L606L504K729K328K752L296L314L147L409L986M296
$$ 351110 352966 355143 358030 361636 365140 367869 370197 372949 376245 379559 382706 386115 390101 394397
60674C94397M103L632L208L146L603M129L781K208K37j146j978k820l516l369
$$ 394397 398500 402132 405340 408486 412089 416218 419999 422207 422444 421298 419320 416500 412984 409615
60660D09615k467j760j746j853j503j019j018j447j724j521r60k84K89N59N25
$$ 409615 407148 405388 403642 401789 400286 399267 398249 396802 395078 393557 392597 392313 392602 393161 393686
60645C93686M43M80L93j85j178k051k347k190k091k323k591k440j923j527j420
$$ 393686 394129 394609 395002 394817 393639 391588 389241 387051 384960 382637 380046 377606 375683 374156 372736
60630C72736j248q68p79j303j834j572p71m29p79r72l73N97J163J092N97r8p18
$$ 372736 371488 370620 369841 368538 366704 365132 364361 363932 363153 362181 361808 362405 363568 364660 365257 365159 364441
60613C64441r77r45r40q86l35O53J362J449J455J817K050J520N15j56k36JM88
$$ 364441 363464 362519 361579 360693 360358 361011 362373 363822 365277 367094 369144 370664 371179 371023 370787 370788 371276
60596C71276J364K363K889K720K193J745J570J644J725J509J012O56O87Q82J011
$$ 371276 372640 375003 377892 380612 382805 384550 386120 387764 389489 390998 392010 392666 393353 394235 395246
60581C95246J157J219P24l81j239j066r5J061K434M179N546N566M616M176N003
$$ 395246 396403 397622 398346 397965 396726 395660 395565 396626 399060 403239 408785 414351 418967 423143 428146
60566D28146O505P987R391J0621J1186J0937J0361R640Q217N803L076R01o89k121
$$ 428146 434651 442638 452029 462650 473836 484773 495134 504774 512991 518794 521870 522771 522082 519961
60552E19961l441m316m580m286l594k824k293j753m96J622L741N057N863P056
$$ 519961 516520 512204 507624 503338 499744 496920 494627 492874 492378 494000 497741 502798 508661 515717
60538E15717Q943J1052J2861J4163J4888J5019J4685J3949J2644J0641Q132N369
$$ 515717 524660 535712 548573 562736 577624 592643 607328 621277 633921 644562 652694 658063
60526F58063K437m53k759m120m829n359n646n377m794m600n021n486n388m755
$$ 658063 660500 660047 657288 653168 648339 642980 637334 631957 627163 622563 617542 612056 606668 601913
60512F01913m015l446l105k931k698j967l85J932M480O796Q798J0655J2507J4514
$$ 601913 597898 594452 591347 588416 585718 583751 583366 585298 589778 596574 605372 616027 628534 643048
60498F43048J7076K0675K5192K9735L3503L6671L9919M3150M5280M5425M3705
$$ 643048 660124 680799 705991 735726 769229 805900 845819 888969 934249 979674 1023379
60487A023379M0627L6254L0436K3305J5082N770m385j4399k3110l0111l5606l9639
$$ 1023379 1064006 1100260 1130696 1154001 1169083 1174853 1170468 1156069 1132959 1102848 1067242 1027603
60475A027603m2020m2949m2978m2293m0632l8057l5220l2619l0110k7424k4723
$$ 1027603 985583 942634 899656 857363 816731 778674 743454 710835 680725 653301 628578
60464F28578k2292k0059j7888j6058j4946j4286j3245j1380r191p507o596o056
$$ 628578 606286 586227 568339 552281 537335 523049 509804 498424 489233 481726 475130 469074
60452D69074n464m814m251l764l309l061l172l355l073k237j406j131j382j757
$$ 469074 463610 458796 454545 450781 447472 444411 441239 437884 434811 432574 431168 430037 428655 426898
60438D26898j974j911j510r51o48p21o52KP32N86m48j262j088n19o13j414k020
$$ 426898 424924 423013 421503 420552 419904 419183 418531 418533 419265 419851 419403 418141 417053 416534 415921 414507 412487
60421D12487j868j313r01o64l45R9O06J283K223L113L409K914J997J149O07L90
$$ 412487 410619 409306 408405 407741 407396 407495 408101 409384 411607 414720 418129 421043 423040 424189 424796 425186
60405D25186M50O54P65O92N73N69O47O97O95O24M29K16K68O47J076J423K039L101
$$ 425186 425636 426290 427055 427747 428320 428889 429536 430233 430928 431552 431981 432197 432465 433112 434188 435611 437650 440751
60387D40751L977L874K989K248J953J556J006J188K457L597L228J703O18P01J253
$$ 440751 444728 448602 451591 453839 455792 457348 458354 459542 461999 465596 468824 470527 471145 471846 473099
60372D73099J572J838K246K338J747J028R78J523J852J548R47N09L02K43M12Q34
$$ 473099 474671 476509 478755 481093 482840 483868 484846 486369 488221 489769 490716 491225 491527 491770 492182 493016
60356D93016J244J357J322J593K333L219M006M916O146P209P306O445N532N114
$$ 493016 494260 495617 496939 498532 500865 504084 508090 513006 519152 526361 533667 540112 545644 550758
60342E50758M578L109J054m72j089j559k600l982n041n527n609n411m939m307
$$ 550758 555336 558445 559499 559027 557938 556379 553779 549797 544756 539229 533620 528209 523270 518963
60328E18963l734l427l537m009m397m138l203k216j709j559j379j127r95r09n69
$$ 518963 515229 511802 508265 504256 499859 495721 492518 490302 488593 487034 485655 484528 483533 482624 482055
60313D82055J11R60J884K920L990M968O028P598R853J2452J4910J7021J8739J9767
$$ 482055 482166 483126 485010 487930 491920 496888 502916 510514 520367 532819 547729 564750 583489 603256
60299F03256J9527J7632J4342J0465O668K957j054n363r252j1849j2893j2834
$$ 603256 622783 640415 654757 665222 671890 674847 673793 668430 659178 647329 634436 621602
60287F21602j2344j1873j1500j0947r828q140o478n513n310n384n385n364n382
$$ 621602 609258 597385 585885 574938 565110 556970 550492 544979 539669 534285 528900 523536 518154
60274E18154n226m706m013l507l346l422l524l487l322l268l472l594l098k088
$$ 518154 512928 508222 504209 500702 497356 493934 490410 486923 483601 480333 476861 473267 470169 468081
60260D68081j454j787k570k889k614k258j892j061J36P80L81k78j13Q64J702J779
$$ 468081 466627 464840 462270 459381 456767 454509 452617 451556 451692 452472 452853 452575 452462 453326 455028 456807
60244D56807J265N64l1j84L12J005J026J70p04o74J45R12J210J409J976K807L414
$$ 456807 458072 458636 458605 458421 458733 459738 460764 460934 460230 459556 459701 460613 461823 463232 465208 468015 471429
60227D71429L521L279K971K710K493K396K547K899L179L175K957K823L071L889
$$ 471429 474950 478229 481200 483910 486403 488799 491346 494245 497424 500599 503556 506379 509450 513339
60213E13339N179O417O930O597O109O218O873P433P531P296O851O216N696N727
$$ 513339 518518 524935 531865 538462 544571 550789 557662 565095 572626 579922 586773 592989 598685 604412
60199F04412O106O041N222M359M083L946L147J893J185J274J164l0j906l355l947
$$ 604412 610518 616559 621781 626140 630223 634169 637316 639209 640394 641668 642832 642802 640896 637541 633594
60184F33594m175m498m736m581m274m372m931n365n183m591m111l873l616l261
$$ 633594 629419 624921 620185 615604 611330 606958 602027 596662 591479 586888 582777 578904 575288 572027
60170E72027l013k924k763k455k207k047j650q83k02r1m11o49o55o82q68j020
$$ 572027 569014 566090 563327 560872 558665 556618 554968 554085 553883 553792 553381 552732 552077 551395 550527 549507
60154E49507r11m75K71J194J932K120J802J421J374J639J927K047K138K532L341
$$ 549507 548596 548121 548392 549586 551518 553638 555440 556861 558235 559874 561801 563848 565986 568518 571859
60139E71859M216M718M918N277N882O201N882N394N473O109O599O436N747M830
$$ 571859 576075 580793 585711 590988 596870 603071 608953 614347 619820 625929 632528 638964 644711 649541
60125F49541L704K295Q42k2K67J529K658K542J325L22M82J422K241K699K940K689
$$ 649541 653245 655540 656382 656360 656627 658156 660814 663356 664681 665003 665485 666907 669148 671847 674787 677476
60109F77476J623K56n40q37j548k974m375n140n503n803n873n587n283n170m857
$$ 677476 679099 679355 678815 677978 676430 673456 669081 663941 658438 652635 646762 641175 635892 630722 625865
60094F25865m005k932k149j712j392j025l14J081K778L590K912J713J399K031
$$ 625865 621860 618928 616779 615067 613675 612650 612336 613417 616195 619785 622697 624410 625809 627840
60080F27840K423J833O82l64j176j870k386k682k976l505m314n339o389p061p033
$$ 627840 630263 632096 632778 632414 631238 629368 626982 624300 621324 617819 613505 608166 601777 594716 587683
60065E87683o502o054n978o064o062n987n872n596n131m652m259l831l281k694
$$ 587683 581181 575127 569149 563085 557023 551036 545164 539568 534437 529785 525526 521695 518414 515720
60051E15720k107j326j72J255K598L435L487K980K744L540N079O183O152N561
$$ 515720 513613 512287 512115 513370 515968 519403 522890 525870 528614 532154 537233 543416 549568 555129
60037E55129N340N473N134L975K550J487Q00J99m47j251k434l916n128n599n567
$$ 555129 560469 565942 571076 575051 577601 579088 579888 580087 579640 578389 575955 572039 566911 561312 555745
60022E55745n542n533n196m702m770n631o478o411n562m880m916n243n094m275
$$ 555745 550203 544670 539474 534772 530002 524371 517893 511482 505920 501040 496124 490881 485787 481512
60008D81512l275k670k562k602k461k205k111k164j984j313l45N22J053J169Q68
$$ 481512 478237 475567 473005 470403 467942 465737 463626 461462 459478 458165 457820 458342 459395 460564 461432
59993D61432M13L88J143K313L192L532L638L779L884L828L590L119K327J381N88
$$ 461432 461845 462233 463376 465689 468881 472413 476051 479830 483714 487542 491132 494251 496578 497959 498547
59978D98547On61j112j405j525j933k731l268k907j968j391j583k010j937j241
$$ 498547 498553 497992 496880 495475 493950 492017 489286 486018 483111 481143 479752 478169 476159 474222 472981
59963D72981l93J26K22J87M07J058J994K798K994K332J075k8l21J21O01O07L10
$$ 472981 472588 472714 472936 473123 473530 474588 476582 479380 482374 484706 485781 485753 485432 485553 486154 486761 487071
59946D87071K07M42P37P82N48K07q9l31o18r53j115q53k17M04O43M07r9m42n5
$$ 487071 487278 487720 488457 489239 489787 489994 489905 489574 488956 488003 486888 486035 485818 486222 486865 487272 487173 486731 486676
59927D86676J354L310M807N191M754M261M144M285M453M673N138N878O513O435
$$ 486676 488030 491340 496147 501338 506092 510353 514497 518782 523235 527908 533046 538924 545437 551872
59913E51872N397L963L029K823K706K110J291Q06O01J22p83j605j893j833j906
$$ 551872 557269 561232 564261 567084 569790 571900 573191 573997 574598 574720 573937 572332 570439 568606 566700
59898E66700k259k603k616k275j734j061j53J008K146K866L104L191L424L745
$$ 566700 564441 561838 559222 556947 555213 554152 553999 555007 557153 560019 563123 566314 569738 573483
59884E73483M001M286M776N294N427N074M689M720M985M827L922K755K062J932
$$ 573483 577484 581770 586546 591840 597267 602341 607030 611750 616735 621562 625484 628239 630301 632233
59870F32233J722R13l05j504k670l922m879m927m204l645l793m134l937l313k896
$$ 632233 633955 634868 634563 633059 630389 626467 621588 616661 612457 608812 605019 600885 596948 593635 590739
59855E90739k821k651k199j810j684j386k69J790M280O421P606P633O805N691
$$ 590739 587918 585267 583068 581258 579574 578188 577919 579709 583989 590410 598016 605649 612454 618145
59841F18145M663L620K346J101O04J207K256K681K245J753J800J796P87j132k909
$$ 618145 622808 626428 628774 629875 630479 631686 633942 636623 638868 640621 642421 644217 645004 643872 640963
59826F40963l908m474m969n129m736m316m519n191n562n185m239l159k359k179
$$ 640963 637055 632581 627612 622483 617747 613431 608912 603721 598159 592974 588735 585576 583217 581038
59812E81038k616l200l449l396l381l466l396l065k714k635k880l209l211k716
$$ 581038 578422 575222 571773 568377 564996 561530 558134 555069 552355 549720 546840 543631 540420 537704
59798E37704k188k359l177l601k852j550r54j299j632j342r52j122j572j555j066
$$ 537704 535516 533157 529980 526379 523527 521977 521023 519724 518092 516750 515798 514676 513104 511549 510483
59783E10483q57j270j601r02P69K286K598J773P62M01P71J406J781J635J150Q89
$$ 510483 509626 508356 506755 505853 506622 508908 511506 513279 514041 514442 515213 516619 518400 520035 521185 522074
59767E22074J179J621J560J067R29J497K172K321K169K267K639K977L297L763
$$ 522074 523253 524874 526434 527501 528430 529927 532099 534420 536589 538856 541495 544472 547769 551532
59753E51532M172M299M475N077N686N557M872M626N166N718N579N020M564M067
$$ 551532 555704 560003 564478 569555 575241 580798 585670 590296 595462 601180 606759 611779 616343 620410
59739F20410L125J930J100Q31P72N91L04O1m5l9q1m07j002j459j409j005p47q20
$$ 620410 623535 625465 626565 627396 628168 628759 629063 629124 629079 629040 628959 628552 627550 626091 624682 623677 622930 622110
59721F22110r33q57q08j061j399j314p73l74n70r68p73K44J505K305K365J794
$$ 622110 621177 620320 619512 618451 617052 615738 614965 614591 614021 613053 612280 612524 614029 616334 618699 620493
59705F20493R69M98Q81J925K801K884K327J725J538J867K435K730K527K296K596
$$ 620493 621462 621960 622841 624766 627567 630451 632778 634503 636041 637908 640343 643073 645600 647896 650492
59690F50492L000K423P31q51j375j361j643j919j487p74r31k098l176l416l240
$$ 650492 653492 655915 656646 655795 654420 653059 651416 649497 648010 647236 646305 644207 641031 637615 634375
59675F34375l324l683l893l731l353l185l619m456m922m682m375m605m838m231
$$ 634375 631051 627368 623475 619744 616391 613206 609587 605131 600209 595527 591152 586547 581709 577478
59661E77478l117k494k259j239Q49K766L451L223K900K667K450K519L018L446
$$ 577478 574361 571867 569608 568369 569218 571984 575435 578658 581558 584225 586675 589194 592212 595658
59647E95658L224K338J120j98j399k312l149m246n259n408m687m017l896l760
$$ 595658 598882 601220 602340 602142 600743 598431 595282 591036 585777 580369 575682 571665 567769 564009
59633E64009l131k447k153j904j436j391k327l564l988l541l019k792k645k590
$$ 564009 560878 558431 556278 554374 552938 551547 549220 545656 541668 538127 535108 532316 529671 527081
59619E27081k825l117l042k772k787k972k751k051j386r62m92Q3L96L40K98N26
$$ 527081 524256 521139 518097 515325 512538 509566 506815 504764 503378 502416 501924 502007 502403 502743 503041 503567
59603E03567Q54J162J577J956J767Q11l23r09q75o17k89K62Q96J077N67o2m6N25
$$ 503567 504421 505583 507160 509116 510883 511694 511371 510462 509587 508970 508681 508943 509839 510916 511483 511421 511375 511900
59585E11900P06q3j298k067k313k544k833k767k346k153k419k636k401k028j973
$$ 511900 512606 512523 511225 509158 506845 504301 501468 498701 496355 494202 491783 489147 486746 484718 482745
59570D82745k158k267k231k085j799j518j523j653j342n55K3P6K71J178K238K531
$$ 482745 480587 478320 476089 474004 472205 470687 469164 467511 466169 465614 465637 465713 465984 467162 469400 471931
59554D71931K017J338Q34N73Q21J672K473K519K136K274L117L962M417N010O485
$$ 471931 473948 475286 476120 476693 477514 479186 481659 484178 486314 488588 491705 495667 500084 505094 511579
59539E11579Q970J1916J4442J5874J6233J5985J5008J2377P812K788o54j930j953
$$ 511579 520549 532465 546907 562781 579014 594999 610007 622384 630196 632984 632330 630400 628447
59526F28447j560r41l86l42o09m52K09N87K63l03p50j517l031m866o201o716o664
$$ 628447 626887 625946 625560 625218 624609 624157 624366 624953 625216 624913 624163 622646 619615 614749 608548 601832 595168
59509E95168o448o406o669o978o970o652o299n929n390m897m833n036m842m045
$$ 595168 588720 582314 575645 568667 561697 555045 548746 542817 537427 532530 527697 522661 517819 513774
59495E13774l116k423j899j580j688j957j645n97M58J052J611K500L230L272L056
$$ 513774 510658 508235 506336 504756 503068 501111 499466 498869 499327 500379 501990 504490 507720 510992 514048
59480E14048L357M079M458M174L699L593M017M777N365N203M244L203K688K400
$$ 514048 517405 521484 525942 530116 533815 537408 541425 546202 551567 556770 561014 564217 566905 569305
59466E69305J687P14L40Q97J706K029J973K133K687L299L774M460N817P697R279
$$ 569305 570992 571706 572046 572943 574649 576678 578651 580784 583471 586770 590544 595004 600821 608518 617797
59451F17797R810R380Q757Q477Q287P548N972L844J645l39k118l808n420o802
$$ 617797 627607 636987 645744 654221 662508 670056 676028 679872 681517 681178 679060 675252 669832 663030
59437F63030p709p953p540o760o149o030o092n666m602l513k930k606j995j042
$$ 663030 655321 647368 639828 633068 626919 620889 614797 609131 604529 601016 598086 595480 593485 592443
59423E92443P2J567L740O194Q152R571J1188J3418J5913J8287K0512K2356K3115
$$ 592443 592515 594082 597822 604016 612168 621739 632927 646345 662258 680545 701057 723413 746528
59410G46528K2208J9499J4906Q544J560m060p120q097p923o724m405j715K70J272
$$ 746528 768736 788235 803141 811685 813245 809185 802065 793968 786045 779321 774916 773201 773471 774743
59396G74743J469L66k806p633j2352j5396j6461j6055j4766j3198j1927j1103
$$ 774743 776212 776578 773772 766139 753787 738391 721930 705875 691109 677911 665984 654881
59384F54881j0471r883r382q707p318n235l298k247j859j399n40N31J666K853
$$ 654881 644410 634527 625145 616438 609120 603885 600587 598340 596481 595082 594542 595073 596739 599592
59370E99592L923M572M762M752M765M836M990N288N652N878N900N860N868N901
$$ 599592 603515 608087 612849 617601 622366 627202 632192 637480 643132 649010 654910 660770 666638 672539
59356F72539O087O752P975R269J0075J0459J0997J1930J2843J3271J3323J3445
$$ 672539 678626 685378 693353 702622 712697 723156 734153 746083 758926 772197 785520 798965
59344G98965J3822J4254J4407J3995J2813J0938Q800O801M898K768K90k366n025
$$ 798965 812787 827041 841448 855443 868256 879194 887994 894795 899693 902461 902751 900385 895360
59331H95360p563r736j1229j2022j2436j2837j3365j3889j4074j3565j2364j0900
$$ 895360 887797 878061 866832 854810 842374 829537 816172 802283 788209 774644 762280 751380
59319G51380r517q147o767n906o079o779o777n605m157l476l428l071j999p92
$$ 751380 741863 733716 726949 721043 714964 708185 701408 695803 691646 688170 684742 681671 679672 678880
59305F78880j73j12O3Q96K331L961N647P605R751J1289J1319R818P539M917J616
$$ 678880 678707 678595 678658 679554 681885 685846 691493 699098 708849 720138 731457 741275 748814 753731 755347
59290G55347k641p197j0830j2774j3136j2449j1175r631q084o795n890n190m211
$$ 755347 752706 745509 734679 721905 708769 696320 685145 675514 667430 660635 654745 649555 645344
59277F45344k541k13K358M760O763Q289R425J0423J1368J1916J1649J0634R355
$$ 645344 642803 642590 644948 649708 656471 664760 674185 684608 695976 707892 719541 730175 739530
59264G39530Q059O645N098L584J997r4k745n347p232q320q863q941q541p917p452
$$ 739530 747589 754234 759332 762916 764913 764819 762074 756727 749495 741175 732312 723371 714830 706913 699461
59249F99461p207o852o043m752l315k194j615j315q00J23J148J873K275K688L337
$$ 699461 692254 685402 679359 674607 671292 669098 667483 666168 665368 665491 666639 668512 670787 673475 676812
59234F76812L955L963L186K335K346L084L220J792n13k190k695k732l024l569
$$ 676812 680767 684730 687916 690251 692597 695681 698901 700693 700180 697990 695295 692563 689539 685970
59220F85970m074m371m303l835l339l211l235k962k642k945l748m049l287j906
$$ 685970 681896 677525 673222 669387 666048 662837 659602 656640 653998 651053 647305 643256 639969 638063
59206F38063n25O17J182P47l21r97r89j102j691j907j171l64n22j186j192m89
$$ 638063 637538 638155 639337 640084 639763 638766 637777 636675 634984 633077 631906 631542 631020 629834 628642 628153
59190F28153m2k60o25o53k81M88J561K460K858L176L905M600M383L335K458K349
$$ 628153 628111 627851 627226 626573 626292 626780 628341 630801 633659 636835 640740 645340 649723 653058 655516 657865
59174F57865K639K798K816K968L561M792O397P540P636P167P053P432P791P972
$$ 657865 660504 663302 666118 669086 672647 677439 683836 691376 699012 706179 713232 720664 728455 736427
59160G36427Q173Q016O707M270J721k53j987l908n741p079q012q705q882q333
$$ 736427 744600 752616 759323 763593 765314 765061 763074 759166 753425 746346 738334 729629 720747 712414
59146G12414p574p390p865q305q134p554p239p503p905p769p052o377o099n736
$$ 712414 704840 697450 689585 681280 673146 665592 658353 650850 642945 635176 628124 621747 615648 609912
59132F09912m718l339k343j860j377p40l56l44j40P37K088L470M782O048P034
$$ 609912 605194 601855 599512 597652 596275 595535 595179 594835 594695 595432 597520 600990 605772 611820 618854
59117F18854P513P757Q325R385J0498J1135J1266J1291J1422J1307J0546R374
$$ 618854 626367 634124 642449 651834 662332 673467 684733 696024 707446 718753 729299 738673
59105G38673Q401P672O600N004L608L016K796K198J300O60K27n22j523k138k197
$$ 738673 747074 754746 761346 766350 769958 772974 775770 777968 779268 779928 780155 779633 778110 775972 773775
59090G73775k197k310k088j399r10j199k034k919l913n373p154q535q951q577
$$ 773775 771578 769268 767180 765781 764871 763672 761638 758719 754806 749433 742279 733744 724793 716216
59076G16216q177q332q782q710p842o923o759p084o964o107n146m702m766n066
$$ 716216 708039 699707 690925 682215 674373 667450 660691 653607 646643 640536 635390 630688 625922 620856
59062F20856n372n357m750l789l019k617k327k148k364k860l037k650k101j672
$$ 620856 615484 610127 605377 601588 598569 595952 593625 591477 589113 586253 583216 580566 578465 576793
59048E76793j113l05K64J93j37j23J46O5n45j125j050k75O81J268J366J355J679
$$ 576793 575680 575375 575639 575832 575695 575572 575718 575783 575238 574113 573063 572788 573469 574737 576103 577458 579137
59031E79137K464L488M473N247N863O643P909R436J0577J1118J1569J2263J2632
$$ 579137 581601 585089 589562 594809 600672 607315 615224 624660 635237 646355 657924 670187 682819
59018F82819J2082J1037J0304R668Q194N794L484J898O18p62j780j868j310q46
$$ 682819 694901 705938 716242 725910 734104 739898 743382 745280 745898 745136 743356 741488 740178 739332
59004G39332q18j019j055m89R45K961M799N856N976N233L923K709K140J866R81
$$ 739332 738514 737495 736440 735951 736896 739857 744656 750512 756488 761721 765644 768353 770493 772359 773340
58989G73340p00k375l392l980m594n198n563n721n695n347m670l899l008j648
$$ 773340 772640 770265 766873 762893 758299 753101 747538 741817 736122 730775 726105 722206 719198 717550
58975G17550J77J876K976L650M376N456O940Q537R621R886R931J0530J1395J1524
$$ 717550 717727 719603 722579 726229 730605 736061 743001 751538 761159 771045 780976 791506 802901 814425
58961H14425J0743R834R025P629N396L043Q70j801n140p951r282r874j0945j2404
$$ 814425 825168 835002 844027 851656 857052 860095 860965 859164 854024 846073 836791 826917 815972 803568
58947H03568j3284j3366j3172j2886j2232j1163r856q374p018o469o821p004o049
$$ 803568 790284 776918 763746 750860 738628 727465 717609 709235 702217 695748 688927 681923 675874
58934F75874m408l213k752k488k152j893j680j442j405j592j553j214j357k272
$$ 675874 671466 668253 665501 663013 660861 658968 657288 655846 654441 652849 651296 650082 648725 646453
58920F46453k823k065r67j003j688j322R4P02k67j236o04J249L038M317N292N931
$$ 646453 643630 641565 640598 639595 637907 636585 636679 637381 637114 635878 635274 636523 639561 643878 649170 655101
58904F55101O265O829Q015R458J0621J1471J2108J2289J1901J1377J1140J1081
$$ 655101 661366 668195 676210 685668 696289 707760 719868 732157 744058 755435 766575 777656
58892G77656J1061J1464J2713J4551J6231J7249J7522J7176J6430J5480J4283
$$ 777656 788717 800181 812894 827445 843676 860925 878447 895623 912053 927533 941816
58881I41816J2684J0836R144P602N688L071K2l104o242r258j1679j3139j3799
$$ 941816 954500 965336 974480 982082 987770 990841 990863 987759 981517 972259 960580 947441 933642
58868I33642j3971j3718j3057j2258j1537j0778r925r375r581j0364j1025j1054
$$ 933642 919671 905953 892896 880638 869101 858323 848398 839023 829442 819078 808053 796999
58856G96999j0541r847r175q507p912p703q091q638q414p061n401m554m636m915
$$ 796999 786458 776611 767436 758929 751017 743314 735223 726585 718171 711110 705709 701155 696519 691604
58842F91604n097n687o903p978q032p205o466o525p225p791p411n912m071l017
$$ 691604 686507 680820 673917 665939 657907 650702 644236 637711 630486 622695 615284 609372 605301 602284
58828F02284l071l432l177k197r45K97J407K045J933J451J406K096L021L626L974
$$ 602284 599213 595781 592604 590407 589462 589759 591166 593211 595144 596595 598001 600097 603118 606744 610718
58813F10718M407M805M614L598K335J729K100K819K892J892K88j030j658k047
$$ 610718 615125 619930 624544 628142 630477 632206 634306 637125 640017 641909 642197 641167 639509 637462
58799F37462k916m250n128m787l705l187l858m967n354m681l545k677k279j935
$$ 637462 634546 630296 625168 620381 616676 613489 609631 604664 599310 594629 591084 588407 586128 584193
58785E84193r38R13K870L909M010M122M744N222M949M374M126L781K518N47j156
$$ 584193 583255 584168 587038 590947 594957 599079 603823 609045 613994 618368 622494 626275 628793 629340 628184
58770F28184k278l289m319m979n278n658o025n782m987m436m323l893k820j853
$$ 628184 625906 622617 618298 613319 608041 602383 596358 590576 585589 581153 576830 572937 570117 568264
58756E68264j477r85L44J945K747K679K439K262J887J412J378J965K861L784M615
$$ 568264 566787 565802 566146 568091 570838 573517 575956 578218 580105 581517 582895 584860 587721 591505 596120
58741E96120N177N451N847O604P159O824N951N590N981O250N806N185N063N133
$$ 596120 601297 606748 612595 619199 626358 633182 639133 644723 650704 656954 662760 667945 673008 678141
58727F78141M646L577K578J985J508R07L58J38K95Q12J662K566L083L144L202
$$ 678141 682787 686364 688942 690927 692435 693342 693700 693838 694133 694945 696607 699173 702256 705400 708602
58712G08602L555L774L258K151J256R97R42L77j031l266o094q915j0900j1740
$$ 708602 712157 715931 719189 721340 722596 723593 724535 724912 723881 720615 714521 705606 694706 682966
58698F82966j2012j2429j2964j3083j2611j1861j1069j0186r223q300p325o150
$$ 682966 670954 658525 645561 632478 619867 608006 596937 586751 577528 569228 561903 555753
58686E55753n085m809n484o348o479n741m757m102l799l489k881k015j170n14
$$ 555753 550668 545859 540375 534027 527548 521807 517050 512948 509149 505660 502779 500764 499594 499080
58672D99080J27J063K315L510M278M665N158O242P911R556J0427J0196R005P076
$$ 499080 499207 500270 502585 506095 510373 515038 520196 526438 534349 543905 554332 564528 573533 580609
58658E80609M594K014O6q88j271j782k635l576m416n211o001o661o926o492n273
$$ 580609 585203 587217 587283 586395 585124 583342 580707 577131 572715 567504 561503 554842 547916 541424 536151
58643E36151l772k804k604k505j878r45k34M32J659L340M489M308K994J428M45
$$ 536151 532379 529575 526971 524466 522588 521643 521409 521841 523500 526840 531329 535637 538631 540059 540504
58628E40504L59P52P68Jr36j106m11L73O35N45O67J390K699M145N072N266N266
$$ 540504 540863 541615 542383 542384 541448 540342 539931 540304 540939 541484 542151 543541 546240 550385 555457 560723 565989
58611E65989N609O070O039N428M599L674K629J819J583J470P72k78q19q70j443
$$ 565989 571598 577668 583707 589135 593734 597408 600037 601856 603439 604909 605681 605403 604584 603714 602271
58596F02271k808l847l597k547j668r73J70J805L346M499N530O743Q080R241R844
$$ 602271 599463 595616 592019 589472 587804 586831 587001 588806 592152 596651 602181 608924 617004 626245 636089
58581F36089R716R178Q798Q714Q474P740O810O197O100O494P282Q149Q663Q908
$$ 636089 645805 654983 663781 672495 680969 688709 695519 701716 707816 714310 721592 729741 738404 747312
58567G47312R589J1196J3420J5725J8079K0630K3009K4490K4735K3968K2486K0354
$$ 747312 756901 768097 781517 797242 815321 835951 858960 883450 908185 932153 954639 974993
58555I74993J7581J4326J0911P696M867K360J23j575k402k560k788l639n049o693
$$ 974993 992574 1006900 1017811 1025507 1030374 1032734 1032857 1031282 1028880 1026320 1023532 1019893 1014844 1008151
58541A008151q450j0370j2478j4811j7334j9701k1289k1641k0807j9272j7679
$$ 1008151 999701 989331 976853 962042 944708 925007 903718 882077 861270 841998 824319
58530H24319j6514j5702j4589j2681j0317q323p051o166n232m055k567r64J11
$$ 824319 807805 792103 777514 764833 754516 746193 739142 732976 727744 723689 721122 720158 720269
58517G20269R5p34j526j844j905j893j737j542j570j757j806j804k069k382k177
$$ 720269 720364 719630 718104 716260 714355 712462 710725 709183 707613 705856 704050 702246 700177 697795 695618
58502F95618j546j203j368j479j231j001j014r30o20n41q38q93j59J117K473L785
$$ 695618 694072 692869 691501 690022 688791 687790 686776 685846 685226 684685 683847 682954 682795 683912 686385 690170
58486F90170M938N672O181P221R119J1311J3205J4843J6270J7046J6943J6380
$$ 690170 695108 700780 706961 714182 723301 734612 747817 762660 778930 795976 812919 829299
58474H29299J5597J4054J1265P682M152J014j725l905n529p004q467r275q768
$$ 829299 844896 858950 870215 877897 882049 883063 881338 877433 871904 864900 856433 847158 838390
58461H38390p148n099k963p77J310L201N147P323R423J0910J1383J0557Q400N511
$$ 838390 831242 826143 823180 822403 823713 826914 832061 839384 848807 859717 871100 881657 890057 895568
58447H95568K738J99k648n749q124r144r317r271q826p693o330n345m608l687
$$ 895568 898306 898505 895857 890108 881984 872840 863523 854252 845426 837733 831403 826058 821450 817763
58433H17763k612j635o87L93J612L172N392P879R530R954J0123J0901J1692J1319
$$ 817763 815151 813516 812829 813222 814834 818006 823398 831277 840807 850761 860884 871785 883477 894796
58419H94796R553P034M253J445r70k677l915n082o175p021p624p990q065q068
$$ 894796 904349 911383 915636 917081 916111 913434 909519 904437 898262 891241 883617 875627 867562 859494
58405H59494q263q279p467o031m837l952k595q00L17M90R02K139L021K527J485
$$ 859494 851231 842952 835485 829454 824617 820665 818070 817270 817587 818077 818979 821118 824139 826666 828151
58390H28151J192J585J925K055J911J058n8J57K074L592K899J176P68J836K820
$$ 828151 829343 830928 832853 834908 836819 837877 837819 837976 840050 843642 846541 847717 848485 850321 853141
58375H53141L231L833M683N130N445O439P782Q464Q698R543J0842J1344J0872
$$ 853141 856372 860205 864888 870018 875463 881902 889684 898148 906846 916389 927231 938575 949447
58362I49447J0654J1457J2778J3891J4376J3746J1903R853Q701Q099O940N162
$$ 949447 960101 971558 984336 998227 1012603 1026349 1038252 1048105 1056806 1064905 1071845 1077007
58350A077007L591K406J275O35J249K690L785M386N204O223O853P453R074J1638
$$ 1077007 1080598 1083004 1084279 1084914 1086163 1088853 1092638 1097024 1102228 1108451 1115304 1122757 1131831 1143469
58336A143469J3897J5152J5735J5874J5553J5276J5551J5789J5026J3550J2364
$$ 1143469 1157366 1172518 1188253 1204127 1219680 1234956 1250507 1266296 1281322 1294872 1307236
58325A307236J1403R821P762O246N445M620L609K915K571K346K704M088N679O462
$$ 1307236 1318639 1328460 1336222 1342468 1347913 1352533 1356142 1359057 1361628 1363974 1366678 1370766 1376445 1382907
58311A382907P009Q489J0474J1593J1895J2586J3807J4681J5219J6124J7040J7035
$$ 1382907 1389916 1398405 1408879 1420472 1432367 1444953 1458760 1473441 1488660 1504784 1521824 1538859
58299A538859J6537J6702J7231J7030J6541J7123J8468J9150J9365K0454K1973
$$ 1538859 1555396 1572098 1589329 1606359 1622900 1640023 1658491 1677641 1697006 1717460 1739433
58288A739433K2117K1097K1108K2658K3880K3938K4162K5229K5965K5873K6156
$$ 1739433 1761550 1782647 1803755 1826413 1850293 1874231 1898393 1923622 1949587 1975460 2001616
58277B001616K7363K8420K8836K9567L1033L2575L4459L7889M2437M5905M7556
$$ 2001616 2028979 2057399 2086235 2115802 2146835 2179410 2213869 2251758 2294195 2340100 2387656
58266B387656M8996N1281N3689N5977N9153O3062O5789O6558O6852O7813O8771
$$ 2387656 2436652 2487933 2541622 2597599 2656752 2719814 2785603 2852161 2919013 2986826 3055597
58255C055597O9147O9477O9968P0287P1220P4031P7950Q0951Q3294Q7224R2932
$$ 3055597 3124744 3194221 3264189 3334476 3405696 3479727 3557677 3638628 3721922 3809146 3902078
58244C902078R8168J02298J07322J14135J21259J28087J35942J45054J53962J62706
$$ 3902078 4000246 4102544 4209866 4324001 4445260 4573347 4709289 4854343 5008305 5171011
58234E171011J73003J84576J95197K05170K17624K33422K50018K66394K84698
$$ 5171011 5344014 5528590 5723787 5928957 6146581 6380003 6630021 6896415 7181113
58225G181113L05844L28108L51460L78619M10316M44186M79823N20101N66140
$$ 7181113 7486957 7815065 8166525 8545144 8955460 9399646 9879469 10399570 10965710
58216A0965710O16222O71106P34866Q08917Q91167R82726J089216J213780J355703
$$ 10965710 11581932 12253038 12987904 13796821 14687988 15670714 16759930 17973710 19329413
58207A9329413J518102J709838J937817K205405K521400K903174L369483L940611
$$ 19329413 20847515 22557353 24495170 26700575 29221975 32125149 35494632 39435243
58199C9435243M649935N547316O689806Q141177R984498J2321358J5244273J8790378
$$ 39435243 44085178 49632494 56322300 64463477 74447975 86769333 102013606 120803984
58191A20803984K2863382K7112226L0846209L3130199L3083312L0208585K4569186
$$ 120803984 143667366 170779592 201625801 234756000 267839312 298047897 322617083
58184C22617083J6795074P978658n72389p749803j3037074j6580523j8887546
$$ 322617083 339412157 347390815 346818426 339068623 326031549 309451026 290563480
58177B90563480k0435667k1480104k2072923k2150746k1628461k0505432j8927361
$$ 290563480 270127813 248647709 226574786 204424040 182795579 162290147 143362786
58170A43362786j7130112j5314819j3583608j1971657j0494993r158338p952855
$$ 143362786 126232674 110917855 97334247 85362590 74867597 65709259 57756404
58163E7756404o871637n918354n092833m381194l767736l244829k804502k431671
$$ 57756404 50884767 44966413 39873580 35492386 31724650 28479821 25675319 23243648
58155B3243648k113033j843788j619611j430354j267228j128506j012848r13788
$$ 23243648 21130615 19286827 17667216 16236862 14969634 13841128 12828280 11914492
58147A1914492q25533p47835o80682o20143n63402n12262m67729m26541l86646
$$ 11914492 11088959 10341124 9660442 9040299 8476897 7964635 7496906 7070365 6683719
58138F683719l50937l21933k97619k75833k57857k44236k31604k17334k03246
$$ 6683719 6332782 6010849 5713230 5437397 5179540 4935304 4703700 4486366 4283120
58129D283120j91507j80745j69354j58780j50366j42462j33657j25463j18970
$$ 4283120 4091613 3910868 3741514 3582734 3432368 3289906 3156249 3030786 2911816
58120B911816j12253j03985r6324r1230q7053q1651p6080p2214o9367o6104o3015
$$ 2911816 2799563 2695578 2599254 2508024 2420971 2339320 2263240 2191026 2121659 2055555 1992540
58109A992540o0937n8739n5392n2114n0142m8468m5960m3514m2015m0367l7787
$$ 1992540 1931603 1872864 1817472 1765358 1715216 1666748 1620788 1577274 1535259 1494892 1457105
58098A457105l5857l5954l6689l6114l4601l3399l2105k9731k6634k3602k0614
$$ 1457105 1421248 1385294 1348605 1312491 1277890 1244491 1212386 1182655 1156021 1132419 1111805
58087A111805j8071j7308j8228j8552j7199j6235j7460j9368j9682j8851j8550
$$ 1111805 1093734 1076426 1058198 1039646 1022447 1006212 988752 969384 949702 930851 912301
58076I12301j8562j7747j6610j6402j6821j6846j6663j6734j6279j4667j3051
$$ 912301 893739 875992 859382 842980 826159 809313 792650 775916 759637 744970 731919
58065G31919j2575j2247j0735q956q575r123q918p991p700q223q597q716r222
$$ 731919 719344 707097 696362 687406 678831 669708 660790 652799 645099 636876 628279 619563 610341
58052F10341r903r959r485q988q178o782n804o163o845o257m752m007m389m788
$$ 610341 600438 590479 580994 572006 563828 557046 551242 545079 538234 531977 527225 523218 518829 514041
58038E14041m672m487m369m060l892m358n108n606o304p703q933q814p741o933
$$ 514041 509369 504882 500513 496453 492561 488203 483095 477489 471185 463482 454549 445735 437994 431061
58024D31061o472n728n122n537o406o350n461n048n286n022m009l360l507l463
$$ 431061 424589 418861 413739 408202 401796 395446 389985 384937 379651 374629 370620 367260 363753 360290
58010C60290k609j619j072n89Q6L68j17p19o80p1N89R98J001N82J19J72P59J350
$$ 360290 357681 356062 354990 354401 354487 354855 354738 354019 353339 353268 353857 354855 355856 356438 356557 356729 357488 358838
57992C58838J559J345O31o10j917k641k718k611k620k759l090l572l746l223k340
$$ 358838 360397 361742 362373 361763 359846 357205 354487 351876 349256 346497 343407 339835 336089 332866 330526
57977C30526j787j798k180k760l214k934j825q44r53j831k417k354k023j552p84
$$ 330526 328739 326941 324761 322001 318787 315853 314028 313184 312231 310400 307983 305629 303606 302054 301270
57962C01270j9K43J77L89Q05P11j10j079j627j668j328q41n83o49n49L5O06N72
$$ 301270 301251 301494 301671 302060 302865 303576 303466 302387 300760 299092 297764 296923 296340 295691 295142 295177 295783 296355
57944B96355K85N16J291K124L098M579O158O922O876O995P758Q588Q934R027R247
$$ 296355 296640 297156 298447 300571 303669 308248 314406 321328 328204 335199 342957 351545 360479 369506 378753
57929C78753R407Q980P668N666L668K425J880J072n70k306l137l290l694m407
$$ 378753 388160 397140 404808 410474 414142 416567 418447 419519 418949 416643 413506 410216 406522 402115
57915D02115m741m728n169o169o815o557n854n187m448l662l342l615l803l383
$$ 402115 397374 392646 387477 381308 374493 367936 362082 356895 352447 348785 345443 341828 338025 334642
57901C34642k732k496k785l347m015m488m247l101j557l14L70O68Q74J307K126
$$ 334642 331910 329414 326629 323282 319267 314779 310532 307431 305874 305560 305930 306598 307472 308779 310905
57886C10905L032L436L061K191J294O82M38L90J70l42p87q27p32r60j343j278
$$ 310905 313937 317373 320434 322625 323919 324601 325039 325429 325599 325257 324470 323643 322911 321951 320608 319330
57870C19330o37M0L25K47r1o71j228j300p64P5R33J759K439K754K673K379K003
$$ 319330 318693 318733 319058 319305 319214 318543 317315 316015 315251 315326 316259 318018 320457 323211 325884 328263 330266
57853C30266J684J751K374L075L129K426J555R59M88k03j133k005k457k333j928
$$ 330266 331950 333701 336075 339150 342279 344705 346260 347219 347707 347504 346371 344366 341909 339576 337648
57838C37648j806k180k711l167l786m698n359n161m189k917j561l25J97k68r02
$$ 337648 335842 333662 330951 327784 323998 319300 313941 308780 304591 301674 300113 299788 299985 299717 298815
57823B98815o12N46J545J849J801J737J602J505J772K297K536K224J544O20n84
$$ 298815 298203 298749 300294 302143 303944 305681 307283 308788 310560 312857 315393 317617 319161 319781 319197
57808C19197j874k969l870m577m648l812k708k193k160j905j405j179j177r11
$$ 319197 317323 314354 310484 305907 301259 297447 294739 292546 290386 288481 287076 285897 284720 283809
57794B83809o08q66j279q10L49Q45M28M97J737K828K548J782K045L061L344K642
$$ 283809 283201 282335 281056 280246 280595 281440 281868 282365 284102 286930 289478 291260 293305 296366 299710 302352
57778C02352K294L192M642N408N048M004L031K695K960L100K348P32r41j969k415
$$ 302352 304646 307838 312480 317888 322936 326940 329971 332666 335626 338726 341074 341806 340865 338896 336481
57763C36481k865l663m553n028n013m869m671l969k617j371j050j360j320o13
$$ 336481 333616 329953 325400 320372 315359 310490 305819 301850 299233 297862 296812 295452 294132 293519
57749B93519J95P22J177J656J916J981K204K513K394J733J004M35j68o84o04K7
$$ 293519 293714 294436 295613 297269 299185 301166 303370 305883 308277 310010 311014 311449 311281 310597 309993 310020
57733C10020M63L49J37J21J4k04l3M87M36n86j631j697j105q24j061j322j333
$$ 310020 310483 310832 310969 311090 311104 310900 310867 311354 311790 311204 309573 307876 306771 305947 304886 303564 302231
57716C02231j188j027j079j629k482l052l262l697m446m672l904k860k312k034
$$ 302231 301043 300016 298937 297308 294826 291774 288512 284815 280369 275697 271793 268933 266621 264587
57702B64587j634j475j804j878j091j84j69o71o62k68m18j113j458j273j242j527
$$ 264587 262953 261478 259674 257796 256705 256521 256352 255681 255019 254751 254333 253220 251762 250489 249247 247720
57686B47720j564j295j221j152j91J695L331M022M458N391O567P697R535J3100
$$ 247720 246156 244861 243640 242488 242297 243992 247323 251345 255803 261194 267761 275458 284993 298093
57672B98093J8386K4626L1447L8908M6594N3309N7518N7713N2594M1672K6018
$$ 298093 316479 341105 372552 411460 458054 511363 568881 626594 679188 720860 746878
57661G46878Q268q369k1457l0214l5416l8377l9866l9934l8575l6144l3063k9506
$$ 746878 755146 746777 725320 695106 659690 621313 581447 541513 502938 466794 433731 404225
57649D04225k5603k1765j8590j6383j4844j3198j0831p912n295l674k961k616
$$ 404225 378622 356857 338267 321884 307040 293842 283011 275099 269804 266130 263169 260553
57637B60553k410k469k737k722j930l92J221K034J676P03M1m5j45o88j259j331
$$ 260553 258143 255674 252937 250215 248285 247893 249114 251148 252824 253527 253568 253523 253378 252690 251431 250100
57621B50100j199j478k022k086j492r47j038j559j962j965j544q09j39j6m46q39
$$ 250100 248901 247423 245401 243315 241823 240876 239838 238279 236317 234352 232808 231999 231860 231844 231398 230559
57605B30559p38l36p4m3r9l35r56j751k072j607r64j166k484l997m562l983l001
$$ 230559 229821 229485 229411 229368 229269 228934 227978 226227 224155 222548 221584 220418 217934 213937 209375 205392 202391
57588B02391k251j731j296j083j163j255j165j149j446j771j730j505j627k210
$$ 202391 200140 198409 197113 196030 194867 193612 192447 191298 189852 188081 186351 184846 183219 181009
57574A81009k836l161l203l068k702k086j385r60j216k225l413l876l212j858
$$ 181009 178173 175012 171809 168741 166039 163953 162568 161608 160392 158167 154754 150878 147666 145808
57560A45808m71N85J098R14L78K70Q11J289J171J015J538K343K514K038J651J488
$$ 145808 145337 145922 147020 147934 148312 148582 149393 150682 151853 152868 154406 156749 159263 161301 162952 164440
57544A64440J047L29p5r3l02p78q41k75K18J54m7L1J05j1J64Q54J314Q85J68K20
$$ 164440 165487 165816 165741 165648 165346 164568 163727 163452 163670 163824 163777 163808 163913 163902 164066 164920 166234 167119 167287 167507
57524A67507Q96J051K10q82j382j204n75M70J726K521K307J390O03M00N43O93
$$ 167507 168403 169454 169664 168782 167400 166196 165621 166091 167817 170338 172645 174035 174638 175038 175581 176274
57508A76274Q74J201J434J197O10K27K69K60l01j191j759j740j432j164j088j342
$$ 176274 177148 178349 179783 180980 181590 181817 182086 182346 182045 180854 179095 177355 175923 174759 173671 172329
57492A72329j928k395k156j282n54n09q18q73o10m83p39j083j000k92P12J374
$$ 172329 170401 168006 165850 164568 164014 163505 162687 161814 161204 160721 159982 158899 157899 157607 158319 159693
57476A59693J306P25K10J08K93M26K83j70p83j352j844k437l123l410k777j462
$$ 159693 160999 161724 161934 162042 162335 162761 163044 162874 162091 160739 158895 156458 153335 149925 147148 145686
57460A45686m09l15r07j362j250q80p33p22k80P19J462J100J1n63j96J83j73o64
$$ 145686 145277 144962 144055 142693 141443 140563 139830 139108 138828 139547 141009 142109 142120 141557 141361 141544 141371 140707
57442A40707m32J31P7m46m12L90J112J309J450J750J674J001L55J43j22q24j340
$$ 140707 140275 140406 140483 140037 139625 140015 141127 142436 143886 145636 147310 148311 148666 148809 148687 147863 146523
57425A46523q91K42J116J256Q16K8q32j232p65K83J153J288O52l11q58n31K04
$$ 146523 145632 145874 146990 148246 149062 149090 148258 147026 146261 146544 147697 148985 149637 149326 148468 147937 148141
57408A48141M19Oj43M67J036O37m17j056q64k01N68J225J358P97K05L34R03R67
$$ 148141 148560 148566 148423 148890 149926 150563 150146 149090 148226 148025 148593 149818 151176 151973 152178 152512 153415 154382
57390A54382M54L33J130K154K550K445K585L262M067M383L891K810J762J229J015
$$ 154382 154836 155169 156299 158453 161003 163448 166033 169295 173362 177745 181636 184446 186208 187437 188452
57375A88452O19N5j74j7j22q42j558j567j198j287j767j684p22Q8k08r78p09Q74
$$ 188452 189071 189126 188952 188935 188813 187971 186413 184846 183648 182361 180594 178910 178188 178276 178068 177090 176381 177255
57357A77255K287K139Q73J10O78J859K519K285J535P80L84N48J131J639J611J124
$$ 177255 179542 181681 182554 182664 183342 185201 187720 190005 191540 192320 192704 193252 194383 196022 197633 198757
57341A98757P00P37J085J258J036P56Q20J010O76l10j229j500j446j631j774j172
$$ 198757 199457 200194 201279 202537 203573 204329 205149 206159 206835 206525 205296 203796 202350 200719 198945 197773
57325A97773jP34N59O3j48j86l17l75k38j62k07O9Q34J495J547J393J658K153
$$ 197773 197772 198506 199065 199128 198980 198794 198477 198102 197864 197702 197495 197564 198398 199893 201440 202833 204491 206644
57307B06644K177J529O41o5l25J11J168K168K535K519K663K813K457J837J878
$$ 206644 208821 210350 210991 210926 210601 210712 211880 214048 216583 219102 221765 224578 227035 228872 230750
57292B30750K831L781L799K994K135J689J648J926K513L219L574L158K109J176
$$ 230750 233581 237362 241161 244155 246290 247979 249627 251553 254066 257285 260859 264017 266126 267302
57278B67302J069J732K489K935L292L806M258M380M279M151L974L873M233M990
$$ 267302 268371 270103 272592 275527 278819 282625 286883 291263 295542 299693 303667 307540 311773 316763
57264C16763N312M643L634L297L625L849L786L942M442M785M744M664M770M963
$$ 316763 322075 326718 330352 333649 337274 341123 344909 348851 353293 358078 362822 367486 372256 377219
57250C77219N350O157O965O956O219N880O568P577Q067Q268Q766R267R059Q352
$$ 377219 382569 388726 395691 402647 408866 414746 421314 428891 436958 445226 453992 463259 472318 480670
57236D80670Q248R307J0847J1882J2257J2618J3469J4572J5359J5708J6131J7029
$$ 480670 488918 498225 509072 520954 533211 545829 559298 573870 589229 604937 621068 638097
57224F38097J8023J8363J7887J7263J7250J8032J9309K0606K1456K1640K1468
$$ 638097 656120 674483 692370 709633 726883 744915 764224 784830 806286 827926 849394
57213H49394K1575K2315K3560K4992K6268K7010K7126K7206K8097K9964L2240
$$ 849394 870969 893284 916844 941836 968104 995114 1022240 1049446 1077543 1107507 1139747
57202A139747L4536L6955L9350M1071M1878M2422M3191M3421M1870L8464L4627
$$ 1139747 1174283 1211238 1250588 1291659 1333537 1375959 1419150 1462571 1504441 1542905 1577532
57191A577532L2068L1642L3153L5656L7858L8809L8333L6770L4371L1285K7913
$$ 1577532 1609600 1641242 1674395 1710051 1747909 1786718 1825051 1861821 1896192 1927477 1955390
57180A955390K4800K2139J9748J7586J5882J4651J3507J2226J1221J1134J2001
$$ 1955390 1980190 2002329 2022077 2039663 2055545 2070196 2083703 2095929 2107150 2118284 2130285
57169B130285J3135J3846J4044J4070J4133J4216J4382J4886J5827J6939J7921
$$ 2130285 2143420 2157266 2171310 2185380 2199513 2213729 2228111 2242997 2258824 2275763 2293684
57158B293684J8808J9864K1168K2510K3576K4092K3962K3499K3407K4277K6128
$$ 2293684 2312492 2332356 2353524 2376034 2399610 2423702 2447664 2471163 2494570 2518847 2544975
57147B544975K8596L1310L3917L6029L7584L8992M0509M1653M1810M1344M1360
$$ 2544975 2573571 2604881 2638798 2674827 2712411 2751403 2791912 2833565 2875375 2916719 2958079
57136B958079M2380M3840M4932M5249M4455M2159L8608L4946L2268L0767L0136
$$ 2958079 3000459 3044299 3089231 3134480 3178935 3221094 3259702 3294648 3326916 3357683 3387819
57125C387819L0382L1819L4558L8420M3264M9100N6033O4095P2793Q0825Q6804
$$ 3387819 3418201 3450020 3484578 3522998 3566262 3615362 3671395 3735490 3808283 3889108 3975912
57114C975912R0465R2749R4590R6354R8631J02844J10599J23064J41322J66427
$$ 3975912 4066377 4159126 4253716 4350070 4448701 4551545 4662144 4785208 4926530 5092957
57104E092957J98577K37203K82916L38713M08370M94402N98873P25466Q79131
$$ 5092957 5291534 5528737 5811653 6150366 6558736 7053138 7652011 8377477 9256608
57095I256608J063617J280471J529742J809355K112675K427415K736810L020542
$$ 9256608 10320225 11600696 13130438 14939793 17052468 19479883 22216693 25237235
57087B5237235L254987L416064L484836L450479L307679L053347K688353K221770
$$ 25237235 28492222 31908286 35393122 38843601 42151280 45204627 47892980 50114750
57079E0114750J671754J063518M29706j88034p44294j204438j558342j821227
$$ 50114750 51786504 52850022 53279728 53091694 52347400 51142962 49584620 47763393
57071D7763393k021041k182755k319300k431370k513032k558701k567209k541083
$$ 47763393 45742352 43559597 41240297 38808927 36295895 33737194 31169985 28628902
57063B8628902k483202k395188k278841k137966j978391j807033j631385j458881
$$ 28628902 26145700 23750512 21471671 19333705 17355314 15548281 13916896 12458015
57055A2458015j295377j144056j006181q82653p74173o80201n98815n27981m66436
$$ 12458015 11162638 10018582 9012401 8129748 7355575 6675374 6076559 5548578 5082142
57046E082142m13228l67066l26634k91122k60000k32436k07426j84452j63685
$$ 5082142 4668914 4301848 3975214 3684092 3424092 3191656 2984230 2799778 2636093
57037B636093j45461j29686j15741j02817r0344p8140o6213n4463m2618l0267
$$ 2636093 2490632 2360946 2245205 2142388 2052044 1973904 1907691 1853228 1810610 1780343
57027A780343j6770j448J5553L2303M5266N0711M6257L1665R132j6915m1132n9532
$$ 1780343 1763573 1762125 1777678 1809981 1855247 1905958 1952215 1983880 1993012 1976097 1934965 1875433
57015A875433p1042p7147q0115q1520q1708q0207p6623p1452o5856o0605n5477
$$ 1875433 1804391 1727244 1647129 1565609 1483901 1403694 1327071 1255619 1189763 1129158 1073681
57004A073681m9901m3883l8032l2946k8916k6003k3940k2116k0041j7777j5610
$$ 1073681 1023780 979897 941865 908919 880003 854000 830060 807944 787903 770126 754516
56993G54516j3443j0918q042n206k571J89L310O443Q887J0156J0134Q939O779
$$ 754516 741073 730155 722113 716907 714336 714525 717835 724278 733165 743321 753455 762394 769173
56980G69173L954Q13k333n248p811r945j1518j2355j2394j1751j0568q953p110
$$ 769173 773127 773940 771607 766359 758548 748603 737085 724730 712336 700585 690017 681064 673954
56967F73954n369l910k472n42K221N696R395J2733J5335J7043J7578J6296J2603
$$ 673954 668585 664675 662203 661661 663882 669578 678973 691706 707041 724084 741662 757958 770561
56954G70561O781R8o017j0750j3942j5807j6785j7307j7439j6972j5999j4943
$$ 770561 777342 777440 771423 760673 746731 730924 714139 696832 679393 662421 646422 631479
56942F31479j3811j1912q760m830r20K877P024J1577J6013J9800K2457K3205K1285
$$ 631479 617668 605756 596996 592166 591246 594123 601147 612724 628737 648537 670994 694199 715484
56929G15484J6848J0978M740j390p085j1837j5385j8035k0199k1840k2639k2474
$$ 715484 732332 743310 748050 746660 739575 727738 712353 694318 674119 652279 629640 607166
56917F07166k1554k0200j8711j7282j5947j4632j3292j1960j0678r473q374p353
$$ 607166 585612 565412 546701 529419 513472 498840 485548 473588 462910 453437 445063 437710
56905D37710o314n239m238l411k809k561k666k537j352Q37K803L604L810M731
$$ 437710 431396 426157 421919 418508 415699 413138 410472 407935 406583 407420 410223 413827 417637 422368
56891D22368O732R138J1394J3361J4563J4256J2439R969P395M541J486j032k643
$$ 422368 429100 438238 449632 462993 477556 491812 504251 514220 521615 526156 527642 526610 523967
56878E23967l951n507o850p199o535n410m113k682j218M48K970O695J1028J5214
$$ 523967 520016 514509 507659 500460 493925 488515 484402 481720 480502 480950 483920 490615 501643 516857
56864E16857J9404K4101K8867L2397L3810L3025K9905K4059J5886P040o85o690
$$ 516857 536261 560362 589229 621626 655436 688461 718366 742425 758311 765351 764666 757976
56852G57976j1421j5329j8334k0087k0364j9180j6783j3556r792n495m22N668
$$ 757976 746555 731226 712892 692805 672441 653261 636478 622922 613130 607635 607213 612881
56840F12881J2777K0680K9140L7974M6667N3833N7474N6137M9771L9376K6098
$$ 612881 625658 646338 675478 713452 760119 813952 871426 927563 977334 1016710 1042808
56829A042808J1059m113j7303k6884l2653l5732l7576l8947l9576l8641l5672
$$ 1042808 1053867 1049754 1032451 1005567 972914 937182 899606 860659 821083 782442 746770
56818G46770l0980k5333j9315j3116o666K66P977J6510K5274L3076L8482M0170
$$ 746770 715790 690457 671142 658026 651360 651626 659603 676113 701387 734463 772945 813115
56806H13115L7239K9690J8655O034o232j6678k4495k9716l3092l5384l6623l6285
$$ 813115 850354 880044 898699 904733 898501 881823 857328 827612 794520 759136 722513 686228
56794F86228l4204l1010k7535k4077k0396j6287j1827p178k337K781P996J2754
$$ 686228 652024 621014 593479 569402 549006 532719 520892 513714 511377 514158 522154 534908
56782E34908J6374J8375J8376J5854J0456K843n129j1468j5401j7487j8709j9763
$$ 534908 551282 569657 588033 603887 614343 617186 612057 600589 585188 567701 548992 529229
56770E29229k0988k2305k3090k2572k0666j8220j6210j4882j3782j2409j0715
$$ 529229 508241 485936 462846 440274 419608 401388 385178 370296 356514 344105 333390
56759C33390r095q019p578p323o727n778m880m223l588k873k355k262k388k440
$$ 333390 324295 316276 308698 301375 294648 288870 283990 279767 276179 273306 270951 268689 266301 263861
56745B63861k392k236j784j098p63j172j778j713j069p60j136j448j048l61j17
$$ 263861 261469 259233 257449 256351 255588 254416 252638 250925 249856 249096 247960 246512 245464 245103 244986
56730B44986k00K1N21O22J55j60L29J328K002J872J100J77l58k52K34N16L98K56
$$ 244986 244786 244807 245328 245950 246105 245945 246274 247602 249604 251476 252576 252753 252395 252143 252377 252893 253291 253547
56712B53547M34P20P54O04N55N58L21j33m80n62m15O1R18J715J803J209O25M53
$$ 253547 253981 254701 255455 256059 256614 257172 257493 257360 256880 256318 255903 255964 256882 258597 260400 261609 262234 262687
56694B62687L31j34p78j335j865k351k405j939j561j705j807j161j99L6m87p38
$$ 262687 263018 262884 262106 260771 258906 256555 254150 252211 250650 248945 247138 245977 245778 245814 245327 244589
56678B44589k62J81o9n88o89m43k79j83mn5o33j297j338p63j34L19P74J147J152
$$ 244589 244327 244508 244439 243851 243162 242719 242440 242257 242253 242198 241565 240268 238930 238167 238033 238352 239126 240273 241425
56659B41425R65J017J142P38q3l99J54P63O77L70P07J576K149K108J819J415O51
$$ 241425 242390 243407 244549 245287 245204 244805 244959 245722 246399 246769 247476 249052 251201 253309 255128 256543 257194
56642B57194l12p48l61K05J81l47o84m46L3J80k22r16j453j631j573j473j398
$$ 257194 256882 256134 255773 255978 256159 255812 255128 254682 254715 254895 254673 253757 252304 250673 249100 247627 246229
56625B46229j425j728k338k925l168l163l117k850k021q56j01j18n05p12o76o29
$$ 246229 244804 243076 240738 237813 234645 231482 228365 225515 223494 222638 222537 222419 221914 221202 220526 219897
56609B19897o37n75l20J70P09Q13J38r05j451j171n83k01O4M44P69P69N34K40
$$ 219897 219260 218685 218365 218535 219244 220057 220195 219290 217839 216668 216085 215884 215948 216392 217161 217930 218464 218704
56591B18704j33n15n51j51K23J96J8K9Q9K5J45O50J006O99K22M04J126J517J336
$$ 218704 218571 218056 217505 217354 217577 217773 217791 217820 217909 217934 218079 218729 219735 220434 220656 221060 222186 223703 225039
56572B25039J109J021P49M50Q57K053L153L624L986M779N662O208O829Q107R644
$$ 225039 226148 227169 227918 228368 229225 231278 234431 238055 242041 246820 252482 258690 265519 273626 283270
56557B83270J0394R855Q389O528M581K773J215j72j444k384k813k965l213l544
$$ 283270 293664 303519 311908 318436 323017 325790 327005 326833 325389 323005 320192 317227 314014 310470
56543C10470l641l442l283l516m071m451m163l273k463k301k498k353j880j899
$$ 310470 306829 303387 300104 296588 292517 288066 283903 280630 278167 275866 273368 271015 269135 267236
56529B67236k760l660l630k752j835j254p49k02P7j58p21j266j613j807j966k152
$$ 267236 264476 260816 257186 254434 252599 251345 250596 250394 250471 250313 249592 248326 246713 244906 242940 240788
56513B40788k257k132j867j717j672j419q61l89l70p16j171j673k111k141j673
$$ 240788 238531 236399 234532 232815 231143 229724 228863 228474 228104 227388 226217 224544 222433 220292 218619
56498B18619j223j264j470j205n66k40m04m00K32J030J233P99L73L82N08K25l93
$$ 218619 217396 216132 214662 213457 212891 212651 212247 211847 212079 213109 214342 215141 215514 215896 216404 216629 216236
56481B16236o49r3P79J126Q82Q19J330J743J305L95J20Q18J590J425L43q00j295
$$ 216236 215587 215494 216273 217399 218281 219100 220430 222173 223478 223873 223993 224811 226401 227826 228169 227369 226074
56464B26074j128p50n46n20m47k35m7j5p1j38l28o99r52o90P6Q71J242J180J007
$$ 226074 224946 224196 223650 223130 222683 222448 222401 222386 222315 222177 221849 221150 220198 219508 219584 220455 221697 222877 223884
56445B23884R76J005Q00K67k84m58k64j2J73M89R56J194Q75K26k09j56J29J39
$$ 223884 224860 225865 226665 226932 226648 226190 225926 225914 226087 226576 227532 228726 229601 229827 229618 229462 229591 229730
56427B29730m12j212j581j200n85n05r92j310r28n9P75J280J371J180J154J630
$$ 229730 229318 228106 226525 225325 224740 224235 223243 221933 221005 220946 221721 223001 224372 225552 226706 228336
56411B28336K186J979R03j38l80LM75P72O75j18j275j724q58N89J426J378R82
$$ 228336 230522 232501 233404 233266 232886 232889 233364 234136 234811 234693 233418 231694 230836 231425 232851 234229 235211
56394B35211P11P21J028J324J119N34L86R45J328Q67K81M98J001N70o80j346p33
$$ 235211 235922 236643 237671 238995 240114 240648 241034 241979 243307 244174 244455 244953 245954 246524 245844 244498 243765
56377B43765L21P75N46J93K03P06J374J556J053N24N94R41R13N95M47L33L7J65
$$ 243765 244086 244861 245407 245600 245803 246509 247883 249439 250492 251016 251610 252551 253464 254059 254506 254839 254876 255041
56359B55041J285K416J985J92j051p53R9M78P59J503K164J946J049K07l15n16
$$ 255041 256326 258742 260727 260919 259868 259115 259214 259692 260451 261954 264118 266064 267113 267320 267005 266489
56343B66489j86O20J251J223Q52O30N32M46O24J183J753K159K785L717M211L743
$$ 266489 266303 266923 268174 269397 270249 270879 271411 271857 272481 273664 275417 277576 280361 284078 288289 292032
56327B92032K990K926L433L644L283K867K662K310J507M48m84j068j187q44k90
$$ 292032 295022 297948 301381 305025 308308 311175 313837 316147 317654 318102 317618 316550 315363 314519 314229
56312C14229M9j15o73j135r50k6J101J864K326K931L691M159M202M210M408M512
$$ 314229 314278 314163 313490 312355 311405 311379 312480 314344 316670 319601 323292 327451 331653 335863 340271 344783
56296C44783M241L678K971K221J763K050K953L750L979L826L545L126K690K596
$$ 344783 349024 352702 355673 357894 359657 361707 364660 368410 372389 376215 379760 382886 385576 388172
56282C88172K841L039L230M009N480O804P222O991O876P240Q046R123J0036J0274
$$ 388172 391013 394052 397282 401291 406771 413575 420797 427788 434664 441904 449950 459073 469109 479383
56268D79383J0018J0133J0997J1951J2509J3298J5080J7426J9284K0517K2017
$$ 479383 489401 499534 510531 522482 534991 548289 563369 580795 600079 620596 642613
56257F42613K4391K7362L0527L4075L8504M3933M9930N5946O1951O8482P5852
$$ 642613 667004 694366 724893 758968 797472 841405 891335 947281 1009232 1077714 1153566
56246A153566Q3452R0247R5918J00896J05300J08499J09873J09324J06770J01777
$$ 1153566 1237018 1327265 1423183 1524079 1629379 1737878 1847751 1957075 2063845 2165622
56236B165622R4059Q3804P1282N6707M0670K4082P480q953k4549l8265m9899o0300
$$ 2165622 2259681 2343485 2414767 2471474 2512144 2536226 2543706 2534753 2510204 2471939 2422040 2361740
56224B361740o9871p7816q3365q6879q9083r0053q9680q8350q6378q3452p9343
$$ 2361740 2291869 2214053 2130688 2043809 1954726 1864673 1774993 1686643 1600265 1516813 1437470
56213A437470p4634p0058o5696o1418n7401n3562m9293m4559m0428l7647l5360
$$ 1437470 1362836 1292778 1227082 1165664 1108263 1054701 1005408 960849 920421 882774 847414
56202H47414l2245k8334k4733k2097k0326j9235j8504j7418j5666j4002j3141
$$ 847414 815169 786835 762102 740005 719679 700444 681940 664522 648856 634854 621713
56191F21713j2489j0999q902p365o671n956m668l262k336j995k181k730l041k491
$$ 621713 609224 598225 589323 581958 575287 569331 564663 561401 559065 557070 554889 552159 549118 546627
56177E46627j270j75M10P53J062J167J016Q70R66J363K056K914L626M071M529
$$ 546627 545357 545182 545592 546345 547407 548574 549590 550460 551426 552789 554845 557759 561385 565456 569985
56162E69985N224N968O555P065P523P763P965Q696J0025J1290J2239J3512J5455
$$ 569985 575209 581177 587732 594797 602320 610083 618048 626744 636769 648059 660298 673810 689265
56149F89265J7341J8670K0342K3516K8017L2976L8407M4929N2465O0463O9046
$$ 689265 706606 725276 745618 769134 797151 830127 868534 913463 965928 1026391 1095437
56138A095437P8666Q8658R7143J02410J03692J00944R4856Q6914P8746P1377O5407
$$ 1095437 1174103 1262761 1359904 1462314 1566006 1666950 1761806 1848720 1927466 1998843 2064250
56127B064250O1133N7806N3551M7084L8939L0259K1294J2102L806k511p679j3855
$$ 2064250 2125383 2183189 2236740 2283824 2322763 2353022 2374316 2386418 2390224 2387713 2380034 2366179
56115B366179k2309l2937m5339n8931p2211q3315r1281r5934r6947r4326q9270
$$ 2366179 2343870 2310933 2265594 2206663 2134452 2051137 1959856 1863922 1766975 1672649 1583379
56104A583379q3274p6688o9318o1849n5209m8999m2171l4975k8741k3883j9651
$$ 1583379 1500105 1423417 1354099 1292250 1237041 1188042 1145871 1110896 1082155 1058272 1038621
56093A038621j5711j2485r961p626n524m079k972j489J64J264K006L152M497N191
$$ 1038621 1022910 1010425 1000464 992838 987314 983235 980263 978774 978938 980202 982208 985360 989857 995048
56079I95048N402O015O960P360P295P691Q572R045R070R572J0742J1789J2464
$$ 995048 1000450 1006465 1013425 1020785 1028080 1035771 1044343 1053388 1062458 1072030 1082772 1094561 1107025
56066A107025J3323J4383J5091J5598J6623J7924J8427J7900J7148J6607J6205
$$ 1107025 1120348 1134731 1149822 1165420 1182043 1199967 1218394 1236294 1253442 1270049 1286254
56055A286254J6257J6998J7523J6913J6018J6299J7263J7160J5960J5407J6199
$$ 1286254 1302511 1319509 1337032 1353945 1369963 1386262 1403525 1420685 1436645 1452052 1468251
56044A468251J7303J8196J9495K1215K2458K3144K4060K5107K5539K5852K7350
$$ 1468251 1485554 1503750 1523245 1544460 1566918 1590062 1614122 1639229 1664768 1690620 1717970
56033A717970K9791L1729L3132L5222L7775L9224L9579M0593M2706M4503M5490
$$ 1717970 1747761 1779490 1812622 1847844 1885619 1924843 1964422 2005015 2047721 2092224 2137714
56022B137714M6709M8321M9324N0099N2358N6014N9020O0862O3248O6764O9878
$$ 2137714 2184423 2232744 2282068 2332167 2384525 2440539 2499559 2560421 2623669 2690433 2760311
56011B760311P2066P4793P8540Q1881Q4453Q7852R2566R7083J00993J05875J12161
$$ 2760311 2832377 2907170 2985710 3067591 3152044 3239896 3332462 3429545 3530538 3636413 3748574
56000C748574J18284J23932J30880J39528J47928J55370J63635J73568J83849
$$ 3748574 3866858 3990790 4121670 4261198 4409126 4564496 4728131 4901699 5085548
55991E085548J94159K06073K19841K33900K48536K66043K86469L07406L28879
$$ 5085548 5279707 5485780 5705621 5939521 6188057 6454100 6740569 7047975 7376854
55982G376854L53813L82719M13013M44788M81799N25208N72206O22648O81008
$$ 7376854 7730667 8113386 8526399 8971187 9452986 9978194 10550400 11173048 11854056
55973A1854056P49617Q26253R11010J009139J124399J256386J407470J585555
$$ 11854056 12603673 13429926 14340936 15350075 16474474 17730860 19138330 20723885
55965B0723885J797010K044709K336809K690381L124056L657078M320556N161432
$$ 20723885 22520895 24565604 26902413 29592794 32716850 36373928 40694484 45855916
55957D5855916O233131P594866R326011J1528685J4304004J7713248K1711687
$$ 45855916 52089047 59683913 69009924 80538609 94842613 112555861 134267548
55950A34267548K6029274L0058452L2896186L3597120L1497251K6428589J8798195
$$ 134267548 160296822 190355274 223251460 256848580 288345831 314774420 333572615
55943C33572615R576690J28196q205144j4599944j8961567k1686521k3236749
$$ 333572615 343149305 343277501 335072357 320472413 301510846 279824325 256587576
55936B56587576k3897879k3804987k3053105k1750129k0028639j8053850j6004706
$$ 256587576 232689697 208884710 185831605 164081476 144052837 125998987 109994281
55929A09994281j4023853j2188919j0531802r066685p793245o694097n747336
$$ 109994281 95970428 83781509 73249707 64183022 56389777 49695680 43948344
55922D3948344m937553m250182l665537l165942k741419k383051k077999j815871
$$ 43948344 39010791 34760609 31095072 27929130 25187711 22804660 20726661 18910790
55914A8910790j592958j405473j245013j104762r83885q81709p93320p14781o47010
$$ 18910790 17317832 15912359 14667346 13562584 12578699 11696990 10903670 10188889 9541879
55905I541879n90533n41491m96420m56129m21381l89420l58246l29940l06213
$$ 9541879 8951346 8409855 7913435 7457306 7035925 6646505 6288259 5958319 5652106
55896E652106k84776k63305k43217k26320k11301j96608j83265j71979j60813
$$ 5652106 5367330 5104025 4860808 4634488 4423187 4226579 4043314 3871335 3710522
55887C710522j48595j37388j28698j20435j10486j00371r2484q6401q0719p6080
$$ 3710522 3561927 3424539 3295841 3175406 3064920 2964549 2872065 2785664 2704945 2628865
55877B628865p3606p2536p1790p1723p2223p1531o9057o6978o6796o6725o4732
$$ 2628865 2555259 2482723 2410933 2339210 2266987 2195456 2126399 2059421 1992625 1925900 1861168
55866A861168o1743n9392n6953n3113m8816m5636m3033l9738l6393l4432l3649
$$ 1861168 1799425 1740033 1683080 1629967 1581151 1535515 1492482 1452744 1416351 1381919 1348270
55855A348270l2943l2244l1889l1351l0324k9681k9748k9240k7449k5859k5863
$$ 1348270 1315327 1283083 1251194 1219843 1189519 1159838 1130090 1100850 1073401 1047542 1021679
55844A021679k6467k6042k4761k3526k2147k0363j9130j8982j8662j7211j5907
$$ 1021679 995212 969170 944409 920883 898736 878373 859243 840261 821599 804388 788481
55833G88481j6091j6656j5740j3611j1790j0570r431q730q971r407r296r418j0461
$$ 788481 772390 755734 739994 726383 714593 704023 694592 685862 676891 667484 658188 648770 638309
55820F38309j1225j0432r124r004r600r411q780r036r596q691o491m911m452l796
$$ 638309 627084 616652 607528 598524 588924 579513 570733 561697 552101 543410 536919 532008 527556 523760
55806E23760k517j757j824j445NJ490K172K591L254L544K862J722Q43M2j338l396
$$ 523760 521243 519486 517662 516217 516222 517712 519884 522475 525729 529273 532135 533857 534700 534742 533404 530008
55790E30008n538o991p327o785o080n564m928m085l769m617o216p743r016j0140
$$ 530008 524470 517479 510152 503367 497287 491723 486795 482710 478941 474324 468108 460365 451349 441209
55776D41209j0764j0555r941r380q506o886n136m148l732l112k358k045j937j283
$$ 441209 430445 419890 409949 400569 392063 385177 380041 375893 372161 369049 366691 364646 362709 361426
55762C61426k70R3m91j295j815k281k844l218l273l242l258l345l799m894o200
$$ 361426 361156 361249 360758 359463 357648 355367 352523 349305 346032 342790 339532 336187 332388 327494 321294
55747C21294o929o895o610o488o563o725o788o456n724n024m576m017l166k544
$$ 321294 314365 307470 300860 294372 287809 281084 274296 267840 262116 257092 252516 248499 245333 242789
55733B42789k493k436j765r63r34j703k589l245l602l306k252j268j264j971k498
$$ 242789 240296 237860 236095 235132 234198 232495 229906 226661 223059 219753 217501 216233 214969 212998 210500
55718B10500k741l138l376k673j189k8L06L63O08Q49R53J199J619J740J268M61
$$ 210500 207759 204621 201245 198572 197383 197355 197661 198024 198632 199481 200434 201633 203252 204992 206260 206721
55702B06721l08q35r69q02r08j744k843l279k885k385k332k504k453k003j260
$$ 206721 206413 205578 204609 203807 202899 201155 198312 195033 192148 189763 187431 184927 182474 180471 179211
55687A79211m55K00Q00J737L034M053M237L799L276K814K407K250K303K046J273
$$ 179211 178756 178956 179756 181493 184527 188580 192817 196616 199892 202706 205113 207363 209666 211712 212985
55672B12985N46K07k79j220j748j106q7J00k48K2P97Q93J50l06L5M60N49P83J266
$$ 212985 213531 213738 213459 212239 210491 209385 209298 209398 209150 209172 209969 210862 211012 210706 210741 211201 211750 212533 213799
55653B13799J257M92k06k23j3j19l33m34q19j745k709l204l459l821m080l968
$$ 213799 215056 215548 215342 215119 215106 214987 214654 214220 213401 211656 208947 205743 202284 198463 194383 190415
55637A90415l780l909m156m078l708l469l576l828l828l319k431j635j197q17
$$ 190415 186635 182726 178570 174492 170784 167315 163739 159911 156083 152764 150333 148698 147501 146684
55623A46684j09P01J047Q20M16J07j34l42n99j121j803k005j465j021j501k311
$$ 146684 146575 147276 148323 149143 149559 149666 149532 149190 148591 147470 145667 143662 142197 141176 139675 137364
55607A37364k217j287q47j484k293k283j515n60J07K4r23j853j623m35K86j33
$$ 137364 135147 133860 133013 131529 129236 126953 125438 124878 124985 125009 124086 122233 120610 120175 120461 120328
55591A20328q53r95o96k75M03J121R98j49j135r04P2O65O38O18J076K037L200
$$ 120328 119475 118480 117784 117509 117912 119033 120031 119882 118747 117843 117915 118580 119218 119836 120912 122949 126149
55574A26149L830L269K058J739K857M093M079L233K873L274L687L607K983J668
$$ 126149 129979 133248 135306 137045 139902 143995 148074 151307 154180 157454 161141 164748 167731 169399
55560A69399k01j705k068j831k087k825l074k533j983k038k436k669k558k064
$$ 169399 169198 167493 165425 163594 161507 158682 155608 153075 151092 149054 146618 143949 141391 139327
55546A39327j301p85j000j624j815j305n66J01Q48J590J814J413J027J134J324
$$ 139327 138026 137241 136241 134617 132802 131497 130931 131032 131880 133470 135284 136697 137724 138858 140182
55531A40182R68J53m77o31n99p44j068j383j644j957k310k478k289j929j800k010
$$ 140182 141150 141303 140826 140195 139596 138852 137784 136401 134757 132800 130490 128012 125723 123794 121994 119984
55515A19984k230k143j865j729j809j851j667j355j169j166j039m08N71J097N69
$$ 119984 117754 115611 113746 112017 110208 108357 106690 105335 104166 103000 101961 101553 102124 103221 103790
55500A03790m94r71o06l71j082k246k769k348j541q08j45L76M38j9n46o72m16
$$ 103790 103296 102325 101719 101348 100266 98020 95251 92903 91362 90554 90409 90785 91223 91204 90658 89986 89570
55483H9570j22QQ2K35L21L6n31o97Q8J306J721Q30m59r39m56K16M63K82j62p71
$$ 89570 89448 89456 89538 89773 90094 90130 89599 88902 88990 90296 92017 92847 92388 91449 90993 91209 91672 91954 91792 91021
55463I1021j327j501j200o33k6M54O36M39P3o7K50R24J612J865J392L97m75p25
$$ 91021 89694 88193 86993 86360 86334 86788 87424 87863 87936 87869 88119 89043 90655 92520 93912 94309 93834 93109
55445I3109m20O2M47O24N32K65L9j36m72r07r58m48R0J62Q0M26J059J341J133
$$ 93109 92689 92751 93198 93822 94354 94619 94658 94522 94050 93143 92185 91737 91827 91989 92069 92495 93554 94895 96028
55426I6028Q11M59k07j043j433j208q54n98l2R47J534J001j67p94m06M94J249
$$ 96028 96839 97298 97091 96048 94615 93407 92553 91955 91923 92870 94404 95405 95238 94444 94038 94532 95781
55409I5781J580J394P92K39J83L84J52o03j161j078q87j221j747j633q55k16j89
$$ 95781 97361 98755 99547 99786 99969 100353 100505 99902 98741 97663 96776 95555 93808 92175 91320 91104 90915
55392I0915l66k75o5m5p4J13L60L65K77M28P26P74N05K10nk48l58K9P71J147P33
$$ 90915 90549 90274 90209 90164 90090 90203 90563 90928 91205 91633 92359 93133 93638 93848 93843 93595 93237 93266 94037 95184 95917
55371I5917J1k32J99P93R37M25m17r19o62j3J70m28j137j068j56Q82J383J252
$$ 95917 95928 95696 95895 96688 97625 98050 97633 96714 96052 96039 96209 95781 94644 93576 93420 94302 95685 96937
55353I6937P54J41m19p20n16K04R78J125M43m59q46p36p58j195j595j441p45J48
$$ 96937 97691 97832 97413 96693 96177 96381 97359 98484 98927 98468 97622 96886 96128 94933 93338 91897 91152 91300
55335I1300R50J441J436R75K87n27j442k093j905q60K84Q11P34M51J76J0N3J24
$$ 91300 92250 93691 95127 96102 96389 95862 94420 92327 90422 89562 89846 90657 91391 91842 92018 92028 92081 92205
55317I2205k05q70j091m14N04P68N44O87J310J565R71J43r0K28L69j29j001j627
$$ 92205 92000 91130 90039 89625 90129 90897 91441 92128 93438 95003 95974 96117 96027 96255 96624 96495 95494 93867
55299I3867j609j074m94k20k41l35l58k39M5L59M49K82J60K64L86L16K73N12P60
$$ 93867 92258 91184 90690 90470 90229 89894 89536 89297 89342 89701 90150 90432 90592 90856 91242 91558 91831 92343 93103
55280I3103N36n6l65m9N26P66M26l22j040j213o61J09L05k39q43p99j80L49L35
$$ 93103 93639 93583 93218 93169 93695 94461 94887 94565 93525 92312 91651 91760 92065 91826 90983 90184 90004 90353 90688
55261I0688j05n58p61p47o91o79o15l12K95R99J364J061K69k90j4Q39J308P47
$$ 90688 90583 90025 89264 88517 87826 87147 86532 86220 86515 87514 88878 89939 90208 89918 89904 90743 92051 92798
55243I2798m53j309j194k79Q03J443J383P65q7q82j389j426j102r20j186j458
$$ 92798 92345 91036 89842 89563 90366 91809 93192 93957 93870 92988 91599 90173 89071 88151 86965 85507
55227H5507j052j52K91k1j90N49J632J969J480J036J131J415J440J224R58P43
$$ 85507 84455 84303 84594 84573 84383 84932 86564 88533 90013 91049 92180 93595 95035 96259 97217 97960
55211I7960O30M98k6j039j808j400O8J339J448P07Q6l8o7l75p02n04K29P70M96
$$ 97960 98590 99088 99062 98023 96215 94815 94883 96222 97670 98377 98463 98425 98358 97983 97281 96777 97006 97776 98272
55192I8272k31m29J58O36K47m72m73K58P98O82L86L36K89J1j54J32N54N36M8m08
$$ 98272 98041 97612 97770 98406 98653 98181 97708 97966 98764 99446 99832 100168 100457 100468 100314 100446 101000 101536 101584 101176
55172A01176m61k11l0j55n13q04p95m73L3N41O97J35q77j303l99J143J786Q98
$$ 101176 100715 100504 100474 100319 99806 99002 98207 97734 97767 98308 99005 99140 98263 96960 96561 97704 99490 100388
55154A00388n69j290r60k31K43L65M71Q69J479J850J704J317J119J009O02l0m10
$$ 100388 99819 98529 97569 97338 97581 97946 98417 99286 100765 102615 104319 105636 106755 107764 108366 108336 107926
55137A07926m85p59j407j882j711j150o96m34k17j38l31n38l59K54R77J400J192
$$ 107926 107441 106682 105275 103393 101682 100532 99836 99402 99185 99047 98716 98178 97819 98073 99050 100450 101642
55120A01642K26j082j865j616p63j61p7k2N06J302J574P70o80j518r27N04J416
$$ 101642 101868 100786 98921 97305 96542 96381 96304 96282 96788 98090 99664 100434 99754 98236 97309 97813 99229
55103I9229J310R36R92J153Q34K42mJ16J59O2J32L08J59k63k86M46J394J753J310
$$ 99229 100539 101475 102467 103620 104454 104696 104692 104808 104967 105029 105161 105469 105628 105365 105079 105525 106919 108672 109982
55084A09982M76k32n25l92r7P6J99O01J320J805J451L09q96j429j174o49m64o85
$$ 109982 110458 110226 109701 109309 109212 109288 109487 110088 111408 113213 114664 114973 114077 112648 111474 110825 110361 109676
55066A09676p74k56O12J064P34O2l49m95p90j300j549j108r7R58J574J545R69
$$ 109676 108902 108646 109258 110322 111056 111118 110769 110274 109484 108184 106635 105527 105430 106388 107962 109507 110476
55049A10476K40j85j95j45m13r10j204j056o49k93j42j97l85n69o07n31m90n21
$$ 110476 110716 110531 110336 110191 109778 108868 107664 106608 105959 105666 105524 105327 104942 104373 103766 103235 102745 102224
55031A02224m80k80k0K13M77Q38J223J473J418R24P5o17n97L5N07L02k10l29N9
$$ 102224 101744 101464 101444 101657 102134 102972 104195 105668 107086 108010 108085 107468 106871 106906 107413 107715 107505 107176 107235
55012A07235N49R10J243J491J353P86K34J50N31R45R35L10o84j458j531r84l41
$$ 107235 107784 108694 109937 111428 112781 113567 113801 113951 114482 115427 116362 116672 115988 114530 112999 112015 111674
54995A11674NR2J52L12N55Q44J100J159Q34J07p12j157j086q94r64j019m77N36
$$ 111674 111679 111771 111923 112235 112790 113634 114734 115893 116727 116834 116122 114965 113879 112985 112021 111002 110525 111061
54977A11061J061N43l58n97LQ17J405J757J846J526R44M44Q9k86n86n22j77j1
$$ 111061 112122 112665 112307 111710 111713 112530 113935 115692 117538 119064 120008 120452 120541 120255 119669 119147 118970 118959
54959A18959k31n34n71l18N3L47M23L52M57Q52J145R71N93N06O00L83j21l89l12
$$ 118959 118728 118194 117623 117305 117358 117705 118128 118480 118937 119789 120934 121905 122498 123004 123604 123987 123866 123477 123165
54940A23165l76p98j094p38K39J365K074J953J202P17J119J776J613P74N69J576
$$ 123165 122789 121991 120897 120159 120398 121763 123837 125790 126992 127709 128828 130604 132217 132991 133560 135136
54924A35136K872L493L629L865M114M129M279N020N938O128N253L652J748j72
$$ 135136 138008 141501 145130 148995 153109 157238 161517 166537 172475 178603 183856 187508 189256 189084
54910A89084j767k750l130l074k826k843l543m677n391n228m563l864l119k320
$$ 189084 187317 184567 181437 178363 175537 172694 169151 164474 159083 153855 149292 145428 142309 139989
54896A39989j775j531j160o35o82j545k218j684l85M21L72J49K90P73J500K418
$$ 139989 138214 136683 135523 134888 134206 132661 130443 128759 128374 128795 129167 129316 129606 130379 131879 134297
54880A34297L239L793M394N226N655N088M198M273N362O071N366L666J991P19
$$ 134297 137536 141329 145723 150949 156604 161692 165890 170163 175525 181596 186962 190628 192619 193338
54866A93338l60j445k540l547m293m707m978n304n501n213m434l490k665k174
$$ 193338 192978 191533 188993 185446 181153 176446 171468 166164 160663 155450 151016 147526 144861 142687
54852A42687k207k581k562j704o46m42j222k162k625k640k332j629o42K40P36
$$ 142687 140480 137899 135337 133633 132987 132545 131323 129161 126536 123896 121564 119935 119293 119533 120269
54837A20269P38J16r70j754j566p13k2L29P13R47L87q17j549j180l47O2n8l39
$$ 120269 121007 121123 120153 118399 116833 116120 116098 116427 117140 118087 118474 117657 116108 114928 114581 114643 114585 114246
54819A14246n43m67J4N31M41j62l93J29O56M53j64m00j5P05J419J718J240L08
$$ 114246 113703 113236 113250 113781 114222 114060 113667 113796 114452 114905 114741 114341 114326 115031 116450 118168 119408 119716
54801A19716j26L56J096J435J623K018K108J245j79j112j200r04n82k30J8l8j79
$$ 119716 119590 119946 121042 122477 124100 126118 128226 129471 129292 128180 126980 126076 125494 125264 125282 125244 125065
54784A25065j3L41M86M91P70J262J415J086P21O77Q74J250J843K393K451K126
$$ 125065 125052 125393 125879 126370 127140 128402 129817 130903 131624 132301 133175 134425 136268 138661 141112 143238
54768A43238K156K995M258N326O103O841P547P870P471O312M706L080J564j23
$$ 143238 145394 148389 152647 157973 164076 170917 178464 186334 193805 200117 204823 207903 209467 209344
54754B09344k157m102n285n617n589n514n281m894m648m533m089l207k581k826
$$ 209344 207187 203085 197800 192183 186594 181080 175799 170905 166257 161724 157635 154428 151847 149021
54740A49021l465l427k371j036k93k58m19l03J49O25Q39R14J309K170K984L153
$$ 149021 145556 142129 139758 138722 138429 138171 137752 137449 137598 138223 139062 139976 141285 143455 146439 149592
54724A49592K847K821L450M343M989N316N392N083M320L383K490J347l86k354
$$ 149592 152439 155260 158710 163053 168042 173358 178750 183833 188153 191536 194026 195373 194987 192633
54710A92633l753m305m475m628m534m006l456l375l578l470k900k289j927j671
$$ 192633 188880 184575 180100 175472 170938 166932 163476 160101 156523 153053 150153 147864 145937 144266
54696A44266j363j139j108j122j035r75j089j229j197j090j149j260j039m52m2
$$ 144266 142903 141764 140656 139534 138499 137524 136435 135206 134009 132919 131770 130510 129471 129019 128977
54681A28977k57q08j039q15o48q13q18j47Q22J141N06m15r18r87q81n27J92Q83
$$ 128977 128720 127912 126873 126058 125410 124597 123779 123632 124454 125595 126101 125686 124768 123781 122900 122373 122565 123448
54663A23448R42L24m40q80r04n50J01P28R36P08M19K67O1k77m33j37L49N06J94
$$ 123448 124390 124714 124274 123394 122490 121940 122041 122769 123705 124413 124832 125099 125160 124883 124450 124313 124662 125168 125362
54644A25362k70n31m88j81L28Q38R60M11n79j268j027l2Q42Q91K43l73m58j60
$$ 125362 125092 124561 124073 123892 124220 125058 126018 126429 125850 124582 123555 123523 124365 125256 125499 125126 124668 124508
54626A24508J9k18o77q57m90J36N20N93P25J069J266J033O06L12O9k67l85L6O32
$$ 124508 124527 124309 123632 122775 122285 122421 122941 123534 124259 125328 126594 127627 128233 128545 128614 128347 127962 127998 128630
54607A28630P16K77o2m9j40o06r98q47l94j93k48m0O24J200R82J5p43l99P57J453
$$ 128630 129346 129623 129561 129512 129372 128766 127768 126921 126527 126334 126086 126046 126670 127870 128852 128867 128124 127725 128482 129935
54587A29935R09k59q90o63j31K56M60M24R1j93k7K87J02m53n59r3Q9m25q48m25
$$ 129935 130844 130585 129695 129032 128901 129157 129617 130041 130132 129939 129912 130199 130301 129848 129289 129196 129285 128860 128012 127587
54567A27587L69O47M06K51L02K71K60N98J042R97M38j8l3P9o0m25p85r62q25l88
$$ 127587 127956 128603 129009 129260 129562 129833 130093 130691 131733 132730 133168 133150 133117 133196 133136 132711 131926 130964 130139 129751
54547A29751J32N87J105J696J898J355N51L61Q77J301J121P09N55M63M6m89n68
$$ 129751 129883 130470 131575 133271 135169 136524 137075 137436 138313 139614 140735 141444 141999 142462 142508 142019 141451
54530A41451j82K5l69r64j074o11q1K03M47Q00Q70K74o10j038r75j054j411j328
$$ 141451 141269 141294 140925 139961 138887 138276 138195 138398 138845 139645 140515 140789 140179 139141 138166 137112 135701 134373
54512A34373m34M91N44L9J6O84J199Q77m3r36j354j058q9Q53P78m55j805k178
$$ 134373 133939 134430 134974 135013 135029 135713 136912 137789 137746 136810 135456 134398 134309 135162 135940 135485 133680 131502
54494A31502j596q31k65L40J071J514J407J161J322J772J860J337P35N93P11N61
$$ 131502 129906 129075 128810 129150 130221 131735 133142 134303 135625 137397 139257 140594 141329 141922 142633 143194
54478A43194J64O0M07O93N18J23r2j66k74k10L11J049J396J141O79M25M00M15
$$ 143194 143358 143418 143825 144518 145036 145159 145067 144901 144627 144417 144728 145777 147173 148314 148993 149418 149818 150233
54460A50233L98L73L55L10K36J50N9r4l76o28m92J31O80M82k92p33m29lr5m16
$$ 150233 150631 151004 151359 151669 151905 152055 152114 152020 151644 151016 150524 150655 151335 151817 151525 150792 150363 150360 150265 149849
54440A49849l70j02k30p63j058p74k22J77K57k5n24p02j46O89Q50J72m29j86O02
$$ 149849 149479 149377 149147 148384 147326 146552 146330 146507 146764 146739 146215 145513 145367 146056 146906 147078 146649 146463 147065
54421A47065J184J321J185P77Q2m01jJ118J819J202k83j302j137m28j53k92JR77
$$ 147065 148249 149570 150755 151532 151614 151213 151212 152330 154149 155351 155068 153766 152629 152201 152048 151756 151757 152734
54403A52734J729J363K93k41K85J172J495J068L66j15k17r5k6j21k14q7K83P56
$$ 152734 154463 155826 156119 155878 156163 157335 158830 159898 160264 160149 159932 159837 159811 159690 159476 159389 159672 160428
54385A60428J234J576J548J085N02J22j75p55j637k411k645k150j014L24J183
$$ 160428 161662 163238 164786 165871 166373 166495 166320 165565 163928 161517 158872 156722 155708 156032 157215
54370A57215J268R72Q15P26L78pJ43Q10J300J225R73R90J146J098Q57O76O51P95
$$ 157215 158483 159455 160270 160996 161374 161367 161510 162320 163620 164845 165818 166808 167954 169052 169909 170585 171236 172031
54352A72031J208J903K553K677K076J022M3n07p57j057j422j519j326j309j638
$$ 172031 173239 175142 177695 180372 182448 183470 183513 183006 182249 181192 179770 178251 176925 175616 173978
54337A73978j705j100n65j122k449l095k384j204o64q22j087j098p63l9P77J074
$$ 173978 172273 171173 170608 169486 167037 163942 161558 160354 159690 158868 157781 156683 155920 155881 156658 157732
54321A57732O39k2l99n47o28m75lL80L36J26J30K46K05J42K68L57O2m61p94r02
$$ 157732 158371 158349 157950 157403 156775 156300 156297 156677 157013 157139 157269 157515 157720 157862 158130 158487 158549 158088 157294 156392
54301A56392j014j073q43m28k10l05m39l48j5M04O09L30k87o66n12j93j40o4O05
$$ 156392 155378 154305 153462 153034 152824 152519 152080 151732 151717 152121 152730 153060 152773 152107 151595 151402 151262 151198 151803
54282A51803J717K348J851N70n40p84k62K70J38n17q81m76L06R14J340J742J857
$$ 151803 153520 155868 157719 158289 157749 156965 156703 156973 157111 156594 155713 155237 155543 156457 157797 159539 161396
54265A61396J351N34l8m26j052j733j751r64q7L01L84M78N13N04R23J992L045
$$ 161396 162747 163281 163243 162817 161765 160032 158281 157317 157230 157531 157915 158393 158906 159410 160333 162325 165370
54248A65370L121K132R02J61q8k53n20p44p39n39m17o13j038j348j312j015o39
$$ 165370 168491 170623 171525 171686 171598 171345 170825 170081 169342 168803 168386 167773 166735 165387 164075 163060 162421
54231A62421j84M21J068J436J275N89l76j269j725j512p08K67Q94R36N57J10j28
$$ 162421 162237 162658 163726 165162 166437 167026 166650 165381 163656 162144 161436 161703 162597 163533 164090 164200 164072
54214A64072n8K80O67P72M09k10o30n69j18M28P20N02j60p60p85k80K46M72M86
$$ 164072 164014 164294 164961 165733 166142 165932 165302 164733 164615 165043 165763 166265 166105 165345 164560 164280 164526 164998 165484
54195A65484L71M6l61m46j59Nk27l94n9L31J7q21j164n50L07N37K32J32M84P46
$$ 165484 165855 165901 165540 165094 164935 164940 164713 164319 164260 164591 164608 163787 162623 162073 162380 162917 163149 163281 163765 164511
54175A64511L90k99m62L05J352J566O05p16j290p73L26J247J443P45m74j449j683
$$ 164511 164901 164602 164140 164445 165797 167363 167968 167252 165962 165189 165515 166762 168205 168950 168476 167027 165344
54158A65344j442j266j228j020o05k68n7K68N88L47o26j586j605n99O44J351J396
$$ 165344 163902 162636 161408 160388 159783 159515 159458 159726 160314 160661 160035 158449 156844 156245 156889 158240 159636
54141A59636J110P91M81J19k40m25l56j25J82N71R20Q83L08l66m84K7N39N21J50
$$ 159636 160746 161537 162018 162137 161897 161472 161116 160991 161173 161744 162664 163547 163855 163489 163005 163032 163571 164092 164242
54122A64242J4L72R44J238J020M94J66M14J080J535J314O09O1K2K04J47o9J13
$$ 164242 164256 164628 165572 166810 167830 168324 168490 168904 169984 171519 172833 173442 173503 173525 173729 173876 173807 173920
54104A73920R14J701J660P62k25p39q86q91o46j32K17J07l2M18J289J789J541
$$ 173920 174834 176535 178195 178957 178732 177993 177107 176216 175570 175438 175655 175762 175730 176148 177437 179226 180767
54087A80767R07L40o5k61q0M43R41J185J316J489J581J474J382J627K245K984
$$ 180767 181674 182014 181949 181688 181608 182051 182992 184177 185493 186982 188563 190037 191419 193046 195291 198275
54071A98275L592M044M481N004N438N400M757L799K780J528p5j500k109k206k731
$$ 198275 201867 205911 210392 215396 220834 226234 230991 234790 237570 239098 239023 237523 235414 233208 230477
54056B30477l804m321l451j873r30r79j215r17j79M62O59M71L37P45J633K293
$$ 230477 226673 222352 218901 217028 216098 215119 213904 212987 212808 213270 213929 214400 214737 215482 217115 219408
54040B19408K300K324L427N500P111P156O168N562N940O624O759O310N848N724
$$ 219408 221708 224032 227459 232959 240070 247226 253394 258956 264896 271520 278279 284589 290437 296161
54026B96161N713N435M867M352M129M001L546K632J608R19O14L38k38j125k123
$$ 296161 301874 307309 312176 316528 320657 324658 328204 330836 332444 333363 333977 334315 334077 332952 330829
54011C30829l049l751m050l909l595l493l685l931m043m095m134l947l319k358
$$ 330829 327780 324029 319979 316070 312475 308982 305297 301366 297323 293228 289094 285147 281828 279470
53997B79470j406p03l54l97o85q29o62o89j541k998l947l643k629k034k211k486
$$ 279470 278064 277361 277007 276610 275925 275096 274434 273745 272204 269206 265259 261616 258987 256953 254742 252256
53981B52256k192j508j121j404k126k824l176l051k479j719j177j038j046q03
$$ 252256 250064 248556 247435 246031 243905 241081 237905 234854 232375 230656 229479 228441 227395 226592
53967B26592k60K51M82M75L24J3l37l91n7K60J61j12Q8R67K045K740K881K618
$$ 226592 226332 226583 227065 227540 227864 227877 227540 227149 227092 227352 227513 227401 227489 228456 230501 233241 236122 238740
53949B38740K123J546J076Q97J144J845K744L354L464L448L773M271M400M184
$$ 238740 240863 242409 243485 244382 245526 247371 250115 253469 256933 260381 264154 268425 272825 277009
53935B77009M293N000N636N544N084N096N726O383O756P173P877Q641R344J0416
$$ 277009 281302 286302 291938 297482 302566 307662 313388 319771 326527 333700 341577 350218 359562 369978
53921C69978J2182J4063J4976J4470J3032J1269R311P240N503M468L750K610J008
$$ 369978 382160 396223 411199 425669 438701 449970 459281 466521 472024 476492 480242 482852 483860
53908D83860k40m89l8L66L58Pn94j363k016k281k254k287k598l199m042m942n567
$$ 483860 483620 483131 483093 483459 483817 483824 483230 481867 479851 477570 475316 473029 470431 467232 463190 458248 452681
53891D52681n834o191p049q087q646q656q588q571q188p336o570o301o238n977
$$ 452681 446847 440656 433607 425520 416874 408218 399630 391059 382871 375535 368965 362664 356426 350449
53877C50449n643n514n398m932m271l981m339n131n986o585o643o050n021l900
$$ 350449 344806 339292 333894 328962 324691 320710 316371 311240 305254 298669 292026 285976 280955 277055
53863B77055k917k259k139k477k753k567k225k350k975l479l391k856k210j605
$$ 277055 274138 271879 269740 267263 264510 261943 259718 257368 254393 250914 247523 244667 242457 240852
53849B40852j129r82j155j279j115r59j231j743j808j114j54L28J05m97j056j318
$$ 240852 239723 238741 237586 236307 235192 234233 233002 231259 229451 228337 228183 228511 228616 228119 227063 225745
53833B25745j176p58m47m91n95k97K96O07N21O49J305J823J503P74O83J372J981
$$ 225745 224569 223811 223364 222873 222278 221981 222277 222884 223405 224054 225359 227182 228685 229459 230142 231514 233495
53816B33495J992J822J874J824J339Q41R28J464J832J881K038K632L565M570N439
$$ 233495 235487 237309 239183 241007 242346 243187 244115 245579 247411 249292 251330 253962 257527 262097 267536
53801B67536O008O243O328O404O317N886N336N145N434N703N322M161K774J958
$$ 267536 273544 279787 286115 292519 298836 304722 310058 315203 320637 326340 331662 335823 338597 340555
53787C40555K005K373K286J640R97O79L08m66j297j706j998k906m427n597n670
$$ 340555 342560 344933 347219 348859 349856 350535 350843 350377 349080 347374 345376 342470 338043 332446 326776
53772C26776m995m507m579m777m615m205m053m365m746m648m016l325l052l275
$$ 326776 321781 317274 312695 307918 303303 299098 295045 290680 285934 281286 277270 273945 270893 267618
53758B67618l760m232m466m312l773k979k044j161p03r34j552j926j861j753j806
$$ 267618 263858 259626 255160 250848 247075 244096 242052 240891 240188 239254 237702 235776 233915 232162 230356
53743B30356j577o99L53O59j03j381k303k269j254R8Q59P08L49O62J641K510K715
$$ 230356 228779 228080 228433 229092 228989 227608 225305 223036 221782 221880 222739 223447 223796 224458 226099 228609 231324
53726B31324K405J989J661J360Q99J46o71j014o42L6N14Q27J224J503J300Q56
$$ 231324 233729 235718 237379 238739 239638 239784 239113 238099 237457 237493 238007 238834 240058 241561 242861 243717
53710B43717Q57J395J891K001K108K577L137L324L113K753K368J981J763J921
$$ 243717 244574 245969 247860 249861 251969 254546 257683 261007 264120 266873 269241 271222 272985 274906
53696B74906K457L188L867M249M213L891L435K687J438K6p38m59L40Q04N75r6
$$ 274906 277363 280551 284418 288667 292880 296771 300206 302893 304331 304357 303619 303160 303500 304304 304879 304783
53680C04783p59j064r16n81m62o16o49k40M54R72J016N86o9n64o73o52r42j506
$$ 304783 304024 302960 302044 301463 301001 300385 299736 299496 299950 300922 301938 302524 302455 301891 301218 300566 299624 298118
53662B98118j786j466r08n84n06n09p02j148j373q46J51O83L27l12m25J6L94K89
$$ 298118 296332 294866 293958 293374 292868 292359 291657 290509 289136 288290 288441 289124 289451 289139 288714 288730 289124 289413
53644B89413j36m58l93Q9Q09J427J688J775K126K795L100K385J003J38M82J460
$$ 289413 289277 288819 288426 288515 289324 290751 292439 294214 296340 299135 302235 304620 305623 305761 306243 307703
53628C07703K015J817J349J101J183J576K213K780K911K705K713L246M001M495
$$ 307703 309718 311535 312884 313985 315168 316744 318957 321737 324648 327353 330066 333312 337313 341808
53614C41808M570M376M147M109M358M709M858M751M579M398M128L922M114M691
$$ 341808 346378 350754 354901 359010 363368 368077 372935 377686 382265 386663 390791 394713 398827 403518
53600D03518N165N120M545L551K248J042M70M51K41n02j136j076q49j400k626
$$ 403518 408683 413803 418348 421899 424147 425189 425659 426110 426351 425849 424713 423637 422788 421388 418762
53585D18762l399l068k185j674j842k359k751k688k197j740j785k174k288j918
$$ 418762 415363 412295 410110 408436 406594 404235 401484 398796 396599 394859 393074 390900 388612 386694
53571C86694j573j686j984j932j495j031o77k76J82M56N23P14J184J519J203L88
$$ 386694 385121 383435 381451 379519 378024 376993 376316 376040 376222 376678 377201 377915 379099 380618 381821 382209
53555C82209j56K4N01N27M6k29K84J424K614L446L720L264K155R53L39M83J074
$$ 382209 382053 382077 382578 383105 383151 382922 383206 384630 387244 390690 394410 397674 399829 400782 401121 401604 402678
53538D02678J879K879L879M479M613M790N510O706P961Q975R672J0011J0111J0328
$$ 402678 404557 407436 411315 415794 420407 425197 430707 437413 445374 454349 464021 474032 484143 494471
53524D94471J0866J1449J1683J1623J1659J1978J2489J3196J4177J5252J6155
$$ 494471 505337 516786 528469 540092 551751 563729 576218 589414 603591 618843 634998
53513F34998J7108J8598K0486K1994K2781K3391K4176K4563K4068K3426K3694
$$ 634998 652106 670704 691190 713184 735965 759356 783532 808095 832163 855589 879283
53502H79283K4621K5016K4536K3951K3563K2744K1428K0712K1163K1583K0601
$$ 879283 903904 928920 953456 977407 1000970 1023714 1045142 1065854 1087017 1108600 1129201
53491A129201J8720J7565J7644J8083J8243J8313J8353J8035J7571J7732J8531
$$ 1129201 1147921 1165486 1183130 1201213 1219456 1237769 1256122 1274157 1291728 1309460 1327991
53480A327991J8870J8095J6985J6547J6530J5907J4349J2382J0406Q284N837L184
$$ 1327991 1346861 1364956 1381941 1398488 1415018 1430925 1445274 1457656 1468062 1476346 1482183 1485367
53468A485367N23k011m283o202p883r533j1204j2741j3876j4362j4308j4338j5052
$$ 1485367 1485890 1483879 1479596 1473394 1465511 1455978 1444774 1432033 1418157 1403795 1389487 1375149 1360097
53455A360097j6217j6947j6950j6989j7821j9164k0188k0539k0334j9681j8871
$$ 1360097 1343880 1326933 1309983 1292994 1275173 1256009 1235821 1215282 1194948 1175267 1156396
53444A156396j8613j9189j9569j8321j5437j2414j0407r076p615o042m932m396
$$ 1156396 1137783 1118594 1099025 1080704 1065267 1052853 1042446 1033370 1025755 1019713 1014781 1010385
53432A010385l986l375k551j485l1J755L518M860N605N941O431P663R680J1816
$$ 1010385 1006399 1003024 1000473 998988 998957 1000712 1004230 1009090 1014695 1020636 1027067 1034730 1044410 1056226
53418A056226J3377J4388J5475J7058J8895K0499K1776K3081K4727K6561K8137
$$ 1056226 1069603 1083991 1099466 1116524 1135419 1155918 1177694 1200775 1225502 1252063 1280200
53407A280200K9240L0124L1251L2890L5030L7503L9985M2040M3461M4626M6196
$$ 1280200 1309440 1339564 1370815 1403705 1438735 1476238 1516223 1558263 1601724 1646350 1692546
53396A692546M8340N0483N1994N2915N3731N4613N5221N5318N5187N5224N5323
$$ 1692546 1740886 1791369 1843363 1896278 1950009 2004622 2059843 2115161 2170348 2225572 2280895
53385B280895N4903N3595N1684M9754M7986M5922M3028L9394L5685L2358K9132
$$ 2280895 2335798 2389393 2441077 2490831 2538817 2584739 2627767 2667161 2702846 2735204 2764336
53374B764336K5410K1099J6645J2305P793K821k384p539j2937j9034k5517l1409
$$ 2764336 2789746 2810845 2827490 2839795 2847588 2850409 2848025 2840486 2827549 2808515 2782998 2751589
53362B751589l6222m0395m4279m7377m9066m9677n0183n0976n1550n1323n0253
$$ 2751589 2715367 2674972 2630693 2583316 2534250 2484573 2434390 2383414 2331864 2280541 2230288
53351B230288m8602m6648m4716m3183m2263m1999m2339m2916m3016m2241m1026
$$ 2230288 2181686 2135038 2090322 2047139 2004876 1962877 1920538 1877622 1834606 1792365 1751339
53340A751339l9967l8748l6615l3817l1686l0859l0372k9031k6928k4885k3082
$$ 1751339 1711372 1672624 1636009 1602192 1570506 1539647 1509275 1480244 1453316 1428431 1405349
53329A405349k1094j9016j7543j6945j6669j6137j5368j4719j4372j4218j4004
$$ 1405349 1384255 1365239 1347696 1330751 1314082 1297945 1282577 1267858 1253486 1239268 1225264
53318A225264j3547j2958j2566j2373j1823j0421q358o204m157k070l0J603K688
$$ 1225264 1211717 1198759 1186193 1173820 1161997 1151576 1143218 1137014 1132857 1130787 1130757 1132360 1135048
53305A135048L417L996M619N687P536R883J2022J3665J5158J6799J8391J9653
$$ 1135048 1138465 1142461 1147080 1152767 1160303 1170186 1182208 1195873 1211031 1227830 1246221 1265874
53293A265874K0725K2003K3636K5392K6820K7543K7496K6940K6131K5098K3892
$$ 1265874 1286599 1308602 1332238 1357630 1384450 1411993 1439489 1466429 1492560 1517658 1541550
53282A541550K2706K1465J9609J6777J3531J0734Q322N442J800j828m717p053
$$ 1541550 1564256 1585721 1605330 1622107 1635638 1646372 1654694 1660136 1661936 1660108 1655391 1648338
53270A648338r334j1525j3366j5011j6807j8705k0429k1989k3559k4918k5569
$$ 1648338 1639004 1627479 1614113 1599102 1582295 1563590 1543161 1521172 1497613 1472695 1447126
53259A447126k5454k5207k5537k6535k7662k8295k8302k8054k7844k7452k6528
$$ 1447126 1421672 1396465 1370928 1344393 1316731 1288436 1260134 1232080 1204236 1176784 1150256
53248A150256k5356k4740k4963k5339k5086k4309k3697k3506k3366k2957k2422
$$ 1150256 1124900 1100160 1075197 1049858 1024772 1000463 976766 953260 929894 906937 884515
53237H84515k2054k1914k1787k1299k0099j8240j6287j4742j3440j1860j0068
$$ 884515 862461 840547 818760 797461 777362 759122 742835 728093 714653 702793 692725
53226F92725q872q839r585j0348j0957j1757j2786j3533j3627j3353j3162j3085
$$ 692725 683853 675014 665429 655081 644124 632367 619581 606048 592421 579068 565906 552821
53214E52821j2856j2497j2328j2447j2552j2316j1653j0584r241q127p866q386
$$ 552821 539965 527468 515140 502693 490141 477825 466172 455588 446347 438220 430354 421968
53202D21968q740q166p061o461o722p248p392p085o592o169o035o136n961n029
$$ 421968 413228 405062 398001 391540 384818 377570 370178 363093 356501 350332 344297 338161 332200 327171
53188C27171l728l020l169l314k741j943j867k530l063k904k328j782j331r15
$$ 327171 323443 320423 317254 313940 311199 309256 307389 304859 301796 298892 296564 294782 293451 292536
53174B92536o69q29j474k422l269l499k802j389J52J178J235K29j314k357k226
$$ 292536 291867 291038 289564 287142 283873 280374 277572 276183 276335 277513 278748 278977 277663 275306 273080
53159B73080j363q74j212j703j461m43N89Q75K76p43j499j601j275j079j269j530
$$ 273080 271717 270843 269631 267928 266467 266024 266613 267488 267764 267021 265522 263921 262646 261567 260298 258768
53143B58768j483j167q87o88l58J92P85J264J598J664J234L45n08q01n17j06Q2
$$ 258768 257285 256118 255231 254543 254185 254377 255162 256426 258024 259688 260922 261267 260759 259958 259441 259335 259417
53126B59417J28L64R46J647J979J636Q65L03L46Q04J227J414J359R98L67j61k89
$$ 259417 259545 259909 260855 262502 264481 266117 266982 267285 267631 268435 269662 271076 272435 273433 273800 273639 273350
53109B73350l27p78j437j510q54l61p22j440j623j263j012j049r71o65n15o67
$$ 273350 273023 272245 270808 269298 268444 268083 267361 265921 264298 263035 262023 260974 260003 259338 258823 258156
53093B58156q03p66q09r83r53o23m48p30j000o17L08R25N74n27j470j435m41O68
$$ 258156 257353 256587 255778 254795 253842 253219 252771 252041 251041 250424 250732 251657 252231 251704 250234 248799 248358 249026
53075B49026J152J148J236J403J031M4p30o56k07j85n06m65L3K80j73r37j483
$$ 249026 250178 251326 252562 253965 254996 255040 254310 253654 253447 253262 252756 252291 252324 252604 252431 251494 250011
53058B50011j847k236k378j778n45N46R73J046J332J789J859J313M79k95r14j106
$$ 250011 248164 245928 243550 241772 241227 241773 242746 243792 245124 246913 248772 250085 250564 250269 249355 248249
53042B48249m44P54J229J87j458k086j402n73m12m69q9N28Q45P93N42O9m98o09
$$ 248249 247805 248559 249788 249975 248517 246431 245029 244456 244044 243575 243486 244014 244859 245652 246194 246263 245765 245156
53024B45156K9Q95J260J096R22J079J529K046K190J464k0j332j685j271p86m65
$$ 245156 245185 246080 247340 248436 249358 250437 251966 254012 256202 257666 257646 256314 254629 253358 252572 252107
53008B52107j56K6j51m38l17K18O82Q16P57O01L39J56K58M35L17J6m0J80K76J89
$$ 252107 251951 251977 251826 251388 251071 251289 251971 252787 253544 254145 254484 254640 254898 255333 255650 255666 255626 255806 256082 256271
52988B56271L00P06R78Q81Q10J172J783K162K166K003J879J813J744J658J596
$$ 256271 256571 257277 258255 259136 259946 261118 262901 265063 267229 269232 271111 272924 274668 276326 277922
52973B77922J642J764J731J364P63J88k23m07k85O5K95J94N5K32N11L80j92p16
$$ 277922 279564 281328 283059 284423 285186 285374 285151 284744 284459 284524 284819 285013 285068 285300 285811 286191 285999 285283
52955B85283r03r38j042j232j523j904k016j442m64Nm99j406j884j807j565j269
$$ 285283 284380 283442 282400 281168 279645 277741 275725 274283 273819 273824 273325 271919 270035 268228 266663 265394
52939B65394o88J41O44K96o51j308j140o81r31j918k454j577J30J285J315P08
$$ 265394 264706 264847 265491 265787 265136 263828 262688 262007 261076 259158 256704 255127 255257 256542 257857 258565
52923B58565o7r02j409r85J88J054J044Q19J166J781J745P38p40k032k680k487
$$ 258565 258498 257596 256187 255202 255390 256444 257488 258307 259473 261254 262999 263737 262997 260965 258285 255798
52907B55798j744j157j090j112p14j53l4l78o77p63q77r96o82J63R90J321J311
$$ 255798 254054 252897 251807 250695 249981 249828 249794 249416 248739 247976 247099 246103 245421 245584 246574 247895 249206
52890B49206J327J312J006N46M26P72J069P83N0n45p32p74q94r02n60n5K45L08
$$ 249206 250533 251845 252851 253397 253823 254595 255664 256447 256497 255952 255220 254446 253552 252650 252090 252035 252280 252588
52872B52588L69N17P24J104J722K202K056J443J077J330J810J951J559P55q0k22
$$ 252588 252957 253474 254198 255302 257024 259226 261282 262725 263802 265132 266942 268893 270452 271207 271127 270905
52856B70905Q01K292K706J369o76k031k555k997l571l774l383k758k144j450q57
$$ 270905 271706 273998 276704 278073 277397 275366 272811 269814 266243 262469 259086 256328 254184 252734 251877
52841B51877q99j640k312k210j562j119j135j186r55o73o49o88l68K49N30J04
$$ 251877 250978 249338 247026 244816 243254 242135 241000 239814 238859 238186 237537 236849 236481 236730 237260 237364
52825B37364n63p31l88k32o45j149j082n15j14j98j96P43K626M198L992J945l10
$$ 237364 236801 236070 235682 235450 234805 233656 232574 232059 231945 231747 231551 232294 234920 239118 243110 245055 244745
52808B44745j046j62J060J546J204L99n17j112j142j056j502k150j930p43R7l25
$$ 244745 243699 243537 244597 246143 247347 247746 247229 246117 244975 243919 242417 240267 238337 237594 237691 237366
52792B37366j186j229n79k34l99m35j76r4k32j8P72J654K131K085J451K97p78
$$ 237366 236180 234951 234372 234138 233739 233304 233128 233034 232802 232784 233556 235210 237341 239426 240877 241174 240396
52775B40396j102q48p72r54o41M08J275J086J28o96j006j008q67n75k67j45j95
$$ 240396 239294 238446 237674 236720 236079 236487 237762 238848 238976 238280 237274 236266 235399 234824 234557 234412 234217
52758B34217k14p8J66L44J92l76r70r59j89P76J301J340J285J378J491J409J148
$$ 234217 234003 233925 234091 234435 234627 234251 233281 232322 232133 232909 234210 235550 236835 238213 239704 241113 242261
52741B42261R70J091J388J573J649J940K458K600J962J073Q18J254J668J658J524
$$ 242261 243231 244322 245710 247283 248932 250872 253330 255930 257892 258965 259783 261037 262705 264363 265887
52726B65887J532J494J212P70J79o69j543j838j314m93j30n91j689k773k992k147
$$ 265887 267419 268913 270125 270895 271074 270405 268862 267024 265710 265217 265087 264496 262807 260034 257042 254895
52710B54895j195j180j730j562m78K67k5l99Q5P88O46k0p3N90J116J233J441J757
$$ 254895 253700 252520 250790 249228 248750 249017 248992 248593 248678 249466 250112 250092 250019 250609 251725 252958 254399 256156
52692B56156J503N73j45N1Q26J441J546J143L90k93m61k72m05j148j992k285j911
$$ 256156 257659 258232 258087 258138 258964 260405 261951 263094 263484 263191 262730 262458 262053 260905 258913 256628 254717
52675B54717j170m17k7k18p57j117j059p24j93N72J285J439J053P55R23J205J165
$$ 254717 253547 253130 253103 252885 252128 251011 249952 249228 249035 249607 250892 252331 253384 254139 255062 256267 257432
52658B57432R09P83Q58J081J499K079K575K860L015K848J878J36j447j948j474
$$ 257432 258341 259124 259982 261063 262562 264641 267216 270076 273091 275939 277817 277953 276506 274558 273084
52643B73084q03l97k54m10q89j344j329r21n34k46J55N04L51j53j28R29K398L211
$$ 273084 272281 271884 271630 271220 270331 268987 267658 266737 266203 265957 266112 266616 266967 266814 266686 267615 270013 273224
52625B73224K988K160J247M40k20o10o15l49k12n95j399j988j827j160p40q38
$$ 273224 276212 278372 279619 280059 279839 279229 278614 278265 278053 277458 276059 274071 272244 271084 270344 269506
52609B69506r57o32j68k06q22j426j425o94M48J402J567Q95J37J90J045J795J792
$$ 269506 268549 267917 267749 267543 266721 265295 263870 263176 263624 265026 266593 267488 267625 267815 268860 270655 272447
52592B72447J391J241J240P69j71o90j42R48J475J086M98M90R84J299J023M11
$$ 272447 273838 275079 276319 277088 276917 276227 276085 277033 278508 279594 280092 280582 281566 282865 283888 284299
52576B84299n1j89k27m25p59r48q23n47m23m98n76n76o35q00q33n37q5K03K36
$$ 284299 284248 284059 283832 283407 282648 281700 280877 280330 279907 279409 278833 278257 277622 276822 275989 275452 275367 275570 275806
52557B75806Q9l05j038j855k248j965j212l47L15N06J42l70m57j17O2j99m25j83
$$ 275806 275895 275590 274552 272697 270449 268484 267272 266925 267240 267746 267888 267518 267061 266944 267006 266807 266382 266199
52539B66199J94J61p2J82R95J655J642J201Q02N29K28q4k33j17K53P75J213J334
$$ 266199 266393 266554 266482 266664 267659 269314 270956 272157 272959 273488 273716 273632 273399 273282 273535 274310 275523 276857
52521B76857J136P50J85n25r75o77K17R58J201J413K010K565K432J810J535J944
$$ 276857 277993 278743 278928 278403 277428 276751 276968 277926 279127 280540 282550 285115 287547 289357 290892 292836
52505B92836K464K386J609N47l43q48j093j421j971k415k328j829j500j610j742
$$ 292836 295300 297686 299295 299842 299499 298651 297558 296137 294166 291751 289423 287594 286094 284484 282742
52490B82742j395o74j16L0O5L09N87M41j78p19p08m01m01o73m86N20J696K143
$$ 282742 281347 280673 280557 280587 280652 280961 281548 281989 281811 281092 280384 279983 279582 278909 278423 278943 280639 282782
52472B82782J771J158P07M53N10J041J792K207K154K056K193K324K167J841J558
$$ 282782 284553 285711 286418 286871 287381 288422 290214 292421 294575 296631 298824 301148 303315 305156 306714
52457C06714J275R01N46K66k11j098k140k839l102l307l743m112l769k451p98
$$ 306714 307989 308890 309436 309702 309491 308393 306253 303414 300312 297005 293262 289150 285381 282930 282132
52442B82132M9m36j534j982j341l31R7k67r50j356j155m65J34N4n22o93M5J043
$$ 282132 282181 281745 280211 278229 276888 276557 276654 276387 275437 274081 272926 272461 272595 272649 272127 271434 271479 272522
52424B72522J230M71k81j32Q05J684J847J349P51N30P11J023J315J691K232K853
$$ 272522 273752 274223 273942 273810 274615 276299 278146 279495 280246 280776 281487 282510 283825 285516 287748 290601
52408B90601L421L920M471N361O942R100J0839J0858Q878N945L281J086j081l221
$$ 290601 294022 297942 302413 307774 314716 323816 334655 345513 354391 360336 363617 364703 363622 360401
52394C60401m699n089m761m476m650m963m736l736k601k128k222k030j188l06
$$ 360401 355702 350613 345852 341376 336726 331763 327027 323291 320690 318562 316340 314310 313122 312816
52380C12816Q6L24Q29J267J284J473K575M011M447L710L055L314L925M106L955
$$ 312816 312902 313226 314055 315322 316606 318079 320654 324665 329112 332822 335877 339191 343116 347222 351177
52365C51177L758L190K014R04O48R16O56m36j556j907j484p20P4P48J132J150
$$ 351177 354935 358125 360139 361043 361691 362607 363263 362827 361271 359364 357880 357160 357234 357982 359114 360264
52349C60264R49Q37J063J610K143K308K147K045K170K238K059K018K676M033N502
$$ 360264 361213 362050 363113 364723 366866 369174 371321 373366 375536 377774 379833 381851 384527 388560 394062
52334C94062O560P143P487P835Q304Q842R349R908J0820J2209J3773J5093J6020
$$ 394062 400622 407765 415252 423087 431391 440233 449582 459490 470310 482519 496292 511385 527405
52321E27405J6649J7069J7327J7477J7421J6956J6208J5777J6082J6773J7246
$$ 527405 544054 561123 578450 595927 613348 630304 646512 662289 678371 695144 712390
52310G12390J7462J7826J8382J8735J8743J8711J8753J8554J7927J7149J6494
$$ 712390 729852 747678 766060 784795 803538 822249 841002 859556 877483 894632 911126
52299I11126J5894J5322J4982J4764J3903J1836R037O525M594K696M53j755l448
$$ 911126 927020 942342 957324 972088 985991 997827 1006864 1013389 1017983 1020679 1021132 1019377 1015929
52286A015929m684n752o568o861o752o653o631o250n242l985k996k206j060O30
$$ 1015929 1011245 1005493 998925 992064 985312 978659 972028 965778 960536 956551 953555 951349 950289 950919
52272I50919K387L706M709N844P183Q330Q989R294R559J0011J0797J1957J3237
$$ 950919 953306 957012 961721 967565 974748 983078 992067 1001361 1010920 1020931 1031728 1043685 1056922
52259A056922J4101J4232J3878J3648J3934J4616J5272J5545J5380J4908J4127
$$ 1056922 1071023 1085255 1099133 1112781 1126715 1141331 1156603 1172148 1187528 1202436 1216563
52248A216563J2816J0893Q747O862N145K989K33k357l880m394m737n412o038o078
$$ 1216563 1229379 1240272 1249019 1255881 1261026 1264015 1264248 1261891 1258011 1253617 1248880 1243468 1237430 1231352
52234A231352n672n510o036o983p737p967p847p712p566p112o257n376m880m690
$$ 1231352 1225680 1220170 1214134 1207151 1199414 1191447 1183600 1175888 1168322 1161210 1154953 1149577 1144697 1140007
52220A140007m350l624k739j967j268m69M01J147J725K360L285M450N531O238
$$ 1140007 1135657 1132033 1129294 1127327 1126059 1125590 1125991 1127138 1128863 1131223 1134508 1138958 1144489 1150727
52206A150727O532O507O149N462M842M913N750O544O465N747N461O219P521Q461
$$ 1150727 1157259 1163766 1169915 1175377 1180219 1185132 1190882 1197426 1203891 1209638 1215099 1221318 1228839 1237300
52192A237300Q678Q343P705O929O167N402M388L008J580N21k14j037k244l774
$$ 1237300 1245978 1254321 1262026 1268955 1275122 1280524 1284912 1287920 1289500 1290021 1289807 1288770 1286526 1282752
52178A282752n437p047q408r353r882j0071r942r462q660p638o527n548m894m417
$$ 1282752 1277315 1270268 1261860 1252507 1242625 1232554 1222612 1213150 1204490 1196852 1190325 1184777 1179883 1175466
52164A175466l637k282o38Q65K133L193L739L364K108M30j218k367k431j278J47
$$ 1175466 1171829 1169547 1168909 1169774 1171907 1175100 1178839 1182203 1184311 1184741 1183523 1181156 1178725 1177447 1177594
52149A177594O04M3l82J9N54L42l30n48j89K0l47r11j217j328j500j644j391n41
$$ 1177594 1178198 1178241 1177859 1177878 1178432 1178774 1178444 1177896 1177707 1177727 1177380 1176469 1175252 1173924 1172424 1170780 1169389 1168848
52131A168848O41J694K495L504N298P853J0562J3021J5414J7967K0389K2166K3181
$$ 1168848 1169489 1171183 1173678 1177182 1182480 1190333 1200895 1213916 1229330 1247297 1267686 1289852 1313033
52118A313033K3725K4133K4625K5253K5669K5364K4346K3282K2588K1835K0517
$$ 1313033 1336758 1360891 1385516 1410769 1436438 1461802 1486148 1509430 1532018 1553853 1574370
52107A574370J8933J7653J6512J4962J3202J2054J1724J1546J1045J0409R744
$$ 1574370 1593303 1610956 1627468 1642430 1655632 1667686 1679410 1690956 1702001 1712410 1722154
52096A722154Q653O816M296J102k794o705r388j0472j1114j2571j4672j6284j6740
$$ 1722154 1730807 1737623 1741919 1743021 1740227 1733522 1724134 1713662 1702548 1689977 1675305 1659021 1642281
52083A642281j6178j4942j3342j1753j0333q855p296o191n787n296l759j361R46
$$ 1642281 1626103 1611161 1597819 1586066 1575733 1566878 1559582 1553391 1547604 1542308 1538549 1537188 1538134
52070A538134K916N107P611R653J0735J1291J1888J2472J2839J3168J3599J3813
$$ 1538134 1541050 1546157 1553768 1563421 1574156 1585447 1597335 1609807 1622646 1635814 1649413 1663226
52058A663226J3514J3002J2786J2908J2974J2594J1466R390O589L775J460o27
$$ 1663226 1676740 1689742 1702528 1715436 1728410 1741004 1752470 1761860 1768449 1772224 1773684 1773057
52046A773057l086n974q790j1170j3153j4865j6297j7445j8333j8901j9059j8899
$$ 1773057 1769971 1763997 1755207 1744037 1730884 1716019 1699722 1682277 1663944 1645043 1625984 1607085
52034A607085j8543j7879j6750j5424j4512j4310j4452j4346j3784j2994j2314
$$ 1607085 1588542 1570663 1553913 1538489 1523977 1509667 1495215 1480869 1467085 1454091 1441777
52023A441777j1918j1778j1719j1579j1324j0974j0519r942r376r010q882q921
$$ 1441777 1429859 1418081 1406362 1394783 1383459 1372485 1361966 1352024 1342648 1333638 1324756 1315835
52011A315835r114r482r894j0230j0770j2106j4373j6834j8486j9031j9115j9599
$$ 1315835 1306721 1297239 1287345 1277115 1266345 1254239 1239866 1223032 1204546 1185515 1166400 1146801
51999A146801k0750k2101k2914k2773k1852k0566j9106j7448j5880j5112j5522
$$ 1146801 1126051 1103950 1081036 1058263 1036411 1015845 996739 979291 963411 948299 932777
51988I32777j6523j7075j6857j6471j6539j6972j7331j7455j7414j7184j6782
$$ 932777 916254 899179 882322 865851 849312 832340 815009 797554 780140 762956 746174
51977G46174j6475j6437j6318j5581j4280j3024j2113j1105r462p264m996k879
$$ 746174 729699 713262 696944 681363 667083 654059 641946 630841 621379 614115 609119 606240
51965F06240q05J217K892L996M611M974N215N283M970M021K299pk397m331n466
$$ 606240 605435 606652 609544 613540 618151 623125 628340 633623 638593 642614 644913 644906 642509 638178 632712
51950F32712n815n737n696n745n315l804j440P45K019K835M245O565Q960J0462
$$ 632712 626897 621160 615464 609719 604404 600600 599160 599905 601924 604759 609004 615569 624529 634991
51936F34991J1020J1331J1805J2084J1523R886P450M620J663j210l758n806p408
$$ 634991 646011 657342 669147 681231 692754 702640 710090 714710 716373 715163 711405 705599 698191
51923F98191q799j0143j1354j2180j2478j2316j1764j0650q682n928l007o76Q73
$$ 698191 689392 679249 667895 655715 643237 630921 619157 608507 599825 593897 590890 590214 591087
51910E91087K136L633N154N864N245L731K237J133O1j210k207k427k262k672m005
$$ 591087 593223 596856 602010 607874 613119 616850 619087 620220 620281 619071 616864 614437 612175 609503 605498
51895F05498n714p334r075j1065j2671j3156j2727j2190j1800j1080r781q299
$$ 605498 599784 592450 583375 572310 559639 546483 533756 521566 509766 498686 488905 480606
51883D80606o971n578l824j850M7J778L288M408N254O317P806R092R314Q332O704
$$ 480606 473635 468057 464233 462383 462430 464208 467496 471904 477158 483475 491281 500373 509687 518019 524723
51868E24723M963L329J958Q89k04j751l669n365o342o448n596l797j593O9O78
$$ 524723 529686 533015 534973 535862 535658 533907 530238 524873 518531 512083 506487 502690 501097 501166 501844
51853E01844O06M46L23R2j49k29l61r81k079l139l761m047m284m593n027n651
$$ 501844 502450 502896 503219 503311 503162 502933 502572 501591 499512 496373 492612 488565 484281 479688 474661 469010
51837D69010o211o048m741k807j310o97l98K67J181J731J670J170L11r16k098
$$ 469010 462799 456751 452010 449203 447893 447196 446798 447065 448246 449977 451647 452817 453128 452212 450114
51822D50114k568k267j926k069k384k408k287k333k201j239M34J869K371K139
$$ 450114 447546 445279 443353 441284 438900 436492 434205 431872 429671 428432 428866 430735 433106 435245
51808D35245J756J506J328J030M07n27j305j348o73R9N07P38J113J470J307L79
$$ 435245 437001 438507 439835 440865 441272 440745 439440 438092 437419 437518 438025 438763 439876 441346 442653 443032
51792D43032j056k436l230l235k695k050j579j378j558k088k525k336j564p55
$$ 443032 441976 439540 436310 433075 430380 428330 426751 425373 423815 421727 419202 416866 415302 414547
51778D14547k07K47O11N41R4jQ10K223L729N379P284Q833R228Q603P873P465P007
$$ 414547 414340 414587 415198 415739 415833 415832 416642 418865 422594 427973 435257 444090 453318 461921 469794 477259 484266
51761D84266O216N356M547L325J348r66k889m231n320o351p069p104o429n480
$$ 484266 490482 495838 500385 503710 505058 504092 501203 496972 491652 485301 478232 471128 464699 459219
51747D59219m884m949n386n598n251m436l335j982l88J333L060M746O300P501
$$ 459219 454335 449386 444000 438402 433151 428715 425380 423398 423010 424343 427403 432149 438449 445950
51733D45950Q125Q121P670P060O447N659M457L091K343K697L637M096L481J976
$$ 445950 454075 462196 469866 476926 483373 489032 493489 496580 498923 501620 505257 509353 512834 514810
51719E14810M8j842l180l674l698l913m391m567m176l724l711l954l941l461k547
$$ 514810 514858 513016 509836 506162 502464 498551 494160 489593 485417 481693 477982 474028 470087 466626 464079
51704D64079j314j73K17k76r09r89q30j228k155k660k073p94K51O07N81P74J358
$$ 464079 462765 462592 462809 462533 461624 460635 459805 458577 456422 453762 451689 450895 451146 451753 452334 453108 454466
51687D54466J806J372qj622k843l724m420m572l839k716k073k035j930j340m66
$$ 454466 456272 457644 457636 456014 453171 449447 445027 440455 436616 433900 431827 429792 427862 426522 426056
51672D26056N13J742L113M140M725N487O926Q707J0153J1035J1464J1252R869
$$ 426056 426569 428311 431424 435564 440289 445776 452702 461409 471562 482597 494061 505313 515182
51659E15182P004K988j202m366n869o125n952n377l622m45L055N413O077N327
$$ 515182 522186 525174 523972 519606 513737 507612 501660 496283 492661 492216 495271 500684 506761 512088
51645E12088L458O95k459n405p866r693j0587j0506r964r381q517p194o178o285
$$ 512088 515546 516241 513782 508377 500511 490818 480231 469725 459761 450380 441863 434669 428491 422206
51631D22206o860o311m233j908m94K15P71R61N35J15M38J138J285Q03M66O48R07
$$ 422206 415346 409035 404802 402894 402400 402615 403386 404347 404882 404997 405435 406573 407858 408661 409127 409775 410682
51614D10682P76K74m15j158j687j749j534j506j704j745j485j173q28j8J453L047
$$ 410682 411458 411732 411317 410159 408472 406723 405189 403683 401979 400234 398749 397576 396748 396730 398183 401230
51598D01230M059M389M541N082O218P654Q694Q726P719O054L883J112j912m279
$$ 401230 405289 409678 414219 419301 425519 433173 441867 450593 458312 464366 468249 469361 467449 463170
51584D63170n384n468m961l733j620O95K136K645L402N397Q210J0587J1919J2717
$$ 463170 457786 452318 447357 443624 442004 442699 444835 447480 450882 456279 464489 475076 486995 499712
51570D99712J3773J5282J6897J8307J9440K0101J9897J8848J7935J8520K1087
$$ 499712 513485 528767 545664 563971 583411 603512 623409 642257 660192 678712 699799
51559F99799K4814K8600L2070L5245L7591L8019L5904L1605K5845J9004J1264
$$ 699799 724613 753213 785283 820528 858119 896138 932042 963647 989492 1008496 1019760
51548A019760L081m897j2272j8970k4894k9717l3119l5078l5864l5744l4885l3486
$$ 1019760 1022841 1017944 1005672 986702 961808 932091 898972 863894 828030 792286 757401 723915
51536G23915l1898l0288k8284k5307k1450j7726j5115j3573j2352j1074r899q773
$$ 723915 692017 661729 633445 608138 586688 568962 553847 540274 527922 516848 506949 498176
51524D98176p295n543m397m469n184n426m765l543k055l88J071J700J451R82Q37
$$ 498176 490881 485338 480941 476472 471288 465862 461097 457554 455499 455111 456182 457882 459333 460315 461152
51509D61152Q45O52K78j49q36k037l492m545m781m280l409k604k205k223k304
$$ 461152 461997 462649 462927 462778 461942 459905 456413 451868 447087 442807 439398 436794 434589 432366 430062
51494D30062k154j900j792j727j431j015q59r75r40o14m62r09j679k118k003j730
$$ 430062 427908 426008 424216 422489 421058 420043 419184 418209 417269 416655 416193 415284 413605 411487 409484 407754
51478D07754j767k185k708l075l259l346l266k848k266k192l115m482n002m059
$$ 407754 405987 403802 401094 398019 394760 391414 388148 385300 383034 380842 377727 373245 368243 364184
51464C64184k396j168o71l97K4M74Q12J120J399J472J325J181J190J312J573K097
$$ 364184 361788 360620 359949 359552 359576 360050 360862 361982 363381 364853 366178 367359 368549 369861 371434 373531
51448C73531K753L184L396L998N528P707R728J1120J1996J2507J2411J1358R409
$$ 373531 376284 379468 382864 386862 392390 400097 409825 420945 432941 445448 457859 469217 478626
51435D78626P029M698K599Q07n13j297j877k824m304n834o813p141p082o756o098
$$ 478626 485655 490353 492952 493759 493246 491949 490072 487248 482944 477110 470297 463156 456074 449318 443220
51420D43220n249m580m252m009l454k369r12L07N85l6m80J91J523K198J860J487
$$ 443220 437971 433391 429139 425130 421676 419307 418395 418702 419287 419251 418771 418962 420485 422683 424543 426030
51404D26030J751K007J483O47N50J311K223K923L552L934L636K834K376K736L621
$$ 426030 427781 429788 431271 431918 432468 433779 436002 438925 442477 446411 450047 452881 455257 457993 461614
51389D61614M613N614O586P559R103J2009J6239K0807K5016K9142L3641L8381
$$ 461614 466227 471841 478427 485986 495089 507098 523337 544144 569160 598302 631943 670324
51377F70324M3097M7839N2345N5433N5786N3104M7963M0923L2390K3044J3564
$$ 670324 713421 761260 813605 869038 924824 977928 1025891 1066814 1099204 1122248 1135812
51366A135812M022n830j5666k4584l2020l8035m2696m5753m7112m7144m6217m4371
$$ 1135812 1139834 1134004 1118338 1093754 1061734 1023699 981003 935250 888138 840994 794777 750406
51354G50406m1673l8474l5077l1474k7720k4225k1280j8630j5837j3006j0689
$$ 750406 708733 670259 635182 603708 575988 551763 530483 511853 496016 483010 472321
51343D72321r188q309p763p493p407p203o650n938n433n132m639l723k787k487
$$ 472321 463133 454824 447061 439568 432161 424958 418308 412370 406937 401805 397166 393443 390656 388169
51329C88169k990l764m107l746k885j866r61l29KJ28J00j21n00p69o21l3P76J647
$$ 388169 385179 381415 377308 373562 370677 368811 367850 367521 367523 367651 367751 367630 367130 366361 365740 365707 366483 368130
51311C68130K487L054L025K420J748J575K011K685L104K917K063Q63q2l76l10
$$ 368130 370617 373671 376696 379116 380864 382439 384450 387135 390239 393156 395219 396082 396000 395624 395314
51296C95314o50j801l293m275m463m302m234m069l415k387j533j034m69N13J655
$$ 395314 394664 392863 389570 385295 380832 376530 372296 368227 364812 362425 360892 359858 359389 359902 361557
51281C61557K476K905L238L660M124M517M595L973K606J211O92J049J319Q36J34
$$ 361557 364033 366938 370176 373836 377960 382477 387072 391045 393651 394862 395554 396603 397922 398758 398892
51266C98892K48J376K679L276L111K724K416J891P34r07k283k776k556k354k661
$$ 398892 399140 400516 403195 406471 409582 412306 414722 416613 417347 416440 414157 411381 408825 406471 403810
51251D03810l308l760l619k882j937j321j214j218q48k56l3l43p05q12j001j541
$$ 403810 400502 396742 393123 390241 388304 386983 385769 384551 383703 383447 383414 383071 382366 381554 380553 379012
51235C79012j984j803j267r85q84m46J02j40j267k042j524m89l87j283j842j253
$$ 379012 377028 375225 373958 372973 372089 371643 371745 371605 370338 368296 366772 366283 365896 364613 362771 361518
51219C61518j51O20J290K451L678L809K540R69L25P00J386J952K493L028L281
$$ 361518 361367 361987 363277 365728 369406 373215 375755 376724 377049 377749 379135 381087 383580 386608 389889
51204C89889L107K744K464K269K108K052K060J790J010P1l79k25n5l85r97j331
$$ 389889 392996 395740 398204 400473 402581 404633 406693 408483 409493 409564 409185 408960 408905 408520 407523 406192
51188D06192j324j408j714j750j110j82K94J52j57l74p35j266j430q45nL07P4
$$ 406192 404868 403460 401746 399996 398886 398704 398998 399150 398993 398619 397884 396618 395188 394343 394338 394645 394719
51171C94719p5J36L11J55r6j94k34k17K04J144K091K513K539K516K299J561O37
$$ 394719 394644 394780 395091 395246 395150 394956 394722 394505 394709 395853 397944 400457 402996 405512 407811 409372 410009
51154D10009K90O34R16N87j5k89j66K7J68L24L46j26j140k233k830k782k442k210
$$ 410009 410299 410933 411849 412436 412421 412132 411966 411993 412161 412485 412831 412705 411565 409332 406502 403720 401278 399068
51136C99068k095j798j271q71q80j013q31m08j95k11O5Q93J817K286K279K086
$$ 399068 396973 395175 393904 393033 392153 391140 390309 389901 389706 389495 389560 390453 392270 394556 396835 398921
51120C98921J797J421J151J150J311J529J974K672L135K945K564K897M036N031
$$ 398921 400718 402139 403290 404440 405751 407280 409254 411926 415061 418006 420570 423467 427503 432534
51106D32534N019M112K983K104J636J607J770J645J020K10m25r92j649j996j442
$$ 432534 437553 441665 444648 446752 448388 449995 451765 453410 454430 454640 454215 453223 451574 449578 448136
51091D48136j69P89O44k88j002q59j17M74L63l69j131j345r20k08M05P95R90R80
$$ 448136 447967 448756 449400 449112 448110 447251 447134 447608 447971 447602 446471 445126 444206 443998 444403 445198 446188 447168
51073D47168P53M63M45R60J898K727K910K498K246K947M644O693Q568J0383J2422
$$ 447168 447921 448384 448829 449789 451687 454414 457324 459822 462068 465015 469659 476352 484920 495303 507725
51058E07725J4388J5466J5106J3585J1740J0331R722R968J0975J2498J4118J5358
$$ 507725 522113 537579 552685 566270 578010 588341 598063 608031 619006 631504 645622 660980
51046F60980J5845J5422J4138J2160R665O736L405j07l226n289o150o376o677
$$ 660980 676825 692247 706385 718545 728210 734946 738351 738244 735018 729729 723579 717203 710526
51033G10526p333q321r834j2116j4765j6704j7192j6521j5406j4003j2007r521
$$ 710526 703193 694872 685038 672922 658157 641453 624261 607740 592334 578331 566324 556803
51021E56803p220n525m103k379k04K107M133N526O206O512O978P653P986P604
$$ 556803 549583 544058 539955 537576 537372 539479 543612 549138 555344 561856 568834 576487 584473 592077
51007E92077O933O738P161P700P970Q091Q332Q759R339R984J0449J0462J0087
$$ 592077 599010 605748 612909 620609 628579 636670 645002 653761 663100 673084 683533 693995 704082
50994G04082R677R384Q956Q210P335O541N627M297K752J672J568K385L713N206
$$ 704082 713759 723143 732099 740309 747644 754185 759812 764109 766861 768533 770101 772486 776199 781405
50980G81405O704Q132R381J0307J0851J1140J1451J2025J3027J4597J6863J9764
$$ 781405 788109 796241 805622 815929 826780 837920 849371 861396 874423 889020 905883 925647
50968I25647K3073K6684L0761L5353M0097M4474M8327N1861N5197N8232O0884
$$ 925647 948720 975404 1006165 1041518 1081615 1126089 1174416 1226277 1281474 1339706 1400590
50957A400590O3164O4851O5342O4114O1288N7624N3938N0558M7177M3204L8341
$$ 1400590 1463754 1528605 1593947 1658061 1719349 1776973 1830911 1881469 1928646 1971850 2010191
50946B010191L3080K8468K5285K3429K2239K1270K0475J9655J8171J5549J2205
$$ 2010191 2043271 2071739 2097024 2120453 2142692 2163962 2184437 2204092 2222263 2237812 2250017
50935B250017R139O878M962K593o00m596r414j4972k0676k5771l0304l5256m1371
$$ 2250017 2259156 2266034 2270996 2273589 2272989 2268393 2258979 2244007 2223331 2197560 2167256 2132000 2090629
50922B090629m8121n4216n8868o2144o4293o5337o5430o5011o4234o2569n9407
$$ 2090629 2042508 1988292 1929424 1867280 1802987 1737650 1672220 1607209 1542975 1480406 1420999
50911A420999n4964n0277m6236m2866l9637l6199l2668k9289k6128k3222k0815
$$ 1420999 1366035 1315758 1269522 1226656 1187019 1150820 1118152 1088863 1062735 1039513 1018698
50900A018698j9141j7967j6693j5051j3432j2224j1099r446p446o097n946o300
$$ 1018698 999557 981590 964897 949846 936414 924190 913091 903645 896199 890102 884156 877856
50888H77856o053m933l507k280j302n85k19J2O44J882L240M133M547M976N790
$$ 877856 871803 866870 863363 861083 859781 859196 858977 858989 859633 861515 864755 868888 873435 878411 884201
50873H84201P003Q418R779J0829J1544J2206J3092J4115J5084J6192J7923K0365
$$ 884201 891204 899622 909401 920230 931774 943980 957072 971187 986271 1002463 1020386 1040751
50861A040751K3020K5493K7985L0906L4261L7876M1981M7108N3341O0100O6817
$$ 1040751 1063771 1089264 1117249 1148155 1182416 1220292 1262273 1309381 1362722 1422822 1489639
50850A489639P3453Q0269Q7425R5010J03053J11265J19031J26011J32459J38510
$$ 1489639 1563092 1643361 1730786 1825796 1928849 2040114 2159145 2285156 2417615 2556125
50840B556125J43375J45790J45212J42038J36712J29154J19176J06938R2852P7550
$$ 2556125 2699500 2845290 2990502 3132540 3269252 3398406 3517582 3624520 3717372 3794922
50830C794922O2141M7906L5391K4266J4521P284L830M111O944J1359J6951K2965
$$ 3794922 3857063 3904969 3940360 3964626 3979147 3986431 3990261 3994372 4001316 4012675 4029626 4052591
50818D052591K7964L0730L0815K7918K1407J0975k644j8216l5013n2796p1099
$$ 4052591 4080555 4111285 4142100 4170018 4191425 4202400 4199756 4181540 4146527 4093731 4022632
50807D022632q9059j05987j21506j35071j45795j52985j56591j56961j54407j49218
$$ 4022632 3933573 3827586 3706080 3571009 3425214 3272229 3115638 2958677 2804270 2655052
50797B655052j41909j33133j23376j12893j01942r0895q0081o9669n9803n0725
$$ 2655052 2513143 2380010 2256634 2143741 2041799 1950904 1870823 1801154 1741351 1690626
50787A690626m2618l5347k8589k2307j6957j2993j0340q558p491p349q084r032
$$ 1690626 1648008 1612661 1584072 1561765 1544808 1531815 1521475 1512917 1505426 1498077 1489993 1480961
50775A480961r504r494r584j0222j1399j2863j4294j5364j5994j6674j8064k0113
$$ 1480961 1471457 1461963 1452379 1442157 1430758 1417895 1403601 1388237 1372243 1355569 1337505 1317392
50763A317392k1929k2772k2858k2764k2409k1266j9461j7875j6864j5610j3263
$$ 1317392 1295463 1272691 1249833 1227069 1204660 1183394 1163933 1146058 1129194 1113584 1100321
50752A100321j0339q146o997n763l407k31K744N126P303R607J2030J4760J8320
$$ 1100321 1089982 1081836 1074839 1069076 1065669 1065438 1068182 1073308 1080611 1090218 1102248 1117008 1135328
50739A135328K2922K8044L2966L7533M2145M7153N2410N7380O1567O4888O7667
$$ 1135328 1158250 1186294 1219260 1256793 1298938 1346091 1398501 1455881 1517448 1582336 1650003
50728A650003P0226P2486P4106P4960P5240P5058P4162P2232O9236O5311O0299
$$ 1650003 1720229 1792715 1866821 1941781 2017021 2092079 2166241 2238473 2307709 2373020 2433319
50717B433319N3650M4879L4186K2659J1730K261n712j2287j6883j8614j7388j4179
$$ 2433319 2486969 2531848 2566034 2588693 2600423 2602684 2596972 2584685 2567802 2549188 2531800 2517621
50705B517621j0021n141O34O952J2847J7352J9849J9953J7439J2357M948m545
$$ 2517621 2507600 2502459 2503093 2510045 2522892 2540244 2560093 2580046 2597485 2609842 2614790 2610245
50693B610245j5819k8342m1327n3835o4822p3370p9218q2835q4629q4308q1443
$$ 2610245 2594426 2566084 2524757 2470922 2406100 2332730 2253512 2170677 2086048 2001740 1920297
50682A920297p6456p0531o4469n8099n0932m2915l4413k5815j7482r723k558M326
$$ 1920297 1843841 1773310 1708841 1650742 1599810 1556895 1522482 1496667 1479185 1469462 1466904 1471230
50670A471230J1051J7168K1943K5041K6732K7515K7628K6974K5480K3435K1337
$$ 1471230 1482281 1499449 1521392 1546433 1573165 1600680 1628308 1655282 1680762 1704197 1725534
50659A725534J9369J7329J5296J3911J3557J3503J2624J0934R723R920J1059J2229
$$ 1725534 1744903 1762232 1777528 1791439 1804996 1818499 1831123 1842057 1851780 1861700 1872759 1884988
50647A884988J3427J5295J7963K0899K3804K7049L1041L5600M0065M3806M6588
$$ 1884988 1898415 1913710 1931673 1952572 1976376 2003425 2034466 2070066 2110131 2153937 2200525
50636B200525M8667N0498N2144N3006N2409N0440M8058M6272M5324M4539M2726
$$ 2200525 2249192 2299690 2351834 2404840 2457249 2507689 2555747 2602019 2647343 2691882 2734608
50625B734608L8727L1753K1483Q188o953k1837l4260m3079m8354n0380m9174m5124
$$ 2734608 2773335 2805088 2826571 2834759 2827806 2805969 2771709 2728630 2680276 2629896 2580722 2535598
50613B535598l9483l3467k7231k0399j3350p239k776J63J662J197j751p071j4232
$$ 2535598 2496115 2462648 2435417 2415018 2401668 2394429 2391653 2391816 2393478 2394675 2392924 2385853 2371621
50600B371621k2627l1411l9616m6804n3267n9211o4106o7180o8266o7705o5827
$$ 2371621 2348994 2317583 2277967 2231163 2177896 2118685 2054579 1987399 1919133 1851428 1785601
50589A785601o2958n9729n6782n4141n1274m7822m3904l9859l5987l2590k9841
$$ 1785601 1722643 1662914 1606132 1551991 1500717 1452895 1408991 1369132 1333145 1300555 1270714
50578A270714k7522k5208k2749k0278j7743j4817j1468q267n844m112k389j22
$$ 1270714 1243192 1217984 1195235 1174957 1157214 1142397 1130929 1122662 1116818 1112706 1110317 1110195
50566A110195K653N550Q252J0623J2655J4420J6098J7871J9889K2212K4783K7405
$$ 1110195 1112848 1118398 1126650 1137273 1149928 1164348 1180446 1198317 1218206 1240418 1265201 1292606
50554A292606K9844L2009L3887L5339L6136L6310L6202L5965L5224L3604L1545
$$ 1292606 1322450 1354459 1388346 1423685 1459821 1496131 1532333 1568298 1603522 1637126 1668671
50543A668671L0115K9923L0618L1650L3085L5368L8620M2606M7184N2352N7934
$$ 1668671 1698786 1728709 1759327 1790977 1824062 1859430 1898050 1940656 1987840 2040192 2098126
50532B098126O3603O9257P5062Q1228Q7930R5326J03250J11083J18255J24695
$$ 2098126 2161729 2230986 2306048 2387276 2475206 2570532 2673782 2784865 2903120 3027815
50522C027815J30339J34418J35990J35083J32573J28649J22195J12064R8414Q2231
$$ 3027815 3158154 3292572 3428562 3563645 3696218 3824867 3947062 4059126 4157540 4239771
50512D239771O4135M4244K2942J116k0352m0897o0102p7464r2327j03942j11759
$$ 4239771 4303906 4348150 4371092 4372208 4351856 4310959 4250857 4173393 4081066 3977124 3865365
50501C865365j15707j15878j11898j03248r0431p5155n8807m1370k2592l683J3105
$$ 3865365 3749658 3633780 3521882 3418634 3328203 3253048 3194241 3152871 3130279 3126596 3139701
50490C139701K6333L5828M1342M1857L6565K5742J0348q501k9218m9685o8232
$$ 3139701 3166034 3201862 3243204 3285061 3321626 3347368 3357716 3349215 3319997 3270312 3202080
50479C202080q4451r8545j10196j18582j23363j25104j24566j22005j17309j10766
$$ 3202080 3117629 3019084 2908888 2790306 2666943 2541839 2417273 2295268 2177959 2067193
50469B067193j03351r6125q9304q2251p4536o6721n9718n3617m7695m1453l5091
$$ 2067193 1963842 1867717 1778413 1696162 1621626 1554905 1495187 1441570 1393875 1352422 1317331
50458A317331k8981k3335j8545j5043j2582j0258p713n660m692m154k928r60Q12
$$ 1317331 1288350 1265015 1246470 1231427 1218845 1208587 1200874 1195214 1190522 1186368 1183440 1182480 1183292
50445A183292J875K766M184O146Q099R496J0112J0114R897R645R170Q363P619
$$ 1183292 1185167 1187933 1192117 1198263 1206362 1215858 1225970 1236084 1245981 1255626 1264796 1273159 1280778
50432A280778P407P642P987Q564R783J1527J3194J4580J6034J7620J8838J9470
$$ 1280778 1288185 1295827 1303814 1312378 1322161 1333688 1346882 1361462 1377496 1395116 1413954 1433424
50420A433424K0043K1117K2624K4395K6708K9844L3538L7516M2074M7429N2779
$$ 1433424 1453467 1474584 1497208 1521603 1548311 1578155 1611693 1649209 1691283 1738712 1791491
50409A791491N6887N9576O1862O4506O7082O8668O8837O7673O5276O1694N7027
$$ 1791491 1848378 1907954 1969816 2034322 2101404 2170072 2238909 2306582 2371858 2433552 2490579
50398B490579N1265M4208L5726K5922J4868K530j0816k4362l7188m8720n8601
$$ 2490579 2541844 2586052 2621778 2647700 2662568 2665098 2654282 2629920 2592732 2544012 2485411
50387B485411o6434p1956p5153p5973p4177o9819o3513n5825m6712l6149k5007
$$ 2485411 2418977 2347021 2271868 2195895 2121718 2051899 1988386 1932561 1885849 1849700 1824693
50376A824693j4640n631K294R101J3946J6071J5601J3078Q733K567n251j4393
$$ 1824693 1810053 1804422 1806716 1815817 1829763 1845834 1861435 1874513 1883246 1885813 1880562 1866169
50364A866169k4328l3966m1885m7406n1114n3835n5565n5979n5440n4686n3668
$$ 1866169 1841841 1807875 1765990 1718584 1667470 1613635 1558070 1502091 1446651 1391965 1338297
50353A338297n1693m8719m5654m3127m0730l7795l4307l0614k6777k2708j8600
$$ 1338297 1286604 1237885 1192231 1149104 1108374 1070579 1036272 1005658 978881 956173 937573
50342I37573j4729j1041p274l337O58M546Q014J0519J1658J1480J0277Q242N514
$$ 937573 922844 911803 904529 901192 901850 906396 914410 924929 936587 948067 958344 966586 972100
50329I72100K395p79l770o238p620p502o138m288k672j584q54K7J489L367M951
$$ 972100 974495 973716 969946 963708 956088 948586 942448 938160 935488 933904 933050 933077 934566 937933 942884
50314I42884N760N988N948N479M455L503L492M372N162N269N148N469O171O793
$$ 942884 948644 954632 960580 966059 970514 974017 977509 981881 987043 992312 997460 1002929 1009100 1015893
50300A015893P218P655Q119Q458Q790R426J0367J1285J2063J3126J5007J7823
$$ 1015893 1023111 1030766 1038885 1047343 1056133 1065559 1075926 1087211 1099274 1112400 1127407 1145230
50288A145230K1217K4750K8022L0465L1092K8748K2846J4016L990n273j2458j7078
$$ 1145230 1166447 1191197 1219219 1249684 1280776 1309524 1332370 1346386 1350376 1345103 1332645 1315567
50276A315567j9178j9113j7626j5650j3760j1798r334o461m026k843k895l407
$$ 1315567 1296389 1277276 1259650 1244000 1230240 1218442 1209108 1202647 1198621 1195778 1192883 1189476
50264A189476l650l485l191l060l189l454l550l240k668k315k428k616k251j150
$$ 1189476 1185826 1182341 1179150 1176090 1172901 1169447 1165897 1162657 1159989 1157674 1155246 1152630 1150379 1149229
50250A149229L64K071M180O908R981J2898J5585J8414K1425K3891K5062K5194
$$ 1149229 1149593 1151664 1155844 1162752 1172733 1185631 1201216 1219630 1241055 1264946 1290008 1315202
50238A315202K5357K6111K6872K6849K6144K5410K4732K3481K1164J7802J3455
$$ 1315202 1340559 1366670 1393542 1420391 1446535 1471945 1496677 1520158 1541322 1559124 1572579
50227A572579Q023J725m832j1289j7678k3678k8314l0910l1852l1902l1253k9758
$$ 1572579 1580602 1582327 1577495 1566206 1548528 1524850 1496536 1465626 1433774 1401872 1370619 1340861
50215A340861k7696k5606k3697k2138k1593k2578k4468k5961k6590k6932k7326
$$ 1340861 1313165 1287559 1263862 1241724 1220131 1197553 1173085 1147124 1120534 1093602 1066276
50204A066276k7265k6290k4652k2659k0237j7609j5687j5014j4772j3630j1370
$$ 1066276 1039011 1012721 988069 965410 945173 927564 911877 896863 882091 868461 857091
50193H57091r062p733p378p311o953o267n665n601o038o419o286n794n427n393
$$ 857091 848029 840296 832918 825607 818654 812387 806722 801121 795083 788664 782378 776584 771157 765764
50179G65764n525n610n575n430n241n117n045m880m560m131l465k400j251p86
$$ 765764 760239 754629 749054 743624 738383 733266 728221 723341 718781 714650 711185 708785 707534 706748
50165G06748j217j670j176J06J300K111K989M061M795M968N186O002P132Q031
$$ 706748 705531 703861 702685 702791 704091 706202 709191 713252 718047 723015 728201 734203 741335 749366
50151G49366Q799R875J1052J1459J0575Q834P084N811M990M381L758L054K500
$$ 749366 758165 768040 779092 790551 801126 809960 817044 822855 827845 832226 835984 839038 841538
50138H41538K602L747N861Q501J1285J4113J7030K0060K3274K6889L1074L5645
$$ 841538 844140 847887 853748 862249 873534 887647 904677 924737 948011 974900 1005974 1041619
50126A041619M0066M3720M6198M7412M7619M7307M6938M6751M6866M7369M8101
$$ 1041619 1081685 1125405 1171603 1219015 1266634 1313941 1360879 1407630 1454496 1501865 1549966
50115A549966M8434M7651M5545M2275L7567L0634K1231J0393l35j0208j9368k7832
$$ 1549966 1598400 1646051 1691596 1733871 1771438 1802072 1823303 1833696 1833361 1823153 1803785 1775953
50103A775953l5068m0668m4831m7908m9819n0328m9628m8257m6452m3979m0695
$$ 1775953 1740885 1700217 1655386 1607478 1557659 1507331 1457703 1409446 1362994 1319015 1278320
50092A278320l7024l3613l0670k7902k5114k2546k0392j8270j5575j2304r086
$$ 1278320 1241296 1207683 1177013 1149111 1123997 1101451 1081059 1062789 1047214 1034910 1025824
50081A025824o344l923j711n8Q68J764L433N509O611N989M439L271K877K677K226
$$ 1025824 1019480 1015557 1013846 1013788 1014656 1016420 1019853 1025362 1031973 1037962 1042401 1045672 1048549 1051226 1053452
50066A053452J689J230M55j161l364n096n560n170n109n947p097p744p837p772
$$ 1053452 1055141 1056371 1056826 1055665 1052301 1047205 1041645 1036475 1031366 1025419 1018322 1010578 1002741 994969
50052I94969p513o699n489m576m159l558k200n20O06J036J523K797M870P170R059
$$ 994969 987456 980757 975268 970692 966533 962975 960775 960255 960861 961897 963420 966217 971087 978257 987316
50037I87316J0269J1095J2134J3603J4945J5371J4764J3868J3497J3717J3864
$$ 987316 997585 1008680 1020814 1034417 1049362 1064733 1079497 1093365 1106862 1120579 1134443
50026A134443J3219J1617R527P558N916M341K603R04l33r30j037q82p22q74j462
$$ 1134443 1147662 1159279 1168806 1176364 1182280 1186621 1189224 1190128 1189795 1188865 1187828 1186946 1186224 1185350 1183888
50011A183888k033j778k99K014M529P028R629J2214J4347J5796J6909J8292K0203
$$ 1183888 1181855 1180077 1179778 1181792 1186321 1193349 1202978 1215192 1229539 1245335 1262244 1280536 1300739
49998A300739K2376K4357K5940K7138K7770K7187K4621J9853J3426O116j698r965
$$ 1300739 1323115 1347472 1373412 1400550 1428320 1455507 1480128 1499981 1513407 1519523 1517825 1507860
49986A507860j8376k6134l2465l7216m0839m3786m6010m7067m6635m4871m2193
$$ 1507860 1489484 1463350 1430885 1393669 1352830 1309044 1263034 1215967 1169332 1124461 1082268
49975A082268l8892l5128l1299k8024k5457k2997k0143j7420j5827j5332j4681
$$ 1082268 1043376 1008248 976949 948925 923468 900471 880328 862908 847081 831749 817068
49964H17068j3036j1105j0052r755q984p162n065l613k672j475J97J806K877L688
$$ 817068 804032 792927 782875 773120 764136 756974 751909 748296 745624 744149 744346 746152 749029 752717
49950G52717M952O840Q538R003Q158O990O214N413L972K410J817K186K214J030
$$ 752717 757669 764509 773047 782050 790208 797198 803412 808825 812797 815207 817024 819210 821424 822454
49936H22454q60k648m467o859r656j2098j3759j4768j5301j5347j4854j3829j2468
$$ 822454 821594 818946 814479 807620 797964 785866 772107 757339 742038 726691 711837 698008 685540
49923F85540j1288j0659j0051q430n754l408k442k200j442k19N13O65J088J979
$$ 685540 674252 663593 653542 645112 639358 635950 633508 631308 629866 629647 630160 630825 631913 633892
49909F33892K525K429K670M155O479Q541R836J0640J1380J2273J3248J3886J3723
$$ 633892 636417 638846 641516 645671 652150 660691 670527 681167 692547 704820 718068 731954 745677
49896G45677J2795J1618J0514R312P791N935L690R60j928m312n951p302q842j0480
$$ 745677 758472 770090 780604 789916 797707 803642 807332 808292 806364 802052 796101 788799 779957 769477
49882G69477j1834j2645j2828j2543j2315j2553j2878j2488j1306j0052r087q066
$$ 769477 757643 744998 732170 719627 707312 694759 681881 669393 658087 648035 638948 630882
$$ [...]
##END NTUPLES=NMR SPECTRUM
##END=
