##TITLE=AC1724_GUAAH15010_9207984_s5XGJ8nSeJ
##JCAMPDX= 6.0         $$ Bruker NMR JCAMP-DX V2.0
##DATA TYPE= NMR SPECTRUM
##DATA CLASS= NTUPLES
##ORIGIN= BRUKER
##OWNER= Administrator
$$ 1.72 TOPSPIN		Version 2.1
$$ 2015-06-01 19:12:13.061 -0700  Administrator@X
$$ Compression mode = diff/dup
##.OBSERVE FREQUENCY= 400.02188249412
##.OBSERVE NUCLEUS= ^1H
##.ACQUISITION MODE= SIMULTANEOUS (DQD)
##.ACQUISITION SCHEME= undefined
##.AVERAGES= 8
##.DIGITISER RES= 22
##SPECTROMETER/DATA SYSTEM= spect
##.PULSE SEQUENCE= zg30
##.SOLVENT NAME= COFFEE_meoh
##.SHIFT REFERENCE= INTERNAL, COFFEE_meoh, 1, 14.98509
##AUDIT TRAIL= $$ (NUMBER, WHEN, WHO, WHERE, PROCESS, VERSION, WHAT)
$$ ##TITLE= Audit trail, TOPSPIN		Version 2.1
$$ ##JCAMPDX= 5.01
$$ ##ORIGIN= Bruker BioSpin GmbH
$$ ##OWNER= Administrator
$$ $$ E:\/data/COFFEE/nmr/AC1724_GUAAH15010_9207984_s5XGJ8nSeJ/10/pdata/1/auditp.txt
$$ ##AUDIT TRAIL=  $$ (NUMBER, WHEN, WHO, WHERE, PROCESS, VERSION, WHAT)
(   1,<2015-06-01 19:12:05.967 -0700>,<Administrator>,<X>,<go>,<TOPSPIN 2.1>,
      <created by zg
	started at 2015-06-01 19:11:00.108 -0700,
	POWCHK enabled, PULCHK disabled,
       configuration hash MD5:
       21 0F 79 D6 B3 7B B4 F6 88 20 88 DB 03 48 BD 9F
       data hash MD5: 64K
       EA D6 ED B8 20 52 53 E5 77 9F 80 82 6F 00 01 FF>)
(   2,<2015-06-01 19:12:09.030 -0700>,<Administrator>,<X>,<proc1d>,<TOPSPIN 2.1>,
      <Start of raw data processing
       efp LB = 0 FT_mod = 6 PKNL = 1 PHC0 = 0 PHC1 = 0 SI = 32K 
       data hash MD5: 32K
       49 AD 7B C6 CE 75 2F DB 1A 34 97 E4 CC 09 4C 80>)
(   3,<2015-06-01 19:12:09.311 -0700>,<Administrator>,<X>,<proc1d>,<TOPSPIN 2.1>,
      <pk PHC0 = 90.19775 PHC1 = 0 
       data hash MD5: 32K
       19 5E 78 73 F5 E7 70 40 12 B4 B4 DB 5B 90 69 2F>)
(   4,<2015-06-01 19:12:09.436 -0700>,<Administrator>,<X>,<proc1d>,<TOPSPIN 2.1>,
      <abs ABSG = 1 
       data hash MD5: 32K
       AA AE C5 92 1C E3 A3 88 DE 4F 58 4C 85 49 04 CD>)
(   5,<2015-06-01 19:12:09.483 -0700>,<Administrator>,<X>,<proc1d>,<TOPSPIN 2.1>,
      <abs ABSG = 2 
       data hash MD5: 32K
       98 DB 30 1C 42 9C 21 4F 39 B1 D2 48 F1 A9 31 DF>)
(   6,<2015-06-01 19:12:09.545 -0700>,<Administrator>,<X>,<proc1d>,<TOPSPIN 2.1>,
      <abs ABSG = 3 
       data hash MD5: 32K
       00 9C CD F5 9B 70 D4 07 D5 1B 6E C6 55 D3 2C EB>)
(   7,<2015-06-01 19:12:09.608 -0700>,<Administrator>,<X>,<proc1d>,<TOPSPIN 2.1>,
      <abs ABSG = 4 
       data hash MD5: 32K
       AB D7 5B 49 29 AD 43 40 A9 CB 56 4C E0 05 03 9F>)
(   8,<2015-06-01 19:12:09.670 -0700>,<Administrator>,<X>,<proc1d>,<TOPSPIN 2.1>,
      <abs ABSG = 5 
       data hash MD5: 32K
       93 B8 A9 EF B9 9B E5 44 10 9D 8A 9C AF AF 4C 4F>)
$$ ##END=
$$ 
$$ $$ hash MD5
$$ $$ C1 67 E2 74 EC FB 46 BB 6C EC 5C 5C 6F 1D C7 4A
##$RELAX= 
##$RELAX= 
##$RELAX= 
##$RELAX= 
##$RELAX= 
##$RELAX= 
##$RELAX= 
$$ Bruker specific parameters
$$ --------------------------
##$DU= <E:\>
##$EXPNO= 10
##$NAME= <AC1724_GUAAH15010_9207984_s5XGJ8nSeJ>
$$ [...]
##$TP= (0..7)
150 150 150 150 150 150 150 150
##$TP07= 0
##$TPNAME0= <>
##$TPNAME1= <>
##$TPNAME2= <>
##$TPNAME3= <>
##$TPNAME4= <>
##$TPNAME5= <>
##$TPNAME6= <>
##$TPNAME7= <>
##$TPOAL= (0..7)
0.5 0.5 0.5 0.5 0.5 0.5 0.5 0.5
##$TPOFFS= (0..7)
0 0 0 0 0 0 0 0
##$TUNHIN= 0
##$TUNHOUT= 0
##$TUNXOUT= 0
##$USERA1= <user>
##$USERA2= <user>
##$USERA3= <user>
##$USERA4= <user>
##$USERA5= <user>
##$V9= 5
##$VALIST= <valist>
##$VCLIST= <CCCCCCCCCCCCCCC>
##$VD= 0
##$VDLIST= <DDDDDDDDDDDDDDD>
##$VPLIST= <PPPPPPPPPPPPPPP>
##$VTLIST= <TTTTTTTTTTTTTTT>
##$WBST= 2048
##$WBSW= 25
##$XGAIN= (0..3)
0 0 0 0
##$XL= 0
##$YL= 0
##$YMAX_a= 595951
##$YMIN_a= -513195
##$ZGOPTNS= <>
##$ZL1= 120
##$ZL2= 120
##$ZL3= 120
##$ZL4= 120
##$ABSF1= 14.98509
##$ABSF2= -5.573092
##$ABSG= 5
##$ABSL= 3
##$ALPHA= 0
##$AQORDER= 0
##$ASSFAC= 0
##$ASSFACI= 0
##$ASSFACX= 0
##$ASSWID= 0
##$AUNMP= <proc_prof1d_extract_pilot.lims>
##$AXLEFT= 0
##$AXNAME= <>
##$AXNUC= <1H>
##$AXRIGHT= 0
##$AXTYPE= 0
##$AXUNIT= <>
##$AZFE= 0.1
##$AZFW= 0.1
##$BCFW= 0
##$BC_mod= 0
##$BYTORDP= 0
##$COROFFS= 0
##$CY= 15
##$DATMOD= 1
##$DC= 0
##$DFILT= <>
##$DTYPP= 0
##$F1P= 0
##$F2P= 0
##$FCOR= 0.5
##$FTSIZE= 32768
##$FT_mod= 6
##$GAMMA= 0
##$GB= 0
##$INTBC= 1
##$INTSCL= 1
##$ISEN= 128
##$LB= 0
##$LEV0= 0
##$LPBIN= 0
##$MAXI= 10000
##$MC2= 0
##$MEAN= 0
##$ME_mod= 0
##$MI= 0
##$NCOEF= 0
##$NC_proc= -8
##$NLEV= 6
##$NOISF1= 0
##$NOISF2= 0
##$NSP= 0
##$NTH_PI= 0
##$NZP= 0
##$OFFSET= 14.98509
##$PC= 1
##$PHC0= 90.19775
##$PHC1= 0
##$PH_mod= 1
##$PKNL= yes
##$PPARMOD= 0
##$PPDIAG= 0
##$PPIPTYP= 0
##$PPMPNUM= 2147483647
##$PPRESOL= 1
##$PSCAL= 4
##$PSIGN= 0
##$PYNMP= <proc.py>
##$REVERSE= no
##$SF= 400.02
##$SI= 32768
##$SIGF1= 0
##$SIGF2= 0
##$SINO= 400
##$SIOLD= 32768
##$SPECTYP= <>
##$SREGLST= <1H.CDCl3>
##$SSB= 0
##$STSI= 32768
##$STSR= 0
##$SW_p= 8223.68421052631
##$SYMM= 0
##$S_DEV= 0
##$TDeff= 65536
##$TDoff= 0
##$TI= <>
##$TILT= no
##$TM1= 0
##$TM2= 0
##$TOPLEV= 0
##$USERP1= <user>
##$USERP2= <user>
##$USERP3= <user>
##$USERP4= <user>
##$USERP5= <user>
##$WDW= 1
##$XDIM= 32768
##$YMAX_p= 432794913
##$YMIN_p= -667911
##$CURPLOT= <Network HP LaserJet P1505>
##$CURPRIN= <$Network HP LaserJet P1505>
##$DFORMAT= <normdp>
##$LAYOUT= <+/1D_H.xwp>
##$LFORMAT= <normlp>
##$PFORMAT= <normpl>
##$SURQMSG= 1
$$ End of Bruker specific parameters
$$ ---------------------------------
##NTUPLES= NMR SPECTRUM
##VAR_NAME=  FREQUENCY,     SPECTRUM/REAL,   SPECTRUM/IMAG
##SYMBOL=    X,             R,               I
##VAR_TYPE=  INDEPENDENT,   DEPENDENT,       DEPENDENT
##VAR_FORM=  AFFN,          ASDF,            ASDF
##VAR_DIM=   32768,         32768,           32768
##UNITS=     HZ,            ARBITRARY UNITS, ARBITRARY UNITS
##FACTOR=    0.250966925370066, 1,           1
##FIRST=     8223.43324360094, 45399,        -75245
##LAST=      0,             121034,          37849
##MIN=       0,             -667911,         0
##MAX=       8223.43324360094, 432794913,    0
$$ Real data points
##PAGE= N=1
##DATA TABLE= (X++(R..R)), XYDATA
$$ [...]
19571a02483n7901n5349a00294A03854h455c845C43714J1691d5998l83437c3131
$$ -102483 -160384 -215733 -100294 103854 -8455 -3845 343714 355405 -45998 -429435 -33131
19559a21942j2277A76391H2397a16267l07587K05895B74140G9459c90841J16806
$$ -121942 -134219 176391 82397 -116267 -423854 -217959 274140 79459 -390841 -274035
19549b74035H1002L08774d24813A23426a73300A97152f7953j98020D936K3401
$$ -274035 81002 389776 -424813 123426 -173300 197152 -67953 -265973 4936 28337
19539B8337h527A73790a32054d4424n8938j74969E7377c14763A55283a16934n8975
$$ 28337 -8527 173790 -132054 -44424 -103362 -278331 57377 -314763 155283 -116934 -175909
19528a75909L6610I175f5650E302J32452J72935a80776b9536j75501a0608j79388
$$ -175909 -139299 9175 -65650 5302 137754 310689 -180776 -29536 -205037 -10608 -189996
19517a89996j55527A18527L3147e07739K6572a80781o2839j43600A6029b78905
$$ -189996 -345523 118527 151674 -507739 -481167 -180781 -243620 -387220 16029 -278905
19506f5760j69652I6789a53893H227b02625a0862H2210h2006E6154k3017e7479
$$ -65760 -235412 96789 -153893 8227 -202625 -10862 82210 -82006 56154 33137 -57479
19494E1084L11162a69238d5238j68065h9400A06079g6181j1815B37183G1992f6567
$$ 51084 362246 -169238 -45238 -213303 -89400 106079 -76181 -87996 237183 71992 -66567
19482b30858b1222q5208D9422a28026n071N6437k04095H4571a00588j2803q6045
$$ -230858 -21222 -106430 49422 -128026 -133097 -76660 -280755 84571 -100588 -113391 -199436
19471a99436B7459K28524g4200A87208b39276J11855M7924r8191q4277b4764r1902
$$ -199436 27459 255983 -74200 187208 -239276 -127421 -79497 -177688 -261965 -24764 -116666
19460a16666I1674a02622B29613G6369c29837a51498c6917k59399B11158r1385
$$ -116666 91674 -102622 229613 76369 -329837 -151498 -36917 -296316 211158 119773
19450A19773d08727d9477l47m136C45109a90273B7085J0882J30231e0708B46032
$$ 119773 -408727 -49477 -49824 -53960 345109 -190273 27085 37967 168198 -50708 246032
19438d3759C07013a73387A1980J43775r940f7472R51k39348d9152l61519a42069
$$ -43759 307013 -173387 11980 155755 145815 -67472 -66521 -305869 -49152 -410671 -142069
19426a03618j19851l662n2665G3758b55675C01114j43727F5014k9180h1673B45909
$$ -103618 -223469 -227131 -279796 73758 -255675 301114 157387 65014 35834 -81673 245909
19414f3807r3956l6034A29287a3488k37170A77143k6560B4783e4860l0871m6635
$$ -63807 -157763 -193797 129287 -13488 -250658 177143 150583 24783 -54860 -85731 -132366
19403a32366D9331a9230C9449b79460h5683L1032m0513k36328A35536a37858F0442
$$ -132366 49331 -19230 39449 -279460 -85683 -54651 -95164 -331492 135536 -137858 60442
19391a1370q1570D0615L3490b50688B33841M9619a97910A535R0567m4347d8678
$$ -11370 -92940 40615 74105 -250688 233841 283460 -197910 1535 92102 47755 -48678
19379d2761j64654b5802B4477K09059c53601F2096g1875j38355O5489D2303A3045
$$ -42761 -207415 -25802 24477 233536 -353601 62096 -71875 -210230 -144741 42303 13045
19367C72207A66074e2178j911a7917k61214a03557n2600B43493H8819b02840O1322
$$ 372207 166074 -52178 -54089 -17917 -279131 -103557 -156157 243493 88819 -202840 -141518
19356a41518a4793A05207b67890g8278L8835p078j10971l6210C0270a5368j9041
$$ -141518 -14793 105207 -267890 -78278 -39443 -46521 -157492 -193702 30270 -15368 -34409
19345c4409j29884J8727o6106A31504i1245A27007c12787D2002a87802J6325A4440
$$ -34409 -164293 -145566 -211672 131504 -91245 127007 -312787 42002 -187802 -171477 14440
19333b64505C4677b50005a16773j0092j5940m3707r7423a05599A10678J32681
$$ -264505 34677 -250005 -116773 -126865 -142805 -186512 -283935 -105599 110678 243359
19323B43359i6022n7151M1770a9968A14710a39742A17591B8819L16750a69605
$$ 243359 -96022 -153173 -111403 -19968 114710 -139742 117591 28819 345569 -169605
19312G7354K79172i2003r5711I5270h4330m3571g055p012j08834e9743A61986
$$ 77354 356526 -92003 -187714 95270 -84330 -127901 -7055 -14067 -122901 -59743 161986
19300A09997f9601J3320A723a21622A957f2026I6339d0766o7258c1627m18954
$$ 109997 -69601 -56281 1723 -121622 1957 -62026 96339 -40766 -108024 -31627 -450581
19289d50581a31476k6576k31457f1315K1968k25203e4598H2919J84344a27440
$$ -450581 -131476 -158052 -389509 -61315 -39347 -264550 -54598 82919 267263 -127440
19278b55020C4294c52862f9832A07349j1976C8437J40536e8338C5015i0672A41903
$$ -255020 34294 -352862 -69832 107349 95373 38437 178973 -58338 35015 -90672 141903
19266b0046r1353n0025j6310A46197i920j66364B16763c7484j47526I347b21498
$$ -20046 -111399 -161424 -177734 146197 -9920 -176284 216763 -37484 -185010 9347 -221498
19254b07193B96402A28542m5022c20392J29074N1427N1982D0457h7604j64461
$$ -207193 296402 128542 83520 -320392 -191318 -139891 -87909 40457 -87604 -252065
19244b52065a6012k3402k8295q1411Q670B1703d5247m84763C8185e2639C32448
$$ -252065 -16012 -39414 -67709 -149120 -140450 21703 -45247 -530010 38185 -52639 332448
19232H7925i7668A4929O2482c81621b1095k8444A0451a74009B9105c65137f8766
$$ 87925 -97668 14929 77411 -381621 -21095 -49539 10451 -174009 29105 -365137 -68766
19220A05932g0772C2622N8686c02626A3652h5643K0657j67193J7254r0196d9188
$$ 105932 -70772 32622 91308 -302626 13652 -85643 -64986 -232179 -214925 -305121 -49188
19208b45323P2060A68968a58138m4807A16556e3610k01265N7979A7925b03033
$$ -245323 -173263 168968 -158138 -202945 116556 -53610 -254875 -196896 17925 -203033
19197a31470l3826M0124f1655j62710E961i9114d179j10928D5543K8024h8840
$$ -131470 -165296 -125172 -61655 -224365 5961 -99114 -4179 -115107 45543 73567 -88840
19185E2590J8465b776j60826g4129p5930B44260a89192H5886a56104B60209c5852
$$ 52590 71055 -2776 -163602 -74129 -150059 244260 -189192 85886 -156104 260209 -35852
19173H1698e5083H2828K389i3449r3221N5334e4668B5352K22608g0505l0005k4731
$$ 81698 -55083 82828 85217 -93449 -186670 -131336 -54668 25352 247960 -70505 -100510 -125241
19161a25241a3179j66642f4483b1161A59194D0413c9413l08484C208b75923r6856
$$ -125241 -13179 -179821 -64483 -21161 159194 40413 -39413 -347897 3208 -275923 -372779
19150c72779g7100E0404a86543Q4295j48861G6876L4669E3491b4889m00504i3708
$$ -372779 -77100 50404 -186543 -102248 -251109 76876 111545 53491 -24889 -425393 -93708
19138A7480J5349J58353J12327c37772g9257A49724p2701K10257a36791j8282
$$ 17480 32829 191182 303509 -337772 -79257 149724 77023 287280 -136791 -155073
19128a55073F9929b02565A43077b7785A95381a06051C27823d31518D6668b95733
$$ -155073 69929 -202565 143077 -27785 195381 -106051 327823 -431518 46668 -295733
19117c559G8548A8293a69305F7887d3497B8522J55494b53718A0882a65964C07128
$$ -3559 78548 18293 -169305 67887 -43497 28522 184016 -253718 10882 -165964 307128
19105A635h8274C4447R3787J32079a06438A10754l5785a38701G4581b9915j1515
$$ 1635 -88274 34447 128234 260313 -106438 110754 74969 -138701 74581 -29915 -41430
19094d1430j701N166A68807e4114l8054D1583b24077j30113a7881k96297J22728
$$ -41430 -43131 -37965 168807 -54114 -92168 41583 -224077 -354190 -17881 -314178 -191450
19083a91450A8351f4973K1381o6557A43094E7689a71036Q2796M1344A12406f8710
$$ -191450 18351 -64973 -43592 -110149 143094 57689 -171036 -88240 -46896 112406 -68710
19071a66010B1085f9596A12536e1467I6501a6055j64811j8690N4458j61241A79706
$$ -166010 21085 -69596 112536 -51467 96501 -16055 -180866 -199556 -145098 -306339 179706
19059B12172D7779c35838O9783N3591E2536N033M8201B4810J16261a14160J7166
$$ 212172 47779 -335838 -266055 -212464 52536 57569 105770 24810 141071 -114160 -96994
19048i6994B01529R3977a69567H261P1446C8596J05127M0192i6007I33b4533o9277
$$ -96994 201529 295506 -169567 8261 79707 38596 143723 183915 -96007 933 -24533 -93810
19036i3810M5816k8928h3A64414h004a877C22793c20691J58429H9912K05799J05599
$$ -93810 -47994 -76922 -83 164414 -8004 -1877 322793 -320691 -162262 89912 295711 401310
19024D01310c1955G4594Q1846C4532M0466P2513K8098E8997d9840B3633a19535
$$ 401310 -31955 74594 156440 34532 74998 147511 175609 58997 -49840 23633 -119535
19012C0372C276J55484e5376k30471J37687c2651k09758Q6262C8282o215e6683
$$ 30372 3276 158760 -55376 -285847 -148160 -32651 -242409 -156147 38282 32067 -56683
19000B74433a08415Q884j54211O4933I1345j6948d08698A90204f1157A47189e9765
$$ 274433 -108415 -99531 -253742 -188809 91345 74397 -408698 190204 -61157 147189 -59765
18988I8254b14743a5900E8583b4601L327C63408A62334b55518J17173B0861M7360
$$ 98254 -214743 -15900 58583 -24601 -21274 363408 162334 -255518 -138345 20861 68221
18977F8221b86397R4599E2340j1359i7264r5323k04423B0214c08487D0496a31733
$$ 68221 -286397 -191798 52340 40981 -97264 -192587 -397010 20214 -308487 40496 -131733
18965A28821e910A62421K38311b3232H4291P968m3991e4082A45530i5795j8807
$$ 128821 -5910 162421 400732 -23232 84291 92259 48268 -54082 145530 -95795 -114602
18954a14602F32a05003B1223A06O7171b1454B49794C6214J51401a53684n2128
$$ -114602 632 -105003 21223 106 67277 -21454 249794 36214 187615 -153684 -205812
18943b05812j44020B78880j05302i5788j8071j22061A02000I627a04476B82923
$$ -205812 -349832 278880 173578 -95788 -113859 -235920 102000 9627 -104476 282923
18932c7054C2603K41796n9635c6698A6656J70495q3254e0025p7838O1930A27044
$$ -37054 32603 274399 214764 -36698 16656 187151 103897 -50025 -127863 -65933 127044
18920d6059F4165a62358M6742C1226K3406a07560n0493B9963c16007A84494e7520
$$ -46059 64165 -162358 -115616 31226 54632 -107560 -158053 29963 -316007 184494 -57520
18908A6731K14085b23550h4492j12174A70403P4850F2796J14661i5513M4651D26956
$$ 16731 230816 -223550 -84492 -196666 170403 245253 62796 177457 -95513 -50862 426956
18896b71099B20005c4822N097k50342O4999m3744b2372B5791a37448A46101b03882
$$ -271099 220005 -34822 -29725 -280067 -215068 -258812 -22372 25791 -137448 146101 -203882
18884d45144a91780C48919h1029r6803A33578a74802A80282d2631A80751b28127
$$ -445144 -191780 348919 -81029 -177832 133578 -174802 180282 -42631 180751 -228127
18873c1135q3939l8775d943k51838C70195b74152D2505b57448F118b01594i697
$$ -31135 -115074 -153849 -4943 -256781 370195 -274152 42505 -257448 6118 -201594 -9697
18861F1731e4813k47591A29146j8920a14462I039b01540h0400D7611e4266j06463
$$ 61731 -54813 -302404 129146 110226 -114462 9039 -201540 -80400 47611 -54266 -160729
18850a60729a344j27981o403G2796f2796B53289m2720A1743a40588C155f1844
$$ -160729 -1344 -129325 -135728 72796 -62796 253289 210569 11743 -140588 3155 -61844
18838c8633j11554C4345a23514B1850j0875J64870c80239A39419b95720m4715
$$ -38633 -150187 34345 -123514 21850 10975 175845 -380239 139419 -295720 -340435
18828c40435C5516b91771A749N5670Q9877B1193a24082B1380b19151B29025r310
$$ -340435 35516 -291771 1749 57419 147296 21193 -124082 21380 -219151 229025 219715
18817B19715A1378d50862I4832m2371b08235A58517b50533D1436K45482J42536
$$ 219715 11378 -450862 94832 52461 -208235 158517 -250533 41436 286918 429454
18807D29454a45273m501A5229c9643B24576a37191M3618A06242D9922I24f6361
$$ 429454 -145273 -149774 15229 -39643 224576 -137191 -93573 106242 49922 924 -66361
18795d16479A33715b76926a4497j51816l8868i010j24913d35j15181A71050P6990
$$ -416479 133715 -276926 -14497 -166313 -205181 -9010 -133923 -435 -115616 171050 248040
18784B48040a1665l2040j13672J2271A52343i4035j09452a2115j98127d1658j06824
$$ 248040 -11665 -43705 -157377 -145106 152343 -94035 -203487 -12115 -210242 -41658 -148482
18773a48482b7518A9999a10715e1254I9061a02328o926k90405A20266a58873n6523
$$ -148482 -27518 19999 -110715 -51254 99061 -102328 -109254 -399659 120266 -158873 -215396
18762b15396I8975N9699p3377c63421E9919a70367D927b20224j28823A66669e2172
$$ -215396 98975 158674 85297 -363421 59919 -170367 4927 -220224 -349047 166669 -52172
18750b39819c9150m4202k23221a16316p5565b5591b236E630a80322o0801b3577
$$ -239819 -39150 -83352 -306573 -116316 -191881 -25591 -2236 5630 -180322 -241123 -23577
18738i7747A1766a36616m5688g0299j53528g5884A23268B8908f0399o0193k9399
$$ -97747 11766 -136616 -182304 -70299 -223827 -75884 123268 28908 -60399 -120592 -149991
18727a49991i404j92326f6898j66063n4239B01997B2405a35864J4177C35296D2175
$$ -149991 -9404 -201730 -66898 -232961 -287200 201997 22405 -135864 -121687 335296 42175
18715i0020B4442c37694a2642q3191F6231c9615l58385A53251F9724a04536j41323
$$ -90020 24442 -337694 -12642 -95833 66231 -39615 -398000 153251 69724 -104536 -245859
18704b45859h6176k72543B47816e3807C32199C9K55492c16282A72513a46637D3218
$$ -245859 -86176 -358719 247816 -53807 332199 39 255531 -316282 172513 -146637 43218
18692c47597a21138A22329B4661K7849b11516q2457h3405G9198g2067A67852h4409
$$ -347597 -121138 122329 24661 52510 -211516 -293973 -83405 79198 -72067 167852 -84409
18680A05238a12234A66170A4529L3739a55331k0692F1088c7562j59804A66506
$$ 105238 -112234 166170 14529 48268 -155331 -176023 61088 -37562 -197366 166506
18669F1217m767b79588e1517L054P450p4710n8280b1380A87726b01360A85468
$$ 61217 56450 -279588 -51517 -48463 -41013 -115723 -174003 -21380 187726 -201360 185468
18657a13512A11148a71736b8991A9196b23565B76264H8528J52119d8459r7992
$$ -113512 111148 -171736 -28991 19196 -223565 276264 88528 240647 -48459 -146451
18647a46451a6377j36992H0928g3987B8540a11687G2648g802H1737K4558a01885
$$ -146451 -16377 -153369 80928 -73987 28540 -111687 72648 -7802 81737 106295 -101885
18635A1372e1484A70564a3991m8089p0738j5488E6066J69792C3758a13930F7692
$$ 11372 -51484 170564 -13991 -62080 -132818 -148306 56066 225858 33758 -113930 67692
18623g7604m8720A19131l9801a88048B06384f9460A26088a65560b3206A49389
$$ -77604 -126324 119131 79330 -188048 206384 -69460 126088 -165560 -23206 149389
18612A77165b17572N2894A2485a89270a0079I7505K81192b42978r3991A09626
$$ 177165 -217572 -164678 12485 -189270 -10079 97505 378697 -242978 -336969 109626
18601A33652a80641A73103b8697k03441R7082l17124D8985e0589C4503a80103
$$ 133652 -180641 173103 -28697 -232138 -135056 -452180 48985 -50589 34503 -180103
18590e4659F0466b24710C04957h6457k18233h1363D1554a94263c353A55710a45848
$$ -54659 60466 -224710 304957 -86457 -304690 -81363 41554 -194263 -3353 155710 -145848
18578a97631k1493A99888C0567a01024j02922D8892b1804k16259H2655O997a48606
$$ -197631 -219124 199888 30567 -101024 -203946 48892 -21804 -238063 82655 89652 -148606
18566I4540D4138h2595j85577C8820N3261a32088k10798a43322A95843c13701
$$ 94540 44138 -82595 -268172 38820 92081 -132088 -342886 -143322 195843 -313701
18555b47464C39271a40946j46386C0059b05420d29k65087i9021j65021g4335A18087
$$ -247464 339271 -140946 -287332 30059 -205420 -429 -265516 -99021 -264042 -74335 118087
18543c301m4134n781F5097d65224B01578e4145j55197A16747E5926O8297a37792
$$ -3301 -47435 -53216 65097 -465224 201578 -54145 -209342 116747 55926 124223 -137792
18531I9575R0097b2292m2965n6856j1325E4784a30715H88b55070e5877o1253q9185
$$ 99575 189672 -22292 -65257 -122113 -133438 54784 -130715 888 -255070 -55877 -117130 -206315
18519b06315j13953j563C0173b76770H6351b16582A98257b67525K0688j4363h5991
$$ -206315 -320268 -321831 30173 -276770 86351 -216582 198257 -267525 -246837 -261200 -85991
18507b40803Q3351B4636b5835m9258K4994N123J3966m7307G8952K394b23254A75356
$$ -240803 -157452 24636 -25835 -75093 -50099 -44976 -31010 -78317 78952 81346 -223254 175356
18494b25629E9195J07884c3893j66430B93054a59938J7075A50700C0537J26801
$$ -225629 59195 167079 -33893 -200323 293054 -159938 -142863 150700 30537 157338
18484A57338a3086n9861K3953n2372B36168d6620B48077b19045B07305a58035
$$ 157338 -13086 -72947 -48994 -101366 236168 -46620 248077 -219045 207305 -158035
18473a28556J589d017k83485A39101g7026p8229C32574i0084N059r4349o44B31800
$$ -128556 -126967 -4017 -287502 139101 -77026 -155255 332574 -90084 -85025 -179374 -180018 231800
18460I1142a09276m9783B1304K7551K53925H3275b77313A6935b23299B11047o375
$$ 91142 -109276 -159059 21304 48855 302780 83275 -277313 16935 -223299 211047 204672
18449B04672K989l6125b4150A75973p2559B245J38439C0666b94798B83467A35142
$$ 204672 207661 171536 -24150 175973 103414 2245 140684 30666 -294798 283467 135142
18437B12527b59753g6778A05236b46433f7222l5076m7243D463J35180a17238j34628
$$ 212527 -259753 -76778 105236 -246433 -67222 -102298 -149541 4463 139643 -117238 -251866
18426b51866B38396b80799f7738j14373g5950o6013j14297L0478F8534a19804
$$ -251866 238396 -280799 -67738 -182111 -75950 -141963 -256260 -225782 68534 -119804
18415e0289A17349e3006k54797A27429b03746d503j26623f1444k573C7086m797
$$ -50289 117349 -53006 -307803 127429 -203746 -4503 -131126 -61444 -64017 37086 32289
18404C2289K00567I5110a51269j08171I9714b25777b8271D4400M3282j6156O2829
$$ 32289 232856 95110 -151269 -259440 99714 -225777 -28271 44400 87682 71526 134355
18393A34355e9480q0037A37752L8762a10482l6391F9590b49710h3222a372A26949
$$ 134355 -59480 -139517 137752 176514 -110482 -146873 69590 -249710 -83222 -1372 126949
18381H0783c86976D20756B2779J95783c66859F7276B8095a05997l3313N6656k46094
$$ 80783 -386976 420756 22779 218562 -366859 67276 28095 -105997 -139310 -82654 -328748
18370c28748a44875C6161A158J05924a73501A87701b4707o3703J279R962o903
$$ -328748 -144875 36161 1158 107082 -173501 187701 -24707 -88410 -87131 -77169 -84072
18359h4072F7093b3668l7460A82678A6667a09299N2525j39501B09538a26504J3243
$$ -84072 67093 -23668 -61128 182678 16667 -109299 -56774 -196275 209538 -126504 -113261
18348a13261j38719A10295a45532l3930m2243B1199M7600q496h9576k26756K7770
$$ -113261 -251980 110295 -145532 -179462 -221705 21199 68799 60303 -89576 -316332 -288562
18337b88562l8101o6049O5134L082j3585a35949c3794j36432m5878A5586b53401
$$ -288562 -326663 -392712 -327578 -324496 -338081 -135949 -33794 -170226 -216104 15586 -253401
18325I7467b7277A53755e1917k86085B6820K18298B780J45916K12169i5775d0415
$$ 97467 -27277 153755 -51917 -338002 26820 245118 2780 148696 360865 -95775 -40415
18313C81418A00554b93605C10803e916B27728b30022I6666J47976E5457a65960
$$ 381418 100554 -293605 310803 -5916 227728 -230022 96666 244642 55457 -165960
18302a26167q5389C070b2141A78739q1304b2159j33870A47442i3172j19719l09803
$$ -126167 -211556 3070 -22141 178739 97435 -22159 -156029 147442 -93172 -212891 -522694
18291e22694a89701B5290a46933H6671a65086l2164g7696o7642K7320I9625a36468
$$ -522694 -189701 25290 -146933 86671 -165086 -197250 -77696 -145338 -118018 99625 -136468
18279G3976C2502b02738A41021a3184A32240b21741A79519q7063b09390e224l16268
$$ 73976 32502 -202738 141021 -13184 132240 -221741 179519 92456 -209390 -5224 -321492
18268c21492c2966p9160p8151P4671j3155C4460a04345F4215i1995L9894D08398
$$ -321492 -32966 -112126 -190277 -115606 -128761 34460 -104345 64215 -91995 -52101 408398
18256A01468c6782j51456A19341f095F623a79145a2881j18772A26719a47802l16778
$$ 101468 -36782 -188238 119341 -6095 6623 -179145 -12881 -131653 126719 -147802 -464580
18245d64580J24946A35959a68106m09783h1413L1910C7403O6596a04981G543c65962
$$ -464580 -339634 135959 -168106 -577889 -81413 -49503 37403 103999 -104981 7543 -365962
18233c0833k8787p297k8017l4131k44806A8019Q1047a02149A63361b19012P7999
$$ -30833 -59620 -66917 -94934 -129065 -373871 18019 99066 -102149 163361 -219012 -141013
18222a41013e1860o0889e3864b1149j16286j77288b7247A29994J36413r4061D9779
$$ -141013 -51860 -112749 -53864 -21149 -137435 -314723 -27247 129994 266407 172346 49779
18210b86595B41586n3744f2908I5502M0965b09828R976F0339d285o6353B43625
$$ -286595 241586 187842 -62908 95502 136467 -209828 -199852 60339 -4285 -70638 243625
18198A85822j7501b4944B3873J48803J73125a24517C0254J8508a26635B46830
$$ 185822 168321 -24944 23873 172676 345801 -124517 30254 48762 -126635 246830
18187A07930C9844J31884D9122b67870a22006m0691B03128b5569j96930i8631
$$ 107930 39844 171728 49122 -267870 -122006 -162697 203128 -25569 -222499 -98631
18176b2549o5760j23285r712J05870J939k1135E2268a2180r4914B54572a9340
$$ -22549 -88309 -211594 -221306 -115436 -113497 -134632 52268 -12180 -107094 254572 -19340
18164A00996c85582A96210f3438A34275N5357o711C5697a74675j9859h7687q417
$$ 100996 -385582 196210 -63438 134275 189632 182921 35697 -174675 -194534 -87687 -96104
18153i6104j15373a862p8978o8595d6856j07056B43027a97428j10363h3965B06335
$$ -96104 -211477 -1862 -80840 -149435 -46856 -153912 243027 -197428 -307791 -83965 206335
18141b04746R0465B3573a17019B9779b22762b0279j41796A24078a11791J9142
$$ -204746 -114281 23573 -117019 29779 -222762 -20279 -162075 124078 -111791 -92649
18131i2649m4427A5460a52642a4584j20572e0790l54128C6547b780k21968A06919
$$ -92649 -137076 15460 -152642 -14584 -135156 -50790 -404918 36547 -2780 -224748 106919
18119A83326G8298h7938j69107B06748m6001E811i2361A01700I682a36745G1700
$$ 183326 78298 -87938 -257045 206748 160747 5811 -92361 101700 9682 -136745 71700
18107f7429k6519c2529G661J05295e9765q1810d0554k59009J04038M7765q6027
$$ -67429 -93948 -32529 7661 112956 -59765 -141575 -40554 -299563 -195525 -147760 -233787
18096b33787c8850k41057a29667A14743B095K32222A6381c47324E4037b60795
$$ -233787 -38850 -279907 -129667 114743 2095 234317 16381 -347324 54037 -260795
18085B53313A05272N0764a21532j55490A05047l5267b5985r6589a0685E5134i2610
$$ 253313 105272 156036 -121532 -277022 105047 69780 -25985 -122574 -10685 55134 -92610
18073a56938p315M609A83535f3305F9523d247C29505F9449d3453J9278m319E477
$$ -156938 -164253 -159644 183535 -63305 69523 -4247 329505 69449 -43453 -24175 -28494 5477
18060B75630a48144i654p084l81520a00735q2868k1514L1670g9669A29740a62970
$$ 275630 -148144 -9654 -16738 -398258 -100735 -183603 -205117 -173447 -79669 129740 -162970
18048B95631c7397A1280J05869B6005b3588G2194J03802b55184j07018a8570G5224
$$ 295631 -37397 11280 117149 26005 -23588 72194 175996 -255184 -362202 -18570 75224
18036b08715C9104j7119b06761F2340h1190C03616h0174j03138k8231e5448j84800
$$ -208715 39104 21985 -206761 62340 -81190 303616 -80174 -183312 -211543 -55448 -240248
18025b40248A58142a30897j28249e4926r8143C7187J58596K44368G5972c5157
$$ -240248 158142 -130897 -259146 -54926 -153069 37187 195783 440151 75972 -35157
18014d4412K1257j28525A76430A6576h806C2665K451a53175k5045h1406j01078
$$ -44412 -23155 -151680 176430 16576 -8806 32665 35116 -153175 -178220 -81406 -182484
18003a82484f5328j13890j14701B39474R463h8615j29171i0908B69493N4835e8627
$$ -182484 -65328 -179218 -293919 239474 248937 -88615 -217786 -90908 269493 324328 -58627
17991A45938b88363L0037A85153a60528g9888k13466J20189a9919k00881Q9511
$$ 145938 -288363 -258326 185153 -160528 -79888 -293354 -173165 -19919 -220800 -131289
17981a31289r3242P1832J826A67991N6270a58278B08369l7282b88503D1550b8268
$$ -131289 -224531 -152699 -150873 167991 224261 -158278 208369 171087 -288503 41550 -28268
17969c04486a10886k29057B02389a6925J884F8514q260b76317J06899j58666A17026
$$ -304486 -110886 -339943 202389 -16925 -15041 68514 60254 -276317 -169418 -328084 117026
17957a10984a202r1787m9048l33328d7496B9577i5512B04949g6621j92414D3480
$$ -110984 -1202 -92989 -142037 -475365 -47496 29577 -95512 204949 -76621 -269035 43480
17945a26937B09491L5141f9774K7967o427A27226a98626d509C00219D1773d0507
$$ -126937 209491 244632 -69774 -41807 -48234 127226 -198626 -4509 300219 41773 -40507
17933i6844M456e641j67476C06053E1004c45032A53891a56667e3621j20376d8972
$$ -96844 -92388 -5641 -173117 306053 51004 -345032 153891 -156667 -53621 -173997 -48972
17921a588j33785i098k931l3144B17030c3677A2003a58279b6214A4781J50850
$$ -1588 -135373 -9098 -12029 -45173 217030 -33677 12003 -158279 -26214 14781 165631
17910A65631a67343A72461J6536d73913d0470B82228j05813a8384B97868C8668
$$ 165631 -167343 172461 188997 -473913 -40470 282228 176415 -18384 297868 38668
17899A66426L1245e1829A05836D8038J43698O4611H2655d761C9499n533h9374
$$ 166426 197671 -51829 105836 48038 191736 256347 82655 -4761 39499 33966 -89374
17887c93440A6703J73442o5997E1023K57526c24030E9014b88605C50022m0875
$$ -393440 16703 190145 124148 51023 308549 -324030 59014 -288605 350022 309147
17877C09147F6925c2455H9464J3559b40500C5962i896A52045b9770n8148j63667
$$ 309147 66925 -32455 89464 103023 -240500 35962 -9896 152045 -29770 -87918 -251585
17866b51585A48030d8296A10749c6003o25F43J35303b945B48067D2592a37990
$$ -251585 148030 -48296 110749 -36003 -36628 643 135946 -2945 248067 42592 -137990
17854a61379A25166b3487A41806a58260A78157b37269B22338a32754p0180j1304
$$ -161379 125166 -23487 141806 -158260 178157 -237269 222338 -132754 -202934 -214238
17844b14238B6859L6327a57165j38889c3791a5849p2777M2681k90353K2240A75750
$$ -214238 26859 63186 -157165 -296054 -33791 -15849 -88626 -45945 -336298 -314058 175750
17832g4276H0861e0864A00612a71469q9114B26968H8819J11004k8505a56380j0471
$$ -74276 80861 -50864 100612 -171469 -260583 226968 88819 199823 171318 -156380 -166851
17821a66851C78671b0209A18338a48286M2834A08899a23896C718b8591A72936
$$ -166851 378671 -20209 118338 -148286 -105452 108899 -123896 3718 -28591 172936
17810e1844B7023J49788C8161J51230b87249I1280Q583c0987A96584B4323P2414
$$ -51844 27023 176811 38161 189391 -287249 91280 99863 -30987 196584 24323 96737
17799I6737B2743J5774J858a68053I5918h66j58427N2552A43362i6779A56669
$$ 96737 22743 38517 40375 -168053 95918 -866 -159293 -106741 143362 -96779 156669
17787A62662R8941a47219G278b07555A62868e3016j95577a2518I6670J0259o900
$$ 162662 261603 -147219 7278 -207555 162868 -53016 -248593 -12518 96670 106929 100029
17776A00029b12286j48048i2524j91179L353B54313E946J65136B4925h3208A04401
$$ 100029 -212286 -360334 -92524 -283703 -280350 254313 5946 171082 24925 -83208 104401
17764a72481F6912b32535J09276q709A54071n9673b20182a08995p9561A22171
$$ -172481 66912 -232535 -123259 -131968 154071 94398 -220182 -108995 -188556 122171
17753B17576a18937A69919J27708j32097a37240c3532C5219c4250H6389J46885
$$ 217576 -118937 169919 297627 165530 -137240 -33532 35219 -34250 86389 233274
17743B33274a83399p6193C04677A44204E038P5904C1117J7434l084i1048j59917
$$ 233274 -183399 -259592 304677 144204 5038 80942 31117 48551 45467 -91048 -250965
17732b50965J69J1804C70631A33529Q0943a46062b8969j05510A1085L70787b6927
$$ -250965 -250796 -238992 370631 133529 214472 -146062 -28969 -134479 11085 381872 -26927
17720a6542B36033A14778k1658a57843E8312a18076I1855E864a22243L9319o3845
$$ -16542 236033 114778 93120 -157843 58312 -118076 91855 5864 -122243 -82924 -146769
17709a46769d3417j45333A6645M9365A3445L3687K31604H2323Q165R1982E1621
$$ -146769 -43417 -188750 16645 66010 13445 47132 278736 82323 90488 182470 51621
17697a36391A14253k0442k075a27752D41861g2191k45590A95389E4075c3811r7851
$$ -136391 114253 93811 91736 -127752 441861 -72191 -317781 195389 54075 -33811 -131662
17686a31662L3471I7693a50868B0716M4398R7356D4091J3516b67597A41179a43375
$$ -131662 -98191 97693 -150868 20716 65114 162470 44091 57607 -267597 141179 -143375
17674A81090f9676A42403M3631b43854k7261a2152a411k43655a03158e0323C12221
$$ 181090 -69676 142403 186034 -243854 -271115 -12152 -1411 -245066 -103158 -50323 312221
17662D9693f5410m3921G0633a65465A34560E2494O7762P9781H9908d82412a25075
$$ 49693 -65410 -109331 70633 -165465 134560 52494 120256 200037 89908 -482412 -125075
17650A35302E1052R7433f0143A83913F7242f2789B47178a3940j32063A17894C1472
$$ 135302 51052 148485 -60143 183913 67242 -62789 247178 -13940 -146003 117894 31472
17638B4077d8747A34199E8101M807B2884K51623A15215a6644A30186a64158B9073
$$ 24077 -48747 134199 58101 62908 22884 274507 115215 -16644 130186 -164158 29073
17626a85454j10533A68858k5031b07502F6719C1183R6415a00966C6274R4046J72835
$$ -185454 -295987 168858 143827 -207502 66719 31183 127598 -100966 36274 130320 303155
17615C03155b89738B13730a99053A95008b81188a25331a517F0894c250F5826a83582
$$ 303155 -289738 213730 -199053 195008 -281188 -125331 -1517 60894 -3250 65826 -183582
17603b37635H3293C6141J28015j1433e6579B4672P4968O4945b890r2349B17709
$$ -237635 83293 36141 164156 152723 -56579 24672 99640 164585 -2890 -95239 217709
17591B05722k973B4436e6049r0793a2751j04619F3957J64925a30719H8555A7416
$$ 205722 202749 24436 -56049 -146842 -12751 -117370 63957 228882 -130719 88555 17416
17579A26992c66393A87361b32997F4455K5498b7998B32322b3453A42806P6626
$$ 126992 -366393 187361 -232997 64455 89953 -27998 232322 -23453 142806 219432
17569B19432b65522R9493d182A67276c01241C74522A8645J2805J52244F0259M52895
$$ 219432 -265522 -166029 -4182 167276 -301241 374522 18645 31450 183694 60259 513154
17558E13154b5659p5343A11021b3706A83038K46577A06873D1655J63608J51919
$$ 513154 -25659 -101002 111021 -23706 183038 429615 106873 41655 205263 357182
17548C57182b6313C23196j60011n1683K68797c0849D4653a32146A72060G0249
$$ 357182 -26313 323196 163185 111502 380299 -30849 44653 -132146 172060 70249
17537B2887J0727R7532e3969p1649B915d1016A44457K5910B7658J55800f6256
$$ 22887 33614 131146 -53969 -125618 2915 -41016 144457 170367 27658 183458 -66256
17525B45161g0157h997B80461o0523F216a76173A4617L45876m6528j7657G7443
$$ 245161 -70157 -8997 280461 219938 6216 -176173 14617 360493 313965 296308 77443
17513b07607I9865a4610j9278A31841l3770m2828a84383H6658K6973j2231a7190
$$ -207607 99865 -14610 -33888 131841 98071 55243 -184383 86658 113631 101400 -17190
17501A17430B5012N4303C7075M1453K96886A25224Q7018O5608d58363B16163H113
$$ 117430 25012 79315 37075 78528 375414 125224 212242 277850 -458363 216163 8113
17489B46500b90344A9945M8086N4326K36575A4846J46685O5796a00202B52975
$$ 246500 -290344 19945 68031 122357 358932 14846 161531 227327 -100202 252975
17478F906L74986f824A27341E6220Q4657P174A3395J53844h4090C13987A05283
$$ 6906 381892 -6824 127341 56220 140877 148051 13395 167239 -84090 313987 105283
17466A45494B011d0948j06057B47181h5080C11767A47130R5472J6856j23846D6166
$$ 145494 2011 -40948 -147005 247181 -85080 311767 147130 242602 259458 135612 46166
17454B01465P406N1815J61189p7792o2186L65610H8055J34032J64743A31186K81158
$$ 201465 208871 260686 421875 344083 281897 647507 88055 222087 386830 131186 412344
17443D12344H7232a91491C53077A36130J05102P5668j40346J13553A4120J51870
$$ 412344 87232 -191491 353077 136130 241232 316900 176554 290107 14120 165990
17433A65990J02704a60161B01707H2503A4206e5870C24399O4436L1426A53508
$$ 165990 268694 -160161 201707 82503 14206 -55870 324399 388835 420261 153508
17422I6464c13206B56951k561J26961p2524j54254L7800K18406A44014L21576
$$ 96464 -313206 256951 254390 381351 308827 154573 192373 410779 144014 465590
17412D65590c4511C92046b02061A34947k8602M00012j84951D4410a5704B71269
$$ 465590 -34511 392046 -202061 134947 106345 506357 321406 44410 -15704 271269
17401A07983C4157J44635d7245C25780A9648O3013k3666M8725K29153A67363K51191
$$ 107983 34157 178792 -47245 325780 19648 82661 58995 107720 336873 167363 418554
17390D18554a12025j35843A86913a6871q0215E2383c84622H4817J67285a49088
$$ 418554 -112025 -247868 186913 -16871 -97086 52383 -384622 84817 252102 -149088
17379A1228J80324Q955B8317J5251J30364P8613L3403a98490g1446C3657K4446
$$ 11228 191552 200507 28317 43568 173932 252545 285948 -198490 -71446 33657 58103
17368E8103R4046P5781q2292E8146K68970N840a26827F1601J93231E4644L76183
$$ 58103 152149 227930 145638 58146 327116 332956 -126827 61601 254832 54644 430827
17357D30827d2429q1930m2519A60211o765k0671N8332l613C9413J34172J0085
$$ 430827 -42429 -124359 -166878 160211 153446 132775 191107 187494 39413 173585 183670
17346A83670F7764J37787C4397K88803a0649k80615A95912J7863C9295J56353
$$ 183670 67764 205551 34397 323200 -10649 -291264 195912 213775 39295 195648
17336A95648b0073A42805b75223A42923g653A67617N8891m5626E0088J14534j0353
$$ 195648 -20073 142805 -275223 142923 -7653 167617 226508 180882 50088 164622 154269
17325A54269o8356Q338L3115O4117G9100Q6608a84046A47281C2040J74850l5563
$$ 154269 85913 94251 127366 191483 79100 165708 -184046 147281 32040 206890 171327
17314A71327D6471K16263Q9218a3037B09545k4576n7342L96K86216m3756A2444
$$ 171327 46471 262734 351952 -13037 209545 184969 127627 128023 414239 370483 12444
17302A60485k1352K98023k05517p9181M2738J17488i7587C3221i4384B18472c6075
$$ 160485 139133 437156 231639 152458 195196 312684 -97587 33221 -94384 218472 -36075
17290B42635Q7815A38025i66A66603n7331J08769o775E6232L4967k0467M7341
$$ 242635 330450 138025 -966 166603 109272 218041 211266 56232 91199 70732 118073
17279A18073f2740A59724i8027B48421M8550n2794K3018F5700J71999c2136C97839
$$ 118073 -62740 159724 -98027 248421 296971 244177 267195 65700 237699 -32136 397839
17267F0150j6222k234O0877L99094j44834A16993p897J66737D0360J65741g3561
$$ 60150 43928 41694 102571 501665 356831 116993 109096 275833 40360 206101 -73561
17255C24750a00648C22789H2849r589J23132E0945a12847c2203B05954B5964D023
$$ 324750 -100648 322789 82849 73260 196392 50945 -112847 -32203 205954 25964 4023
17243b9755D4319J25536D0425L76806j45552c3137C19869R5886n9395H6381j5210
$$ -29755 44319 169855 40425 417231 271679 -33137 319869 415755 356360 86381 71171
17232G1171N2687K57407j31475L89210k90838o012n2545O5313A00211J50964H6529
$$ 71171 123858 381265 249790 639000 348162 342150 289605 354918 100211 251175 86529
17220d9931n7B71609J5177Q4914J2356c4187B55390M620r7383M34665j85152K577
$$ -49931 -49988 271609 286786 371700 384056 -34187 255390 260010 162627 597292 412140 414717
17208D14717Q859k08852J03118A6283K29319J04512O2750j24015A9459K16683
$$ 414717 423576 214724 317842 16283 245602 350114 412864 288849 19459 236142
17198B36142K37107A67058C9859M26741j78842R5877j84636n1672k009J27238
$$ 236142 473249 167058 39859 466600 287758 383635 198999 147327 145318 272556
17188B72556C7425J32721K46669E5090N34106B82853n4054J37355l1974o3679
$$ 272556 37425 170146 416815 55090 589196 282853 228799 366154 334180 270501
17178B70501f6212B83403Q2699q8152o462m1362R2093l2239K332L32820B92831
$$ 270501 -66212 283403 366102 277950 271488 230126 322219 289980 292312 625132 292831
17166I7814J69349J20368J89327B23273r2205L94260A75312K20210C7011L98293
$$ 97814 267163 387531 576858 223273 131068 525328 175312 395522 37011 435304
17156D35304j93222P395P9101L7469J56006r1680J95656A18567N7632J10500j35062
$$ 435304 242082 249477 328578 366047 522053 430373 626029 118567 176199 286699 151637
17145A51637C1342M02366A76123K12990I4848J2593R4926J54710j69739L7243
$$ 151637 31342 433708 176123 389113 94848 107441 202367 357077 187338 224581
17135B24581Q0686j21781L58637k02897e273B64251M109M1911E8610K68218F7952
$$ 224581 305267 183486 542123 339226 -5273 264251 268360 310271 58610 326828 67952
17123C19454L06419j58550o9214L0454O0182m0103B11284M06314k74366r7540
$$ 319454 625873 467323 398109 428563 488745 448642 211284 617598 343232 245692
17113B45692M484j7496J55287J77917K8057k04975P4003O0738j71900L10185A73130
$$ 245692 250176 232680 387967 565884 593941 388966 462969 523707 351807 661992 173130
17101E85248n4317j44700K4960J0045j24475J95022k0681j8172N7922j34846j24542
$$ 585248 530931 386231 411191 421236 296761 491783 471102 452930 510852 376006 251464
17090B51464r6058E4309L51660p5334P7427R4921K4898k7989M3391j26700L7519
$$ 251464 155406 54309 405969 330635 408062 502983 527881 499892 543283 416583 454102
17079D54102H4016J57748K79554J0515j44899A04567M92396O4891k70080q56p1635
$$ 454102 84016 241764 521318 531833 386934 104567 596963 661854 391774 390918 319283
17068C19283p8645J33025M95836D24137Q9713K5402B67193K35571J06083q5737
$$ 319283 240638 373663 869499 424137 513850 539252 267193 502764 608847 523110
17058E23110B53347K35142A73129K82408J67713k37021N8586O3164N708q1262
$$ 523110 253347 488489 173129 455537 623250 386229 444815 507979 513687 432425
17048D32425L11887o3892N7353C63690K46215q3132J23956j94024K41726B05063
$$ 432425 744312 680420 737773 363690 609905 526773 650729 456705 698431 205063
17037D81898k832N0092M0409q7645J52832j11809k29897J14921K12272A96225
$$ 481898 479066 529158 569567 481922 634754 522945 293048 407969 620241 196225
17026F01064M9525j76871Q4273k6210L12485k4467q4247B55935L81061J04364
$$ 601064 650589 473718 557991 531781 844266 819799 735552 255935 636996 741360
17016G41360C49394L01163k63172Q0985L40964N8823k84500J68012j10275r2011
$$ 741360 349394 650557 387385 468370 809334 868157 583657 751669 641394 549383
17006E49383J10331R2772J69291j81098j02330J04478J76158l67167j90243K48349
$$ 549383 659714 752486 921777 740679 638349 742827 918985 551818 361575 609924
16996F09924J04032M601J24420N8039k84269J80967r556j17337p0993K07993k15135
$$ 609924 713956 718557 842977 901016 616747 797714 788158 670821 599828 807821 592686
16985E92686k00115K64406L05949k24105J43102Q804r2534l45079K71140J36774
$$ 592686 392571 656977 962926 738821 881923 890727 798193 453114 724254 861028
16975H61028q3765J01724l0438l8804J75699L9649j08487J19683E10062M14966
$$ 861028 777263 878987 848549 809745 985444 1025093 916606 1036289 510062 925028
16965I25028M5791k15616J72038O1614J49408l77510J41066m0645l2987L42907
$$ 925028 970819 755203 927241 988855 1138263 760753 901819 861174 828187 1171094
16955A171094k38394k66362M22892Q5454n1859j01465K25605k05245r5479J85683
$$ 1171094 932700 666338 1089230 1174684 1122825 1021360 1246965 1041720 946241 1131924
16945A131924N8940l82259l14307Q74102m72243J4838J61213L10258j76820J20847
$$ 1131924 1190864 808605 494298 1368400 896157 910995 1072208 1382466 1205646 1326493
16935A326493L6360k81423j09837K20164k97904N72137n09162J89779J77144k95945
$$ 1326493 1362853 1081430 971593 1191757 893853 1465990 956828 1146607 1323751 1027806
16925A027806L64400j69722k02829K5563J79235l3311K25034N9204o5221k16694
$$ 1027806 1392206 1222484 1019655 1045218 1224453 1191142 1416176 1475380 1410159 1193465
16915A193465M46745l23315P0072J47755j39500j54719J81281J74492j9974J77349
$$ 1193465 1640210 1316895 1386967 1534722 1395222 1240503 1421784 1596276 1576302 1753651
16905A753651k60455J22957m3964K68944j73647j08215M21257l20407J16915Q0357
$$ 1753651 1493196 1616153 1572189 1841133 1667486 1559271 1980528 1660121 1777036 1857393
16895A857393O7226j93296K0850K56606Q1546k21641N9720K25132l59116J12429
$$ 1857393 1924619 1731323 1752173 2008779 2090325 1868684 1928404 2153536 1794420 1906849
16885A906849J29413M06637m52493Q5900r7072j18362L29049q3679R9928K85849
$$ 1906849 2036262 2442899 1990406 2076306 1979234 1860872 2189921 2106242 2206170 2492019
16875B492019k65331N9189p0732J75750o6510J16930j75329L95292j7731J16512
$$ 2492019 2226688 2285877 2215145 2390895 2324385 2441315 2265986 2661278 2643547 2760059
16865B760059m00372L97114l30299j32115N97943q0833K02081k18005q4155M70193
$$ 2760059 2359687 2756801 2426502 2294387 2892330 2811497 3013578 2795573 2711418 3181611
16855C181611k12745L477J46162j22877K90560M0987R3203m66625N27295l24493
$$ 3181611 2968866 2972343 3118505 2995628 3286188 3327175 3420378 2953753 3481048 3156555
16845C156555K54242o1909J0717O0189J94930L05437m11785N52966l79101K44384
$$ 3156555 3410797 3348888 3359605 3419794 3614724 3920161 3508376 4061342 3682241 3926625
16835C926625K16655o866L9350K71065j60168K75395O7733o7642J18670O8593
$$ 3926625 4143280 4136414 4175764 4446829 4286661 4562056 4629789 4562147 4680817 4749410
16825D749410J121K46688M79685n44804M13879k34377K07080L37713j54543L59301
$$ 4749410 4750531 4997219 5476904 4932100 5345979 5111602 5318682 5656395 5501852 5861153
16815E861153K0216l1484J79922L85515J41060q2046M1157L0330N71262J02367
$$ 5861153 5881369 5849885 6029807 6415322 6556382 6474336 6515493 6545823 7117085 7219452
16805G219452L20070r0242J31938N3961K09373J33430L64036K18356n1402M54420
$$ 7219452 7539522 7449280 7581218 7635179 7844552 7977982 8342018 8560374 8508972 8963392
16795H963392n9474J32700N55006J37146P11301j97732O84273K1042M49549J9474
$$ 8963392 8903918 9036618 9591624 9728770 10440071 10242339 10926612 10947654 11397203 11416677
16785A1416677K26498M16919P28335k42847O45331N70412L80089K83705O21079
$$ 11416677 11643175 12060094 12788429 12545582 13190913 13761325 14141414 14425119 15046198
16776A5046198N00252M06735M11196M54966O69257O19373O31110R64647P87200
$$ 15046198 15546450 15953185 16364381 16819347 17488604 18107977 18739087 19703734 20490934
16767B0490934K91320P64158O11335R87651J424267P67549Q62702R16245J297152
$$ 20490934 20782254 21546412 22157747 23145398 24569665 25337214 26199916 27116161 28413313
16758B8413313J139361J054360J356331J256153J738834J816478J589433J701395
$$ 28413313 29552674 30607034 31963365 33219518 34958352 36774830 38364263 40065658
16750D0065658J999986J910514K465727K175174K847110K717102K566131K885950
$$ 40065658 42065644 43976158 46441885 48617059 51464169 54181271 56747402 59633352
16742E9633352L329904L456200L765309M222141L957391M204527N118560M693204
$$ 59633352 62963256 66419456 70184765 74406906 78364297 82568824 87687384 92380588
16734I2380588N526746N454208N908954N799837O109521O702164O334560O300618
$$ 92380588 97907334 103361542 109270496 115070333 121179854 127882018 134216578 140517196
16726A40517196O345438N818327N857474M960846M279513L500633K928634J363978
$$ 140517196 146862634 152680961 158538435 163499281 167778794 171279427 174208061 175572039
16718A75572039O60380l35991j887702k729124l706411m727436n047270n968442
$$ 175572039 176232419 175896428 174008726 171279602 167573191 162845755 157798485 151830043
16710A51830043o017378o727594o276832o718522o459887o665844o177086o061683
$$ 151830043 145812665 139085071 132808239 126089717 119629830 112963986 106786900 100725217
16702A00725217n485326n257432n305913m692317m665328m255641m013122l759506
$$ 100725217 95239891 89982459 84676546 79984229 75318901 71063260 67050138 63290632
16694F3290632l575545l107819l026176k506582k650609k525687k640887j983511
$$ 63290632 59715087 56607268 53581092 51074510 48423901 45898214 43257327 41273816
16686D1273816j998129k217361j276077j903821j451822j455729j505320j018923
$$ 41273816 39275687 37058326 35782249 33878428 32426606 30970877 29465557 28446634
16678B8446634j537865r66728j237978n12114j331882m97118r47860j232083n93276
$$ 28446634 26908769 25942041 24704063 24191949 22860067 22362949 21415089 20183006 19589730
16669A9589730m05175j094783n12837l39089p55832q13086l60047o66425j22631
$$ 19589730 19184555 18089772 17576935 17237846 16482014 15668928 15308881 14642456 14519825
16660A4519825m68310n86371k38113n14581p42618k05367k76376m23204m13705
$$ 14519825 14051515 13465144 13227031 12712450 11969832 11764465 11488089 11064885 10651180
16651A0651180j94451m34607m0383l32445j15444m79602n26247L14782l14340
$$ 10651180 10456729 10022122 9981739 9649294 9533850 9054248 8528001 8842783 8528443
16642H528443l95617J04904m26142l24474K4413j6162l22243l60502k6164Q8517
$$ 8528443 8132826 8237730 7811588 7487114 7511527 7495365 7173122 6812620 6786456 6874973
16632F874973l94162J874l88349o2975k59841k11372k22840K04132k14086k14612
$$ 6874973 6480811 6482685 6094336 6031361 5771520 5560148 5337308 5541440 5327354 5112742
16622E112742N4390j65299j80892R6130l06780J71859k50053k32961J61455l25442
$$ 5112742 5167132 5001833 4820941 4917071 4610291 4782150 4532097 4299136 4460591 4135149
16612D135149k2647N8113K12007j03978k56787l91453J47682N6356k05987n8931
$$ 4135149 4112502 4170615 4382622 4278644 4021857 3630404 3778086 3834442 3628455 3569524
16602C569524j94647M02761l29772j82422j23192K69047j67385L9211m80247L50268
$$ 3569524 3374877 3777638 3447866 3265444 3142252 3411299 3243914 3283125 2802878 3153146
16592C153146n6351j27630j72988K23060M0878l96393j18669K43225j70945k5022
$$ 3153146 3096795 2969165 2796177 3019237 3060115 2663722 2545053 2788278 2617333 2592311
16582B592311p1607k50051j5316n18J68292o8111l57629L31849k47309K99830
$$ 2592311 2520704 2270653 2255337 2254819 2423111 2355000 1997371 2329220 2081911 2381741
16572B381741j23319n39778N54707j8216j15041K1302k97118L79799l09749L81778
$$ 2381741 2258422 1718644 2273351 2255135 2140094 2161396 1864278 2244077 1934328 2316106
16562B316106l42142j70017j17402o8410M62500q9572n32316M64013j55355k8632
$$ 2316106 1973964 1803947 1686545 1618135 2080635 1991063 1458747 1922760 1767405 1738773
16552A738773J96855k39434K8946K1137k28153L2827M88152n70098k04047J49233
$$ 1738773 1935628 1696194 1725140 1746277 1518124 1550951 2039103 1469005 1264958 1414191
16542A414191l25333M90472k29107K47712j90473M9261j58784k99525K70971k11020
$$ 1414191 1088858 1579330 1350223 1597935 1407462 1456723 1297939 998414 1269385 1058365
16532A058365R2285o7153M9101q4556J83613J07764l00707L97242q0283k50098
$$ 1058365 1150650 1083497 1132598 1048042 1231655 1339419 1038712 1435954 1355671 1105573
16522A105573L08447j01519k81138O1612K2561J15315l0750J25036l97234J64455
$$ 1105573 1414020 1312501 1031363 1092975 1115536 1230851 1200101 1325137 927903 1092358
16512A092358L03895k54967j87055j5918R1484J2543j73897P5449l90246K97716
$$ 1092358 1396253 1141286 954231 938313 1029797 1042340 868443 943892 553646 851362
16502H51362l2969J08395L75707l69988q7459M78335n63783K9463K75481D98955
$$ 851362 818393 926788 1302495 932507 845048 1323383 759600 789063 1064544 498955
16491G73527n4450K37268k32292J60788k33526J42063n4586j79075K40255J04166
$$ 773527 719077 956345 724053 884841 651315 793378 738792 559717 799972 904138
16481I04138k16488M0503L48354l24529j6498l6762K05740r8677o2808J29034
$$ 904138 687650 728153 1076507 751978 735480 698718 904458 805781 742973 872007
16471H72007l20087K30941k21800Q9102L51440k97296J33980k32499M56368k62659
$$ 872007 551920 782861 561061 650163 1001603 704307 838287 605788 1062156 799497
16461G99497l52898K43684o0048K67699j02572J27627k34406K93323k25036Q6682
$$ 799497 446599 690283 630235 897934 795362 922989 688583 981906 756870 843552
16451H43552j08874j59802J17109o6284j22780B09691J14339J93874n690J02166
$$ 843552 734678 574876 691985 625701 502921 209691 324030 517904 512214 614380
16441F14380k65757J29711J71164P9896j27156k95316K31110q3077K45028k03776
$$ 614380 348623 478334 649498 729394 602238 306922 538032 454955 699983 496207
16431D96207J16613j70212J07811l953o7829J3925r2095j67766L47119K34070
$$ 496207 612820 442608 550419 546466 478637 492562 400467 232701 579820 813890
16421H13890B46543K86276j23599k6947J16981K7226R2957j59174j11859J19632
$$ 813890 246543 532819 409220 382273 499254 526480 619437 460263 348404 468036
16411D68036n6288j62642K98138q9519l3718J32818k00830J82663O5304A89945
$$ 468036 411748 249106 547244 457725 424007 556825 355995 538658 603962 189945
16400F06240B55738J11993A75447M52660k6077B41889L02007A87297L58446B04955
$$ 606240 255738 367731 175447 628107 602030 241889 543896 187297 545743 204955
16389B05488N20301B24135K18640Q1691k45531q2421M69204B01918J57980r1789
$$ 205488 725789 224135 442775 524466 278935 196514 665718 201918 359898 268109
16379B68109h379A61725K88346A94608O03223B70066J34554P0946j97290m1660
$$ 268109 -8379 161725 450071 194608 797831 270066 404620 475566 278276 236616
16369B36616n18L69740m2179B05921D3955K14291K69940j52817I5616R5120J31105
$$ 236616 236098 605838 563659 205921 43955 258246 528186 375369 95616 190736 321841
16358C21841J71261P5614d2495D68364d3019A03687l6114K51760J08378f2839
$$ 321841 493102 568716 -42495 468364 -43019 103687 67573 319333 427711 -62839
16347G34643A64243K20151o6283J03999A96496R4987j653H7634K75464p3013j22775
$$ 734643 164243 384394 318111 422110 196496 291483 289830 87634 363098 290085 167310
16336A67310G9144R077J82493A21775L11416A78302j0123C5191K2333d6757C78401
$$ 167310 79144 88221 270714 121775 433191 178302 168179 35191 57524 -46757 378401
16324A60688K16763F4300J0000J48498J30037r1406M7687r3969I5447a67506B73211
$$ 160688 377451 64300 74300 222798 352835 261429 309116 215147 95447 -167506 273211
16312C39811j08612j2971Q9227c2157J3794B86599A24438n0074J18008A2669L617
$$ 339811 231199 218228 307455 -32157 -18363 286599 124438 74364 192372 12669 16286
16301A6286J63702a15364A69529a01739H3475L53421D3229J2257J29730P801j0504
$$ 16286 179988 -115364 169529 -101739 83475 436896 43229 55486 185216 193017 182513
16290A82513J5310f4182A68733o7748j1805K4921m2769c2377A48883K89962a42160
$$ 182513 197823 -64182 168733 100985 89180 114101 71332 -32377 148883 438845 -142160
16278D0384J1514L77786q5491j71666O1970m3977C3236J57767R378J66308M2054
$$ 40384 51898 429684 344193 172527 234497 190520 33236 191003 200381 366689 408743
16267D08743j37744I6110K60987A70126M1623b34603C14728A7378O8399L02881
$$ 408743 270999 96110 357097 170126 211749 -234603 314728 17378 85777 388658
16257C88658o6106f6149B67751A08032J32104j01455K6212e1365j75394B3182
$$ 388658 322552 -66149 267751 108032 240136 138681 164893 -51365 -226759 23182
16246A38652J4279o2195e4555B98853B2012N5274J72965A22771m5271a28286b1214
$$ 138652 152931 90736 -54555 298853 22012 77286 250251 122771 77500 -128286 -21214
16234a74543D6330P9365a2B33155m8434A8563J68742H8150e0023j30583E1527
$$ -174543 46330 125695 -12 233155 184721 18563 187305 88150 -50023 -180606 51527
16222d1759F0692K39292A18026K8329J0041M21J9595o5143b9471B1439J6735K92761
$$ -41759 60692 299984 118026 146355 156396 156817 176412 111269 -29471 21439 38174 330935
16210C30935k4132b4902A30375J9022E9137Q077J39698a44878A37901b52337B24671
$$ 330935 306803 -24902 130375 149397 59137 67214 206912 -144878 137901 -252337 224671
16198a80046c864F6625O269a4569A56520h2950A27273a2878B11850l1012c43287
$$ -180046 -3864 66625 72894 -14569 156520 -82950 127273 -12878 211850 180838 -343287
16186C56287a9035C521K3486L6036e8945A55978l8380O3884q7444k1939d2360
$$ 356287 -19035 3521 27007 63043 -58945 155978 117598 181482 94038 72099 -42360
16174B38018G0736N8179J15822e3134o5013o9170A31018Q795b9361F9056k7720
$$ 238018 70736 128915 244737 -53134 -118147 -187317 131018 139813 -29361 69056 41336
16163D1336q79j6043M0732J88060g7820G0129b2756m0886j325a1169j32539p2276
$$ 41336 40457 24414 65146 253206 -77820 70129 -22756 -63642 -64967 -11169 -143708 -215984
16151b15984B4608d05067a46843O4163p7391A48109D8362a34256f5265E2282J54225
$$ -215984 24608 -405067 -146843 -82680 -160071 148109 48362 -134256 -65265 52282 206507
16140B06507d1268j21188g2750C9998J14691g9623f4l79071f2953B73276Q0530
$$ 206507 -41268 -162456 -72750 39998 154689 -79623 -64 -379135 -62953 273276 353806
16129C53806D2895b8122A48437F0797c52860A16473c8510I5818j6179n907J32491
$$ 353806 42895 -28122 148437 60797 -352860 116473 -38510 95818 79639 73732 206223
16118B06223h2349A45236a50229D04350d9397A1593E415K77232c1407j27008E0668
$$ 206223 -82349 145236 -150229 404350 -49397 11593 5415 282647 -31407 -158415 50668
16106A60530o2948g3694j0338m903B00088l0592D7127K77121F4166i4504b7183
$$ 160530 97582 -73694 -84032 -88935 200088 169496 47127 324248 64166 -94504 -27183
16094b4500E5088f4338p0642M991a7399o5990j17093f5306j12155O9568b1865
$$ -24500 55088 -64338 -134980 -129989 -17399 -83389 -200482 -65306 -177461 -107893 -21865
16082a40166a1565F4417Q1425g7619A88428k4050b2550j83877o2392D66991I133
$$ -140166 -11565 64417 145842 -77619 188428 164378 -22550 -206427 -268819 466991 9133
16070A59129K5706I0760b84188C6976M4565E236K12876a82284A75958C5850g8241
$$ 159129 184835 90760 -284188 36976 81541 5236 218112 -182284 175958 35850 -78241
16058a76232e5901A465K77707a92310f3068A05733B4621L95913A29595b63562
$$ -176232 -55901 1465 279172 -192310 -63068 105733 24621 420534 129595 -263562
16047B79641a17635c9159k7398B13116a28361c923A36599g3585d895A23652L7760
$$ 279641 -117635 -39159 -66557 213116 -128361 -3923 136599 -73585 -4895 123652 161412
16036A61412o4843a14492b5588j43505C25267j2301e3710A06525N0289j3991K26531
$$ 161412 96569 -114492 -25588 -169093 325267 312966 -53710 106525 156814 142823 369354
16025C69354B579K8501Q5412J5918a4780H2484b02144r6701e2651l55586a97461
$$ 369354 2579 31080 116492 132410 -14780 82484 -202144 -298845 -52651 -408237 -197461
16013E4943a19925L4960r3755k51828J96338I3497a68686G9186a27661q4279g0545
$$ 54943 -119925 -84965 -178720 -430548 -234210 93497 -168686 79186 -127661 -211940 -70545
16001A8207J40125c93628G7290M6692F1750a75355i174L252H9239J34160a38559
$$ 18207 158332 -393628 77290 123982 61750 -175355 -9174 -5922 89239 223399 -138559
15989h6432A03483m5012m063a49654L5246A65253J43084H5872K74392m4128A27163
$$ -86432 103483 58471 54408 -149654 -114408 165253 308337 85872 360264 316136 127163
15977C0446A3536B733a59535e0474A57946f6397k71748g0701f192m0522J305l20753
$$ 30446 13536 2733 -159535 -50474 157946 -66397 -338145 -70701 -6192 -46714 -45409 -366162
15965c66162j34489D0654n389P085a45445n0844A44594J85890e7985B92407q194
$$ -366162 -500651 40654 35265 42350 -145445 -196289 144594 330484 -57985 292407 284213
15954B84213h3853j30535a7407j92336L1658B6311J27977n7618m3292c35850A75766
$$ 284213 -83853 -214388 -17407 -209743 -178085 26311 154288 96670 53378 -335850 175766
15942G3262a34917d2957j86262I5561i9521b5616k34026A55890e2881C7495R5333
$$ 73262 -134917 -42957 -229219 95561 -99521 -25616 -259642 155890 -52881 37495 132828
15931A32828c60580A45286j2374a62082l6423I194d96064I2241J06139a31977
$$ 132828 -360580 145286 132912 -162082 -198505 9194 -496064 92241 198380 -131977
15920a0556j46223f9058h792A9307J67995f4978A70545k2200i748H0109J04755
$$ -10556 -156779 -69058 -8792 19307 187302 -64978 170545 148345 -9748 80109 184864
15909A84864M0437h6531E8587d3233A3651c57219d3267D5328R7721b01945D4185
$$ 184864 225301 -86531 58587 -43233 13651 -357219 -43267 45328 143049 -201945 44185
15897A1074g6499F2848a24576b6688q6110l27615A59148N0037b4520n3792A00010
$$ 11074 -76499 62848 -124576 -26688 -112798 -440413 159148 209185 -24520 -78312 100010
15885i5213G7154a8406j73503A17323g7810A0419K8709J64302J9151f8268C7032
$$ -95213 77154 -18406 -191909 117323 -77810 10419 39128 203430 222581 -68268 37032
15873b61082g203k21335G9546a35090A56727a64775C9924b5322A2881a50575j66537
$$ -261082 -7203 -228538 79546 -135090 156727 -164775 39924 -25322 12881 -150575 -317112
15862c17112A01137m6680a14577L4247L290A47728J50410a2330k72738A06446
$$ -317112 101137 54457 -114577 -80330 -77040 147728 298138 -12330 -285068 106446
15851g756r6349L8402D1382a41281f0859C2378a88461f0988C07635a41238C4487
$$ -7756 -104105 -65703 41382 -141281 -60859 32378 -188461 -60988 307635 -141238 34487
15839b10194A52725f6650p0478C19315F812J24054c7324j74125d1635q643l14578
$$ -210194 152725 -66650 -137128 319315 6812 130866 -37324 -211449 -41635 -50278 -364856
15828c64856f4927A23621g0115A19726q389a86490B7319J57794i3740k08548J00413
$$ -364856 -64927 123621 -70115 119726 111337 -186490 27319 185113 -93740 -302288 -201875
15817b01875c5423A52170E1794a04029m2851j35269D2299K36911f7950A1490M7305
$$ -201875 -35423 152170 51794 -104029 -146880 -282149 42299 279210 -67950 11490 58795
15806E8795a22842L9135L6720j79945N0560l6837O1698A15108c5820A30029b67824
$$ 58795 -122842 -83707 -46987 -226932 -176372 -213209 -151511 115108 -35820 130029 -267824
15794a05713j17112k3135d1410A43056a69276F1372g6370A30418b48569C05761
$$ -105713 -222825 -245960 -41410 143056 -169276 61372 -76370 130418 -248569 305761
15783B53388g7519B09144b28554D806J37570o5666b70023B09628d5759j69111
$$ 253388 -77519 209144 -228554 4806 142376 76710 -270023 209628 -45759 -214870
15773b14870E470N9753A4091N8217a44729p4385O3128M5088q0509A49147a92659
$$ -214870 5470 65223 14091 72308 -144729 -219114 -155986 -110898 -191407 149147 -192659
15761i4542C5489J2950a91209M6064B97840I8439B5618L3105d940l91027B71911
$$ -94542 35489 48439 -191209 -145145 297840 98439 25618 58723 -4940 -395967 271911
15749a90682O6245F5182l500J34784I7639h031C6550d015k0195r2979K3267a8936
$$ -190682 -124437 65182 61682 196466 97639 -8031 36550 -4015 -24210 -117189 -93922 -18936
15736C4625b47656m8363E7538k0807J37095i2456C03525A20579M8161D2159c06614
$$ 34625 -247656 -296019 57538 36731 173826 -92456 303525 120579 168740 42159 -306614
15724b22764A14607K92669C9696j3645c43733a60052A41683g5255j22757c1101
$$ -222764 114607 407276 39696 26051 -343733 -160052 141683 -75255 -198012 -31101
15713b53392C03031p2325c4966D1271J12262O9829h9588j06045A29724a18303
$$ -253392 303031 230706 -34966 41271 153533 223362 -89588 -195633 129724 -118303
15702A31574a26128L0148q4874B21204N9407A14567j4414b13534N9192B5294F927
$$ 131574 -126128 -95980 -180854 221204 280611 114567 100153 -213534 -154342 25294 6927
15690b44889B0547O9070e9065A27334b16313O7064E5468c25176g2058j39400i5690
$$ -244889 20547 89617 -59065 127334 -216313 -149249 55468 -325176 -72058 -211458 -95690
15678a43901A40652C7740b06288j44943b0269j5760G8959h8633A68016L45a95334
$$ -143901 140652 37740 -206288 -351231 -20269 -36029 78959 -88633 168016 168361 -195334
15666B80163j07902a0462j40390e180p5042N948A31083A9316R4393i4807B5104
$$ 280163 172261 -10462 -150852 -5180 -80222 -74274 131083 19316 113709 -94807 25104
15654a26080j01435A32425a40027l5744p054k07413a01920k554j9765I4420M9089
$$ -126080 -227515 132425 -140027 -175771 -182825 -390238 -101920 -104474 -124239 94420 143509
15643A43509g5961A13317B0569k552f3208C45545d09090D9790c5554j32337E7831
$$ 143509 -75961 113317 20569 18017 -63208 345545 -409090 49790 -35554 -167891 57831
15631i0709H2031M704c2136j85048k74393i0832a2846A3996K85017H751K19h9025
$$ -90709 82031 86735 -32136 -217184 -491577 -90832 -12846 13996 299013 8751 8970 -89025
15618b30805j5343a17281d4868k9794j52442j976A62684l8552a52474B017J17310
$$ -230805 -246148 -117281 -44868 -74662 -227104 -229080 162684 124132 -152474 2017 119327
15607A19327e1660K692p2799D2697n311j6839a43388L1981J728N3461l0526j69845
$$ 119327 -51660 -48968 -121767 42697 37386 20547 -143388 -111407 -109679 -56218 -86744 -256589
15595b56589I0753k1531k1833b29998A10273a23429q0671N6870G9351J32172J34550
$$ -256589 90753 69222 47389 -229998 110273 -123429 -204100 -147230 79351 211523 346073
15584C46073c6445q5585j43119a12571e4298A58329i7187f582r622j3742D199
$$ 346073 -36445 -122030 -265149 -112571 -54298 158329 -97187 -6582 -16204 -29946 4199
15572C61115A79377a48111f3502H1835F27L98955b09227A2056P0124J18539a5910
$$ 361115 179377 -148111 -63502 81835 627 399582 -209227 12056 82180 200719 -15910
15560I2870A478J43472d1609R14G5842N9413a91738M1847L7904R770H3417b4758
$$ 92870 1478 144950 -41609 -40695 75842 135255 -191738 -149891 -111987 -102217 83417 -24758
15547a45586k7623C25031a05520j03892B79604d8992K0304j39351j25347c7045
$$ -145586 -173209 325031 -105520 -209412 279604 -48992 -28688 -168039 -293386 -37045
15536A29037A1830a52596a5412j36208b1861B69085j12020O2731b68924d3568
$$ 129037 11830 -152596 -15412 -151620 -21861 269085 157065 219796 -268924 -43568
15525a03266H0982g8488A2871a33441a6978A38831c5017F7308a21602b431B84334
$$ -103266 80982 -78488 12871 -133441 -16978 138831 -35017 67308 -121602 -2431 284334
15513D35888h4248j74637H0227j1552K06380r7318a27010k39222c8291k43688
$$ 435888 -84248 -258885 80227 68675 275055 177737 -127010 -366232 -38291 -281979
15503b81979H340c72611a53909c1589J4174j45715f539n5115F4080B3837a00014
$$ -281979 8340 -372611 -153909 -31589 -17415 -163130 -6539 -61654 64080 23837 -100014
15491b36265B5846J5249J31738a21702H8709B3089a03715C03283c7828C57562
$$ -236265 25846 41095 172833 -121702 88709 23089 -103715 303283 -37828 357562
15480A29616i1861B31666d1486C48450c73300G6320J42029C2715a03413E4936
$$ 129616 -91861 231666 -41486 348450 -373300 76320 218349 32715 -103413 54936
15469b46550H5741J386d5121B45580q1049j4047l4452B4723K06923J6142E3755
$$ -246550 85741 87127 -45121 245580 164531 150484 116032 24723 231646 247788 53755
15457b9961j31609F6589b23291H5898b48009I39J47305J12303A10092J45056c16730
$$ -29961 -161570 66589 -223291 85898 -248009 939 148244 260547 110092 255148 -316730
15445a19857A5990R1883O4411g7587A42451g9985A83205C085b21776D5440b29668
$$ -119857 15990 107873 172284 -77587 142451 -79985 183205 3085 -221776 45440 -229668
15433c2624B74938A28789D6742K25415K80922b15477A23847n8839b23888m8752
$$ -32624 274938 128789 46742 272157 553079 -215477 123847 65008 -223888 -272640
15423b72640B51133b13111A54144n0817M11842B9167J71670b34751M4302j9408
$$ -272640 251133 -213111 154144 103327 515169 29167 200837 -234751 -190449 -209857
15413b09857B13539a46269O2538A74830a44680l3785M6491e7897A14145a55186
$$ -209857 213539 -146269 -83731 174830 -144680 -178465 -131974 -57897 114145 -155186
15402I3279A2265M20452c0895a4079j50422A58310f4307A95251c9582H1253a74125
$$ 93279 12265 432717 -30895 -14079 -164501 158310 -64307 195251 -39582 81253 -174125
15390A72213D4412Q226f0465j32120B10982c36596O2375B20374C0007a2286j89588
$$ 172213 44412 52638 -60465 -192585 210982 -336596 -274221 220374 30007 -12286 -201874
15379b01874B9812K4337A6725J95908a8615I7127b28144C1115I601a69318b7824
$$ -201874 29812 54149 16725 212633 -18615 97127 -228144 31115 9601 -169318 -27824
15367d66653P9645a41296K2188A02869a37494j36607A23618E4125L90728a09172
$$ -466653 -387008 -141296 -119108 102869 -137494 -274101 123618 54125 444853 -109172
15356B12186a9240Q073j56377d8502O304F6056a16277A33141N7555e3716q3343
$$ 212186 -19240 -11167 -167544 -48502 -42198 66056 -116277 133141 190696 -53716 -137059
15345a37059I9318a72185o3610C41805d3295j03509M6536B66369L5397c4984q9106
$$ -137059 99318 -172185 -235795 341805 -43295 -146804 -100268 266369 301766 -34984 -124090
15334a24090p254C95866j56368f753C05902j28329J26971b07785A89605E1752
$$ -124090 -131344 395866 239498 -6753 305902 177573 304544 -207785 189605 51752
15323A222e1094B0099a86689F4080a61157c0277j09888e9792p0557A30427a36165
$$ 1222 -51094 20099 -186689 64080 -161157 -30277 -140165 -59792 -130349 130427 -136165
15311B04075G9324J4719J02034F639b63576A4913R7140C4175b34252B63930f3316
$$ 204075 79324 94043 196077 6639 -263576 14913 112053 34175 -234252 263930 -63316
15299b36017C8672b1811r5405C63326b01646A06033m9739k7914M2014P0680C0405
$$ -236017 38672 -21811 -117216 363326 -201646 106033 56294 28380 70394 141074 30405
15287A84821J10830I298e5766H8491a54714k8803C05649B4542P6583J3236j2516
$$ 184821 295651 9298 -55766 88491 -154714 -183517 305649 24542 101125 114361 101845
15276A01845J32603r1138L3341d2750B49641j21717a97783Q9461a3180j1093G5384
$$ 101845 234448 143310 176651 -42750 249641 127924 -197783 -108322 -13180 -24273 75384
15264A61611d1395A51394P4088r6556j2726l0758A1070K26318n5666a13413G2592
$$ 161611 -41395 151394 225482 128926 116200 85442 11070 237388 181722 -113413 72592
15252h8501A38236J28252j4409J63411O67616L72162n14339L23789l41236H5551
$$ -88501 138236 266488 252079 415490 1083106 1455268 940929 1264718 923482 85551
15241B00229f9316A81650M5774h7293c0717E11632A43372E0645i2187c6350B52509
$$ 200229 -69316 181650 227424 -87293 -30717 511632 143372 50645 -92187 -36350 252509
15229a97502B36395L5679E0555O221K82489d9136F8407a6080P800G6258b14993
$$ -197502 236395 272074 50555 56776 339265 -49136 68407 -16080 -8280 76258 -214993
15217A40899f5818k0331E8014K11398J68306I0463f0261G7476a30350b3036A1060
$$ 140899 -65818 -86149 58014 269412 437718 90463 -60261 77476 -130350 -23036 11060
15205B55649a57294F4307e4938G8136J54037I2400Q9058b28364C15613A44437
$$ 255649 -157294 64307 -54938 78136 232173 92400 181458 -228364 315613 144437
15194B38242a74162B78408a35902D57108B03607m6265c7824l0254F4806j9681
$$ 238242 -174162 278408 -135902 457108 203607 157342 -37824 -68078 64806 45125
15184D5125P1648l2044J16391H4048J15684F9688P0910f3630j53717B41036m2340
$$ 45125 116773 84729 201120 84048 199732 69688 140598 -63630 -217347 241036 198696
15173A98696n1662i1326A02994J40586A061L1821J50579L317J07405d7381j23738
$$ 198696 147034 -91326 102994 243580 1061 32882 183461 186778 294183 -47381 -171119
15162a71119i611j3842A7691P913I929J64617q1520O3598b169A61327J47277i0048
$$ -171119 -9611 -23453 17691 25604 9929 174546 93026 156624 -2169 161327 308604 -90048
15149F3772K99923a94457A83222J51324j59376d52230E237L7128J92815A13671
$$ 63772 363695 -194457 183222 334546 175170 -452230 5237 42365 235180 113671
15138A53573M6061a68010A64111R9990m9247J01327j24635p6593Q9717d1836C61629
$$ 153573 199634 -168010 164111 264101 214854 316181 191546 114953 204670 -41836 361629
15126b08077D83182B063K02095b7081A51205b9755p5502k292I0078C215P2575
$$ -208077 483182 2063 204158 -27081 151205 -29755 -105257 -107549 90078 3215 75790
15115G5790K18937R6223j93836F6485A4159K27249e0484A18616a07194a7664B0289
$$ 75790 294727 390950 197114 66485 14159 241408 -50484 118616 -107194 -17664 20289
15103A75915e3748l9348C7147J76204R127A5402R8243J33413E2706J32707c9692
$$ 175915 -53748 -93096 37147 213351 222478 15402 113645 247058 52706 185413 -39692
15091b62139A86207J4906o3445J36952J31761h847G223J65339N5569j9324G2200
$$ -262139 186207 201113 137668 274620 406381 -8847 7223 172562 228131 208807 72200
15079c54643F893L09800j01688B9792K42952E6128a06445A92595E2550J40988
$$ -354643 6893 316693 215005 29792 272744 56128 -106445 192595 52550 193538
15069A93538a36266c6392A41305N9269J79264j76571n7157Q5993A08172K4386
$$ 193538 -136266 -36392 141305 200574 379838 203267 146110 232103 108172 132558
15059A32558K98883I259O5129K07260j9521J36721f3474A80403p5589p75a056
$$ 132558 431441 9259 74388 281648 262127 398848 -63474 180403 104814 104039 -1056
15047B21401P3568k0633d5549E22685j24115N4187a24883e0995B90400r1332k9252
$$ 221401 294969 274336 -45549 522685 398570 452757 -124883 -50995 290400 199068 169816
15036A69816D9474a82510D03747A44702p0639J27969q4885J43986m7438a70966
$$ 169816 49474 -182510 403747 144702 74063 202032 117147 261133 213695 -170966
15025D61747q1131F6788R3943K69170B05769L4222b9580A91450a23636I5530K633
$$ 461747 380616 66788 160731 429901 205769 239991 -29580 191450 -123636 95530 98163
15014I8163J71006a7345C92855j5045r5096G9731J02255b0536B58776J05645e7455
$$ 98163 269169 -17345 392855 377810 282714 79731 181986 -20536 258776 364421 -57455
15002C20076k4202c0329B32190N2417l2257O9757A46864n5783M6081m5690K01190
$$ 320076 295874 -30329 232190 284607 252350 322107 146864 91081 137162 91472 292662
14991B92662o7935J10696A01753O1358N4994f601B11554K47751a59120D4119K72839
$$ 292662 224727 335423 101753 163111 218105 -6601 211554 459305 -159120 44119 316958
14980C16958j38551J3058H4971e7423a2497I0039J6703j0390J72537b23583C17660
$$ 316958 178407 191465 84971 -57423 -12497 90039 106742 96352 268889 -223583 317660
14968A01782l3640Q1475K76972A55560P6020N3854A15818J86471b4300B20983
$$ 101782 68142 149617 426589 155560 231580 285434 115818 302289 -24300 220983
14957B80658f3060I6256m4634L44682k3953j65852J4541r1935L7870K17161r7571
$$ 280658 -63060 96256 51622 396304 372351 206499 221040 129105 166975 384136 286565
14946B86565o8783n513F7172J42573J12116L1769L0804A30752a63648A41081K04836
$$ 286565 217782 212269 67172 209745 321861 353630 384434 130752 -163648 141081 345917
14935C45917A20133K07795K05545B60323J09542A26884J93615A51152K04996j04922
$$ 345917 120133 327928 533473 260323 369865 126884 320499 151152 356148 251226
14925B51226L2408j22991Q131J5109O0832a08185C10235I4366b07440E29300e4020
$$ 251226 283634 160643 168774 183883 244715 -108185 310235 94366 -207440 529300 -54020
14913D32340j68080J03084j25200L6531l8949L0999K00385l373j19900J05212
$$ 432340 264260 367344 242144 278675 239726 270725 471110 467737 347837 453049
14903D53049K55263B31580o4G8373M25088N6043B19415J37888O5632A11375J88800
$$ 453049 708312 231580 231516 78373 503461 559504 219415 357303 422935 111375 300175
14892C00175j09130L2953J50262o9170o5008m562I7747J49595J23015j21356J44899
$$ 300175 191045 223998 374260 305090 240082 235520 97747 247342 370357 249001 393900
14881C93900J9822m2077j49716M8874J03037L3776j24811m3286I3710K99343L12447
$$ 393900 413722 371645 221929 270803 373840 407616 282805 239519 93710 393053 705500
14870G05500k46353A96517P6708j9259n5366Q5482J35761j20261J85220I3609
$$ 705500 459147 196517 273225 253966 198600 284082 419843 299582 484802 93609
14859F64280B19124O2538L98781k00910p0930G5344M32937D2103M89498N508n9566
$$ 664280 219124 281662 680443 479533 408603 75344 508281 42103 531601 537109 477543
14848D77543m1504H0409M80396A09943P05714B05336J83300K62592n4582j01104
$$ 477543 436039 80409 560805 109943 815657 205336 388636 651228 596646 495542
14838D95542j82518L22382j97437A54576Q4668k7719M21437j77363K17930A36792
$$ 495542 313024 635406 437969 154576 239244 211525 632962 455599 673529 136792
14827E19628o0270j4032L0709k19431K56674K64825k57967j32046K57193J56385
$$ 519628 459358 445326 476035 256604 513278 778103 520136 388090 645283 801668
14817H01668l48712p9759j331Q4022J57874k55028R7360P1085o1212B29715J72327
$$ 801668 452956 373197 371866 455888 613762 358734 456094 527179 465967 229715 402042
14806D02042q2490J53891j39374j0637K32148B16445O74461C58563j28549K55420
$$ 402042 319552 473443 334069 323432 555580 216445 890906 358563 230014 485434
14796D85434R4255B06680O62581l90460k08164K80788q2578J40111J84074k91487
$$ 485434 579689 206680 869261 478801 270637 551425 468847 608958 793032 501545
14786E01545j33265L26287l22055J03206K78068o003k54625j20965M65844O5959
$$ 501545 368280 694567 372512 475718 753786 747783 493158 372193 838037 903996
14776I03996D30344K24121k58619M5594K51107k4582C23664K16196l6911J55343
$$ 903996 430344 654465 395846 441440 692547 667965 323664 539860 502949 658292
14766F58292K17902j22299m1885o6594P7906B52303M94721j57872K3937m6779
$$ 658292 876194 753895 712010 645416 723322 252303 747024 589152 613089 566310
14756E66310K29394C23289M49171J27370k38120O0324o8909N8022K37429m04133
$$ 566310 795704 323289 772460 899830 661710 722034 653125 711147 948576 544443
14746E44443J77147k55475J85514K40685q3126l04393J17698N0752k29583L79067
$$ 544443 721590 466115 651629 892314 809188 504795 622493 673245 443662 822729
14736H22729j91452j45509L43414j44583j88022L80640o6728n1723o0134k78663
$$ 822729 631277 485768 829182 684599 496577 877217 810489 758766 698632 419969
14726D19969L99237R9600M067j92386r1640n3308M24694k48948k27531L50773
$$ 419969 819206 918806 922873 730487 638847 585539 1010233 761285 533754 884527
14716H84527k0777m8965Q6976N9883k83099L62583l40883J32094K2001M41649
$$ 884527 863750 814785 901761 961644 678545 1041128 700245 832339 854340 1295989
14706A295989E69651J67182l5671J49368r4691K01234J57140m54418K00612k45974
$$ 1295989 569651 736833 701162 850530 755839 957073 1114213 659795 860407 614433
14696F14433J62927J53987k6590J0332J2145j62675Q332K87746k54666K62682
$$ 614433 777360 931347 904757 915089 927234 764559 772891 1060637 805971 1068653
14686A068653l74432P6525j5372J43403J93094l40086K08706J19885l07092N27701
$$ 1068653 694221 770746 755374 898777 1091871 751785 960491 1080376 773284 1300985
14676A300985m06268r3527k9858J98247P4452k61452M05914J21930m56558O7967
$$ 1300985 894717 801190 771332 969579 1044031 782579 1188493 1310423 853865 921832
14666I21832l18186M46712J41155m8485J28938j34921r5084j47631K1860J73589
$$ 921832 603646 1050358 1191513 1143028 1271966 1137045 1041961 894330 916190 1089779
14656A089779M93045l17291l55966R7205J14686q7248K40050k06865J53705k798
$$ 1089779 1582824 1265533 909567 1006772 1121458 1034210 1274260 1067395 1221100 1218302
14646A218302l04930J61714k27065O68946q1234j84206l9172J44782k51240k6450
$$ 1218302 913372 1075086 848021 1516967 1435733 1251527 1212355 1357137 1105897 1079447
14636A079447K51100j1461k41116K07016j6383j87520M06730j78977q6184L23492
$$ 1079447 1330547 1319086 1077970 1284986 1268603 1081083 1487813 1308836 1222652 1546144
14626A546144p9670m9405j37585k31356K82331J34947o0673n1674O9614J40332
$$ 1546144 1466474 1417069 1279484 1048128 1330459 1465406 1404733 1353059 1422673 1563005
14616A563005j49722J68212j10399N086K8112J61821l01518J52619P5381R375
$$ 1563005 1413283 1581495 1471096 1476182 1504294 1666115 1364597 1517216 1592597 1601972
14606A601972j44574J39862k04006L69724j9634j65532k23881O3118L62384k78516
$$ 1601972 1457398 1597260 1393254 1762978 1743344 1577812 1353931 1417049 1779433 1500917
14596A500917K13174k03985K3696p3005R8700R7895K54346l07043K9943j0280
$$ 1500917 1714091 1510106 1533802 1460797 1559497 1657392 1911738 1604695 1634638 1624358
14586A624358K97281m91459P21809j46459l66912K52412n1163P9364J4502Q3123
$$ 1624358 1921639 1430180 2151989 2005530 1638618 1891030 1839867 1919231 1933733 2016856
14576B016856q1338M2932j26852K8319J17100N4612j90211K92987j2360N4109
$$ 2016856 1935518 1978450 1851598 1879917 1997017 2051629 1861418 2154405 2142045 2196154
14566B196154J93605M5221P1164j06563Q5959q250K89707j58803P2062L1537N05457
$$ 2196154 2389759 2434980 2506144 2399581 2485540 2477290 2766997 2608194 2680256 2711793 3217250
14555C217250j28637M60724L86692J08325R49649J014565K240519M495489Q782934
$$ 3217250 3088613 3549337 3936029 4044354 4994003 6008568 8249087 12744576 21527510
14546B1527510J7647415j365081A7699197H362527m000461j777425j72344k07394
$$ 21527510 39174925 37809844 17699197 8362527 4362066 2584641 2412297 2204903
14538B204903l93808J23418l0110M5189L52636j46870Q9687l42982L68283k51648
$$ 2204903 1811095 1934513 1904403 1949592 2302228 2155358 2245045 1902063 2270346 2018698
14528B018698K53888k7191L88547k77058j09136K97806l74338j08155M19618l5203
$$ 2018698 2272586 2245395 2633942 2356884 2247748 2545554 2171216 2063061 2482679 2447476
14518B447476k49076L62048k00776M90193p3933j9622n05403O85116k60005J08183
$$ 2447476 2198400 2560448 2359672 2849865 2775932 2756310 2250907 2936023 2676018 2784201
14508B784201L73627l03479k99929L25056J03551J71890l16183J69994j27285
$$ 2784201 3157828 2854349 2554420 2879476 2983027 3154917 2838734 3008728 2881443
14499B881443L67497l95856L75617p2792j99268L60949L26754j80634j20059k9070
$$ 2881443 3248940 2853084 3228701 3155909 2956641 3317590 3644344 3463710 3343651 3314581
14489C314581M6121o5488j24429M09518J13106R4896l03098l844K5548L08019
$$ 3314581 3360702 3295214 3170785 3580303 3693409 3788305 3485207 3481363 3506911 3814930
14479C814930P6025l21077L72986J89883k47995K8021J44204p1254L33620k49666
$$ 3814930 3890955 3569878 3942864 4132747 3884752 3912773 4056977 3985723 4319343 4069677
14469D069677N25654l608n08740J12871L09285J00859k50337M34308k54760J58087
$$ 4069677 4595331 4591723 4082983 4195854 4505139 4605998 4355661 4789969 4535209 4693296
14459D693296P3315o0671M1143M4423J10523K63238j05915J65456J1913J27297
$$ 4693296 4766611 4705940 4747083 4791506 4902029 5165267 5059352 5224808 5236721 5364018
14449E364018N0445l2450j13478P4376K61225l0869L60900j64147J87834N8564
$$ 5364018 5414463 5382013 5268535 5342911 5604136 5573267 5934167 5770020 5957854 6016418
14439F016418j6145l15029K48351J16433J82924r483L39881o1120J94091R2276
$$ 6016418 6000273 5685244 5933595 6050028 6232952 6223469 6563350 6502230 6696321 6788597
14429F788597J02562P071n8871L54835j69864J42390K8583K26668o2210Q4424
$$ 6788597 6891159 6898230 6839359 7194194 7024330 7166720 7195303 7421971 7359761 7444185
14419G444185K44011J19079J30954L2523K94716M2306L79637p4407l4106J28558
$$ 7444185 7688196 7807275 7938229 7970752 8265468 8307774 8687411 8613004 8578898 8707456
14409H707456M12591P9042L9981P9584K43076J00837m9651L33609L9464L10566
$$ 8707456 9120047 9199089 9239070 9318654 9561730 9662567 9612916 9946525 9985989 10296555
14399A0296555M59820P3572P2097m6901K54146J9599K66753L95603k8212J77830
$$ 10296555 10756375 10829947 10902044 10855143 11109289 11128888 11395641 11791244 11763032 11940862
14389A1940862N52258k14573Q98837j53303N02113j18870M53713k424L11824K37324
$$ 11940862 12493120 12278547 13177384 13024081 13526194 13407324 13861037 13858613 14170437 14407761
14379A4407761L51103L21464J28879M22146K08643M46755L86759J76733m3027
$$ 14407761 14758864 15080328 15209207 15631353 15839996 16286751 16673510 16850243 16807216
14370A6807216R13958K77536L02280k9775O22158M97584K58152O24312M52122
$$ 16807216 17721174 17998710 18300990 18271215 18893373 19390957 19649109 20273421 20725543
14361B0725543N15753N79727N56723K53259J95865P71465M80900Q16967N38778
$$ 20725543 21241296 21821023 22377746 22631005 22826870 23598335 24079235 24896202 25434980
14352B5434980M35450N42134O55990P28323O29815M88027Q10271R87313P71640
$$ 25434980 25870430 26412564 27068554 27796877 28426692 28914719 29724990 30712303 31483943
14343C1483943M89208J148076J146450O75783R32362J281594N55348J277080J121898
$$ 31483943 31973151 33121227 34267677 34943460 35875822 37157416 37712764 38989844 40111742
14334D0111742J516010R46964J496210J125825J302358J507166J573179J615380
$$ 40111742 41627752 42574716 44070926 45196751 46499109 48006275 49579454 51194834
14326E1194834J565548J714301K049092J673504K138067K462817J570771K664438
$$ 51194834 52760382 54474683 56523775 58197279 60335346 62798163 64368934 67033372
14318F7033372K768946K254659K651566K863365K968017L333385L190490L469602
$$ 67033372 69802318 72056977 74708543 77571908 80539925 83873310 87063800 90533402
14310I0533402L683225L844028M414625M061800M898283M578360N460337N575738
$$ 90533402 94216627 98060655 102475280 106537080 111435363 116013723 121474060 127049798
14302A27049798N462270O238343O696114O886470P130260P591372Q165842Q595490
$$ 127049798 132512068 138750411 145446525 152332995 159463255 167054627 175220469 183815959
14294A83815959R328008R391367R742612J0714746J0589639J1188421J1739219
$$ 183815959 193143967 202535334 212277946 222992692 233582331 244770752 256509971
14287B56509971J2495749J2497025J2693341J3837336J3715200J3855513J3729097
$$ 256509971 269005720 281502745 294196086 308033422 321748622 335604135 349333232
14280C49333232J3826257J3042290J2653693J1900101J0813307R364490P180932
$$ 349333232 363159489 376201779 388855472 400755573 411568880 420933370 428114302
14273D28114302K709692Q30917L63852P76150p93213n276963m813099o235399
$$ 428114302 430823994 431654911 432018763 432794913 432001700 426724737 421911638 415676239
14265D15676239q730491j1028039j2497437j3318487j4521090j4497900j4998693
$$ 415676239 406945748 395917709 383420272 370101785 355580695 341082795 326084102
14258C26084102j4632956j4577101j4157101j3642491j2111658j2938508j2335084
$$ 326084102 311451146 296874045 282716944 269074453 256962795 244024287 231689203
14251B31689203j1515064j0866710j0585828r818988r447548q264675q303925
$$ 231689203 220174139 209307429 198721601 188902613 179455065 171190390 162886465
14244A62886465p555485p487184o797852o713161o002045n844764m857428n360823
$$ 162886465 155330980 147843796 141045944 134332783 128330738 122485974 117628546 112267723
14236A12267723n166134m408423l939821m537294l263878l476248l698829l193713
$$ 112267723 107101589 102693166 98753345 94216051 90952173 87475925 83777096 80583383
14228H0583383l432273k537648l066305k483485k662261k262351k279483k194255
$$ 80583383 77151110 74613462 71547157 69063672 66401411 64139060 61859577 59665322
14220E9665322j853987j880021j834365k033917j601451j548298j229599j434717
$$ 59665322 57811335 55931314 54096949 52063032 50461581 48913283 47683684 46248967
14212D6248967j635110j309580j491428r20738j268759n51508j226134j308817
$$ 46248967 44613857 43304277 41812849 40892111 39623352 39071844 37845710 36536893
14204C6536893j216810q07513j028956p81845q54324j068487m89781j234562l32677
$$ 36536893 35320083 34512570 33483614 32701769 31847445 30778958 30289177 29054615 28721938
14195B8721938o51893o81597p35184n64216r46227m35640n23252m57389o26587
$$ 28721938 28070045 27388448 26653264 26089048 25142821 24707181 24183929 23726540 23099953
14186B3099953o11756m22234l80966q17703k71041m18671m65334m75461j88591
$$ 23099953 22488197 22065963 21684997 20867294 20596253 20177582 19712248 19236787 19048196
14177A9048196o73152m4312m93186l79110k83414l79340l15750m06345m69527
$$ 19048196 18375044 18330732 17837546 17458436 17175022 16795682 16479932 16073587 15604060
14168A5604060j88394r0194n54076j17634k51515l88916N543l80670K9519n03088
$$ 15604060 15415666 15325472 14771396 14653762 14402247 14013331 14018874 13638204 13667723 13164635
14158A3164635j30987o03079K23883k89416m06240n584l38593j90211J33171l94708
$$ 13164635 13033648 12430569 12654452 12365036 11958796 11953212 11614619 11424408 11557579 11162871
14148A1162871n9250k05729o5476j42795n99800o1587J33669o21583K72560k47018
$$ 11162871 11103621 10897892 10832416 10689621 10089821 10028234 10161903 9540320 9812880 9565862
14138I565862l60284J23278j91657j50666L23918n13526j24952j73298j69277
$$ 9565862 9205578 9328856 9137199 8986533 9310451 8796925 8671973 8498675 8329398
14129H329398K46242l35737j90253K2153r3160l83171K16841m54000M36786m75532
$$ 8329398 8575640 8239903 8049650 8071803 7978643 7595472 7812313 7358313 7795099 7319567
14119G319567L50375n17905j16683n4447l12890O0135Q7362K3956j53883m58472
$$ 7319567 7669942 7152037 7035354 6980907 6668017 6728152 6815514 6839470 6685587 6227115
14109F227115N4300p238L8787O7527j66867k70851k30933o2476k5149K25676l69792
$$ 6227115 6281415 6274177 6312964 6380491 6213624 5942773 5711840 5649364 5624215 5849891 5480099
14098E480099J3494M350Q3641k04192r5051K5316j21409r1269N0805J08352j72969
$$ 5480099 5493593 5497943 5581584 5377392 5282341 5307657 5186248 5094979 5145784 5254136 5081167
14087E081167l82069J54079K28301k00889j63789j24668J961k85204M84412m72551
$$ 5081167 4699098 4853177 5081478 4880589 4716800 4592132 4594093 4308889 4793301 4320750
14077D320750J28063l67118M02527j55509q2476p5119k64313J35735J19319j77869
$$ 4320750 4448813 4081695 4484222 4328713 4246237 4171118 3906805 4042540 4161859 3983990
14067C983990o9757k00053K25824l51951K31692k28110J89044l46951O40064m10200
$$ 3983990 3914233 3714180 3940004 3588053 3819745 3591635 3780679 3433728 4073792 3663592
14057C663592k65619L99592j88985l45284K76134l6531j55482j76880J48288k80064
$$ 3663592 3397973 3797565 3608580 3263296 3539430 3502899 3347417 3170537 3318825 3038761
14047C038761L76483k24590k82316L64645j29348k72202K50997j23525J54647
$$ 3038761 3415244 3190654 2908338 3272983 3143635 2871433 3122430 2998905 3153552
14038C153552m0190l95372K49422l85377N09681l49518J63278J01233j10749O7288
$$ 3153552 3113362 2717990 2967412 2582035 3091716 2742198 2905476 3006709 2895960 2963248
14028B963248k33086M1980o4927n8035R2225j74341k65966K37265k00827K99686
$$ 2963248 2730162 2772142 2707215 2649180 2741405 2567064 2301098 2538363 2337536 2637222
14018B637222k36310k01668K95556Q2624m03328M58839l88756K40894j4314j18505
$$ 2637222 2400912 2199244 2494800 2577424 2174096 2632935 2244179 2485073 2470759 2352254
14008B352254p8816N0602o7373M95k54541K43180k88889R2587j61573K16014O1753
$$ 2352254 2273438 2324040 2256667 2257162 2002621 2245801 1956912 2049499 1887926 2103940 2165693
13997B165693k04960j39009J0286K02409m0310J51287o9027Q70109J330366L262110
$$ 2165693 1960733 1821724 1832010 2034419 1994109 2145396 2076369 2946478 4276844 7538954
13987G538954P420850J7922150Q612756B0651283r226280m225087j843859j483809
$$ 7538954 14959804 32881954 41494710 20651283 11425003 7199916 5356057 3872248
13979C872248j42259o07862J87419n78627M11534o83020K91715j05642K2196j98881
$$ 3872248 3729989 3122127 3309546 2730919 3142453 2459433 2751148 2645506 2667702 2468821
13969B468821p9571k39657K15479q6883l41511l8764p9460M03038l11232j46379
$$ 2468821 2389250 2149593 2365072 2278189 1936678 1897914 1818454 2221492 1910260 1763881
13959A763881m9354K54203n5243O8589l85250L04623P1645j63168Q4537m87416
$$ 1763881 1714527 1968730 1913487 1982076 1596826 1901449 1973094 1809926 1894463 1407047
13949A407047N25567j96412K64260k21933k69292r9483J5180L92623k96432M17518
$$ 1407047 1932614 1736202 2000462 1778529 1509237 1409754 1424934 1817557 1521125 1938643
13939A938643m34391J76552j63835L0251J98436j11658j31685m850k06051K0301
$$ 1938643 1504252 1680804 1516969 1547220 1745656 1633998 1502313 1497463 1291412 1311713
13929A311713J93536j13162P041R857K64487m26081j77049O89590j72057j84145
$$ 1311713 1505249 1392087 1399128 1408985 1673472 1247391 1070342 1759932 1587875 1403730
13919A403730n09K34748p4422j89592M69394l4270m29457l4673Q0098L14536l47009
$$ 1403730 1403221 1637969 1563547 1373955 1843349 1809079 1379622 1344949 1425047 1739583 1392574
13908A392574j91204n0995L07003R5559k76860j03231Q2506N8675q7610L5465
$$ 1392574 1201370 1150375 1457378 1552937 1276077 1172846 1255352 1314027 1226417 1261882
13898A261882j46882K8234J47999j48059M9899K14111J32928m52455N4104J27685
$$ 1261882 1115000 1143234 1291233 1143174 1193073 1407184 1540112 1087657 1141761 1269446
13888A269446m1079Q159j28389R506j10292K84445j87406O695l06283L00036m5349
$$ 1269446 1228367 1236526 1108137 1117643 1007351 1291796 1104390 1111085 804802 1104838 1059489
13877A059489N7803K55063L43p4521k13080p0886q4758J3583j78362Q5401q2734
$$ 1059489 1117292 1372355 1372698 1298177 1085097 1014211 929453 943036 764674 850075 767341
13866G67341M39415l24588J5798J58385m6777K15000j38022o2442r6994k49519
$$ 767341 1206756 882168 897966 1056351 1009574 1224574 1086552 1024110 927116 677597
13856F77597O66074n09087L24552j44945J5955J44656l61225K39339r4348k9098
$$ 677597 1343671 834584 1159136 1014191 1030146 1174802 813577 1052916 958568 929470
13846I29470J70193N0191m64353N01689l21072j55860J09885K2204J6994j51721
$$ 929470 1099663 1149854 685501 1187190 866118 710258 820143 842347 859341 707620
13836G07620L35768o1368j3981L3260o360m09170Q6861J32991K27854l11465N8064
$$ 707620 1043388 982020 968039 1001299 994939 585769 672630 805621 1033475 722010 780074
13825G80074N8608j90427J92263K79672k05485R5605j61288P6497k50781L33981
$$ 780074 838682 648255 840518 1120190 914705 1010310 849022 925519 674738 1008719
13815A008719k52988J91316k51424J38038k59147J05167O186J14961N4635k37490
$$ 1008719 755731 947047 695623 833661 574514 679681 685867 800828 855463 617973
13805F17973K97405j51798J63573k44125J44668J50900k91906L7663J25566k89587
$$ 617973 915378 763580 927153 683028 827696 978596 686690 724353 849919 560332
13795E60332K01352j64240K63101k06194K18750l34459L05836K2765l5101o1453
$$ 560332 761684 597444 860545 654351 873101 538642 844478 867243 832142 770689
13785G70689l66313L39196o1089R0810k26924J08931L10354l82159K59379k89173
$$ 770689 404376 743572 682483 773293 546369 655300 965654 583495 842874 553701
13775E53701K10025O6639l1820l64757J44666J45829j34427m3322r6185L28307
$$ 553701 763726 830365 798545 433788 578454 724283 589856 546534 450349 778656
13765G78656O4442C76512L47444j97976L39144j58902q2928p9844j51336J68711
$$ 778656 843098 376512 723956 525980 865124 706222 623294 543450 392114 560825
13755E60825Q8305j11706j55355L57679L4053r7738r1289q6912L43187l64966
$$ 560825 649130 537424 382069 739748 773801 676063 584774 497862 841049 476083
13745D76083j03129K07937l5497L15782j58562j59362J49266j75457K4255r9563
$$ 476083 372954 580891 545394 861176 702614 543252 692518 517061 541316 441753
13735D41753K35408j16912n089J58477k89661q5859F4585N60671N8877j63839
$$ 441753 677161 560249 555160 713637 423976 338117 64585 625256 684133 520294
13725E20294P051J12615k00738J834K61748j47251k36476N10592B75539L1785
$$ 520294 527345 639960 439222 441056 702804 555553 319077 829669 275539 307324
13715C07324K52438j13415J15560B69178M5659J14699P669M9261j06724M2329
$$ 307324 559762 446347 561907 269178 314837 429536 437205 486466 379742 422071
13705D22071L63612l42514p578O5588H9236M52545K4400J51051j65810k3587K3986
$$ 422071 785683 443169 435591 501179 89236 541781 566181 717232 551422 527835 551821
13694E51821J0312o6118K6732k54109r8531K79109r4003n6474K68457O2055k40795
$$ 551821 562133 496015 522747 268638 170107 449216 355213 298739 567196 629251 388456
13683C88456p0861K44531j74221k3019N4381R4823k23661L41969k51643o4202
$$ 388456 317595 562126 387905 364886 419267 514090 290429 632398 380755 316553
13673C16553R4977K71155l14474j35289N10437k66483o5846A94628K53749J91730
$$ 316553 411530 682685 368211 232922 743359 476876 411030 194628 448377 640107
13663F40107k95079L9136r9836E0339L93913B19119K12308j13292D7963K54732
$$ 640107 345028 384164 284328 50339 444252 219119 431427 318135 47963 302695
13653C02695M10813A34627P3893L13955j0445p3139j81349L73657m5946j49511
$$ 302695 713508 134627 208520 522475 512030 438891 257542 631199 585253 435742
13643D35742A03616L97306J3266K64361C21334m9105P1617A13263K60488K4281
$$ 435742 103616 500922 514188 778549 321334 272229 343846 113263 373751 398032
13633C98032K00051j62495j35373O6358j9899J35441k00131J84493l3885B7373
$$ 398032 598083 435588 300215 366573 346674 482115 281984 466477 432592 27373
13622E08910j77162P4118F8502K02870n1219L65063n1352q4867Q9196k30991J65904
$$ 508910 331748 405866 68502 271372 220153 585216 533864 448997 538193 307202 473106
13611D73106r9171j3948R2404j75780k9327E7060K75857K95707j89109A76391
$$ 473106 373935 359987 452391 276611 247284 57060 332917 628624 439515 176391
13600C82949N7407A94858l7001K70483j23576A02962J52873J07523j18544K51076
$$ 382949 440356 194858 157857 428340 304764 102962 255835 363358 244814 495890
13590D95890r0294j01366I4695N66408A49418J92662J99301j93052M9270m1156
$$ 495890 405596 304230 94695 661103 149418 342080 541381 348329 397599 356443
13580C56443m373j49240K00156j28476m774m1869K76058a47851C43421L39189
$$ 356443 352070 202830 402986 274510 269736 227867 503925 -147851 343421 682610
13570F82610k69078r495q0364K3233M2p99o4067M260K66081D3942M7733L23619
$$ 682610 413532 404037 323673 346906 346948 346149 282082 286342 552423 43942 91675 415294
13558D15294B05434L6770n4831L03775D1202J70963L200i3236B00390P2392j06135
$$ 415294 205434 242204 187373 491148 41202 212165 215365 -93236 200390 272782 166647
13547A66647J09503o2719I8082L84473A91919K124n1479L0033J92150n5667j24885
$$ 166647 276150 213431 98082 482555 191919 194043 142564 172597 364747 309080 184195
13536A84195J69382o288A09194L84802A4511K11372R4931P8275J62411j20142
$$ 184195 353577 347289 109194 493996 14511 225883 320814 399089 561500 441358
13526D41358A74922J83477j56477R6497E3330J30215j8038J76354p4444m2260
$$ 441358 174922 358399 201922 298419 53330 183545 165507 341861 267417 225157
13516B25157r9042L90773j67141J71336A90788J73988p2653E3902J79305n3440
$$ 225157 126115 516888 349747 521083 190788 364776 292123 53902 233207 179767
13506A79767K49198r0417J3141c3765E0093L30395j78326P1699j4010N9995A37487
$$ 179767 428965 338548 351689 -33765 50093 380488 202162 273861 259851 319846 137487
13494A73974l6737L42067A08103m5127J3623M11559A22392J37621q35a13724C35738
$$ 173974 137237 479304 108103 62976 76599 488158 122392 260013 259178 -113724 335738
13482B24107R4285o2744p3816J7286H6216K92458j20257j26031e9208C00296a2337
$$ 224107 318392 255648 181832 199118 86216 378674 258417 132386 -59208 300296 -12337
13470F9219L7468J11317J7942A15076L63465A87477b4995B06651R1234j3553F913
$$ 69219 106687 218004 235946 115076 478541 187477 -24995 206651 297885 284332 6913
13458D34808A40257F6534c10707A15778j8637N5583M3502F6531K02991J08296
$$ 434808 140257 66534 -310707 115778 97141 152724 196226 66531 269522 377818
13448C77818A26984a26245a1430B29596J39831o3797r9862l7891P0342J01849
$$ 377818 126984 -126245 -11430 229596 369427 305630 205768 167877 238219 340068
13438C40068K17814G4086K21204j38775b8930C98800A13452L4564L6947L31845
$$ 340068 557882 74086 295290 156515 -28930 398800 113452 148016 184963 516808
13428E16808k23431A28923L04057a6643g104C95194H0858d4651A56416b10736
$$ 516808 293377 128923 432980 -16643 -7104 395194 80858 -44651 156416 -210736
13417A59989p3337K09690R2147A23124J9710b5914C68824j16520F2657J88052
$$ 159989 86652 296342 388489 123124 142834 -25914 368824 252304 62657 250709
13407B50709a50430D1022K47718Q1594j61326R2427F3454f1239D01388j68360
$$ 250709 -150430 41022 288740 370334 209008 301435 63454 -61239 401388 233028
13397B33028K08866A07574B6522L09472m8471J20934r3141C072J93113n1822k4030
$$ 233028 441894 107574 26522 335994 287523 408457 315316 3072 196185 144363 120333
13386A20333C6268J07117K78340D3419d272B23537r4865d2383D22350j13494J37560
$$ 120333 36268 143385 421725 43419 -4272 223537 128672 -42383 422350 308856 446416
13375D46416r7382H5181n784J72325M8L33437B11387C2300J33498H2679K41781
$$ 446416 349034 85181 79397 251722 251770 585207 211387 32300 165798 82679 324460
13364C24460D4144J67533K89441A77682d3887C41600G7406B4651K23914a25945
$$ 324460 44144 211677 501118 177682 -43887 341600 77406 24651 248565 -125945
13353H6256a08328c1558C66077r1706j20920P0894d373D08445A03599P3066M06042
$$ 86256 -108328 -31558 366077 274371 153451 224345 -4373 408445 103599 176665 582707
13342E82707k53655n3230H1044L54012j91465P2740j6696N6259d4206F03918B71261
$$ 582707 329052 275822 81044 435056 243591 316331 299635 355894 -44206 603918 271261
13330B69385P0360A23564P5070G5317a9223F6371O6317J53215e474p2636G023
$$ 269385 339745 123564 198634 75317 -19223 66371 132688 285903 -5474 -78110 7023
13318c9229A64311M43347A28188d9244B62421l895b45189B28637D4126K73670
$$ -39229 164311 607658 128188 -49244 262421 258526 -245189 228637 44126 317796
13308C17796n1164m0277K40241E4038M57786H9802b04229Q0405A31384o0387d8846
$$ 317796 266632 226355 466596 54038 511824 89802 -204229 -123824 131384 70997 -48846
13296c69869B18770l8985K80060k15007c5867k84583g5465B90942o1583K60481
$$ -369869 218770 179785 459845 244838 -35867 -320450 -75465 290942 229359 489840
13286D89840a72365B14726r7931J63484H3978J31773k9504Q3540A1710l319K21750
$$ 489840 -172365 214726 116795 280279 83978 215751 186247 269787 11710 8391 230141
13275B30141C7087M177h3006B02320h3491j9737e101C85342A9960J75335a72368
$$ 230141 37087 41264 -83006 202320 -83491 -103228 -5101 385342 19960 195295 -172368
13263A27679K0746A8022b1960B95890i1937A96872q2320B0472J03983l9222a84400
$$ 127679 148425 18022 -21960 295890 -91937 196872 114552 20472 124455 85233 -184400
13251H7573c87450B41536c06030C21383p6718I9834Q8101L0137J8648b211k4027
$$ 87573 -387450 241536 -306030 321383 244665 99834 187935 218072 236720 -2211 -26238
13240b6238j21699A37192b48553d7882B09645G1528K0385M0209J05450A7319J19565
$$ -26238 -147937 137192 -248553 -47882 209645 71528 91913 132122 237572 17319 136884
13229A36884J24733P2405C7375J46792N4738F0834J3292J13244m4669b21701i171
$$ 136884 261617 334022 37375 184167 238905 60834 74126 187370 142701 -221701 -9171
13217A44807a7800p1207F380R0914L1151b8126j2478m6187F0701J1015Q9950Q0800
$$ 144807 -17800 -89007 6380 97294 128445 -28126 -40604 -86791 60701 71716 161666 242466
13205B42466J39769o6310k9435k2184r9912F7224a10134B40357G4366j0295L10318
$$ 242466 382235 315925 286490 264306 164394 67224 -110134 240357 74366 64071 374389
13194C74389a9955k1410H9315L4103b01666B49264a30387O2479j10557C86145
$$ 374389 -19955 -41365 89315 123418 -201666 249264 -130387 -67908 -178465 386145
13183C94844e0200E9022J11691A8556K08485r7745k9312i0210J0615C9497g5391
$$ 394844 -50200 59022 170713 18556 227041 129296 99984 -90210 -79595 39497 -75391
13171A80373M3386a00585A96013I0103a09247B19657k8181g3201K2084C53773
$$ 180373 223759 -100585 196013 90103 -109247 219657 191476 -73201 -51117 353773
13160A97042g4447J8017B32811c0226B83333c00189B49207q1544C7714R8957b2923
$$ 197042 -74447 -56430 232811 -30226 283333 -300189 249207 167663 37714 136671 -22923
13148A45349d3376A18773a61155A13802h3132B04698A7549J09965J7686c85884
$$ 145349 -43376 118773 -161155 113802 -83132 204698 17549 127514 145200 -385884
13137c60926A41751a62310A88438a80030a5928A81016d0269B11617b36610a13918
$$ -360926 141751 -162310 188438 -180030 -15928 181016 -40269 211617 -236610 -113918
13126C11613b4818A84365n0894a61947I4759A3932a62049P895A70775b14109E9344
$$ 311613 -24818 184365 133471 -161947 94759 13932 -162049 -154154 170775 -214109 59344
13114A27333A8363K1411h3240A26359N7084g911j1786B89960l0707a249k31313
$$ 127333 18363 39774 -83240 126359 183443 -7911 -19697 289960 259253 -1249 -232562
13103b32562j99326N2645a58930H6796b1171A7046N5262J69642L0276j8873K22779
$$ -232562 -431888 -379243 -158930 86796 -21171 17046 72308 241950 272226 253353 476132
13092D76132a12932A76138N1840A00069h593A30448a18628k88128e8337p1743
$$ 476132 -112932 176138 227978 100069 -8593 130448 -118628 -406756 -58337 -130080
13082a30080H5039j2211K34602A02917P6419c3019B77777o3783K09224A89432
$$ -130080 85039 72828 307430 102917 179336 -33019 277777 213994 423218 189432
13071B45641q2113c4981C26395q7052a18032G9425h2565J720J464E7136J71225
$$ 245641 163528 -34981 326395 239343 -118032 79425 -82565 -80845 -79381 57136 228361
13060B28361J64313F9955N8665h6035q5650k16294A67742K71863b03525B59451
$$ 228361 392674 69955 128620 -86035 -171685 -387979 167742 439605 -203525 259451
13049C66263K1452A57503E9613g891A04366J41406h7886D7515J82991I9379K69209
$$ 366263 387715 157503 59613 -7891 104366 245772 -87886 47515 230506 99379 368588
13038C68588c9263j0942a9368f337C7614L97297B0604i0325i418p2491B54834
$$ 368588 -39263 -50205 -19368 -6337 37614 434911 20604 -90325 -9418 -81909 254834
13026B23432a07948A31802n0480J7508c4874A39242m1626a3875C78808A88793
$$ 223432 -107948 131802 81322 98830 -34874 139242 97616 -13875 378808 188793
13015a18041e8141q1462B22357I2438N2917o3391L2412i1867a8119A19M1852J15232
$$ -118041 -58141 -139603 222357 92438 145355 81964 114376 -91867 -18119 119 41971 157203
13003A57203d4615n5339B82516J8912j44010f6386K9645A44970E4023b68520A59234
$$ 157203 -44615 -99954 282516 301428 157418 -66386 -36741 144970 54023 -268520 159234
12991C31231f3925p180A10552J3451O7919F7808J63371q9528b43464k4022A79554
$$ 331231 -63925 -71105 110552 124003 191922 67808 231179 141651 -243464 -267486 179554
12979a4467j13606n4380F1217J09319M2822r2348n746a9859j02882B05310f624
$$ -14467 -128073 -182453 61217 170536 213358 121010 115264 -19859 -122741 205310 -6624
12967B82618n4686l9270K33522f8708A14337E2801c32041A24073a31802B95837
$$ 282618 227932 188662 422184 -68708 114337 52801 -332041 124073 -131802 295837
12956B7368L26383b09866c6913A8079J16923e5837D4676a00663r7011G7895i5639
$$ 27368 353751 -209866 -36913 18079 135002 -55837 44676 -100663 -197674 77895 -95639
12944A05710k8530b12233A22899a02552B31901i6258H9639J95099a85590A45396
$$ 105710 77180 -212233 122899 -102552 231901 -96258 89639 284738 -185590 145396
12933D09499A51417D7175b3230A79511i9855A25544h235C9988d5269C25209C481
$$ 409499 151417 47175 -23230 179511 -99855 125544 -8235 39988 -45269 325209 3481
12921a66257b9104j66856C8628J61189g788A60812B9125K66794B3053a66129C8688
$$ -166257 -29104 -195960 38628 199817 -7788 160812 29125 295919 23053 -166129 38688
12909a29813B78972o3075d7988b1570C67443l3747d02467A49184b25855Q6580
$$ -129813 278972 215897 -47988 -21570 367443 333696 -402467 149184 -225855 -139275
12899a39275J6754j5668A26216K09043b05518B69475K0305b1933A15390c8622
$$ -139275 -122521 -138189 126216 335259 -205518 269475 289780 -21933 115390 -38622
12888a30287A32569d4103k00549c5583n88A14226g8927j50779q9523a40425A76965
$$ -130287 132569 -44103 -244652 -35583 -36171 114226 -78927 -229706 -319229 -140425 176965
12876A98766G2404L7264N31083G0384e4722j69553r2799A26057H884h6271k16054
$$ 198766 72404 109668 640751 70384 -54722 -224275 -317074 126057 8884 -86271 -302325
12865c02325l4662C14557r6285r0001a1632G1209a60316e2700A89969a30844B72888
$$ -302325 -336987 314557 218272 128271 -11632 71209 -160316 -52700 189969 -130844 272888
12853c24371H1049D0205N7885h3074K4962E1430I008J53939O638M4473B2838J30072
$$ -324371 81049 40205 98090 -83074 -58112 51430 9008 162947 169585 214058 22838 152910
12841A52910C1889N0918M5684a28014e3120G8347g331A70624A7137J31335m2774
$$ 152910 31889 82807 128491 -128014 -53120 78347 -7331 170624 17137 148472 105698
12830A05698j9850c7293k19872A89023B976P6138b34189E6135L24392a07696f004
$$ 105698 85848 -37293 -257165 189023 2976 79114 -234189 56135 380527 -107696 -6004
12818a5201A90401K570b48476F724a32244H799K90096A04078c82002a00527J1327
$$ -15201 190401 192971 -248476 6724 -132244 8799 298895 104078 -382002 -100527 -89200
12807h9200E5158a25160l7196r7947C17820b23732A4323b1970A91818G3710b53430
$$ -89200 55158 -125160 -162356 -260303 317820 -223732 14323 -21970 191818 73710 -253430
12795D6300f7666k4681F0880O4568M06305i1401A16542a2121C52543c49963B20587
$$ 46300 -67666 -92347 60880 125448 531753 -91401 116542 -12121 352543 -349963 220587
12783d313k03901k12241A32580R0035r8496D9203c26423E0748a77778C7384J4996
$$ -4313 -208214 -420455 132580 222615 124119 49203 -326423 50748 -177778 37384 52380
12772E2380c62157a1079j40274A91028L01950i4916r3903O1339O2721A11634J50772
$$ 52380 -362157 -11079 -151353 191028 492978 -94916 -188819 -127480 -64759 111634 262406
12761B62406A22495k7684b51310j2633D69520a47263L5862j08455b6283B76310
$$ 262406 122495 94811 -251310 -263943 469520 -147263 -111401 -219856 -26283 276310
12750b43919B98104b67555b87A72765a10766A10500b34375A88246m6873F4865
$$ -243919 298104 -267555 -287 172765 -110766 110500 -234375 188246 141373 64865
12739d5679I0403J66811D5238c3795D85076a17555C81299j69236R5245l52I8096
$$ -45679 90403 257214 45238 -33795 485076 -117555 381299 212063 307308 306956 98096
12727e6278H1614d1622B24752E8948J79214d7500j09111j31744C18600b14563
$$ -56278 81614 -41622 224752 58948 238162 -47500 -156611 -288355 318600 -214563
12716F6808c82676J18731r411B40925B2406a71514A97287m2531F9240Q8071J72890
$$ 66808 -382676 -263945 -273356 240925 22406 -171514 197287 154756 69240 157311 330201
12705C30201l8247F4100K92601G8578g6568D8655C357a24122B99539a84738A54693
$$ 330201 291954 64100 356701 78578 -76568 48655 3357 -124122 299539 -184738 154693
12693E6320Q8855m8651d1322B81955j24036a94056A450J38712F3232M0601b41348
$$ 56320 145175 96524 -41322 281955 157919 -194056 1450 140162 63232 103833 -241348
12681B27124B7823J99633E2269K87079o8187E8920O5511O5118N1278j02502a31254
$$ 227124 27823 227456 52269 339348 271161 58920 124431 189549 240827 138325 -131254
12669B88078q5190D5164J42701a94548g2997B63694n0452O8780A05918g9380A06767
$$ 288078 202888 45164 187865 -194548 -72997 263694 213242 282022 105918 -79380 106767
12657B34502e19327B44768A18948b88236E7335g9574A6527a15403A58278J6598
$$ 234502 -519327 244768 118948 -288236 57335 -79574 16527 -115403 158278 174876
12647A74876l6037b31608R518c5150E4186Q5196J6087A0422a49111B50412j9182
$$ 174876 138839 -231608 -222090 -35150 54186 139382 155469 10422 -149111 250412 231230
12636B31230Q791i6519J8263A19009L31446b43476B27980j05614K04810F1791
$$ 231230 240021 -96519 -78256 119009 450455 -243476 227980 122366 327176 61791
12625D39432l7922f1593C45531a00914A95362J54316H4156J69359a63838B02886
$$ 439432 401510 -61593 345531 -100914 195362 349678 84156 253515 -163838 202886
12614a35592K2784q0429P4138b975D0311e307l3279k3596C4739J83515m0975d37346
$$ -135592 -112808 -193237 -119099 -2975 40311 -5307 -38586 -62182 34739 218254 177279 -437346
12601A38617J04937o2375b5970I7734J2952M0523C8062L3961Q2026o3499J8279
$$ 138617 243554 181179 -25970 97734 110686 151209 38062 72023 154049 90550 108829
12590A08829J97406j00502H2619J35223j03446K22997a7797D7863a13740B10014
$$ 108829 306235 205733 82619 217842 114396 337393 -17797 47863 -113740 210014
12579e3136a3158B71576c4507j4633B01941a50880B16108a06200l8546H7789b01640
$$ -53136 -13158 271576 -34507 -49140 201941 -150880 216108 -106200 -144746 87789 -201640
12567B0149K89623j42305a13472G9782h224k18162b4611p5515H1917N2692J04382
$$ 20149 309772 167467 -113472 79782 -8224 -226386 -24611 -100126 81917 134609 238991
12556B38991g8953k2757B94116a7795F8689J23330H9143C3861a40796l8905j45235
$$ 238991 -78953 -101710 294116 -17795 68689 192019 89143 33861 -140796 -179701 -324936
12545c24936A68516H2777B9039K06452d5966O379A65506B1248a8742F398d3997
$$ -324936 168516 82777 29039 235491 -45966 -39587 165506 21248 -18742 6398 -43997
12533b89993a28999A07056m3427N6008b22969J09170c3021k77943D24743e1303
$$ -289993 -128999 107056 63629 119637 -222969 -113799 -33021 -310964 424743 -51303
12522b1981A67329E9490A3633J1966b67034a25229A66518A1991J90941a2293C8387
$$ -21981 167329 59490 13633 25599 -267034 -125229 166518 11991 202932 -12293 38387
12510A31919h4733l2715A24577K2650h9507k8218C32999b8792M010A1428J66030
$$ 131919 -84733 -117448 124577 147227 -89507 -117725 332999 -28792 -24782 11428 177458
12499A77458a4025B34256E2475b09889Q9631D5009e8743B15971I9146c16446A8395
$$ 177458 -14025 234256 52475 -209889 -120258 45009 -58743 215971 99146 -316446 18395
12487b28918J05101b248A3208L4096J19554b7446j78059Q8679p175r9060b032
$$ -228918 -123817 -2248 13208 47304 166858 -27446 -205505 -116826 -124001 -223061 -2032
12475e1949E1960c38400D19851A83783H2617a43477J1714m3688A13396d06493
$$ -51949 51960 -338400 419851 183783 82617 -143477 -131763 -175451 113396 -406493
12464B19972H7493a07221A74545a13668j50652D1693b58291E4429J85322a20116
$$ 219972 87493 -107221 174545 -113668 -264320 41693 -258291 54429 239751 -120116
12453C31800f1127A026m57J29499a85370j29361I0988J11894a29718B52054D0761
$$ 331800 -61127 1026 569 130068 -185370 -314731 90988 202882 -129718 252054 40761
12441A07691d4047k63204h5413l9684A46729b15479A7112c9012b672C5313J70780
$$ 107691 -44047 -307251 -85413 -125097 146729 -215479 17112 -39012 -2672 35313 206093
12430B06093F3688a91132M9874n9097n7256A76779b42224d7248n4723A45329a44755
$$ 206093 63688 -191132 -141258 -200355 -257611 176779 -242224 -47248 -101971 145329 -144755
12418D7024Q7974f880j03745D2126c0539A76256a0715E95599b84726A5755J23114
$$ 47024 134998 -6880 -110625 42126 -30539 176256 -10715 595599 -284726 15755 138869
12407A38869b15793R9048A79758a45602B4026a09195G0614J36373C5502g4164
$$ 138869 -215793 -116745 179758 -145602 24026 -109195 70614 206987 35502 -74164
12396A45030d4254p2934D6298a89936D2075K52718B0254J46990c67235A16512
$$ 145030 -44254 -117188 46298 -189936 42075 294793 20254 167244 -367235 116512
12385g2036H847d365A06876g4966p8565F6576M2584a45623O4241o8101B48778
$$ -72036 8847 -4365 106876 -74966 -153531 66576 109160 -145623 -81382 -149483 248778
12373D0957b14505D9068K7176c50932A83413a59281p8078A47754O1193N8163r1440
$$ 40957 -214505 49068 76244 -350932 183413 -159281 -237359 147754 208947 267110 175670
12362A75670F7933j8421g0177A95646o0464N0607A8917b04300A36483b20236F2699
$$ 175670 67933 49512 -70177 195646 135182 185789 18917 -204300 136483 -220236 62699
12350c40070a9611l5140A4072a54516F1367K0102k5138d1728C8632K298b35047
$$ -340070 -19611 -54751 14072 -154516 61367 81469 56331 -41728 38632 40930 -235047
12338d5519k8233n1512A07469J59368b82063I1373d0854B14777e6064Q08I1581
$$ -45519 -73752 -125264 107469 266837 -282063 91373 -40854 214777 -56064 -55256 91581
12326a788D3604c95754A3540a76028D514a1243c316I053a8572p063k62642F3747
$$ -1788 43604 -395754 13540 -176028 4514 -11243 -3316 9053 -18572 -25635 -288277 63747
12313a54366d1262j27770A65519a44198L5035d6029m7685k94117h687B08003a1136
$$ -154366 -41262 -169032 165519 -144198 -109163 -46029 -93714 -387831 -8687 208003 -11136
12301e8377C02916j41516G0458c89288d9088j66414A24627J67099I3622a11000
$$ -58377 302916 161400 70458 -389288 -49088 -215502 124627 291726 93622 -111000
12290A00336E373L17016h3633A13253P0213g3143C0173J37734K3566g7145j77476
$$ 100336 5373 322389 -83633 113253 183466 -73143 30173 167907 191473 -77145 -254621
12279b54621B10504C150L29599j52662E6107N730L856K52755a40723L6696H7007
$$ -254621 210504 3150 332749 180087 56107 61837 65693 318448 -140723 -104027 87007
12267G4119c6551E5025J66223A09143B8976i9497p1329A44520J39907m2299g708
$$ 74119 -36551 55025 221248 109143 28976 -99497 -170826 144520 284427 242128 -7708
12255a48750K9979B78521O9135A54157L32666B34054a44333A73430f4899A40994
$$ -148750 -118771 278521 347656 154157 486823 234054 -144333 173430 -64899 140994
12244a48936B50538k8203a75614B63054j17381i120A12525J89507p7957G6453
$$ -148936 250538 222335 -175614 263054 145673 -9120 112525 302032 224075 76453
12233A64539d9401C05933j32266p2702L48365d0666i490A47184E991J75571q3759
$$ 164539 -49401 305933 173667 100965 449330 -40666 -9490 147184 5991 181562 97803
12222I7803J93178a38558A39859m2070J66450m0397p3772m3251D6059c2221C83613
$$ 97803 290981 -138558 139859 97789 264239 223842 150070 106819 46059 -32221 383613
12210B67840A29109L4486l0009A6788L32034N9711A76562J80354j57833c111A42025
$$ 267840 129109 163595 133586 16788 348822 408533 176562 356916 199083 -3111 142025
12198C07370n2402R371J1921F9762R7011P3139M5007m1013H4833M7510l8010N3597
$$ 307370 254968 264339 276260 69762 166773 239912 284919 243906 84833 132343 94333 147930
12186A47930k0676m1987A3587J72931K7171a09531A88931a3497B78089j9644O8901
$$ 147930 127254 85267 13587 186518 213689 -109531 188931 -13497 278089 258445 327346
12175C27346K03126F84J28318O8066R3550M9763e6338b3180B34009j3135I3951
$$ 327346 530472 684 129002 197068 290618 340381 -56338 -23180 234009 220874 93951
12163a35163B86882c0018C064K55272C9612K1120J16086O4061H0157h7204q8361
$$ -135163 286882 -30018 3064 258336 39612 60732 176818 240879 80157 -87204 -175565
12152a75565m4733l8124C82417c0620A67952N909L21432m9870b98773b2281k44278
$$ -175565 -220298 -258422 382417 -30620 167952 173861 495293 445423 -298773 -22281 -266559
12141b66559e9829c393j99114E6987B6055a38587k510G2641f8277L03q412n8079
$$ -266559 -59829 -3393 -202507 56987 26055 -138587 -141097 72641 -68277 -67974 -76386 -134465
12129a34465k66339E7337e5529D1580a9162j8873j29765A39106d33485d3133C1966
$$ -134465 -400804 57337 -55529 41580 -19162 -38035 -167800 139106 -433485 -43133 31966
12117B44033b16991J00795A42825a54558B08884k286k8317C4223c7584C6701b22844
$$ 244033 -216991 -116196 142825 -154558 208884 206598 178281 34223 -37584 36701 -222844
12105G1476K10702c5525j9930p8451F7265J34813a68771D0026a93020C05081B6021
$$ 71476 282178 -35525 -55455 -133906 67265 202078 -168771 40026 -193020 305081 26021
12093B74891a05148j94137g5729F386a35404k04645g523m784D4512c6244A35502
$$ 274891 -105148 -299285 -75729 6386 -135404 -340049 -7523 -12307 44512 -36244 135502
12081a36082A22878b16397C2173a72753A97914c93871a76300N8625M7170K0104
$$ -136082 122878 -216397 32173 -172753 197914 -393871 -176300 -117675 -70505 -50401
12071e0401E4986g8512B03446R8677K26413J043964m11579n49512H1059f9761
$$ -50401 54986 -78512 203446 302123 528536 1572500 1160921 611409 81059 -69761
12060A59519i5619m6862A2197K48885K9981B7435i1370n0401j37833P2495e4665
$$ 159519 -95619 -142481 12197 261082 291063 27435 -91370 -141771 -279604 -207109 -54665
12048B5722b54321A86273E5288d5170A35764A6152M381d8516B47986j21260N9552
$$ 25722 -254321 186273 55288 -45170 135764 16152 20533 -48516 247986 126726 186278
12037A86278J3965q9042c44327B1150b03489e6740B01404H0873a60746A13896
$$ 186278 200243 111201 -344327 21150 -203489 -56740 201404 80873 -160746 113896
12026F3614m961a44779b708k49495D2594a19962C59242b21852F4294b47449C69044
$$ 63614 58653 -144779 -2708 -252203 42594 -119962 359242 -221852 64294 -247449 369044
12014f3607B40128j07211f1560a6103a04l07719e2504A0748a4819I977J25426
$$ -63607 240128 132917 -61560 -16103 -104 -307823 -52504 10748 -14819 9977 135403
12003A35403a29431K7466C9537a34634p2642d9211B25565a76084f3577C33394
$$ 135403 -129431 -101965 39537 -134634 -207276 -49211 225565 -176084 -63577 333394
11992a97269a1306q4267H7671A8684a46251f8540m696C01139j13372h8828a2313
$$ -197269 -11306 -95573 87671 18684 -146251 -68540 -73236 301139 187767 -88828 -12313
11980b48927D77287G9428b098C06531c11471a03831F1993a5299A50919L1594a61355
$$ -248927 477287 79428 -2098 306531 -311471 -103831 61993 -15299 150919 182513 -161355
11968b44480h0052A008a1961k2384D38756c02577a36319l03117K08211Q4644G6599
$$ -244480 -80052 1008 -11961 -34345 438756 -302577 -136319 -439436 -231225 -146581 76599
11956A61166a69609c2613A04411b39397i5005C02509L7997a27572K6457j04142
$$ 161166 -169609 -32613 104411 -239397 -95005 302509 340506 -127572 -101115 -205257
11946b05257G1782k3625J04923h8579A18154H000a65454r764g1992J1201j01861
$$ -205257 71782 48157 153080 -88579 118154 8000 -165454 -175218 -71992 -60791 -162652
11935a62652c758q4823B35934g238A34258j4920A8919f0430B05558O8410b12695
$$ -162652 -3758 -88581 235934 -7238 134258 119338 18919 -60430 205558 273968 -212695
11923b61350B17545C1284a23917n0746J5147B91263C3258b69832A38669C7363
$$ -261350 217545 31284 -123917 -174663 -159516 291263 33258 -269832 138669 37363
11912a53756D8183o888i5155k16755Q8247J11241C48936a24211j17309A88989
$$ -153756 48183 41295 -95155 -311910 -223663 -112422 348936 -124211 -241520 188989
11901a81918f1232J717B3168N7206R7052g8607A95382a08353A22969b05199A70635
$$ -181918 -61232 -59515 23168 80374 177426 -78607 195382 -108353 122969 -205199 170635
11889b57945C4399a49421e926n4631j04301A17143g9634H4669e8040a7721A53629
$$ -257945 34399 -149421 -5926 -60557 -164858 117143 -79634 84669 -58040 -17721 153629
11877a32502F3857L8697A076i2043A32383a32540e716m74053a36231f1873B1464
$$ -132502 63857 102554 1076 -92043 132383 -132540 -5716 -479769 -136231 -61873 21464
11865i5283J5813b9644I394J20238J66351i3694C167a29467b9045k1203B87139
$$ -95283 -79470 -29644 9394 129632 295983 -93694 3167 -129467 -29045 -50248 287139
11853I2941q321c29435Q3276e3998k8693c7479q9174B61598i9014F8888c59169
$$ 92941 84620 -329435 -246159 -53998 -82691 -37479 -126653 261598 -99014 68888 -359169
11841g5442C31395k245e8495B12818e8124C2103P6823b82634P6276A23417b9018
$$ -75442 331395 329150 -58495 212818 -58124 32103 108926 -282634 -206358 123417 -29018
11829b49521A26976D1117H503P6599A7441b19995K2459a8371j12987l8471M2736
$$ -249521 126976 41117 8503 85102 17441 -219995 -197536 -18371 -131358 -169829 -127093
11818a27093f2504k46695b2364r2704M5237b8223J1489o6611G4236j0091c3911
$$ -127093 -62504 -309199 -22364 -115068 -69831 -28223 -16734 -83345 74236 64145 -33911
11806a59087j20377e2474J0625A9278f0111a6634j55832K437b5405H8766Q174
$$ -159087 -279464 -52474 -41849 19278 -60111 -16634 -172466 -170029 -25405 88766 96940
11795I6940J64242A23408h205n0612A46061i5184A64422g896B58558c13381M1430
$$ 96940 261182 123408 -8205 -58817 146061 -95184 164422 -7896 258558 -313381 -271951
11784b71951R5777K6137g0027a3231B08222K56562b72554O4515q8411m2345e7783
$$ -271951 -176174 -150037 -70027 -13231 208222 464784 -272554 -208039 -296450 -338795 -57783
11772A21705l095b44456B50668r2803b09032A69037C8842h0323j21606p552h0564
$$ 121705 118610 -244456 250668 157865 -209032 169037 38842 -80323 -201929 -209481 -80564
11760A29715J03074c4333m318B49837A09795A4370f0936j14445f3578F0022a34147
$$ 129715 232789 -34333 -38651 249837 109795 14370 -60936 -175381 -63578 60022 -134147
11748F3794K4909J67690b18632f5724c2704J530A00220h2633B34847f2684j38413
$$ 63794 88703 256393 -218632 -65724 -32704 -31174 100220 -82633 234847 -62684 -201097
11737b01097B34358h0335A02657b44663A56482a00708N0166j45537P8794C3978
$$ -201097 234358 -80335 102657 -244663 156482 -100708 -50542 -196079 -117285 33978
11726a54982P2121I0124d1141A71500K64376C5144K53734b13070A47866d817A03730
$$ -154982 -82861 90124 -41141 171500 435876 35144 288878 -213070 147866 -4817 103730
11714C87401D2891i0491K6779k3806C01195H1528d2311a5614j05920b6722B87097
$$ 387401 42891 -90491 -63712 -87518 301195 81528 -42311 -15614 -121534 -26722 287097
11702A3473a22276A24191i070j87294D7700a40763E5881b69018A09056r135f7492
$$ 13473 -122276 124191 -9070 -196364 47700 -140763 55881 -269018 109056 99921 -67492
11690G5333M5053k0480m7952a75280D2615J76264M1332j3438a7699A87688J77593
$$ 75333 120386 99906 51954 -175280 42615 218879 260211 246773 -17699 187688 365281
11679C65281A47377L9406P8085K245b9376B97770a68448d3435B08334a26832J0555
$$ 365281 147377 186783 264868 267113 -29376 297770 -168448 -43435 208334 -126832 -116277
11668a16277B86567d3215C14485f5349n5485J7543H2349K19674h139o9154j02975
$$ -116277 286567 -43215 314485 -65349 -120834 -103291 82349 302023 -8139 -77293 -180268
11657a80268m7456A7622L3631l907L07577j03993A08232B0430J65180j7403H2839
$$ -180268 -227724 17622 51253 47346 354923 250930 108232 20430 185610 168207 82839
11645a71310j01331C8885b89790D4662g9077j14327A00851k4019J50079d5282
$$ -171310 -272641 38885 -289790 44662 -79077 -193404 100851 76832 226911 -45282
11634a46557C59497b04496h0868m480K4859J1580j07006B03989M9940d8530F3733
$$ -146557 359497 -204496 -80868 -85348 -60489 -48909 -155915 203989 253929 -48530 63733
11622h2704j2427j66781M1870A95485K0835n6933G3471h4052A99874I9647A5310
$$ -82704 -95131 -261912 -220042 195485 216320 159387 73471 -84052 199874 99647 15310
11610A1672b1066k10694D6805M5190k3776L9339B3716h82F4723B7399c50013I0760
$$ 11672 -21066 -231760 46805 91995 68219 107558 23716 -882 64723 27399 -350013 90760
11597G325a5769l9213J4408M520A68429d296D97788A86840b6183r0484N1453C80024
$$ 7325 -15769 -54982 -40574 -36054 168429 -4296 497788 186840 -26183 -116667 -65214 380024
11584B34348A7994c2523B1815J48662B7541R4590F676J25347L8922G6257A2434
$$ 234348 17994 -32523 21815 170477 27541 122131 6676 132023 170945 76257 12434
11572C0005K02927C1939A0121M6140f6445A87353R873H2459N1019B3155i0105
$$ 30005 232932 31939 10121 56261 -66445 187353 197226 82459 133478 23155 -90105
11560A36182b271C34522B6854f81A45948b90326a00468K7972A99782j6692J5499
$$ 136182 -2271 334522 26854 -681 145948 -290326 -100468 -72496 199782 183090 198589
11549A98589a96697e3081B097K50866G7342b7562A0197J78652p3463b7748j80042
$$ 198589 -196697 -53081 2097 252963 77342 -27562 10197 188849 115386 -27748 -207790
11538b07790N5263I0808l2560J3898K5816P543P8517H8630J63005F1322h0169
$$ -207790 -152527 90808 58248 72146 97962 105505 184022 88630 251635 61322 -80169
11526b4979j02927A90906c50829i7389j03160d4870B24863m5689J42475A30394
$$ -24979 -127906 190906 -350829 -97389 -200549 -44870 224863 179174 321649 130394
11515A28288M943a03342D6941K06166G005J85298G6509C7438b6838D48657j67765
$$ 128288 133231 -103342 46941 253107 7005 192303 76509 37438 -26838 448657 280892
11504B80892D19J08748c780B40990l8519Q4399J34441j21705o9332B4089K15540
$$ 280892 419 109167 -3780 240990 202471 286870 421311 299606 230274 24089 239629
11493B39629A4193J30061a83728D43345d7267C63332H1134f7348b9284D0924J12805
$$ 239629 14193 144254 -183728 443345 -47267 363332 81134 -67348 -29284 40924 153729
11482A53729l1113J10899a30364E7613L4009a58114d9839A50254M22153r9507
$$ 153729 122616 233515 -130364 57613 91622 -158114 -49839 150254 572407 472900
11472D72900e4534G1006c8992r3092B63107h7390D7408J01441H379J98027k8543
$$ 472900 -54534 71006 -38992 -132084 263107 -87390 47408 148849 8379 206406 177863
11461A77863M4154g6657K9269B11968m6846K04692b36147c7427j98239O3557H709
$$ 177863 222017 -76657 -47388 211968 165122 369814 -236147 -37427 -235666 -172109 8709
11449B18944A4488J99389k1620D6870J83922a02552C99856a7278r8758A47641
$$ 218944 14488 213877 192257 46870 230792 -102552 399856 -17278 -116036 147641
11438c19135E9162g8607c1892J0221p7156c0382k27851c9912H533J40218d6781
$$ -319135 59162 -78607 -31892 -21671 -98827 -30382 -258233 -39912 8533 148751 -46781
11426A39295K04283m3454b23534L2625K942I3959h2394G372K82195G7980K75476
$$ 139295 343578 300124 -223534 -190909 -187967 93959 -82394 7372 289567 77980 353456
11415C53456j64335G6252g2957k43046a5267A67383c9787I4823f852j81164g2136
$$ 353456 189121 76252 -72957 -316003 -15267 167383 -39787 94823 -6852 -188016 -72136
11403a26749B2610K0955b51604F0493f0527k6730c9490j78565A5233a4652j79090
$$ -126749 22610 43565 -251604 60493 -60527 -87257 -39490 -218055 15233 -14652 -193742
11392a93742M4039c0476n2120j7945q3920g1758a9538j43249F4991h3485H8722
$$ -193742 -149703 -30476 -82596 -100541 -184461 -71758 -19538 -162787 64991 -83485 88722
11380A95240G033J33796K41326A63249o0253B1887J16711J98630h1974A57426
$$ 195240 7033 140829 382155 163249 102996 21887 138598 337228 -81974 157426
11369d102C87737A38315a07412J1540B28366B0483N8695M6271b08478e4599b6787
$$ -4102 387737 138315 -107412 -95872 228366 20483 79178 125449 -208478 -54599 -26787
11357a94091d0778j40069A56124n1152b81709J18791C05700j26996H2415K44927
$$ -194091 -40778 -180847 156124 104972 -281709 -162918 305700 178704 82415 327342
11347C27342D601a3517B886a45310A60327i3835k4733H5818l2097c74690G2880
$$ 327342 4601 -13517 2886 -145310 160327 -93835 -118568 85818 53721 -374690 72880
11335G8307a45507B06727f3860J1764B9950N2576C0861L48074H7126c06190A66274
$$ 78307 -145507 206727 -63860 -52096 29950 82526 30861 378935 87126 -306190 166274
11323G7871b63497L63B35329O931a92573A3892a54461A46360a05434L3684K5682
$$ 77871 -263497 -263134 235329 242260 -192573 13892 -154461 146360 -105434 -71750 -46068
11312d6068n6721l8038L2300A10386J51678G9465A1087b08895G3994L72888I8706
$$ -46068 -102789 -140827 -108527 110386 262064 79465 11087 -208895 73994 446882 98706
11300c3926o032A42640b16346A66356e4060C23988e1535j13910A07769J19308
$$ -33926 -39958 142640 -216346 166356 -54060 323988 -51535 -165445 107769 227077
11290B27077a64844p3339a07491N2901H118O1900J64564J39103a32758k77512
$$ 227077 -164844 -238183 -107491 -54590 8118 70018 234582 373685 -132758 -410270
11280d10270N5099B48768h0038F5796J6428a14158k7227d9054B7816K16999i5504
$$ -410270 -355171 248768 -80038 65796 82224 -114158 -141385 -49054 27816 244815 -95504
11268D0195f9199A16749d9323D5741a08539G4442a34083e0368l7270j21753O3823
$$ 40195 -69199 116749 -49323 45741 -108539 74442 -134083 -50368 -87638 -209391 -145568
11257a45568A17872D2367J96164A01605a08142p2916J3448A60657a32647D6691
$$ -145568 117872 42367 238531 101605 -108142 -181058 -167610 160657 -132647 46691
11246E4341c20959A32305b96256g2163A44319a11123k5462n0793c528q3182j83540
$$ 54341 -320959 132305 -296256 -72163 144319 -111123 -136585 -187378 -3528 -86710 -270250
11235b70250a16229D1344i0094I8949a14323A35936d31595O0607A56167J02261
$$ -270250 -116229 41344 -90094 98949 -114323 135936 -431595 -370988 156167 258428
11225B58428a23906D9134a11729L4042L662L4037k18441A54378G805f1152l60642
$$ 258428 -123906 49134 -111729 -77687 -74025 -39988 -258429 154378 7805 -61152 -421794
11214d21794J50613h3141A61582q0556a56548b4218B80444B6242f3647b5211k38518
$$ -421794 -271181 -83141 161582 81026 -156548 -24218 280444 26242 -63647 -25211 -263729
11203b63729C93428A81125b7242F0429j2878b95473E8960b78585a5597H569L0339
$$ -263729 393428 181125 -27242 60429 47551 -295473 58960 -278585 -15597 8569 38908
11192C8908a33354m5702h9074r350K4560g427k87661J10268d5357j61656K2633
$$ 38908 -133354 -179056 -89074 -98424 -73864 -7427 -295088 -184820 -45357 -207013 -184380
11181a84380k80691B01151b26980c0820A41323d3032j38306M9273a6151A43598
$$ -184380 -465071 201151 -226980 -30820 141323 -43032 -181338 -132065 -16151 143598
11170e2587A74743l7003a88600A28051a98949r4694g5670k01180c2654o7392B84873
$$ -52587 174743 137740 -188600 128051 -198949 -293643 -75670 -276850 -32654 -100046 284873
11158a40099A3419b3861j7934r9538F7774b68241D8244a8706R278o1574A59443
$$ -140099 13419 -23861 -41795 -141333 67774 -268241 48244 -18706 -9428 -71002 159443
11146a65724A82365B0243K78968c1525B31285e310A42790b51531C06436A10417
$$ -165724 182365 20243 299211 -31525 231285 -5310 142790 -251531 306436 110417
11135a02376o9818A69730B7526a63430A56178b38191D0432K25551p5471q7773
$$ -102376 -172194 169730 27526 -163430 156178 -238191 40432 265983 190512 102739
11125A02739d0865B6502b06625h6454E7833a68071G7816K5880g9363j92084a35037
$$ 102739 -40865 26502 -206625 -86454 57833 -168071 77816 103696 -79363 -271447 -135037
11113C14134j56481a70230A00054r939J98909A27107L39886D2890d4613a77A59842
$$ 314134 157653 -170230 100054 90115 289024 127107 466993 42890 -44613 -177 159842
11101B27274H9039P684k2619L2802Q1200r2361N9547b9248B27808A01160B1310
$$ 227274 89039 96723 74104 106906 188106 95745 155292 -29248 227808 101160 21310
11089C64049A10607J37894m8121J48375j16970E432d8242A64235K68856A94308
$$ 364049 110607 248501 200380 348755 231785 5432 -48242 164235 433091 194308
11078E70710k37822n61O2179R2796j58457I9109K79604j11854n493o8894K07510
$$ 570710 332888 332327 394506 487302 328845 99109 378713 266859 261366 192472 399982
11067C99982n4767P9671J12688B55720J82655p7930K11924j54501K8216L73096
$$ 399982 345215 424886 537574 255720 438375 360445 572369 417868 446084 819180
11057H19180k97552L29605k87156Q804J79851k40666M05507D36871L77690k05926
$$ 819180 521628 851233 564077 572881 752732 512066 917573 436871 814561 608635
11047F08635J03823j13829J53095J81066J9739p7628k36223j25451J39641l0224
$$ 608635 712458 598629 751724 932790 952529 874901 638678 513227 652868 622644
11037F22644J8687J30061j49161l3739J80402k33503O4043k07303M20993k5295
$$ 622644 641331 771392 622231 588492 768894 535391 599434 392131 813124 787829
11027G87829j81160j01769j87163M56475p3594O0530j38417Q3428j02658j55130
$$ 787829 606669 504900 317737 774212 700618 761148 622731 706159 603501 448371
11017D48371L69711j25962N9579r7461j38308P4823J12544j72548J50099p3063
$$ 448371 818082 692120 751699 654238 515930 590753 703297 530749 680848 607785
11007F07785K49305k29691j01209K16140k78760J36186L50275B40364O28916k5493
$$ 607785 857090 627399 526190 742330 463570 599756 950031 240364 869280 843787
10997H43787k90162J2469O2777k1716L04586k3402l15296J59804j62631M66932
$$ 843787 553625 566094 628871 607155 911741 888339 573043 732847 570216 1037148
10987A037148k68364K86423j87895p5779R5367J29398J8729J05727K58861L00722
$$ 1037148 768784 1055207 867312 791533 886900 1016298 1035027 1140754 1399615 1700337
10977A700337K1657L4351M6604L90539J01978L25946K18803L2969k67460j07513
$$ 1700337 1721994 1756345 1802949 2193488 2295466 2621412 2840215 2873184 2605724 2498211
10967B498211k80029k04673j21122k52101j3931L3881K29163K35911l01845j03559
$$ 2498211 2218182 2013509 1892387 1640286 1626355 1660236 1889399 2125310 1823465 1719906
10957A719906P9776L6664K35313l50844k33339l81063n39826K69866k98243J41546
$$ 1719906 1799682 1836346 2071659 1720815 1487476 1106413 566587 836453 538210 679756
10947F79756m8403j63041Q1695j86921A45945J96149j33663J54290J31250A04003
$$ 679756 631353 468312 550007 363086 145945 342094 208431 362721 493971 104003
10936B48398j24024J74696K20333k35179a05470A35280a49173B71954A8961b0946
$$ 248398 124374 299070 519403 284224 -105470 135280 -149173 271954 18961 -20946
10925a62944f3703A88336G6332A7052g0941D30880k09148h2457o296c5334A49847
$$ -162944 -63703 188336 76332 17052 -70941 430880 221732 -82457 -88753 -35334 149847
10913A81571E8555e2840B2981J51469k7421a34467A3705J3840K8683b76159A18983
$$ 181571 58555 -52840 22981 174450 147029 -134467 13705 27545 56228 -276159 118983
10901D1282i2269k59325A79333J37205H8336b67855A66826f3725j62164B40715
$$ 41282 -92269 -351594 179333 316538 88336 -267855 166826 -63725 -225889 240715
10890a73891q2507I4988a90380F9570L6531h5964j71607B07794b34163B9019b90888
$$ -173891 -256398 94988 -190380 69570 106101 -85964 -257571 207794 -234163 29019 -290888
10878E612P8921J65586H1881b10384P0758M905C4896a08542I2464a77063O7659
$$ 5612 84533 250119 81881 -210384 -139626 -134721 34896 -108542 92464 -177063 -109404
10867a09404K5918A98866c6375A93571c2694H0411a28153m2745F0318b05602G0779
$$ -109404 -83486 198866 -36375 193571 -32694 80411 -128153 -170898 60318 -205602 70779
10855e0801r9106c3674F1856a98764A1207K85381a07364B7390R9048a03475D4138
$$ -50801 -149907 -33674 61856 -198764 11207 296588 -107364 27390 126438 -103475 44138
10843h9278p0554j82756f0567A54302J40043b7156j23282r5573O2110k1718j75016
$$ -89278 -159832 -342588 -60567 154302 294345 -27156 -150438 -246011 -183901 -205619 -380635
10832c80635a73967A32330a03815M3168a712k12124J01468A31538k0608a64417
$$ -380635 -173967 132330 -103815 -60647 -1712 -213836 -112368 131538 110930 -164417
10821C5536a36664j4068H7757i4062A47229i3369A5027c3844B52454H8974b997
$$ 35536 -136664 -150732 87757 -94062 147229 -93369 15027 -33844 252454 88974 -2997
10809a79014C16070j03876b51371C9160b6255k03135J10162o3377b3630r2607
$$ -179014 316070 212194 -251371 39160 -26255 -229390 -119228 -182605 -23630 -116237
10799a16237a389I8288a89865H6694b16700A18148h7904A27042a79829M2686q2067
$$ -116237 -1389 98288 -189865 86694 -216700 118148 -87904 127042 -179829 -137143 -219210
10788b19210E0893a30878q5503B51361E7039a67389p6519J17456k9345j78005
$$ -219210 50893 -130878 -216381 251361 57039 -167389 -243908 -126452 -155797 -333802
10778c33802i458A82001a36760B03640b91958a26640o3087J9519A9867L00788
$$ -333802 -9458 182001 -136760 203640 -291958 -126640 -189727 -170208 19867 320655
10768C20655g9481A43733a77388K664A94379B9684d845k68551A64975J6273b16219
$$ 320655 -79481 143733 -177388 -174724 194379 29684 -4845 -273396 164975 181248 -216219
10756A46816e9938r9972c6746A84521L794b1220F8242P3874d7783j48550A80519
$$ 146816 -59938 -159910 -36746 184521 188315 -21220 68242 142116 -47783 -196333 180519
10744B12514l4745a27945j50905A93249b00956A71065h4289A9663f568C5067e982
$$ 212514 177769 -127945 -278850 193249 -200956 171065 -84289 19663 -6568 35067 -5982
10732F1472J52323a18947b8542k01234r0642M0425A07722j0271l8681a7739E7914
$$ 61472 213795 -118947 -28542 -229776 -320418 -279993 107722 97451 58770 -17739 57914
10720c3636A08704a76838n4874M2538B54921E344Q5830a32467H6909m405O5400
$$ -33636 108704 -176838 -231712 -189174 254921 5344 91174 -132467 86909 82504 147904
10709A47904i0244C8989P5523L0383a29986b7562A31657A1521I56J45172E2493
$$ 147904 -90244 38989 114512 144895 -129986 -27562 131657 11521 956 146128 52493
10697a07372B91656I686c09427a44940j86355G3014B5239e2565F2531L7170d37409
$$ -107372 291656 9686 -309427 -144940 -331295 73014 25239 -52565 62531 99701 -437409
10685b08010M5112g9862o3564b0293O406p764o6730k52820a8187j84573E9405
$$ -208010 -162898 -79862 -143426 -20293 -13887 -21651 -88381 -341201 -18187 -202760 59405
10673g4700A0322J70567H3674a4744A0938a80713B3468b57196q5334A80422C768
$$ -74700 10322 180889 83674 -14744 10938 -180713 23468 -257196 -342530 180422 3768
10661b55725C04988B5270a11878I1128d5787j78608A29686D0735e6759A74094
$$ -255725 304988 25270 -111878 91128 -45787 -224395 129686 40735 -56759 174094
10650c4803A71761a44615m2507B09014a94202F1958a58002C07789a40544e0707
$$ -34803 171761 -144615 -187122 209014 -194202 61958 -158002 307789 -140544 -50707
10639a97403P0858I7468b24076b9756m4697r8838n8680A59623a02013M9658B0269
$$ -197403 -126545 97468 -224076 -29756 -74453 -173291 -231971 159623 -102013 -52355 20269
10627B29208A4626c86255h0176b2224F6808J25038c21739a37013C2348b39402
$$ 229208 14626 -386255 -80176 -22224 66808 191846 -321739 -137013 32348 -239402
10616b23044h9993A29807d1460l25632Q3344A21603h3832A98558p8902f3669j8515
$$ -223044 -89993 129807 -41460 -367092 -283748 121603 -83832 198558 119656 -63669 -82184
10605h2184D6250i9450A62499a39009a9036k9379A09778m5798a51586G6371a64018
$$ -82184 46250 -99450 162499 -139009 -19036 -48415 109778 63980 -151586 76371 -164018
10593b52541j77325A95256f6704m0879I0675j9785b37204k18212a36251E0299
$$ -252541 -429866 195256 -66704 -107583 90675 70890 -237204 -455416 -136251 50299
10582c11714a15456B2320J14644b7412A6349c09721a27966j52220Q2962q4524
$$ -311714 -115456 22320 136964 -27412 16349 -309721 -127966 -280186 -197224 -281748
10572b81748E0043a15959L7580m9547p0203j20192N3181E3300B0676a51383l8057
$$ -281748 50043 -115959 -78379 -127926 -198129 -318321 -265140 53300 20676 -151383 -189440
10561a89440b0974r1019A51761a07459J4331b0546A13254A0631a4434m6462a7157
$$ -189440 -20974 -111993 151761 -107459 -93128 -20546 113254 10631 -14434 -60896 -17157
10549A76631M6568G1280A0123g6520L3511H5562J6153a15153m0340m3924I8744
$$ 176631 223199 71280 10123 -76520 -43009 85562 101715 -115153 -155493 -199417 98744
10537F0558J57876B7098Q8571O1940e1252B44399I3088d04839a15645j34073A23639
$$ 60558 218434 27098 115669 177609 -51252 244399 93088 -404839 -115645 -249718 123639
10525D5230i6859A21348c7816p9939b9331A52160a93359A55803c56008A07537
$$ 45230 -96859 121348 -37816 -117755 -29331 152160 -193359 155803 -356008 107537
10514B25085I5955J70135e2742B95662b8558A7907a27741d5448C6239b21541Q6700
$$ 225085 95955 266090 -52742 295662 -28558 17907 -127741 -45448 36239 -221541 -134841
10503a34841F0478A9905b00972B72522E2490a16969M6562A8321h1571b7939A36183
$$ -134841 60478 19905 -200972 272522 52490 -116969 -70407 18321 -81571 -27939 136183
10491B90709a0236q696A77123c5880C13668a13382A5681J77680a02390A49322
$$ 290709 -10236 -18932 177123 -35880 313668 -113382 15681 193361 -102390 149322
10480c497B15416J50849J6321o0308A31488C1509J55541G5860i3160D0191O7034
$$ -3497 215416 366265 382586 322278 131488 31509 187050 75860 -93160 40191 107225
10469A07225f4611o6137L1398A90114a396p0956B93398A800N556R1786J09655
$$ 107225 -64611 -130748 -99350 190114 -1396 -72352 293398 1800 7356 99142 208797
10458B08797a1867C8512d41702I057J63189i6592F6758a98609A01906N4467a36234
$$ 208797 -11867 38512 -441702 9057 172246 -96592 66758 -198609 101906 156373 -136234
10446a74622k96281i359F0347J19740C5893a88363B50662a15666g535j29042k93997
$$ -174622 -470903 -9359 60347 180087 35893 -188363 250662 -115666 -7535 -136577 -430574
10435d30574B65576b60007F273a68166g7801k76913f076E77K2540a42694k29408
$$ -430574 265576 -260007 6273 -168166 -77801 -354714 -6076 577 23117 -142694 -372102
10424c72102B20145B7679N7562M4768a19827E9219P9991b03197C08900o038a20007
$$ -372102 220145 27679 85241 130009 -119827 59219 139210 -203197 308900 302862 -120007
10412F2674h7943K7423I3090j6387d6825m05215J95693g3757A6606f7643k9779
$$ 62674 -87943 -60520 93090 76703 -46825 -452040 -256347 -73757 16606 -67643 -97422
10401i7422j3386B26688b4112j50715H4551N3322a22271G2957a85509D11447A4569
$$ -97422 -110808 226688 -24112 -174827 84551 137873 -122271 72957 -185509 411447 14569
10389c75961D2571f7001j12762M1450c1733C26109c4534I7552L6530a25498C20373
$$ -375961 42571 -67001 -179763 -138313 -31733 326109 -34534 97552 134082 -125498 320373
10377C73764j86091J0401M4929n9537K35405p7800A21390J08231l7721K29968
$$ 373764 187673 198074 243003 183466 418871 341071 121390 229621 191900 421868
10367D21868L846J65764q9629B48254K15685B25457J75069A50988J96209E0913
$$ 421868 425714 591478 501849 248254 463939 225457 400526 150988 347197 50913
10356A11943J34791J97440A80914a3623B45268K25756j48387N6456j40612k4729
$$ 111943 246734 444174 180914 -13623 245268 471024 322637 379093 238481 213752
10346B13752K8830L26436B29031J27509q2413L78044B72062I6114O5887p6177
$$ 213752 242582 569018 229031 356540 274127 652171 272062 96114 162001 85824
10336H5824J75708n9064H1337J83841a7051j5788l9141I8613Q274L2929n1869
$$ 85824 261532 202468 81337 265178 -17051 -32839 -71980 98613 106887 139816 87947
10325H7947d8745I0191R5507J40897A6643J04098J52625j35782m3350B1171A0532
$$ 87947 -48745 90191 185698 326595 16643 120741 273366 137584 94234 21171 10532
10313A15205a87860B28045a37381L0723D9371a92232P7805J9859p6159f5819q9602
$$ 115205 -187860 228045 -137381 -106658 49371 -192232 -114427 -94568 -170727 -65819 -155421
10302a55421l4746I2243e3051G7910J78490b8481l23328F7693e7372B00494q358
$$ -155421 -190167 92243 -53051 77910 256400 -28481 -351809 67693 -57372 200494 192136
10291A92136F7304i2971g81H143K8110a33021B67417c64178C2772K04527b84461
$$ 192136 67304 -92971 -781 8143 36253 -133021 267417 -364178 32772 237299 -284461
10279I6747c32673H1895a0033n8466m8797K5851A19218a8397C7702b74902B05518
$$ 96747 -332673 81895 -10033 -68499 -117296 -91445 119218 -18397 37702 -274902 205518
10267G903L68939j73886n7968c2220r3572H0484K11334A09701K622M53007J41127
$$ 7903 376842 202956 144988 -32220 -125792 80484 291818 109701 112323 565330 706457
10256G06457k03770a05226A70572m2295c5748q5728r4255D2484M8501k4675b34627
$$ 706457 502687 -105226 170572 128277 -35748 -121476 -215731 42484 90985 66310 -234627
10244b4219A80255J01963d0970n7224m3904A17266i5225p65G0689e4865Q63A7557
$$ -24219 180255 282218 -40970 -98194 -142098 117266 -95225 -95990 70689 -54865 -54002 17557
10231A75460b62754D1837f1983B0868c67618a68946A78777h1424A12453O879m9041
$$ 175460 -262754 41837 -61983 20868 -367618 -168946 178777 -81424 112453 119332 70291
10220G0291g6718B7038b75716I6933J6598M1955F1339c1396j10963r7697d0781
$$ 70291 -76718 27038 -275716 96933 113531 155486 61339 -31396 -142359 -240056 -40781
10208d6297k11510A46418C7285J3634e5353q9698H3699n749d2535B5972J14754
$$ -46297 -257807 146418 37285 50919 -55353 -145051 83699 77950 -42535 25972 140726
10197A40726O4142e7706k14829g6084k6924A10139c11105R5807M7254g2642C29206
$$ 140726 204868 -57706 -272535 -76084 -103008 110139 -311105 -215298 -168044 -72642 329206
10185i2540p1116o2144h8694A87839a3603N898j22215o7523k03934g0576a7218
$$ -92540 -163656 -225800 -88694 187839 -13603 -7705 -129920 -197443 -401377 -70576 -17218
10173a82209j1968d6642j34727c6660k9405B1106b9518B8798a35467L3821r3220
$$ -182209 -194177 -46642 -181369 -36660 -66065 21106 -29518 28798 -135467 -101646 -194866
10162a94866g8085j28273A52770C0645c20890B05555a13022k29941a44684l03664
$$ -194866 -78085 -206358 152770 30645 -320890 205555 -113022 -342963 -144684 -448348
10152d48348a03850H685J72506H0055K2321m221a46576Q737j50172b7844D15141
$$ -448348 -103850 8685 181191 80055 102376 98155 -146576 -137839 -288011 -27844 415141
10140A30267G253g2662l71079F7192j4486Q1294f3159A84536i0932H9171O02b57524
$$ 130267 7253 -72662 -443741 67192 52706 134000 -63159 184536 -90932 89171 89773 -257524
10127a88814J4434c4580l912C9512g3705B3322J37800a05513j13705c5143o7090
$$ -188814 -174380 -34580 -38492 39512 -73705 23322 161122 -105513 -219218 -35143 -102233
10116a02233P501m0466p6924f2937j81215j57012E6672L05722b01836h6067l20280
$$ -102233 -94732 -135198 -212122 -62937 -244152 -401164 56672 362394 -201836 -86067 -406347
10105d06347J89463N1997A20718l5390a17607g276j67421A04371b14559f7324
$$ -406347 -216884 -164887 120718 85328 -117607 -7276 -174697 104371 -214559 -67324
10094h98A42911n2856B6268a18406g769l88038H5843J83144a16836j0779C61368
$$ -898 142911 90055 26268 -118406 -7769 -395807 85843 268987 -116836 -127615 361368
10082a60677g0837j23286E7163g9701n2248B664O634J05812f5610C6027e9662
$$ -160677 -70837 -194123 57163 -79701 -131949 2664 9298 115110 -65610 36027 -59662
10070a09660N3286j13642h3256A15681D5646J43154a40473K7205j39194A50668
$$ -109660 -56374 -170016 -83256 115681 45646 188800 -140473 -113268 -252462 150668
10059H7875a57948A81129h7224j94841G5282b6266j06177L8777A38958g3069A95835
$$ 87875 -157948 181129 -87224 -282065 75282 -26266 -132443 -93666 138958 -73069 195835
10047b00320c4302m3760F8030d526j61906k3555r8312C6871L2715N2015a60391
$$ -200320 -34302 -78062 68030 -4526 -166432 -189987 -288299 36871 69586 121601 -160391
10035c14278a52463O0567j0338I8682a47548A95912b05089L3913C41586d7829
$$ -314278 -152463 -91896 -102234 98682 -147548 195912 -205089 -171176 341586 -47829
10024A00202b12784a01946o3163C19802i7108L3582J1203J7826j39440A26661
$$ 100202 -212784 -101946 -165109 319802 -97108 -63526 -52323 -34497 -173937 126661
10013f7380q3460I4533c01959B7727a8301B49471a28245n1709l18412a18308J1597
$$ -67380 -150840 94533 -301959 27727 -18301 249471 -128245 -179954 -498366 -118308 -106711
10002a06711k36194E460b90393J13968B2119K52294a17384A03045b32824d0317
$$ -106711 -342905 5460 -290393 -176425 22119 274413 -117384 103045 -232824 -40317
9991a6203k1046l4840C21516j54265D3158a23615q370l8252h0082a0688l4972
$$ -16203 -37249 -72089 321516 167251 43158 -123615 -131985 -170237 -80082 -10688 -45660
9980d5660o5239B52915b53766a16125I0085c06146e8080o5466j4067q6809d3700
$$ -45660 -110899 252915 -253766 -116125 90085 -306146 -58080 -123546 -137613 -224422 -43700
9968C0849a33237q8463e2690k24981N8367i8077B29956c3180A00044a49557G0525
$$ 30849 -133237 -221700 -52690 -277671 -219304 -98077 229956 -33180 100044 -149557 70525
9956D2976f6043B5006A2469a35621K017c4176R688B8262d7130D1277J8972L775
$$ 42976 -66043 25006 12469 -135621 -133604 -34176 -24488 28262 -47130 41277 60249 64024
9944F4024J53057b29211B0481c32683A22485a77424J0364b1294I8080i8832j61103
$$ 64024 217081 -229211 20481 -332683 122485 -177424 -167060 -21294 98080 -98832 -259935
9933b59935G4144k1112b67740a04725r1011K3675P6875j02139G131g9684j68408
$$ -259935 74144 53032 -267740 -104725 -195736 -172061 -95186 -197325 7131 -79684 -248092
9922b48092M9048O9266B49092C913a19047B25670R3871A26995J19690D7926b5498
$$ -248092 -199044 -129778 249092 3913 -119047 225670 319541 126995 246685 47926 -25498
9910a49179B4590Q3960L33392d22043A90342D4141b96358m760D1311d5134I2992
$$ -149179 24590 108550 441942 -422043 190342 44141 -296358 -301118 41311 -45134 92992
9898B033L9688M4423b14975c9253A74022B1823L2516e17C66756g6909l178C3798
$$ 2033 41721 86144 -214975 -39253 174022 21823 54339 -517 366756 -76909 -80087 33798
9885b46878O8644d7441l18410E0002b00734B4092b01186e7125j91635f5022I2427
$$ -246878 -178234 -47441 -365851 50002 -200734 24092 -201186 -57125 -248760 -65022 92427
9873e1203q9079j29707J01834A32351a31793N362k3214A17309J2724F2560p003
$$ -51203 -140282 -269989 -168155 132351 -131793 -126431 -149645 117309 130033 62560 55557
9862E5557a77280A37287b30777r9692B79448a06318J6757a1341k13785A34206
$$ 55557 -177280 137287 -230777 -330469 279448 -106318 -89561 -11341 -225126 134206
9851b04369f8095l2907A29263O086d20587d6177B0172a69498g3209A80268a37656
$$ -204369 -68095 -101002 129263 135349 -420587 -46177 20172 -169498 -73209 180268 -137656
9839e916j49975A6174O886P6313k2959J79070i3082D405J01297a16204Q267F0726
$$ -5916 -155891 16174 23060 99373 76414 255484 -93082 4405 105702 -116204 -107937 60726
9826a84333A12641a01165p3659c8931k48999L9287O6921Q1013B28783J01289i4322
$$ -184333 112641 -101165 -174824 -38931 -287930 -248643 -181722 -100709 228783 330072 -94322
9814B00695L3046b5004B66349C5567b39307n0969R4237A04871D0391f5248j16293
$$ 200695 233741 -25004 266349 35567 -239307 -290276 -196039 104871 40391 -65248 -181541
9803a81541K4171D9241J32080a71696F4577c4395J1974j58239M0947O7894A21260
$$ -181541 -157370 49241 181321 -171696 64577 -34395 -22421 -180660 -139713 -71819 121260
9791g9723r6835n5263p917j92667B68709h8582j61897Q9225e1817I921f8151l05544
$$ -79723 -176558 -231821 -239738 -432405 268709 -88582 -250479 -161254 -51817 9921 -68151 -373695
9779c73695A38424B019J27709a64397B2530O2482Q4561D3790K22924b11696k26772
$$ -373695 138424 2019 129728 -164397 22530 85012 169573 43790 266714 -211696 -438468
9768d38468b08374B27950a16728j62913J20227A91162H8098J0388a04093m05474
$$ -438468 -208374 227950 -116728 -279641 -159414 191162 88098 98486 -104093 -509567
9758e09567K53952M0110j01144a16207j8482b6725k8493E5094a07013b3062q4767
$$ -509567 -255615 -215505 -316649 -116207 -134689 -26725 -55218 55094 -107013 -23062 -107829
9747a07829l375J0823R996F0231J42125c09751J03510A82913a54820I8920K5168
$$ -107829 -111204 -100381 -90385 60231 202356 -309751 -206241 182913 -154820 98920 124088
9736A24088A0984b6507l37037J18952A68100K0088g9049B6671a70880A09470H153
$$ 124088 10984 -26507 -363544 -244592 168100 188188 -79049 26671 -170880 109470 8153
9724a61329j94617g1091k86448A70179o5472d543k8969p146j95508I4663i6835
$$ -161329 -355946 -71091 -357539 170179 104707 -4543 -33512 -40658 -236166 94663 -96835
9712a06947j53986e272j33636C8101P5315a16325a886j24845B02835g8083A85866
$$ -106947 -260933 -5272 -138908 38101 113416 -116325 -1886 -126731 202835 -78083 185866
9700c01283h8203r0384A27621b29935A48695b52432d8566m51268f4991H1267d55311
$$ -301283 -88203 -178587 127621 -229935 148695 -252432 -48566 -499834 -64991 81267 -455311
9688e0731A37363b22883L0009f4941J7859k96417A10471E395e7312j55811j21626
$$ -50731 137363 -222883 -192874 -64941 -47082 -343499 110471 5395 -57312 -213123 -334749
9677c34749H5641k4507a59349A21200i4654J2156k38839A19684O1951a55866F5142
$$ -334749 85641 61134 -159349 121200 -94654 -82498 -321337 119684 181635 -155866 65142
9665I1709a28785D35483D7654J32190f5432j80217j12929e5098l9694A50379b6884
$$ 91709 -128785 435483 47654 179844 -65432 -245649 -358578 -55098 -94792 150379 -26884
9653a48242j72723g8970j6461b4881j75826l3515E3352K0872h0652m8359M1812
$$ -148242 -320965 -78970 -95431 -24881 -200707 -234222 53352 74224 -80652 -129011 -87199
9642h7199j17030n6412K2178F6573b38203A7815a88964Q3505j9036F8480L873
$$ -87199 -204229 -260641 -238463 66573 -238203 17815 -188964 -105459 -124495 68480 72353
9631G2353L4975a01455L0588D2084a37443B33866a6991A64490b37554J935F468
$$ 72353 107328 -101455 -70867 42084 -137443 233866 -16991 164490 -237554 -235619 6468
9619b48271A14126a24217D00400E4786a01177K6530L4820B18362H5489b20597
$$ -248271 114126 -124217 400400 54786 -101177 -74647 -39827 218362 85489 -220597
9608a25795B506c2700A66963a50884c0264B1951a77866a4011j32016c2253p7895
$$ -125795 2506 -32700 166963 -150884 -30264 21951 -177866 -14011 -146027 -32253 -110148
9597a10148N3858j0190A41323d3783n1905k11950Q8670c0635e396m2399C1898
$$ -110148 -56290 -66480 141323 -43783 -95688 -307638 -218968 -30635 -5396 -47795 31898
9585b28654A17579a08116C2667b9779E7276a95737i1709B6050J06123b70512a15930
$$ -228654 117579 -108116 32667 -29779 57276 -195737 -91709 26050 132173 -270512 -115930
9573b65576O8365F0943J36691f7390J1894K3178I6345a10676G8122J83156H4736
$$ -265576 -197211 60943 197634 -67390 -55496 -32318 96345 -110676 78122 261278 84736
9561C1653f9520G0236L5440c6612r0855j82911n2955h6141j763b2933k40977D4289
$$ 31653 -69520 70236 105676 -36612 -127467 -310378 -363333 -86141 -87904 -22933 -263910 44289
9548a19104B421a37839l3853A20919O4764a88117A04591a81890h1976K0678j86102
$$ -119104 2421 -137839 -171692 120919 185683 -188117 104591 -181890 -81976 -61298 -247400
9537b47400c9925E6510a26121l0050j3569g4112H2934a25607B22436c6089k84605
$$ -247400 -39925 56510 -126121 -156171 -169740 -74112 82934 -125607 222436 -36089 -320694
9526c20694j40380b3056m62769B58628h5717j21091Q8269D134L37649A25017f4062
$$ -320694 -461074 -23056 -485825 258628 -85717 -206808 -118539 4134 341783 125017 -64062
9514c32381F085L09943b00233O5500B24352i625p0273K6323k06409A02516a02628
$$ -332381 6085 316028 -200233 -134733 224352 -9625 -79898 -53575 -259984 102516 -102628
9502d7738H7515P7936e234E2358b06913o958L5642c3744F178b32902A59818f5216
$$ -47738 87515 165451 -5234 52358 -206913 -213871 -178229 -33744 6178 -232902 159818 -65216
9489h6313A02033j4957h0755A47900j8491J74510a35414A1420a74521A26052d10391
$$ -86313 102033 87076 -80755 147900 129409 303919 -135414 11420 -174521 126052 -410391
9477A27146o1804a81879E9887b57678K4350Q0060n102c4492B55714a07207j80867
$$ 127146 65342 -181879 59887 -257678 -233328 -153268 -158370 -34492 255714 -107207 -288074
9466b88074a34081A20923A0699d8915A1157g7754K9761n7221A1497a02048B56658
$$ -288074 -134081 120923 10699 -48915 11157 -77754 -47993 -105214 11497 -102048 256658
9454a77404H989c01515J19066C22505C3854d2898j09327P0068B5141a75892c7787
$$ -177404 8989 -301515 -182449 322505 33854 -42898 -152225 -82157 25141 -175892 -37787
9442a04750o0087P3040L221B99968c8976j43023Q9127c6683k2068A8419c20467
$$ -104750 -164837 -91797 -88576 299968 -38976 -181999 -92872 -36683 -58751 18419 -320467
9430a75427b6955r3747q4056A55576G7179a10660c4909B61476E7863J47925i5344
$$ -175427 -26955 -120702 -204758 155576 77179 -110660 -34909 261476 57863 205788 -95344
9418d4759j46951g2362H4522b8486A848b13978O7234j01591a16450k45139A33901
$$ -44759 -191710 -72362 84522 -28486 1848 -213978 -146744 -248335 -116450 -361589 133901
9406a8940B7207L4291Q9569e62274a53393b007m081j37073F4576B0415b94347
$$ -18940 27207 61498 151067 -562274 -153393 -2007 -6088 -143161 64576 20415 -294347
9394C108O0574a60341j54902a26105q2639D7105i8920k02633f123C449c3144A83110
$$ 3108 63682 -160341 -315243 -126105 -208744 47105 -98920 -301553 -6123 3449 -33144 183110
9381c2319j23457L8481j52484c4736q2980a5620C5804a39369m9601D8091a63447
$$ -32319 -155776 -117295 -269779 -34736 -117716 -15620 35804 -139369 -188970 48091 -163447
9369f2148o5716l0126K5176D3357M2225d03151a39505K5720b6325A13137c0317
$$ -62148 -127864 -157990 -132814 43357 85582 -403151 -139505 -113785 -26325 113137 -30317
9357a12672e3622m6150j69178d4602n7035L8650j15743B14007f5207n5359d6954
$$ -112672 -53622 -99772 -268950 -44602 -101637 -62987 -178730 214007 -65207 -120566 -46954
9345A74506c4971q7916C4920J48190d8566B57345a41457o1995e7119B4928J98528
$$ 174506 -34971 -122887 34920 183110 -48566 257345 -141457 -203452 -57119 24928 223456
9334B23456C7974O4518K6203a5256r2676e3335A04357b5086G0425b82269d6001
$$ 223456 37974 102492 128695 -15256 -107932 -53335 104357 -25086 70425 -282269 -46001
9322B19223L05109d25235J99214G9870k9090J18622d17734J72731A2607c01379
$$ 219223 524332 -425235 -226021 79870 50780 169402 -417734 -245003 12607 -301379
9311i053n8258j59233i8395H3668b14076c8691j16531c3332p8491k86006J80067
$$ -9053 -67311 -226544 -98395 83668 -214076 -38691 -155222 -33332 -111823 -397829 -217762
9300b17762P7219M1801A16256a10599M7263A1655c538k18515l02904A88848D2243
$$ -217762 -140543 -98742 116256 -110599 -63336 11655 -3538 -222053 -524957 188848 42243
9288c85999c1213A15935C9779M2113h8092r1192A18990a3463j15329L1956J5680
$$ -385999 -31213 115935 39779 81892 -88092 -179284 118990 -13463 -128792 -96836 -81156
9277h1156j57391A59979b12501B05098c31276F5228b78442d350k3340k64994k2727
$$ -81156 -238547 159979 -212501 205098 -331276 65228 -278442 -4350 -27690 -292684 -315411
9266c15411L7849O3955J01947j33377c8889A94977o6398a61792j86083A16986
$$ -315411 -277562 -213607 -111660 -245037 -38889 194977 128579 -161792 -347875 116986
9255E2898a82908B2689c9010k68664B06957o9119h117j31348a9823j76874K5361
$$ 52898 -182908 22689 -39010 -307674 206957 137838 -8117 -139465 -19823 -196697 -171336
9244a71336e895j98688h8132l7592G4912c9962m0730G5338l4977b29876E6195
$$ -171336 -5895 -204583 -88132 -125724 74912 -39962 -80692 75338 40361 -229876 56195
9232A73711a93443B75560a11873A10240a40163F7272a02794j23383i0537D7366
$$ 173711 -193443 275560 -111873 110240 -140163 67272 -102794 -226177 -90537 47366
9221c18535e7689l3764B10470b28473I2721k2503j5739d295o9975i338I5867f8408
$$ -318535 -57689 -91453 210470 -228473 92721 70218 54479 -4295 -74270 -9338 95867 -68408
9208B78836F42e3712j03010D20052C1444b00854R9321b7901p7576A71898a9460
$$ 278836 642 -53712 -156722 420052 31444 -200854 -101533 -27901 -105477 171898 -19460
9196A25586c731H3113k7210N204a94806f8881k52453A88632c44470a65093p7468
$$ 125586 -3731 83113 55903 61107 -194806 -68881 -321334 188632 -344470 -165093 -242561
9185b42561A61969a80182f9834r3057A56817b1002n5087B25594C6833d9109h915
$$ -242561 161969 -180182 -69834 -162891 156817 -21002 -76089 225594 36833 -49109 -8915
9173a05585l5039H0435b91808A17778b87086G0963a41569L251f7079b6811C1762
$$ -105585 -140624 80435 -291808 117778 -287086 70963 -141569 -138318 -67079 -26811 31762
9161f86j94146b2379j61635A7552J15782a54934p9575P9897a9220A88048a82352
$$ -686 -194832 -22379 -184014 17552 133334 -154934 -234509 -154612 -19220 188048 -182352
9149A03906b19140d2760i856l2215j92664Q0750r8800b237A74786M5901q8532
$$ 103906 -219140 -42760 -9856 -42071 -234735 -153985 -252785 -2237 174786 220687 132155
9138A32155a07853o6620P7753G5465b6249k5883Q746n3643I3079o287c90492A6302
$$ 132155 -107853 -174473 -96720 75465 -26249 -52132 -43386 -97029 93079 86792 -390492 16302
9125D2514a86942A55680c68185P4889J32159L5653k58803A03796g3871a5874r3525
$$ 42514 -186942 155680 -368185 -293296 -161137 -125484 -384287 103796 -73871 -15874 -109399
9114a09399C72339c44035b9652A63626h4910j26927H5303l4268R417k5443f9660
$$ -109399 372339 -344035 -29652 163626 -84910 -211837 85303 51035 60452 35009 -69660
9102d912m9721C1857d0852m87211A63863a17511G8540L928a07773l2085A28228
$$ -4912 -54633 31857 -40852 -528063 163863 -117511 78540 82468 -107773 -139858 128228
9090a37800j24472A80132E8217d6798B58548a24947C1184e0422k81473a32293
$$ -137800 -262272 180132 58217 -46798 258548 -124947 31184 -50422 -331895 -132293
9079A83203e8523q9511j86066A94004b39825A22711J37791H1038J69256r1869
$$ 183203 -58523 -148034 -334100 194004 -239825 122711 260502 81038 250294 158425
9069A58425a88173e685o6403C3056b52032K9860a3346m9049p6685k04941a59518
$$ 158425 -188173 -5685 -72088 33056 -252032 -222172 -13346 -62395 -139080 -344021 -159518
9057C8797l080L7442a6308p9912B50072b40012L7198M6385d449k61478B89372
$$ 38797 35717 73159 -16308 -96220 250072 -240012 -202814 -156429 -4449 -265927 289372
9045b64809H7046C4938a09784A73900a44926j61811b6160F3948a24622b058k4107
$$ -264809 87046 34938 -109784 173900 -144926 -306737 -26160 63948 -124622 -2058 -26165
9034b6165k2346H6906k5641c56416A89855e7693b6713B0499b5742B0858h3280
$$ -26165 -48511 86906 61265 -356416 189855 -57693 -26713 20499 -25742 20858 -83280
9022d8123j5493A25779b99019j59539J66822A88360f2287A45959p0122M5635b12184
$$ -48123 -63616 125779 -299019 -458558 -291736 188360 -62287 145959 75837 121472 -212184
9010h0489n5800A97357b3303A7530M9669c5243l4248a5060p3209l9843M5706m9023
$$ -80489 -136289 197357 -23303 17530 67199 -35243 -69491 -15060 -88269 -128112 -82406 -131429
8998a31429n8250J2151N4860e120B12965M8968a46153j47231a7900B07456b39225
$$ -131429 -189679 -177528 -122668 -5120 212965 261933 -146153 -293384 -17900 207456 -239225
8986a77128j149A11089a94631d3434j22077A43281A5895a06754A87704G7787b20502
$$ -177128 -178277 111089 -194631 -43434 -165511 143281 15895 -106754 187704 77787 -220502
8974a80747m4772B06310a81126A16367b60644k4189D53347a4851A72138c9769
$$ -180747 -225519 206310 -181126 116367 -260644 -284833 453347 -14851 172138 -39769
8963h4825o4279G7481a49474j14372E7160h9644E6185a73256j12839a9273k16575
$$ -84825 -149104 77481 -149474 -263846 57160 -89644 56185 -173256 -286095 -19273 -235848
8952b35848e5531k20377a27207o1137O7936I9544f0611k41296R8384R9433j23581
$$ -235848 -55531 -275908 -127207 -188344 -120408 99544 -60611 -301907 -203523 -104090 -227671
8941b27671M3280A67860g7069j27364a1150m790p0276G6655d3049B55603b13814
$$ -227671 -184391 167860 -77069 -204433 -11150 -15940 -86216 76655 -43049 255603 -213814
8929C71232D5111i3776o7284Q936N9159A19913J4927J165193J60416B37190h2107
$$ 371232 45111 -93776 -161060 -152124 -92965 119913 134840 1300033 1460449 237190 -82107
8917A12639c4420j08360N4116L3364j5755J6415B65335n9953c32512a4602m3294
$$ 112639 -34420 -142780 -88664 -55300 -71055 -54640 265335 205382 -332512 -14602 -57896
8906e7896b8591c328j4197F3299Q2028c05497j19113a41720A24989L9711a96757
$$ -57896 -28591 -3328 -17525 63299 145327 -305497 -424610 -141720 124989 164700 -196757
8894a636A45510b45934H6225i5482B13056i5133J0008B91973j08488r0926e8264
$$ -1636 145510 -245934 86225 -95482 213056 -95133 -85125 291973 183485 92559 -58264
8882A87166c35196k47057b10272p3416B29370f1028a6111l9296B18022C352K0196
$$ 187166 -335196 -582253 -210272 -283688 229370 -61028 -16111 -55407 218022 3352 23548
8871B3548L3430K7227b70434d376j53716L9917j04340p5923f1760D03397g1998
$$ 23548 56978 84205 -270434 -4376 -158092 -118175 -222515 -298438 -61760 403397 -71998
8859A9986f3330p484K8882D1574c3749G2580a3028A64556A0242M5678J7356a15830
$$ 19986 -63330 -70814 -41932 41574 -33749 72580 -13028 164556 10242 55920 73276 -115830
8846I5565J9699c34925A48873J0565A1101i9338H0275c13740J56573j3248B6009
$$ 95565 115264 -334925 148873 159438 11101 -99338 80275 -313740 -157167 -170415 26009
$$ [...]
##END NTUPLES=NMR SPECTRUM
##END=
