##TITLE=AC1724_GUAAH15010_9207984_s5XGJ8nSeJ
##JCAMPDX= 6.0         $$ Bruker NMR JCAMP-DX V2.0
##DATA TYPE= NMR SPECTRUM
##DATA CLASS= NTUPLES
##ORIGIN= BRUKER
##OWNER= Administrator
$$ 1.72 TOPSPIN		Version 2.1
$$ 2015-06-01 19:25:16.248 -0700  Administrator@X
$$ Compression mode = diff/dup
##.OBSERVE FREQUENCY= 400.02188249412
##.OBSERVE NUCLEUS= ^1H
##.ACQUISITION MODE= SIMULTANEOUS (DQD)
##.ACQUISITION SCHEME= undefined
##.AVERAGES= 64
##.DIGITISER RES= 22
##SPECTROMETER/DATA SYSTEM= spect
##.PULSE SEQUENCE= noesygpps1d.comp
##.SOLVENT NAME= COFFEE_meoh
##.SHIFT REFERENCE= INTERNAL, COFFEE_meoh, 1, 14.96091
##AUDIT TRAIL= $$ (NUMBER, WHEN, WHO, WHERE, PROCESS, VERSION, WHAT)
$$ ##TITLE= Audit trail, TOPSPIN		Version 2.1
$$ ##JCAMPDX= 5.01
$$ ##ORIGIN= Bruker BioSpin GmbH
$$ ##OWNER= Administrator
$$ $$ E:\/data/COFFEE/nmr/AC1724_GUAAH15010_9207984_s5XGJ8nSeJ/12/pdata/1/auditp.txt
$$ ##AUDIT TRAIL=  $$ (NUMBER, WHEN, WHO, WHERE, PROCESS, VERSION, WHAT)
(   1,<2015-06-01 19:25:11.076 -0700>,<Administrator>,<X>,<go>,<TOPSPIN 2.1>,
      <created by zg
	started at 2015-06-01 19:13:41.123 -0700,
	POWCHK enabled, PULCHK disabled,
       configuration hash MD5:
       21 0F 79 D6 B3 7B B4 F6 88 20 88 DB 03 48 BD 9F
       data hash MD5: 64K
       BA 8A 3C 97 90 11 0B D7 88 5E F7 BE 71 C2 4A 1B>)
(   2,<2015-06-01 19:25:14.217 -0700>,<Administrator>,<X>,<proc1d>,<TOPSPIN 2.1>,
      <Start of raw data processing
       efp LB = 0.3 FT_mod = 6 PKNL = 1 PHC0 = 0 PHC1 = 0 SI = 128K 
       data hash MD5: 128K
       D5 7B 83 4E D5 D7 9B EC 13 43 31 8E B3 6B 1A 2D>)
(   3,<2015-06-01 19:25:15.076 -0700>,<Administrator>,<X>,<proc1d>,<TOPSPIN 2.1>,
      <pk PHC0 = -88.02246 PHC1 = 0 
       data hash MD5: 128K
       F7 D3 9F E3 0C BA DF 83 83 B5 B1 43 DC 17 98 FD>)
(   4,<2015-06-01 19:25:15.436 -0700>,<Administrator>,<X>,<proc1d>,<TOPSPIN 2.1>,
      <abs ABSG = 1 
       data hash MD5: 128K
       21 31 2C 19 AF 32 A4 F9 9B 63 CD 76 DC BB 50 F1>)
(   5,<2015-06-01 19:25:15.530 -0700>,<Administrator>,<X>,<proc1d>,<TOPSPIN 2.1>,
      <abs ABSG = 2 
       data hash MD5: 128K
       CE 6A 03 C2 41 0D 32 05 B2 53 98 0E F1 6B 96 D4>)
(   6,<2015-06-01 19:25:15.623 -0700>,<Administrator>,<X>,<proc1d>,<TOPSPIN 2.1>,
      <abs ABSG = 3 
       data hash MD5: 128K
       F2 07 7D 15 C3 4D 5C 13 F3 D8 FC 38 F9 BF 9D D4>)
(   7,<2015-06-01 19:25:15.701 -0700>,<Administrator>,<X>,<proc1d>,<TOPSPIN 2.1>,
      <abs ABSG = 4 
       data hash MD5: 128K
       C2 54 22 F5 AD 8A BD 16 9A 60 41 07 5B C8 3A 99>)
(   8,<2015-06-01 19:25:15.795 -0700>,<Administrator>,<X>,<proc1d>,<TOPSPIN 2.1>,
      <abs ABSG = 5 
       data hash MD5: 128K
       5B 53 2C 54 49 1B F3 B7 56 E5 69 D2 A3 07 47 4F>)
$$ ##END=
$$ 
$$ $$ hash MD5
$$ $$ A7 71 85 9E 8A C3 1B 0D C3 92 F5 D3 BF 60 5D 17
##$RELAX= 
##$RELAX= 
##$RELAX= 
##$RELAX= 
##$RELAX= 
##$RELAX= 
##$RELAX= 
##$RELAX= 
$$ Bruker specific parameters
$$ --------------------------
##$DU= <E:\>
##$EXPNO= 12
$$ [...]
##$TP07= 0
##$TPNAME0= <>
##$TPNAME1= <>
##$TPNAME2= <>
##$TPNAME3= <>
##$TPNAME4= <>
##$TPNAME5= <>
##$TPNAME6= <>
##$TPNAME7= <>
##$TPOAL= (0..7)
0.5 0.5 0.5 0.5 0.5 0.5 0.5 0.5
##$TPOFFS= (0..7)
0 0 0 0 0 0 0 0
##$TUNHIN= 0
##$TUNHOUT= 0
##$TUNXOUT= 0
##$USERA1= <user>
##$USERA2= <user>
##$USERA3= <user>
##$USERA4= <user>
##$USERA5= <user>
##$V9= 5
##$VALIST= <valist>
##$VCLIST= <CCCCCCCCCCCCCCC>
##$VD= 0
##$VDLIST= <DDDDDDDDDDDDDDD>
##$VPLIST= <PPPPPPPPPPPPPPP>
##$VTLIST= <TTTTTTTTTTTTTTT>
##$WBST= 2048
##$WBSW= 25
##$XGAIN= (0..3)
0 0 0 0
##$XL= 0
##$YL= 0
##$YMAX_a= 6458941
##$YMIN_a= -12072083
##$ZGOPTNS= <>
##$ZL1= 120
##$ZL2= 120
##$ZL3= 120
##$ZL4= 120
##$ABSF1= 14.96091
##$ABSF2= -5.597272
##$ABSG= 5
##$ABSL= 3
##$ALPHA= 0
##$AQORDER= 0
##$ASSFAC= 0
##$ASSFACI= 0
##$ASSFACX= 0
##$ASSWID= 0
##$AUNMP= <proc_prof1d_extract.lims>
##$AXLEFT= 0
##$AXNAME= <>
##$AXNUC= <1H>
##$AXRIGHT= 0
##$AXTYPE= 0
##$AXUNIT= <>
##$AZFE= 0.1
##$AZFW= 0.1
##$BCFW= 0
##$BC_mod= 0
##$BYTORDP= 0
##$COROFFS= 0
##$CY= 15
##$DATMOD= 1
##$DC= 0
##$DFILT= <>
##$DTYPP= 0
##$F1P= 0
##$F2P= 0
##$FCOR= 0.5
##$FTSIZE= 131072
##$FT_mod= 6
##$GAMMA= 0
##$GB= 0
##$INTBC= 1
##$INTSCL= 1
##$ISEN= 128
##$LB= 0.3
##$LEV0= 0
##$LPBIN= 0
##$MAXI= 10000
##$MC2= 0
##$MEAN= 0
##$ME_mod= 0
##$MI= 0
##$NCOEF= 0
##$NC_proc= -2
##$NLEV= 6
##$NOISF1= 0
##$NOISF2= 0
##$NSP= 0
##$NTH_PI= 0
##$NZP= 0
##$OFFSET= 14.96091
##$PC= 1
##$PHC0= -88.02246
##$PHC1= 0
##$PH_mod= 1
##$PKNL= yes
##$PPARMOD= 0
##$PPDIAG= 0
##$PPIPTYP= 0
##$PPMPNUM= 2147483647
##$PPRESOL= 1
##$PSCAL= 4
##$PSIGN= 0
##$PYNMP= <proc.py>
##$REVERSE= no
##$SF= 400.020009672026
##$SI= 131072
##$SIGF1= 0
##$SIGF2= 0
##$SINO= 400
##$SIOLD= 131072
##$SPECTYP= <>
##$SREGLST= <1H.CDCl3>
##$SSB= 0
##$STSI= 131072
##$STSR= 0
##$SW_p= 8223.68421052631
##$SYMM= 0
##$S_DEV= 0
##$TDeff= 65536
##$TDoff= 0
##$TI= <>
##$TILT= no
##$TM1= 0
##$TM2= 0
##$TOPLEV= 0
##$USERP1= <user>
##$USERP2= <user>
##$USERP3= <user>
##$USERP4= <user>
##$USERP5= <user>
##$WDW= 1
##$XDIM= 131072
##$YMAX_p= 367785763
##$YMIN_p= -11634
##$CURPLOT= <Network HP LaserJet P1505>
##$CURPRIN= <$Network HP LaserJet P1505>
##$DFORMAT= <normdp>
##$LAYOUT= <+/1D_H.xwp>
##$LFORMAT= <normlp>
##$PFORMAT= <normpl>
##$SURQMSG= 1
$$ End of Bruker specific parameters
$$ ---------------------------------
##NTUPLES= NMR SPECTRUM
##VAR_NAME=  FREQUENCY,     SPECTRUM/REAL,   SPECTRUM/IMAG
##SYMBOL=    X,             R,               I
##VAR_TYPE=  INDEPENDENT,   DEPENDENT,       DEPENDENT
##VAR_FORM=  AFFN,          ASDF,            ASDF
##VAR_DIM=   131072,        131072,          131072
##UNITS=     HZ,            ARBITRARY UNITS, ARBITRARY UNITS
##FACTOR=    0.0627417313425164, 1,          1
##FIRST=     8223.62146879497, -1671,        -58010
##LAST=      0,             660,             -59030
##MIN=       0,             -11634,          0
##MAX=       8223.62146879497, 367785763,    0
$$ Real data points
##PAGE= N=1
##DATA TABLE= (X++(R..R)), XYDATA
$$ [...]
61625D25665k828k658k604k494k341k240j895q64N00J139O47q2r5L11J65p75j958
61608D07593l070m301n539o181n968n455n296n469n485n102m467l803l277l069
61594C41111l309l803m016l497k353j203o52q04j350k012k645k980k668j760q96
61579C07163o43q29q92p77r98j780k569k640j909q83m3M28M74O8n87j111j250
61562B91222j075p85m25Q1P15J278J584J620J517J360J063N22o8k09L97J326J735
61545C01858J282N29K16L73M68K38p5k19j75J58R32J879K389K347K388K852L011
61528C20451K004J87j180j512j399j548j953k295k476k436k008j331r74j194j490
61513C00846j298q44p19r22q95m42m7j44n12o09k39L58Q04Q45M31k59r17j337
$$ plain form
61625 425665 422837 420179 417575 415081 412740 410500 408605 407741 408241 409380 410027 409945 409850 410161 410326 409551 407593
61608 407593 404523 400222 394683 388502 382534 377079 371783 366314 360829 355727 351260 347457 344180 341111
61594 341111 337802 333999 329983 326486 324133 322930 322278 321474 320124 318112 315467 312487 309819 308059 307163
61579 307163 306520 305691 304799 304022 303024 301244 298675 296035 294126 293243 293200 293628 294102 294170 293583 292472 291222
61562 291222 290147 289362 288937 289018 289733 291011 292595 294215 295732 297092 298155 298677 298609 298400 298797 300123 301858
61545 301858 303140 303669 303885 304258 304726 304964 304889 304670 304495 304653 305585 307464 309853 312200 314588 317440 320451
61528 320451 322455 322642 321462 319950 318551 317003 315050 312755 310279 307843 305835 304504 303530 302336 300846
61513 300846 299548 298704 297985 297063 296168 295726 295679 295535 295023 294414 294175 294533 295337 296182 296613 296354 295437 294100
61495B94100j539j630j558j078o1J206K058J938R44j79o05p8R49J705J620P31
61479B98523k65n06K80J422J994J802J538J785K205K049J268O60P66J122R50K68
61463C15861k64l93n25q75j063q71p63j121j415q03O17J829K109J705J218Q92
61447C16138O43M12K68M16J069K026K472J746L78k31O29K171L134L108K536J928
61431C38843J541J532J819J959J616J087R45J246J464J277J001J177J913K815
61417C60235L366L288K705J967J345Q49L49k62j018j866k571k806k480j903j475
61402C59723j289j146q98o90q23j396k018j961q98N91J457J246L94m95j236j774
61386C48787j770r82K60J296J803J883J732J546J614K010K334K156J728J800K601
$$ plain form
61495 294100 292561 290931 289373 288295 288234 289440 291498 293436 294380 294201 293596 293518 294467 296172 297792 298523
61479 298523 298258 297752 298032 299454 301448 303250 304788 306573 308778 310827 312095 312755 313521 314643 315593 315861
61463 315861 315597 315204 314679 313804 312741 311870 311107 309986 308571 307768 308385 310214 312323 314028 315246 316138
61447 316138 316781 317193 317461 317877 318946 320972 323444 325190 325568 325337 325966 328137 331271 334379 336915 338843
61431 338843 340384 341916 343735 345694 347310 348397 349342 350588 352052 353329 354330 355507 357420 360235
61417 360235 363601 366889 369594 371561 372906 373755 374104 373842 372824 370958 368387 365581 363101 361198 359723
61402 359723 358434 357288 356390 355700 354877 353481 351463 349502 348604 349195 350652 351898 352292 351797 350561 348787
61386 348787 347017 346035 346295 347591 349394 351277 353009 354555 356169 358179 360513 362669 364397 366197 368798
61371C68798L405L342K437J588J528K056K280J666O50J54N37J320J916K290K633
61356C96600K826K675K519L047M426N972O887P071P032P194P458P435O996O430
61342D74568N970N337M126K619J771K060K815L046K623K048J433M64p76j749k337
61327E04018k992l772m049l527k826k516k179j221n0M38L46O62J693K600K827
61312D89452L070M193N889P149P709Q202Q997R702R926R897J0061J0467J0788
61299E95502J0572R347O899L747R29r65k205l175l741l874m332n830p753q622
61285E86499p932o741o127n887n194l973k871k244j777j037%J029J726K021K224
61270E49716K755L594M189M117L597L187L194L606M300N005N328N228N238N855
$$ plain form
61371 368798 372203 375545 377982 379570 381098 383154 385434 387100 387750 387904 388441 389761 391677 393967 396600
61356 396600 399426 402101 404620 407667 412093 418065 424952 432023 439055 446249 453707 461142 468138 474568
61342 474568 480538 485875 490001 492620 494391 496451 499266 502312 504935 506983 508416 508880 508104 506355 504018
61327 504018 501026 497254 493205 489678 486852 484336 482157 480936 480886 481324 481670 482332 484025 486625 489452
61312 489452 492522 496715 502604 509753 517462 525664 534661 544363 554289 564186 574247 584714 595502
61299 595502 606074 615421 622320 626067 626996 626031 623826 620651 616910 613036 608704 602874 595121 586499
61285 586499 578567 571826 565699 559812 554618 550645 547774 545530 543753 542716 542716 543745 545471 547492 549716
61270 549716 552471 556065 560254 564371 567968 571155 574349 577955 582255 587260 592588 597816 603054 608909
61256F08909O796P316P083O328N239L765K060O29j89o14j145k026l069l815l956
61241F33311l739l849m630n510n610m807l844l347l187k886k274j536q73l24K68
61226E87163J207K655M312N582O167O285O263O156N892N560N351N345N459N571
61212F58968N630N727N969O219O111N521M879M683M826M808M539M509N100O184
61198G33673P526R107J0855J2452J3685J4705J5698J6584J7183J7361J6755J4900
61186I00484J1940Q880O585M787K623qk176l100l051k964l456m457n591o700p920
61171H95876r308j0490j0930j0662j0505j1227j2677j4040j4828j5203j5400j5346
61159G45260j4972j4502j4146j3803j3220j2265j0865q963o765m774l292k081
$$ plain form
61256 608909 615705 623021 630104 636432 641671 645436 647496 648125 647936 647322 646177 644151 641082 637267 633311
61241 633311 629572 625723 621093 615583 609973 605166 601322 597975 594788 591902 589628 588092 587219 586895 587163
61226 587163 588370 591025 595337 600919 607086 613371 619634 625790 631682 637242 642593 647938 653397 658968
61212 658968 664598 670325 676294 682513 688624 694145 699024 703707 708533 713341 717880 722389 727489 733673
61198 733673 741199 750306 761161 773613 787298 802003 817701 834285 851468 868829 885584 900484
61186 900484 912424 921304 927889 932676 935299 935291 933115 930015 926964 924000 920544 916087 910496 903796 895876
61171 895876 886568 876078 865148 854486 843981 832754 820077 806037 791209 776006 760606 745260
61159 745260 730288 715786 701640 687837 674617 662352 651487 642524 635759 630985 627693 625612
61147F25612q23K83P19L53m81j599l197n275p176q053p654o443n065l865k813
61132E74523j649j50J553L030M037M897O141P887R840J1812J3877J5960J7770
61119F69528J9279K0912K2884K4693K5665K5877K6105K6853K7815K8311K7945
61108I45867K6771K5148K3527K2130K0649J8466J5322J1610P899M383R48k480
61096A120240n899r358j2783j5825j8250k0382k2720k5099k6691k7103k6937k6892
61084H82301k6712k5585k3444k1193j9550j8269j6799j5186j3861j2822j1612
61073F77268j0010q317o872n720m780m025l299k304j053q4R5k73l11O12K315M152
61057F37394N683O901P943Q872R755J0654J1495J2179J2979J4477J6801J9139
$$ plain form
61147 625612 624789 625072 625791 626144 625663 624064 620867 615592 608416 600363 592709 586266 581201 577336 574523
61132 574523 572874 572724 574277 577307 581344 586241 592382 600269 610109 621921 635798 651758 669528
61119 669528 688807 709719 732603 757296 782961 808838 834943 861796 889611 917922 945867
61108 945867 972638 997786 1021313 1043443 1064092 1082558 1097880 1109490 1117389 1121772 1122720 1120240
61096 1120240 1114341 1104983 1092200 1076375 1058125 1037743 1015023 989924 963233 936130 909193 882301
61084 882301 855589 830004 806560 785367 765817 747548 730749 715563 701702 688880 677268
61073 677268 667258 658941 652069 646349 641569 637544 634245 631941 630888 630804 630899 630626 630315 630927 633242 637394
61057 637394 643077 649978 657921 666793 676548 687202 698697 710876 723855 738332 755133 774272
61045G74272K0558K1171K1974K3516K5305K6684K7677K8620K9598L0642L1970
61034A061987L3494L4575L4919L5241L6418L8315M0158M1738M3376M5042M6348
61023A491611M7388M8642N0209N1941N4329N8336O4403P2342Q2071R3485J05825
61012B220582J18489J32541J50360J73981K04999K45611K97752L61456M36450
61003D342221N25221O31671P57051R01793J070799J267312J474443J650431J755079
60994A4376021J779011J731730J598414J332225R15390M25306J2661k05680k29845
60985B1735233j51374o2548j1024l2740j85983n15946r86021j468634j820260
60976A6500703j967676j928525j768737j553723j328799j120025r37797p81544
$$ plain form
61045 774272 794830 816001 837975 861491 886796 913480 941157 969777 999375 1030017 1061987
61034 1061987 1095481 1130056 1164975 1200216 1236634 1274949 1315107 1356845 1400221 1445263 1491611
61023 1491611 1538999 1587641 1637850 1689791 1744120 1802456 1866859 1939201 2021272 2114757 2220582
61012 2220582 2339071 2471612 2621972 2795953 3000952 3246563 3544315 3905771 4342221
61003 4342221 4867442 5499113 6256164 7157957 8228756 9496068 10970511 12620942 14376021
60994 14376021 16155032 17886762 19485176 20817401 21732791 22158097 22170758 21965078 21735233
60985 21735233 21583859 21521311 21510287 21477547 21291564 20775618 19789597 18320963 16500703
60976 16500703 14533027 12604502 10835765 9282042 7953243 6833218 5895421 5113877
60968E113877o47675n34839m42191l66498l03800k52328k11675j80319j55746
60959B018806j36132j20411j07333r5752q5276p5743o6728n8282n1255m5997m1574
60948A134323l7188l3475l1412l0715l0336k9844k9240k8082k6066k3983k2906
60937H11076k2662k2168k0988j9578j8160j6516j4802j3551j2786j1923j0709
60926F27233r498q578p869p381p249p235o821n957n140m645m208l592l039k897
60912E43124l199l712m140m162l624k759j986j460j049p75q94j386j679j180q4
60897E11035O01L3j489k730k788j926j003m15k3K19K40K99P18J201J091M68J96
60880E05727O71J302J544J632J899K182K411K997M060M936N165N215N610O007
$$ plain form
60968 5113877 4466202 3931363 3489172 3122674 2818874 2566546 2354871 2174552 2018806
60959 2018806 1882674 1762263 1654930 1559178 1473902 1398159 1331431 1273149 1221894 1175897 1134323
60948 1134323 1097135 1063660 1032248 1001533 971197 941353 912113 884031 857965 833982 811076
60937 811076 788414 766246 745258 725680 707520 691004 676202 662651 649865 637942 627233
60926 627233 617735 609157 601288 593907 586658 579423 572602 566645 561505 556860 552652 549060 546021 543124
60912 543124 539925 536213 532073 527911 524287 521528 519542 518082 517033 516258 515364 513978 512299 511119 511035
60897 511035 511636 511669 510180 507450 504662 502736 501733 501318 501295 501514 501754 502053 502771 503972 505063 505531 505727
60880 505727 506398 507700 509244 510876 512775 514957 517368 520365 524425 529361 534526 539741 545351 551358
60866E51358O062O403P719R365J0057R714R471R967J0641J0854J0742J0675J0614
60853F73642J0362R984R784J0053J0852J1753J2066J1644J1183J1262J1518J1335
60841H05438J0855J0604J0464R932R164Q813Q924Q867Q398P919P642P300O754
60828I21074O121N225L677J669r1j412k884m934p275r545j1759j3867j5513j6539
60814H53947j7258j7939j8452j8597j8382j7807j6850j5768j4899j4118j3007
60803F70870j1714j0962j1001j1089j0332q683o863n658n379n671n793n422n050
60790E67253n160n314m832m053l938m415m324l322k605l161m299m776m498m264
60776E08292m332m246l801l356l261l582m220m884n115m806m466m608n049n144
$$ plain form
60866 551358 557420 563823 571542 580907 590964 600678 610149 620116 630757 641611 652353 663028 673642
60853 673642 684004 693988 703772 713825 724677 736430 748496 760140 771323 782585 794103 805438
60841 805438 816293 826897 837361 847293 856457 865270 874194 883061 891459 899378 907020 914320 921074
60828 921074 927195 932420 936097 937766 937675 936263 933379 928445 921170 911625 899866 885999 870486 853947
60814 853947 836689 818750 800298 781701 763319 745512 728662 712894 697995 683877 670870
60803 670870 659156 648194 637193 626104 615772 607089 600226 594568 589189 583518 577725 572303 567253
60790 567253 562093 556779 551947 547894 543956 539541 535217 531895 529290 526129 521830 517054 512556 508292
60776 508292 503960 499714 495913 492557 489296 485714 481494 476610 471495 466689 462223 457615 452566 447422
60762D47422m575l613k881k991l980m892m465k679j024p46j383j765j819k321
60748D08288l174l151j581O06J959J972J168K35m60q58j119j417j668j624j302
60733C97874j059j076j074p31j50L48O43P53N72M4n01o60o05j013k071l039l155
60716C85100k708k671l357m056m120l788l665l829l881l527k766j752r84j217
60702C42779k603m048m119k600o63M77N81K8q24j605j832j291l77L21O47R45J502
60685C27318K093K142J416N37M80J456K637L229L302L238K916K184J678K197L384
60670C60207M043L816L546L791L983L431K325J251M37n0J8N82J135J429J798K387
60654C94129K763K801L136M052M655M139L193L058L559L314J883M09j49l70j396
$$ plain form
60762 447422 442847 439234 436353 433362 429382 424490 420025 417346 416322 415576 414193 412428 410609 408288
60748 408288 405114 401963 400382 400988 402947 404919 406087 406322 405862 405004 403885 402468 400800 399176 397874
60733 397874 396815 395739 394665 393934 393784 394132 394775 395528 396100 396144 395643 394983 394378 393365 391294 388255 385100
60716 385100 382392 379721 376364 372308 368188 364400 360735 356906 353025 349498 346732 344980 343996 342779
60702 342779 340176 336128 332009 329409 328746 329223 329804 329832 329008 327403 325571 324280 323903 324224 324871 325816 327318
60685 327318 329411 331553 332969 333506 333986 335442 338079 341308 344610 347848 350764 352948 354626 356823 360207
60670 360207 364250 368066 371612 375403 379386 382817 385142 386393 386830 386780 386798 387380 388515 389944 391742 394129
60654 394129 396892 399693 402829 406881 411536 415675 418868 421926 425485 428799 430682 431091 430942 430572 429176
60639D29176l273n024n925o124o101o023n737n102m170l096k016j078n53o89j377
60624C72888k089k308j949j288o10j05J03k9l47n38l19K96Q42O51m24j609j879
60607C61286j097r3M34O03P62Q07N23J79K32O09Q19P05O11P33Q36P80R77J914
60589C71620L270L919L041J150l23n02J02M38J59k62l77j66K74Q57J368J629J887
60572C88084K565L617M622N452O342P267P914Q360R092J0146J0886J0895J0375
60559D85617R429P642M841J648j185l499n351o504o816o573o027m955l233j271
60545D63763M95K130L720M958N751O652Q057R514J0458J1113J1962J2736J2756
60532E64065J1909J0503Q498N694K471m44k783m655n899o274o066n819n550m948
$$ plain form
60639 429176 425903 420879 414954 408830 402729 396706 390969 385867 381697 378601 376585 375507 374954 374265 372888
60624 372888 370799 368491 366542 365254 364644 364539 364642 364613 364266 363728 363409 363705 364547 365198 364774 363165 361286
60607 361286 360189 360096 360530 361133 361895 362702 363225 363404 363636 364245 365064 365769 366380 367113 367949 368729 369706 371620
60589 371620 374890 378809 381850 383000 382677 382175 382277 382715 382874 382612 382235 382069 382343 383200 384568 386197 388084
60572 388084 390649 394266 398888 404340 410682 417949 425863 434223 443315 453461 464347 475242 485617
60559 485617 495046 502688 507529 509177 507992 504493 499142 492638 485822 479249 473222 468267 465034 463763
60545 463763 464258 466388 470108 475066 480817 487469 495526 505040 515498 526611 538573 551309 564065
60532 564065 575974 586477 594975 600669 603140 602696 599913 595258 589359 583085 577019 571200 565650 560702
60518E60702m132l448k756j654l00P73J469J985K067J339K86l0P24K024L618N784
60502E68451Q360J0628J2516J4979J8630K2871K6805L0359L3835L6963L9060L9910
60490H63367L9865L9198L7550L4012K7798J9089R198n53r973j9516k8839l6602
60478I74594m1834m4694m5704m5018m2878l9983l6849l3333k9332k5468k2430
60467E67071k0058j7667j5058j2628j0637q920p348o108n458n397n626n792n758
60454D40616n678n664n489m835l800k855k305k118k224k568k816k504j633o29
60440C95498K85J180J796J511L05q95j285j120j084j179r13l03N4r3k66P8Q00
60423C94369J268J045L48j73r6L65P08Q13R98J387J635J484J232J286J534J508
$$ plain form
60518 560702 556570 553122 550366 548712 548412 549185 550654 552639 554706 556045 556331 556301 557025 559049 562667 568451
60502 568451 576811 587439 599955 614934 633564 656435 683240 713599 747434 784397 823457 863367
60490 863367 903232 942430 979980 1013992 1041790 1060879 1070077 1069524 1059551 1040035 1011196 974594
60478 974594 932760 888066 842362 797344 754466 714483 677634 644301 614969 589501 567071
60467 567071 547013 529346 514288 501660 491023 482103 474755 468647 463189 457792 452166 446374 440616
60454 440616 434938 429274 423785 418950 415150 412295 409990 407872 405648 403080 400264 397760 396127 395498
60440 395498 395783 396963 398759 400270 400575 399680 398395 397275 396191 395012 394099 393796 393850 393757 393491 393569 394369
60423 394369 395637 396682 397030 396857 396761 397126 397834 398647 399645 401032 402667 404151 405383 406669 408203 409711
60407D09711J069O15O20J160J826J994J284k4j086j189l31Q83J777K018J754J489
60391D23570J689K331K895K923K507K111K089K370K552K260J579J077J223J779
60377D52955K033J694J196J045J150J130R79J062J479J739J266J29r29j229q03
60362D64896j41N20J283J977K064J466R73J253J899K086J881K063K809L501L877
60347D92407M427N364O105O188N970N818N264L747J667Or28j696k776m022n041
60332E22500n653n935o033o003n672m815l621k724k545k762k797k560k411k486
60318D66483k464j997j118j87M20O37Q09J408K582M040N399O414P048P625Q887
60303E05986J1331J4317J6395J6872J6497J6201J5670J3878J0603O602K373k366
$$ plain form
60407 409711 410780 411395 412015 413175 415001 416995 418279 418255 417169 415980 415649 416532 418309 420327 422081 423570
60391 423570 425259 427590 430485 433408 435915 438026 440115 442485 445037 447297 448876 449953 451176 452955
60377 452955 454988 456682 457878 458923 460073 461203 462182 463244 464723 466462 467728 467857 466928 465699 464896
60362 464896 464755 465275 466558 468535 470599 472065 473038 474291 476190 478276 480157 482220 485029 488530 492407
60347 492407 496834 502198 508303 514491 520461 526279 531543 535290 536957 536963 536035 534339 531563 527541 522500
60332 522500 516847 510912 504879 498876 493204 488389 484768 482044 479499 476737 473940 471380 468969 466483
60318 466483 464019 462022 460904 460717 461137 461774 462583 463991 466573 470613 476012 482426 489474 497099 505986
60303 505986 517317 531634 548029 564901 581398 597599 613269 627147 637750 644352 646725 644359
60291F44359p611j2257j4854j5112j4191j3475j3259j2790j1461r623q093p116
60279E04517o232n121m078l543l599m094m848n520n676n283m809m487l925k797
60265D40505j524p71n72n37n99r36j331j286q01l72j75J79Q28J264J017L83M6
60248D35318K80Q14J287J515J404R60M26J33J70L01K90K34L71O73P84N38L03N90
60230D46391J379K162K595K818L041L201L224L288L483L551L329L191L607M371
60216D89631M718M300L646L520M079M873N483N919O379O813O928O657O413O591
60202E65950O942O745N697M293L210K647K452K545K771K645J759M20n44p93r24
60187F05815j731l168m348m567m159m113m813n474n146m051l411l890m798n081
$$ plain form
60291 644359 636748 624491 609637 594525 580334 566859 553600 540810 529349 519726 511633 504517
60279 504517 498285 493164 489086 485543 481944 477850 473002 467482 461806 456523 451714 447227 443302 440505
60265 440505 438981 438210 437638 437101 436502 435566 434235 432949 432148 431776 431601 431780 432608 433872 434889 435272 435318
60248 435318 435598 436412 437699 439214 440618 441578 442004 442137 442307 442608 442898 443132 443503 444176 444960 445498 445801 446391
60230 446391 447770 449932 452527 455345 458386 461587 464811 468099 471582 475133 478462 481653 485260 489631
60216 489631 494349 498649 502295 505815 509894 514767 520250 526169 532548 539361 546289 552946 559359 565950
60202 565950 572892 579637 585334 589627 592837 595484 597936 600481 603252 605897 607656 608076 607532 606739 605815
60187 605815 604084 600916 596568 592001 587842 583729 578916 573442 568296 564245 560834 556944 552146 547065
60173E47065m579l829l099k193j110k35J77K11j00r30k200l293l528k800j647
60158E17910p24l16k39j11K72Q06J259J571J827K093K293K299K161K172K659L556
60142E39488M265M240L651L241L457L997M303M235M073M076M213M214L841L168
60128E94462K624K487K466K118J594J418J544J365P73M41O72Q36M61J49N13R56
60112F14879N34m56q97o25n20r13j212j304j946l234l962l425k762l409m840n207
60096E80701l948k442j960k111j793q10J66P37J189J817K475K805K697K334J989
60081E83846J783J651J483J281J084P44n5j377k903m319n651o952p861p890p211
60066E47653o665o792p161o922n773m135k640j767j798k671l746m094l217j467
$$ plain form
60173 547065 542486 538657 535558 533365 532255 532020 532197 532408 532308 531378 529178 525885 522357 519557 517910
60158 517910 517186 516870 516631 516520 516792 517598 518857 520428 522255 524348 526641 528940 531101 533273 535932 539488
60142 539488 543753 547993 551644 554885 558342 562339 566642 570877 574950 579026 583239 587453 591294 594462
60128 594462 597086 599573 602039 604157 605751 607169 608713 610078 610851 611292 611964 612800 613261 613410 613923 614879
60112 614879 615413 614957 614060 613435 612915 612002 610790 609486 607540 604306 600344 596919 594157 590748 585908 580701
60096 580701 576753 574311 572351 570240 568447 567637 567803 568540 569729 571546 574021 576826 579523 581857 583846
60081 583846 585629 587280 588763 590044 591128 591872 591817 590440 587537 583218 577567 570615 562754 554864 547653
60066 547653 540988 534196 527035 520113 514340 510205 507565 505798 504000 501329 497583 493489 490272 488805
60052D88805K86J345J700J913K434L024L132K786K680L180L758L881L911M492
60038E27327N370N678N199M553M041L181J563m76k324l683m488m847n226o107
60024E29761p243p822p640p421p752q283q414q087p517o665n557m584l985l378
60010D35413k338j090j76K30L64N30R66J613J878J158j19p12j96M99N97O08J182
59993D40407J821J720J209J233J906K700L575M750N642N339L988K615J641O84
59979D79230k74p31p47j034j717k113j962j888k268k637k575k332k107j599o77
59964D54569K26Q04J324J922K269K240K270K543K598K221J943K084K039J244K47
59949D80543M6O84J266J119L00q08j791k239k010j519j368j712k240k593k578
$$ plain form
60052 488805 489091 490436 492136 494049 496483 499507 502639 505425 508105 511285 515043 518924 522835 527327
60038 527327 532697 538375 543574 548127 552168 555349 556912 556436 554112 550429 545941 541094 535868 529761
60024 529761 522518 514696 507056 499635 491883 483600 475186 467099 459582 452917 447360 442776 438791 435413
60010 435413 433075 431985 431809 432039 432403 432933 433899 435512 437390 438548 438429 437717 437521 438020 438617 439225 440407
59993 440407 442228 443948 445157 446390 448296 450996 454571 459321 464963 470302 474290 476905 478546 479230
59979 479230 478956 478225 477478 476444 474727 472614 470652 468764 466496 463859 461284 458952 456845 455246 454569
59964 454569 454795 455599 456923 458845 461114 463354 465624 468167 470765 472986 474929 477013 479052 480296 480543
59949 480543 480589 481273 482539 483658 483958 483150 481359 479120 477110 475591 474223 472511 470271 467678 465100
59934D65100k169j589j219j188j251j220j213j313j289r29l55K71J055K044K945
59919D57680L434L489L241K826K631L161M224M824M372L678L978N285O411O515
59905E15749N873N091M348L603K863J924M60j298k505k744k648k910l095k275
59891E22436o26N18M60J26P37K157L278L650L832M246M544M389M059L924L831
59876E61561L480K939K359J566M23o96j297j443j611k078k724l317l580l289k646
59861E49647k299k574k948k736k024j367q50r8R40J855K461L044L967N348O971
59846E59337Q209Q374P649P167P492P497N689K328p85k428k778k320j169K37R79
59831F05478O06n97k419m870p272q385p910o885o175n559m816m538n068n564n142
$$ plain form
59934 465100 462931 461342 460123 458935 457684 456464 455251 453938 452649 451720 451365 451636 452691 454735 457680
59919 457680 461114 464603 467844 470670 473301 476462 480686 485510 489882 493560 497538 502823 509234 515749
59905 515749 521622 526713 531061 534664 537527 539451 539911 538613 536108 533364 530716 527806 524711 522436
59891 522436 521810 522328 522788 522914 523651 525808 529086 532736 536568 540814 545358 549747 553806 557730 561561
59876 561561 565041 567980 570339 571905 572328 571632 570335 568892 567281 565203 562479 559162 555582 552293 549647
59861 549647 547348 544774 541826 539090 537066 535699 534849 534751 535691 537546 540007 543051 547018 552366 559337
59846 559337 567546 575920 583569 590736 598228 605725 611414 613742 612957 610529 607751 605431 604262 604499 605478
59831 605478 606084 605487 603068 598198 590926 582541 574631 567746 561571 556012 551196 546658 541590 536026 530884
59816E30884m136l354k703j646m37J51O4o2Pr8m53o30m03j13j61n84j164j657
59798E13505k003k439l268m337n057n145m917m651m174l404k717k319j859j191
59784D66024r41j592k516k674j984j252r26p49m87l06l75n90p27n60R0J062J855
59767D53352K226K465K744K657J958J297J467K257K793K788K681K704K662K622
59753D86673L025L965M964N610N918N948N584M850M085L676L781M220M395L622
59739E50316J965M89J46O38R17O14K99M68R45J343J518J500J446J676K236K551
59723E69067K084J211P68Q27P06K53J96R18J732J863J538J448J612J403N76k83
59707E85919l94M03J523K245K418K459K618K556J974J366J498K229K548K011J402
$$ plain form
59816 530884 526748 523394 520691 519045 518608 518759 518823 518761 518768 518670 518217 517587 517184 517071 516910 516326 515162 513505
59798 513505 511502 509063 505795 501458 496401 491256 486339 481688 477514 474110 471393 469074 467215 466024
59784 466024 465083 463491 460975 458301 456317 455065 454139 453390 452903 452597 452222 451632 450905 450345 450435 451497 453352
59767 453352 455578 458043 460787 463444 465402 466699 468166 470423 473216 476004 478685 481389 484051 486673
59753 486673 489698 493663 498627 504237 510155 516103 521687 526537 530622 534298 538079 542299 546694 550316
59739 550316 552281 552770 552916 553554 554471 555085 555384 555852 556797 558140 559658 561158 562604 564280 566516 569067
59723 569067 571151 572362 573130 573957 574663 574916 575112 576030 577762 579625 581163 582611 584223 585626 586202 585919
59707 585919 585525 585928 587451 589696 592114 594573 597191 599747 601721 603087 604585 606814 609362 611373 612775
59692F12775J584K245K365J596N53j61o25j214j974k603k846k660k114j385q71
59677F04665j031j928l091m032m785n627o336o295n443m620m607n171n428m916
59663E41355l855k620j459n96j29J38M43O89O99P23J192K009K555K534K375K554
59647E48607K866K599J343n32k203l117l449l801m457n080n166m578l552k444
59633E17036j598j189j021p16k59p5l98r50j445j932k385k470k158k030k401k726
59617D93283k461k027k135k580k633k272k022j768q42O93J966K620L196L820L649
59602D90487K162J58j220j784k003k025j726j358j329j481j240m07N86J217J213
59587D81250N54n14j461j833j669j347j031o57l80o98j794l064l591l139k380
$$ plain form
59692 612775 614359 616604 618969 620565 621118 620957 620332 619118 617144 614541 611695 609035 606921 605536 604665
59677 604665 603634 601706 598615 594583 589798 584171 577835 571540 566097 561477 556870 551699 546271 541355
59663 541355 537500 534880 533421 532825 532696 532834 533277 533966 534665 535388 536580 538589 541144 543678 546053 548607
59647 548607 551473 554072 555415 554883 552680 549563 546114 542313 537856 532776 527610 523032 519480 517036
59633 517036 515438 514249 513228 512512 512253 512178 511780 510830 509385 507453 505068 502598 500440 498410 496009 493283
59617 493283 490822 488795 486660 484080 481447 479175 477153 475385 474543 475236 477202 479822 483018 486838 490487
59602 490487 492649 492807 491587 489803 487800 485775 484049 482691 481362 479881 478641 478234 478820 480037 481250
59587 481250 481804 481290 479829 477996 476327 474980 473949 473292 472912 472214 470420 467356 463765 460626 458246
59572D58246k041k121k165k030j943j842j287j74Q96J296J095P94O40N63N24M95
59556D50946L44P6OL46Q60J193J379J704K244K907L624M273M645M856N369O371
59540D91143P540Q712J0146J1691J2547J2571J2932J4250J4791J2061O044m69
59528F13959m813o445o054m265j802L22J642K523L118K874J625K87k55m47j446
59513F00823l597o086p865q533q503q554r013r344q875p836p063o753o320n521
59499D96960m811m331l543k241r92j68N50J156Q88l92j332o73J000K106K175J995
59483D88347K110K279K379K755L534M370N015N570O081O447O649O715O424N588
59469E54263M480L515K648J610O00J31K02L16L42P94K015L651N195O598Q053R425
$$ plain form
59572 458246 456205 454084 451919 449889 447946 446104 444817 444643 445539 446835 447930 448724 449364 449927 450451 450946
59556 450946 451290 451366 451372 451718 452578 453771 455150 456854 459098 462005 465629 469902 474547 479403 484772 491143
59540 491143 498683 507395 517541 529232 541779 554350 567282 581532 596323 608384 614428 613959
59528 613959 609146 602701 596647 592382 590580 590902 592544 595067 598185 601059 602684 602971 602716 602269 600823
59513 600823 597226 591140 583275 574742 566239 557685 548672 539328 530453 522617 515554 508801 502481 496960
59499 496960 492149 487818 484275 482034 481042 480874 481424 482580 483468 483076 481744 481071 482071 484177 486352 488347
59483 488347 490457 492736 495115 497870 501404 505774 510789 516359 522440 528887 535536 542251 548675 554263
59469 554263 558743 562258 564906 566516 567116 567247 567449 567765 568107 568901 570916 574567 579762 586360 594413 603838
59453F03838J0303J0490J0218R893R730R661R445Q831P642N823L516R71j708m617
59439F94036p649j0220j1707j2111j1979j1637j0936r703q055o240m565l491l275
59426E82468l412l022j830k39J616M075P018R645J1587J3464J5744J7912J9416
59413F74442K0598K1731K1937K0243J7187J3997J0387M698l430j1757j7396j9154
59401G53483j7554j3621q584m010j018N97J577J470j419p840j5916k2281k4868
59388F40016k4156k1823j8895j5527j2039r218p490o397n179l621k071r01j23
59375E12576N56J421K421L148L356L398L798M472M812M633M449M643M963N108
59361E63754N279N735O271O629P053P951R226J0419J1351J2209J3193J4389J5836
$$ plain form
59453 603838 614141 624631 634849 644742 654472 664133 673578 682409 690051 695874 699390 700361 698653 694036
59439 694036 686387 676167 664460 652349 640370 628733 617797 608094 600039 593799 589234 585743 582468
59426 582468 579056 576034 574204 573965 575581 579656 586674 596319 607906 621370 637114 655026 674442
59413 674442 695040 716771 738708 758951 776138 790135 800522 805220 801790 790033 772637 753483
59401 753483 735929 722308 713724 709714 708696 709293 710870 712340 710921 703081 687165 664884 640016
59388 640016 615860 594037 575142 559615 547576 538358 530868 524471 519292 515671 513600 512699 512576
59375 512576 513132 514553 516974 520122 523478 526876 530674 535146 539958 544591 549040 553683 558646 563754
59361 563754 569033 574768 581039 587668 594721 602672 611898 622317 633668 645877 659070 673459 689295
59348F89295J7360J8559J9195J9409J9286J8583J7214J5642J4284J2833J0677
59337H72337P848M923K167p43m103p756j1287j4295j6413j7410j7435j7018j6726
59324G64089j6774j6882j6495j5339j3761j2295j0944r364p710o608o150n584
59312F26183m420l114k240j603q13j12J23K89J145K803M811O946R182J1138J2352
59297F62670J2975J3406J3368J2054R137M929k15n821j0667j3295j3491j2477
59285F72573j1352r986p768m877k286p96l95l77O0J175K602L957N335O896Q346
59270F63107R316R971J0590J0795J0008Q543P350O567N267K826l02l429o431r153
59256G25025j0959j1519j1520j1842j2407j2425j1476r812p859n951m382l244
$$ plain form
59348 689295 706655 725214 744409 763818 783104 801687 818901 834543 848827 861660 872337
59337 872337 880185 885108 887275 886532 882429 874673 863386 849091 832678 815268 797833 780815 764089
59324 764089 747315 730433 713938 698599 684838 672543 661599 652235 644525 637917 631767 626183
59312 626183 621763 618649 616409 614806 613993 613881 614004 614293 615438 618241 623052 629998 639180 650318 662670
59297 662670 675645 689051 702419 714473 723610 728539 728324 722503 711836 698541 685050 672573
59285 672573 661221 651235 643467 638590 636304 635508 635113 634736 634796 635971 638573 642530 647865 654761 663107
59270 663107 672423 682394 692984 703779 713787 722330 729680 736247 741514 744340 744038 740609 734178 725025
59256 725025 714066 702547 691027 679185 666778 654353 642877 633065 625206 619255 614873 611629
59244F11629k297j359n92j12M26J324K218K572K645L298M748O098O337N362L751
59229F46048J991K94j102k020k750l939n884q059r552r879r305q420p606o847
59215E72970n957m833l569k366j410q40p54j025j124m34J048K529L275L439L649
59200E64598L967L860L224K752L018L685M024L759L074K176J353J071J551K319
59186F04431K690K530K217K070K146K475K937L114K694J989J616J722J911J892
59172F36434J802J858K182K933M211N745P022P804Q233Q396Q147P430O439N384
59158G14020M282L094J816L94j251l071m919o673q147q974q899q221p653p584
59144F58214p628p050n605l935l064l419m403n080n174n066m854m125k859j901
$$ plain form
59244 611629 609332 607973 607381 607269 607695 609019 611237 613809 616454 619752 624500 630598 636935 642297 646048
59229 646048 648039 648333 647231 645211 642461 638522 632638 624579 615027 605148 595843 587423 579817 572970
59215 572970 567013 562180 558611 556245 554835 553995 553241 552216 551092 550658 551706 554235 557510 560949 564598
59200 564598 568565 572425 575649 578401 581419 585104 589128 592887 595961 598137 599490 600561 602112 604431
59186 604431 607121 609651 611868 613938 616084 618559 621496 624610 627304 629293 630909 632631 634542 636434
59172 636434 638236 640094 642276 645209 649420 655165 662187 669991 678224 686620 694767 702197 708636 714020
59158 714020 718302 721396 723212 723606 722355 719284 714365 707692 699545 690571 681672 673451 665798 658214
59144 658214 650586 643536 637931 633996 630932 627513 623110 618030 612856 607790 602936 598811 595952 594051
59130E94051j958k542k557j654l95O91J466J799J605J371J888L299M847N879O566
59115F14356P412Q455R278R560R349R008Q977R397R816R515Q259O567N144M197
59101G29290L440K630J904J547J505J195K5j878l584m251l886l150k557k140j786
59086G18304j571j718k362l404m515n387o045o767p649q421q816q895q914q986
59072F34854r013q732p846o395m996m379m520m678m318l615k963k563k603l193
59058E65040l856l769k922k294k460k688k084r81m11o41j026j002n58Q5O31P54
59042E41818M75K49L05L22O8j46j25k14m87k17R98K318K777K750L277M402N341
59025E63911N901O634P736Q870R950J1126J2055J2083J1127R676Q108O654N574
$$ plain form
59130 594051 592093 589551 586994 585340 584945 585636 587102 588901 590506 591877 593765 597064 601911 607790 614356
59115 614356 621768 630223 639501 649061 658410 667418 676395 685792 695608 705123 713382 719949 725093 729290
59101 729290 732730 735360 737264 738811 740316 741511 741536 739658 736074 731823 727937 724787 722230 720090 718304
59086 718304 716733 715015 712653 709249 704734 699347 693302 686535 678886 670465 661649 652754 643840 634854
59072 634854 625841 617109 609263 602868 597872 593493 588973 584295 579977 576362 573399 570836 568233 565040
59058 565040 561184 557415 554493 552199 549739 547051 544967 543986 543575 542934 541908 540906 540348 540433 541064 541818
59042 541818 542293 542542 542847 543169 543237 543091 542966 542752 542265 542048 543046 545364 548141 550891 554168 558570 563911
59025 563911 569812 576446 584182 593052 603002 614128 626183 638266 649393 659069 667177 673831 679405
59012F79405M613K861J24k180k626j703q98m56L79J466J926K011K897M529N529
58997F97877N511N583O093N759L885J805J019J187R45k63k025l739m812m924m637
58982G09264m845n331m945l523k271j709p67J269L365M429N106O601Q736J0489
58968G25868J1624J2503J3013J2848J2391J2144J1793J0807R491Q386P155N099
58956H53122K413j56k586n446q599j1068j2310j2832j3471j4519j5624j6143j5646
58943G27135j4307j2644j0856q848o955n850n516n117m321l837m072m176l278
58930F37358j902j227j495k010k267k239j916j406j126j251j258o24L46R93J152
58915F21128J049Q69R11J578K585K901K226J806K891N017O768P742Q626R779J0854
$$ plain form
59012 679405 684018 686879 687003 684823 682197 680494 679596 679140 679519 680985 682911 684922 687819 692348 697877
58997 697877 703388 708971 715064 720823 724708 726513 727532 728719 729664 729401 727376 723637 718825 713901 709264
58982 709264 704419 699088 694143 690620 688349 686640 685873 687142 690507 694936 700042 706643 715379 725868
58968 725868 737492 749995 763008 775856 788247 800391 812184 822991 832482 840868 848023 853122
58956 853122 855535 855379 852793 847347 838748 827680 815370 802538 789067 774548 758924 742781 727135
58943 727135 712828 700184 689328 680480 673525 667675 662159 657042 652721 648884 644812 640636 637358
58930 637358 635456 634229 632734 630724 628457 626218 624302 622896 621770 620519 619261 618637 618983 619976 621128
58915 621128 622177 623046 623957 625535 628120 631021 633247 635053 637944 642961 649729 657471 666097 675876 686730
58900F86730J1636J2277J2779J3029J3251J3688J4023J3847J3422J3308J3497
58889H31487J3783J4564J6388J8735K0254K0271J9232J7668J5468J2411Q720M873
58877A013854J148k417n897r273j2260j4502j6072j7337j8225j8158j7095j5982
58865H67784j5617j5596j4988j3553j1756j0069q880q567r029r542r660r748j0063
58852G20716j0065r350q552q377q364p635o402n625n565n680n773o115o584o694
58838F19935o349n832n108m052l120k947l363l636l564l448l180k295q98L26J044
58823E73513J512J902K147K414L014L826M421M685M777M655M243L778L460K994
58809F21341K171J466J351J435J093N62M30L73n01k239l958n064n680n945n847
$$ plain form
58900 686730 698366 710643 723422 736451 749702 763390 777413 791260 804682 817990 831487
58889 831487 845270 859834 876222 894957 915211 935482 954714 972382 987850 1000261 1008981 1013854
58877 1013854 1015002 1012585 1006688 997415 985155 970653 954581 937244 919019 900861 883766 867784
58865 867784 852167 836571 821583 808030 796274 786205 777325 768758 759729 750187 740527 730779 720716
58852 720716 710651 701301 692749 684372 676008 668373 661971 656346 650781 645101 639328 633213 626629 619935
58838 619935 613586 607754 602646 598594 595474 592527 589164 585528 581964 578516 575336 573041 572143 572469 573513
58823 573513 575025 576927 579074 581488 584502 588328 592749 597434 602211 606866 611109 614887 618347 621341
58809 621341 623512 624978 626329 627764 628857 629419 629849 630222 629721 627482 623524 618460 612780 606835 600988
58794F00988n607n456n104m308l587l459l305k134l01Q23Q27O69J047J567J828
58779E74488K193L004L939M479M403L610K228R40L98K05o88k543m579o197p463
58764E78417q268q076o894n573m773m278l642k811j819n32R21K013K331J949J249
58749E40214Q29J352K862M339M714M195L914M352M968N264N315N282N250N514
58735E98364O193O612O081N165N064N779O066N338M335L690L070K224J655J638
58721F61274J595J090O45Q88J600K229K723L282L774L927L736L270K495J492M58
58706F94478o66k069l517m485n070o074p970j0290j2251j3503j4086j4147j3850
58693E86500j3212j2040j0432r037q289p611o228m460l416l484m054m596n029
$$ plain form
58794 600988 595381 589925 584821 580513 576926 573467 570162 568028 567727 568550 569377 570046 571093 572660 574488
58779 574488 576681 579685 583624 588103 592506 596116 598344 599284 599682 599887 599199 596656 592077 585880 578417
58764 578417 570149 562073 555179 549606 544833 540555 536913 534102 532283 531751 532672 534685 537016 538965 540214
58749 540214 541043 542395 545257 549596 554310 558505 562419 566771 571739 577003 582318 587600 592850 598364
58735 598364 604557 611169 617250 622415 627479 633258 639324 644662 648997 652687 655757 657981 659636 661274
58721 661274 662869 663959 664604 665492 667092 669321 672044 675326 679100 683027 686763 690033 692528 694020 694478
58706 694478 693812 691743 688226 683741 678671 672597 664627 654337 642086 628583 614497 600350 586500
58693 586500 573288 561248 550816 541779 533490 525879 519651 515191 511775 508291 504237 499641 494612
58680D94612n100m433l318k466j921j124r4N79Q86J501K564L462M024M782N878
58665D99832O764P318Q079R085R530Q930P630N835L264J78k368l808m610n161
58651E50498n134m449l803l692l785l787l948m254m072l148k114j431p90J5N46
58636E06652O23Q70J698K593K938K843K579K005J127M55L15M67O57Q71Q18K21
58620E27732j82R05L424N677O499O549O867P351P455P246O859N951M507L292K660
58605F02792J868M42q39j222j306j978k910l240l088l176l464l302k618j886j229
58590E74844l73O91J781L016M588O265P710Q957J0119J0926J1050J0576R731Q605
58576F68486P441O719O532O362N884N542N961P178Q767J0328J1717J3151J5088
$$ plain form
58680 494612 489512 485079 481761 479295 477374 476250 476156 476735 477621 479122 481686 485148 489172 493954 499832
58665 499832 506596 513914 521993 531078 540608 549538 557168 563003 566267 566445 564077 560269 555659 550498
58651 550498 545364 540915 537112 533420 529635 525848 521900 517646 513574 510426 508312 506881 506091 506106 506652
58636 506652 507275 508145 509843 512436 515374 518217 520796 522801 523928 524383 524698 525165 525822 526693 527511 527732
58620 527732 527550 528455 531879 537556 544055 550604 557471 564822 572277 579523 586382 592333 596840 600132 602792
58605 602792 604660 605102 604263 603041 601735 599757 596847 593607 590519 587343 583879 580577 577959 576073 574844
58590 574844 574471 575162 576943 579959 584547 590812 598522 607479 617598 628524 639574 650150 659881 668486
58576 668486 675927 682646 689178 695540 701424 706966 712927 720105 728872 739200 750917 764068 779156
58563G79156J7501J9524K0573K1393K2892K4150K3219J9897J6082J3035R993O112
58551I93527K140q37k870m382n151n168n345o319p502q228q957j0488j2804j5492
58537I02124j8327k0760k1815k1313k0197j9052j7402j5175j3278j1885r686o117
58525G07117k885j765k042j739m19Q28J391J627J830K001K246K394J807M52o17
58510G12226p54q02j649k703k928k460j976j460p48m82j124j879j901j675k025
58495F87660k511k256j486q89k76Q02J892K518L270M596N523N216M904O316Q983
58480G24262J1067J2316J3984J6093J6979J5774J3533J1428R341O662L302m52
58468H54289m153p115q899r816j0298j0086q775o753m699k633l51J781L473N332
$$ plain form
58563 779156 796657 816181 836754 858147 881039 905189 928408 948305 964387 977422 987415 993527
58551 993527 995667 994830 991960 987578 982427 977259 971914 965595 958093 949865 940908 930420 917616 902124
58537 902124 883797 863037 841222 819909 799712 780660 763258 748083 734805 722920 713234 707117
58525 707117 704232 702467 700425 698686 698267 699095 700486 702113 703943 705944 708190 710584 712391 712843 712226
58510 712226 711472 710670 709021 706318 703390 700930 698954 697494 696746 696264 695140 693261 691360 689685 687660
58495 687660 685149 682893 681407 680518 680242 681044 682936 685454 688724 693320 698843 704059 708963 715279 724262
58480 724262 735329 747645 761629 777722 794701 810475 824008 835436 844777 851439 854741 854289
58468 854289 850136 843021 834122 824306 814008 803922 795147 788394 783695 781062 780711 782492 785965 791297
58454G91297P911J0460J1768J1750J1008R450O627L063j38k734n315p993j0170
58441H36984j1330j1261r941p970o473n749m734k674m13J015K031L537N270O521
58427G94813P611R111J0430J0652J0153R919R875R268Q069O616M652J968o52k508
58413H89977m130o079p587p893p831q446r077q641p761p681p887o940m931l186
58399G91907k100j189n50l29N05K754N068N553M697M448N055N132M435M089M229
58384H33704L852L018K982L954M697M578M217M100M117M441N308O148O370O517
58370H98003P228P849P681P726R170J1056J1682J1524J2360J4160J5228J4988
58358A028655J4281J3303J1605R724Q612P779O083L837K098P67m95n28J548L984
$$ plain form
58454 791297 799208 809668 821436 833186 844194 853644 860271 863334 863196 860462 855147 847154 836984
58441 836984 825654 814393 804452 796482 790009 784260 779526 776852 776439 777454 779485 783022 788292 794813
58427 794813 802424 811535 821965 832617 842770 852689 862564 871832 879901 886517 891169 893137 892485 889977
58413 889977 885847 879768 872181 864288 856457 848011 838934 830293 822532 814851 806964 800024 795093 791907
58399 791907 789807 788618 788068 787739 788244 790998 796066 801619 806316 810764 815819 820951 825386 829475 833704
58384 833704 837556 840574 843556 847510 852207 856785 861002 865102 869219 873660 878968 885116 891486 898003
58370 898003 905231 913080 920761 928487 937657 948713 960395 971919 984279 998439 1013667 1028655
58358 1028655 1042936 1056239 1067844 1077568 1086180 1093959 1100042 1103879 1105977 1106744 1106249 1105721 1107269 1111253
58344A111253M684M694O327Q917R943R584J0279J2206J3157J2879J3674J6155
58332A233752J8156J8442J8144J7925J6915J5165J4028J3473J1897R104O704N288
58320A398993M111L608M964P113P565O499O572Q400R878J0411J1862J4525J6020
58307A510521J5411J4849J5837J7147J7729J8484J9918K0939K1094K1280K1464
58296A714673K0590J9261J9436K0982K1718K1336K1861K3777K5276K5917K7294
58285A962121K9559L0918L1212L2217L3958L4690L4909L7063M0739M2732M2593
58274B352711M3451M6391M8974N0365N2868N6963N9892O0865O2684O6382O9197
58263B970743O9774P0551P2939P4894P5240P5749P7082P7427P6911P8330Q1855
$$ plain form
58344 1111253 1115937 1120631 1126958 1135875 1145818 1155402 1165681 1177887 1191044 1203923 1217597 1233752
58332 1233752 1251908 1270350 1288494 1306419 1323334 1338499 1352527 1366000 1377897 1387001 1393705 1398993
58320 1398993 1403104 1406712 1411676 1418789 1426354 1432853 1439425 1447825 1457703 1468114 1479976 1494501 1510521
58307 1510521 1525932 1540781 1556618 1573765 1591494 1609978 1629896 1650835 1671929 1693209 1714673
58296 1714673 1735263 1754524 1773960 1794942 1816660 1837996 1859857 1883634 1908910 1934827 1962121
58285 1962121 1991680 2022598 2053810 2086027 2119985 2154675 2189584 2226647 2267386 2310118 2352711
58274 2352711 2396162 2442553 2491527 2541892 2594760 2651723 2711615 2772480 2835164 2901546 2970743
58263 2970743 3040517 3111068 3184007 3258901 3334141 3409890 3486972 3564399 3641310 3719640 3801495
58252C801495Q4223Q4836Q7170R2335R7042J00021J04449J11755J19074J25189
58242D807589J32799J42518J51033J57723J66472J78285J89035J97298K07259
58233F330011K20814K34318K46360K61012K79783K98390L15200L34810L59301
58224H879999L84590M09396M38920M75258N13500N51998N96654O50373P08551
58215A3609239P70131Q42076R27564J021709J124867J247676J396613J568237
58207B2508112J764629K000170K286072K624677L027612L522731M135265M881568
58199D6750836N789436O900980Q245336R834032J1690914J3852240J6327346J9095103
58191A38486223K2115694K5219002K7919315K9490006K9418569K7751013K4770170
$$ plain form
58252 3801495 3885718 3970554 4057724 4150059 4247101 4347122 4451571 4563326 4682400 4807589
58242 4807589 4940388 5082906 5233939 5391662 5558134 5736419 5925454 6122752 6330011
58233 6330011 6550825 6785143 7031503 7292515 7572298 7870688 8185888 8520698 8879999
58224 8879999 9264589 9673985 10112905 10588163 11101663 11653661 12250315 12900688 13609239
58215 13609239 14379370 15221446 16149010 17170719 18295586 19543262 20939875 22508112
58207 22508112 24272741 26272911 28558983 31183660 34211272 37734003 41869268 46750836
58199 46750836 52540272 59441252 67686588 77520620 89211534 103063774 119391120 138486223
58191 138486223 160601917 185820919 213740234 243230240 272648809 300399822 325169992
58184C25169992K0298220J3598857M264246o794787j7425387k5428000k9774680
58177B83908461l0869418k9891964k7959024k5691412k3263665k0683606j8015896
58170A07533476j5414284j3027020j0927529r130215p627137o391391n375407
58163C9640493m533476l838805l270615k800899k405745k075935j804836j577411
58155A7332771j381184j216262j083893r74769q78168p93475p23234o62890o06243
58146I012653n53918n08222m66042m24166l85562l53480l25067k96922k71265
58137E428009k50834k33308k16431k03001j95137j88978j80415j71063j63338
58128C625504j54865j43209j31323j22921j16635j09633j02847r7965r3368q7598
$$ plain form
58184 325169992 345468212 359067069 363331315 356536528 339111141 313683141 283908461
58177 283908461 253039043 223147079 195188055 169496643 146232978 125549372 107533476
58170 107533476 92119192 79092172 68164643 59034428 51407291 45015900 39640493
58163 39640493 35107017 31268212 27997597 25196698 22790953 20715018 18910182 17332771
58155 17332771 15951587 14735325 13651432 12676663 11798495 11005020 10281786 9618896 9012653
58146 9012653 8458735 7950513 7484471 7060305 6674743 6321263 5996196 5699274 5428009
58137 5428009 5177175 4943867 4727436 4524435 4329298 4140320 3959905 3788842 3625504
58128 3625504 3470639 3327430 3196107 3073186 2956551 2846918 2744071 2646106 2552738 2465140
58118B465140q2819q0469p7631p2008o6442o4057o2916n9953n6363n4426n2760
58107A735296m9366m5993m4787m3807m0420l6245l4152l3128l0627k7480k6070
58096A323221k5783k4593k3140k3103k3462k2176j9977j8878j8528j7512j6569
58085A089500j7148j8402j8736j8738j9620k0497k0174j9754k0547k1241k0161
58074H74482j8431j7923j7954j7013j5905j5955j5950j4155j1736j0891j1002
58063G07567j0006q225p536p812p375o173n575n810o246p271r276j0749j0100
58050F05413q339p509p455o765n717n562n872n422m757n162n906n351m045l898
58036E23653m816m998m240m202n491o948p799q308q388p695o912p015p458p059
$$ plain form
58118 2465140 2382321 2301852 2224221 2152213 2085771 2021714 1958798 1898845 1842482 1788056 1735296
58107 1735296 1685930 1639937 1595150 1551343 1510923 1474678 1440526 1407398 1376771 1349291 1323221
58096 1323221 1297438 1272845 1249705 1226602 1203140 1180964 1160987 1142109 1123581 1106069 1089500
58085 1089500 1072352 1053950 1035214 1016476 996856 976359 956185 936431 915884 894643 874482
58074 874482 856051 838128 820174 803161 787256 771301 755351 741196 729460 718569 707567
58063 707567 697561 689336 681800 673988 666613 660440 654865 649055 642809 635538 626262 615513 605413
58050 605413 597074 589565 582110 575345 569628 564066 558194 552772 548015 542853 536947 531596 527551 523653
58036 523653 518837 513839 509599 505397 499906 492958 485159 476851 468463 460768 453856 446841 439383 432324
58022D32324o214o295p098p029n658m176l353k824k389k433k944l449l755l734
58008C70973k897j321k88o75j568j705j375j386j281l32P06P81N15J047J736J148
57992C64078l00r08m41j58m93o85n39o10p77m01K42L23mm8j37j027k146k278j709
57973C51982j789k607k901k253j538j188o25L89J300J690J489N19r94j869j290
57958C40315j89J45Q9O77J363Q46l28k64J289K650K963L139L749M026L524L047
57942C67041L280L867M376M942N581N999O267O656O871O509O059O130O028M626
57928D44232K402R09L17p14k665m491n572o540p750q591q790q896r016q510p423
57913C68902o744o761o544n609m665m146l351j910p39p42j427j702j271o00j39
$$ plain form
58022 432324 426110 419815 412717 405688 400030 395854 392501 389677 387288 384855 381911 378462 374707 370973
58008 370973 368076 366755 366467 365792 364224 362519 361144 359758 358477 358145 358851 359632 360147 361194 362930 364078
57992 364078 363778 362870 362429 362271 361778 361093 360554 359944 359167 358766 359008 359331 359327 359279 359142 358115 355969 353691 351982
57973 351982 350193 347586 344685 342432 340894 339706 339081 339470 340770 342460 343949 344468 343474 341605 340315
57958 340315 340126 340271 340360 341037 342400 343246 342918 342654 343943 346593 349556 352695 356444 360470 363994 367041
57942 367041 370321 374188 378564 383506 389087 395086 401353 408009 414880 421389 427448 433578 439606 444232
57928 444232 446634 447543 447860 447146 444481 439990 434418 427878 420128 411537 402747 393851 384835 376325 368902
57913 368902 362158 355397 348853 343244 338579 334433 331082 329172 328433 327691 326264 324562 323291 322691 322552
57898C22552o7l07m51k11O7l1j7R34K541L592L562L028K442J674Q50M79M58O4
57880C41159q56j712k324l159m269n141n724o410o870o232m682l553l395l363
57866B83469k809k220j933j351j50Q60R75P08R03J610K478L473M429M811M547
57851B99800M378M770N141M839M074L313K478J411N61L85N74M65j05p96j307j485
57835C28496j300r74q33q03n20M0N10P92J130J516J693J868K558L618M155L802
57819C45748L283L417M102M629M438L336J602J1p47q67j187k232l961o202q525
57804C46845r878r419p733o258n518m865l993l418l343l207k728k260j832r43
57790B81450L08R87O74P3j10P7N74J603K823L322L063L211M356N533N781N558
$$ plain form
57898 322552 322485 322178 321727 321516 321583 321552 321535 322469 325010 328602 332164 335192 337634 339308 340158 340637 341095 341159
57880 341159 340303 338591 336267 333108 328839 323698 317974 311564 304694 298462 293780 290227 286832 283469
57866 283469 280660 278440 276507 275156 275006 275866 276841 277549 278452 280062 282540 286013 290442 295253 299800
57851 299800 304178 308948 314089 318928 323002 326315 328793 330204 330765 331150 331724 332189 332084 331288 329981 328496
57835 328496 327196 326222 325389 324586 324066 324106 324616 325408 326538 328054 329747 331615 334173 337791 341946 345748
57819 345748 349031 352448 356550 361179 365617 368953 370555 370566 369819 368952 367765 365533 361572 355370 346845
57804 346845 336967 327548 319815 313557 308039 303174 299181 295763 292420 289213 286485 284225 282393 281450
57790 281450 281758 282745 283419 283492 283382 283459 284033 285636 288459 291781 294844 298055 302411 307944 313725 319283
57774C19283N726O045N684M612L484K712K284K088J790R10m76j682k371k943l656
57759C43490m149m291m567n141n407n014m401l842k998k001j758k387k466r95
57745B94073R24J577R68M41N44O72M26P4j88m69p56r94j419k040k179j263J98
57728B90589J212J562J776K104K297K207J922J484R92P04N69P6q58j412r71k15
57712C04038k38j017j605j599j498j697j995k134k122j945j494q37k71m1j95n28
57696B84822n89q4N80O80K34OK37J97n74j450j671j346q17R8J429K492K871L298
57678B90413M603O523Q519J1086J4961J9591K3735K7341L1518L6746M2137M6495
57666E63668M9050M9145M6113L9489K8891J4001m396k3505l9548m9829n3551n1424
$$ plain form
57774 319283 325009 331054 336738 341350 344834 347546 349830 351918 353708 354618 354142 352460 350089 347146 343490
57759 343490 339341 335050 330483 325342 319935 314921 310520 306678 303680 301679 299921 297534 295068 294073
57745 294073 294997 296574 297542 297983 298527 299199 299625 299699 299511 299042 298286 297292 295873 293833 291654 290391 290589
57728 290589 291801 293363 295139 297243 299540 301747 303669 305153 306145 306849 307418 307494 306636 305224 304253 304038
57712 304038 303800 302783 301178 299579 298081 296384 294389 292255 290133 288188 286694 285857 285586 285545 285350 284822
57696 284822 284233 284149 284729 285409 285643 285649 285886 286083 285509 284059 282388 281042 280225 280323 281752 284244 287115 290413
57678 290413 295016 301539 310058 321144 336105 355696 379431 406772 438290 475036 517173 563668
57666 563668 612718 661863 707976 747465 776356 790357 785961 762456 722908 673079 619528 568104
57654E68104m5482l8646l3021k8525k3988j9250j5118j1788q742o071m466l855
57642C29152l343k665k379k439j936o11O45J237J639K237K526K185J847K100K508
57627C32703K316J520N60l89j277j835j939j842j726j407q17k34K18O79R98O85
57611C28213k81j255j831k188k317j754n14N14P58P09R89J320J160O35J27m71
57595C23814j299j862j673j166j137j589j854j680j411j256j118r93r29o20K18
57580C05445J125J173J10j290k131k265k135k173k426k594k328j638q86k81L61
57565B88067J118J574J379R26Q92J262J391J035P57J147K059K852L076K761K300
57550C12596K133K361K631K581K414K633L258L646L331K612K116K024K062K023
$$ plain form
57654 568104 522622 483976 450955 422430 398442 379192 364074 352286 343544 337473 333007 329152
57642 329152 325809 323144 320765 318326 316390 315779 316424 317661 319300 321537 324063 326248 328095 330195 332703
57627 332703 335019 336539 337099 336710 335433 333598 331659 329817 328091 326684 325867 325633 325851 326530 327528 328213
57611 328213 327932 326677 324846 322658 320341 318587 318073 318587 319345 320054 321043 322363 323523 324158 324285 323814
57595 323814 322515 320653 318980 317814 316677 315088 313234 311554 310143 308887 307769 306776 305847 305227 305445
57580 305445 306570 307743 307853 306563 304432 302167 300032 297859 295433 292839 290511 288873 287987 287706 288067
57565 288067 289185 290759 292138 293064 293956 295218 296609 297644 298401 299548 301607 304459 307535 310296 312596
57550 312596 314729 317090 319721 322302 324716 327349 330607 334253 337584 340196 342312 344336 346398 348421
57536C48421J941J824J569J243J158J498K002K177J815J245J042J508K400L135
57522C72978L289K970K641K647K855K900K657K431K653L456M553N407N606N199
57508D22242M710M570M561M016K707J297O55Q51J171J054O80N00N50N09L17L25
57492D50715P83J385J611J376J105J105J243J372J751K626L577L804L110K184
57478D77747J752J853K102K343K710L266L841M151L937L178K270J814K005K447
57464E15416K675K632K564K744L384M467N491N789N309M667M259L877L489L698
57450E70461M860O261O930O795O369N716M642L634L516M203M694M491M205M517
57436F41294N371O396P401Q010P614O225M868M586N270N975O089N841N792O225
$$ plain form
57536 348421 350362 352186 353755 354998 356156 357654 359656 361833 363648 364893 365935 367443 369843 372978
57522 372978 376267 379237 381878 384525 387380 390280 392937 395368 398021 401477 406030 411437 417043 422242
57508 422242 426952 431522 436083 440099 442806 444103 444758 445609 446780 447834 448514 449014 449564 450073 450390 450715
57492 450715 451498 452883 454494 455870 456975 458080 459323 460695 462446 465072 468649 472453 475563 477747
57478 477747 479499 481352 483454 485797 488507 491773 495614 499765 503702 506880 509150 510964 512969 515416
57464 515416 518091 520723 523287 526031 529415 533882 539373 545162 550471 555138 559397 563274 566763 570461
57450 570461 575321 581582 588512 595307 601676 607392 612034 615668 619184 623387 628081 632572 636777 641294
57436 641294 646665 653061 660462 668472 676086 682311 687179 691765 697035 703010 709099 714940 720732 726957
57422G26957O939P444P442P152P014P082P016O682O458O716P347P984Q423Q644
57408H29300Q579Q141P421O787O702P323Q200Q594Q273P767P636P785P900Q154
57394I38562Q871R771J0208J0079R804R588R410R683J0917J2653J3625J3294J2400
57381A078865J1754J1382J1186J1455J2114J2292J1464J0404J0216J0871J1495
57370A203498J1669J1677J1723J1709J1708J1979J2492J2887J2917J2634J2244
57359A337137J2095J2566J3672J4975J6084J6933J7372J7062J6216J5768J6205
57348A506085J6782J6615J6083J6242J7123J7641J7105J6004J5157J4905J5235
57337A684977J6004J6844J7385J7770J8440J9389K0136K0480K0670K0753K0451
$$ plain form
57422 726957 733896 741340 748782 755934 762948 770030 777046 783728 790186 796902 804249 812233 820656 829300
57408 829300 837879 846020 853441 860228 866930 874253 882453 891047 899320 907087 914723 922508 930408 938562
57394 938562 947433 957204 967412 977491 987295 996883 1006293 1015976 1026893 1039546 1053171 1066465 1078865
57381 1078865 1090619 1102001 1113187 1124642 1136756 1149048 1160512 1170916 1181132 1192003 1203498
57370 1203498 1215167 1226844 1238567 1250276 1261984 1273963 1286455 1299342 1312259 1324893 1337137
57359 1337137 1349232 1361798 1375470 1390445 1406529 1423462 1440834 1457896 1474112 1489880 1506085
57348 1506085 1522867 1539482 1555565 1571807 1588930 1606571 1623676 1639680 1654837 1669742 1684977
57337 1684977 1700981 1717825 1735210 1752980 1771420 1790809 1810945 1831425 1852095 1872848 1893299
57326A893299J9872J9655K0109K0744K1063K1260K1708K2271K2607K2808K3172
57315B128568K3571K3670K3641K4097K5195K6258K6511K5901K4988K4300K4070
57304B400770K4443K5417K6508K6883K6228K5243K4883K5212K5519K5487K5578
57293B682171K6088K6535K6516K6564K7396K8685K9400K9267K9069K9400K9869
57282B990960K9859K9471K9323K9766L0637L1545L2168L2417L2484L2560L2467
57271C333657L1857L0815L0001K9966L0617L1473L2124L2369L2187L1829L1734
57260C678629L2050L2438L2461L2086L1585L1224L1077L1039L0788L0003K8766
57249D022146K7671K7321K7794K8673K9475K9961L0207L0491L0990L1534L1814
$$ plain form
57326 1893299 1913171 1932826 1952935 1973679 1994742 2016002 2037710 2059981 2082588 2105396 2128568
57315 2128568 2152139 2175809 2199450 2223547 2248742 2275000 2301511 2327412 2352400 2376700 2400770
57304 2400770 2425213 2450630 2477138 2504021 2530249 2555492 2580375 2605587 2631106 2656593 2682171
57293 2682171 2708259 2734794 2761310 2787874 2815270 2843955 2873355 2902622 2931691 2961091 2990960
57282 2990960 3020819 3050290 3079613 3109379 3140016 3171561 3203729 3236146 3268630 3301190 3333657
57271 3333657 3365514 3396329 3426330 3456296 3486913 3518386 3550510 3582879 3615066 3646895 3678629
57260 3678629 3710679 3743117 3775578 3807664 3839249 3870473 3901550 3932589 3963377 3993380 4022146
57249 4022146 4049817 4077138 4104932 4133605 4163080 4193041 4223248 4253739 4284729 4316263 4348077
57238D348077L1900L2260L3133L4114L4659L4740L4688L4563L4087L3211L2299
57227D717731L1642L1075L0294K9325K8422K7584K6553K5247K3949K2946K2287
57216E017055K2135K2932K4746K6604K7268K6763K6489K7461K9101L0349L1276
57205E312179L2697L4538L5787L6149L6580L7723L8803L8808L7988L7300L6860
57194E715412L5973L4523L3265L2596L1869L0394K8432K6766K5632K4623K3484
57183F042969K2511K2150K2484K3210K4010K4853K5992K7733L0298L3903L8644
57172F338757M3977M8320M9722M7226M1481L3949K5731J7298R051J592m520r046
57160F643538j2063j3861j4803j5078j4598j3346j1656r913q022n596k742k22
$$ plain form
57238 4348077 4379977 4412237 4445370 4479484 4514143 4548883 4583571 4618134 4652221 4685432 4717731
57227 4717731 4749373 4780448 4810742 4840067 4868489 4896073 4922626 4947873 4971822 4994768 5017055
57216 5017055 5039190 5062122 5086868 5113472 5140740 5167503 5193992 5221453 5250554 5280903 5312179
57205 5312179 5344876 5379414 5415201 5451350 5487930 5525653 5564456 5603264 5641252 5678552 5715412
57194 5715412 5751385 5785908 5819173 5851769 5883638 5914032 5942464 5969230 5994862 6019485 6042969
57183 6042969 6065480 6087630 6110114 6133324 6157334 6182187 6208179 6235912 6266210 6300113 6338757
57172 6338757 6382734 6431054 6480776 6528002 6569483 6603432 6629163 6646461 6655512 6657104 6652584 6643538
57160 6643538 6631475 6617614 6602811 6587733 6573135 6559789 6548133 6538220 6530198 6524602 6521860 6521638
57148F521638J421K470L526M575M914L838J115l049q121j3402j8361k2877k6873
57135F450814k9823l0906k9646k6139k0689j3600n409K995J0619J6571K0081K0796
57123F365664J9239J6704J4462J3296J3953J7624K5500L7767N3327P0512Q8001
57112F736049J05234J22320J39832J58802J80790K07838K42213K86058L41209
57103H520345M09342M92420N93336P16194Q65755J046427J261671J513943J804512
57094A7223945K133229K499098K900975L336237L797357M269860M733878N166588
57086D6061167N542408N832417O004711O022124N835475N383368M614328L526572
57078H8822570K193961P49939o62670j938586l025098l908423m593098n089403
$$ plain form
57148 6521638 6523059 6525529 6529055 6533630 6538544 6542382 6543497 6540448 6532327 6518925 6500564 6477687 6450814
57135 6450814 6420991 6390085 6360439 6334300 6313611 6300011 6294602 6297597 6308216 6324787 6344868 6365664
57123 6365664 6384903 6401607 6416069 6429365 6443318 6460942 6486442 6524209 6577536 6648048 6736049
57112 6736049 6841283 6963603 7103435 7262237 7443027 7650865 7893078 8179136 8520345
57103 8520345 8929687 9422107 10015443 10731637 11597392 12643819 13905490 15419433 17223945
57094 17223945 19357174 21856272 24757247 28093484 31890841 36160701 40894579 46061167
57086 46061167 51603575 57435992 63440703 69462827 75298302 80681670 85295998 88822570
57078 88822570 91016531 91766470 91103800 89165214 86140116 82231693 77638595 72549192
57070G2549192n409654n568265n582268n470943n254743m954559m591837m188591
57062C1528332l766444l345067k940668k564726k223528j919329j652403j422012
57054A1694155j225796j059473r18079p97438o94381o06248n30796m66320m11363
57045D984261l64386l23935k88905k58422k31800k08724j89057j72057j56194
57036B790781j40244j24335j09410r5811q2879o9823n6360m2262k6968j0495N220
57025B037414J6919K2841K4475K4002J9690N725k1546n7530r1200j13192j21391
57014A746207j19253j11111r9977q7979p6648o6693n8325n1598m6047m0696l5202
57003I52678l0435k7137k4649k1905j9099j7202j6204j5111j3620j2534j2282
$$ plain form
57070 72549192 67139538 61571273 55989005 50518062 45263319 40308760 35716923 31528332
57062 31528332 27761888 24416821 21476153 18911427 16687899 14768570 13116167 11694155
57054 11694155 10468359 9408886 8490807 7693369 6998988 6392740 5861944 5395624 4984261
57045 4984261 4619875 4295940 4007035 3748613 3516813 3308089 3119032 2946975 2790781
57036 2790781 2650537 2526202 2416792 2320981 2238102 2168279 2111919 2069657 2042689 2032194 2037414
57025 2037414 2054333 2077174 2101649 2125651 2145341 2151066 2129520 2071990 1980790 1867598 1746207
57014 1746207 1626954 1515843 1415866 1327887 1251239 1184546 1126221 1074623 1028576 987880 952678
57003 952678 922243 895106 870457 848552 829453 812251 796047 780936 767316 754782 742500
56992G42500j2147j1401j0258r135p669n153j605K090M905O195N816M054J334
56979G09526k180o508j1320j5738j8795j9917j9058j6723j3988j1896j0593r309
56967E53501p410n086k792m61K249N219P956J0258J2306J4053J5016J4767J3165
56954F32741R955M735k251r630j5809k0193k3045k4303k3424k0480j6661j3150
56942D78485j0050o902l721q37J929N070Q554J1917J5056J8085K0470K1226K0132
56929E79414J7832J4432Q938P11r218j8777k6237l0577l1443k9599k6906k4815
56917D23755k3114k0800j7781j4961j2888j1279r835q638p661o605n435m524m075
56904B76159l853l565l127k453j405j47R20J594K072K684L687N216P054Q575R367
$$ plain form
56992 742500 730353 718952 708694 699559 691890 686737 685132 687222 692127 698322 704138 708192 709526
56979 709526 707346 700838 689518 673780 654985 635068 616010 599287 585299 573403 562810 553501
56967 553501 546091 541005 538213 537752 540001 545220 553176 563434 575740 589793 604809 619576 632741
56954 632741 642696 647431 645180 635550 619741 599548 576503 552200 528776 508296 491635 478485
56942 478485 468435 461533 457812 456975 458904 463974 472528 484445 499501 517586 538056 559282 579414
56929 579414 597246 611678 620616 621327 612109 593332 567095 536518 505075 475476 448570 423755
56917 423755 400641 379841 362060 347099 334211 322932 313097 304459 296798 290193 284758 280234 276159
56904 276159 272306 268741 265614 263161 261756 261609 262529 264123 266195 268879 272566 277782 284836 293411 302778
56889C02778R887J0960J2623J3956J4180J3365J1821R327N419L04m857q692j0506
56876C80565j0586r705q386o652m410j761J113M133P250J0372J3567J6993K0544
56863D13037K3824K6717K9451L1802L2718L1252K7354K1240J2530J127j1247k1480
56851F18325k7394k9074k7926k5153k1379j6870j1542n187J844Q478J3897J8530
56839D96549K3745L0467L8189M5270N0157N2276N1807M8756M2537L2490J8449
56828I30692R42j8468l6731n0112n6448n6520n2776m7044m0066l2507k5148j8122
56816D97692j0922l419L854J0488J6632K2477K7817L2155L4795L5037L2834K8883
56804G28323K3280J4511J141j5430l1126m2366m8202m9342m6626m1219l4992k9459
$$ plain form
56889 302778 312665 323625 336248 350204 364384 377749 389570 398897 404316 404620 399763 391071 380565
56876 380565 369979 360274 351888 345236 340826 339065 340178 344311 351561 361933 375500 392493 413037
56863 413037 436861 463578 493029 524831 557549 588801 616155 637395 649925 651052 639805 618325
56851 618325 590931 561857 533931 508778 487399 470529 458987 453800 455644 464122 478019 496549
56839 496549 520294 550761 588950 634220 684377 736653 788460 837216 879753 912243 930692
56828 930692 931634 913166 876435 826323 769875 713355 660579 613535 573469 540962 515814 497692
56816 497692 486770 483351 487205 497693 514325 536802 564619 596774 631569 666606 699440 728323
56804 728323 751603 766114 767255 751825 720699 678333 630131 580789 534163 492944 457952 428493
56792D28493k4693j9939j4870r722m747j11M009P752J1475J5035J7645J8806J8736
56779D47869J7470J4214Q247K5r032j7436k3913k7547k8390k7555k6130k4326
56767C03496k1956j9256j6609j4016j1487r524q492p901o971n669m577l925l398
56754A69715k788k248j955j899j989k026j753j144m65J14N89P01L7j154j854j431
56738A50450m39K04K78Jo17j470j911j392l09N05Q50J020J025P28N46J143K368
56721A52980L236L118K351J611J147Q15N16L62N21Q54Q54K32n13o04j18J20q6
56704A67396M5Q50J416J034M50O68J168O73p30j626j304n28j20M6L14M90L17m
56686A70555k05l42m56l40M0L24K13j56m74o53p56p30m54P9O29Q23N06K2j36J5
$$ plain form
56792 428493 403800 383861 368991 359269 354522 354411 358420 366172 377647 392682 410327 429133 447869
56779 447869 465339 479553 487800 487825 478793 461357 437444 409897 381507 353952 327822 303496
56767 303496 281540 262284 245675 231659 220172 210648 202156 194255 187284 181615 177038 173113 169715
56754 169715 166927 164679 162724 160825 158836 156810 155057 153913 153448 153562 154151 154852 154889 153735 151881 150450
56738 150450 150011 150215 150493 150494 149877 148407 146496 145104 144795 145300 146150 147170 148195 148923 149469 150612 152980
56721 152980 156216 159334 161685 163296 164443 165258 165774 166136 166657 167511 168365 168597 168084 167480 167362 167482 167396
56704 167396 167441 168291 169707 170741 171191 171859 173027 173700 172970 171344 170040 169512 169392 169438 169752 170242 170559 170555
56686 170555 170350 170008 169552 169212 169252 169576 169789 169633 169159 168506 167750 167020 166566 166645 167274 168097 168603 168625 168489 168504
56666A68504K7j81j85P6L0m88p05p4P14P46L38M95J313J998K232K484L005L461
56648A83790L640L624L275K360J248P35J031J564J782J556Q93k6o18m71l5M2Q
56631B04398N21J209J019j6o29k42J90j63p11n96k31o59j973l180l452k857k002
56614A90626j474j436j565j494j407j782k494k744k135j268q20o07l4Q33J265
56599A73464Q73J16k23J01O55Q82P33O00P26Q91Q31N57J44m19q82p14Q8O76L83
56580A79482k85m07P1N41Q41J265J662J602J377J799K909L755L688L126K811L007
56564B07244L622M476N326O070O950Q078R007R351R416R367Q318N472J905k75
56550B94327o05o06j308j975j790j303j405k015k667l438m424n062m823l987l121
$$ plain form
56666 168504 168531 168350 168165 168241 168271 167783 167078 167004 167718 168464 168802 169297 170610 172608 174840 177324 180329 183790
56648 183790 187430 191054 194329 196689 197937 198672 199703 201267 203049 204605 205498 205472 204854 204383 204348 204390 204398
56631 204398 204919 206128 207147 207131 206502 206260 206450 206287 205576 204980 204749 204090 202117 198937 195485 192628 190626
56614 190626 189152 187716 186151 184657 183250 181468 178974 176230 174095 172827 172007 171400 171366 172199 173464
56599 173464 174337 174453 174230 174331 174986 175868 176601 177201 177927 178818 179649 180206 180350 179931 179049 178335 178423 179099 179482
56580 179482 179197 178790 178861 179402 180243 181508 183170 184772 186149 187948 190857 194612 198300 201426 204237 207244
56564 207244 210866 215342 220668 226738 233688 241766 250773 260124 269540 278907 287225 292697 294602 294327
56550 294327 293722 293116 291808 289833 288043 286740 285335 283320 280653 277215 272791 267729 262906 258919 255798
56535B55798k391j836j630j625j313p33o17j208j793j911k091k733l160k643j603
56520B28511j004j056j305j452j458j279j074j178j454j256n11q9n36j251j449
56505B12159j239j066q75n04k46k95k95m6Pl53n55k42j4l37n61K2R45J371J449
56486B09325J716J822J098o8o23m18k43m93p92q39o94l49K04O02N64M76P99J215
56468B13302J168R21J162J812K099J713R94J87o36j058o43K54Q12Q70R42J203
56452B25102J252R41O32N06L34O4J4L46P88J025R47N80J04j46o4pl15p31p39k22
56432B30411N09J068J058K57q79j377r13k33Q8N11J454K090J438Q1m39J70O93
56415B35987L29k88l15J42M92N16K95j67p28r07l68N96J280J233O51J53J84O62
$$ plain form
56535 255798 253407 251571 249941 248316 247003 246270 245653 244445 242652 240741 238650 235917 232757 230114 228511
56520 228511 227507 226451 225146 223694 222236 220957 219883 218705 217251 215995 215484 215395 214859 213608 212159
56505 212159 210920 209854 208979 208475 208229 207934 207639 207593 207600 207247 206692 206450 206436 206099 205538 205560 206505 207876 209325
56486 209325 211041 212863 213961 213893 213270 212852 212609 212116 211324 210485 209791 209442 209646 210248 210812 211288 212087 213302
56468 213302 214470 215391 216553 218365 220464 222177 223171 223358 222722 221664 221021 221275 222087 222957 223899 225102
56452 225102 226354 227295 227927 228433 228767 228831 228845 229191 229979 231004 231951 232531 232635 232489 232425 232418 232103 231372 230633 230411
56432 230411 230920 231988 233046 233303 232424 231047 230134 229901 229989 230500 231954 234044 235482 235563 235124 235294 235987
56415 235987 236316 236028 235713 235855 236347 236863 237158 236991 236263 235356 234988 235584 236864 238097 238748 238901 239085 239747
56397B39747J232J725K109K133J574Q01M53N29M75K00J11R3m34j181j006K07J030
56380B49798O86L82J295K578K743K021J659J662J138K96K98J174J680J328R82
56365B69720J207J443J188P99O31M10o9m54m13o9L84Q83J169R35M18K66P26J315
56347B80489J381O35o07j477j221j69N68O82J087K236L120K969K734L538M632
56332C00597M591L736L486L852L570K509J892K041J933J302J268K251L043K691
56318C38762J853J409J114N00m7o2Q8JN3O44J293J369J167J532K701M105N057
56301C61539N249M835M316M092M069L934L635L319K907K360K086K505L391M194
56287D12431M806N339N531N193M938N577O927Q062Q519Q502Q255Q114Q765J0383
$$ plain form
56397 239747 240979 242704 244813 246946 248520 249321 249774 250303 250778 250978 251089 251182 250748 249567 248561 248768 249798
56380 249798 250484 250866 252161 254739 257482 259503 261162 262824 263962 264258 264556 265730 267410 268738 269720
56365 269720 270927 272370 273558 274357 274988 275398 275329 274875 274462 274393 274777 275660 276829 277764 278182 278448 279174 280489
56347 280489 281870 282505 281898 280421 279200 279031 279599 280281 281368 283604 286724 289693 292427 295965 300597
56332 300597 305188 308924 312410 316262 319832 322341 324233 326274 328207 329509 330777 333028 336071 338762
56318 338762 340615 342024 343138 343638 343591 343529 343617 343618 343671 344315 345608 346977 348144 349676 352377 356482 361539
56301 361539 366788 371623 375939 380031 384100 388034 391669 394988 397895 400255 402341 404846 408237 412431
56287 412431 417237 422576 428107 433300 438238 443815 450742 458804 467323 475825 484080 492194 500959 511342
56273E11342J1855J1951J0969J0185J0056J0227J0847J2474J4814J7014J9023
56262F50757K1411K4016K6243K8516L1873L6166M0299M4206M8974N4865O1013
56251A068339O7276P4642Q3323R2049R9909J07368J14868J21777J27266J31002
56241B087819J32473J30981J26752J20723J12735J01301Q5751O7265M7171K5615
56231C038586K726k0112m1120n9517p5373q8840j00007j08840j14925j17972j18597
56220B196009j17812j15727j11830j06436j00607r4694q8210q1250p4611o8514
56210A236318o2550n6974n2455m8539m4032l9080l5112l2421k9632k6055k2763
56199G86705k0674j9217j7647j6158j4893j3295j1176r229p895o852n986n647
$$ plain form
56273 511342 523197 535148 546117 556302 566358 576585 587432 599906 614720 631734 650757
56262 650757 672168 696184 722427 750943 782816 818982 859281 903487 952461 1007326 1068339
56251 1068339 1135615 1210257 1293580 1385629 1485538 1592906 1707774 1829551 1956817 2087819
56241 2087819 2220292 2351273 2478025 2598748 2711483 2812784 2898535 2965800 3012971 3038586
56231 3038586 3041312 3021200 2980080 2920563 2845190 2756350 2656343 2547503 2432578 2314606 2196009
56220 2196009 2078197 1962470 1850640 1744204 1643597 1548903 1460693 1379443 1304832 1236318
56210 1236318 1173768 1116794 1064339 1015800 971768 932688 897576 865155 835523 809468 786705
56199 786705 766031 746814 729167 713009 698116 684821 673645 664416 656521 649669 643683 638036
56187F38036n660n392m905m708m414l235j734j196j340p75L75N99k8L11J861K562
56171F10357J514N71J356L055M323N206N919N864N147N016N792O334O487P653
56157F74594R940J1289J0831J0495J1836J3720J4919J6449J9412K2840K5727K9050
56145H71102L3733L8747M3335M9005N7019O5838P3379P9971Q6744R2781R6379
56134A588033R7518R6701R2780Q4552P3508O2663N3503M5939M0125L6125L2635
56123B304082K7905K1278J2729K228r007j8366k4575k9291l4602m0830m8140n7846
56111B105565o9848q0942q8098r1660r2997r1062q4232p3903o3272n3582m4248
56100A271721l5545k8497k2865j7731j3346j0382q199n852l739k424j071J029
$$ plain form
56187 638036 632376 626984 622079 617371 612957 609722 607988 606792 605452 604677 605052 605651 605623 605934 607795 610357
56171 610357 611871 612442 613798 616853 621176 626382 632301 638165 643312 648328 654120 660454 666941 674594
56157 674594 684534 695823 706654 717149 728985 742705 757624 774073 793485 816325 842052 871102
56145 871102 904835 943582 986917 1035922 1092941 1158779 1232158 1312129 1398873 1491654 1588033
56134 1588033 1685551 1782252 1875032 1959584 2033092 2095755 2149258 2195197 2235322 2271447 2304082
56123 2304082 2331987 2353265 2365994 2368222 2359215 2340849 2316274 2286983 2252381 2211551 2163411 2105565
56111 2105565 2035717 1954775 1866677 1775017 1682020 1590958 1506726 1432823 1369551 1315969 1271721
56100 1271721 1236176 1207679 1184814 1167083 1153737 1143355 1135156 1129304 1125565 1123141 1122070 1123099
56088A123099K820L294L420M293N026M626M240N179O458O744O997Q595J0480J0979
56074A206250J0865J1853J3434J4006J3884J4477J5676J6647J7859J9855K1408
56063A376214K1457K1313K2427K3591K3025K1593K1157K1358K0881K0260K0526
56052A613802K0781J9967J9411K0642K2463K3098K3392K4868K6555K6958K7307
56041A869244K9439L2332L4012L5110L7139L9197L9749L9802M1050M2867M4330
56030B284271M6859N1359N5416N6957N8121O1510O5393O6796O6547O6856O6778
56019B946863O4891O3622O5885O9952P2682P5142P9901Q5538Q9256R2358R7545
56008C803635J03506J07719J11874J18648J26036J30843J34896J41676J49867
$$ plain form
56088 1123099 1125919 1129213 1132633 1136926 1141952 1146578 1150818 1155997 1162455 1169199 1176196 1184791 1195271 1206250
56074 1206250 1217115 1228968 1242402 1256408 1270292 1284769 1300445 1317092 1334951 1354806 1376214
56063 1376214 1397671 1418984 1441411 1465002 1488027 1509620 1530777 1552135 1573016 1593276 1613802
56052 1613802 1634583 1654550 1673961 1694603 1717066 1740164 1763556 1788424 1814979 1841937 1869244
56041 1869244 1898683 1931015 1965027 2000137 2037276 2076473 2116222 2156024 2197074 2239941 2284271
56030 2284271 2331130 2382489 2437905 2494862 2552983 2614493 2679886 2746682 2813229 2880085 2946863
56019 2946863 3011754 3075376 3141261 3211213 3283895 3359037 3438938 3524476 3613732 3706090 3803635
56008 3803635 3907141 4014860 4126734 4245382 4371418 4502261 4637157 4778833 4928700
55999D928700J56655J64035J75031J87063J96236K04884K17418K32115K44821
55990F706958K57253K73523K92064L09389L28051L52067L78503M02910M28903
55981I729621M62540N01613N40870N83159O34421O92544P52963Q20198R01485
55972A5619414R94599J095248J210623J351510J517629J706421J929363K203304
55964B7628111K533977K926849L406100M003647M739825N636049O733069Q071020
55956F5678647R665138J1526634J3686166J6164826J8945310K1983961K5149641
55949A82800323K8038865K9942103L0225716K8791873K5930310K1578537J4984234
55942C62291961N493802o239726j8051726k7430683l2925722l4583341l3386740
$$ plain form
55999 4928700 5085355 5249390 5424421 5611484 5807720 6012604 6230022 6462137 6706958
55990 6706958 6964211 7237734 7529798 7839187 8167238 8519305 8897808 9300718 9729621
55981 9729621 10192161 10693774 11234644 11817803 12452224 13144768 13897731 14717929 15619414
55972 15619414 16614013 17709261 18919884 20271394 21789023 23495444 25424807 27628111
55964 27628111 30162088 33088937 36495037 40498684 45238509 50874558 57607627 65678647
55956 65678647 75343785 86870419 100556585 116721411 135666721 157650682 182800323
55949 182800323 210839188 240781291 271007007 299798880 325729190 347307727 362291961
55942 362291961 367785763 361546037 343494311 316063628 283137906 248554565 215167825
55935B15167825l0505726k6897317k3203234j9759012j6679711j3989232j1691782
55928G2441811r764710q156211o818948n723051m832955m101383l493659k994497
55920B6556397k586508k243839j950595j704946j501015j324515j168841j038045
55912A3038093r30739q36492p50503o77140o16617n61864n10658m67982m34211
55903G251887m02835l71593l44529l21755k98147k73474k53146k37716k21702
55894D526990k03952j89177j78206j66434j53130j42761j35791j27272j16026
55885C114241j06477j00019r3050q4958p9629p7539p4432o9581o7572p0027p2872
55874B218085p3544p3884p4271p2033o7387o4307o3606o1566n6957n3067n1146
$$ plain form
55935 215167825 184662099 157764782 134561548 114802536 98122825 84133593 72441811
55928 72441811 62677101 54520890 47701942 41978891 37145936 33044553 29550894 26556397
55920 26556397 23969889 21726050 19775455 18070509 16569494 15244979 14076138 13038093
55912 13038093 12107354 11270862 10520359 9843219 9226602 8664738 8154080 7686098 7251887
55903 7251887 6849052 6477459 6132930 5811175 5513028 5239554 4986408 4748692 4526990
55894 4526990 4323038 4133861 3955655 3789221 3636091 3493330 3357539 3230267 3114241
55885 3114241 3007764 2907745 2814695 2729737 2650108 2572569 2498137 2428556 2360984 2290957 2218085
55874 2218085 2144541 2070657 1996386 1924353 1856966 1792659 1729053 1667487 1610530 1557463 1506317
55863A506317m8156m2904l8250l5382l1762k6673k3180k2568k2188k0607j9786
55852A174861k0385k0141j8590j8431k0498k2228k2641k3907k6415k7278k5504
55841I28843k3835k3618k2645j9954j8069j8393j8696j7352j5892j5421j4440
55830G20528j2213j0463r945r003p259o872q453r584r040q775r899j0519r444
55817E99059q379q529q500p503p164q249q869p855o704o367n354k897p90j92L52
55802E12059J853K920K714K807M116M919L896K327J330k46l115n461n746n204
55788E19169n519o243o448o662p283p255o084n242n949p549r322j1600j3800j3935
55774D06278j1699r542r054q688o773m310k875k107j205q30j472j957j505j381
$$ plain form
55863 1506317 1458161 1415257 1377007 1341625 1309863 1283190 1260010 1237442 1215254 1194647 1174861
55852 1174861 1154476 1134335 1115745 1097314 1076816 1054588 1031947 1008040 981625 954347 928843
55841 928843 905008 881390 858745 838791 820722 802329 783633 766281 750389 734968 720528
55830 720528 708315 697852 687907 678904 671645 664773 656320 646736 637696 628921 619022 608503 599059
55817 599059 590680 582151 573651 566148 558984 550735 541866 534011 527307 520940 515586 512689 511899 511707 512059
55802 512059 513912 516832 519546 522353 526469 531388 535284 537611 538941 538695 535580 530119 524373 519169
55788 519169 513650 507407 500959 494297 487014 479759 473675 468433 462484 454935 445613 434013 420213 406278
55774 406278 394579 385037 375983 367295 360522 356212 353337 351230 350025 349195 347723 345766 344261 342880
55760C42880k666m173m429l907l620l264k500k335l471m871n529n986o626o391
55746B83112m834l569l870m555m117l221l176l523l200k699l029l613l141j718
55732B34847n73l26q03j682k259j736o31p07k451m103m167l375k989k810k222
55717B04013j659j589j380n62R2kl7P21J612J875J900K003J535M19l6P98J514
55700B11217P99o33j622k508l853m759m222k912j955j216k84J55l71o88L07J636
55684A89091J742J006R49J767K479K876L516M261M358L693K777J874J129R14J111
55669B23543Q04l73j397j282m55J01J77k3m96q18j96J016J215oq85j63Q07K07
55651B21776j414k202j807j309j236j321j592k237k893l277l834m723n171m804
$$ plain form
55760 342880 340214 336041 331612 327705 324085 320821 318321 315986 312515 307644 302115 296129 289503 283112
55746 283112 278278 274709 270839 266284 262167 258946 255770 252247 249047 246348 243319 239706 236565 234847
55732 234847 234274 233948 233145 231463 229204 227468 226837 226130 223679 219576 215409 212034 209045 206235 204013
55717 204013 202354 200765 199385 198823 198915 198913 198876 199597 201209 203084 204984 206987 208522 208941 208905 209703 211217
55700 211217 212016 211383 209761 207253 203400 198641 194419 191507 189552 188336 188052 188207 187836 187148 187455 189091
55684 189091 190833 191839 192788 194555 197034 199910 203426 207687 212045 215738 218515 220389 221518 222432 223543
55669 223543 224347 223974 222577 221295 220840 220941 221118 221095 220599 219781 219585 220601 221816 221810 220925 220762 221569 221776
55651 221776 220362 218160 216353 215044 213808 212487 210895 208658 205765 202488 198654 193931 188760 183956
55637A83956m571n081n344m475l411l329l581k959j932j710j939j241L97J585
55623A46365J535O65m29j294j388p69n02j199j888j538q13r55j697j859j327r30
55607A31977q64p24o36r93j466j500j301j221q54P9O94J71p81r71n76m81n49q3
55589A19921N91O16J41o7j23n97j074o51M32J129J255J493J987K224K079J935
55573A31291J978K330L335M833N748N430M632M184L634K412J211Q30O00m12j641
55558A70395k089k252l108m036l745k617k149k525k678k366k197j969r99J54K50
55543A38069m87p19l22l34p40l88P27J228O44P4J78L24J57K26N64L33n68j112
55525A37854r47j059k005k854k676j896j457j579j921k225k320k130j889j748
$$ plain form
55637 183956 179385 174304 168960 164485 161074 157745 154164 151205 149273 147563 145624 144383 144780 146365
55623 146365 147900 148565 148136 146842 145454 144685 144183 142984 141096 139558 138745 137790 136093 134234 132907 131977
55607 131977 131113 130389 129753 128760 127294 125794 124493 123272 122418 122497 123191 123362 122581 121610 121034 120553 120004 119921
55589 119921 120512 121128 121269 121202 121079 120482 119408 118757 119189 120318 121573 123066 125053 127277 129356 131291
55573 131291 133269 135599 138934 143767 149515 154945 159577 163761 167395 169807 171018 171848 172448 172036 170395
55558 170395 168306 166054 162946 158910 155165 152548 150399 147874 145196 142830 140633 138664 137665 137819 138069
55543 138069 137582 136863 136541 136207 135467 135079 135806 137034 137678 137752 137930 138254 138411 138637 139201 139534 138966 137854
55525 137854 136907 135848 133843 130989 128313 126417 124960 123381 121460 119235 116915 114785 112896 111148
55511A11148j320l78L29nq67j131q06p67j013p98l10n44j425j721j022k52J9J78
55493I9315K20m62j459j221O49K446K540J265q1r25j318j205p22l95m21l67o8
55476I7791M9j42j27J92J70l65m69N25J868K320J702P57J1n99j211j645j556q47
55458I8424mJ93l63q26n23J2q4n86o02r6R5k81n71l71l6Q8L4k00o57r98q65n19
55436I1264l52j10N14R12L97m00l06M25M16n73j182m72R43J979K147J367J0q42
55418I6137l73O07O35j66k99O01J259R63N50O21N02k75r51r65r63j483j793j095
55400I3512J24Q46Q01K37p22j754k156j659q53k40L63J132J698J753J418P70j83
55383I5087r27q30l05m57j298j640j048m90n71n02L74J364J600J295R51L65o48
$$ plain form
55511 111148 109828 109450 109779 109774 108907 107776 106970 106203 105190 104392 104082 103538 102113 100392 99370 99118 99137 99315
55493 99315 99535 99073 97614 96393 97042 99488 102028 103293 103212 102287 100969 99764 99042 98647 98226 97859 97791
55476 97791 97840 97698 97571 97763 97933 97568 97099 97624 99492 101812 103514 104271 104282 103683 102472 100827 99271 98424
55458 98424 98420 98613 98250 97424 96901 96913 96829 96243 95641 95545 95640 95359 94788 94417 94381 94469 94503 94303 93646 92648 91783 91264
55436 91264 90912 90802 91316 92228 92625 92225 91919 92344 92760 92187 91005 90533 91476 93455 95602 96969 96979 96137
55418 96137 95764 96371 97006 96840 96541 97142 98401 99364 99914 100535 101037 100762 99811 98846 97883 96400 94607 93512
55400 93512 93636 94482 95283 95520 94798 93044 90888 89229 88376 88136 88499 89631 91329 93082 94500 95270 95087
55383 95087 94160 93330 93025 92568 91270 89630 88582 88092 87521 87019 87393 88757 90357 91652 92603 92968 92320
55366I2320j433j319o57k19k52n92j065j259o72M28J128J147J070J087O00m93
55350H9819j298j182m35O11J884K660J889j6j261j160r01j164q64O31J928J683
55334I2824O68J94j9p07j186n68L23K57j19O48K125K484J304n1o93r84j097o28
55316I4775K11M99J3n00o20o41o44l17J69K34r0k31j82m50q75o64K59R73R00M95
55296I3314L13K66J16n6j48j69R9R50K038K484J904Q55O5k88l97m23m43m88m53
55277I9539k05J75L77J44n62j399j648p93O61J478J135N09O10J199J289O42%o
55259A03145M37P16M10l52r48q32k32J08J1J03O25Q03Lj151j516q74O9O46N54
55240A01725k69j414j977j505n96o7N2O2j47o10p25j29L75j66j249j498o06M10
$$ plain form
55366 92320 90887 89568 88911 88692 88440 87848 86783 85524 84852 85280 86408 87555 88625 89712 90312 89819
55350 89819 88521 87339 86904 87515 89399 92059 93948 93932 92671 91511 90610 89446 88582 89213 91141 92824
55334 92824 93492 93686 93667 92960 91774 91206 91529 91786 91667 92315 94440 96924 98228 98177 97484 96500 95403 94775
55316 94775 94986 95485 95498 94998 94378 93737 93093 92776 92945 93179 93089 92858 92676 92226 91351 90687 90946 91919 92819 93314
55296 93314 93627 93893 94009 93953 93805 93636 93735 94685 96723 99207 101111 101966 102031 101743 101346 100923 100480 99992 99539
55277 99539 99334 99509 99886 100030 99468 98069 96421 95628 96289 97767 98902 99411 100021 101220 102509 103151 103151 103145
55259 103145 103582 104298 104708 104356 103408 102576 102344 102452 102463 102566 103191 103994 103997 102846 101330 100456 100525 101171 101725
55240 101725 101456 100042 98065 96560 95964 95897 95949 96011 95864 95254 94529 94400 94775 94609 93360 91862 91256 91666
55222I1666Q44R81J080Q57K49j56J7L60L76J86K01M26N18K92n1j32J61M79L34
55203I8688k45p02o64k91J77O81R93P36J30K2O45J073N59k23j65O33J062N89l10
55184A03388r98j161o54K90Q91N73k69q41j014j128j090o01mM6l27k96M56J358
55166I8619J783J599R95L86M13J268K129J985R97K24P9j06q79j799k092j556n90
55149A03455K75O69N58K40o9m95j114j509j225m42K37N32O04O46Q34J381K138
55132A06715K401J683M74l43n19m60m34m07l62k85k1L13K08m47r10n58J62N00
55114A07710N89R36J224O91m94j299j186n03L14J019J220O79o2k79j39l07o64
55097A09449m48L72R10O73Q3l56n33k60O55J713K012J455Q45O48N02J16k24l15
$$ plain form
55222 91666 92510 93491 94571 95428 95677 95521 95538 95898 96274 96460 96661 97087 97605 97897 97846 97714 97875 98354 98688
55203 98688 98443 97741 97077 96786 96963 97644 98637 99373 99503 99525 100170 101243 101802 101579 101414 102047 103109 103698 103388
55184 103388 102390 101229 100575 100865 101756 102329 102060 101219 100205 99077 97987 97386 97382 97428 97101 96805 97261 98619
55166 98619 100402 102001 102996 103382 103795 105063 107192 109177 110174 110398 110477 110371 109492 107693 105601 104045 103455
55149 103455 103730 104399 104957 105197 105128 104633 103519 102010 100785 100343 100580 101112 101716 102362 103196 104577 106715
55132 106715 109116 110799 111273 110930 110411 109951 109517 109110 108748 108463 108442 108755 108963 108516 107606 107048 107210 107710
55114 107710 108299 109235 110459 111150 110656 109357 108171 107668 107982 109001 110221 110900 110838 110559 110420 110113 109449
55097 109449 109001 109373 110283 110956 111039 110683 110150 109890 110545 112258 114270 115725 116570 117218 117720 117836 117612 117297
55079A17297l25k34J95O91N65j66n80j63M85O24L49J34Kl00p23r29o88o4N55O54
55059A17379J00o30j058j264j371j013o0N50j36j427j684o63K01P5r3O69J660
55042A11235J536K74q61r43k00N20O19J40l56m23k75m20q72j085p25QP64J281
55024A10217J334R76O87P37O34j26r98j048l74J19K29N42J040R23R9m66k19K79
55006A14585N47R00J400J325M61j48L78J372J609R84L82L50O67Q34M27o02j585
54989A23886j595o72J04Q5j12K39Q36J052R62Q89N66l12j243j467j043n97k97
54972A21281J18N68O01J23m99r33j083q95m08J39N83J015J423J482J008L50j2
54955A24861qJ09J52K8k90o18p05o39o64n94L1J025J545J262Q36Q10P79K38m55
$$ plain form
55079 117297 116972 116738 116933 117624 118189 118023 117443 117280 117765 118389 118738 118872 118874 118574 117851 116922 116234 116170 116725 117379
55059 117379 117479 116849 115791 114527 113156 112143 112083 112633 112497 111070 109386 108723 108924 108999 108906 109575 111235
55042 111235 112771 113045 112184 111241 111041 111561 112180 112320 111964 111541 111266 110846 109974 108889 108164 108172 108936 110217
55024 110217 111551 112527 113214 113951 114585 114459 113461 112413 112039 112158 112387 112929 113969 114892 114991 114525 114306 114585
55006 114585 115132 116032 117432 118757 119218 119070 119448 120820 122429 123413 123795 124145 124812 125646 126073 125471 123886
54989 123886 122291 121619 121723 121808 121696 121935 122771 123823 124785 125674 126240 125928 124685 123218 122175 121578 121281
54972 121281 121399 121967 122568 122691 122192 121259 120176 119281 118873 119012 119595 120610 122033 123515 124523 124873 124861
54955 124861 124853 124962 125114 125142 124852 124234 123529 122890 122226 121632 121663 122688 124233 125495 126331 127141 127920 128158 127703
54936A27703o01j50M56R68J282J146N37J2J10O55J133J479K016K864L875M880
54920A48365N666N990N895N788N907N947N402L997J803o11k236k548k378l037
54906A83950m490n442n343n027m943m301k815j860k523l611l235j589n12o86j011
54891A36562o60j40RJ56O34R80P36K91L70J087J983K650L054L397L905M583N161
54874A64758N404N361N152M690L790K430P13j103k479k971k914l198m058m710
54860A70865m631m422m716m935m140k648j753j964k554k729k435j942j490j420
54846A29086j931k567k533j679o70r8P5J37J77J35k2k82m97l91J12O78R78J082
54828A21790J163J101P97N00M09K35k65o88n30q6j08p30j339j445j051l26M94
$$ plain form
54936 127703 127102 126952 127408 128376 129658 130804 131341 131353 131463 132118 133251 134730 136746 139610 143485 148365
54920 148365 154031 160021 165916 171704 177611 183558 188960 192957 194760 194149 191913 189365 186987 183950
54906 183950 179460 174018 168675 163648 158705 154404 151589 149729 147206 143595 140360 138771 138259 137573 136562
54891 136562 135902 135762 135771 135927 136561 137541 138277 138568 138938 140025 142008 144658 147712 151109 155014 159597 164758
54874 164758 170162 175523 180675 185365 189155 191585 192298 191195 188716 185745 182831 179633 175575 170865
54860 170865 166234 161812 157096 152161 148021 145373 143620 141656 139102 136373 133938 131996 130506 129086
54846 129086 127155 124588 122055 120376 119706 119608 119683 119820 119997 120132 120110 119828 119331 118940 119052 119730 120708 121790
54828 121790 122953 124054 124851 125351 125760 125995 125730 125042 124512 124426 124318 123588 122249 120804 119753 119427 119921
54811A19921R37O61k6n15o45o71o18k67L35R41J497J987K053J453O87M66O69N66
54793A29431J2l47j17L29M80K35k83q41r52k56Q45J520J542J403J384J221Q25
54776A36431O14Q15J084J163J343J983K963L931M727N284N472N350N270N473N799
54761A87702N936N736N141M060K514O88j216l036m548n554o062o213o079n764
54747A73305n485n311m959m220l385k802k252j315k50J80k10p79r50p67l92K62
54731A40670J097J603J555J536K266L629M717M849M206L435K932K710K789L366
54717A81360M283M667L660J569l31j298j877k778l791m357m638n118n564n341
54703A60446m562l972l686l005j652l41K29K04N0j67n55r02q64m45JJ36p7l28
$$ plain form
54811 119921 120858 121519 121493 120978 120333 119662 119044 118777 119112 120053 121550 123537 125590 127043 127730 128196 128865 129431
54793 129431 129443 129096 128979 129308 129788 130023 129740 128899 127947 127691 128536 130056 131598 133001 134385 135606 136431
54776 136431 137045 137860 138944 140107 141450 143433 146396 150327 155054 160338 165810 171160 176430 181903 187702
54761 187702 193638 199374 204515 208575 211089 211777 210561 207525 202977 197423 191361 185148 179069 173305
54747 173305 167820 162509 157550 153330 149945 147143 144891 143576 143326 143506 143296 142517 141567 140800 140408 140670
54731 140670 141767 143370 144925 146461 148727 152356 157073 161922 166128 169563 172495 175205 177994 181360
54717 181360 185643 190310 193970 195539 195208 193910 192033 189255 185464 181107 176469 171351 165787 160446
54703 160446 155884 151912 148226 145221 143569 143228 143457 143661 143711 143544 142989 142087 141223 140778 140779 140915 140838 140510
54685A40510k41J48K96j54p99j014q47q28j048j083q00n59n23m73l80n50r49j045
54667A29661o09j88l38q13r22m23L12Q53J113J200J085N62l45j086r67%R85J290
54649A31370J021O01J32k85k31L46O62J40m85j32Q94J271O66J13K27L38j81q66
54631A35601j080j082j367j614j118P7J182J558J202M71k77q49j255j452j167
54616A28830l26N04N98P3k49N0O01R93J200J153O78O5p0J97O1p37j337r96j20
54597A31168M79P12Q45P10K5p87r48l23M59P71M45l06r62q88J06J424K187K004
54579A37121J127M7q05j193j155q91n53k76l10p27j077q10n7N65Q59J117J276
54562A34258Q93R7k99M4M55L43K9NR5m4j93L5N20Q85R96Q20K88k70j45P98J737
$$ plain form
54685 140510 140269 140417 140713 140559 139760 138746 137899 137071 136023 134940 134140 133581 133058 132585 132205 131655 130706 129661
54667 129661 129052 128864 128526 127713 126791 126368 126680 127533 128646 129846 130931 131493 131148 130062 129095 129095 130080 131370
54649 131370 132391 132992 133124 132839 132608 132954 133616 133756 133271 133139 134033 135304 135970 136083 136310 136648 136467 135601
54631 135601 134521 133439 132072 130458 129340 129417 130599 132157 133359 133830 133553 132704 131449 129997 128830
54616 128830 128504 129008 129606 129679 129430 129480 130081 131074 132274 133427 134105 134170 134100 134297 134358 133621 132284 131288 131168
54597 131168 131647 132359 133204 133914 133939 133152 132204 131881 132340 133111 133556 133250 132288 131400 131506 132930 135117 137121
54579 137121 138248 138295 137490 136297 135142 134251 133698 133422 133112 132385 131308 130498 130441 131006 131865 132982 134258
54562 134258 135151 135248 134949 134993 135448 135791 135820 135825 135920 135876 135683 135718 136238 137123 138119 138939 139227 138957 138812 139610 141347
54541A41347J954J682J427J168Q15P64J191J429Q94R5j26J34J88m8j55j79m98
54524A52082r56j011o88n28p44j073j344j503j309p15k96m80o82j36O43L94r26
54507A40728j859j323J76J433J820J337K71q16j317j171p77l19K21M73l2q47q20
54490A37178K87J321J316P38N48P73P44K36l58o72n71k6O90R56N92L25Q68J753
54472A46698J847R45O6P0O15Q50N97L32M06O92R57J138J201J019N41o9n70q61
54454A56474j000j030r16o25k40J4r7n77j043r77l01M56P31N57M06M86N13K41
54436A53072j80m84p03j055j592k042k020j372m09L08N46O65J013J301J023L92
54420A48463K36Q71J680K007J845J450Q43J15l37k83j8J44K58L47J51k72l00L40
$$ plain form
54541 141347 143301 144983 146410 147578 148393 149157 150348 151777 152671 152766 152640 152774 152962 152914 152759 152580 152082
54524 152082 151126 150115 149427 148899 148155 147082 145738 144235 142926 142211 141915 141435 140753 140617 141260 141654 140728
54507 140728 138869 137546 137722 139155 140975 142312 142583 141767 140450 139279 138502 138183 138404 138877 138845 137998 137178
54490 137178 137465 138786 140102 140840 141388 142161 142905 143141 142783 142111 141540 141514 142204 143160 143752 144077 144945 146698
54472 146698 148545 149490 149556 149626 150241 151091 151688 152020 152426 153118 154075 155213 156414 157433 157974 157905 157335 156474
54454 156474 155474 154444 153528 152903 152663 152677 152580 152003 150960 149983 149682 150138 150869 151426 151832 152318 152831 153072
54436 153072 152892 152408 151705 150650 149058 147016 144996 143624 143215 143523 144069 144734 145747 147048 148071 148463
54420 148463 148699 149570 151250 153257 155102 156552 157395 157510 157173 156890 156872 157016 157274 157621 157772 157500 157200 157540
54402A57540R46Q18L27K42M85M15M0l5K61M09L15M41Q29R20N60L22N54Q32P07
54383A66928L82J90K8l27p82j170j458j436p15N88J596J576P44q9m14k01M18J170
54365A67028J595J386P30R8k08j48J58M11K72k23o08n74k99m4K41N75O22J94j81
54346A71025J63R45J135L35n59m19P88K108K806K991L120L280L183K613J666N93
54330A95773l35q79r80r31j181j842k500k716k567k498k671k733k317j571r82
54315A69070p64o41k87J72L02m4m83n97m70n28q85j229j300j222j183j048n74
54298A58289J57P04P18K48k99n00k39K28N64O39M85J39k62l82l9M25N06L04M18
54279A62103J029J579J553J083N66J22k47l77k53j87l77n57m34j26J19L00M26
$$ plain form
54402 157540 158486 159304 159631 159873 160358 160773 160813 160778 161039 161448 161763 162204 163033 163953 164513 164835 165389 166221 166928
54383 166928 167310 167500 167528 167201 166419 165249 163791 162355 161640 162228 163824 165400 166144 166055 165641 165440 165858 167028
54365 167028 168623 170009 170739 170837 170629 170481 170639 171050 171322 171099 170491 169917 169618 169574 169815 170390 171012 171206 171025
54346 171025 171188 172133 173268 173603 173044 172625 173413 175521 178327 181318 184438 187718 190901 193514 195180 195773
54330 195773 195438 194559 193579 192648 191467 189625 187125 184409 181842 179344 176673 173940 171623 170052 169070
54315 169070 168306 167665 167378 167550 167852 167808 167325 166728 166258 165730 164845 163616 162316 161094 159911 158863 158289
54298 158289 158446 159150 159868 160116 159817 159317 159078 159306 159870 160509 160994 161133 160871 160489 160450 160875 161381 161685 162103
54279 162103 163132 164711 166264 167347 167913 168035 167788 167411 167158 166971 166594 166037 165603 165477 165596 165896 166322
54262A66322L20J5k6M65J149J582J751J649R85j91j085j105o69m18j88L29N91
54245A71476j5q29p72k06m57j472j654m59N32J4r88p45N32J110L36o11n56K44
54227A65480Q05P19L61J76K22K73J67k7j42k23m21o36n46j42J01j87p09q21k98
54208A64152M14O44Q2r11j561j337m16N73J233J573J603J231N84N4j71l00n33
54191A66914p53p60n51k73p0n8k07k95k15k48n84p24KJ284J917J264N2o50o49
54172A65396m78m82n76o04m76j60K08L51K19P0L9m0k01j62J36K31k65j066j536
54153A60604j376p35L1N05M92L61P37J617K225K038J350N79k64r88r44p7M47l13
54135A66289j472j315L04J731J698P09p2k69k24j63j24j97l64l44N6N99R20R44
$$ plain form
54262 166322 166642 166657 166631 167096 168245 169827 171578 173227 174212 174021 172936 171831 171162 170744 170556 170885 171476
54245 171476 171461 170632 169860 169654 169197 167725 166071 165612 166144 166158 165170 164425 164957 166067 166403 165792 165236 165480
54227 165480 166285 167004 167365 167541 167763 168036 168203 168176 168034 167811 167390 166754 166208 166066 166167 165980 165271 164450 164152
54208 164152 164566 165210 165292 164381 162820 161483 161067 161640 162873 164446 166049 167280 167864 167918 167747 167447 166914
54191 166914 166161 165401 164850 164577 164507 164449 164242 163947 163732 163484 162900 162176 162178 163462 165379 166643 166695 166045 165396
54172 165396 164918 164436 163860 163256 162780 162620 162828 163179 163398 163468 163507 163467 163266 163104 163240 163471 163206 162140 160604
54153 160604 159228 158493 158524 159029 159521 159882 160619 162236 164461 166499 167849 168428 168164 167176 166232 166155 166602 166289
54135 166289 164817 163502 163806 165537 167235 167944 167872 167603 167379 167216 167092 166895 166531 166187 166243 166842 167762 168706
54117A68706Q40P45P31Q33R44Q87O88N96O45M95r1q32j206j062p56o40o49m22
54099A70452J34O17N66Q2k44n0L65N52M68L42K54K34M60R38J174P23m7l35JL66
54079A77052M53O26J100J453J353J142J181J195Q71O16R91J633J630R10M15P46
54063A93367J332J362R25P11R43J176J048P42O42R04J357J665J551J093Q47J376
54047B11041K671M095N009N268N170N199N867P414R469J1221J2213J2835J3721
54034C11193J4827J5379J4722J2867J0180O950L454K11k217l629m265m442m262
54021C70968l725l026k507k350k407k444k439k510k656k776l009l716m988o358
54007C26057p247p449p126o488n771n257m999m692m124l551l286l058k401j528
$$ plain form
54117 168706 169546 170291 171022 171855 172799 173686 174374 174970 175615 176110 176019 175187 173981 172919 172163 171523 170874 170452
54099 170452 170586 171203 171769 171851 171607 171557 171922 172474 172942 173284 173538 173772 174232 175170 176344 177067 177020 176685 176686 177052
54079 177052 177505 178131 179231 180684 182037 183179 184360 185555 186426 187042 188033 189666 191296 192206 192621 193367
54063 193367 194699 196061 196986 197697 198640 199816 200864 201606 202248 203152 204509 206174 207725 208818 209665 211041
54047 211041 213712 217807 222816 228084 233254 238453 244320 251734 261203 272424 284637 297472 311193
54034 311193 326020 341399 356121 368988 379168 386118 389572 389783 387566 383937 379672 375230 370968
54021 370968 367243 364217 361710 359360 356953 354509 352070 349560 346904 344128 341119 337403 332415 326057
54007 326057 318810 311361 304235 297747 291976 286719 281720 277028 272904 269353 266067 263009 260608 259080
53993B59080j261j893k760l137l115l191l412l407k996k396j857j498j393j497
53979B25267j528j231p25m13m35n25l79m3J90J71k8k75n34p76q35n64q0L34N85
53960B18176Q52J171J251R45O55Q78J526K075K327K584L012L359L400L281L210
53945B48702L193L300L742M429M772M323L490L204L933N227O247O546O335O110
53931C13553O120O211O146N933N650N186M479L905L996M739N548O006O238O490
53917C90200O798P202P820Q530R011R352J0121J1481J2665J2765J1725J0172Q594
53904E16436P052N465L703J640n16k205l185m021n373p075q389r015r274r429
53890D75814r394r151q909q657q012o668m785k728p03J237L004M431N305N372
$$ plain form
53993 259080 257819 255926 253166 250029 246914 243723 240311 236904 233908 231512 229655 228157 226764 225267
53979 225267 223739 222508 221783 221370 220935 220410 220031 219988 220178 220349 220321 220046 219512 218736 217901 217337 217257 217591 218176
53960 218176 219028 220199 221450 222395 223050 223928 225454 227529 229856 232440 235452 238811 242211 245492 248702
53945 248702 251895 255195 258937 263366 268138 272461 275951 279155 283088 288315 294562 301108 307443 313553
53931 313553 319673 325884 332030 337963 343613 348799 353278 357183 361179 365918 371466 377472 383710 390200
53917 390200 396998 404200 412020 420550 429561 438913 449034 460515 473180 485945 497670 507842 516436
53904 516436 523488 528953 532656 534296 533780 531575 528390 524369 518996 511921 503532 494517 485243 475814
53890 475814 466420 457269 448360 439703 431691 425023 420238 417510 416807 418044 421048 425479 430784 436156
53876D36156M367K056j676o538j1549j5345j7136j7192j6246j4685j2695j0755
53864C18762r460q817q265p427o489n731n151m596m031l496l059k830k753k496
53850B44161j806r96o44q67j211j332j276j075n32K59O77K57o88j457j830k051
53834B29589k158j794q13L35J032J143J052J128J315J262P56N1l15l1O30J081
53818B34263J017P04O06R29J603K466L256L532L029K101J505J624K235L063M104
53803B66037N177N727N562N326N653O174O102N561N425N882O117N558M636L862
53789C42799L090K146J487J467J551R96k2p58j052j411k094k843l450m027m566
53774C33313m853m897n007n319n587n528n135m593m173m150m559m990m916m227
$$ plain form
53876 436156 440523 442579 440903 434365 422816 407471 390335 373143 356897 342212 329517 318762
53864 318762 309302 300485 292220 284793 278304 272573 267422 262826 258795 255299 252240 249410 246657 244161
53850 244161 242355 241359 240715 239848 238637 237305 236029 234954 234422 234681 235358 235615 234927 233470 231640 229589
53834 229589 227431 225637 224824 225159 226191 227334 228386 229514 230829 232091 232847 232898 232583 232552 233182 234263
53818 234263 235280 235984 236590 237519 239122 241588 244844 248376 251405 253506 255011 256635 258870 261933 266037
53803 266037 271214 276941 282503 287829 293482 299656 305758 311319 316744 322626 328743 334301 338937 342799
53789 342799 345889 348035 349522 350989 352540 353536 353514 352756 351704 350293 348199 345356 341906 337879 333313
53774 333313 328460 323563 318556 313237 307650 302122 296987 292394 288221 284071 279512 274522 269606 265379
53760B65379l272k468k044k043k267k344k108j849j961k443k958l186k885j883
53746B31668m25O82P79J65k46j9M41N94M08J98K02M07O34P30P63R31J185J108
53728B40205M39m74j082j186q61r8J006J895K026J525R29L69l40r20o48N87J912
53711B45284K470K404K425K782L051K834K318K035K237K613K649K202J584J095
53697B77983P78O91J051J877K764L291L411L269K902K340J665P48n48j713j771
53682B98738o92J48l45j374j387k30Q94J374J666J923J541M03o39j075j452k184
53666B97309k627k092j039l75j98j2K34J73j67l78l78m94q00r50p25l47j83l13
53648B86638n12m91k26l1j74m85n01j01M08P75J058J295J377J365J499J681J451
$$ plain form
53760 265379 262107 259639 257595 255552 253285 250941 248833 246984 245023 242580 239622 236436 233551 231668
53746 231668 231243 231925 232704 232869 232623 232604 233045 233639 234047 234245 234447 234854 235488 236218 236981 237912 239097 240205
53728 240205 240644 240170 239088 237902 237041 236943 237949 239844 241870 243395 244324 244693 244353 243433 242785 243372 245284
53711 245284 247754 250158 252583 255365 258416 261250 263568 265603 267840 270453 273102 275304 276888 277983
53697 277983 278761 279452 280503 282380 285144 288435 291846 295115 298017 300357 302022 302770 302222 300509 298738
53682 298738 298046 298194 297849 296475 295088 294858 295752 297126 298792 300715 302256 302659 302020 300945 299493 297309
53666 297309 294682 292590 291551 291176 290978 290966 291200 291373 291206 290828 290450 289956 289156 288206 287481 287134 286951 286638
53648 286638 286126 285635 285409 285378 285204 284719 284218 284117 284525 285300 286358 287653 289030 290395 291894 293575 295026
53631B95026P14R0K00Q97J606K051K338K570K724K812K828K706K504K440K572
53616C24078K725K834L114L605L943L842L566L541L792M012M091M178M341M400
53602C76062M087L281K177J326J254J927K714K978K544J625O17J1J46Q49J504
53587D03102J624J156K84o92j287j124m70k3m1j15R0M17P06J063J313Q72l67j570
53569D04938j966j874k088k710l211l335l227k844k000j050o92r83j104m13P23
53554C78164J411J326R21P14O90N56L51M70J026J547J614J548J969K821L475L776
53538D02379M303N272N976N741M959M512M660N034N527O435P793R149J0056J0466
53524D92262J0604J0718J0969J1411J2075J3116J4616J6151J6964J6915J6874
$$ plain form
53631 295026 295740 295830 296030 296927 298533 300584 302922 305492 308216 311028 313856 316562 319066 321506 324078
53616 324078 326803 329637 332751 336356 340299 344141 347707 351248 355040 359052 363143 367321 371662 376062
53602 376062 380149 383430 385607 386933 388187 390114 392828 395806 398350 399975 400592 400603 400749 401598 403102
53587 403102 404726 405882 406166 405474 404187 403063 402593 402570 402529 402414 402504 402921 403627 404690 406003 406875 406508 404938
53569 404938 402972 401098 399010 396300 393089 389754 386527 383683 381683 380633 379941 378958 377854 377441 378164
53554 378164 379575 380901 381822 382536 383226 383782 384133 384603 385629 387176 388790 390338 392307 395128 398603 402379
53538 402379 406682 411954 417930 423671 428630 433142 437802 442836 448363 454798 462591 471740 481796 492262
53524 492262 502866 513584 524553 535964 548039 561155 575771 591922 608886 625801 642675
53513F42675J7720J9224K0387K0738K0833K1431K2644K3942K4693K4677K4187
53502H83151K3720K3468K3213K2710K1904K0755J9258J7866J7432J8257J9480
53491A111214J9920J9339J8480J7949J7649J7301J6982J6893J6911J6691J6134
53480A305463J5532J5187J5020J4700J4140J3539J2861J1586R420O882M693K757
53468A441780L79k562n453p932j0211j2259j3525j3874j4026j4548j5061j5041
53456A317667j4752j4784j5244j5986j7144j8688j9892k0054j9426j8872j8759
53445A124066j8772j8483j7674j6377j5086j4373j3922j2515r697o751n151m682
53433I70583m149l305k825k619j690K10K106L296M256N618P137Q253R050J0112
$$ plain form
53513 642675 660395 679619 700006 720744 741577 763008 785652 809594 834287 858964 883151
53502 883151 906871 930339 953552 976262 998166 1018921 1038179 1056045 1073477 1091734 1111214
53491 1111214 1131134 1150473 1168953 1186902 1204551 1221852 1238834 1255727 1272638 1289329 1305463
53480 1305463 1320995 1336182 1351202 1365902 1380042 1393581 1406442 1418028 1427448 1434330 1439023 1441780
53468 1441780 1442159 1439597 1434144 1426212 1416001 1403742 1390217 1376343 1362317 1347769 1332708 1317667
53456 1317667 1302915 1288131 1272887 1256901 1239757 1221069 1201177 1181123 1161697 1142825 1124066
53445 1124066 1105294 1086811 1069137 1052760 1037674 1023301 1009379 996864 987167 980416 975265 970583
53433 970583 966434 963129 960304 957685 955995 956205 958311 961607 965863 971481 978618 986871 995921 1006033
53419A006033J1780J3893J5902J7190J7668J8061J9214K1133K3207K5179K7166
53408A216426K8934L0036L0774L2029L3918L5563L6541L7662L9707M2170M4026
53397A607786M5228M6646M8739N0991N2617N3378N3580N3635N3722N3746N3516
53386B173584N2920N1896N0363M8348M6079M3745M1259L8459L5398L2201K8885
53375B643137K5516K2248J8846J4646R501M310j19m347r532j5677k1638k6898
53363B659993l2085l7538m2424m5886m8223n0236n1984n2891n2718n1880n0883
53352B143245m9852m8542m6743m4632m2713m1164l9605l7907l6874l7343l8817
53341A679053l9862l9804l9053l7821l5700l2804l0161k8320k6597k4343k2114
$$ plain form
53419 1006033 1017813 1031706 1047608 1064798 1082466 1100527 1119741 1140874 1164081 1189260 1216426
53408 1216426 1245360 1275396 1306170 1338199 1372117 1407680 1444221 1481883 1521590 1563760 1607786
53397 1607786 1653014 1699660 1748399 1799390 1852007 1905385 1958965 2012600 2066322 2120068 2173584
53386 2173584 2226504 2278400 2328763 2377111 2423190 2466935 2508194 2546653 2582051 2614252 2643137
53375 2643137 2668653 2690901 2709747 2724393 2733894 2738204 2738085 2733738 2724206 2708529 2686891 2659993
53363 2659993 2627908 2590370 2547946 2502060 2453837 2403601 2351617 2298726 2246008 2194128 2143245
53352 2143245 2093393 2044851 1998108 1953476 1910763 1869599 1829994 1792087 1755213 1717870 1679053
53341 1679053 1639191 1599387 1560334 1522513 1486813 1454009 1423848 1395528 1368931 1344588 1322474
53330A322474k0647j9534j7804j5512j3715j3117j3480j4242j5033j5649j5934
53319A147807j5700j4665j2781j0710r394q791p688n360k736j237q86m50Q63K629
53305A060901M082M995N673O650Q364J0725J3008J4615J5783J7202J9056K0939
53293A201993K2526K3837K4926K5819K6622K7249K7161K5990K4290K3055K2419
53282A475887K1495J9600J7053J4526J2132R598O929M352J794j077m228p043q985
53269A562033j0279j1708j3732j6081j8215j9901k1172k1997k2414k2867k3932
53258A359735k5569k6947k7271k6635k5960k6122k7123k7985k7628k5979k4132
53247A068384k3153k3039k3134k3191k3414k3725k3701k3301k2838k2267k1196
$$ plain form
53330 1322474 1301827 1282293 1264489 1248977 1235262 1222145 1208665 1194423 1179390 1163741 1147807
53319 1147807 1132107 1117442 1104661 1093951 1084557 1075766 1068078 1062718 1059982 1058745 1057859 1057409 1058272 1060901
53305 1060901 1064983 1069978 1075651 1082301 1090665 1101390 1114398 1129013 1144796 1161998 1181054 1201993
53293 1201993 1224519 1248356 1273282 1299101 1325723 1352972 1380133 1406123 1430413 1453468 1475887
53282 1475887 1497382 1516982 1534035 1548561 1560693 1570291 1577220 1581572 1583366 1582289 1578061 1571018 1562033
53269 1562033 1551754 1540046 1526314 1510233 1492018 1472117 1450945 1428948 1406534 1383667 1359735
53258 1359735 1334166 1307219 1279948 1253313 1227353 1201231 1174108 1146123 1118495 1092516 1068384
53247 1068384 1045231 1022192 999058 975867 952453 928728 905027 881726 858888 836621 815425
53236H15425j9683j8375j7649j7271j6977j6605j5543j3146r989p747p242p583
53224F47615p792q229r561j1219j2070j2026j1884j1949j1931j1870j2175j2728
53212E14181j2930j2588j1998j1261j0225r074q245p770p367p065p071p188o997
53199C94402o613o489o565o378n972n931o392o757o507n746m759l736l003k907
53185C16647l189l051k162j159q94j538k544l116k705j437j78K64J6k05k01m62
53169B94086j096j341n69O83J167K70j360k473k421j775j631k236k662k050q98
53154B75694m16r22j575j639j295j065j099j225j229q71j27N51O75M63N03P42
53138B67165M98l23q99o35PK85J32q1k14k71j21K33M67M00K74K16m3n68p64j58
$$ plain form
53236 815425 795742 777367 759718 742447 725470 708865 693322 680176 670187 662440 655198 647615
53224 647615 639823 631594 622033 610814 598744 586718 574834 562885 550954 539084 526909 514181
53212 514181 501251 488663 476665 465404 455179 446105 437860 430090 422723 415658 408587 401399 394402
53199 394402 387789 381300 374735 368357 362385 356454 350062 343305 336798 331052 326293 322557 319554 316647
53185 316647 313458 310407 308245 307086 306192 304654 302110 298994 296289 294852 294674 294938 294954 294749 294548 294086
53169 294086 292990 291649 291080 291763 292930 293200 291840 289367 286946 285171 283540 281304 278642 276592 275694
53154 275694 275278 274356 272781 271142 269847 268782 267683 266458 265229 264358 264231 264782 265457 265920 266423 267165
53138 267165 267663 267340 266441 265806 265813 266098 266230 266149 265935 265664 265543 265776 266243 266643 266917 267133 267090 266522 265758 265600
53118B65600Q29J403J390J094N81k23q87p87n8L99K2p85j305j330j171j207j540
53101B62025j912j849j165l90l06r92j632j494p95k90k38k26O2L73L62K42M82
53084B52257J109J645J740J483R80J40q72j395r95j60K30J6j25K92R34J154P34
53067B59167ln65o47m11l49o60q68m70J55J36o20j155p57J69Q16J022J112J156
53049B57228J024Q33Q16Q86P88N51L05o8o86j197j147p66p57j288j746j642j233
53032B51901r81q78p06n82p54j023q98l42P7mj70J89R71J412J076L56j07j26J10
53013B49521M98R56J143P03j49o97m63L57J258J867J996J650J086O49L27j41o74
52996B59887p37j16O12P67M44K59M58P06O88M47J51k0J83Q41J509J557J026P25
$$ plain form
53118 265600 266429 267832 269222 270316 270897 270674 269787 269000 268942 269341 269363 268578 267273 265943 264772 263565 262025
53101 262025 260113 258264 257099 256709 256403 255411 253779 252285 251490 251200 250962 250736 250798 251171 251533 251775 252257
53084 252257 253366 255011 256751 258234 259214 259354 258482 257087 256092 255932 256162 256178 256053 256345 257279 258433 259167
53067 259167 259164 258599 257952 257541 257192 256532 255664 255194 255349 255485 254865 253710 252953 253122 253938 254960 256072 257228
53049 257228 258252 259085 259901 260787 261575 262126 262431 262363 261677 260480 259333 258567 257810 256522 254776 253134 251901
53032 251901 250920 250042 249336 248754 248000 246977 246079 245737 245814 245810 245640 245829 246800 248212 249288 249644 249537 249411 249521
53013 249521 250019 250975 252118 252821 252672 251975 251512 251869 253127 254994 256990 258640 259726 260375 260702 260561 259887
52996 259887 259150 259034 259646 260413 260857 261116 261574 262280 262968 263415 263566 263546 263729 264570 266079 267636 268662 269387
52978B69387J216K093K588K504K135J563P20N1K89J318J963J424M38L62J303K020
52962B91374J612N49k70o55q76r19o93o45j337k483l055k497j374o67p94j450
52946B75820k070k201j744r60j94M23R11J227J341J394J480J386R24M37M15P34
52930B79323P43K17l58o28r09j554k243k321j624o70j45l62j017j415j146o13
52914B65278n04p96q15l72j50o58j387j518r98l41J45L98J92n71j394j585j067
52897B53857l23K83O58O51K46r3R8N44O03L42M27R13R85K32n69n48L5K49j60n88
52877B57842n70l07j59j19L5L34N51M14p0m09L9J315K565K888K408K054K222K253
52859B73286J541O14M34R37J003J9j277j860j702j527j666j889k144k712l516
$$ plain form
52978 269387 270603 272696 275284 277788 279923 281486 282206 282257 282546 283864 285827 287251 287689 288051 289354 291374
52962 291374 292986 293535 293265 292610 291734 290815 290122 289477 288140 285657 282602 280105 278731 278064 277270 275820
52946 275820 273750 271549 269805 268845 268651 269074 269985 271212 272553 273947 275427 276813 277737 278174 278589 279323
52930 279323 280066 280283 279925 279297 278388 276834 274591 272270 270646 269976 269831 269469 268452 267037 265891 265278
52914 265278 264774 263978 263163 262791 262641 261983 260596 259078 258080 257739 257884 258282 258474 257903 256509 254924 253857
52897 253857 253534 253817 254475 255126 255372 255279 255377 255921 256524 256866 257293 258206 259191 259423 258854 258306 258341 258590 258430 257842
52877 257842 257272 256965 256806 256687 256722 257056 257607 258021 257951 257542 257581 258896 261461 264349 266757 268811 271033 273286
52859 273286 274827 275441 275875 276812 277815 277834 276557 274697 272995 271468 269802 267913 265769 263057 259541
52844B59541l903l481k679k155j950j613r69l53j63m42r32j305j343j025n06O1
52828B36783N79R59J143J150R63L78p31j930k385j711m70M57P28O15M93O29J206
52811B38856K155K922K886K016R80M96P19J208J325O96n06j692k309k247j784
52796B45721j355j312j701k070j832j007l02k61n95p34p24r64j356j293n69K83
52780B29929P14P05N35M01M62Q78J507J927J929J741J568J248O07j58p42j110
52764B42141j379j511j412j111n89K65J226J571Q69k10m81K89J088R85K11l21
52748B41631k36Q7J97K3k74m44j33Q57K126K852K642J993J688J888K063J714R31
52731B59605K73K34Q17J493J667J318J072J415J988J925Q63o98j979k522k238
$$ plain form
52844 259541 255638 252157 249478 247323 245373 243760 242791 242438 242275 241833 240901 239596 238253 237228 236722 236783
52828 236783 237362 238321 239464 240614 241577 241955 241224 239294 236909 235198 234728 235185 235913 236528 237021 237650 238856
52811 238856 241011 243933 246819 248835 249815 250311 251030 252238 253563 254259 253753 252061 249752 247505 245721
52796 245721 244366 243054 241353 239283 237451 236444 236142 235881 235286 234552 233828 232864 231508 230215 229646 229929
52780 229929 230643 231348 231883 232284 232746 233624 235131 237058 238987 240728 242296 243544 244151 243993 243251 242141
52764 242141 240762 239251 237839 236728 236139 236404 237630 239201 240070 239860 239379 239668 240756 241741 241952 241631
52748 241631 241395 241482 241679 241702 241428 240984 240851 241708 243834 246686 249328 251321 253009 254897 256960 258674 259605
52731 259605 259878 260112 260929 262422 264089 265407 266479 267894 269882 271807 272670 271972 269993 267471 265233
52716B65233j377n99n99j313j880j689j125q48p70l51K89L71l58j166j318r77
52700B51523p03n25o9O96J344J580J474J129N55pr6M32J085J280J064J009J434
52683B63205J954J905J082r4j011j394j323r88n22j01N8q9l14l67l10l75n83o73
52665B60060m32L4M50N74K83l15p69n66K67J155J701K071K404K333J669J130J534
52648B73583K404K325Q54q29j574j650j871k165j906j139m74l5N02J015J000O14
52632B70654O57J344J873J590Q80N05O50J011J319J363Q92l6r39j489j852k213
52616B76209k287j780r65m04k87l52l45j84J21M46N94N51M78L18j88q72r97j77
52598B69879R03J250Q06L93N75J155J700K003J876J097j82j232j302l24J052K057
$$ plain form
52716 265233 263856 263257 262658 261345 259465 257776 256651 255803 255033 254682 254971 255342 254984 253818 252500 251523
52700 251523 250820 250295 250226 250922 252266 253846 255320 256449 257004 256997 256901 257333 258418 259698 260762 261771 263205
52683 263205 265159 267064 268146 268052 267041 265647 264324 263336 262814 262713 262771 262682 262368 262001 261691 261316 260733 260060
52665 260060 259628 259662 260112 260686 260969 260654 259885 259319 259586 260741 262442 264513 266917 269250 270919 272049 273583
52648 273583 275987 278312 279166 278337 276763 275113 273242 271077 269171 268032 267558 267523 268025 269040 270040 270654
52632 270654 271311 272655 274528 276118 276998 277503 278153 279164 280483 281846 282738 282702 281763 280274 278422 276209
52616 276209 273922 272142 271177 270773 270486 270134 269789 269605 269726 270172 270766 271317 271795 272113 271925 271053 270056 269879
52598 269879 270782 272032 272838 273231 273806 274961 276661 278664 280540 281637 281455 280223 278921 278597 279649 281706
52582B81706K393K299K114J895J512R81M18k11r79j586j555r72n62p60j059p63
52566B84871MM98L42j44n46p67q27o60k08M02Q55P68N3q37j214q94l90k03l00
52547B80803m13m70m21j32K61L11l2j28L94R41Q06K80J30L27K10k96n77m25k90
52528B81279l68k92L9J83k1r1K45M92J66l90n07j22K64L33K41L27Q49J806K846
52509B87279L488L552L311L036K699K113J197m7j456k619l168l228l252l309l013
52494B86583k221j411j027q97o13k25j56n18q58o28J71R00Q82J58n24m98J86J065
52476B80369J784K087J738J013Q23J617K456K125R91O22J498K345K174J721K100
52461C05463K998L280K703J955J378P02p3n73q53j519k778l983m374l844k892
$$ plain form
52582 281706 284099 286398 288512 290407 291919 292900 293318 293107 292128 290542 288987 288015 287453 286693 285634 284871
52566 284871 284875 285373 285715 285571 285025 284258 283431 282771 282563 282965 283820 284588 284641 283804 282590 281696 281306 281103 280803
52547 280803 280390 279920 279499 279367 279628 279939 279907 279779 280173 281114 281920 282200 282330 282657 282867 282571 281994 281569 281279
52528 281279 280911 280619 280658 280841 280820 280729 280974 281466 281632 281242 280735 280613 280877 281210 281451 281778 282627 284433 287279
52509 287279 290767 294319 297630 300666 303365 305478 306675 306628 305172 302553 299385 296157 292905 289596 286583
52494 286583 284362 282951 281924 281027 280414 280189 280033 279515 278657 278029 278200 279100 279982 280140 279616 279118 279304 280369
52476 280369 282153 284240 285978 286991 287814 289431 291887 294012 295003 295625 297123 299468 301642 303363 305463
52461 305463 308461 311741 314444 316399 317777 318479 318406 317833 316980 315461 312683 308700 304326 300482 297590
52446B97590k172k139k702l091k504j043K46M82j25o51n52j57l7j68J1O68J082
52429B84738M70q02j470q74K24O55J93m41n52J1R04J519J390P72N81J286K173
52412B90777K299J901K139L518N252O407O979P570Q461R385R901R580Q048N252
52398C77469J694j822m758o989q509r119q573p037n243l978l388k898j893m23
52384C14533Q82J430J116L13m06n96j43Q09K058L357M270M373L810L315L401L754
52368C46276L752L347L041L070L103K748J979R69j24j047j433j173o17k30j32
52353C63529j50j97l28m44j65P76K132L256L718L645L398L053K484J885J902K946
52337C91440M551N743O085O126O703P955R282J0222J0974J1924J2926J3530J3831
$$ plain form
52446 297590 295418 293279 290577 287486 284982 283939 284185 284667 284542 283891 283339 283182 283145 282977 282988 283656 284738
52429 284738 285208 284406 282936 282062 282286 282941 283134 282693 282141 282152 283056 284575 285965 286737 287318 288604 290777
52412 290777 293076 294977 297116 300634 305886 312293 319272 326842 335303 344688 354589 364169 372217 377469
52398 377469 379163 377341 372583 365594 357085 347966 339393 332356 327113 323135 319747 316849 314956 314533
52384 314533 315415 316845 317961 318274 317868 317272 317129 317938 319996 323353 327623 331996 335806 339121 342522 346276
52368 346276 350028 353375 356416 359486 362589 365337 367316 368285 368161 367114 365681 364508 363891 363661 363529
52353 363529 363379 363182 362854 362410 362245 363021 365153 368409 372127 375772 379170 382223 384707 386592 388494 391440
52337 391440 395991 401734 407819 413945 420648 428603 437885 448107 459081 471005 483931 497461 511292
52324E11292J4518J5869J7182J7642J7343J7037J7122J7418J7716J7958J7960
52313F99057J7571J7148J7251J7806J8123J7899J7613J7707J7944J7818J7153
52302H93090J6070J4847J4026J4060J4479J4012J1926Q889O081L954K262P77o43
52289A013830k299m298o126p108p225p027o859o646o260n706m934l853k504j039
52275I41946M26J778K985M245N757P239Q185Q700R539J0994J2394J3090J3267
52262A040545J3314J3075J2468J2156J2734J3718J4207J4149J4109J4140J3874
52251A188489J3429J3133J2577J0978Q466N946L728J356j135k952l796m331n068
52238A240820n693n917o116o610p015o893o447o138o044o019o027o050n964n660
$$ plain form
52324 511292 525810 541679 558861 576503 593846 610883 628005 645423 663139 681097 699057
52313 699057 716628 733776 751027 768833 786956 804855 822468 840175 858119 875937 893090
52302 893090 909160 924007 938033 952093 966572 980584 992510 1001399 1007480 1011434 1013696 1014473 1013830
52289 1013830 1011531 1007233 1001107 993999 986774 979747 972888 966242 959982 954276 949342 945489 942985 941946
52275 941946 942372 944150 947135 951380 957137 964376 972561 981261 990800 1001794 1014188 1027278 1040545
52262 1040545 1053859 1066934 1079402 1091558 1104292 1118010 1132217 1146366 1160475 1174615 1188489
52251 1188489 1201918 1215051 1227628 1238606 1247072 1253018 1256746 1258102 1256967 1254015 1250219 1245888 1240820
52238 1240820 1235127 1229210 1223094 1216484 1209469 1202576 1196129 1189991 1183947 1177928 1171901 1165851 1159887 1154227
52224A154227m945l425j159P27R83n7p14j01J001J702K282L229M137M430M449
52209A166766M889N793O838P926Q713Q355O753N395N742P240Q080P688P128P208
52195A264514P490P443P366P668Q063Q027P463O546N342L905K423R74n24k047
52181A334653l447m754o094p348q288r035r835j0466j0428r827r326r044q239
52168A228522o454m324k766j881j193m84J60Q54J738K493K606K128J594J180M97
52153A224670o32j724k206k106j841j642j472j297j055n18L61J015P19m33j432
52138A210407j544j196j308k000k510k186j034P03K877N176P086Q456R759J1453
52124A244139J3447J5445J7507J9820K2182K4146K5522K6336K6412K5552K4121
$$ plain form
52224 1154227 1149282 1145857 1144698 1145425 1146408 1146351 1145637 1145536 1146537 1148239 1150521 1153750 1157887 1162317 1166766
52209 1166766 1171655 1177448 1184286 1192212 1200925 1209280 1216033 1221428 1227170 1234410 1242490 1250178 1257306 1264514
52195 1264514 1272004 1279447 1286813 1294481 1302544 1310571 1318034 1324580 1329922 1333827 1336250 1337224 1336700 1334653
52181 1334653 1331206 1326452 1320358 1313010 1304722 1295687 1285852 1275386 1264958 1255131 1245805 1236761 1228522
52168 1228522 1222068 1217744 1214978 1213097 1211904 1211420 1211580 1212434 1214172 1216665 1219271 1221399 1222993 1224173 1224670
52153 1224670 1224038 1222314 1220108 1218002 1216161 1214519 1213047 1211750 1210695 1210177 1210538 1211553 1212272 1211839 1210407
52138 1210407 1208863 1207667 1206359 1204359 1201849 1199663 1198629 1199332 1202209 1207385 1214471 1222927 1232686 1244139
52124 1244139 1257586 1273031 1290538 1310358 1332540 1356686 1382208 1408544 1434956 1460508 1484629
52113A484629K2955K2552K2612K2438K1474J9462J6568J3617J1770J1552J2280
52102A681909J2739J2344J1395J0337R178P795O322M891L121M02l237o884r683
52089A740629j1735j3699j5751j7366j8094j7970j7109j5438j3106j0655q448
52078A581258o270l879j595R6J260K362L584M813O148P815R674J1277J2512J3640
52064A642695J4647J5128J4970J4604J4318J3820J2843J1743J0947J0170Q788
52053A784673O812M953L625K436P85j485m202p232j0359j3088j5032j6422j7794
52040A717670j9183j9999j9879j9275j8910j8895j8718j7921j6475j4626j2775
52029A521014j1466j1058j1295j1499j1387j1323j1615j1948j1802j1169j0482
$$ plain form
52113 1484629 1507584 1530136 1552748 1575186 1596660 1616122 1632690 1646307 1658077 1669629 1681909
52102 1681909 1694648 1706992 1718387 1728724 1737902 1745697 1752019 1756910 1760031 1760433 1757196 1750312 1740629
52089 1740629 1728894 1715195 1699444 1682078 1663984 1646014 1628905 1613467 1600361 1589706 1581258
52078 1581258 1574988 1571109 1569514 1569610 1570870 1573232 1576816 1581629 1587777 1595592 1605266 1616543 1629055 1642695
52064 1642695 1657342 1672470 1687440 1702044 1716362 1730182 1743025 1754768 1765715 1775885 1784673
52053 1784673 1791485 1796438 1800063 1802499 1803284 1801799 1797597 1790365 1780006 1766918 1751886 1735464 1717670
52040 1717670 1698487 1678488 1658609 1639334 1620424 1601529 1582811 1564890 1548415 1533789 1521014
52029 1521014 1509548 1498490 1487195 1475696 1464309 1452986 1441371 1429423 1417621 1406452 1395970
52018A395970j0051r869r907j0210j0714j1118j1092j0533r790r621j0669j2767
52006A269629j5004j6722j8139j9755k1443k2650k3271k3736k4220k4271k3424
51995A036994k1812j9984j8462j7511j7083j6817j6363j5830j5653j5944j6300
51984H45235j6371j6327j6466j6667j6488j5748j4769j4054j3877j4097j4251
51973F76120j3843j2689j0959q937o850m911l293j906l86J534L680N596O888P374
51959F37418O919N478L327J111n34j525k390l716n432o740o865n836m484l612
51945F13119l220k592j041J393M016O208P949R561J1054J2028J2178J1600J0476
51932F92729Q825O710M357J849r96m138p093r502j1623j3762j5578j6517j6733
$$ plain form
52018 1395970 1385919 1376050 1366143 1355933 1345219 1334101 1323009 1312476 1302686 1293065 1282396 1269629
52006 1269629 1254625 1237903 1219764 1200009 1178566 1155916 1132645 1108909 1084689 1060418 1036994
51995 1036994 1015182 995198 976736 959225 942142 925325 908962 893132 877479 861535 845235
51984 845235 828864 812537 796071 779404 762916 747168 732399 718345 704468 690371 676120
51973 676120 662277 649588 638629 629692 622842 617931 614638 612732 612346 613880 617560 623156 630044 637418
51959 637418 644337 649815 653142 654253 653719 652194 649804 646088 640656 633916 627051 621215 616731 613119
51945 613119 609899 607307 606266 607659 611675 617883 625832 635393 646447 658475 670653 682253 692729
51932 692729 701554 708264 712621 714470 713474 709336 702243 692741 681118 667356 651778 635261 618528
51919F18528j6840j6872j6203j4636j2823j1343j0010q403o595m980l690k489
51907D93644j078P29K796M639N897O864Q052R205R465Q652P607O889N922M022
51893E73305J552o21k238l427l819k918j132M30J210J497J548J186K75j002k432
51878E63414l721m197l301j443K70J263J879K462K808K650J996P36j345l862n829
51863E53780o732p081p472p791p684p209o443n029k803m31J205J980K301K278
51849E02869J741P67l97j715l077l975m168m328n229o418o639n571m257l596l285
51834D52722k594j453k49Q93K102L249L946L875K988J561J65p21j201j746k377
51819D61160k584k187j771j809j892j316j78P10Q53N66M64P79J161R70j18j645
$$ plain form
51919 618528 601688 584816 568613 553977 541154 529811 519801 511398 504803 499823 496133 493644
51907 493644 492566 493295 496091 500730 506627 513491 521543 530748 540213 548865 556472 563361 569283 573305
51893 573305 574857 574236 571998 568571 564752 561834 560702 561132 562342 563839 565387 566573 566848 565846 563414
51878 563414 559693 555496 552195 550752 551022 552285 554164 556626 559434 562084 564080 564816 563471 559609 553780
51863 553780 547048 539967 532495 524704 517020 509811 503368 498339 495536 495105 496310 498290 500591 502869
51849 502869 504610 505377 504980 503265 500188 496213 492045 487717 482488 476070 469431 463860 459603 456007 452722
51834 452722 450128 448675 448426 449319 451421 454670 458616 462491 465479 467040 467205 466484 465283 463537 461160
51819 461160 458576 456389 454618 452809 450917 449601 449423 450133 450986 451552 452016 452795 453956 454926 454808 453163
51803D53163k679k815k570k516k388j557j75Q02P70J39l59n62q39j455k271l000
51787D31688l454l448k705j148O20J442O66r38j824j396o26o48j214j128J12J769
51771D17768K942L538M088N046O466Q013R135R491R256Q736P741N760K851j04
51757E00727k340m021n801p762r203r488q828q008p498p003o003m553l215k257
51743D14747j349k31Q27J615K618M421O727Q597R610J0130J0496J0569J0173R308
51729D98258P861N812L872L064L311L315K267R59M37L29o18k686m907o420p183
51714E07671p332o756n566m359l607l289l205l275l270k760j641l32Q04J903L076
51699D68062L742L052R78j358k649k529j684r83o99m91l8N10O34l4j402l067m651
$$ plain form
51803 453163 450484 447669 445099 442583 440195 438638 438463 439265 440035 440174 439815 439253 438414 436959 434688 431688
51787 431688 428234 424786 422081 420933 421553 422995 423661 422723 420899 419503 418877 418229 417015 415887 415999 417768
51771 417768 420710 424248 428336 433382 439848 447861 456996 466487 475743 484479 492220 497980 500831 500727
51757 500727 498387 494366 488565 480803 471600 462112 453284 445276 437778 430775 424772 420219 417004 414747
51743 414747 413398 413167 413994 415609 418227 422648 429375 437972 447582 457712 468208 478777 488950 498258
51729 498258 506119 511931 515803 518867 522178 525493 527760 528719 529156 529485 528867 526181 521274 514854 507671
51714 507671 500339 493583 488017 483658 480051 476762 473557 470282 467012 464252 462611 462279 463083 464986 468062
51699 468062 471804 474856 475834 474476 471827 469298 467614 466631 465932 465441 465403 465913 466547 466513 465111 462044 457393
51682D57393n951o731o574n235l169j401n25p0Q14K155L142L260K934K846L174
51667D46062L733M487N484O547P392P815P536O151L626O25j990l848m980n376
51653D83264m962l845k151J33K784N031O077N768M391K014j344n094q217j0101
51639D73748j0779j0480r456q184p119o168m972l703k947k723k317j336k53M04
51625D03715P69J145J432J519J696K108K237J565M98p9M0K49L3o17j613k915m104
51608D07678m431l662k497j796j656j460o77P13K391L962N111N803O440P545R202
51593D32666J0854J1851J1989J1353R794P021L300l23k842m134m668m614l662
51580D78585j672R49L648O130Q241R824J0994J2236J3869J5564J6738J7311J7763
$$ plain form
51682 457393 451442 444711 438137 432902 429733 428332 427807 427737 428551 430706 433848 437108 440042 442888 446062
51667 446062 449795 454282 459766 466313 473705 481520 489056 495207 498833 499458 497468 493620 488640 483264
51653 483264 478302 474457 472306 472439 475223 480254 486331 492099 496490 498504 497160 492066 483849 473748
51639 473748 462969 452489 443033 434849 427730 421562 416590 412887 409940 407217 404900 403564 403311 403715
51625 403715 404484 405629 407061 408580 410276 412384 414621 416186 416684 416605 416645 416894 416927 416310 414697 411782 407678
51608 407678 403247 399585 397088 395292 393636 392176 391499 392212 394603 398565 403676 409479 415919 423464 432666
51593 432666 443520 455371 467360 478713 488507 495528 498828 498505 495663 491529 486861 482247 478585
51580 478585 476913 477862 481510 487640 495881 505705 516699 528935 542804 558368 575106 592417 610180
51567F10180J8448J9201J9709J9891J9850J9694J9706K0577K3101K7453L2781
51556H50591L7569M0429M0713L8529L4236K7863J9121Q183l620j4330k2841k9577
51544A026866l5375m0093m2874m3579m3139m2317m0790l7914l3851k9416k5251
51533F12267k1585j8540j6111j4058j2246j0893j0037r112p610n906m786m326
51521D77057l986l667l806m360m590m136l548l358l303k947k535k547k786k603
51507D28885j923j446j746k560l122l024k559k216j972j337j89Q16J042P57P93
51492D10199J415K164K755L453M376N122N289M910M141L052J967J325R44qj867
51477D49237l865n089n505n564n372m888m509m698n295n740n788n548n064m416
$$ plain form
51567 610180 628628 647829 667538 687429 707279 726973 746679 767256 790357 817810 850591
51556 850591 888160 928589 969302 1007831 1042067 1069930 1089051 1097234 1093614 1079284 1056443 1026866
51544 1026866 991491 951398 908524 864945 821806 779489 738699 700785 666934 637518 612267
51533 612267 590682 572142 556031 541973 529727 518834 508797 499685 492075 486169 481383 477057
51521 477057 473071 469404 465598 461238 456648 452512 448964 445606 442303 439356 436821 434274 431488 428885
51507 428885 426962 425516 423770 421210 418088 415064 412505 410289 408317 406980 406791 407607 408649 409406 410199
51492 410199 411614 413778 416533 419986 424362 429484 434773 439683 443824 446876 448843 450168 451112 451104 449237
51477 449237 445372 440283 434778 429214 423842 418954 414445 409747 404452 398712 392924 387376 382312 377896
51463C77896l934l758l476k765k007j734j721j415q85n57j64R80K675L774L747
51448C66656L464M097N825Q054J0270J2169J3473J4173J4673J5220J5309J4062
51436D97445J1155P154L080k26k386l461l755l690l821m732o565q680j0096j0377
51422D61045r857r034q013o706n194l767k707k131j983k023k010j851j527r15
51408D03327O0J124J811J966J898J990K321K696K856K683K341K224K559L133L637
51393D36626M202N236O816Q587J0306J2109J4153J6327J8547K1075K4281K8158
51381F06423L2301L6335M0366M4804M9632N3882N6203N6201N4786N2760M9334
51370A133027M2735L2305J9436O271o038j7509k8307l8045m6011n1784n5501n7573
$$ plain form
51463 377896 373962 370204 366728 363963 361956 360222 358501 357086 356201 355644 355480 356460 359135 362909 366656
51448 366656 370120 374217 380042 388096 398366 410535 424008 438181 452854 468074 483383 497445
51436 497445 508600 515754 518834 518608 516222 512761 509006 505316 501495 496763 490198 481518 471422 461045
51422 461045 451188 442154 434141 427435 422241 418474 415767 413636 411653 409630 407620 405769 404242 403327
51408 403327 403387 404511 406322 408288 410186 412176 414497 417193 420049 422732 425073 427297 429856 432989 436626
51393 436626 440828 446064 452880 461467 471773 483882 498035 514362 532909 553984 578265 606423
51381 606423 638724 675059 715425 760229 809861 863743 919946 976147 1030933 1083693 1133027
51370 1133027 1175762 1208067 1227503 1233774 1227736 1210227 1181920 1143875 1097864 1046080 990579 933006
51358I33006n8151n7001n4018m9719m4955m0265l5755l1417k7213k2981j8708
51347D92823j4904j2194j0547r353q268p415o752n830m511l333k788k661k452
51334D01815k111j928j943j896j661j366j155j069j082j078q47l02L32O79M85
51319C86873j94j029j626j868j985k113j989j380p06o96j377j905j570o29Q9O5
51303C67960n42j131j093l37O20J185J294J135N58o62k009k523j946r28R7J342
51287C63020K750L591L587L552M232N156N383M832M091L412K705K116J744J128
51273D11299j00j353j788j598j660k041j896r06J58O06O36P01P84O80L76j22q69
51256D02907j608j876j731j818k446l095l188k837k481k177j731j221q93p17l54
$$ plain form
51358 933006 874855 817854 763836 714117 669162 628897 593142 561725 534512 511531 492823
51347 492823 477919 465725 455178 445825 437557 430142 423390 417560 413049 409716 406928 404267 401815
51334 401815 399704 397776 395833 393937 392276 390910 389755 388686 387604 386526 385679 385377 385709 386388 386873
51319 386873 386679 385650 384024 382156 380171 378058 376069 374689 373983 373287 371910 370005 368435 367806 367895 367960
51303 367960 367418 366287 365194 364857 365477 366662 367956 369091 369649 368987 366978 364455 362509 361581 361678 363020
51287 363020 365770 369361 372948 376500 380732 385888 391271 396103 400194 403606 406311 408427 410171 411299
51273 411299 411199 409846 408058 406460 404800 402759 400863 399957 400115 400721 401357 402058 402842 403522 403898 403776 402907
51256 402907 401299 399423 397692 395874 393428 390333 387145 384308 381827 379650 377919 376698 375805 375088 374734
51241C74734M26J430K103J884P02q72k168k972l246k633q77J251K270J590J70
51226C73792o60n51JN01P05N14J54P3K92K71j41k17N94J621J788J144O67P05O33
51207C81886J41q1N89J737K508K728K850L114L284L072K472J659Q39J79l20p43
51191D05914j039r82n44m4K42M52P96J095J048Q11Q25J047Q45q4j208j850k064
51174D05260k349k785k993k816k479k041j307m11O2r5l23o4N89J396K584M203
51158C96431N300M741K756Q11j74n76r25j026o92m34o48p96k82L49Q3j017j870
51141D02031j933j724j675j407n03O67J404J464J021L33j81l4P23J344J294J010
51125D03834J247J943K285J801Q45M5k48MN61R11P00K22Q3L73N98N18M72P07Q79
$$ plain form
51241 374734 375160 376590 378693 380577 381279 380407 378239 375267 372021 369388 368511 369762 372032 373622 373792
51226 373792 373132 372581 372582 373083 373788 374302 374456 374529 374821 375092 374951 374734 375328 376949 378737 379881 380548 381253 381886
51207 381886 382027 381946 382535 384272 386780 389508 392358 395472 398756 401828 404300 405959 406798 406977 406657 405914
51191 405914 404875 403893 403349 403305 403547 403999 404795 405890 406938 407749 408574 409621 410466 410382 409174 407324 405260
51174 405260 402911 400126 397133 394317 391838 389797 388490 388079 388141 388046 387723 387659 388248 389644 392228 396431
51158 396431 401731 406472 409228 410039 409865 409289 408364 407338 406646 406212 405564 404768 404486 404835 404918 403901 402031
51141 402031 400098 398374 396699 395292 394789 395456 396860 398324 399345 399678 399497 399463 400186 401530 402824 403834
51125 403834 405081 407024 409309 411110 411955 412000 411752 411756 412317 413228 413928 414150 414233 414606 415204 415722 416194 416901 417780
51106D17780O87M80P67J402J781J727J664J954K524L136L624L828L640L224K820
51091D51038K307J327nr42r00j53M69M55q6p45j193j268j033p91q93j351j697
51074D44539j329j52J139J700J521J512K350L530M131M227M809O276P854Q816
51060D90923R486J0434J1382J1717J1601J1593J1396J0072P654N638N451P012
51048F04359R234J1312J2974J3871J3518J1931R831Q009O568M887K405o63l409
51035G04827n195o266p283q487r718j1135j3204j5812j8004j8915j8515j7066
51023E55227j4387j0389o034k905j625j196k49J451K987L563L391L388M222N742
51009E43186P217Q021Q122P961P973Q210Q456Q601Q796R214R786J0354J0994J1911
$$ plain form
51106 417780 418467 418947 419714 421116 422897 424624 426288 428242 430766 433902 437526 441354 444994 448218 451038
51091 451038 453345 454672 454667 453725 452825 452672 453141 453596 453510 452765 451572 450304 449271 448480 447587 446236 444539
51074 444539 443210 443058 444197 445897 447418 448930 451280 454810 458941 463168 467977 474253 482107 490923
51060 490923 500409 510843 522225 533942 545543 557136 568532 578604 586258 591896 597347 604359
51048 604359 613593 624905 637879 651750 665268 677199 687030 695039 701607 706494 708899 708236 704827
51035 704827 699632 693366 686083 677596 667878 656743 643539 627727 609723 590808 572293 555227
51023 555227 540840 530451 524417 521512 519887 518691 518442 519893 522880 526443 529834 533222 537444 543186
51009 543186 550403 558424 566546 574507 582480 590690 599146 607747 616543 625757 635543 645897 656891 668802
50995F68802J3000J3832J4224J4532J5031J5359J4960J3954J3005J2406J1812
50984H20917J0928R960R254Q931R063R697J0480J0736J0271R705R640R933J0169
50971I49684J0600J2039J4996J9296K4418K9818L5001L9753M4241M8620N2636
50960A281102N5924N8502O0530O1697O1426N9773N7584N5589N3620N0988M7335
50949A904070M3005L8654L4735L1268K8059K5139K2861K1513K1000K1044K1402
50938B212750K1562K0561J7607J2893P413K004l070p735j1990j6222k1030k6489
50926B208254l2080l7578m3467n0056n6655o2163o6210o9144p1038p1384o9915
50915A578564o7177o3989o0588n6638n2034m7306m3135l9587l6054l1953k7477
$$ plain form
50995 668802 681802 695634 709858 724390 739421 754780 769740 783694 796699 809105 820917
50984 820917 831845 841805 851059 859990 869053 878750 889230 899966 910237 919942 929582 939515 949684
50971 949684 960284 972323 987319 1006615 1031033 1060851 1095852 1135605 1179846 1228466 1281102
50960 1281102 1337026 1395528 1456058 1517755 1579181 1638954 1696538 1752127 1805747 1856735 1904070
50949 1904070 1947075 1985729 2020464 2051732 2079791 2104930 2127791 2149304 2170304 2191348 2212750
50938 2212750 2234312 2254873 2272480 2285373 2292786 2294790 2291720 2283985 2271995 2255773 2234743 2208254
50926 2208254 2176174 2138596 2095129 2045073 1988418 1926255 1860045 1790901 1719863 1648479 1578564
50915 1578564 1511387 1447398 1386810 1330172 1278138 1230832 1187697 1148110 1112056 1080103 1052626
50904A052626k3544k1032j9902j9124j7560j5090j2695j1309j0665r784q394p225
50892H76302o733o257n005l302k115j669j275m53O38J797L081M308N013N118N091
50877H74539N235N445N859O998Q904J0735J1757J2246J2919J3938J4965J5910
50865I99450J7001J8337J9848K1572K3623K6064K9018L2612L6607M0560M4624
50854A309316M9697N6267O3655P0966P8236Q5986R4112J02064J09763J17432J24705
50843B262199J30831J35617J39322J41601J41539J38780J33736J26537J16756
50834C466918J04509R0829P6558O1762M6785L3016K1797J3238O942L381L514P265
50822C936514J3273K0147K7201L3823L8894M1166L9837L4444K4627J0386p560
$$ plain form
50904 1052626 1029082 1008050 988148 969024 951464 936374 923679 912370 901705 891921 883527 876302
50892 876302 869569 863312 858307 855005 852890 851221 849946 849493 850131 851928 855009 859317 864330 869448 874539
50877 874539 879774 885219 891078 898076 906980 917715 929472 941718 954637 968575 983540 999450
50865 999450 1016451 1034788 1054636 1076208 1099831 1125895 1154913 1187525 1224132 1264692 1309316
50854 1309316 1359013 1415280 1478935 1549901 1628137 1714123 1808235 1910299 2020062 2137494 2262199
50843 2262199 2393030 2528647 2667969 2809570 2951109 3089889 3223625 3350162 3466918
50834 3466918 3571427 3662256 3738814 3800576 3847361 3880377 3902174 3915412 3922354 3925735 3929249 3936514
50822 3936514 3949787 3969934 3997135 4030958 4069852 4111018 4150855 4185299 4209926 4220312 4212752
50811D212752k7956m9563p1450r2761j12596j30246j45444j58026j67327j72322
50801C085061j72624j68970j62403j53237j41417j27714j13790j00904q9113p7881
50791A777008o6916n6226m5968l6644k8855k2527j6835j1408p052m730m229m504
50779A471114m961n686o629p468q293r623j1534j3314j4378j5002j5859j7122
50767A341245j8408j9396k0168k0959k1829k2624k3121k3104k2358k0795j8691
50756A109792j6619j4884j3066j0562p510m704k480k29K651N843Q629J0895J3051
50743A080807J5321J7691K0376K3723K7699L1983L6503M1366M6396N1257N5959
50732A449081O0721O5292O8988P1458P2961P3894P4474P4795P4703P3589P0910
$$ plain form
50811 4212752 4184796 4135233 4063783 3971022 3858426 3728180 3582736 3424710 3257383 3085061
50801 3085061 2912437 2743467 2581064 2427827 2286410 2158696 2044906 1944002 1854889 1777008
50791 1777008 1710092 1653866 1607898 1571254 1542399 1519872 1503037 1491629 1484577 1479847 1475618 1471114
50779 1471114 1466153 1460467 1453838 1446370 1438077 1428454 1416920 1403606 1389228 1374226 1358367 1341245
50767 1341245 1322837 1303441 1283273 1262314 1240485 1217861 1194740 1171636 1149278 1128483 1109792
50756 1109792 1093173 1078289 1065223 1054661 1047151 1042447 1039967 1039738 1042389 1048232 1056861 1067756 1080807
50743 1080807 1096128 1113819 1134195 1157918 1185617 1217600 1254103 1295469 1341865 1393122 1449081
50732 1449081 1509802 1575094 1644082 1715540 1788501 1862395 1936869 2011664 2086367 2159956 2230866
50721B230866O6909O2210N6801N0036M1689L2251K2138J1431O99q764j5963k0760
50709B529543k3059k2217j7946j1249l714L750J0949J7536K2799K6108K7071K5359
50697B584930K0818J3531L524r278k4364m0264n5355o8766q0106q8700r3798r5298
50685B066874r3715q9563q3330p5858o8033o0070n1608m2490l3021k3562j4396
50674A431228n909J616Q371J4700K0399K4839K7712K9238K9654K9056K7659K5656
50662A664219K2881J9222J5399J2602J1193J0401R481Q553Q025P838P685P524
50650A805023P458P526P937R101J1120J3596J6262J9398K3316K7778L2324L6771
50638B017610M0961M4385M6582M7741M8445M8929M8966M8406M7419M6323M5242
$$ plain form
50721 2230866 2297775 2359985 2416786 2466822 2508511 2540762 2562900 2574331 2575030 2566266 2550303 2529543
50709 2529543 2506484 2484267 2466321 2455072 2451358 2455108 2466057 2483593 2506392 2532500 2559571 2584930
50697 2584930 2605748 2619279 2622803 2613525 2589161 2548897 2493542 2424776 2344670 2255970 2162172 2066874
50685 2066874 1973159 1883596 1800266 1724408 1656375 1596305 1544697 1502207 1469186 1445624 1431228
50674 1431228 1425319 1426935 1435306 1450006 1470405 1495244 1522956 1552194 1581848 1610904 1638563 1664219
50662 1664219 1687100 1706322 1721721 1734323 1745516 1755917 1765398 1773951 1781976 1789814 1797499 1805023
50650 1805023 1812481 1820007 1827944 1837045 1848165 1861761 1878023 1897421 1920737 1948515 1980839 2017610
50638 2017610 2058571 2102956 2149538 2197279 2245724 2294653 2343619 2392025 2439444 2485767 2531009
50627B531009M3850M1317L6825L0362K2433J2706m28j7940l7818n5347o5972o7899
50615B473098o2451n2782m2202l2770k4801j7712j1380o315k827p38j20j606n537
50602B211857j1332j8160k5861l4630m4017n2817n9985o5197o8491o9797o9075
50591A692495o6646o3148n9136n4893n0570m6347m2268l8053l3288k8005k2911
50580A187230j8758j5621j3035j0734q848p308n579l337j043O08J574K467L698
50567A111314N087O331P528R000J0830J2720J4333J5688J7277J9681K2961K6500
50555A279250K9569L1946L3825L5332L6352L6782L6567L5492L3380L0598K7932
50544A647025K5765K3828K2043K1300K2717K6289L0719L4809L8581M2874M8181
$$ plain form
50627 2531009 2574859 2616176 2653001 2683363 2705796 2718502 2718074 2700134 2662316 2606969 2540997 2473098
50615 2473098 2410647 2357865 2315663 2282893 2258092 2240380 2229000 2222685 2219858 2219120 2219000 2217394 2211857
50602 2211857 2200525 2182365 2156504 2121874 2077857 2025040 1965055 1899858 1831367 1761570 1692495
50591 1692495 1625849 1562701 1503565 1448672 1398102 1351755 1309487 1271434 1238146 1210141 1187230
50580 1187230 1168472 1152851 1139816 1129082 1120234 1112926 1107347 1104010 1102967 1103575 1105149 1107616 1111314
50567 1111314 1116401 1122732 1130260 1139260 1150090 1162810 1177143 1192831 1210108 1229789 1252750 1279250
50555 1279250 1308819 1340765 1374590 1409922 1446274 1483056 1519623 1555115 1588495 1619093 1647025
50544 1647025 1672790 1696618 1718661 1739961 1762678 1788967 1819686 1854495 1893076 1935950 1984131
50533A984131N4146O0097O5691P1076P6592Q2416Q8427R4374J00157J05881J11497
50522B894485J16342J19203J19025J15668J09888J02452R3287Q1651O7114N0213
50512C869328L2008J3251n821k4943m3417o0362p5210q7819r8087j05472j08983
50501C304473j07827j02153r2986q1291o7363n1438l4526j8094k895J1195K3939
50490B781034L3995L9934M1454L8943L2150K0263L488j6277l6782n6839p5867
50479B805496r2538j04930j12195j15361j16101j15102j12091j07037j00652r3687
50469A735802q6363p8706p0992o3530n6371m9565m3450l8208l3402k8486k3675
50458A163054j9729j6792j4064j0862p440m455k061O9K168M303O581Q903J0684
$$ plain form
50533 1984131 2038277 2098374 2164065 2235141 2311733 2394149 2482576 2576950 2677107 2782988 2894485
50522 2894485 3010827 3130030 3249055 3364723 3474611 3577063 3670350 3752001 3819115 3869328
50512 3869328 3901336 3914587 3908766 3883823 3840406 3780044 3704834 3617015 3518928 3413456 3304473
50501 3304473 3196646 3094493 3001507 2920216 2852853 2801415 2766889 2748795 2745900 2757095 2781034
50490 2781034 2815029 2854963 2896417 2935360 2967510 2987773 2991261 2974984 2938202 2881363 2805496
50479 2805496 2712958 2608028 2495833 2380472 2264371 2149269 2037178 1930141 1829489 1735802
50469 1735802 1649439 1570733 1499741 1436211 1379840 1330275 1286825 1248617 1215215 1186729 1163054
50458 1163054 1143325 1126533 1112469 1101607 1094167 1089712 1087651 1087720 1089888 1094191 1100772 1109675 1120359
50445A120359J1399J1396J1704J2908J4564J5762J5952J5203J3986J2825J1900
50434A267958J0839R153O924M885L736L561L959M505N027N713O964Q945J1218
50421A353387J3222J5105J7658K1274K5330K9024L2483L6515M1434M6607N1247
50410A683286N5173N8559O1243O2766O2991O2321O1057N8796N4840M9199M2777
50399B313008L6356K9711K2009J2912K875p558j8253k9239m0236n0642n9674o6504
50387B144765p0593p2083p1606o9465o5323n8841n0431m1065l1531k2149j3036
50376A578642m365L583J0340J5287J7982J8435J6887J3433Q004O90q109j7787
50364A653022k7500l6126m2638m6730m8951n0097n0482m9887m8106m5412m2466
$$ plain form
50445 1120359 1131758 1143154 1154858 1167766 1182330 1198092 1214044 1229247 1243233 1256058 1267958
50434 1267958 1278797 1287950 1294874 1299759 1303495 1307056 1311015 1315520 1320547 1326260 1333224 1342169 1353387
50421 1353387 1366609 1381714 1399372 1420646 1445976 1475000 1507483 1543998 1585432 1632039 1683286
50410 1683286 1738459 1797018 1858261 1921027 1984018 2046339 2107396 2166192 2221032 2270231 2313008
50399 2313008 2349364 2379075 2401084 2413996 2416871 2409313 2391060 2361821 2321585 2270943 2211269 2144765
50387 2144765 2074172 2002089 1930483 1861018 1795695 1736854 1686423 1645358 1613827 1591678 1578642
50376 1578642 1574277 1577860 1588200 1603487 1621469 1639904 1656791 1670224 1678228 1678918 1670809 1653022
50364 1653022 1625522 1589396 1546758 1500028 1451077 1400980 1350498 1300611 1252505 1207093 1164627
50353A164627l9854l7713l5797l3832l1722k9500k7095k4293k0902j7123j3710
50342H53086j1481j0465r676p997n278k328M8J607K468K862L225M014N201O272
50328H31558P001P751Q817R944J0842J1796J3280J5268J7403J9540K1529K2735
50316I97464K2511K1042J9103J6893J3766R262L840j567o208r495j0940j0571
50304A065100r133p457n830m150k527j307o66l83L1J074K838M742N911O128O130
50289A060501O731P865Q923R848J1391J4070J7295J9827K1011K1210K0862J9314
50277A238848J4987P053l139j2593j8724k0835j9792j6913j3447j0475q544p300
50265A129126n965m405l344l434m347n052m843l909k991k631k789l001k881k468
$$ plain form
50353 1164627 1124773 1087060 1051263 1017431 985709 956209 929114 904821 883919 866796 853086
50342 853086 841605 831140 821464 813467 808189 805861 805909 807516 809984 812846 816071 820085 825286 831558
50328 831558 838559 846310 855127 865071 875913 887709 900989 916257 933660 953200 974729 997464
50316 997464 1019975 1041017 1060120 1077013 1090779 1100041 1103881 1102314 1096106 1086611 1075671 1065100
50304 1065100 1055967 1048510 1042680 1038530 1036003 1034696 1034030 1033647 1033678 1034752 1037590 1042332 1048243 1054371 1060501
50289 1060501 1067232 1075097 1084020 1093868 1105259 1119329 1136624 1156451 1177462 1198672 1219534 1238848
50277 1238848 1253835 1260888 1257749 1245156 1226432 1205597 1185805 1168892 1155445 1144970 1136426 1129126
50265 1129126 1123161 1118756 1115412 1111978 1107631 1102579 1097736 1093827 1090836 1088205 1085416 1082415 1079534 1077066
50251A077066k121k124k442k743k618j829n05Q63J822K395L040M131N605P182
50237A087722Q752J0418J2215J3964J5354J6207J6674J7282J8532K0276K1613
50226A259009K1728K0847J9967J9630J9310J8231J6435J4665J3387J2407J1391
50215A447007J0302R164P771N777K898j068o112j1774j7364k2610k7848l3146
50203A362997l7588l9841l9415l7014l3567k9403k4494j9248j4712j1907j1058
50192A064750j1543j2674j4474j7448k1432k5011k6497k5532k3384k1561k0444
50181H44750j9334j7534j5111j2715j0928r836r123q528q043p658p091o066m769
50168G08014l778l425l469l388k808j708m71K81K92J52P41K073L191L451L380
$$ plain form
50251 1077066 1074945 1072821 1070379 1067636 1065018 1063189 1062684 1063547 1065369 1067764 1070804 1074935 1080540 1087722
50237 1087722 1096474 1106892 1119107 1133071 1148425 1164632 1181306 1198588 1217120 1237396 1259009
50226 1259009 1280737 1301584 1321551 1341181 1360491 1378722 1395157 1409822 1423209 1435616 1447007
50215 1447007 1457309 1466473 1474244 1480021 1482919 1481851 1475739 1463965 1446601 1423991 1396143 1362997
50203 1362997 1325409 1285568 1246153 1209139 1175572 1146169 1121675 1102427 1087715 1075808 1064750
50192 1064750 1053207 1040533 1026059 1008611 987179 962168 935671 910139 886755 865194 844750
50181 844750 825416 807882 792771 780056 769128 759292 750169 741641 733598 725940 718849 712783 708014
50168 708014 704236 700811 697342 693954 691146 689438 688967 689248 689540 689692 690433 692506 695697 699148 702528
50153G02528L867M915N794O075N891N404M693M056L691L073J502n56j551p63N88
50138G49207Q60L4n49j26Q12J710K788M355O073P397Q294Q981R381R428R621J0653
50122H28919J2522J4541J6279J7990J9997K2179K4326K6713K9880L3986L8618
50111A085950M3181M7285N0774N3552N5495N6477N6494N5702N4300N2449N0467
50100A662126M8918M8161M7716M6447M3554L9074L3242K5800J6331N118o863j8689
50088A990935k9816l9739m7842n3753n7441n8865n7874n4736n0421m5981m1781
50077A452686l7536l2964k8170k3537j9469j6308j4202j3050j2588j2555j2675
50066A229632j2698j2603j2693j3202j3851j4064j3679j3179j3067j3260j3284
$$ plain form
50153 702528 706395 711310 717104 723179 729070 734474 739167 743223 746914 749987 751489 750933 749382 748619 749207
50138 749207 750067 750101 749552 749426 750238 751948 754736 759091 765164 772561 780855 789836 799217 808645 818266 828919
50122 828919 841441 855982 872261 890251 910248 932427 956753 983466 1013346 1047332 1085950
50111 1085950 1129131 1176416 1227190 1280742 1336237 1392714 1449208 1504910 1559210 1611659 1662126
50100 1662126 1711044 1759205 1806921 1853368 1896922 1935996 1969238 1995038 2011369 2016487 2009624 1990935
50088 1990935 1961119 1921380 1873538 1819785 1762344 1703479 1645605 1590869 1540448 1494467 1452686
50077 1452686 1415150 1382186 1354016 1330479 1311010 1294702 1280500 1267450 1254862 1242307 1229632
50066 1229632 1216934 1204331 1191638 1178436 1164585 1150521 1136842 1123663 1110596 1097336 1084052
50055A084052j2897j2241j1466j0565r566q599p608o348m807l338k138q66Q39
50042I94452K731M335N762P514R484J0873J1272J1247J1470J1901J2215J2409
50030A105665J2445J1775J0089Q089O718N764M147J557j141l168m654n924o913
50017A144449p662q647j0046j1314j2038j2606j3506j4450j4853j4685j4163j3076
50005I97403j1175q894o857m814j949J846N822R520J3212J7120K0927K4295K7118
49992A083574K9112K9921K9966L0327L1341L1988L1242K9368K7154K4562K1103
49981A399658J7164J3868J1693J0227R282R094R060P445L125l092r736j6626k4467
49968A436695l2836l9951m4696m7738n0017n1043m9561m5533m0411l5529l0995
$$ plain form
50055 1084052 1071155 1058914 1047448 1036883 1027317 1018718 1011110 1004762 999955 996617 994479 993613 994452
50042 994452 997183 1001518 1007280 1014794 1024278 1035151 1046423 1057670 1069140 1081041 1093256 1105665
50030 1105665 1118110 1129885 1139974 1148063 1154781 1160545 1164692 1166249 1165108 1161940 1157286 1151362 1144449
50017 1144449 1136787 1128140 1118094 1106780 1094742 1082136 1068630 1054180 1039327 1024642 1010479 997403
50005 997403 986228 977334 970477 965663 963714 965560 971382 980902 994114 1011234 1032161 1056456 1083574
49992 1083574 1112686 1142607 1172573 1202900 1234241 1266229 1297471 1326839 1353993 1378555 1399658
49981 1399658 1416822 1430690 1442383 1452610 1461892 1470986 1480046 1487491 1490616 1487524 1477788 1461162 1436695
49968 1436695 1403859 1363908 1319212 1271474 1221457 1170414 1120853 1075320 1034909 999380 968385
49957I68385k6292k1264j6221j1570p599m381j667P95K780L801L890L633L263
49944H97553K355P70p92j721k420l558m929n964o994q932j1706j4186j5827j7325
49930H06324j9181k0637k0668j9314j7290j4960j2518j0527r357q398o724m385
49918F42365k229o47O16J496J535R39P47J575K895L958M718N475O268P220Q814
49903F85745J1128J3227J4122J4028J3963J4236J4139J3134J1602J0102Q521O262
49891H30209L068n96l889o193p636q964j0791j2946j4736j5731j6035j5944j5669
49878G04147j5382j5091j4482j3277j1719j0320r129p745o090m602l510k491j265
49865E89044l3J041K223L665M960N768O502P768R404J0724J1560J2401J3570J4777
$$ plain form
49957 968385 942093 920829 904608 893038 885439 881058 879391 880186 882966 886767 890657 894290 897553
49944 897553 899908 900678 899886 898165 895745 892187 887258 881294 874300 865368 853662 839476 823649 806324
49930 806324 787143 766506 745838 726524 709234 694274 681756 671229 661872 653474 646750 642365
49918 642365 640136 639489 640105 641601 643136 644075 644822 646397 649292 653250 657968 663443 669711 676931 685745
49903 685745 696873 710100 724222 738250 752213 766449 780588 793722 805324 815426 823947 830209
49891 830209 833277 832681 828792 822599 814963 805999 795208 782262 767526 751795 735760 719816 704147
49878 704147 688765 673674 659192 645915 634196 623876 614747 607002 600912 596310 592800 590309 589044
49865 589044 589011 590052 592275 595940 600900 606668 613170 620938 630342 641066 652626 665027 678597 693374
$$ [...]
##END NTUPLES=NMR SPECTRUM
##END=
